{"text_format":"1","workbook":"xlsx","n_sheets":4,"sheets":["CUISINE","BIERES","VINS","AFFICHER"],"not_rendered":{"charts":0,"images":0,"macros":0,"external_links":1,"defined_names":0,"comments":0,"pivot_tables":0},"unopened":[],"bounds":{"document_bytes":16777216,"sheet_cells":100000,"rows_first":2000,"rows_last":500,"rows_between":2000,"halvings":0,"cell_chars":16384,"cell_head_chars":4096},"cells_cut":0,"cells_raw":0,"read":"whole","date_system":"1900"}

{"sheet":"CUISINE","index":0,"n_rows":38,"n_cols":11,"rows_kept":38,"cut":false,"hidden":false,"merged":[]}
[]
[]
[null,null,null,null,null,null,"                   ALERTE STOCK CUISINE"]
[]
[]
[]
[null,null,null,null,null,null,null,{"$f":"IF([1]ECuis!Q11<0,([1]ECuis!C11),\"\")","v":"Cuisse rotie deporc"},null,null,{"$f":"IF(H7=[1]ECuis!C11,([1]ECuis!Q11),0)","v":-5}]
[null,null,null,null,null,null,null,{"$f":"IF([1]ECuis!Q12<0,([1]ECuis!C12),\"\")","v":""},null,null,{"$f":"IF(H8=[1]ECuis!C12,([1]ECuis!Q12),0)","v":0}]
[null,null,null,null,null,null,null,{"$f":"IF([1]ECuis!Q13<0,([1]ECuis!C13),\"\")","v":"Travers de porc "},null,null,{"$f":"IF(H9=[1]ECuis!C13,([1]ECuis!Q13),0)","v":-40}]
[null,null,null,null,null,null,null,{"$f":"IF([1]ECuis!Q14<0,([1]ECuis!C14),\"\")","v":""},null,null,{"$f":"IF(H10=[1]ECuis!C14,([1]ECuis!Q14),0)","v":0}]
[null,null,null,null,null,null,null,{"$f":"IF([1]ECuis!Q15<0,([1]ECuis!C15),\"\")","v":"Cotelettes de porc"},null,null,{"$f":"IF(H11=[1]ECuis!C15,([1]ECuis!Q15),\"\")","v":-11}]
[null,null,null,null,null,null,null,{"$f":"IF([1]ECuis!Q16<0,([1]ECuis!C16),\"\")","v":"Cassoulet au porc"},null,null,{"$f":"IF(H12=[1]ECuis!C16,([1]ECuis!Q16),\"\")","v":-11}]
[null,null,null,null,null,null,null,{"$f":"IF([1]ECuis!Q17<0,([1]ECuis!C17),\"\")","v":"Boudin de porc"},null,null,{"$f":"IF(H13=[1]ECuis!C17,([1]ECuis!Q17),\"\")","v":-11}]
[null,null,null,null,null,null,null,{"$f":"IF([1]ECuis!Q18<0,([1]ECuis!C18),\"\")","v":"Saucisses  toulouse"},null,null,{"$f":"IF(H14=[1]ECuis!C18,([1]ECuis!Q18),\"\")","v":-11}]
[null,null,null,null,null,null,null,{"$f":"IF([1]ECuis!Q19<0,([1]ECuis!C19),\"\")","v":"Soupe de pied et oreilles"},null,null,{"$f":"IF(H15=[1]ECuis!C19,([1]ECuis!Q19),\"\")","v":-11}]
[null,null,null,null,null,null,null,{"$f":"IF([1]ECuis!Q20<0,([1]ECuis!C20),\"\")","v":"Pâte de campagne"},null,null,{"$f":"IF(H16=[1]ECuis!C20,([1]ECuis!Q20),\"\")","v":-11}]
[null,null,null,null,null,null,null,{"$f":"IF([1]ECuis!Q21<0,([1]ECuis!C21),\"\")","v":""},null,null,{"$f":"IF(H17=[1]ECuis!C21,([1]ECuis!Q21),\"\")","v":""}]
[null,null,null,null,null,null,null,{"$f":"IF([1]ECuis!Q22<0,([1]ECuis!C22),\"\")","v":"Pâté de campagne barquette"},null,null,{"$f":"IF(H18=[1]ECuis!C22,([1]ECuis!Q22),\"\")","v":-15}]
[null,null,null,null,null,null,null,{"$f":"IF([1]ECuis!Q23<0,([1]ECuis!C23),\"\")","v":"Rillettes"},null,null,{"$f":"IF(H19=[1]ECuis!C23,([1]ECuis!Q23),\"\")","v":-11}]
[null,null,null,null,null,null,null,{"$f":"IF([1]ECuis!Q24<0,([1]ECuis!C24),\"\")","v":"Crépinettes natures"},null,null,{"$f":"IF(H20=[1]ECuis!C24,([1]ECuis!Q24),\"\")","v":-11}]
[null,null,null,null,null,null,null,{"$f":"IF([1]ECuis!Q25<0,([1]ECuis!C25),\"\")","v":"Crépinettes au foie"},null,null,{"$f":"IF(H21=[1]ECuis!C25,([1]ECuis!Q25),\"\")","v":-11}]
[null,null,null,null,null,null,null,{"$f":"IF([1]ECuis!Q26<0,([1]ECuis!C26),\"\")","v":"Hure de langues"},null,null,{"$f":"IF(H22=[1]ECuis!C26,([1]ECuis!Q26),\"\")","v":-11}]
[null,null,null,null,null,null,null,{"$f":"IF([1]ECuis!Q27<0,([1]ECuis!C27),\"\")","v":"Cochon rôti"},null,null,{"$f":"IF(H23=[1]ECuis!C27,([1]ECuis!Q27),\"\")","v":-11}]
[null,null,null,null,null,null,null,{"$f":"IF([1]ECuis!Q28<0,([1]ECuis!C28),\"\")","v":"Mouton dibi"},null,null,{"$f":"IF(H24=[1]ECuis!C28,([1]ECuis!Q28),\"\")","v":-11}]
[null,null,null,null,null,null,null,{"$f":"IF([1]ECuis!Q29<0,([1]ECuis!C29),\"\")","v":"Foie"},null,null,{"$f":"IF(H25=[1]ECuis!C29,([1]ECuis!Q29),\"\")","v":-11}]
[null,null,null,null,null,null,null,{"$f":"IF([1]ECuis!Q30<0,([1]ECuis!C30),\"\")","v":"Poulet"},null,null,{"$f":"IF(H26=[1]ECuis!C30,([1]ECuis!Q30),\"\")","v":-11}]
[null,null,null,null,null,null,null,{"$f":"IF([1]ECuis!Q31<0,([1]ECuis!C31),\"\")","v":"Filet de bœuf"},null,null,{"$f":"IF(H27=[1]ECuis!C31,([1]ECuis!Q31),\"\")","v":-11}]
[null,null,null,null,null,null,null,{"$f":"IF([1]ECuis!Q32<0,([1]ECuis!C32),\"\")","v":"Soupe de bœuf"},null,null,{"$f":"IF(H28=[1]ECuis!C32,([1]ECuis!Q32),\"\")","v":-11}]
[null,null,null,null,null,null,null,{"$f":"IF([1]ECuis!Q33<0,([1]ECuis!C33),\"\")","v":"Côte de boeuf"},null,null,{"$f":"IF(H29=[1]ECuis!C33,([1]ECuis!Q33),\"\")","v":-11}]
[null,null,null,null,null,null,null,{"$f":"IF([1]ECuis!Q34<0,([1]ECuis!C34),\"\")","v":"Hamburger"},null,null,{"$f":"IF(H30=[1]ECuis!C34,([1]ECuis!Q34),\"\")","v":-11}]
[null,null,null,null,null,null,null,{"$f":"IF([1]ECuis!Q35<0,([1]ECuis!C35),\"\")","v":"Hamburger double"},null,null,{"$f":"IF(H31=[1]ECuis!C35,([1]ECuis!Q35),\"\")","v":-11}]
[null,null,null,null,null,null,null,{"$f":"IF([1]ECuis!Q36<0,([1]ECuis!C36),\"\")","v":"Chawarma"},null,null,{"$f":"IF(H32=[1]ECuis!C36,([1]ECuis!Q36),\"\")","v":-11}]
[null,null,null,null,null,null,null,{"$f":"IF([1]ECuis!Q37<0,([1]ECuis!C37),\"\")","v":"Norvegien"},null,null,{"$f":"IF(H33=[1]ECuis!C37,([1]ECuis!Q37),\"\")","v":-11}]
[null,null,null,null,null,null,null,{"$f":"IF([1]ECuis!Q38<0,([1]ECuis!C38),\"\")","v":"Pizza GM"},null,null,{"$f":"IF(H34=[1]ECuis!C38,([1]ECuis!Q38),\"\")","v":-11}]
[null,null,null,null,null,null,null,{"$f":"IF([1]ECuis!Q39<0,([1]ECuis!C39),\"\")","v":"Pizza MM"},null,null,{"$f":"IF(H35=[1]ECuis!C39,([1]ECuis!Q39),\"\")","v":-11}]
[null,null,null,null,null,null,null,{"$f":"IF([1]ECuis!Q40<0,([1]ECuis!C40),\"\")","v":"PIZZA PM"},null,null,{"$f":"IF(H36=[1]ECuis!C40,([1]ECuis!Q40),\"\")","v":-11}]
[null,null,null,null,null,null,null,{"$f":"IF([1]ECuis!Q41<0,([1]ECuis!C41),\"\")","v":"Fatayas"},null,null,{"$f":"IF(H37=[1]ECuis!C41,([1]ECuis!Q41),\"\")","v":-11}]
[null,null,null,null,null,null,null,{"$f":"IF([1]ECuis!Q42<0,([1]ECuis!C42),\"\")","v":"Cheezeburger"},null,null,{"$f":"IF(H38=[1]ECuis!C42,([1]ECuis!Q42),\"\")","v":-11}]

{"sheet":"BIERES","index":1,"n_rows":25,"n_cols":10,"rows_kept":25,"cut":false,"hidden":false,"merged":[]}
[]
[null,null,null,null,null,null,"                   ALERTE STOCK BIERES"]
[]
[]
[]
[]
[null,null,null,null,null,null,null,{"$f":"IF('[1]Ecart Biere'!Q10<0,('[1]Ecart Biere'!C10),\"\")","v":"HEINEKEN BOUT"},null,{"$f":"IF(H7='[1]Ecart Biere'!C10,('[1]Ecart Biere'!Q10),\"\")","v":-291}]
[null,null,null,null,null,null,null,{"$f":"IF('[1]Ecart Biere'!Q11<0,('[1]Ecart Biere'!C11),\"\")","v":"HEINEKEN CAN GM"},null,{"$f":"IF(H8='[1]Ecart Biere'!C11,('[1]Ecart Biere'!Q11),\"\")","v":-50}]
[null,null,null,null,null,null,null,{"$f":"IF('[1]Ecart Biere'!Q12<0,('[1]Ecart Biere'!C12),\"\")","v":""},null,{"$f":"IF(H9='[1]Ecart Biere'!C12,('[1]Ecart Biere'!Q12),\"\")","v":""}]
[null,null,null,null,null,null,null,{"$f":"IF('[1]Ecart Biere'!Q13<0,('[1]Ecart Biere'!C13),\"\")","v":"33 \"EXPORT\""},null,{"$f":"IF(H10='[1]Ecart Biere'!C13,('[1]Ecart Biere'!Q13),\"\")","v":-50}]
[null,null,null,null,null,null,null,{"$f":"IF('[1]Ecart Biere'!Q14<0,('[1]Ecart Biere'!C14),\"\")","v":"MEISTER"},null,{"$f":"IF(H11='[1]Ecart Biere'!C14,('[1]Ecart Biere'!Q14),\"\")","v":-50}]
[null,null,null,null,null,null,null,{"$f":"IF('[1]Ecart Biere'!Q15<0,('[1]Ecart Biere'!C15),\"\")","v":"CODY'S GM"},null,{"$f":"IF(H12='[1]Ecart Biere'!C15,('[1]Ecart Biere'!Q15),\"\")","v":-50}]
[null,null,null,null,null,null,null,{"$f":"IF('[1]Ecart Biere'!Q16<0,('[1]Ecart Biere'!C16),\"\")","v":""},null,{"$f":"IF(H13='[1]Ecart Biere'!C16,('[1]Ecart Biere'!Q16),\"\")","v":""}]
[null,null,null,null,null,null,null,{"$f":"IF('[1]Ecart Biere'!Q17<0,('[1]Ecart Biere'!C17),\"\")","v":"CODY'S ENERGY"},null,{"$f":"IF(H14='[1]Ecart Biere'!C17,('[1]Ecart Biere'!Q17),\"\")","v":-50}]
[null,null,null,null,null,null,null,{"$f":"IF('[1]Ecart Biere'!Q18<0,('[1]Ecart Biere'!C18),\"\")","v":"ROYAL DUTCH"},null,{"$f":"IF(H15='[1]Ecart Biere'!C18,('[1]Ecart Biere'!Q18),\"\")","v":-50}]
[null,null,null,null,null,null,null,{"$f":"IF('[1]Ecart Biere'!Q19<0,('[1]Ecart Biere'!C19),\"\")","v":"SAGRES GM"},null,{"$f":"IF(H16='[1]Ecart Biere'!C19,('[1]Ecart Biere'!Q19),\"\")","v":-50}]
[null,null,null,null,null,null,null,{"$f":"IF('[1]Ecart Biere'!Q20<0,('[1]Ecart Biere'!C20),\"\")","v":""},null,{"$f":"IF(H17='[1]Ecart Biere'!C20,('[1]Ecart Biere'!Q20),\"\")","v":""}]
[null,null,null,null,null,null,null,{"$f":"IF('[1]Ecart Biere'!Q21<0,('[1]Ecart Biere'!C21),\"\")","v":"SAGRES CANET"},null,{"$f":"IF(H18='[1]Ecart Biere'!C21,('[1]Ecart Biere'!Q21),\"\")","v":-50}]
[null,null,null,null,null,null,null,{"$f":"IF('[1]Ecart Biere'!Q22<0,('[1]Ecart Biere'!C22),\"\")","v":"SAGRES LIMON"},null,{"$f":"IF(H19='[1]Ecart Biere'!C22,('[1]Ecart Biere'!Q22),\"\")","v":-50}]
[null,null,null,null,null,null,null,{"$f":"IF('[1]Ecart Biere'!Q23<0,('[1]Ecart Biere'!C23),\"\")","v":"FLAG GM"},null,{"$f":"IF(H20='[1]Ecart Biere'!C23,('[1]Ecart Biere'!Q23),\"\")","v":-50}]
[null,null,null,null,null,null,null,{"$f":"IF('[1]Ecart Biere'!Q24<0,('[1]Ecart Biere'!C24),\"\")","v":"FLAG PM"},null,{"$f":"IF(H21='[1]Ecart Biere'!C24,('[1]Ecart Biere'!Q24),\"\")","v":-50}]
[null,null,null,null,null,null,null,{"$f":"IF('[1]Ecart Biere'!Q25<0,('[1]Ecart Biere'!C25),\"\")","v":"MAESTRO"},null,{"$f":"IF(H22='[1]Ecart Biere'!C25,('[1]Ecart Biere'!Q25),\"\")","v":-50}]
[null,null,null,null,null,null,null,{"$f":"IF('[1]Ecart Biere'!Q26<0,('[1]Ecart Biere'!C26),\"\")","v":""},null,{"$f":"IF(H23='[1]Ecart Biere'!C26,('[1]Ecart Biere'!Q26),\"\")","v":""}]
[null,null,null,null,null,null,null,{"$f":"IF('[1]Ecart Biere'!Q27<0,('[1]Ecart Biere'!C27),\"\")","v":"CORONA EXTRA"},null,{"$f":"IF(H24='[1]Ecart Biere'!C27,('[1]Ecart Biere'!Q27),\"\")","v":-50}]
[null,null,null,null,null,null,null,{"$f":"IF('[1]Ecart Biere'!Q28<0,('[1]Ecart Biere'!C28),\"\")","v":"GUINESS"},null,{"$f":"IF(H25='[1]Ecart Biere'!C28,('[1]Ecart Biere'!Q28),\"\")","v":-56}]

{"sheet":"VINS","index":2,"n_rows":47,"n_cols":11,"rows_kept":47,"cut":false,"hidden":false,"merged":[]}
[]
[null,null,null,null,null,null,"             ALERTE STOCK VINS"]
[]
[]
[]
[]
[null,null,null,null,null,null,null,{"$f":"IF([1]EVins!Q10<0,([1]EVins!C10),\"\")","v":"COTES RHONE ROUGE 37"},null,{"$f":"IF(H7='[1]Ecart Biere'!C10,('[1]Ecart Biere'!Q10),\"\")","v":""},{"$f":"IF(H7=[1]EVins!C10,([1]EVins!Q10),\"\")","v":-5}]
[null,null,null,null,null,null,null,{"$f":"IF([1]EVins!Q11<0,([1]EVins!C11),\"\")","v":""},null,{"$f":"IF(H8='[1]Ecart Biere'!C11,('[1]Ecart Biere'!Q11),\"\")","v":""},{"$f":"IF(H8=[1]EVins!C11,([1]EVins!Q11),\"\")","v":""}]
[null,null,null,null,null,null,null,{"$f":"IF([1]EVins!Q12<0,([1]EVins!C12),\"\")","v":"COTES DU RHONE ROUGE 75"},null,{"$f":"IF(H9='[1]Ecart Biere'!C12,('[1]Ecart Biere'!Q12),\"\")","v":""},{"$f":"IF(H9=[1]EVins!C12,([1]EVins!Q12),\"\")","v":-50}]
[null,null,null,null,null,null,null,{"$f":"IF([1]EVins!Q13<0,([1]EVins!C13),\"\")","v":"COTES DU RHONE ROSE   75"},null,{"$f":"IF(H10='[1]Ecart Biere'!C13,('[1]Ecart Biere'!Q13),\"\")","v":""},{"$f":"IF(H10=[1]EVins!C13,([1]EVins!Q13),\"\")","v":-11}]
[null,null,null,null,null,null,null,{"$f":"IF([1]EVins!Q14<0,([1]EVins!C14),\"\")","v":"BORDEAUX ROUGE GM"},null,{"$f":"IF(H11='[1]Ecart Biere'!C14,('[1]Ecart Biere'!Q14),\"\")","v":""},{"$f":"IF(H11=[1]EVins!C14,([1]EVins!Q14),\"\")","v":-11}]
[null,null,null,null,null,null,null,{"$f":"IF([1]EVins!Q15<0,([1]EVins!C15),\"\")","v":"BORDEAUX ROUGE PM"},null,{"$f":"IF(H12='[1]Ecart Biere'!C15,('[1]Ecart Biere'!Q15),\"\")","v":""},{"$f":"IF(H12=[1]EVins!C15,([1]EVins!Q15),\"\")","v":-11}]
[null,null,null,null,null,null,null,{"$f":"IF([1]EVins!Q16<0,([1]EVins!C16),\"\")","v":"LUMIERE ROSE "},null,{"$f":"IF(H13='[1]Ecart Biere'!C16,('[1]Ecart Biere'!Q16),\"\")","v":""},{"$f":"IF(H13=[1]EVins!C16,([1]EVins!Q16),\"\")","v":-11}]
[null,null,null,null,null,null,null,{"$f":"IF([1]EVins!Q17<0,([1]EVins!C17),\"\")","v":"LUMIERE ROUGE  "},null,{"$f":"IF(H14='[1]Ecart Biere'!C17,('[1]Ecart Biere'!Q17),\"\")","v":""},{"$f":"IF(H14=[1]EVins!C17,([1]EVins!Q17),\"\")","v":-11}]
[null,null,null,null,null,null,null,{"$f":"IF([1]EVins!Q18<0,([1]EVins!C18),\"\")","v":"LUMIERE BLANC"},null,{"$f":"IF(H15='[1]Ecart Biere'!C18,('[1]Ecart Biere'!Q18),\"\")","v":""},{"$f":"IF(H15=[1]EVins!C18,([1]EVins!Q18),\"\")","v":-11}]
[null,null,null,null,null,null,null,{"$f":"IF([1]EVins!Q19<0,([1]EVins!C19),\"\")","v":"BARON RAMON ROSE"},null,{"$f":"IF(H16='[1]Ecart Biere'!C19,('[1]Ecart Biere'!Q19),\"\")","v":""},{"$f":"IF(H16=[1]EVins!C19,([1]EVins!Q19),\"\")","v":-11}]
[null,null,null,null,null,null,null,{"$f":"IF([1]EVins!Q20<0,([1]EVins!C20),\"\")","v":""},null,{"$f":"IF(H17='[1]Ecart Biere'!C20,('[1]Ecart Biere'!Q20),\"\")","v":""},{"$f":"IF(H17=[1]EVins!C20,([1]EVins!Q20),\"\")","v":""}]
[null,null,null,null,null,null,null,{"$f":"IF([1]EVins!Q21<0,([1]EVins!C21),\"\")","v":""},null,{"$f":"IF(H18='[1]Ecart Biere'!C21,('[1]Ecart Biere'!Q21),\"\")","v":""},{"$f":"IF(H18=[1]EVins!C21,([1]EVins!Q21),\"\")","v":""}]
[null,null,null,null,null,null,null,{"$f":"IF([1]EVins!Q22<0,([1]EVins!C22),\"\")","v":"BARON ROMERO ROSE"},null,{"$f":"IF(H19='[1]Ecart Biere'!C22,('[1]Ecart Biere'!Q22),\"\")","v":""},{"$f":"IF(H19=[1]EVins!C22,([1]EVins!Q22),\"\")","v":-11}]
[null,null,null,null,null,null,null,{"$f":"IF([1]EVins!Q23<0,([1]EVins!C23),\"\")","v":""},null,{"$f":"IF(H20='[1]Ecart Biere'!C23,('[1]Ecart Biere'!Q23),\"\")","v":""},{"$f":"IF(H20=[1]EVins!C23,([1]EVins!Q23),\"\")","v":""}]
[null,null,null,null,null,null,null,{"$f":"IF([1]EVins!Q24<0,([1]EVins!C24),\"\")","v":"SAINT SERNIN ROSE    37"},null,{"$f":"IF(H21='[1]Ecart Biere'!C24,('[1]Ecart Biere'!Q24),\"\")","v":""},{"$f":"IF(H21=[1]EVins!C24,([1]EVins!Q24),\"\")","v":-11}]
[null,null,null,null,null,null,null,{"$f":"IF([1]EVins!Q25<0,([1]EVins!C25),\"\")","v":"SAINT SERNIN ROUGE 75"},null,{"$f":"IF(H22='[1]Ecart Biere'!C25,('[1]Ecart Biere'!Q25),\"\")","v":""},{"$f":"IF(H22=[1]EVins!C25,([1]EVins!Q25),\"\")","v":-11}]
[null,null,null,null,null,null,null,{"$f":"IF([1]EVins!Q26<0,([1]EVins!C26),\"\")","v":"SAINT SERNIN ROSE    75"},null,{"$f":"IF(H23='[1]Ecart Biere'!C26,('[1]Ecart Biere'!Q26),\"\")","v":""},{"$f":"IF(H23=[1]EVins!C26,([1]EVins!Q26),\"\")","v":-11}]
[null,null,null,null,null,null,null,{"$f":"IF([1]EVins!Q27<0,([1]EVins!C27),\"\")","v":"JP CHENET VIN ROUGE 75"},null,{"$f":"IF(H24='[1]Ecart Biere'!C27,('[1]Ecart Biere'!Q27),\"\")","v":""},{"$f":"IF(H24=[1]EVins!C27,([1]EVins!Q27),\"\")","v":-11}]
[null,null,null,null,null,null,null,{"$f":"IF([1]EVins!Q28<0,([1]EVins!C28),\"\")","v":"VIN MOUSSEUX"},null,{"$f":"IF(H25='[1]Ecart Biere'!C28,('[1]Ecart Biere'!Q28),\"\")","v":""},{"$f":"IF(H25=[1]EVins!C28,([1]EVins!Q28),\"\")","v":-11}]
[null,null,null,null,null,null,null,{"$f":"IF([1]EVins!Q29<0,([1]EVins!C29),\"\")","v":"DESCARAO BLANC"},null,null,{"$f":"IF(H26=[1]EVins!C29,([1]EVins!Q29),\"\")","v":-11}]
[null,null,null,null,null,null,null,{"$f":"IF([1]EVins!Q30<0,([1]EVins!C30),\"\")","v":"DESCARAO ROSE"},null,null,{"$f":"IF(H27=[1]EVins!C30,([1]EVins!Q30),\"\")","v":-11}]
[null,null,null,null,null,null,null,{"$f":"IF([1]EVins!Q31<0,([1]EVins!C31),\"\")","v":"DESCARAO RGE"},null,null,{"$f":"IF(H28=[1]EVins!C31,([1]EVins!Q31),\"\")","v":-11}]
[null,null,null,null,null,null,null,{"$f":"IF([1]EVins!Q32<0,([1]EVins!C32),\"\")","v":"ROCHE MAZET ROUGE"},null,null,{"$f":"IF(H29=[1]EVins!C32,([1]EVins!Q32),\"\")","v":-11}]
[null,null,null,null,null,null,null,{"$f":"IF([1]EVins!Q33<0,([1]EVins!C33),\"\")","v":"ROCHE MAZET BLANC"},null,null,{"$f":"IF(H30=[1]EVins!C33,([1]EVins!Q33),\"\")","v":-11}]
[null,null,null,null,null,null,null,{"$f":"IF([1]EVins!Q34<0,([1]EVins!C34),\"\")","v":"BORDEAUX SUPERIEUR"},null,null,{"$f":"IF(H31=[1]EVins!C34,([1]EVins!Q34),\"\")","v":-11}]
[null,null,null,null,null,null,null,{"$f":"IF([1]EVins!Q35<0,([1]EVins!C35),\"\")","v":"BORDEAUX ORDINAIRE"},null,null,{"$f":"IF(H32=[1]EVins!C35,([1]EVins!Q35),\"\")","v":-11}]
[null,null,null,null,null,null,null,{"$f":"IF([1]EVins!Q36<0,([1]EVins!C36),\"\")","v":"COTE RHONE /"},null,null,{"$f":"IF(H33=[1]EVins!C36,([1]EVins!Q36),\"\")","v":-11}]
[null,null,null,null,null,null,null,{"$f":"IF([1]EVins!Q37<0,([1]EVins!C37),\"\")","v":"MERLOT ROUGE 75"},null,null,{"$f":"IF(H34=[1]EVins!C37,([1]EVins!Q37),\"\")","v":-11}]
[null,null,null,null,null,null,null,{"$f":"IF([1]EVins!Q38<0,([1]EVins!C38),\"\")","v":"MERLOT ROUGE 37"},null,null,{"$f":"IF(H35=[1]EVins!C38,([1]EVins!Q38),\"\")","v":-11}]
[null,null,null,null,null,null,null,{"$f":"IF([1]EVins!Q39<0,([1]EVins!C39),\"\")","v":"PREFERENCE ROUGE"},null,null,{"$f":"IF(H36=[1]EVins!C39,([1]EVins!Q39),\"\")","v":-11}]
[null,null,null,null,null,null,null,{"$f":"IF([1]EVins!Q40<0,([1]EVins!C40),\"\")","v":"PREFERENCE ROSE"},null,null,{"$f":"IF(H37=[1]EVins!C40,([1]EVins!Q40),\"\")","v":-11}]
[null,null,null,null,null,null,null,{"$f":"IF([1]EVins!Q41<0,([1]EVins!C41),\"\")","v":"LANETTE"},null,null,{"$f":"IF(H38=[1]EVins!C41,([1]EVins!Q41),\"\")","v":-11}]
[null,null,null,null,null,null,null,{"$f":"IF([1]EVins!Q42<0,([1]EVins!C42),\"\")","v":""}]
[null,null,null,null,null,null,null,{"$f":"IF([1]EVins!Q43<0,([1]EVins!C43),\"\")","v":""}]
[null,null,null,null,null,null,null,{"$f":"IF([1]EVins!Q44<0,([1]EVins!C44),\"\")","v":""}]
[null,null,null,null,null,null,null,{"$f":"IF([1]EVins!Q45<0,([1]EVins!C45),\"\")","v":""}]
[null,null,null,null,null,null,null,{"$f":"IF([1]EVins!Q46<0,([1]EVins!C46),\"\")","v":""}]
[null,null,null,null,null,null,null,{"$f":"IF([1]EVins!Q47<0,([1]EVins!C47),\"\")","v":""}]
[null,null,null,null,null,null,null,{"$f":"IF([1]EVins!Q48<0,([1]EVins!C48),\"\")","v":""}]
[null,null,null,null,null,null,null,{"$f":"IF([1]EVins!Q49<0,([1]EVins!C49),\"\")","v":""}]
[null,null,null,null,null,null,null,{"$f":"IF([1]EVins!Q50<0,([1]EVins!C50),\"\")","v":""}]

{"sheet":"AFFICHER","index":3,"n_rows":11,"n_cols":6,"rows_kept":11,"cut":false,"hidden":false,"merged":[]}
[]
[null,null,null,null,null,"AFFICHER  ALERTE STOCK PAR FAMILLE DE PRODUIT"]
[]
[]
[]
[]
[]
[]
[]
[]
[null,null,null,null,null,"LISTE DEROULANTE APPELLANT CUISINE, BIERES OU VINS SUR PAGE EN MASQUANT LES LIGNES VIDES"]