{"text_format":"1","workbook":"xlsx","n_sheets":2,"sheets":["Feuil1","Feuil2"],"not_rendered":{"charts":0,"images":0,"macros":0,"external_links":0,"defined_names":0,"comments":0,"pivot_tables":0},"unopened":[],"bounds":{"document_bytes":16777216,"sheet_cells":100000,"rows_first":2000,"rows_last":500,"rows_between":2000,"halvings":0,"cell_chars":16384,"cell_head_chars":4096},"cells_cut":0,"cells_raw":0,"read":"whole","date_system":"1900"}

{"sheet":"Feuil1","index":0,"n_rows":10,"n_cols":2,"rows_kept":10,"cut":false,"hidden":false,"merged":[]}
["Nom","Notes"]
["toto1",9]
["toto9",2]
["toto2",5]
["toto8",8]
["toto6",6]
["toto3",4]
["toto6",7]
["toto12",87]
["toto4",62]

{"sheet":"Feuil2","index":1,"n_rows":10,"n_cols":2,"rows_kept":10,"cut":false,"hidden":false,"merged":[]}
[{"$f":"Feuil1!A1","v":"Nom"},{"$f":"Feuil1!B1","v":"Notes"}]
[{"$f":"Feuil1!A2","v":"toto1"},{"$f":"INDEX(Feuil1!$B$2:$B$10,MATCH(A2,Feuil1!$A$2:$A$10,0),0)","v":9}]
[{"$f":"Feuil1!A3","v":"toto9"},{"$f":"INDEX(Feuil1!$B$2:$B$10,MATCH(A3,Feuil1!$A$2:$A$10,0),0)","v":2}]
[{"$f":"Feuil1!A4","v":"toto2"},{"$f":"INDEX(Feuil1!$B$2:$B$10,MATCH(A4,Feuil1!$A$2:$A$10,0),0)","v":5}]
[{"$f":"Feuil1!A5","v":"toto8"},{"$f":"INDEX(Feuil1!$B$2:$B$10,MATCH(A5,Feuil1!$A$2:$A$10,0),0)","v":8}]
[{"$f":"Feuil1!A6","v":"toto6"},{"$f":"INDEX(Feuil1!$B$2:$B$10,MATCH(A6,Feuil1!$A$2:$A$10,0),0)","v":6}]
[{"$f":"Feuil1!A7","v":"toto3"},{"$f":"INDEX(Feuil1!$B$2:$B$10,MATCH(A7,Feuil1!$A$2:$A$10,0),0)","v":4}]
[{"$f":"Feuil1!A8","v":"toto6"},{"$f":"INDEX(Feuil1!$B$2:$B$10,MATCH(A8,Feuil1!$A$2:$A$10,0),0)","v":6}]
[{"$f":"Feuil1!A9","v":"toto12"},{"$f":"INDEX(Feuil1!$B$2:$B$10,MATCH(A9,Feuil1!$A$2:$A$10,0),0)","v":87}]
[{"$f":"Feuil1!A10","v":"toto4"},{"$f":"INDEX(Feuil1!$B$2:$B$10,MATCH(A10,Feuil1!$A$2:$A$10,0),0)","v":62}]