{"text_format":"1","workbook":"xlsx","n_sheets":6,"sheets":["Param","Calendrier","septembre","octobre","novembre","décembre"],"not_rendered":{"charts":0,"images":1,"macros":1,"external_links":0,"defined_names":33,"comments":0,"pivot_tables":0},"unopened":[],"bounds":{"document_bytes":16777216,"sheet_cells":100000,"rows_first":2000,"rows_last":500,"rows_between":2000,"halvings":0,"cell_chars":16384,"cell_head_chars":4096},"cells_cut":0,"cells_raw":0,"read":"whole","date_system":"1900"}

{"sheet":"Param","index":0,"n_rows":40,"n_cols":65,"rows_kept":40,"cut":false,"hidden":false,"merged":[]}
[null,null,null,null,null,null,null,null,null,null,null,null,null,null,null,null,null,null,null,null,null,null,null,null,null,"2022-10-10",null,null,null,null,null,null,null,null,null,null,null,null,null,null,null,null,null,null,null,null,null,null,null,null,null,"Nombre en chiffre","Nombre en lettres",null,null,null,null,null,{"$f":"YEAR( TODAY())","v":2019}]
[null,null,null,"2019/10/29",null,null,null,null,null,null,null,null,null,null,null,null,null,null,null,null,null,null,null,null,null,null,null,null,null,null,null,null,null,null,null,null,null,null,null,null,null,null,null,null,null,null,null,null,null,null,null,1,"واحد من عشرين"]
[null,null,null,null,null,null,null,null,null,null,null,null,null,null,null,null,null,null,null,null,null,null,null,null,null,null,null,null,null,null,null,null,null,null,null,null,null,null,null,null,null,null,null,null,null,null,null,null,null,null,null,1.5,"واحد  و نصف من عشرين"]
[null,null,null,null,null,null,null,null,null,null,null,null,null,null,null,null,null,null,null,null,null,null,null,null,null,null,null,null,null,null,null,null,null,null,null,null,null,null,null,null,null,null,null,null,null,null,null,null,null,null,null,2,"اثنان من عشرين"]
[null,null,null,null,null,null,null,null,null,null,null,null,null,null,null,null,null,null,null,null,null,null,null,null,null,null,null,null,null,null,null,null,null,null,null,null,null,null,null,null,null,null,null,null,null,null,null,null,null,null,null,2.5,"اثنان  و نصف من عشرين"]
[null,null,null,null,null,null,null,null,null,null,null,null,null,null,null,null,null,null,null,null,null,null,null,null,null,null,null,null,null,null,null,null,null,null,null,null,null,null,null,null,null,null,null,null,null,null,null,null,null,null,null,3,"ثلاثة من عشرين"]
[null,null,null,null,null,null,null,null,null,null,null,null,null,null,null,null,null,null,null,null,null,null,null,null,null,null,null,null,null,null,null,null,null,null,null,null,null,null,null,null,null,null,null,null,null,null,null,null,null,null,null,3.5,"ثلاثة  و نصف من عشرين"]
[null,null,null,null,null,null,null,null,null,null,null,null,null,null,null,null,null,null,null,null,null,null,null,null,null,null,null,null,null,null,null,null,null,null,null,null,null,null,null,null,null,null,null,null,null,null,null,null,null,null,null,4,"أربعة من عشرين"]
[null,null,null,null,null,null,null,null,null,null,null,null,null,null,null,null,null,null,null,null,null,null,null,null,null,null,null,null,null,null,null,null,null,null,null,null,null,null,null,null,null,null,null,null,null,null,null,null,null,null,null,4.5,"أربعة  و نصف من عشرين",null,null," "]
[null,null,null,null,null,null,null,null,null,null,null,null,null,null,null,null,null,null,null,null,null,null,null,null,null,null,null,null,null,null,null,null,null,null,null,null,null,null,null,null,null,null,null,null,null,null,null,null,null,null,null,5,"خمسة من عشرين"]
[null,null,null,null,null,null,null,null,null,null,null,null,null,null,null,null,null,null,null,null,null,null,null,null,null,null,null,null,null,null,null,null,null,null,null,null,null,null,null,null,null,null,null,null,null,null,null,null,null,null,null,5.5,"خمسة  و نصف من عشرين"]
[null,null,null,null,null,null,null,null,null,null,null,null,null,null,null,null,null,null,null,null,null,null,null,null,null,null,null,null,null,null,null,null,null,null,null,null,null,null,null,null,null,null,null,null,null,null,null,null,null,null,null,6,"ستة من عشرين"]
[null,null,null,null,null,null,null,null,null,null,null,null,null,null,null,null,null,null,null,null,null,null,null,null,null,null,null,null,null,null,null,null,null,null,null,null,null,null,null,null,null,null,null,null,null,null,null,null,null,null,null,6.5,"ستة  و نصف من عشرين"]
[null,null,null,null,null,null,null,null,null,null,null,null,null,null,null,null,null,null,null,null,null,null,null,null,null,null,null,null,null,null,null,null,null,null,null,null,null,null,null,null,null,null,null,null,null,null,null,null,null,null,null,7,"سبعة من عشرين"]
[null,null,null,null,null,null,null,null,null,null,null,null,null,null,null,null,null,null,null,null,null,null,null,null,null,null,null,null,null,null,null,null,null,null,null,null,null,null,null,null,null,null,null,null,null,null,null,null,null,null,null,7.5,"سبعة  و نصف من عشرين"]
[null,null,null,null,null,null,null,null,null,null,null,null,null,null,null,null,null,null,null,null,null,null,null,null,null,null,null,null,null,null,null,null,null,null,null,null,null,null,null,null,null,null,null,null,null,null,null,null,null,null,null,8,"ثمانية من عشرين"]
[null,null,null,null,null,null,null,null,null,null,null,null,null,null,null,null,null,null,null,null,null,null,null,null,null,null,null,null,null,null,null,null,null,null,null,null,null,null,null,null,null,null,null,null,null,null,null,null,null,null,null,8.5,"ثمانية  و نصف من عشرين"]
[null,null,null,null,null,null,null,null,null,null,null,null,null,null,null,null,null,null,null,null,null,null,null,null,null,null,null,null,null,null,null,null,null,null,null,null,null,null,null,null,null,null,null,null,null,null,null,null,null,null,null,9,"تسعة من عشرين"]
[null,null,null,null,null,null,null,null,null,null,null,null,null,null,null,null,null,null,null,null,null,null,null,null,null,null,null,null,null,null,null,null,null,null,null,null,null,null,null,null,null,null,null,null,null,null,null,null,null,null,null,9.5,"تسعة  و نصف من عشرين"]
[null,null,null,null,null,null,null,null,null,null,null,null,null,null,null,null,null,null,null,null,null,null,null,null,null,null,null,null,null,null,null,null,null,null,null,null,null,null,null,null,null,null,null,null,null,null,null,null,null,null,null,10,"عشرة من عشرين"]
[null,null,null,null,null,null,null,null,null,null,null,null,null,null,null,null,null,null,null,null,null,null,null,null,null,null,null,null,null,null,null,null,null,null,null,null,null,null,null,null,null,null,null,null,null,null,null,null,null,null,null,10.5,"عشرة  و نصف من عشرين"]
[null,null,null,null,null,null,null,null,null,null,null,null,null,null,null,null,null,null,null,null,null,null,null,null,null,null,null,null,null,null,null,null,null,null,null,null,null,null,null,null,null,null,null,null,null,null,null,null,null,null,null,11,"أحد عشر من عشرين"]
[null,null,null,null,null,null,null,null,null,null,null,null,null,null,null,null,null,null,null,null,null,null,null,null,null,null,null,null,null,null,null,null,null,null,null,null,null,null,null,null,null,null,null,null,null,null,null,null,null,null,null,11.5,"أحد عشر  و نصف من عشرين"]
[null,null,null,null,null,null,null,null,null,null,null,null,null,null,null,null,null,null,null,null,null,null,null,null,null,null,null,null,null,null,null,null,null,null,null,null,null,null,null,null,null,null,null,null,null,null,null,null,null,null,null,12,"اثنا عشر من عشرين"]
[null,null,null,null,null,null,null,null,null,null,null,null,null,null,null,null,null,null,null,null,null,null,null,null,null,null,null,null,null,null,null,null,null,null,null,null,null,null,null,null,null,null,null,null,null,null,null,null,null,null,null,12.5,"اثنا عشر  و نصف من عشرين"]
[null,null,null,null,null,null,null,null,null,null,null,null,null,null,null,null,null,null,null,null,null,null,null,null,null,null,null,null,null,null,null,null,null,null,null,null,null,null,null,null,null,null,null,null,null,null,null,null,null,null,null,13,"ثلاثة عشر من عشرين"]
[null,null,null,null,null,null,null,null,null,null,null,null,null,null,null,null,null,null,null,null,null,null,null,null,null,null,null,null,null,null,null,null,null,null,null,null,null,null,null,null,null,null,null,null,null,null,null,null,null,null,null,13.5,"ثلاثة عشر  و نصف من عشرين"]
[null,null,null,null,null,null,null,null,null,null,null,null,null,null,null,null,null,null,null,null,null,null,null,null,null,null,null,null,null,null,null,null,null,null,null,null,null,null,null,null,null,null,null,null,null,null,null,null,null,null,null,14,"أربعة عشر من عشرين"]
[null,null,null,null,null,null,null,null,null,null,null,null,null,null,null,null,null,null,null,null,null,null,null,null,null,null,null,null,null,null,null,null,null,null,null,null,null,null,null,null,null,null,null,null,null,null,null,null,null,null,null,14.5,"أربعة عشر  و نصف من عشرين"]
[null,null,null,null,null,null,null,null,null,null,null,null,null,null,null,null,null,null,null,null,null,null,null,null,null,null,null,null,null,null,null,null,null,null,null,null,null,null,null,null,null,null,null,null,null,null,null,null,null,null,null,15,"خمسة عشر من عشرين"]
[null,null,null,null,null,null,null,null,null,null,null,null,null,null,null,null,null,null,null,null,null,null,null,null,null,null,null,null,null,null,null,null,null,null,null,null,null,null,null,null,null,null,null,null,null,null,null,null,null,null,null,15.5,"خمسة عشر  و نصف من عشرين"]
[null,null,null,null,null,null,null,null,null,null,null,null,null,null,null,null,null,null,null,null,null,null,null,null,null,null,null,null,null,null,null,null,null,null,null,null,null,null,null,null,null,null,null,null,null,null,null,null,null,null,null,16,"ستة عشر من عشرين"]
[null,null,null,null,null,null,null,null,null,null,null,null,null,null,null,null,null,null,null,null,null,null,null,null,null,null,null,null,null,null,null,null,null,null,null,null,null,null,null,null,null,null,null,null,null,null,null,null,null,null,null,16.5,"ستة عشر  و نصف من عشرين"]
[null,null,null,null,null,null,null,null,null,null,null,null,null,null,null,null,null,null,null,null,null,null,null,null,null,null,null,null,null,null,null,null,null,null,null,null,null,null,null,null,null,null,null,null,null,null,null,null,null,null,null,17,"سبعة عشر من عشرين"]
[null,null,null,null,null,null,null,null,null,null,null,null,null,null,null,null,null,null,null,null,null,null,null,null,null,null,null,null,null,null,null,null,null,null,null,null,null,null,null,null,null,null,null,null,null,null,null,null,null,null,null,17.5,"سبعة عشر  و نصف من عشرين"]
[null,null,null,null,null,null,null,null,null,null,null,null,null,null,null,null,null,null,null,null,null,null,null,null,null,null,null,null,null,null,null,null,null,null,null,null,null,null,null,null,null,null,null,null,null,null,null,null,null,null,null,18,"ثمانية عشر من عشرين"]
[null,null,null,null,null,null,null,null,null,null,null,null,null,null,null,null,null,null,null,null,null,null,null,null,null,null,null,null,null,null,null,null,null,null,null,null,null,null,null,null,null,null,null,null,null,null,null,null,null,null,null,18.5,"ثمانية عشر  و نصف من عشرين"]
[null,null,null,null,null,null,null,null,null,null,null,null,null,null,null,null,null,null,null,null,null,null,null,null,null,null,null,null,null,null,null,null,null,null,null,null,null,null,null,null,null,null,null,null,null,null,null,null,null,null,null,19,"تسعة عشر من عشرين"]
[null,null,null,null,null,null,null,null,null,null,null,null,null,null,null,null,null,null,null,null,null,null,null,null,null,null,null,null,null,null,null,null,null,null,null,null,null,null,null,null,null,null,null,null,null,null,null,null,null,null,null,19.5,"تسعة عشر  و نصف من عشرين"]
[null,null,null,null,null,null,null,null,null,null,null,null,null,null,null,null,null,null,null,null,null,null,null,null,null,null,null,null,null,null,null,null,null,null,null,null,null,null,null,null,null,null,null,null,null,null,null,null,null,null,null,20,"عشرون من عشرين",null,null,null,null,null,null,null,{"$f":"CHOOSE(MONTH(BK40),\"janvier\",\"février\",\"mars\",\"avril\",\"mai\",\"juin\",\"juillet\",\"aout\",\"septembre\",\"octobre\",\"novembre\",\"décembre\")","v":"janvier"},null,{"$f":"DATE(YEAR(BM40),MONTH(BM40),1)-MOD(DATE(YEAR(BM40),MONTH(BM40),1)-3,7)+5","v":"2019-01-06"},null,{"$f":"DATE(YEAR(TODAY()),1,1)","v":"2019-01-01"}]

{"sheet":"Calendrier","index":1,"n_rows":42,"n_cols":14,"rows_kept":42,"cut":false,"hidden":false,"merged":[[1,0,1,13]]}
[]
[{"$f":"\"Calendrier pour l' année  \"&Param!BG1","v":"Calendrier pour l' année  2019"}]
[null,null,"Janvier","Février","Mars","Avril","Mai","Juin","Juillet","Août","Septembre","Octobre","Novembre","Décembre"]
[null,null,1,2,3,4,5,6,7,8,9,10,11,12]
[null,null,{"$f":"DATE(Param!BG1,C$4,1)-WEEKDAY(DATE(Param!BG1,C$4,1),1)","v":"2018-12-29"},{"$f":"DATE(Param!BG1,D$4,1)-WEEKDAY(DATE(Param!BG1,D$4,1),1)","v":"2019-01-26"},{"$f":"DATE(Param!BG1,E$4,1)-WEEKDAY(DATE(Param!BG1,E$4,1),1)","v":"2019-02-23"},{"$f":"DATE(Param!BG1,F$4,1)-WEEKDAY(DATE(Param!BG1,F$4,1),1)","v":"2019-03-30"},{"$f":"DATE(Param!BG1,G$4,1)-WEEKDAY(DATE(Param!BG1,G$4,1),1)","v":"2019-04-27"},{"$f":"DATE(Param!BG1,H$4,1)-WEEKDAY(DATE(Param!BG1,H$4,1),1)","v":"2019-05-25"},{"$f":"DATE(Param!BG1,I$4,1)-WEEKDAY(DATE(Param!BG1,I$4,1),1)","v":"2019-06-29"},{"$f":"DATE(Param!BG1,J$4,1)-WEEKDAY(DATE(Param!BG1,J$4,1),1)","v":"2019-07-27"},{"$f":"DATE(Param!BG1,K$4,1)-WEEKDAY(DATE(Param!BG1,K$4,1),1)","v":"2019-08-31"},{"$f":"DATE(Param!BG1,L$4,1)-WEEKDAY(DATE(Param!BG1,L$4,1),1)","v":"2019-09-28"},{"$f":"DATE(Param!BG1,M$4,1)-WEEKDAY(DATE(Param!BG1,M$4,1),1)","v":"2019-10-26"},{"$f":"DATE(Param!BG1,N$4,1)-WEEKDAY(DATE(Param!BG1,N$4,1),1)","v":"2019-11-30"}]
["Dimanche",1,{"$f":"IF(MONTH(C$5+$B6)=C$4,C$5+$B6,\"\")","v":""},{"$f":"IF(MONTH(D$5+$B6)=D$4,D$5+$B6,\"\")","v":""},"","","",{"$f":"IF(MONTH(H$5+$B6)=H$4,H$5+$B6,\"\")","v":""},"","","2019-09-01","","","2019-12-01"]
["Lundi",2,{"$f":"IF(MONTH(C$5+$B7)=C$4,C$5+$B7,\"\")","v":""},"","","2019-04-01","","","2019-07-01","","2019-09-02","","","2019-12-02"]
["Mardi",3,{"$f":"IF(MONTH(C$5+$B8)=C$4,C$5+$B8,\"\")","v":"2019-01-01"},"","","2019-04-02","","","2019-07-02","","2019-09-03","2019-10-01","","2019-12-03"]
["Mercredi",4,{"$f":"IF(MONTH(C$5+$B9)=C$4,C$5+$B9,\"\")","v":"2019-01-02"},"","","2019-04-03","2019-05-01","","2019-07-03","","2019-09-04","2019-10-02","","2019-12-04"]
["Jeudi",5,{"$f":"IF(MONTH(C$5+$B10)=C$4,C$5+$B10,\"\")","v":"2019-01-03"},"","","2019-04-04","2019-05-02","","2019-07-04","2019-08-01","2019-09-05","2019-10-03","","2019-12-05"]
["Vendredi",6,{"$f":"IF(MONTH(C$5+$B11)=C$4,C$5+$B11,\"\")","v":"2019-01-04"},"2019-02-01","2019-03-01","2019-04-05","2019-05-03","","2019-07-05","2019-08-02","2019-09-06","2019-10-04","2019-11-01","2019-12-06"]
["Samedi",7,"2019-01-05","2019-02-02","2019-03-02","2019-04-06","2019-05-04","2019-06-01","2019-07-06","2019-08-03","2019-09-07","2019-10-05","2019-11-02","2019-12-07"]
["Dimanche",8,"2019-01-06","2019-02-03","2019-03-03","2019-04-07","2019-05-05","2019-06-02","2019-07-07","2019-08-04","2019-09-08","2019-10-06","2019-11-03","2019-12-08"]
["Lundi",9,"2019-01-07","2019-02-04","2019-03-04","2019-04-08","2019-05-06","2019-06-03","2019-07-08","2019-08-05","2019-09-09","2019-10-07","2019-11-04","2019-12-09"]
["Mardi",10,"2019-01-08","2019-02-05","2019-03-05","2019-04-09","2019-05-07","2019-06-04","2019-07-09","2019-08-06","2019-09-10","2019-10-08","2019-11-05","2019-12-10"]
["Mercredi",11,"2019-01-09","2019-02-06","2019-03-06","2019-04-10","2019-05-08","2019-06-05","2019-07-10","2019-08-07","2019-09-11","2019-10-09","2019-11-06","2019-12-11"]
["Jeudi",12,"2019-01-10","2019-02-07","2019-03-07","2019-04-11","2019-05-09","2019-06-06","2019-07-11","2019-08-08","2019-09-12","2019-10-10","2019-11-07","2019-12-12"]
["Vendredi",13,"2019-01-11","2019-02-08","2019-03-08","2019-04-12","2019-05-10","2019-06-07","2019-07-12","2019-08-09","2019-09-13","2019-10-11","2019-11-08","2019-12-13"]
["Samedi",14,"2019-01-12","2019-02-09","2019-03-09","2019-04-13","2019-05-11","2019-06-08","2019-07-13","2019-08-10","2019-09-14","2019-10-12","2019-11-09","2019-12-14"]
["Dimanche",15,"2019-01-13","2019-02-10","2019-03-10","2019-04-14","2019-05-12","2019-06-09","2019-07-14","2019-08-11","2019-09-15","2019-10-13","2019-11-10","2019-12-15"]
["Lundi",16,"2019-01-14","2019-02-11","2019-03-11","2019-04-15","2019-05-13","2019-06-10","2019-07-15","2019-08-12","2019-09-16","2019-10-14","2019-11-11","2019-12-16"]
["Mardi",17,"2019-01-15","2019-02-12","2019-03-12","2019-04-16","2019-05-14","2019-06-11","2019-07-16","2019-08-13","2019-09-17","2019-10-15","2019-11-12","2019-12-17"]
["Mercredi",18,"2019-01-16","2019-02-13","2019-03-13","2019-04-17","2019-05-15","2019-06-12","2019-07-17","2019-08-14","2019-09-18","2019-10-16","2019-11-13","2019-12-18"]
["Jeudi",19,"2019-01-17","2019-02-14","2019-03-14","2019-04-18","2019-05-16","2019-06-13","2019-07-18","2019-08-15","2019-09-19","2019-10-17","2019-11-14","2019-12-19"]
["Vendredi",20,"2019-01-18","2019-02-15","2019-03-15","2019-04-19","2019-05-17","2019-06-14","2019-07-19","2019-08-16","2019-09-20","2019-10-18","2019-11-15","2019-12-20"]
["Samedi",21,"2019-01-19","2019-02-16","2019-03-16","2019-04-20","2019-05-18","2019-06-15","2019-07-20","2019-08-17","2019-09-21","2019-10-19","2019-11-16","2019-12-21"]
["Dimanche",22,"2019-01-20","2019-02-17","2019-03-17","2019-04-21","2019-05-19","2019-06-16","2019-07-21","2019-08-18","2019-09-22","2019-10-20","2019-11-17","2019-12-22"]
["Lundi",23,"2019-01-21","2019-02-18","2019-03-18","2019-04-22","2019-05-20","2019-06-17","2019-07-22","2019-08-19","2019-09-23","2019-10-21","2019-11-18","2019-12-23"]
["Mardi",24,"2019-01-22","2019-02-19","2019-03-19","2019-04-23","2019-05-21","2019-06-18","2019-07-23","2019-08-20","2019-09-24","2019-10-22","2019-11-19","2019-12-24"]
["Mercredi",25,"2019-01-23","2019-02-20","2019-03-20","2019-04-24","2019-05-22","2019-06-19","2019-07-24","2019-08-21","2019-09-25","2019-10-23","2019-11-20","2019-12-25"]
["Jeudi",26,"2019-01-24","2019-02-21","2019-03-21","2019-04-25","2019-05-23","2019-06-20","2019-07-25","2019-08-22","2019-09-26","2019-10-24","2019-11-21","2019-12-26"]
["Vendredi",27,"2019-01-25","2019-02-22","2019-03-22","2019-04-26","2019-05-24","2019-06-21","2019-07-26","2019-08-23","2019-09-27","2019-10-25","2019-11-22","2019-12-27"]
["Samedi",28,"2019-01-26","2019-02-23","2019-03-23","2019-04-27","2019-05-25","2019-06-22","2019-07-27","2019-08-24","2019-09-28","2019-10-26","2019-11-23","2019-12-28"]
["Dimanche",29,"2019-01-27","2019-02-24","2019-03-24","2019-04-28","2019-05-26","2019-06-23","2019-07-28","2019-08-25","2019-09-29","2019-10-27","2019-11-24","2019-12-29"]
["Lundi",30,"2019-01-28","2019-02-25","2019-03-25","2019-04-29","2019-05-27","2019-06-24","2019-07-29","2019-08-26","2019-09-30","2019-10-28","2019-11-25","2019-12-30"]
["Mardi",31,"2019-01-29","2019-02-26","2019-03-26","2019-04-30","2019-05-28","2019-06-25","2019-07-30","2019-08-27","","2019-10-29","2019-11-26","2019-12-31"]
["Mercredi",32,"2019-01-30","2019-02-27","2019-03-27","","2019-05-29","2019-06-26","2019-07-31","2019-08-28","","2019-10-30","2019-11-27",""]
["Jeudi",33,"2019-01-31","2019-02-28","2019-03-28","","2019-05-30","2019-06-27","","2019-08-29","","2019-10-31","2019-11-28",""]
["Vendredi",34,"","","2019-03-29","","2019-05-31","2019-06-28","","2019-08-30","","","2019-11-29",""]
["Samedi",35,"","","2019-03-30","","","2019-06-29","","2019-08-31","","","2019-11-30",""]
["Dimanche",36,"","","2019-03-31","","","2019-06-30","","","","","",""]
["Lundi",37,{"$f":"IF(MONTH(C$5+$B42)=C$4,C$5+$B42,\"\")","v":""},"","","","","","","","","","",""]

{"sheet":"septembre","index":2,"n_rows":970,"n_cols":21,"rows_kept":970,"cut":false,"hidden":false,"merged":[]}
[null,null,null,null,null,null,"Date du début","g","2019-09-15",null,null,null,null,null,null,null,null,null,{"$f":"CHOOSE(MONTH(I1),\"janvier\",\"février\",\"mars\",\"avril\",\"mai\",\"juin\",\"juillet\",\"aout\",\"septembre\",\"octobre\",\"novembre\",\"décembre\")","v":"septembre"},{"$f":"IF(AND(S1=\"janvier\"),\"يناير\",\"\")&IF(AND(S1=\"février\"),\"فبراير\",\"\")&IF(AND(S1=\"mars\"),\"مارس\",\"\")&IF(AND(S1=\"avril\"),\"أفريل\",\"\")&IF(AND(S1=\"mai\"),\"ماي\",\"\")&IF(AND(S1=\"septembre\"),\"سبتمبر\",\"\")&IF(AND(S1=\"octobre\"),\"أكتوبر\",\"\")&IF(AND(S1=\"novembre\"),\"نوفمبر\",\"\")&IF(AND(S1=\"décembre\"),\"ديسمبر\",\"\")","v":"سبتمبر"},{"$f":"IF(AND(U2=\"janvier\"),\"يناير\",\"\")&IF(AND(U2=\"février\"),\"فبراير\",\"\")&IF(AND(U2=\"mars\"),\"مارس\",\"\")&IF(AND(U2=\"avril\"),\"سبتمبر\",\"\")&IF(AND(U2=\"septembre\"),\"سبتمبر\",\"\")&IF(AND(U2=\"octobre\"),\"أكتوبر\",\"\")&IF(AND(U2=\"novembre\"),\"نوفمبر\",\"\")&IF(AND(U2=\"décembre\"),\"ديسمبر\",\"\")","v":"سبتمبر"}]
[null,null,null,null,null,null,null,null,null,null,null,null,null,null,null,null,null,null,null,null,{"$f":"RIGHT(CELL(\"filename\",A1),LEN(CELL(\"filename\",A1))-SEARCH(\"]\",CELL(\"filename\",A1)))","v":"septembre"}]
[]
[]
[]
[]
[]
[]
[]
[]
[]
[]
[]
[]
[]
[]
[]
[]
[]
[]
[]
[]
[]
[]
[]
[]
[]
[]
[]
[]
[]
[]
[]
[]
[]
[]
[]
[]
[]
[]
[]
[]
[]
[]
[]
[]
[]
[]
[]
[]
[]
[null,null,null,null,null,null,null,null,{"$f":"I1+1","v":"2019-09-16"},null,null,null,null,null,null,null,null,null,{"$f":"CHOOSE(MONTH(I52),\"janvier\",\"février\",\"mars\",\"avril\",\"mai\",\"juin\",\"juillet\",\"aout\",\"septembre\",\"octobre\",\"novembre\",\"décembre\")","v":"septembre"},{"$f":"IF(AND(S52=\"janvier\"),\"يناير\",\"\")&IF(AND(S52=\"février\"),\"فبراير\",\"\")&IF(AND(S52=\"mars\"),\"مارس\",\"\")&IF(AND(S52=\"avril\"),\"أفريل\",\"\")&IF(AND(S52=\"mai\"),\"ماي\",\"\")&IF(AND(S52=\"septembre\"),\"سبتمبر\",\"\")&IF(AND(S52=\"octobre\"),\"أكتوبر\",\"\")&IF(AND(S52=\"novembre\"),\"نوفمبر\",\"\")&IF(AND(S52=\"décembre\"),\"ديسمبر\",\"\")","v":"سبتمبر"}]
[]
[]
[]
[]
[]
[]
[]
[]
[]
[]
[]
[]
[]
[]
[]
[]
[]
[]
[]
[]
[]
[]
[]
[]
[]
[]
[]
[]
[]
[]
[]
[]
[]
[]
[]
[]
[]
[]
[]
[]
[]
[]
[]
[]
[]
[]
[]
[]
[]
[]
[null,null,null,null,null,null,null,null,{"$f":"I52+1","v":"2019-09-17"},null,null,null,null,null,null,null,null,null,{"$f":"CHOOSE(MONTH(I103),\"janvier\",\"février\",\"mars\",\"avril\",\"mai\",\"juin\",\"juillet\",\"aout\",\"septembre\",\"octobre\",\"novembre\",\"décembre\")","v":"septembre"},{"$f":"IF(AND(S103=\"janvier\"),\"يناير\",\"\")&IF(AND(S103=\"février\"),\"فبراير\",\"\")&IF(AND(S103=\"mars\"),\"مارس\",\"\")&IF(AND(S103=\"avril\"),\"أفريل\",\"\")&IF(AND(S103=\"mai\"),\"ماي\",\"\")&IF(AND(S103=\"septembre\"),\"سبتمبر\",\"\")&IF(AND(S103=\"octobre\"),\"أكتوبر\",\"\")&IF(AND(S103=\"novembre\"),\"نوفمبر\",\"\")&IF(AND(S103=\"décembre\"),\"ديسمبر\",\"\")","v":"سبتمبر"}]
[]
[]
[]
[]
[]
[]
[]
[]
[]
[]
[]
[]
[]
[]
[]
[]
[]
[]
[]
[]
[]
[]
[]
[]
[]
[]
[]
[]
[]
[]
[]
[]
[]
[]
[]
[]
[]
[]
[]
[]
[]
[]
[]
[]
[]
[]
[]
[]
[]
[]
[null,null,null,null,null,null,null,null,{"$f":"I103+1","v":"2019-09-18"},null,null,null,null,null,null,null,null,null,{"$f":"CHOOSE(MONTH(I154),\"janvier\",\"février\",\"mars\",\"avril\",\"mai\",\"juin\",\"juillet\",\"aout\",\"septembre\",\"octobre\",\"novembre\",\"décembre\")","v":"septembre"},{"$f":"IF(AND(S154=\"janvier\"),\"يناير\",\"\")&IF(AND(S154=\"février\"),\"فبراير\",\"\")&IF(AND(S154=\"mars\"),\"مارس\",\"\")&IF(AND(S154=\"avril\"),\"أفريل\",\"\")&IF(AND(S154=\"mai\"),\"ماي\",\"\")&IF(AND(S154=\"septembre\"),\"سبتمبر\",\"\")&IF(AND(S154=\"octobre\"),\"أكتوبر\",\"\")&IF(AND(S154=\"novembre\"),\"نوفمبر\",\"\")&IF(AND(S154=\"décembre\"),\"ديسمبر\",\"\")","v":"سبتمبر"}]
[]
[]
[]
[]
[]
[]
[]
[]
[]
[]
[]
[]
[]
[]
[]
[]
[]
[]
[]
[]
[]
[]
[]
[]
[]
[]
[]
[]
[]
[]
[]
[]
[]
[]
[]
[]
[]
[]
[]
[]
[]
[]
[]
[]
[]
[]
[]
[]
[]
[]
[null,null,null,null,null,null,null,null,{"$f":"I154+1","v":"2019-09-19"},null,null,null,null,null,null,null,null,null,{"$f":"CHOOSE(MONTH(I205),\"janvier\",\"février\",\"mars\",\"avril\",\"mai\",\"juin\",\"juillet\",\"aout\",\"septembre\",\"octobre\",\"novembre\",\"décembre\")","v":"septembre"},{"$f":"IF(AND(S205=\"janvier\"),\"يناير\",\"\")&IF(AND(S205=\"février\"),\"فبراير\",\"\")&IF(AND(S205=\"mars\"),\"مارس\",\"\")&IF(AND(S205=\"avril\"),\"أفريل\",\"\")&IF(AND(S205=\"mai\"),\"ماي\",\"\")&IF(AND(S205=\"septembre\"),\"سبتمبر\",\"\")&IF(AND(S205=\"octobre\"),\"أكتوبر\",\"\")&IF(AND(S205=\"novembre\"),\"نوفمبر\",\"\")&IF(AND(S205=\"décembre\"),\"ديسمبر\",\"\")","v":"سبتمبر"}]
[]
[]
[]
[]
[]
[]
[]
[]
[]
[]
[]
[]
[]
[]
[]
[]
[]
[]
[]
[]
[]
[]
[]
[]
[]
[]
[]
[]
[]
[]
[]
[]
[]
[]
[]
[]
[]
[]
[]
[]
[]
[]
[]
[]
[]
[]
[]
[]
[]
[]
[null,null,null,null,null,null,null,null,{"$f":"I205+3","v":"2019-09-22"},null,null,null,null,null,null,null,null,null,{"$f":"CHOOSE(MONTH(I256),\"janvier\",\"février\",\"mars\",\"avril\",\"mai\",\"juin\",\"juillet\",\"aout\",\"septembre\",\"octobre\",\"novembre\",\"décembre\")","v":"septembre"},{"$f":"IF(AND(S256=\"janvier\"),\"يناير\",\"\")&IF(AND(S256=\"février\"),\"فبراير\",\"\")&IF(AND(S256=\"mars\"),\"مارس\",\"\")&IF(AND(S256=\"avril\"),\"أفريل\",\"\")&IF(AND(S256=\"mai\"),\"ماي\",\"\")&IF(AND(S256=\"septembre\"),\"سبتمبر\",\"\")&IF(AND(S256=\"octobre\"),\"أكتوبر\",\"\")&IF(AND(S256=\"novembre\"),\"نوفمبر\",\"\")&IF(AND(S256=\"décembre\"),\"ديسمبر\",\"\")","v":"سبتمبر"}]
[]
[]
[]
[]
[]
[]
[]
[]
[]
[]
[]
[]
[]
[]
[]
[]
[]
[]
[]
[]
[]
[]
[]
[]
[]
[]
[]
[]
[]
[]
[]
[]
[]
[]
[]
[]
[]
[]
[]
[]
[]
[]
[]
[]
[]
[]
[]
[]
[]
[]
[null,null,null,null,null,null,null,null,{"$f":"I256+1","v":"2019-09-23"},null,null,null,null,null,null,null,null,null,{"$f":"CHOOSE(MONTH(I307),\"janvier\",\"février\",\"mars\",\"avril\",\"mai\",\"juin\",\"juillet\",\"aout\",\"septembre\",\"octobre\",\"novembre\",\"décembre\")","v":"septembre"},{"$f":"IF(AND(S307=\"janvier\"),\"يناير\",\"\")&IF(AND(S307=\"février\"),\"فبراير\",\"\")&IF(AND(S307=\"mars\"),\"مارس\",\"\")&IF(AND(S307=\"avril\"),\"أفريل\",\"\")&IF(AND(S307=\"mai\"),\"ماي\",\"\")&IF(AND(S307=\"septembre\"),\"سبتمبر\",\"\")&IF(AND(S307=\"octobre\"),\"أكتوبر\",\"\")&IF(AND(S307=\"novembre\"),\"نوفمبر\",\"\")&IF(AND(S307=\"décembre\"),\"ديسمبر\",\"\")","v":"سبتمبر"}]
[]
[]
[]
[]
[]
[]
[]
[]
[]
[]
[]
[]
[]
[]
[]
[]
[]
[]
[]
[]
[]
[]
[]
[]
[]
[]
[]
[]
[]
[]
[]
[]
[]
[]
[]
[]
[]
[]
[]
[]
[]
[]
[]
[]
[]
[]
[]
[]
[]
[]
[null,null,null,null,null,null,null,null,{"$f":"I307+1","v":"2019-09-24"},null,null,null,null,null,null,null,null,null,{"$f":"CHOOSE(MONTH(I358),\"janvier\",\"février\",\"mars\",\"avril\",\"mai\",\"juin\",\"juillet\",\"aout\",\"septembre\",\"octobre\",\"novembre\",\"décembre\")","v":"septembre"},{"$f":"IF(AND(S358=\"janvier\"),\"يناير\",\"\")&IF(AND(S358=\"février\"),\"فبراير\",\"\")&IF(AND(S358=\"mars\"),\"مارس\",\"\")&IF(AND(S358=\"avril\"),\"أفريل\",\"\")&IF(AND(S358=\"mai\"),\"ماي\",\"\")&IF(AND(S358=\"septembre\"),\"سبتمبر\",\"\")&IF(AND(S358=\"octobre\"),\"أكتوبر\",\"\")&IF(AND(S358=\"novembre\"),\"نوفمبر\",\"\")&IF(AND(S358=\"décembre\"),\"ديسمبر\",\"\")","v":"سبتمبر"}]
[]
[]
[]
[]
[]
[]
[]
[]
[]
[]
[]
[]
[]
[]
[]
[]
[]
[]
[]
[]
[]
[]
[]
[]
[]
[]
[]
[]
[]
[]
[]
[]
[]
[]
[]
[]
[]
[]
[]
[]
[]
[]
[]
[]
[]
[]
[]
[]
[]
[]
[null,null,null,null,null,null,null,null,{"$f":"I358+1","v":"2019-09-25"},null,null,null,null,null,null,null,null,null,{"$f":"CHOOSE(MONTH(I409),\"janvier\",\"février\",\"mars\",\"avril\",\"mai\",\"juin\",\"juillet\",\"aout\",\"septembre\",\"octobre\",\"novembre\",\"décembre\")","v":"septembre"},{"$f":"IF(AND(S409=\"janvier\"),\"يناير\",\"\")&IF(AND(S409=\"février\"),\"فبراير\",\"\")&IF(AND(S409=\"mars\"),\"مارس\",\"\")&IF(AND(S409=\"avril\"),\"أفريل\",\"\")&IF(AND(S409=\"mai\"),\"ماي\",\"\")&IF(AND(S409=\"septembre\"),\"سبتمبر\",\"\")&IF(AND(S409=\"octobre\"),\"أكتوبر\",\"\")&IF(AND(S409=\"novembre\"),\"نوفمبر\",\"\")&IF(AND(S409=\"décembre\"),\"ديسمبر\",\"\")","v":"سبتمبر"}]
[]
[]
[]
[]
[]
[]
[]
[]
[]
[]
[]
[]
[]
[]
[]
[]
[]
[]
[]
[]
[]
[]
[]
[]
[]
[]
[]
[]
[]
[]
[]
[]
[]
[]
[]
[]
[]
[]
[]
[]
[]
[]
[]
[]
[]
[]
[]
[]
[]
[]
[null,null,null,null,null,null,null,null,{"$f":"I409+1","v":"2019-09-26"},null,null,null,null,null,null,null,null,null,{"$f":"CHOOSE(MONTH(I460),\"janvier\",\"février\",\"mars\",\"avril\",\"mai\",\"juin\",\"juillet\",\"aout\",\"septembre\",\"octobre\",\"novembre\",\"décembre\")","v":"septembre"},{"$f":"IF(AND(S460=\"janvier\"),\"يناير\",\"\")&IF(AND(S460=\"février\"),\"فبراير\",\"\")&IF(AND(S460=\"mars\"),\"مارس\",\"\")&IF(AND(S460=\"avril\"),\"أفريل\",\"\")&IF(AND(S460=\"mai\"),\"ماي\",\"\")&IF(AND(S460=\"septembre\"),\"سبتمبر\",\"\")&IF(AND(S460=\"octobre\"),\"أكتوبر\",\"\")&IF(AND(S460=\"novembre\"),\"نوفمبر\",\"\")&IF(AND(S460=\"décembre\"),\"ديسمبر\",\"\")","v":"سبتمبر"}]
[]
[]
[]
[]
[]
[]
[]
[]
[]
[]
[]
[]
[]
[]
[]
[]
[]
[]
[]
[]
[]
[]
[]
[]
[]
[]
[]
[]
[]
[]
[]
[]
[]
[]
[]
[]
[]
[]
[]
[]
[]
[]
[]
[]
[]
[]
[]
[]
[]
[]
[null,null,null,null,null,null,null,null,{"$f":"I460+3","v":"2019-09-29"},null,null,null,null,null,null,null,null,null,{"$f":"CHOOSE(MONTH(I511),\"janvier\",\"février\",\"mars\",\"avril\",\"mai\",\"juin\",\"juillet\",\"aout\",\"septembre\",\"octobre\",\"novembre\",\"décembre\")","v":"septembre"},{"$f":"IF(AND(S511=\"janvier\"),\"يناير\",\"\")&IF(AND(S511=\"février\"),\"فبراير\",\"\")&IF(AND(S511=\"mars\"),\"مارس\",\"\")&IF(AND(S511=\"avril\"),\"أفريل\",\"\")&IF(AND(S511=\"mai\"),\"ماي\",\"\")&IF(AND(S511=\"septembre\"),\"سبتمبر\",\"\")&IF(AND(S511=\"octobre\"),\"أكتوبر\",\"\")&IF(AND(S511=\"novembre\"),\"نوفمبر\",\"\")&IF(AND(S511=\"décembre\"),\"ديسمبر\",\"\")","v":"سبتمبر"}]
[]
[]
[]
[]
[]
[]
[]
[]
[]
[]
[]
[]
[]
[]
[]
[]
[]
[]
[]
[]
[]
[]
[]
[]
[]
[]
[]
[]
[]
[]
[]
[]
[]
[]
[]
[]
[]
[]
[]
[]
[]
[]
[]
[]
[]
[]
[]
[]
[]
[]
[null,null,null,null,null,null,null,null,{"$f":"I511+1","v":"2019-09-30"},null,null,null,null,null,null,null,null,null,{"$f":"CHOOSE(MONTH(I562),\"janvier\",\"février\",\"mars\",\"avril\",\"mai\",\"juin\",\"juillet\",\"aout\",\"septembre\",\"octobre\",\"novembre\",\"décembre\")","v":"septembre"},{"$f":"IF(AND(S562=\"janvier\"),\"يناير\",\"\")&IF(AND(S562=\"février\"),\"فبراير\",\"\")&IF(AND(S562=\"mars\"),\"مارس\",\"\")&IF(AND(S562=\"avril\"),\"أفريل\",\"\")&IF(AND(S562=\"mai\"),\"ماي\",\"\")&IF(AND(S562=\"septembre\"),\"سبتمبر\",\"\")&IF(AND(S562=\"octobre\"),\"أكتوبر\",\"\")&IF(AND(S562=\"novembre\"),\"نوفمبر\",\"\")&IF(AND(S562=\"décembre\"),\"ديسمبر\",\"\")","v":"سبتمبر"}]
[]
[]
[]
[]
[]
[]
[]
[]
[]
[]
[]
[]
[]
[]
[]
[]
[]
[]
[]
[]
[]
[]
[]
[]
[]
[]
[]
[]
[]
[]
[]
[]
[]
[]
[]
[]
[]
[]
[]
[]
[]
[]
[]
[]
[]
[]
[]
[]
[]
[]
[null,null,null,null,null,null,null,null,{"$f":"I562+1","v":"2019-10-01"},null,null,null,null,null,null,null,null,null,{"$f":"CHOOSE(MONTH(I613),\"janvier\",\"février\",\"mars\",\"avril\",\"mai\",\"juin\",\"juillet\",\"aout\",\"septembre\",\"octobre\",\"novembre\",\"décembre\")","v":"octobre"},{"$f":"IF(AND(S613=\"janvier\"),\"يناير\",\"\")&IF(AND(S613=\"février\"),\"فبراير\",\"\")&IF(AND(S613=\"mars\"),\"مارس\",\"\")&IF(AND(S613=\"avril\"),\"أفريل\",\"\")&IF(AND(S613=\"mai\"),\"ماي\",\"\")&IF(AND(S613=\"septembre\"),\"سبتمبر\",\"\")&IF(AND(S613=\"octobre\"),\"أكتوبر\",\"\")&IF(AND(S613=\"novembre\"),\"نوفمبر\",\"\")&IF(AND(S613=\"décembre\"),\"ديسمبر\",\"\")","v":"أكتوبر"}]
[]
[]
[]
[]
[]
[]
[]
[]
[]
[]
[]
[]
[]
[]
[]
[]
[]
[]
[]
[]
[]
[]
[]
[]
[]
[]
[]
[]
[]
[]
[]
[]
[]
[]
[]
[]
[]
[]
[]
[]
[]
[]
[]
[]
[]
[]
[]
[]
[]
[]
[null,null,null,null,null,null,null,null,{"$f":"I613+1","v":"2019-10-02"},null,null,null,null,null,null,null,null,null,{"$f":"CHOOSE(MONTH(I664),\"janvier\",\"février\",\"mars\",\"avril\",\"mai\",\"juin\",\"juillet\",\"aout\",\"septembre\",\"octobre\",\"novembre\",\"décembre\")","v":"octobre"},{"$f":"IF(AND(S664=\"janvier\"),\"يناير\",\"\")&IF(AND(S664=\"février\"),\"فبراير\",\"\")&IF(AND(S664=\"mars\"),\"مارس\",\"\")&IF(AND(S664=\"avril\"),\"أفريل\",\"\")&IF(AND(S664=\"mai\"),\"ماي\",\"\")&IF(AND(S664=\"septembre\"),\"سبتمبر\",\"\")&IF(AND(S664=\"octobre\"),\"أكتوبر\",\"\")&IF(AND(S664=\"novembre\"),\"نوفمبر\",\"\")&IF(AND(S664=\"décembre\"),\"ديسمبر\",\"\")","v":"أكتوبر"}]
[]
[]
[]
[]
[]
[]
[]
[]
[]
[]
[]
[]
[]
[]
[]
[]
[]
[]
[]
[]
[]
[]
[]
[]
[]
[]
[]
[]
[]
[]
[]
[]
[]
[]
[]
[]
[]
[]
[]
[]
[]
[]
[]
[]
[]
[]
[]
[]
[]
[]
[null,null,null,null,null,null,null,null,{"$f":"I664+1","v":"2019-10-03"},null,null,null,null,null,null,null,null,null,{"$f":"CHOOSE(MONTH(I715),\"janvier\",\"février\",\"mars\",\"avril\",\"mai\",\"juin\",\"juillet\",\"aout\",\"septembre\",\"octobre\",\"novembre\",\"décembre\")","v":"octobre"},{"$f":"IF(AND(S715=\"janvier\"),\"يناير\",\"\")&IF(AND(S715=\"février\"),\"فبراير\",\"\")&IF(AND(S715=\"mars\"),\"مارس\",\"\")&IF(AND(S715=\"avril\"),\"أفريل\",\"\")&IF(AND(S715=\"mai\"),\"ماي\",\"\")&IF(AND(S715=\"septembre\"),\"سبتمبر\",\"\")&IF(AND(S715=\"octobre\"),\"أكتوبر\",\"\")&IF(AND(S715=\"novembre\"),\"نوفمبر\",\"\")&IF(AND(S715=\"décembre\"),\"ديسمبر\",\"\")","v":"أكتوبر"}]
[]
[]
[]
[]
[]
[]
[]
[]
[]
[]
[]
[]
[]
[]
[]
[]
[]
[]
[]
[]
[]
[]
[]
[]
[]
[]
[]
[]
[]
[]
[]
[]
[]
[]
[]
[]
[]
[]
[]
[]
[]
[]
[]
[]
[]
[]
[]
[]
[]
[]
[null,null,null,null,null,null,null,null,{"$f":"I715+3","v":"2019-10-06"},null,null,null,null,null,null,null,null,null,{"$f":"CHOOSE(MONTH(I766),\"janvier\",\"février\",\"mars\",\"avril\",\"mai\",\"juin\",\"juillet\",\"aout\",\"septembre\",\"octobre\",\"novembre\",\"décembre\")","v":"octobre"},{"$f":"IF(AND(S766=\"janvier\"),\"يناير\",\"\")&IF(AND(S766=\"février\"),\"فبراير\",\"\")&IF(AND(S766=\"mars\"),\"مارس\",\"\")&IF(AND(S766=\"avril\"),\"أفريل\",\"\")&IF(AND(S766=\"mai\"),\"ماي\",\"\")&IF(AND(S766=\"septembre\"),\"سبتمبر\",\"\")&IF(AND(S766=\"octobre\"),\"أكتوبر\",\"\")&IF(AND(S766=\"novembre\"),\"نوفمبر\",\"\")&IF(AND(S766=\"décembre\"),\"ديسمبر\",\"\")","v":"أكتوبر"}]
[]
[]
[]
[]
[]
[]
[]
[]
[]
[]
[]
[]
[]
[]
[]
[]
[]
[]
[]
[]
[]
[]
[]
[]
[]
[]
[]
[]
[]
[]
[]
[]
[]
[]
[]
[]
[]
[]
[]
[]
[]
[]
[]
[]
[]
[]
[]
[]
[]
[]
[null,null,null,null,null,null,null,null,{"$f":"I766+1","v":"2019-10-07"},null,null,null,null,null,null,null,null,null,{"$f":"CHOOSE(MONTH(I817),\"janvier\",\"février\",\"mars\",\"avril\",\"mai\",\"juin\",\"juillet\",\"aout\",\"septembre\",\"octobre\",\"novembre\",\"décembre\")","v":"octobre"},{"$f":"IF(AND(S817=\"janvier\"),\"يناير\",\"\")&IF(AND(S817=\"février\"),\"فبراير\",\"\")&IF(AND(S817=\"mars\"),\"مارس\",\"\")&IF(AND(S817=\"avril\"),\"أفريل\",\"\")&IF(AND(S817=\"mai\"),\"ماي\",\"\")&IF(AND(S817=\"septembre\"),\"سبتمبر\",\"\")&IF(AND(S817=\"octobre\"),\"أكتوبر\",\"\")&IF(AND(S817=\"novembre\"),\"نوفمبر\",\"\")&IF(AND(S817=\"décembre\"),\"ديسمبر\",\"\")","v":"أكتوبر"}]
[]
[]
[]
[]
[]
[]
[]
[]
[]
[]
[]
[]
[]
[]
[]
[]
[]
[]
[]
[]
[]
[]
[]
[]
[]
[]
[]
[]
[]
[]
[]
[]
[]
[]
[]
[]
[]
[]
[]
[]
[]
[]
[]
[]
[]
[]
[]
[]
[]
[]
[null,null,null,null,null,null,null,null,{"$f":"I817+1","v":"2019-10-08"},null,null,null,null,null,null,null,null,null,{"$f":"CHOOSE(MONTH(I868),\"janvier\",\"février\",\"mars\",\"avril\",\"mai\",\"juin\",\"juillet\",\"aout\",\"septembre\",\"octobre\",\"novembre\",\"décembre\")","v":"octobre"},{"$f":"IF(AND(S868=\"janvier\"),\"يناير\",\"\")&IF(AND(S868=\"février\"),\"فبراير\",\"\")&IF(AND(S868=\"mars\"),\"مارس\",\"\")&IF(AND(S868=\"avril\"),\"أفريل\",\"\")&IF(AND(S868=\"mai\"),\"ماي\",\"\")&IF(AND(S868=\"septembre\"),\"سبتمبر\",\"\")&IF(AND(S868=\"octobre\"),\"أكتوبر\",\"\")&IF(AND(S868=\"novembre\"),\"نوفمبر\",\"\")&IF(AND(S868=\"décembre\"),\"ديسمبر\",\"\")","v":"أكتوبر"}]
[]
[]
[]
[]
[]
[]
[]
[]
[]
[]
[]
[]
[]
[]
[]
[]
[]
[]
[]
[]
[]
[]
[]
[]
[]
[]
[]
[]
[]
[]
[]
[]
[]
[]
[]
[]
[]
[]
[]
[]
[]
[]
[]
[]
[]
[]
[]
[]
[]
[]
[null,null,null,null,null,null,null,null,{"$f":"I868+1","v":"2019-10-09"},null,null,null,null,null,null,null,null,null,{"$f":"CHOOSE(MONTH(I919),\"janvier\",\"février\",\"mars\",\"avril\",\"mai\",\"juin\",\"juillet\",\"aout\",\"septembre\",\"octobre\",\"novembre\",\"décembre\")","v":"octobre"},{"$f":"IF(AND(S919=\"janvier\"),\"يناير\",\"\")&IF(AND(S919=\"février\"),\"فبراير\",\"\")&IF(AND(S919=\"mars\"),\"مارس\",\"\")&IF(AND(S919=\"avril\"),\"أفريل\",\"\")&IF(AND(S919=\"mai\"),\"ماي\",\"\")&IF(AND(S919=\"septembre\"),\"سبتمبر\",\"\")&IF(AND(S919=\"octobre\"),\"أكتوبر\",\"\")&IF(AND(S919=\"novembre\"),\"نوفمبر\",\"\")&IF(AND(S919=\"décembre\"),\"ديسمبر\",\"\")","v":"أكتوبر"}]
[]
[]
[]
[]
[]
[]
[]
[]
[]
[]
[]
[]
[]
[]
[]
[]
[]
[]
[]
[]
[]
[]
[]
[]
[]
[]
[]
[]
[]
[]
[]
[]
[]
[]
[]
[]
[]
[]
[]
[]
[]
[]
[]
[]
[]
[]
[]
[]
[]
[]
[null,null,null,null,null,null,null,null,{"$f":"I919+1","v":"2019-10-10"},null,null,null,null,null,null,null,null,null,{"$f":"CHOOSE(MONTH(I970),\"janvier\",\"février\",\"mars\",\"avril\",\"mai\",\"juin\",\"juillet\",\"aout\",\"septembre\",\"octobre\",\"novembre\",\"décembre\")","v":"octobre"},{"$f":"IF(AND(S970=\"janvier\"),\"يناير\",\"\")&IF(AND(S970=\"février\"),\"فبراير\",\"\")&IF(AND(S970=\"mars\"),\"مارس\",\"\")&IF(AND(S970=\"avril\"),\"أفريل\",\"\")&IF(AND(S970=\"mai\"),\"ماي\",\"\")&IF(AND(S970=\"septembre\"),\"سبتمبر\",\"\")&IF(AND(S970=\"octobre\"),\"أكتوبر\",\"\")&IF(AND(S970=\"novembre\"),\"نوفمبر\",\"\")&IF(AND(S970=\"décembre\"),\"ديسمبر\",\"\")","v":"أكتوبر"}]

{"sheet":"octobre","index":3,"n_rows":970,"n_cols":21,"rows_kept":970,"cut":false,"hidden":false,"merged":[]}
[null,null,null,null,null,null,null,null,{"$f":"septembre!I919+4","v":"2019-10-13"},null,null,null,null,null,null,null,null,null,{"$f":"CHOOSE(MONTH(I1),\"janvier\",\"février\",\"mars\",\"avril\",\"mai\",\"juin\",\"juillet\",\"aout\",\"septembre\",\"octobre\",\"novembre\",\"décembre\")","v":"octobre"},{"$f":"IF(AND(S1=\"janvier\"),\"يناير\",\"\")&IF(AND(S1=\"février\"),\"فبراير\",\"\")&IF(AND(S1=\"mars\"),\"مارس\",\"\")&IF(AND(S1=\"avril\"),\"أفريل\",\"\")&IF(AND(S1=\"mai\"),\"ماي\",\"\")&IF(AND(S1=\"septembre\"),\"سبتمبر\",\"\")&IF(AND(S1=\"octobre\"),\"أكتوبر\",\"\")&IF(AND(S1=\"novembre\"),\"نوفمبر\",\"\")&IF(AND(S1=\"décembre\"),\"ديسمبر\",\"\")","v":"أكتوبر"},{"$f":"IF(AND(U2=\"janvier\"),\"يناير\",\"\")&IF(AND(U2=\"février\"),\"فبراير\",\"\")&IF(AND(U2=\"mars\"),\"مارس\",\"\")&IF(AND(U2=\"avril\"),\"سبتمبر\",\"\")&IF(AND(U2=\"septembre\"),\"سبتمبر\",\"\")&IF(AND(U2=\"octobre\"),\"أكتوبر\",\"\")&IF(AND(U2=\"novembre\"),\"نوفمبر\",\"\")&IF(AND(U2=\"décembre\"),\"ديسمبر\",\"\")","v":"أكتوبر"}]
[null,null,null,null,null,null,null,null,null,null,null,null,null,null,null,null,null,null,null,null,{"$f":"RIGHT(CELL(\"filename\",A1),LEN(CELL(\"filename\",A1))-SEARCH(\"]\",CELL(\"filename\",A1)))","v":"octobre"}]
[]
[]
[]
[]
[]
[]
[]
[]
[]
[]
[]
[]
[]
[]
[]
[]
[]
[]
[]
[]
[]
[]
[]
[]
[]
[]
[]
[]
[]
[]
[]
[]
[]
[]
[]
[]
[]
[]
[]
[]
[]
[]
[]
[]
[]
[]
[]
[]
[]
[null,null,null,null,null,null,null,null,{"$f":"I1+1","v":"2019-10-14"},null,null,null,null,null,null,null,null,null,{"$f":"CHOOSE(MONTH(I52),\"janvier\",\"février\",\"mars\",\"avril\",\"mai\",\"juin\",\"juillet\",\"aout\",\"septembre\",\"octobre\",\"novembre\",\"décembre\")","v":"octobre"},{"$f":"IF(AND(S52=\"janvier\"),\"يناير\",\"\")&IF(AND(S52=\"février\"),\"فبراير\",\"\")&IF(AND(S52=\"mars\"),\"مارس\",\"\")&IF(AND(S52=\"avril\"),\"أفريل\",\"\")&IF(AND(S52=\"mai\"),\"ماي\",\"\")&IF(AND(S52=\"septembre\"),\"سبتمبر\",\"\")&IF(AND(S52=\"octobre\"),\"أكتوبر\",\"\")&IF(AND(S52=\"novembre\"),\"نوفمبر\",\"\")&IF(AND(S52=\"décembre\"),\"ديسمبر\",\"\")","v":"أكتوبر"}]
[]
[]
[]
[]
[]
[]
[]
[]
[]
[]
[]
[]
[]
[]
[]
[]
[]
[]
[]
[]
[]
[]
[]
[]
[]
[]
[]
[]
[]
[]
[]
[]
[]
[]
[]
[]
[]
[]
[]
[]
[]
[]
[]
[]
[]
[]
[]
[]
[]
[]
[null,null,null,null,null,null,null,null,{"$f":"I52+1","v":"2019-10-15"},null,null,null,null,null,null,null,null,null,{"$f":"CHOOSE(MONTH(I103),\"janvier\",\"février\",\"mars\",\"avril\",\"mai\",\"juin\",\"juillet\",\"aout\",\"septembre\",\"octobre\",\"novembre\",\"décembre\")","v":"octobre"},{"$f":"IF(AND(S103=\"janvier\"),\"يناير\",\"\")&IF(AND(S103=\"février\"),\"فبراير\",\"\")&IF(AND(S103=\"mars\"),\"مارس\",\"\")&IF(AND(S103=\"avril\"),\"أفريل\",\"\")&IF(AND(S103=\"mai\"),\"ماي\",\"\")&IF(AND(S103=\"septembre\"),\"سبتمبر\",\"\")&IF(AND(S103=\"octobre\"),\"أكتوبر\",\"\")&IF(AND(S103=\"novembre\"),\"نوفمبر\",\"\")&IF(AND(S103=\"décembre\"),\"ديسمبر\",\"\")","v":"أكتوبر"}]
[]
[]
[]
[]
[]
[]
[]
[]
[]
[]
[]
[]
[]
[]
[]
[]
[]
[]
[]
[]
[]
[]
[]
[]
[]
[]
[]
[]
[]
[]
[]
[]
[]
[]
[]
[]
[]
[]
[]
[]
[]
[]
[]
[]
[]
[]
[]
[]
[]
[]
[null,null,null,null,null,null,null,null,{"$f":"I103+1","v":"2019-10-16"},null,null,null,null,null,null,null,null,null,{"$f":"CHOOSE(MONTH(I154),\"janvier\",\"février\",\"mars\",\"avril\",\"mai\",\"juin\",\"juillet\",\"aout\",\"septembre\",\"octobre\",\"novembre\",\"décembre\")","v":"octobre"},{"$f":"IF(AND(S154=\"janvier\"),\"يناير\",\"\")&IF(AND(S154=\"février\"),\"فبراير\",\"\")&IF(AND(S154=\"mars\"),\"مارس\",\"\")&IF(AND(S154=\"avril\"),\"أفريل\",\"\")&IF(AND(S154=\"mai\"),\"ماي\",\"\")&IF(AND(S154=\"septembre\"),\"سبتمبر\",\"\")&IF(AND(S154=\"octobre\"),\"أكتوبر\",\"\")&IF(AND(S154=\"novembre\"),\"نوفمبر\",\"\")&IF(AND(S154=\"décembre\"),\"ديسمبر\",\"\")","v":"أكتوبر"}]
[]
[]
[]
[]
[]
[]
[]
[]
[]
[]
[]
[]
[]
[]
[]
[]
[]
[]
[]
[]
[]
[]
[]
[]
[]
[]
[]
[]
[]
[]
[]
[]
[]
[]
[]
[]
[]
[]
[]
[]
[]
[]
[]
[]
[]
[]
[]
[]
[]
[]
[null,null,null,null,null,null,null,null,{"$f":"I154+1","v":"2019-10-17"},null,null,null,null,null,null,null,null,null,{"$f":"CHOOSE(MONTH(I205),\"janvier\",\"février\",\"mars\",\"avril\",\"mai\",\"juin\",\"juillet\",\"aout\",\"septembre\",\"octobre\",\"novembre\",\"décembre\")","v":"octobre"},{"$f":"IF(AND(S205=\"janvier\"),\"يناير\",\"\")&IF(AND(S205=\"février\"),\"فبراير\",\"\")&IF(AND(S205=\"mars\"),\"مارس\",\"\")&IF(AND(S205=\"avril\"),\"أفريل\",\"\")&IF(AND(S205=\"mai\"),\"ماي\",\"\")&IF(AND(S205=\"septembre\"),\"سبتمبر\",\"\")&IF(AND(S205=\"octobre\"),\"أكتوبر\",\"\")&IF(AND(S205=\"novembre\"),\"نوفمبر\",\"\")&IF(AND(S205=\"décembre\"),\"ديسمبر\",\"\")","v":"أكتوبر"}]
[]
[]
[]
[]
[]
[]
[]
[]
[]
[]
[]
[]
[]
[]
[]
[]
[]
[]
[]
[]
[]
[]
[]
[]
[]
[]
[]
[]
[]
[]
[]
[]
[]
[]
[]
[]
[]
[]
[]
[]
[]
[]
[]
[]
[]
[]
[]
[]
[]
[]
[null,null,null,null,null,null,null,null,{"$f":"I205+3","v":"2019-10-20"},null,null,null,null,null,null,null,null,null,{"$f":"CHOOSE(MONTH(I256),\"janvier\",\"février\",\"mars\",\"avril\",\"mai\",\"juin\",\"juillet\",\"aout\",\"septembre\",\"octobre\",\"novembre\",\"décembre\")","v":"octobre"},{"$f":"IF(AND(S256=\"janvier\"),\"يناير\",\"\")&IF(AND(S256=\"février\"),\"فبراير\",\"\")&IF(AND(S256=\"mars\"),\"مارس\",\"\")&IF(AND(S256=\"avril\"),\"أفريل\",\"\")&IF(AND(S256=\"mai\"),\"ماي\",\"\")&IF(AND(S256=\"septembre\"),\"سبتمبر\",\"\")&IF(AND(S256=\"octobre\"),\"أكتوبر\",\"\")&IF(AND(S256=\"novembre\"),\"نوفمبر\",\"\")&IF(AND(S256=\"décembre\"),\"ديسمبر\",\"\")","v":"أكتوبر"}]
[]
[]
[]
[]
[]
[]
[]
[]
[]
[]
[]
[]
[]
[]
[]
[]
[]
[]
[]
[]
[]
[]
[]
[]
[]
[]
[]
[]
[]
[]
[]
[]
[]
[]
[]
[]
[]
[]
[]
[]
[]
[]
[]
[]
[]
[]
[]
[]
[]
[]
[null,null,null,null,null,null,null,null,{"$f":"I256+1","v":"2019-10-21"},null,null,null,null,null,null,null,null,null,{"$f":"CHOOSE(MONTH(I307),\"janvier\",\"février\",\"mars\",\"avril\",\"mai\",\"juin\",\"juillet\",\"aout\",\"septembre\",\"octobre\",\"novembre\",\"décembre\")","v":"octobre"},{"$f":"IF(AND(S307=\"janvier\"),\"يناير\",\"\")&IF(AND(S307=\"février\"),\"فبراير\",\"\")&IF(AND(S307=\"mars\"),\"مارس\",\"\")&IF(AND(S307=\"avril\"),\"أفريل\",\"\")&IF(AND(S307=\"mai\"),\"ماي\",\"\")&IF(AND(S307=\"septembre\"),\"سبتمبر\",\"\")&IF(AND(S307=\"octobre\"),\"أكتوبر\",\"\")&IF(AND(S307=\"novembre\"),\"نوفمبر\",\"\")&IF(AND(S307=\"décembre\"),\"ديسمبر\",\"\")","v":"أكتوبر"}]
[]
[]
[]
[]
[]
[]
[]
[]
[]
[]
[]
[]
[]
[]
[]
[]
[]
[]
[]
[]
[]
[]
[]
[]
[]
[]
[]
[]
[]
[]
[]
[]
[]
[]
[]
[]
[]
[]
[]
[]
[]
[]
[]
[]
[]
[]
[]
[]
[]
[]
[null,null,null,null,null,null,null,null,{"$f":"I307+1","v":"2019-10-22"},null,null,null,null,null,null,null,null,null,{"$f":"CHOOSE(MONTH(I358),\"janvier\",\"février\",\"mars\",\"avril\",\"mai\",\"juin\",\"juillet\",\"aout\",\"septembre\",\"octobre\",\"novembre\",\"décembre\")","v":"octobre"},{"$f":"IF(AND(S358=\"janvier\"),\"يناير\",\"\")&IF(AND(S358=\"février\"),\"فبراير\",\"\")&IF(AND(S358=\"mars\"),\"مارس\",\"\")&IF(AND(S358=\"avril\"),\"أفريل\",\"\")&IF(AND(S358=\"mai\"),\"ماي\",\"\")&IF(AND(S358=\"septembre\"),\"سبتمبر\",\"\")&IF(AND(S358=\"octobre\"),\"أكتوبر\",\"\")&IF(AND(S358=\"novembre\"),\"نوفمبر\",\"\")&IF(AND(S358=\"décembre\"),\"ديسمبر\",\"\")","v":"أكتوبر"}]
[]
[]
[]
[]
[]
[]
[]
[]
[]
[]
[]
[]
[]
[]
[]
[]
[]
[]
[]
[]
[]
[]
[]
[]
[]
[]
[]
[]
[]
[]
[]
[]
[]
[]
[]
[]
[]
[]
[]
[]
[]
[]
[]
[]
[]
[]
[]
[]
[]
[]
[null,null,null,null,null,null,null,null,{"$f":"I358+1","v":"2019-10-23"},null,null,null,null,null,null,null,null,null,{"$f":"CHOOSE(MONTH(I409),\"janvier\",\"février\",\"mars\",\"avril\",\"mai\",\"juin\",\"juillet\",\"aout\",\"septembre\",\"octobre\",\"novembre\",\"décembre\")","v":"octobre"},{"$f":"IF(AND(S409=\"janvier\"),\"يناير\",\"\")&IF(AND(S409=\"février\"),\"فبراير\",\"\")&IF(AND(S409=\"mars\"),\"مارس\",\"\")&IF(AND(S409=\"avril\"),\"أفريل\",\"\")&IF(AND(S409=\"mai\"),\"ماي\",\"\")&IF(AND(S409=\"septembre\"),\"سبتمبر\",\"\")&IF(AND(S409=\"octobre\"),\"أكتوبر\",\"\")&IF(AND(S409=\"novembre\"),\"نوفمبر\",\"\")&IF(AND(S409=\"décembre\"),\"ديسمبر\",\"\")","v":"أكتوبر"}]
[]
[]
[]
[]
[]
[]
[]
[]
[]
[]
[]
[]
[]
[]
[]
[]
[]
[]
[]
[]
[]
[]
[]
[]
[]
[]
[]
[]
[]
[]
[]
[]
[]
[]
[]
[]
[]
[]
[]
[]
[]
[]
[]
[]
[]
[]
[]
[]
[]
[]
[null,null,null,null,null,null,null,null,{"$f":"I409+1","v":"2019-10-24"},null,null,null,null,null,null,null,null,null,{"$f":"CHOOSE(MONTH(I460),\"janvier\",\"février\",\"mars\",\"avril\",\"mai\",\"juin\",\"juillet\",\"aout\",\"septembre\",\"octobre\",\"novembre\",\"décembre\")","v":"octobre"},{"$f":"IF(AND(S460=\"janvier\"),\"يناير\",\"\")&IF(AND(S460=\"février\"),\"فبراير\",\"\")&IF(AND(S460=\"mars\"),\"مارس\",\"\")&IF(AND(S460=\"avril\"),\"أفريل\",\"\")&IF(AND(S460=\"mai\"),\"ماي\",\"\")&IF(AND(S460=\"septembre\"),\"سبتمبر\",\"\")&IF(AND(S460=\"octobre\"),\"أكتوبر\",\"\")&IF(AND(S460=\"novembre\"),\"نوفمبر\",\"\")&IF(AND(S460=\"décembre\"),\"ديسمبر\",\"\")","v":"أكتوبر"}]
[]
[]
[]
[]
[]
[]
[]
[]
[]
[]
[]
[]
[]
[]
[]
[]
[]
[]
[]
[]
[]
[]
[]
[]
[]
[]
[]
[]
[]
[]
[]
[]
[]
[]
[]
[]
[]
[]
[]
[]
[]
[]
[]
[]
[]
[]
[]
[]
[]
[]
[null,null,null,null,null,null,null,null,{"$f":"I460+3","v":"2019-10-27"},null,null,null,null,null,null,null,null,null,{"$f":"CHOOSE(MONTH(I511),\"janvier\",\"février\",\"mars\",\"avril\",\"mai\",\"juin\",\"juillet\",\"aout\",\"septembre\",\"octobre\",\"novembre\",\"décembre\")","v":"octobre"},{"$f":"IF(AND(S511=\"janvier\"),\"يناير\",\"\")&IF(AND(S511=\"février\"),\"فبراير\",\"\")&IF(AND(S511=\"mars\"),\"مارس\",\"\")&IF(AND(S511=\"avril\"),\"أفريل\",\"\")&IF(AND(S511=\"mai\"),\"ماي\",\"\")&IF(AND(S511=\"septembre\"),\"سبتمبر\",\"\")&IF(AND(S511=\"octobre\"),\"أكتوبر\",\"\")&IF(AND(S511=\"novembre\"),\"نوفمبر\",\"\")&IF(AND(S511=\"décembre\"),\"ديسمبر\",\"\")","v":"أكتوبر"}]
[]
[]
[]
[]
[]
[]
[]
[]
[]
[]
[]
[]
[]
[]
[]
[]
[]
[]
[]
[]
[]
[]
[]
[]
[]
[]
[]
[]
[]
[]
[]
[]
[]
[]
[]
[]
[]
[]
[]
[]
[]
[]
[]
[]
[]
[]
[]
[]
[]
[]
[null,null,null,null,null,null,null,null,{"$f":"I511+1","v":"2019-10-28"},null,null,null,null,null,null,null,null,null,{"$f":"CHOOSE(MONTH(I562),\"janvier\",\"février\",\"mars\",\"avril\",\"mai\",\"juin\",\"juillet\",\"aout\",\"septembre\",\"octobre\",\"novembre\",\"décembre\")","v":"octobre"},{"$f":"IF(AND(S562=\"janvier\"),\"يناير\",\"\")&IF(AND(S562=\"février\"),\"فبراير\",\"\")&IF(AND(S562=\"mars\"),\"مارس\",\"\")&IF(AND(S562=\"avril\"),\"أفريل\",\"\")&IF(AND(S562=\"mai\"),\"ماي\",\"\")&IF(AND(S562=\"septembre\"),\"سبتمبر\",\"\")&IF(AND(S562=\"octobre\"),\"أكتوبر\",\"\")&IF(AND(S562=\"novembre\"),\"نوفمبر\",\"\")&IF(AND(S562=\"décembre\"),\"ديسمبر\",\"\")","v":"أكتوبر"}]
[]
[]
[]
[]
[]
[]
[]
[]
[]
[]
[]
[]
[]
[]
[]
[]
[]
[]
[]
[]
[]
[]
[]
[]
[]
[]
[]
[]
[]
[]
[]
[]
[]
[]
[]
[]
[]
[]
[]
[]
[]
[]
[]
[]
[]
[]
[]
[]
[]
[]
[null,null,null,null,null,null,null,null,{"$f":"I562+1","v":"2019-10-29"},null,null,null,null,null,null,null,null,null,{"$f":"CHOOSE(MONTH(I613),\"janvier\",\"février\",\"mars\",\"avril\",\"mai\",\"juin\",\"juillet\",\"aout\",\"septembre\",\"octobre\",\"novembre\",\"décembre\")","v":"octobre"},{"$f":"IF(AND(S613=\"janvier\"),\"يناير\",\"\")&IF(AND(S613=\"février\"),\"فبراير\",\"\")&IF(AND(S613=\"mars\"),\"مارس\",\"\")&IF(AND(S613=\"avril\"),\"أفريل\",\"\")&IF(AND(S613=\"mai\"),\"ماي\",\"\")&IF(AND(S613=\"septembre\"),\"سبتمبر\",\"\")&IF(AND(S613=\"octobre\"),\"أكتوبر\",\"\")&IF(AND(S613=\"novembre\"),\"نوفمبر\",\"\")&IF(AND(S613=\"décembre\"),\"ديسمبر\",\"\")","v":"أكتوبر"}]
[]
[]
[]
[]
[]
[]
[]
[]
[]
[]
[]
[]
[]
[]
[]
[]
[]
[]
[]
[]
[]
[]
[]
[]
[]
[]
[]
[]
[]
[]
[]
[]
[]
[]
[]
[]
[]
[]
[]
[]
[]
[]
[]
[]
[]
[]
[]
[]
[]
[]
[null,null,null,null,null,null,null,null,{"$f":"I613+1","v":"2019-10-30"},null,null,null,null,null,null,null,null,null,{"$f":"CHOOSE(MONTH(I664),\"janvier\",\"février\",\"mars\",\"avril\",\"mai\",\"juin\",\"juillet\",\"aout\",\"septembre\",\"octobre\",\"novembre\",\"décembre\")","v":"octobre"},{"$f":"IF(AND(S664=\"janvier\"),\"يناير\",\"\")&IF(AND(S664=\"février\"),\"فبراير\",\"\")&IF(AND(S664=\"mars\"),\"مارس\",\"\")&IF(AND(S664=\"avril\"),\"أفريل\",\"\")&IF(AND(S664=\"mai\"),\"ماي\",\"\")&IF(AND(S664=\"septembre\"),\"سبتمبر\",\"\")&IF(AND(S664=\"octobre\"),\"أكتوبر\",\"\")&IF(AND(S664=\"novembre\"),\"نوفمبر\",\"\")&IF(AND(S664=\"décembre\"),\"ديسمبر\",\"\")","v":"أكتوبر"}]
[]
[]
[]
[]
[]
[]
[]
[]
[]
[]
[]
[]
[]
[]
[]
[]
[]
[]
[]
[]
[]
[]
[]
[]
[]
[]
[]
[]
[]
[]
[]
[]
[]
[]
[]
[]
[]
[]
[]
[]
[]
[]
[]
[]
[]
[]
[]
[]
[]
[]
[null,null,null,null,null,null,null,null,{"$f":"I664+1","v":"2019-10-31"},null,null,null,null,null,null,null,null,null,{"$f":"CHOOSE(MONTH(I715),\"janvier\",\"février\",\"mars\",\"avril\",\"mai\",\"juin\",\"juillet\",\"aout\",\"septembre\",\"octobre\",\"novembre\",\"décembre\")","v":"octobre"},{"$f":"IF(AND(S715=\"janvier\"),\"يناير\",\"\")&IF(AND(S715=\"février\"),\"فبراير\",\"\")&IF(AND(S715=\"mars\"),\"مارس\",\"\")&IF(AND(S715=\"avril\"),\"أفريل\",\"\")&IF(AND(S715=\"mai\"),\"ماي\",\"\")&IF(AND(S715=\"septembre\"),\"سبتمبر\",\"\")&IF(AND(S715=\"octobre\"),\"أكتوبر\",\"\")&IF(AND(S715=\"novembre\"),\"نوفمبر\",\"\")&IF(AND(S715=\"décembre\"),\"ديسمبر\",\"\")","v":"أكتوبر"}]
[]
[]
[]
[]
[]
[]
[]
[]
[]
[]
[]
[]
[]
[]
[]
[]
[]
[]
[]
[]
[]
[]
[]
[]
[]
[]
[]
[]
[]
[]
[]
[]
[]
[]
[]
[]
[]
[]
[]
[]
[]
[]
[]
[]
[]
[]
[]
[]
[]
[]
[null,null,null,null,null,null,null,null,{"$f":"I715+3","v":"2019-11-03"},null,null,null,null,null,null,null,null,null,{"$f":"CHOOSE(MONTH(I766),\"janvier\",\"février\",\"mars\",\"avril\",\"mai\",\"juin\",\"juillet\",\"aout\",\"septembre\",\"octobre\",\"novembre\",\"décembre\")","v":"novembre"},{"$f":"IF(AND(S766=\"janvier\"),\"يناير\",\"\")&IF(AND(S766=\"février\"),\"فبراير\",\"\")&IF(AND(S766=\"mars\"),\"مارس\",\"\")&IF(AND(S766=\"avril\"),\"أفريل\",\"\")&IF(AND(S766=\"mai\"),\"ماي\",\"\")&IF(AND(S766=\"septembre\"),\"سبتمبر\",\"\")&IF(AND(S766=\"octobre\"),\"أكتوبر\",\"\")&IF(AND(S766=\"novembre\"),\"نوفمبر\",\"\")&IF(AND(S766=\"décembre\"),\"ديسمبر\",\"\")","v":"نوفمبر"}]
[]
[]
[]
[]
[]
[]
[]
[]
[]
[]
[]
[]
[]
[]
[]
[]
[]
[]
[]
[]
[]
[]
[]
[]
[]
[]
[]
[]
[]
[]
[]
[]
[]
[]
[]
[]
[]
[]
[]
[]
[]
[]
[]
[]
[]
[]
[]
[]
[]
[]
[null,null,null,null,null,null,null,null,{"$f":"I766+1","v":"2019-11-04"},null,null,null,null,null,null,null,null,null,{"$f":"CHOOSE(MONTH(I817),\"janvier\",\"février\",\"mars\",\"avril\",\"mai\",\"juin\",\"juillet\",\"aout\",\"septembre\",\"octobre\",\"novembre\",\"décembre\")","v":"novembre"},{"$f":"IF(AND(S817=\"janvier\"),\"يناير\",\"\")&IF(AND(S817=\"février\"),\"فبراير\",\"\")&IF(AND(S817=\"mars\"),\"مارس\",\"\")&IF(AND(S817=\"avril\"),\"أفريل\",\"\")&IF(AND(S817=\"mai\"),\"ماي\",\"\")&IF(AND(S817=\"septembre\"),\"سبتمبر\",\"\")&IF(AND(S817=\"octobre\"),\"أكتوبر\",\"\")&IF(AND(S817=\"novembre\"),\"نوفمبر\",\"\")&IF(AND(S817=\"décembre\"),\"ديسمبر\",\"\")","v":"نوفمبر"}]
[]
[]
[]
[]
[]
[]
[]
[]
[]
[]
[]
[]
[]
[]
[]
[]
[]
[]
[]
[]
[]
[]
[]
[]
[]
[]
[]
[]
[]
[]
[]
[]
[]
[]
[]
[]
[]
[]
[]
[]
[]
[]
[]
[]
[]
[]
[]
[]
[]
[]
[null,null,null,null,null,null,null,null,{"$f":"I817+1","v":"2019-11-05"},null,null,null,null,null,null,null,null,null,{"$f":"CHOOSE(MONTH(I868),\"janvier\",\"février\",\"mars\",\"avril\",\"mai\",\"juin\",\"juillet\",\"aout\",\"septembre\",\"octobre\",\"novembre\",\"décembre\")","v":"novembre"},{"$f":"IF(AND(S868=\"janvier\"),\"يناير\",\"\")&IF(AND(S868=\"février\"),\"فبراير\",\"\")&IF(AND(S868=\"mars\"),\"مارس\",\"\")&IF(AND(S868=\"avril\"),\"أفريل\",\"\")&IF(AND(S868=\"mai\"),\"ماي\",\"\")&IF(AND(S868=\"septembre\"),\"سبتمبر\",\"\")&IF(AND(S868=\"octobre\"),\"أكتوبر\",\"\")&IF(AND(S868=\"novembre\"),\"نوفمبر\",\"\")&IF(AND(S868=\"décembre\"),\"ديسمبر\",\"\")","v":"نوفمبر"}]
[]
[]
[]
[]
[]
[]
[]
[]
[]
[]
[]
[]
[]
[]
[]
[]
[]
[]
[]
[]
[]
[]
[]
[]
[]
[]
[]
[]
[]
[]
[]
[]
[]
[]
[]
[]
[]
[]
[]
[]
[]
[]
[]
[]
[]
[]
[]
[]
[]
[]
[null,null,null,null,null,null,null,null,{"$f":"I868+1","v":"2019-11-06"},null,null,null,null,null,null,null,null,null,{"$f":"CHOOSE(MONTH(I919),\"janvier\",\"février\",\"mars\",\"avril\",\"mai\",\"juin\",\"juillet\",\"aout\",\"septembre\",\"octobre\",\"novembre\",\"décembre\")","v":"novembre"},{"$f":"IF(AND(S919=\"janvier\"),\"يناير\",\"\")&IF(AND(S919=\"février\"),\"فبراير\",\"\")&IF(AND(S919=\"mars\"),\"مارس\",\"\")&IF(AND(S919=\"avril\"),\"أفريل\",\"\")&IF(AND(S919=\"mai\"),\"ماي\",\"\")&IF(AND(S919=\"septembre\"),\"سبتمبر\",\"\")&IF(AND(S919=\"octobre\"),\"أكتوبر\",\"\")&IF(AND(S919=\"novembre\"),\"نوفمبر\",\"\")&IF(AND(S919=\"décembre\"),\"ديسمبر\",\"\")","v":"نوفمبر"}]
[]
[]
[]
[]
[]
[]
[]
[]
[]
[]
[]
[]
[]
[]
[]
[]
[]
[]
[]
[]
[]
[]
[]
[]
[]
[]
[]
[]
[]
[]
[]
[]
[]
[]
[]
[]
[]
[]
[]
[]
[]
[]
[]
[]
[]
[]
[]
[]
[]
[]
[null,null,null,null,null,null,null,null,{"$f":"I919+1","v":"2019-11-07"},null,null,null,null,null,null,null,null,null,{"$f":"CHOOSE(MONTH(I970),\"janvier\",\"février\",\"mars\",\"avril\",\"mai\",\"juin\",\"juillet\",\"aout\",\"septembre\",\"octobre\",\"novembre\",\"décembre\")","v":"novembre"},{"$f":"IF(AND(S970=\"janvier\"),\"يناير\",\"\")&IF(AND(S970=\"février\"),\"فبراير\",\"\")&IF(AND(S970=\"mars\"),\"مارس\",\"\")&IF(AND(S970=\"avril\"),\"أفريل\",\"\")&IF(AND(S970=\"mai\"),\"ماي\",\"\")&IF(AND(S970=\"septembre\"),\"سبتمبر\",\"\")&IF(AND(S970=\"octobre\"),\"أكتوبر\",\"\")&IF(AND(S970=\"novembre\"),\"نوفمبر\",\"\")&IF(AND(S970=\"décembre\"),\"ديسمبر\",\"\")","v":"نوفمبر"}]

{"sheet":"novembre","index":4,"n_rows":970,"n_cols":21,"rows_kept":970,"cut":false,"hidden":false,"merged":[]}
[null,null,null,null,null,null,null,null,{"$f":"octobre!I919+4","v":"2019-11-10"},null,null,null,null,null,null,null,null,null,{"$f":"CHOOSE(MONTH(I1),\"janvier\",\"février\",\"mars\",\"avril\",\"mai\",\"juin\",\"juillet\",\"aout\",\"septembre\",\"octobre\",\"novembre\",\"décembre\")","v":"novembre"},{"$f":"IF(AND(S1=\"janvier\"),\"يناير\",\"\")&IF(AND(S1=\"février\"),\"فبراير\",\"\")&IF(AND(S1=\"mars\"),\"مارس\",\"\")&IF(AND(S1=\"avril\"),\"أفريل\",\"\")&IF(AND(S1=\"mai\"),\"ماي\",\"\")&IF(AND(S1=\"septembre\"),\"سبتمبر\",\"\")&IF(AND(S1=\"octobre\"),\"أكتوبر\",\"\")&IF(AND(S1=\"novembre\"),\"نوفمبر\",\"\")&IF(AND(S1=\"décembre\"),\"ديسمبر\",\"\")","v":"نوفمبر"},{"$f":"IF(AND(U2=\"janvier\"),\"يناير\",\"\")&IF(AND(U2=\"février\"),\"فبراير\",\"\")&IF(AND(U2=\"mars\"),\"مارس\",\"\")&IF(AND(U2=\"avril\"),\"سبتمبر\",\"\")&IF(AND(U2=\"septembre\"),\"سبتمبر\",\"\")&IF(AND(U2=\"octobre\"),\"أكتوبر\",\"\")&IF(AND(U2=\"novembre\"),\"نوفمبر\",\"\")&IF(AND(U2=\"décembre\"),\"ديسمبر\",\"\")","v":"نوفمبر"}]
[null,null,null,null,null,null,null,null,null,null,null,null,null,null,null,null,null,null,null,null,{"$f":"RIGHT(CELL(\"filename\",A1),LEN(CELL(\"filename\",A1))-SEARCH(\"]\",CELL(\"filename\",A1)))","v":"novembre"}]
[]
[]
[]
[]
[]
[]
[]
[]
[]
[]
[]
[]
[]
[]
[]
[]
[]
[]
[]
[]
[]
[]
[]
[]
[]
[]
[]
[]
[]
[]
[]
[]
[]
[]
[]
[]
[]
[]
[]
[]
[]
[]
[]
[]
[]
[]
[]
[]
[]
[null,null,null,null,null,null,null,null,{"$f":"I1+1","v":"2019-11-11"},null,null,null,null,null,null,null,null,null,{"$f":"CHOOSE(MONTH(I52),\"janvier\",\"février\",\"mars\",\"avril\",\"mai\",\"juin\",\"juillet\",\"aout\",\"septembre\",\"octobre\",\"novembre\",\"décembre\")","v":"novembre"},{"$f":"IF(AND(S52=\"janvier\"),\"يناير\",\"\")&IF(AND(S52=\"février\"),\"فبراير\",\"\")&IF(AND(S52=\"mars\"),\"مارس\",\"\")&IF(AND(S52=\"avril\"),\"أفريل\",\"\")&IF(AND(S52=\"mai\"),\"ماي\",\"\")&IF(AND(S52=\"septembre\"),\"سبتمبر\",\"\")&IF(AND(S52=\"octobre\"),\"أكتوبر\",\"\")&IF(AND(S52=\"novembre\"),\"نوفمبر\",\"\")&IF(AND(S52=\"décembre\"),\"ديسمبر\",\"\")","v":"نوفمبر"}]
[]
[]
[]
[]
[]
[]
[]
[]
[]
[]
[]
[]
[]
[]
[]
[]
[]
[]
[]
[]
[]
[]
[]
[]
[]
[]
[]
[]
[]
[]
[]
[]
[]
[]
[]
[]
[]
[]
[]
[]
[]
[]
[]
[]
[]
[]
[]
[]
[]
[]
[null,null,null,null,null,null,null,null,{"$f":"I52+1","v":"2019-11-12"},null,null,null,null,null,null,null,null,null,{"$f":"CHOOSE(MONTH(I103),\"janvier\",\"février\",\"mars\",\"avril\",\"mai\",\"juin\",\"juillet\",\"aout\",\"septembre\",\"octobre\",\"novembre\",\"décembre\")","v":"novembre"},{"$f":"IF(AND(S103=\"janvier\"),\"يناير\",\"\")&IF(AND(S103=\"février\"),\"فبراير\",\"\")&IF(AND(S103=\"mars\"),\"مارس\",\"\")&IF(AND(S103=\"avril\"),\"أفريل\",\"\")&IF(AND(S103=\"mai\"),\"ماي\",\"\")&IF(AND(S103=\"septembre\"),\"سبتمبر\",\"\")&IF(AND(S103=\"octobre\"),\"أكتوبر\",\"\")&IF(AND(S103=\"novembre\"),\"نوفمبر\",\"\")&IF(AND(S103=\"décembre\"),\"ديسمبر\",\"\")","v":"نوفمبر"}]
[]
[]
[]
[]
[]
[]
[]
[]
[]
[]
[]
[]
[]
[]
[]
[]
[]
[]
[]
[]
[]
[]
[]
[]
[]
[]
[]
[]
[]
[]
[]
[]
[]
[]
[]
[]
[]
[]
[]
[]
[]
[]
[]
[]
[]
[]
[]
[]
[]
[]
[null,null,null,null,null,null,null,null,{"$f":"I103+1","v":"2019-11-13"},null,null,null,null,null,null,null,null,null,{"$f":"CHOOSE(MONTH(I154),\"janvier\",\"février\",\"mars\",\"avril\",\"mai\",\"juin\",\"juillet\",\"aout\",\"septembre\",\"octobre\",\"novembre\",\"décembre\")","v":"novembre"},{"$f":"IF(AND(S154=\"janvier\"),\"يناير\",\"\")&IF(AND(S154=\"février\"),\"فبراير\",\"\")&IF(AND(S154=\"mars\"),\"مارس\",\"\")&IF(AND(S154=\"avril\"),\"أفريل\",\"\")&IF(AND(S154=\"mai\"),\"ماي\",\"\")&IF(AND(S154=\"septembre\"),\"سبتمبر\",\"\")&IF(AND(S154=\"octobre\"),\"أكتوبر\",\"\")&IF(AND(S154=\"novembre\"),\"نوفمبر\",\"\")&IF(AND(S154=\"décembre\"),\"ديسمبر\",\"\")","v":"نوفمبر"}]
[]
[]
[]
[]
[]
[]
[]
[]
[]
[]
[]
[]
[]
[]
[]
[]
[]
[]
[]
[]
[]
[]
[]
[]
[]
[]
[]
[]
[]
[]
[]
[]
[]
[]
[]
[]
[]
[]
[]
[]
[]
[]
[]
[]
[]
[]
[]
[]
[]
[]
[null,null,null,null,null,null,null,null,{"$f":"I154+1","v":"2019-11-14"},null,null,null,null,null,null,null,null,null,{"$f":"CHOOSE(MONTH(I205),\"janvier\",\"février\",\"mars\",\"avril\",\"mai\",\"juin\",\"juillet\",\"aout\",\"septembre\",\"octobre\",\"novembre\",\"décembre\")","v":"novembre"},{"$f":"IF(AND(S205=\"janvier\"),\"يناير\",\"\")&IF(AND(S205=\"février\"),\"فبراير\",\"\")&IF(AND(S205=\"mars\"),\"مارس\",\"\")&IF(AND(S205=\"avril\"),\"أفريل\",\"\")&IF(AND(S205=\"mai\"),\"ماي\",\"\")&IF(AND(S205=\"septembre\"),\"سبتمبر\",\"\")&IF(AND(S205=\"octobre\"),\"أكتوبر\",\"\")&IF(AND(S205=\"novembre\"),\"نوفمبر\",\"\")&IF(AND(S205=\"décembre\"),\"ديسمبر\",\"\")","v":"نوفمبر"}]
[]
[]
[]
[]
[]
[]
[]
[]
[]
[]
[]
[]
[]
[]
[]
[]
[]
[]
[]
[]
[]
[]
[]
[]
[]
[]
[]
[]
[]
[]
[]
[]
[]
[]
[]
[]
[]
[]
[]
[]
[]
[]
[]
[]
[]
[]
[]
[]
[]
[]
[null,null,null,null,null,null,null,null,{"$f":"I205+3","v":"2019-11-17"},null,null,null,null,null,null,null,null,null,{"$f":"CHOOSE(MONTH(I256),\"janvier\",\"février\",\"mars\",\"avril\",\"mai\",\"juin\",\"juillet\",\"aout\",\"septembre\",\"octobre\",\"novembre\",\"décembre\")","v":"novembre"},{"$f":"IF(AND(S256=\"janvier\"),\"يناير\",\"\")&IF(AND(S256=\"février\"),\"فبراير\",\"\")&IF(AND(S256=\"mars\"),\"مارس\",\"\")&IF(AND(S256=\"avril\"),\"أفريل\",\"\")&IF(AND(S256=\"mai\"),\"ماي\",\"\")&IF(AND(S256=\"septembre\"),\"سبتمبر\",\"\")&IF(AND(S256=\"octobre\"),\"أكتوبر\",\"\")&IF(AND(S256=\"novembre\"),\"نوفمبر\",\"\")&IF(AND(S256=\"décembre\"),\"ديسمبر\",\"\")","v":"نوفمبر"}]
[]
[]
[]
[]
[]
[]
[]
[]
[]
[]
[]
[]
[]
[]
[]
[]
[]
[]
[]
[]
[]
[]
[]
[]
[]
[]
[]
[]
[]
[]
[]
[]
[]
[]
[]
[]
[]
[]
[]
[]
[]
[]
[]
[]
[]
[]
[]
[]
[]
[]
[null,null,null,null,null,null,null,null,{"$f":"I256+1","v":"2019-11-18"},null,null,null,null,null,null,null,null,null,{"$f":"CHOOSE(MONTH(I307),\"janvier\",\"février\",\"mars\",\"avril\",\"mai\",\"juin\",\"juillet\",\"aout\",\"septembre\",\"octobre\",\"novembre\",\"décembre\")","v":"novembre"},{"$f":"IF(AND(S307=\"janvier\"),\"يناير\",\"\")&IF(AND(S307=\"février\"),\"فبراير\",\"\")&IF(AND(S307=\"mars\"),\"مارس\",\"\")&IF(AND(S307=\"avril\"),\"أفريل\",\"\")&IF(AND(S307=\"mai\"),\"ماي\",\"\")&IF(AND(S307=\"septembre\"),\"سبتمبر\",\"\")&IF(AND(S307=\"octobre\"),\"أكتوبر\",\"\")&IF(AND(S307=\"novembre\"),\"نوفمبر\",\"\")&IF(AND(S307=\"décembre\"),\"ديسمبر\",\"\")","v":"نوفمبر"}]
[]
[]
[]
[]
[]
[]
[]
[]
[]
[]
[]
[]
[]
[]
[]
[]
[]
[]
[]
[]
[]
[]
[]
[]
[]
[]
[]
[]
[]
[]
[]
[]
[]
[]
[]
[]
[]
[]
[]
[]
[]
[]
[]
[]
[]
[]
[]
[]
[]
[]
[null,null,null,null,null,null,null,null,{"$f":"I307+1","v":"2019-11-19"},null,null,null,null,null,null,null,null,null,{"$f":"CHOOSE(MONTH(I358),\"janvier\",\"février\",\"mars\",\"avril\",\"mai\",\"juin\",\"juillet\",\"aout\",\"septembre\",\"octobre\",\"novembre\",\"décembre\")","v":"novembre"},{"$f":"IF(AND(S358=\"janvier\"),\"يناير\",\"\")&IF(AND(S358=\"février\"),\"فبراير\",\"\")&IF(AND(S358=\"mars\"),\"مارس\",\"\")&IF(AND(S358=\"avril\"),\"أفريل\",\"\")&IF(AND(S358=\"mai\"),\"ماي\",\"\")&IF(AND(S358=\"septembre\"),\"سبتمبر\",\"\")&IF(AND(S358=\"octobre\"),\"أكتوبر\",\"\")&IF(AND(S358=\"novembre\"),\"نوفمبر\",\"\")&IF(AND(S358=\"décembre\"),\"ديسمبر\",\"\")","v":"نوفمبر"}]
[]
[]
[]
[]
[]
[]
[]
[]
[]
[]
[]
[]
[]
[]
[]
[]
[]
[]
[]
[]
[]
[]
[]
[]
[]
[]
[]
[]
[]
[]
[]
[]
[]
[]
[]
[]
[]
[]
[]
[]
[]
[]
[]
[]
[]
[]
[]
[]
[]
[]
[null,null,null,null,null,null,null,null,{"$f":"I358+1","v":"2019-11-20"},null,null,null,null,null,null,null,null,null,{"$f":"CHOOSE(MONTH(I409),\"janvier\",\"février\",\"mars\",\"avril\",\"mai\",\"juin\",\"juillet\",\"aout\",\"septembre\",\"octobre\",\"novembre\",\"décembre\")","v":"novembre"},{"$f":"IF(AND(S409=\"janvier\"),\"يناير\",\"\")&IF(AND(S409=\"février\"),\"فبراير\",\"\")&IF(AND(S409=\"mars\"),\"مارس\",\"\")&IF(AND(S409=\"avril\"),\"أفريل\",\"\")&IF(AND(S409=\"mai\"),\"ماي\",\"\")&IF(AND(S409=\"septembre\"),\"سبتمبر\",\"\")&IF(AND(S409=\"octobre\"),\"أكتوبر\",\"\")&IF(AND(S409=\"novembre\"),\"نوفمبر\",\"\")&IF(AND(S409=\"décembre\"),\"ديسمبر\",\"\")","v":"نوفمبر"}]
[]
[]
[]
[]
[]
[]
[]
[]
[]
[]
[]
[]
[]
[]
[]
[]
[]
[]
[]
[]
[]
[]
[]
[]
[]
[]
[]
[]
[]
[]
[]
[]
[]
[]
[]
[]
[]
[]
[]
[]
[]
[]
[]
[]
[]
[]
[]
[]
[]
[]
[null,null,null,null,null,null,null,null,{"$f":"I409+1","v":"2019-11-21"},null,null,null,null,null,null,null,null,null,{"$f":"CHOOSE(MONTH(I460),\"janvier\",\"février\",\"mars\",\"avril\",\"mai\",\"juin\",\"juillet\",\"aout\",\"septembre\",\"octobre\",\"novembre\",\"décembre\")","v":"novembre"},{"$f":"IF(AND(S460=\"janvier\"),\"يناير\",\"\")&IF(AND(S460=\"février\"),\"فبراير\",\"\")&IF(AND(S460=\"mars\"),\"مارس\",\"\")&IF(AND(S460=\"avril\"),\"أفريل\",\"\")&IF(AND(S460=\"mai\"),\"ماي\",\"\")&IF(AND(S460=\"septembre\"),\"سبتمبر\",\"\")&IF(AND(S460=\"octobre\"),\"أكتوبر\",\"\")&IF(AND(S460=\"novembre\"),\"نوفمبر\",\"\")&IF(AND(S460=\"décembre\"),\"ديسمبر\",\"\")","v":"نوفمبر"}]
[]
[]
[]
[]
[]
[]
[]
[]
[]
[]
[]
[]
[]
[]
[]
[]
[]
[]
[]
[]
[]
[]
[]
[]
[]
[]
[]
[]
[]
[]
[]
[]
[]
[]
[]
[]
[]
[]
[]
[]
[]
[]
[]
[]
[]
[]
[]
[]
[]
[]
[null,null,null,null,null,null,null,null,{"$f":"I460+3","v":"2019-11-24"},null,null,null,null,null,null,null,null,null,{"$f":"CHOOSE(MONTH(I511),\"janvier\",\"février\",\"mars\",\"avril\",\"mai\",\"juin\",\"juillet\",\"aout\",\"septembre\",\"octobre\",\"novembre\",\"décembre\")","v":"novembre"},{"$f":"IF(AND(S511=\"janvier\"),\"يناير\",\"\")&IF(AND(S511=\"février\"),\"فبراير\",\"\")&IF(AND(S511=\"mars\"),\"مارس\",\"\")&IF(AND(S511=\"avril\"),\"أفريل\",\"\")&IF(AND(S511=\"mai\"),\"ماي\",\"\")&IF(AND(S511=\"septembre\"),\"سبتمبر\",\"\")&IF(AND(S511=\"octobre\"),\"أكتوبر\",\"\")&IF(AND(S511=\"novembre\"),\"نوفمبر\",\"\")&IF(AND(S511=\"décembre\"),\"ديسمبر\",\"\")","v":"نوفمبر"}]
[]
[]
[]
[]
[]
[]
[]
[]
[]
[]
[]
[]
[]
[]
[]
[]
[]
[]
[]
[]
[]
[]
[]
[]
[]
[]
[]
[]
[]
[]
[]
[]
[]
[]
[]
[]
[]
[]
[]
[]
[]
[]
[]
[]
[]
[]
[]
[]
[]
[]
[null,null,null,null,null,null,null,null,{"$f":"I511+1","v":"2019-11-25"},null,null,null,null,null,null,null,null,null,{"$f":"CHOOSE(MONTH(I562),\"janvier\",\"février\",\"mars\",\"avril\",\"mai\",\"juin\",\"juillet\",\"aout\",\"septembre\",\"octobre\",\"novembre\",\"décembre\")","v":"novembre"},{"$f":"IF(AND(S562=\"janvier\"),\"يناير\",\"\")&IF(AND(S562=\"février\"),\"فبراير\",\"\")&IF(AND(S562=\"mars\"),\"مارس\",\"\")&IF(AND(S562=\"avril\"),\"أفريل\",\"\")&IF(AND(S562=\"mai\"),\"ماي\",\"\")&IF(AND(S562=\"septembre\"),\"سبتمبر\",\"\")&IF(AND(S562=\"octobre\"),\"أكتوبر\",\"\")&IF(AND(S562=\"novembre\"),\"نوفمبر\",\"\")&IF(AND(S562=\"décembre\"),\"ديسمبر\",\"\")","v":"نوفمبر"}]
[]
[]
[]
[]
[]
[]
[]
[]
[]
[]
[]
[]
[]
[]
[]
[]
[]
[]
[]
[]
[]
[]
[]
[]
[]
[]
[]
[]
[]
[]
[]
[]
[]
[]
[]
[]
[]
[]
[]
[]
[]
[]
[]
[]
[]
[]
[]
[]
[]
[]
[null,null,null,null,null,null,null,null,{"$f":"I562+1","v":"2019-11-26"},null,null,null,null,null,null,null,null,null,{"$f":"CHOOSE(MONTH(I613),\"janvier\",\"février\",\"mars\",\"avril\",\"mai\",\"juin\",\"juillet\",\"aout\",\"septembre\",\"octobre\",\"novembre\",\"décembre\")","v":"novembre"},{"$f":"IF(AND(S613=\"janvier\"),\"يناير\",\"\")&IF(AND(S613=\"février\"),\"فبراير\",\"\")&IF(AND(S613=\"mars\"),\"مارس\",\"\")&IF(AND(S613=\"avril\"),\"أفريل\",\"\")&IF(AND(S613=\"mai\"),\"ماي\",\"\")&IF(AND(S613=\"septembre\"),\"سبتمبر\",\"\")&IF(AND(S613=\"octobre\"),\"أكتوبر\",\"\")&IF(AND(S613=\"novembre\"),\"نوفمبر\",\"\")&IF(AND(S613=\"décembre\"),\"ديسمبر\",\"\")","v":"نوفمبر"}]
[]
[]
[]
[]
[]
[]
[]
[]
[]
[]
[]
[]
[]
[]
[]
[]
[]
[]
[]
[]
[]
[]
[]
[]
[]
[]
[]
[]
[]
[]
[]
[]
[]
[]
[]
[]
[]
[]
[]
[]
[]
[]
[]
[]
[]
[]
[]
[]
[]
[]
[null,null,null,null,null,null,null,null,{"$f":"I613+1","v":"2019-11-27"},null,null,null,null,null,null,null,null,null,{"$f":"CHOOSE(MONTH(I664),\"janvier\",\"février\",\"mars\",\"avril\",\"mai\",\"juin\",\"juillet\",\"aout\",\"septembre\",\"octobre\",\"novembre\",\"décembre\")","v":"novembre"},{"$f":"IF(AND(S664=\"janvier\"),\"يناير\",\"\")&IF(AND(S664=\"février\"),\"فبراير\",\"\")&IF(AND(S664=\"mars\"),\"مارس\",\"\")&IF(AND(S664=\"avril\"),\"أفريل\",\"\")&IF(AND(S664=\"mai\"),\"ماي\",\"\")&IF(AND(S664=\"septembre\"),\"سبتمبر\",\"\")&IF(AND(S664=\"octobre\"),\"أكتوبر\",\"\")&IF(AND(S664=\"novembre\"),\"نوفمبر\",\"\")&IF(AND(S664=\"décembre\"),\"ديسمبر\",\"\")","v":"نوفمبر"}]
[]
[]
[]
[]
[]
[]
[]
[]
[]
[]
[]
[]
[]
[]
[]
[]
[]
[]
[]
[]
[]
[]
[]
[]
[]
[]
[]
[]
[]
[]
[]
[]
[]
[]
[]
[]
[]
[]
[]
[]
[]
[]
[]
[]
[]
[]
[]
[]
[]
[]
[null,null,null,null,null,null,null,null,{"$f":"I664+1","v":"2019-11-28"},null,null,null,null,null,null,null,null,null,{"$f":"CHOOSE(MONTH(I715),\"janvier\",\"février\",\"mars\",\"avril\",\"mai\",\"juin\",\"juillet\",\"aout\",\"septembre\",\"octobre\",\"novembre\",\"décembre\")","v":"novembre"},{"$f":"IF(AND(S715=\"janvier\"),\"يناير\",\"\")&IF(AND(S715=\"février\"),\"فبراير\",\"\")&IF(AND(S715=\"mars\"),\"مارس\",\"\")&IF(AND(S715=\"avril\"),\"أفريل\",\"\")&IF(AND(S715=\"mai\"),\"ماي\",\"\")&IF(AND(S715=\"septembre\"),\"سبتمبر\",\"\")&IF(AND(S715=\"octobre\"),\"أكتوبر\",\"\")&IF(AND(S715=\"novembre\"),\"نوفمبر\",\"\")&IF(AND(S715=\"décembre\"),\"ديسمبر\",\"\")","v":"نوفمبر"}]
[]
[]
[]
[]
[]
[]
[]
[]
[]
[]
[]
[]
[]
[]
[]
[]
[]
[]
[]
[]
[]
[]
[]
[]
[]
[]
[]
[]
[]
[]
[]
[]
[]
[]
[]
[]
[]
[]
[]
[]
[]
[]
[]
[]
[]
[]
[]
[]
[]
[]
[null,null,null,null,null,null,null,null,{"$f":"I715+3","v":"2019-12-01"},null,null,null,null,null,null,null,null,null,{"$f":"CHOOSE(MONTH(I766),\"janvier\",\"février\",\"mars\",\"avril\",\"mai\",\"juin\",\"juillet\",\"aout\",\"septembre\",\"octobre\",\"novembre\",\"décembre\")","v":"décembre"},{"$f":"IF(AND(S766=\"janvier\"),\"يناير\",\"\")&IF(AND(S766=\"février\"),\"فبراير\",\"\")&IF(AND(S766=\"mars\"),\"مارس\",\"\")&IF(AND(S766=\"avril\"),\"أفريل\",\"\")&IF(AND(S766=\"mai\"),\"ماي\",\"\")&IF(AND(S766=\"septembre\"),\"سبتمبر\",\"\")&IF(AND(S766=\"octobre\"),\"أكتوبر\",\"\")&IF(AND(S766=\"novembre\"),\"نوفمبر\",\"\")&IF(AND(S766=\"décembre\"),\"ديسمبر\",\"\")","v":"ديسمبر"}]
[]
[]
[]
[]
[]
[]
[]
[]
[]
[]
[]
[]
[]
[]
[]
[]
[]
[]
[]
[]
[]
[]
[]
[]
[]
[]
[]
[]
[]
[]
[]
[]
[]
[]
[]
[]
[]
[]
[]
[]
[]
[]
[]
[]
[]
[]
[]
[]
[]
[]
[null,null,null,null,null,null,null,null,{"$f":"I766+1","v":"2019-12-02"},null,null,null,null,null,null,null,null,null,{"$f":"CHOOSE(MONTH(I817),\"janvier\",\"février\",\"mars\",\"avril\",\"mai\",\"juin\",\"juillet\",\"aout\",\"septembre\",\"octobre\",\"novembre\",\"décembre\")","v":"décembre"},{"$f":"IF(AND(S817=\"janvier\"),\"يناير\",\"\")&IF(AND(S817=\"février\"),\"فبراير\",\"\")&IF(AND(S817=\"mars\"),\"مارس\",\"\")&IF(AND(S817=\"avril\"),\"أفريل\",\"\")&IF(AND(S817=\"mai\"),\"ماي\",\"\")&IF(AND(S817=\"septembre\"),\"سبتمبر\",\"\")&IF(AND(S817=\"octobre\"),\"أكتوبر\",\"\")&IF(AND(S817=\"novembre\"),\"نوفمبر\",\"\")&IF(AND(S817=\"décembre\"),\"ديسمبر\",\"\")","v":"ديسمبر"}]
[]
[]
[]
[]
[]
[]
[]
[]
[]
[]
[]
[]
[]
[]
[]
[]
[]
[]
[]
[]
[]
[]
[]
[]
[]
[]
[]
[]
[]
[]
[]
[]
[]
[]
[]
[]
[]
[]
[]
[]
[]
[]
[]
[]
[]
[]
[]
[]
[]
[]
[null,null,null,null,null,null,null,null,{"$f":"I817+1","v":"2019-12-03"},null,null,null,null,null,null,null,null,null,{"$f":"CHOOSE(MONTH(I868),\"janvier\",\"février\",\"mars\",\"avril\",\"mai\",\"juin\",\"juillet\",\"aout\",\"septembre\",\"octobre\",\"novembre\",\"décembre\")","v":"décembre"},{"$f":"IF(AND(S868=\"janvier\"),\"يناير\",\"\")&IF(AND(S868=\"février\"),\"فبراير\",\"\")&IF(AND(S868=\"mars\"),\"مارس\",\"\")&IF(AND(S868=\"avril\"),\"أفريل\",\"\")&IF(AND(S868=\"mai\"),\"ماي\",\"\")&IF(AND(S868=\"septembre\"),\"سبتمبر\",\"\")&IF(AND(S868=\"octobre\"),\"أكتوبر\",\"\")&IF(AND(S868=\"novembre\"),\"نوفمبر\",\"\")&IF(AND(S868=\"décembre\"),\"ديسمبر\",\"\")","v":"ديسمبر"}]
[]
[]
[]
[]
[]
[]
[]
[]
[]
[]
[]
[]
[]
[]
[]
[]
[]
[]
[]
[]
[]
[]
[]
[]
[]
[]
[]
[]
[]
[]
[]
[]
[]
[]
[]
[]
[]
[]
[]
[]
[]
[]
[]
[]
[]
[]
[]
[]
[]
[]
[null,null,null,null,null,null,null,null,{"$f":"I868+1","v":"2019-12-04"},null,null,null,null,null,null,null,null,null,{"$f":"CHOOSE(MONTH(I919),\"janvier\",\"février\",\"mars\",\"avril\",\"mai\",\"juin\",\"juillet\",\"aout\",\"septembre\",\"octobre\",\"novembre\",\"décembre\")","v":"décembre"},{"$f":"IF(AND(S919=\"janvier\"),\"يناير\",\"\")&IF(AND(S919=\"février\"),\"فبراير\",\"\")&IF(AND(S919=\"mars\"),\"مارس\",\"\")&IF(AND(S919=\"avril\"),\"أفريل\",\"\")&IF(AND(S919=\"mai\"),\"ماي\",\"\")&IF(AND(S919=\"septembre\"),\"سبتمبر\",\"\")&IF(AND(S919=\"octobre\"),\"أكتوبر\",\"\")&IF(AND(S919=\"novembre\"),\"نوفمبر\",\"\")&IF(AND(S919=\"décembre\"),\"ديسمبر\",\"\")","v":"ديسمبر"}]
[]
[]
[]
[]
[]
[]
[]
[]
[]
[]
[]
[]
[]
[]
[]
[]
[]
[]
[]
[]
[]
[]
[]
[]
[]
[]
[]
[]
[]
[]
[]
[]
[]
[]
[]
[]
[]
[]
[]
[]
[]
[]
[]
[]
[]
[]
[]
[]
[]
[]
[null,null,null,null,null,null,null,null,{"$f":"I919+1","v":"2019-12-05"},null,null,null,null,null,null,null,null,null,{"$f":"CHOOSE(MONTH(I970),\"janvier\",\"février\",\"mars\",\"avril\",\"mai\",\"juin\",\"juillet\",\"aout\",\"septembre\",\"octobre\",\"novembre\",\"décembre\")","v":"décembre"},{"$f":"IF(AND(S970=\"janvier\"),\"يناير\",\"\")&IF(AND(S970=\"février\"),\"فبراير\",\"\")&IF(AND(S970=\"mars\"),\"مارس\",\"\")&IF(AND(S970=\"avril\"),\"أفريل\",\"\")&IF(AND(S970=\"mai\"),\"ماي\",\"\")&IF(AND(S970=\"septembre\"),\"سبتمبر\",\"\")&IF(AND(S970=\"octobre\"),\"أكتوبر\",\"\")&IF(AND(S970=\"novembre\"),\"نوفمبر\",\"\")&IF(AND(S970=\"décembre\"),\"ديسمبر\",\"\")","v":"ديسمبر"}]

{"sheet":"décembre","index":5,"n_rows":970,"n_cols":21,"rows_kept":970,"cut":false,"hidden":false,"merged":[]}
[null,null,null,null,null,null,null,null,{"$f":"novembre!I919+4","v":"2019-12-08"},null,null,null,null,null,null,null,null,null,{"$f":"CHOOSE(MONTH(I1),\"janvier\",\"février\",\"mars\",\"avril\",\"mai\",\"juin\",\"juillet\",\"aout\",\"septembre\",\"octobre\",\"novembre\",\"décembre\")","v":"décembre"},{"$f":"IF(AND(S1=\"janvier\"),\"يناير\",\"\")&IF(AND(S1=\"février\"),\"فبراير\",\"\")&IF(AND(S1=\"mars\"),\"مارس\",\"\")&IF(AND(S1=\"avril\"),\"أفريل\",\"\")&IF(AND(S1=\"mai\"),\"ماي\",\"\")&IF(AND(S1=\"septembre\"),\"سبتمبر\",\"\")&IF(AND(S1=\"octobre\"),\"أكتوبر\",\"\")&IF(AND(S1=\"novembre\"),\"نوفمبر\",\"\")&IF(AND(S1=\"décembre\"),\"ديسمبر\",\"\")","v":"ديسمبر"},{"$f":"IF(AND(U2=\"janvier\"),\"يناير\",\"\")&IF(AND(U2=\"février\"),\"فبراير\",\"\")&IF(AND(U2=\"mars\"),\"مارس\",\"\")&IF(AND(U2=\"avril\"),\"سبتمبر\",\"\")&IF(AND(U2=\"septembre\"),\"سبتمبر\",\"\")&IF(AND(U2=\"octobre\"),\"أكتوبر\",\"\")&IF(AND(U2=\"novembre\"),\"نوفمبر\",\"\")&IF(AND(U2=\"décembre\"),\"ديسمبر\",\"\")","v":"ديسمبر"}]
[null,null,null,null,null,null,null,null,null,null,null,null,null,null,null,null,null,null,null,null,{"$f":"RIGHT(CELL(\"filename\",A1),LEN(CELL(\"filename\",A1))-SEARCH(\"]\",CELL(\"filename\",A1)))","v":"décembre"}]
[]
[]
[]
[]
[]
[]
[]
[]
[]
[]
[]
[]
[]
[]
[]
[]
[]
[]
[]
[]
[]
[]
[]
[]
[]
[]
[]
[]
[]
[]
[]
[]
[]
[]
[]
[]
[]
[]
[]
[]
[]
[]
[]
[]
[]
[]
[]
[]
[]
[null,null,null,null,null,null,null,null,{"$f":"I1+1","v":"2019-12-09"},null,null,null,null,null,null,null,null,null,{"$f":"CHOOSE(MONTH(I52),\"janvier\",\"février\",\"mars\",\"avril\",\"mai\",\"juin\",\"juillet\",\"aout\",\"septembre\",\"octobre\",\"novembre\",\"décembre\")","v":"décembre"},{"$f":"IF(AND(S52=\"janvier\"),\"يناير\",\"\")&IF(AND(S52=\"février\"),\"فبراير\",\"\")&IF(AND(S52=\"mars\"),\"مارس\",\"\")&IF(AND(S52=\"avril\"),\"أفريل\",\"\")&IF(AND(S52=\"mai\"),\"ماي\",\"\")&IF(AND(S52=\"septembre\"),\"سبتمبر\",\"\")&IF(AND(S52=\"octobre\"),\"أكتوبر\",\"\")&IF(AND(S52=\"novembre\"),\"نوفمبر\",\"\")&IF(AND(S52=\"décembre\"),\"ديسمبر\",\"\")","v":"ديسمبر"}]
[]
[]
[]
[]
[]
[]
[]
[]
[]
[]
[]
[]
[]
[]
[]
[]
[]
[]
[]
[]
[]
[]
[]
[]
[]
[]
[]
[]
[]
[]
[]
[]
[]
[]
[]
[]
[]
[]
[]
[]
[]
[]
[]
[]
[]
[]
[]
[]
[]
[]
[null,null,null,null,null,null,null,null,{"$f":"I52+1","v":"2019-12-10"},null,null,null,null,null,null,null,null,null,{"$f":"CHOOSE(MONTH(I103),\"janvier\",\"février\",\"mars\",\"avril\",\"mai\",\"juin\",\"juillet\",\"aout\",\"septembre\",\"octobre\",\"novembre\",\"décembre\")","v":"décembre"},{"$f":"IF(AND(S103=\"janvier\"),\"يناير\",\"\")&IF(AND(S103=\"février\"),\"فبراير\",\"\")&IF(AND(S103=\"mars\"),\"مارس\",\"\")&IF(AND(S103=\"avril\"),\"أفريل\",\"\")&IF(AND(S103=\"mai\"),\"ماي\",\"\")&IF(AND(S103=\"septembre\"),\"سبتمبر\",\"\")&IF(AND(S103=\"octobre\"),\"أكتوبر\",\"\")&IF(AND(S103=\"novembre\"),\"نوفمبر\",\"\")&IF(AND(S103=\"décembre\"),\"ديسمبر\",\"\")","v":"ديسمبر"}]
[]
[]
[]
[]
[]
[]
[]
[]
[]
[]
[]
[]
[]
[]
[]
[]
[]
[]
[]
[]
[]
[]
[]
[]
[]
[]
[]
[]
[]
[]
[]
[]
[]
[]
[]
[]
[]
[]
[]
[]
[]
[]
[]
[]
[]
[]
[]
[]
[]
[]
[null,null,null,null,null,null,null,null,{"$f":"I103+1","v":"2019-12-11"},null,null,null,null,null,null,null,null,null,{"$f":"CHOOSE(MONTH(I154),\"janvier\",\"février\",\"mars\",\"avril\",\"mai\",\"juin\",\"juillet\",\"aout\",\"septembre\",\"octobre\",\"novembre\",\"décembre\")","v":"décembre"},{"$f":"IF(AND(S154=\"janvier\"),\"يناير\",\"\")&IF(AND(S154=\"février\"),\"فبراير\",\"\")&IF(AND(S154=\"mars\"),\"مارس\",\"\")&IF(AND(S154=\"avril\"),\"أفريل\",\"\")&IF(AND(S154=\"mai\"),\"ماي\",\"\")&IF(AND(S154=\"septembre\"),\"سبتمبر\",\"\")&IF(AND(S154=\"octobre\"),\"أكتوبر\",\"\")&IF(AND(S154=\"novembre\"),\"نوفمبر\",\"\")&IF(AND(S154=\"décembre\"),\"ديسمبر\",\"\")","v":"ديسمبر"}]
[]
[]
[]
[]
[]
[]
[]
[]
[]
[]
[]
[]
[]
[]
[]
[]
[]
[]
[]
[]
[]
[]
[]
[]
[]
[]
[]
[]
[]
[]
[]
[]
[]
[]
[]
[]
[]
[]
[]
[]
[]
[]
[]
[]
[]
[]
[]
[]
[]
[]
[null,null,null,null,null,null,null,null,{"$f":"I154+1","v":"2019-12-12"},null,null,null,null,null,null,null,null,null,{"$f":"CHOOSE(MONTH(I205),\"janvier\",\"février\",\"mars\",\"avril\",\"mai\",\"juin\",\"juillet\",\"aout\",\"septembre\",\"octobre\",\"novembre\",\"décembre\")","v":"décembre"},{"$f":"IF(AND(S205=\"janvier\"),\"يناير\",\"\")&IF(AND(S205=\"février\"),\"فبراير\",\"\")&IF(AND(S205=\"mars\"),\"مارس\",\"\")&IF(AND(S205=\"avril\"),\"أفريل\",\"\")&IF(AND(S205=\"mai\"),\"ماي\",\"\")&IF(AND(S205=\"septembre\"),\"سبتمبر\",\"\")&IF(AND(S205=\"octobre\"),\"أكتوبر\",\"\")&IF(AND(S205=\"novembre\"),\"نوفمبر\",\"\")&IF(AND(S205=\"décembre\"),\"ديسمبر\",\"\")","v":"ديسمبر"}]
[]
[]
[]
[]
[]
[]
[]
[]
[]
[]
[]
[]
[]
[]
[]
[]
[]
[]
[]
[]
[]
[]
[]
[]
[]
[]
[]
[]
[]
[]
[]
[]
[]
[]
[]
[]
[]
[]
[]
[]
[]
[]
[]
[]
[]
[]
[]
[]
[]
[]
[null,null,null,null,null,null,null,null,{"$f":"I205+3","v":"2019-12-15"},null,null,null,null,null,null,null,null,null,{"$f":"CHOOSE(MONTH(I256),\"janvier\",\"février\",\"mars\",\"avril\",\"mai\",\"juin\",\"juillet\",\"aout\",\"septembre\",\"octobre\",\"novembre\",\"décembre\")","v":"décembre"},{"$f":"IF(AND(S256=\"janvier\"),\"يناير\",\"\")&IF(AND(S256=\"février\"),\"فبراير\",\"\")&IF(AND(S256=\"mars\"),\"مارس\",\"\")&IF(AND(S256=\"avril\"),\"أفريل\",\"\")&IF(AND(S256=\"mai\"),\"ماي\",\"\")&IF(AND(S256=\"septembre\"),\"سبتمبر\",\"\")&IF(AND(S256=\"octobre\"),\"أكتوبر\",\"\")&IF(AND(S256=\"novembre\"),\"نوفمبر\",\"\")&IF(AND(S256=\"décembre\"),\"ديسمبر\",\"\")","v":"ديسمبر"}]
[]
[]
[]
[]
[]
[]
[]
[]
[]
[]
[]
[]
[]
[]
[]
[]
[]
[]
[]
[]
[]
[]
[]
[]
[]
[]
[]
[]
[]
[]
[]
[]
[]
[]
[]
[]
[]
[]
[]
[]
[]
[]
[]
[]
[]
[]
[]
[]
[]
[]
[null,null,null,null,null,null,null,null,{"$f":"I256+1","v":"2019-12-16"},null,null,null,null,null,null,null,null,null,{"$f":"CHOOSE(MONTH(I307),\"janvier\",\"février\",\"mars\",\"avril\",\"mai\",\"juin\",\"juillet\",\"aout\",\"septembre\",\"octobre\",\"novembre\",\"décembre\")","v":"décembre"},{"$f":"IF(AND(S307=\"janvier\"),\"يناير\",\"\")&IF(AND(S307=\"février\"),\"فبراير\",\"\")&IF(AND(S307=\"mars\"),\"مارس\",\"\")&IF(AND(S307=\"avril\"),\"أفريل\",\"\")&IF(AND(S307=\"mai\"),\"ماي\",\"\")&IF(AND(S307=\"septembre\"),\"سبتمبر\",\"\")&IF(AND(S307=\"octobre\"),\"أكتوبر\",\"\")&IF(AND(S307=\"novembre\"),\"نوفمبر\",\"\")&IF(AND(S307=\"décembre\"),\"ديسمبر\",\"\")","v":"ديسمبر"}]
[]
[]
[]
[]
[]
[]
[]
[]
[]
[]
[]
[]
[]
[]
[]
[]
[]
[]
[]
[]
[]
[]
[]
[]
[]
[]
[]
[]
[]
[]
[]
[]
[]
[]
[]
[]
[]
[]
[]
[]
[]
[]
[]
[]
[]
[]
[]
[]
[]
[]
[null,null,null,null,null,null,null,null,{"$f":"I307+1","v":"2019-12-17"},null,null,null,null,null,null,null,null,null,{"$f":"CHOOSE(MONTH(I358),\"janvier\",\"février\",\"mars\",\"avril\",\"mai\",\"juin\",\"juillet\",\"aout\",\"septembre\",\"octobre\",\"novembre\",\"décembre\")","v":"décembre"},{"$f":"IF(AND(S358=\"janvier\"),\"يناير\",\"\")&IF(AND(S358=\"février\"),\"فبراير\",\"\")&IF(AND(S358=\"mars\"),\"مارس\",\"\")&IF(AND(S358=\"avril\"),\"أفريل\",\"\")&IF(AND(S358=\"mai\"),\"ماي\",\"\")&IF(AND(S358=\"septembre\"),\"سبتمبر\",\"\")&IF(AND(S358=\"octobre\"),\"أكتوبر\",\"\")&IF(AND(S358=\"novembre\"),\"نوفمبر\",\"\")&IF(AND(S358=\"décembre\"),\"ديسمبر\",\"\")","v":"ديسمبر"}]
[]
[]
[]
[]
[]
[]
[]
[]
[]
[]
[]
[]
[]
[]
[]
[]
[]
[]
[]
[]
[]
[]
[]
[]
[]
[]
[]
[]
[]
[]
[]
[]
[]
[]
[]
[]
[]
[]
[]
[]
[]
[]
[]
[]
[]
[]
[]
[]
[]
[]
[null,null,null,null,null,null,null,null,{"$f":"I358+1","v":"2019-12-18"},null,null,null,null,null,null,null,null,null,{"$f":"CHOOSE(MONTH(I409),\"janvier\",\"février\",\"mars\",\"avril\",\"mai\",\"juin\",\"juillet\",\"aout\",\"septembre\",\"octobre\",\"novembre\",\"décembre\")","v":"décembre"},{"$f":"IF(AND(S409=\"janvier\"),\"يناير\",\"\")&IF(AND(S409=\"février\"),\"فبراير\",\"\")&IF(AND(S409=\"mars\"),\"مارس\",\"\")&IF(AND(S409=\"avril\"),\"أفريل\",\"\")&IF(AND(S409=\"mai\"),\"ماي\",\"\")&IF(AND(S409=\"septembre\"),\"سبتمبر\",\"\")&IF(AND(S409=\"octobre\"),\"أكتوبر\",\"\")&IF(AND(S409=\"novembre\"),\"نوفمبر\",\"\")&IF(AND(S409=\"décembre\"),\"ديسمبر\",\"\")","v":"ديسمبر"}]
[]
[]
[]
[]
[]
[]
[]
[]
[]
[]
[]
[]
[]
[]
[]
[]
[]
[]
[]
[]
[]
[]
[]
[]
[]
[]
[]
[]
[]
[]
[]
[]
[]
[]
[]
[]
[]
[]
[]
[]
[]
[]
[]
[]
[]
[]
[]
[]
[]
[]
[null,null,null,null,null,null,null,null,{"$f":"I409+1","v":"2019-12-19"},null,null,null,null,null,null,null,null,null,{"$f":"CHOOSE(MONTH(I460),\"janvier\",\"février\",\"mars\",\"avril\",\"mai\",\"juin\",\"juillet\",\"aout\",\"septembre\",\"octobre\",\"novembre\",\"décembre\")","v":"décembre"},{"$f":"IF(AND(S460=\"janvier\"),\"يناير\",\"\")&IF(AND(S460=\"février\"),\"فبراير\",\"\")&IF(AND(S460=\"mars\"),\"مارس\",\"\")&IF(AND(S460=\"avril\"),\"أفريل\",\"\")&IF(AND(S460=\"mai\"),\"ماي\",\"\")&IF(AND(S460=\"septembre\"),\"سبتمبر\",\"\")&IF(AND(S460=\"octobre\"),\"أكتوبر\",\"\")&IF(AND(S460=\"novembre\"),\"نوفمبر\",\"\")&IF(AND(S460=\"décembre\"),\"ديسمبر\",\"\")","v":"ديسمبر"}]
[]
[]
[]
[]
[]
[]
[]
[]
[]
[]
[]
[]
[]
[]
[]
[]
[]
[]
[]
[]
[]
[]
[]
[]
[]
[]
[]
[]
[]
[]
[]
[]
[]
[]
[]
[]
[]
[]
[]
[]
[]
[]
[]
[]
[]
[]
[]
[]
[]
[]
[null,null,null,null,null,null,null,null,{"$f":"I460+3","v":"2019-12-22"},null,null,null,null,null,null,null,null,null,{"$f":"CHOOSE(MONTH(I511),\"janvier\",\"février\",\"mars\",\"avril\",\"mai\",\"juin\",\"juillet\",\"aout\",\"septembre\",\"octobre\",\"novembre\",\"décembre\")","v":"décembre"},{"$f":"IF(AND(S511=\"janvier\"),\"يناير\",\"\")&IF(AND(S511=\"février\"),\"فبراير\",\"\")&IF(AND(S511=\"mars\"),\"مارس\",\"\")&IF(AND(S511=\"avril\"),\"أفريل\",\"\")&IF(AND(S511=\"mai\"),\"ماي\",\"\")&IF(AND(S511=\"septembre\"),\"سبتمبر\",\"\")&IF(AND(S511=\"octobre\"),\"أكتوبر\",\"\")&IF(AND(S511=\"novembre\"),\"نوفمبر\",\"\")&IF(AND(S511=\"décembre\"),\"ديسمبر\",\"\")","v":"ديسمبر"}]
[]
[]
[]
[]
[]
[]
[]
[]
[]
[]
[]
[]
[]
[]
[]
[]
[]
[]
[]
[]
[]
[]
[]
[]
[]
[]
[]
[]
[]
[]
[]
[]
[]
[]
[]
[]
[]
[]
[]
[]
[]
[]
[]
[]
[]
[]
[]
[]
[]
[]
[null,null,null,null,null,null,null,null,{"$f":"I511+1","v":"2019-12-23"},null,null,null,null,null,null,null,null,null,{"$f":"CHOOSE(MONTH(I562),\"janvier\",\"février\",\"mars\",\"avril\",\"mai\",\"juin\",\"juillet\",\"aout\",\"septembre\",\"octobre\",\"novembre\",\"décembre\")","v":"décembre"},{"$f":"IF(AND(S562=\"janvier\"),\"يناير\",\"\")&IF(AND(S562=\"février\"),\"فبراير\",\"\")&IF(AND(S562=\"mars\"),\"مارس\",\"\")&IF(AND(S562=\"avril\"),\"أفريل\",\"\")&IF(AND(S562=\"mai\"),\"ماي\",\"\")&IF(AND(S562=\"septembre\"),\"سبتمبر\",\"\")&IF(AND(S562=\"octobre\"),\"أكتوبر\",\"\")&IF(AND(S562=\"novembre\"),\"نوفمبر\",\"\")&IF(AND(S562=\"décembre\"),\"ديسمبر\",\"\")","v":"ديسمبر"}]
[]
[]
[]
[]
[]
[]
[]
[]
[]
[]
[]
[]
[]
[]
[]
[]
[]
[]
[]
[]
[]
[]
[]
[]
[]
[]
[]
[]
[]
[]
[]
[]
[]
[]
[]
[]
[]
[]
[]
[]
[]
[]
[]
[]
[]
[]
[]
[]
[]
[]
[null,null,null,null,null,null,null,null,{"$f":"I562+1","v":"2019-12-24"},null,null,null,null,null,null,null,null,null,{"$f":"CHOOSE(MONTH(I613),\"janvier\",\"février\",\"mars\",\"avril\",\"mai\",\"juin\",\"juillet\",\"aout\",\"septembre\",\"octobre\",\"novembre\",\"décembre\")","v":"décembre"},{"$f":"IF(AND(S613=\"janvier\"),\"يناير\",\"\")&IF(AND(S613=\"février\"),\"فبراير\",\"\")&IF(AND(S613=\"mars\"),\"مارس\",\"\")&IF(AND(S613=\"avril\"),\"أفريل\",\"\")&IF(AND(S613=\"mai\"),\"ماي\",\"\")&IF(AND(S613=\"septembre\"),\"سبتمبر\",\"\")&IF(AND(S613=\"octobre\"),\"أكتوبر\",\"\")&IF(AND(S613=\"novembre\"),\"نوفمبر\",\"\")&IF(AND(S613=\"décembre\"),\"ديسمبر\",\"\")","v":"ديسمبر"}]
[]
[]
[]
[]
[]
[]
[]
[]
[]
[]
[]
[]
[]
[]
[]
[]
[]
[]
[]
[]
[]
[]
[]
[]
[]
[]
[]
[]
[]
[]
[]
[]
[]
[]
[]
[]
[]
[]
[]
[]
[]
[]
[]
[]
[]
[]
[]
[]
[]
[]
[null,null,null,null,null,null,null,null,{"$f":"I613+1","v":"2019-12-25"},null,null,null,null,null,null,null,null,null,{"$f":"CHOOSE(MONTH(I664),\"janvier\",\"février\",\"mars\",\"avril\",\"mai\",\"juin\",\"juillet\",\"aout\",\"septembre\",\"octobre\",\"novembre\",\"décembre\")","v":"décembre"},{"$f":"IF(AND(S664=\"janvier\"),\"يناير\",\"\")&IF(AND(S664=\"février\"),\"فبراير\",\"\")&IF(AND(S664=\"mars\"),\"مارس\",\"\")&IF(AND(S664=\"avril\"),\"أفريل\",\"\")&IF(AND(S664=\"mai\"),\"ماي\",\"\")&IF(AND(S664=\"septembre\"),\"سبتمبر\",\"\")&IF(AND(S664=\"octobre\"),\"أكتوبر\",\"\")&IF(AND(S664=\"novembre\"),\"نوفمبر\",\"\")&IF(AND(S664=\"décembre\"),\"ديسمبر\",\"\")","v":"ديسمبر"}]
[]
[]
[]
[]
[]
[]
[]
[]
[]
[]
[]
[]
[]
[]
[]
[]
[]
[]
[]
[]
[]
[]
[]
[]
[]
[]
[]
[]
[]
[]
[]
[]
[]
[]
[]
[]
[]
[]
[]
[]
[]
[]
[]
[]
[]
[]
[]
[]
[]
[]
[null,null,null,null,null,null,null,null,{"$f":"I664+1","v":"2019-12-26"},null,null,null,null,null,null,null,null,null,{"$f":"CHOOSE(MONTH(I715),\"janvier\",\"février\",\"mars\",\"avril\",\"mai\",\"juin\",\"juillet\",\"aout\",\"septembre\",\"octobre\",\"novembre\",\"décembre\")","v":"décembre"},{"$f":"IF(AND(S715=\"janvier\"),\"يناير\",\"\")&IF(AND(S715=\"février\"),\"فبراير\",\"\")&IF(AND(S715=\"mars\"),\"مارس\",\"\")&IF(AND(S715=\"avril\"),\"أفريل\",\"\")&IF(AND(S715=\"mai\"),\"ماي\",\"\")&IF(AND(S715=\"septembre\"),\"سبتمبر\",\"\")&IF(AND(S715=\"octobre\"),\"أكتوبر\",\"\")&IF(AND(S715=\"novembre\"),\"نوفمبر\",\"\")&IF(AND(S715=\"décembre\"),\"ديسمبر\",\"\")","v":"ديسمبر"}]
[]
[]
[]
[]
[]
[]
[]
[]
[]
[]
[]
[]
[]
[]
[]
[]
[]
[]
[]
[]
[]
[]
[]
[]
[]
[]
[]
[]
[]
[]
[]
[]
[]
[]
[]
[]
[]
[]
[]
[]
[]
[]
[]
[]
[]
[]
[]
[]
[]
[]
[null,null,null,null,null,null,null,null,{"$f":"I715+3","v":"2019-12-29"},null,null,null,null,null,null,null,null,null,{"$f":"CHOOSE(MONTH(I766),\"janvier\",\"février\",\"mars\",\"avril\",\"mai\",\"juin\",\"juillet\",\"aout\",\"septembre\",\"octobre\",\"novembre\",\"décembre\")","v":"décembre"},{"$f":"IF(AND(S766=\"janvier\"),\"يناير\",\"\")&IF(AND(S766=\"février\"),\"فبراير\",\"\")&IF(AND(S766=\"mars\"),\"مارس\",\"\")&IF(AND(S766=\"avril\"),\"أفريل\",\"\")&IF(AND(S766=\"mai\"),\"ماي\",\"\")&IF(AND(S766=\"septembre\"),\"سبتمبر\",\"\")&IF(AND(S766=\"octobre\"),\"أكتوبر\",\"\")&IF(AND(S766=\"novembre\"),\"نوفمبر\",\"\")&IF(AND(S766=\"décembre\"),\"ديسمبر\",\"\")","v":"ديسمبر"}]
[]
[]
[]
[]
[]
[]
[]
[]
[]
[]
[]
[]
[]
[]
[]
[]
[]
[]
[]
[]
[]
[]
[]
[]
[]
[]
[]
[]
[]
[]
[]
[]
[]
[]
[]
[]
[]
[]
[]
[]
[]
[]
[]
[]
[]
[]
[]
[]
[]
[]
[null,null,null,null,null,null,null,null,{"$f":"I766+1","v":"2019-12-30"},null,null,null,null,null,null,null,null,null,{"$f":"CHOOSE(MONTH(I817),\"janvier\",\"février\",\"mars\",\"avril\",\"mai\",\"juin\",\"juillet\",\"aout\",\"septembre\",\"octobre\",\"novembre\",\"décembre\")","v":"décembre"},{"$f":"IF(AND(S817=\"janvier\"),\"يناير\",\"\")&IF(AND(S817=\"février\"),\"فبراير\",\"\")&IF(AND(S817=\"mars\"),\"مارس\",\"\")&IF(AND(S817=\"avril\"),\"أفريل\",\"\")&IF(AND(S817=\"mai\"),\"ماي\",\"\")&IF(AND(S817=\"septembre\"),\"سبتمبر\",\"\")&IF(AND(S817=\"octobre\"),\"أكتوبر\",\"\")&IF(AND(S817=\"novembre\"),\"نوفمبر\",\"\")&IF(AND(S817=\"décembre\"),\"ديسمبر\",\"\")","v":"ديسمبر"}]
[]
[]
[]
[]
[]
[]
[]
[]
[]
[]
[]
[]
[]
[]
[]
[]
[]
[]
[]
[]
[]
[]
[]
[]
[]
[]
[]
[]
[]
[]
[]
[]
[]
[]
[]
[]
[]
[]
[]
[]
[]
[]
[]
[]
[]
[]
[]
[]
[]
[]
[null,null,null,null,null,null,null,null,{"$f":"I817+1","v":"2019-12-31"},null,null,null,null,null,null,null,null,null,{"$f":"CHOOSE(MONTH(I868),\"janvier\",\"février\",\"mars\",\"avril\",\"mai\",\"juin\",\"juillet\",\"aout\",\"septembre\",\"octobre\",\"novembre\",\"décembre\")","v":"décembre"},{"$f":"IF(AND(S868=\"janvier\"),\"يناير\",\"\")&IF(AND(S868=\"février\"),\"فبراير\",\"\")&IF(AND(S868=\"mars\"),\"مارس\",\"\")&IF(AND(S868=\"avril\"),\"أفريل\",\"\")&IF(AND(S868=\"mai\"),\"ماي\",\"\")&IF(AND(S868=\"septembre\"),\"سبتمبر\",\"\")&IF(AND(S868=\"octobre\"),\"أكتوبر\",\"\")&IF(AND(S868=\"novembre\"),\"نوفمبر\",\"\")&IF(AND(S868=\"décembre\"),\"ديسمبر\",\"\")","v":"ديسمبر"}]
[]
[]
[]
[]
[]
[]
[]
[]
[]
[]
[]
[]
[]
[]
[]
[]
[]
[]
[]
[]
[]
[]
[]
[]
[]
[]
[]
[]
[]
[]
[]
[]
[]
[]
[]
[]
[]
[]
[]
[]
[]
[]
[]
[]
[]
[]
[]
[]
[]
[]
[null,null,null,null,null,null,null,null,{"$f":"I868+1","v":"2020-01-01"},null,null,null,null,null,null,null,null,null,{"$f":"CHOOSE(MONTH(I919),\"janvier\",\"février\",\"mars\",\"avril\",\"mai\",\"juin\",\"juillet\",\"aout\",\"septembre\",\"octobre\",\"novembre\",\"décembre\")","v":"janvier"},{"$f":"IF(AND(S919=\"janvier\"),\"يناير\",\"\")&IF(AND(S919=\"février\"),\"فبراير\",\"\")&IF(AND(S919=\"mars\"),\"مارس\",\"\")&IF(AND(S919=\"avril\"),\"أفريل\",\"\")&IF(AND(S919=\"mai\"),\"ماي\",\"\")&IF(AND(S919=\"septembre\"),\"سبتمبر\",\"\")&IF(AND(S919=\"octobre\"),\"أكتوبر\",\"\")&IF(AND(S919=\"novembre\"),\"نوفمبر\",\"\")&IF(AND(S919=\"décembre\"),\"ديسمبر\",\"\")","v":"يناير"}]
[]
[]
[]
[]
[]
[]
[]
[]
[]
[]
[]
[]
[]
[]
[]
[]
[]
[]
[]
[]
[]
[]
[]
[]
[]
[]
[]
[]
[]
[]
[]
[]
[]
[]
[]
[]
[]
[]
[]
[]
[]
[]
[]
[]
[]
[]
[]
[]
[]
[]
[null,null,null,null,null,null,null,null,{"$f":"I919+1","v":"2020-01-02"},null,null,null,null,null,null,null,null,null,{"$f":"CHOOSE(MONTH(I970),\"janvier\",\"février\",\"mars\",\"avril\",\"mai\",\"juin\",\"juillet\",\"aout\",\"septembre\",\"octobre\",\"novembre\",\"décembre\")","v":"janvier"},{"$f":"IF(AND(S970=\"janvier\"),\"يناير\",\"\")&IF(AND(S970=\"février\"),\"فبراير\",\"\")&IF(AND(S970=\"mars\"),\"مارس\",\"\")&IF(AND(S970=\"avril\"),\"أفريل\",\"\")&IF(AND(S970=\"mai\"),\"ماي\",\"\")&IF(AND(S970=\"septembre\"),\"سبتمبر\",\"\")&IF(AND(S970=\"octobre\"),\"أكتوبر\",\"\")&IF(AND(S970=\"novembre\"),\"نوفمبر\",\"\")&IF(AND(S970=\"décembre\"),\"ديسمبر\",\"\")","v":"يناير"}]