{"text_format":"1","workbook":"xlsx","n_sheets":4,"sheets":["COTATION TRANSPORT","Feuil1","messagerie","Pallets"],"not_rendered":{"charts":0,"images":4,"macros":1,"external_links":0,"defined_names":2,"comments":0,"pivot_tables":0},"unopened":[],"bounds":{"document_bytes":16777216,"sheet_cells":100000,"rows_first":2000,"rows_last":500,"rows_between":2000,"halvings":0,"cell_chars":16384,"cell_head_chars":4096},"cells_cut":0,"cells_raw":0,"read":"whole","date_system":"1900"}

{"sheet":"COTATION TRANSPORT","index":0,"n_rows":10,"n_cols":16,"rows_kept":10,"cut":false,"hidden":false,"merged":[[35,6,35,11],[9,15,20,21]]}
[]
[]
[]
[]
[]
[]
[]
[]
[]
[null,null,null,null,null,null,null,null,null,null,null,null,null,null,null,"FR PALLET"]

{"sheet":"Feuil1","index":1,"n_rows":12,"n_cols":10,"rows_kept":12,"cut":false,"hidden":false,"merged":[[2,8,2,9]]}
[]
[]
[null,null,null,null,null,null,null,null,"tarifs"]
[null,null,null,null,"pds ","dep","nb palete",null,"messagerie","pallets"]
[null,null,null,null,304,20,1,null,{"$f":"IF(E5<101,OFFSET(messagerie!C3,MATCH(Feuil1!F5,messagerie!A3:A115,0)-1,MATCH(Feuil1!E5,RIGHT(messagerie!$C$2:$L$2,2)*1,1)),OFFSET(messagerie!$M$3,MATCH(Feuil1!$F$5,messagerie!A3:A115,0)-1,MATCH(Feuil1!E5,RIGHT(messagerie!$L$2:$Q$2,4)*1,1)-1))","v":203.9},{"$f":"SUMPRODUCT((Pallets!$D$2:$H$2=Feuil1!$G$5)*(Pallets!$B$3:$B$118=Feuil1!$F$5)*(Pallets!$D$3:$H$118))","v":448.42}]
[null,null,null,null,null,null,null,null,{"$f":"I5*(E5/100)","v":619.85599999999999}]
[]
[]
[]
[]
[]
[null,null,null,null,null,null,{"$f":"IF(I6>J5,\"FR PALLET\",\"Messagerie\")","v":"FR PALLET"}]

{"sheet":"messagerie","index":2,"n_rows":115,"n_cols":19,"rows_kept":115,"cut":false,"hidden":false,"merged":[[0,13,0,15]]}
[null,null,"<",null,null,null,"Forfait",null,null,null,{"$f":"N23*16","v":420.8},">","<","Aux 100 kgs",null,null,">"]
["DPT","LOCALITES","0 à                  9","10 à                      19","20 à                      29","30 à                      39","40 à                   49","50 à                      59","60 à                       69","70 à                    79","80 à                   89","90 à                  100","0000 à                      299","300 à                        499","500 à                        699","700 à                        999","1000 à                       3000",{"$f":"MATCH(Feuil1!E5,LEFT(L2:Q2,4)*1,1)-1","v":2}]
[1,"AIN",9.8000000000000007,12.92,16.03,17.79,20.3,23.8,25.56,27.32,28.69,30.32,29,26.62,29.2,27.98,26.82]
[2,"AISNE",6.59,7.62,9.4,10.77,12.21,13.85,15.05,16.11,16.73,17.510000000000002,16.579999999999998,14.7,16.22,14.75,13.38]
[3,"ALLIER",18.05,21.65,24.65,26.25,28.8,33.880000000000003,36.25,37.46,40.369999999999997,42.19,40.04,37.729999999999997,37.58,36.71,36.020000000000003]
[4,"ALPES DE HAUTE-PROV",11.82,15.48,19.11,21.68,24.77,29.48,32.130000000000003,34.61,37.299999999999997,40.74,40.19,38.43,46.23,46.8,49.19]
[4,"Stations",39.4,51.6,63.7,72.3,82.6,91.3,99.5,107.1,115.4,126.1,124.4,119,115.6,117,123]
[5,"ALPES (HAUTES-)",11.86,15.91,19.89,22.78,26.21,31.37,34.31,37.090000000000003,40.07,43.89,43.39,41.54,49.92,50.44,52.83]
[5,"Stations",39.5,53,66.3,75.900000000000006,87.4,97.1,106.2,114.8,124,135.9,134.30000000000001,128.6,124.8,126.1,132.1]
[6,"ALPES-MARITIMES",15.37,19.46,23.13,25.55,29.09,34.44,37.549999999999997,39.82,43.05,45.65,43.85,41.45,48.62,47.53,46.7]
[6,"Stations",51.2,64.900000000000006,77.099999999999994,85.2,97,106.6,116.2,123.2,133.30000000000001,141.30000000000001,135.69999999999999,128.30000000000001,121.6,118.8,116.7]
[7,"ARDECHE",15.5,20.46,23.9,25.83,28.54,33.619999999999997,36.17,37.53,40.44,43.47,42.33,40.04,45.37,44.63,43.78]
[8,"ARDENNES",10.210000000000001,11.56,14.39,15.79,17.38,20.28,21.96,22.79,23.8,25.52,24.73,22.79,25.07,23.53,21.94]
[9,"ARIEGE",10.98,14.52,17.86,20.059999999999999,22.88,27.31,30.01,32.35,34.97,37.64,36.65,34.520000000000003,41.24,39.99,38.9]
[9,"Stations",37.6,49.7,61.1,68.599999999999994,78.3,86.6,95.2,102.6,110.9,119.3,116.2,109.5,103.1,100,97.2]
[10,"AUBE",10.050000000000001,12.05,13.74,14.68,16.28,18.829999999999998,20.2,21.03,22.62,23.54,22.26,20.94,23.8,23.21,22.74]
[11,"AUDE",10.75,13.83,17.37,19.68,22.46,26.86,29.44,31.78,34.15,37.72,37.520000000000003,35.880000000000003,43.37,42.59,41.76]
[12,"AVEYRON",10.64,14.67,18.010000000000002,20.67,23.98,28.45,30.87,33.25,35.71,38.700000000000003,37.880000000000003,35.71,42.64,41.39,40.299999999999997]
[13,"BOUCHES DU RHONE",13.92,17.59,20.87,22.97,26.09,30.83,33.6,35.53,38.47,40.869999999999997,39.31,37.25,43.68,42.8,42.12]
[14,"CALVADOS",10.66,13.14,15.3,16.63,18.43,21.09,22.72,23.71,25.65,27.13,26.03,24.59,29.42,28.75,28.27]
[15,"CANTAL",11.7,15.3,18.649999999999999,20.85,24.2,29.87,32.78,35.75,38.78,42.35,41.8,39.380000000000003,39.270000000000003,37.29,35.549999999999997]
[16,"CHARENTE",9.5399999999999991,12.17,14.54,16.13,18.399999999999999,21.39,23.37,24.78,26.87,28.65,27.66,26.22,31.44,30.82,30.29]
[17,"CHARENTE-MARITIME",9.5399999999999991,12.2,14.58,16.16,18.43,21.43,23.41,24.85,26.94,28.73,27.74,26.3,31.49,30.86,30.38]
[18,"CHER",12.4,14.9,17.100000000000001,18.350000000000001,20.399999999999999,24.26,26.13,27.23,29.32,30.64,28.99,27.34,27.14,26.51,26.04]
[19,"CORREZE",13.45,17.350000000000001,20.85,23.25,26.6,32.340000000000003,35.42,37.68,40.869999999999997,43.73,42.35,40.15,40.19,39.380000000000003,38.799999999999997]
[20,"CORSE",90.1,106.2,124,140,150.80000000000001,180.9,188.1,207.7,215.2,230,222.5,203.9,197,182.4,160.1]
[21,"COTE-D OR",10.210000000000001,12.42,14.31,15.46,17.260000000000002,20.059999999999999,21.65,22.66,24.42,25.61,24.33,22.92,26.08,25.49,25.02]
[22,"COTES-D ARMOR",9.25,11.52,13.54,14.83,16.78,19.34,21.05,22.15,23.98,25.35,24.32,22.99,27.5,26.88,26.45]
[23,"CREUSE",11.5,14.3,19.399999999999999,21.15,23.45,27.94,31.13,34.1,37.57,39.99,42.35,38.61,37.119999999999997,35.090000000000003,33.35]
[24,"DORDOGNE",14.36,17.82,20.86,22.65,25.19,29.48,31.82,33.25,35.96,38.17,36.65,34.69,41.7,40.82,40.14]
[25,"DOUBS",10.37,12.75,14.84,16.149999999999999,18.12,21.16,22.92,24.07,26,27.37,26.14,24.68,28.09,27.45,26.98]
[25,"Stations",32.9,40.4,47.1,51.2,57.5,62.5,67.7,71.099999999999994,76.8,80.900000000000006,77.2,72.900000000000006,68.900000000000006,67.3,66.2]
[26,"DROME",10.91,13.98,16.77,18.61,21.28,25.21,27.54,29.26,31.72,33.880000000000003,32.74,31.02,35.4,34.72,34.19]
[27,"EURE",8.35,9.5,10.4,10.73,11.59,12.88,13.6,13.79,14.74,15.28,14.97,13.38,15.02,14.59,14.21]
[28,"EURE-ET-LOIR",8.7100000000000009,10.220000000000001,11.52,12.17,13.43,15.16,16.190000000000001,16.760000000000002,17.97,18.579999999999998,17.440000000000001,16.38,19.440000000000001,18.91,18.53]
[29,"FINISTERE",9.4,11.84,14.04,15.48,17.57,20.37,22.19,23.48,25.42,27.02,25.99,24.59,29.42,28.85,28.37]
[30,"GARD",14.9,18.489999999999998,21.65,23.6,26.64,31.33,34.020000000000003,35.78,38.68,40.909999999999997,39.14,37,43.37,42.48,41.76]
[31,"HAUTE-GARONNE",12.58,15.73,18.510000000000002,20.22,22.88,27.02,29.36,30.96,33.46,35.42,33.99,32.14,38.64,37.799999999999997,37.130000000000003]
[31,"Stations",43,53.8,63.3,69.2,78.3,85.7,93.1,98.2,106.1,112.3,107.8,101.9,96.6,94.5,92.8]
[32,"GERS",12.08,15.66,19.91,21.43,24.24,28,30.46,32.06,34.19,36.9,36,34.19,41.03,40.25,39.42]
[33,"GIRONDE",10.94,13.68,16.149999999999999,17.75,20.14,23.78,25.87,27.39,29.56,31.2,29.89,28.21,33.799999999999997,33.020000000000003,32.450000000000003]
[34,"HERAULT",12.01,15.87,19.420000000000002,21.88,25.31,30.24,33.31,35.619999999999997,38.72,41.66,40.53,38.51,45.34,44.51,43.84]
[35,"ILLE-ET-VILAINE",8.7799999999999994,10.51,11.99,12.78,14.18,16.149999999999999,17.329999999999998,18.010000000000002,19.38,20.18,19.04,17.899999999999999,21.31,20.78,20.350000000000001]
[36,"INDRE",16.649999999999999,19.399999999999999,21.75,22.9,25.15,29.48,31.46,32.450000000000003,34.76,35.64,33.17,31.02,30.68,29.81,29.12]
[37,"INDRE-ET-LOIRE",8.9600000000000009,10.84,12.46,13.43,14.98,17.100000000000001,18.43,19.27,20.75,21.74,20.63,19.46,23.18,22.66,22.22]
[38,"ISERE",10.62,13.33,15.74,17.3,19.600000000000001,23.06,25.08,26.49,28.69,30.4,29.17,27.59,31.48,30.85,30.32]
[38,"Stations",33.700000000000003,42.3,49.9,54.9,62.1,68.099999999999994,74.099999999999994,78.3,84.8,89.8,86.2,81.5,77.2,75.7,74.400000000000006]
[39,"JURA",10.29,13.49,16.52,18.37,20.54,23.85,25.61,27.06,28.78,31.2,30.58,28.47,31.75,30.95,30.21]
[39,"Stations",32.6,42.8,52.4,58.2,65.099999999999994,70.5,75.7,80,85,92.2,90.4,84.1,77.900000000000006,75.900000000000006,74.099999999999994]
[40,"LANDES",12.84,16.34,19.46,21.47,24.47,29.03,31.73,33.58,36.409999999999997,38.75,37.35,35.380000000000003,42.54,41.7,41.03]
[41,"LOIR-ET-CHER",12.7,15.6,18.149999999999999,19.7,22.1,26.46,28.66,30.09,32.450000000000003,34.21,32.729999999999997,30.86,30.8,30.1,29.58]
[42,"LOIRE",10.54,13.16,15.5,16.97,19.190000000000001,22.53,24.46,25.78,27.9,29.52,28.34,26.75,30.53,29.89,29.36]
[42,"Stations",33.4,41.7,49.1,53.8,60.8,66.599999999999994,72.3,76.2,82.4,87.2,83.7,79,74.900000000000006,73.3,72]
[43,"HAUTE-LOIRE",13.7,17.25,21,24.65,27.1,32.56,34.6,37.35,39.44,43.07,42.52,39.44,38.979999999999997,35.96,33.47]
[44,"LOIRE-ATLANTIQUE",9.2899999999999991,11.59,13.68,15.01,16.989999999999998,19.649999999999999,21.36,22.53,24.36,25.8,24.78,23.45,28.03,27.46,26.98]
[45,"LOIRET",12.25,14.6,16.55,17.649999999999999,19.55,23.16,24.86,25.8,27.72,28.88,27.23,25.58,25.4,24.82,24.3]
[46,"LOT",10.15,13.98,17.559999999999999,20.059999999999999,23.26,27.63,30.67,33.21,35.590000000000003,38.75,38.090000000000003,36.24,43.16,41.76,39.99]
[47,"LOT-ET-GARONNE",10.49,13.83,16.87,19,21.93,26.28,28.86,30.87,33.54,36.08,35.1,33.33,40.14,39.42,38.79]
[48,"LOZERE",11.58,13.81,17.079999999999998,18.760000000000002,20.59,24.28,26,28.06,30.2,33.01,32.590000000000003,31.08,36.56,35.72,34.840000000000003]
[49,"MAINE-ET-LOIRE",8.86,10.55,12.02,12.82,14.22,16.190000000000001,17.37,18.05,19.420000000000002,20.22,19.11,17.97,21.41,20.88,20.45]
[50,"MANCHE",10.66,13.14,15.3,16.63,18.43,21.09,22.72,23.71,25.65,27.13,26.03,24.59,29.42,28.75,28.27]
[51,"MARNE",7.05,7.95,10.17,11.28,12.63,14.92,16.32,17.03,17.78,19.23,18.829999999999998,17.38,19.03,17.809999999999999,16.48]
[52,"HAUTE-MARNE",10.050000000000001,12.05,13.74,14.68,16.32,18.88,20.28,21.12,22.75,23.67,22.35,21.03,23.85,23.27,22.84]
[53,"MAYENNE",11.27,13.54,15.44,16.489999999999998,18.36,20.9,22.46,23.37,25.16,26.26,24.89,23.45,27.94,27.26,26.74]
[54,"MEURTHE-ET-MOSELLE",13.57,16.03,18.04,19.07,20.99,24.11,25.83,26.66,28.6,29.61,27.81,26.14,29.63,28.89,28.3]
[55,"MEUSE",9.92,11.77,13.33,14.15,15.66,18.04,19.32,20.02,21.52,22.26,20.94,19.670000000000002,22.31,21.73,21.31]
[56,"MORBIHAN",9.32,11.66,13.75,15.12,17.100000000000001,19.760000000000002,21.51,22.72,24.59,26.03,25,23.64,28.27,27.65,27.22]
[56,"Iles",35,43.7,51.6,56.7,64.099999999999994,70.2,76.400000000000006,80.7,87.3,92.5,88.8,84,79.5,77.8,76.5]
[57,"MOSELLE",10.99,13.2,15.09,16.149999999999999,17.96,20.77,22.35,23.28,25.04,26.14,24.73,23.28,26.45,25.81,25.33]
[58,"NIEVRE",19.100000000000001,22.15,24.6,25.65,27.65,32.119999999999997,33.99,34.76,37.18,38.119999999999997,35.53,33.22,32.83,31.9,31.2]
[59,"NORD",8.5500000000000007,9.69,10.55,10.84,11.69,12.95,13.61,13.81,14.7,15.21,14.9,13.3,14.85,14.36,14.01]
[60,"OISE",8.51,9.58,10.43,10.69,11.47,12.68,13.3,13.46,14.31,14.78,14.47,12.87,14.31,13.82,13.52]
[61,"ORNE",8.7799999999999994,10.44,11.81,12.56,13.93,15.77,16.91,17.559999999999999,18.850000000000001,19.57,18.47,17.37,20.64,20.11,19.73]
[62,"PAS-DE-CALAIS",8.51,9.6199999999999992,10.43,10.69,11.47,12.68,13.34,13.46,14.35,14.78,14.47,12.87,14.31,13.82,13.52]
[63,"PUY-DE-DOME",12.75,15.8,18.45,20.149999999999999,22.7,27.23,29.54,31.08,33.549999999999997,35.42,33.880000000000003,32.01,31.9,31.2,30.62]
[63,"Stations",33.200000000000003,41.1,48,52.4,59,64.400000000000006,69.8,73.5,79.3,83.7,80.099999999999994,75.7,71.5,69.900000000000006,68.599999999999994]
[64,"PYRENEES-ATLANTIQUE",11.51,15.01,18.2,20.41,23.48,28.04,30.79,32.880000000000003,35.71,38.29,37.15,35.26,42.43,41.65,41.03]
[64,"Stations",39.4,51.4,62.3,69.8,80.3,88.9,97.6,104.3,113.2,121.4,117.8,111.8,106.1,104.1,102.6]
[65,"HAUTES-PYRENEES",11.13,13.98,18.2,20.14,22.8,26.94,30.55,33.619999999999997,36.94,39.81,38.79,36.159999999999997,42.64,40.82,39]
[65,"Stations",38.1,47.8,62.3,68.900000000000006,78,85.4,96.9,106.6,117.1,126.2,123,114.7,106.6,102.1,97.5]
[66,"PYRENEES-ORIENTALES",12.62,16.190000000000001,19.46,21.66,24.81,29.56,32.35,34.44,37.31,39.770000000000003,38.340000000000003,36.29,43.63,42.69,41.96]
[66,"Stations",43.2,55.4,66.599999999999994,74.099999999999994,84.9,93.7,102.6,109.2,118.3,126.1,121.6,115.1,109.1,106.7,104.9]
[67,"BAS-RHIN",11.11,13.53,15.62,16.850000000000001,18.86,21.96,23.72,24.82,26.8,28.07,26.66,25.12,28.62,27.93,27.4]
[68,"HAUT-RHIN",11.07,13.45,15.5,16.73,18.7,21.74,23.45,24.55,26.44,27.68,26.31,24.77,28.2,27.51,26.98]
[69,"RHONE",12.1,14.84,17.3,18.739999999999998,21.07,24.6,26.62,27.94,30.18,31.77,30.32,28.6,32.6,31.85,31.32]
[70,"HAUTE-SAONE",10.09,13.33,16.36,18.29,20.46,23.89,25.65,27.19,28.91,31.42,30.84,28.69,32.07,31.27,30.58]
[71,"SAONE-ET-LOIRE",12.18,14.39,17.02,18.04,19.39,22.04,23.1,23.98,25.39,27.06,26.09,24.16,26.77,24.06,21.41]
[72,"SARTHE",8.89,10.73,12.31,13.18,14.69,16.760000000000002,18.05,18.809999999999999,20.25,21.17,20.059999999999999,18.89,22.51,21.98,21.55]
[73,"SAVOIE",10.91,14.02,16.850000000000001,18.78,21.44,25.43,27.81,29.57,32.08,34.229999999999997,33.090000000000003,31.37,35.880000000000003,35.14,34.61]
[73,"Stations",34.6,44.5,53.4,59.5,68,75.099999999999994,82.2,87.4,94.8,101.1,97.8,92.7,88,86.2,84.9]
[74,"HAUTE-SAVOIE",11.93,15.13,17.96,19.84,22.59,26.62,29.04,30.76,33.35,35.46,34.14,32.340000000000003,36.94,36.15,35.56]
[74,"Stations",37.799999999999997,48,56.9,62.9,71.599999999999994,78.7,85.8,90.9,98.5,104.8,100.9,95.6,90.6,88.7,87.2]
[75,"PARIS",19.3,21.74,23.66,24.34,26.16,29.17,29.84,30.91,31.06,31.52,30.91,27.9,27.55,26.77,26.15]
[76,"SEINE-MARITIME",8.82,9.94,10.76,11.02,11.81,13.07,13.72,13.87,14.74,15.2,14.9,13.15,14.5,14.02,13.63]
[77,"SEINE-ET-MARNE",19.39,21.84,23.86,24.53,26.45,29.53,30.24,31.37,32.49,33.659999999999997,29.17,27.29,28.11,27.33,26.71]
[78,"YVELINES",19.3,21.7,23.62,24.24,26.06,29.07,29.68,30.75,30.91,31.31,30.7,27.69,27.33,26.54,25.98]
[79,"DEUX-SEVRES",9.36,11.77,13.86,15.23,17.28,19.95,21.74,22.95,24.85,26.37,25.35,23.98,28.7,28.08,27.6]
[80,"SOMME",7.81,8.44,8.6199999999999992,8.99,9.14,9.83,9.8699999999999992,10.1,10.1,10.37,9.91,8.66,9.4600000000000009,9.07,8.82]
[81,"TARN",19.46,23.29,26.49,28.23,30.89,35.71,38.130000000000003,39.4,42.44,44.24,41.86,39.4,47.06,45.92,45.03]
[82,"TARN-ET-GARONNE",12.16,15.92,19.34,21.62,24.51,29.15,31.78,33.700000000000003,36.61,39.4,38.380000000000003,36.450000000000003,43.94,43.16,42.48]
[83,"VAR",13.92,17.510000000000002,20.71,22.74,25.78,30.45,33.18,35.03,37.93,40.24,38.68,36.619999999999997,42.95,42.07,41.34]
[84,"VAUCLUSE",10.61,13.85,16.77,18.760000000000002,21.61,25.79,28.27,30.16,32.76,35.11,34.06,32.299999999999997,37.96,37.229999999999997,36.659999999999997]
[85,"VENDEE",9.18,11.3,13.18,14.33,16.13,18.54,20.059999999999999,21.09,22.76,24.02,22.95,21.7,25.92,25.34,24.91]
[86,"VIENNE",11.48,14.08,16.309999999999999,17.64,19.8,22.69,24.51,25.69,27.7,29.15,27.82,26.26,31.39,30.67,30.14,null,{"$f":"P103*8.9","v":225.52600000000001}]
[87,"HAUTE-VIENNE",11.5,14.3,19.399999999999999,21.15,23.45,27.94,31.13,34.1,37.57,39.99,42.35,38.61,37.119999999999997,35.090000000000003,33.35]
[88,"VOSGES",10.130000000000001,12.18,13.98,15.01,16.73,19.399999999999999,20.9,21.82,23.5,24.51,23.23,21.87,24.8,24.22,23.74]
[88,"Stations",32.1,38.6,44.3,47.6,53,57.3,61.8,64.5,69.400000000000006,72.400000000000006,68.599999999999994,64.599999999999994,60.8,59.4,58.2]
[89,"YONNE",8.98,10.74,12.14,13.69,14.68,16.940000000000001,17.78,18.57,19.62,20.68,19.8,18.13,20.14,18.23,16.64]
[90,"TERR. DE BELFORT",11.07,13.45,15.5,16.73,18.739999999999998,22.04,23.89,25.52,27.15,29.48,28.95,26.93,30.1,29.36,28.67]
[91,"ESSONNE",14.45,16.75,18.62,19.440000000000001,21.26,23.97,25.5,26.16,28,28.71,26.72,25.04,25.82,25.09,24.58]
[92,"HAUTS-DE-SEINE",16.32,18.100000000000001,19.39,19.68,20.93,23.1,23.36,23.97,24.58,25.19,23.41,20.81,20.22,19.489999999999998,18.98]
[93,"SEINE-ST-DENIS",16.37,18.190000000000001,19.54,19.920000000000002,21.22,23.46,23.82,25.14,25.81,26.52,24.02,21.42,20.83,20.16,19.600000000000001]
[94,"VAL-DE-MARNE",16.420000000000002,18.34,19.78,20.16,21.55,23.92,24.28,25.04,26.52,27.34,24.68,22.08,21.56,20.83,20.329999999999998]
[95,"VAL-D OISE",18.91,20.93,22.42,22.7,24.14,26.57,26.88,27.54,28.2,28.87,26.83,23.87,23.18,22.46,21.9]
[98,"98 MONACO",53.2,67.400000000000006,80.099999999999994,88.4,100.7,110.7,120.7,128,138.4,146.69999999999999,140.9,133.19999999999999,126.2,123.4,121.2]

{"sheet":"Pallets","index":3,"n_rows":118,"n_cols":8,"rows_kept":118,"cut":false,"hidden":false,"merged":[[0,4,0,6]]}
[null,null,null,"<","Forfait",null,null,">"]
[null,"DPT","LOCALITES",1,2,3,4,5]
[null,1,"AIN",78.84,137.43,186.43,242.95,312.36]
[null,2,"AISNE",61.18,99.85,134.44999999999999,167.96,211.36]
[null,3,"ALLIER",86.97,146.69,193.34,241.29,303.10000000000002]
[null,4,"ALPES DE HAUTE-PROV",95.19,171.27,232.65,309.63,398.1]
[null,4,"Stations",290.70999999999998,427.93,544.21,667.47,810.5]
[null,5,"ALPES (HAUTES-)",95.19,171.27,232.65,309.63,398.1]
[null,5,"Stations",290.70999999999998,427.93,544.21,667.47,810.5]
[null,6,"ALPES-MARITIMES",98.35,176.94,240.36,319.89,411.29]
[null,6,"Stations",299.47000000000003,440.82,560.61,687.59,834.93]
[null,7,"ARDECHE",78.84,137.43,186.43,242.95,312.36]
[null,8,"ARDENNES",58.71,99.71,129.62,176.26,226.62]
[null,9,"ARIEGE",107.52,182.01,236.51,314.76,404.69]
[null,9,"Stations",295.08999999999997,434.37,552.41,677.53,822.71]
[null,10,"AUBE",57,96.81,125.85,171.13,220.02]
[null,11,"AUDE",98.76,167.18,217.23,289.11,371.72]
[null,12,"AVEYRON",109.28,184.98,240.36,319.89,411.29]
[null,13,"BOUCHES DU RHONE",87.31,157.08000000000001,213.38,283.98,365.12]
[null,14,"CALVADOS",59.54,95.99,127.38,166,213.43]
[null,15,"CANTAL",114.31,192.8,254.11,317.13,398.36]
[null,16,"CHARENTE",77.94,125.65,166.75,217.3,279.39]
[null,17,"CHARENTE-MARITIME",77.94,125.65,166.75,217.3,279.39]
[null,17,"Iles",211.86,311.85000000000002,396.6,486.42,590.66]
[null,18,"CHER",76.459999999999994,128.96,169.97,212.12,266.45]
[null,19,"CORREZE",93.28,157.33000000000001,207.36,258.79000000000002,325.08]
[null,20,"CORSE",448.42,660.07,839.44,1029.57,1250.19]
[null,21,"COTE-D OR",65.540000000000006,111.32,144.71,196.78,253]
[null,22,"COTES-D ARMOR",76.099999999999994,122.69,162.81,212.17,272.79000000000002]
[null,22,"Iles",207.48,305.41000000000003,388.4,476.37,578.44000000000005]
[null,23,"CREUSE",93.28,157.33000000000001,207.36,258.79000000000002,325.08]
[null,24,"DORDOGNE",82.99,140.49,182.55,242.95,312.36]
[null,25,"DOUBS",70.66,120.02,156.03,212.17,272.79000000000002]
[null,25,"Stations",207.48,305.41000000000003,388.4,476.37,578.44000000000005]
[null,26,"DROME",80.510000000000005,140.33000000000001,190.37,248.07,318.95999999999998]
[null,27,"EURE",50.34,81.16,107.7,140.35,180.45]
[null,28,"EURE-ET-LOIR",57.7,93.03,123.45,160.87,206.84]
[null,29,"FINISTERE",81.62,131.59,174.62,227.56,292.57]
[null,29,"Iles",220.62,324.75,413,506.54,615.08000000000004]
[null,30,"GARD",85.73,154.24,209.53,278.85000000000002,358.53]
[null,31,"HAUTE-GARONNE",97.01,164.22,213.38,283.98,365.12]
[null,31,"Stations",268.81,395.68,503.21,617.17999999999995,749.43]
[null,32,"GERS",98.76,167.18,217.23,289.11,371.72]
[null,33,"GIRONDE",86.5,146.41999999999999,190.26,253.2,325.55]
[null,34,"HERAULT",85.73,154.24,209.53,278.85000000000002,358.53]
[null,35,"ILLE-ET-VILAINE",70.58,113.79,151,196.78,253]
[null,36,"INDRE",80.66,136.05000000000001,179.32,223.79,281.11]
[null,37,"INDRE-ET-LOIRE",66.900000000000006,107.86,143.13,186.52,239.81]
[null,38,"ISERE",78.84,137.43,186.43,242.95,312.36]
[null,38,"Stations",233.76,344.1,437.6,536.71,651.72]
[null,39,"JURA",79.209999999999994,134.53,174.89,237.82,305.76]
[null,39,"Stations",229.38,337.65,429.4,526.66,639.51]
[null,40,"LANDES",93.5,158.29,205.67,273.72000000000003,351.93]
[null,41,"LOIR-ET-CHER",74.36,125.41,165.29,206.29,259.13]
[null,42,"LOIRE",73.849999999999994,128.72999999999999,174.62,227.56,292.57]
[null,42,"Stations",220.62,324.75,413,506.54,615.08000000000004]
[null,43,"HAUTE-LOIRE",108,182.16,240.08,299.63,376.38]
[null,44,"LOIRE-ATLANTIQUE",76.099999999999994,122.69,162.81,212.17,272.79000000000002]
[null,45,"LOIRET",70.150000000000006,118.32,155.94,194.62,244.47]
[null,46,"LOT",95.26,161.25,209.53,278.85000000000002,358.53]
[null,47,"LOT-ET-GARONNE",90,152.35,197.96,263.47000000000003,338.74]
[null,48,"LOZERE",96.77,174.1,236.51,314.76,404.69]
[null,49,"MAINE-ET-LOIRE",68.739999999999995,110.82,147.07,191.65,246.41]
[null,50,"MANCHE",72.42,116.76,154.94,201.91,259.60000000000002]
[null,51,"MARNE",55.29,93.91,122.07,166,213.43]
[null,52,"HAUTE-MARNE",63.83,108.41,140.94,191.65,246.41]
[null,53,"MAYENNE",66.900000000000006,107.86,143.13,186.52,239.81]
[null,54,"MEURTHE-ET-MOSELLE",63.83,108.41,140.94,191.65,246.41]
[null,55,"MEUSE",58.71,99.71,129.62,176.26,226.62]
[null,56,"MORBIHAN",79.78,128.62,170.68,222.43,285.98]
[null,56,"Iles",216.24,318.3,404.8,496.48,602.87]
[null,57,"MOSELLE",62.12,105.51,137.16999999999999,186.52,239.81]
[null,58,"NIEVRE",86.97,146.69,193.34,241.29,303.10000000000002]
[null,59,"NORD",53.12,86.69,116.74,145.83000000000001,183.52]
[null,60,"OISE",49.09,80.12,107.88,134.77000000000001,169.59]
[null,61,"ORNE",63.22,101.93,135.26,176.26,226.62]
[null,62,"PAS-DE-CALAIS",51.11,83.41,112.31,140.30000000000001,176.56]
[null,63,"PUY-DE-DOME",91.18,153.79,202.69,252.96,317.75]
[null,63,"Stations",216.24,318.3,404.8,496.48,602.87]
[null,64,"PYRENEES-ATLANTIQUE",95.26,161.25,209.53,278.85000000000002,358.53]
[null,64,"Stations",264.43,389.24,495.01,607.12,737.22]
[null,65,"HAUTES-PYRENEES",104.02,176.08,228.8,304.5,391.51]
[null,65,"Stations",286.33,421.48,536.01,657.41,798.29]
[null,66,"PYRENEES-ORIENTALES",107.52,182.01,236.51,314.76,404.69]
[null,66,"Stations",295.08999999999997,434.37,552.41,677.53,822.71]
[null,67,"BAS-RHIN",72.37,122.92,159.80000000000001,217.3,279.39]
[null,68,"HAUT-RHIN",72.37,122.92,159.80000000000001,217.3,279.39]
[null,69,"RHONE",73.849999999999994,128.72999999999999,174.62,227.56,292.57]
[null,70,"HAUTE-SAONE",74.08,125.82,163.57,222.43,285.98]
[null,71,"SAONE-ET-LOIRE",79.209999999999994,134.53,174.89,237.82,305.76]
[null,72,"SARTHE",63.22,101.93,135.26,176.26,226.62]
[null,73,"SAVOIE",77.180000000000007,134.53,182.49,237.82,305.76]
[null,73,"Stations",229.38,337.65,429.4,526.66,639.51]
[null,74,"HAUTE-SAVOIE",77.180000000000007,134.53,182.49,237.82,305.76]
[null,74,"Stations",229.38,337.65,429.4,526.66,639.51]
[null,75,"PARIS",57.15,93.27,125.59,162.6,207.83]
[null,76,"SEINE-MARITIME",48.5,78.2,103.77,135.22,173.86]
[null,77,"SEINE-ET-MARNE",57.15,93.27,125.59,162.6,207.83]
[null,78,"YVELINES",57.15,93.27,125.59,162.6,207.83]
[null,79,"DEUX-SEVRES",77.94,125.65,166.75,217.3,279.39]
[null,80,"SOMME",43.05,70.25,94.6,118.17,148.71]
[null,81,"TARN",105.77,179.05,232.65,309.63,398.1]
[null,82,"TARN-ET-GARONNE",93.5,158.29,205.67,273.72000000000003,351.93]
[null,83,"VAR",92.04,165.59,224.94,299.38,384.91]
[null,84,"VAUCLUSE",85.73,154.24,209.53,278.85000000000002,358.53]
[null,85,"VENDEE",77.94,125.65,166.75,217.3,279.39]
[null,86,"VIENNE",74.260000000000005,119.72,158.88,207.04,266.19]
[null,87,"HAUTE-VIENNE",97.49,164.43,216.71,270.45999999999998,339.74]
[null,88,"VOSGES",67.25,114.22,148.47999999999999,201.91,259.60000000000002]
[null,88,"Stations",189.95,279.61,355.59,436.13,529.59]
[null,89,"YONNE",63.83,108.41,140.94,191.65,246.41]
[null,90,"TERR. DE BELFORT",75.790000000000006,128.72999999999999,167.34,227.56,292.57]
[null,91,"ESSONNE",57.15,93.27,125.59,162.6,207.83]
[null,92,"HAUTS-DE-SEINE",57.15,93.27,125.59,162.6,207.83]
[null,93,"SEINE-ST-DENIS",57.15,93.27,125.59,162.6,207.83]
[null,94,"VAL-DE-MARNE",57.15,93.27,125.59,162.6,207.83]
[null,95,"VAL-D OISE",57.15,93.27,125.59,162.6,207.83]
[null,98,"98 MONACO",299.47000000000003,440.82,560.61,687.59,834.93]