{"text_format":"1","workbook":"xlsx","n_sheets":2,"sheets":["SCRIPTS","LECTEUR"],"not_rendered":{"charts":0,"images":7,"macros":1,"external_links":0,"defined_names":7,"comments":2,"pivot_tables":0},"unopened":[],"bounds":{"document_bytes":16777216,"sheet_cells":100000,"rows_first":2000,"rows_last":500,"rows_between":2000,"halvings":0,"cell_chars":16384,"cell_head_chars":4096},"cells_cut":0,"cells_raw":0,"read":"whole","date_system":"1900"}

{"sheet":"SCRIPTS","index":0,"n_rows":3289,"n_cols":4,"rows_kept":3289,"cut":false,"hidden":false,"merged":[]}
[]
["Index","","Comics Scripts VO / VF"]
[1,0,"http://i19.photobucket.com/albums/b187/wgallen/Misc/Infinity01.jpg","NEKOKONEKO"]
[1,1,"… A SPEKTR, A NINJA, A CROCMAN…"]
[1,2,"… UN SPEKTR, UN NINJA, UN CROCMAN ...."]
[1,1,"AS MASTERS OF STEALTH SOMETIMES…"]
[1,2,"SONT PARFOIS CONNUS COMME DES MAÎTRES DE LA FURTIVITÉ ...."]
[1,1,"HIGHLANDER DAUGHTERS"]
[1,2,"FILLES HIGHLANDER"]
[1,1,"CREAK!"]
[1,2,"CRAQUE !"]
[1,1,"OUS ERE !!!"]
[1,2,"QUI EST LÀ !!!"]
[1,1,"… A QUICK MIND IS JUST AS IMPORTANT AS TO CAMO…"]
[1,2,"... UN ESPRIT VIF EST TOUT AUSSI IMPORTANT QU'UN CAMOUFLAGE…."]
[1,1,"MIAW!"]
[1,2,"MIAOU !"]
[1,1,"MIAW!"]
[1,2,"MIAOU !"]
[1,1,"THE CAT !"]
[1,2,"C'EST LE CHAT !"]
[2,0,"http://i19.photobucket.com/albums/b187/wgallen/Misc/NewNinija.jpg"]
[2,1,"HIYA ! I'M THE NEW NINJA RELEASE !"]
[2,2,"S'LUT ! SUIS LA NOUVELLE VERSION NINJA !"]
[2,1,"YES !!! NOW MAYBE PEOPLE WILL STOP WHINING ABOUT MY PONYTAIL !!!"]
[2,2,"OUI !!! PEUT-ÊTRE QUE MAINTENANT LES GENS S'ARRÊTERONT ENFIN DE SE PLAINDRE DE MA QUEUE DE CHEVAL !!!"]
[3,0,"http://i19.photobucket.com/albums/b187/wgallen/Misc/VanZant.jpg"]
[3,1,"PRIVATE! I NEED A DATE TO THE OFFICER BALL!"]
[3,2,"SOLDAT ! J'AI BESOIN D'UN RENCARD POUR LE BAL DES OFFICIERS !"]
[3,1,"ACK!! SORRY SIR, I ALREADY HAVE A DATE…"]
[3,2,"MINCE !! DÉSOLÉ CHEF, J'AI DÉJÀ UN RENDEZ-VOUS...."]
[3,1,"… BUT ME LITTLE SISTER ES INNA THE REGIMENT TOO !"]
[3,2,"... MAIS MA PETITE SŒUR EST AUSSI DANS LE RÉGIMENT !"]
[3,1,"JUST ONE BOX SIR ?"]
[3,2,"JUSTE UNE BOÎTE CHEF ?"]
[3,1,"AWWWW CRAP !!"]
[3,2,"HOOH MERDE !!"]
[4,0,"https://img.fireden.net/tg/thumb/1447/77/1447770968774s.jpg","ROOKI"]
[4,1,"CYBERMASK"]
[4,2,"CYBERMASK"]
[4,1,"WELL THAT'S AWKWARD"]
[4,2,"WELL THAT'S AWKWARD"]
[5,0,"http://i43.tinypic.com/21kjadz.jpg","CARLOTA KOWALSKI"]
[5,1,"FIRST TESTING OF LINKED TROOPS IN THE ARIADNAN ARMY"]
[5,2,"PREMIERS TESTS DES TROUPES LIÉES DE L'ARMÉE ARIADNAISE"]
[6,0,"http://www.critskillpeople.com/wp-content/uploads/2015/01/Corvusdecideng.jpg"]
[6,1,"HOW THEY TAKE DECISIONS IN CORVUS BELLI"]
[6,2,"PROCESSUS DE DÉCISIONS CHEZ CORVUS BELLI"]
[6,1,"FIRST BLOOD ?"]
[6,2,"PREMIER SANG ?"]
[7,0,"http://i44.tinypic.com/2e3738w.jpg"]
[7,1,"ALEPH HAS DETECTED US!"]
[7,2,"ALEPH NOUS A DÉTECTÉS !"]
[7,1,"YOU ARE IN INFERIORITY…"]
[7,2,"VOUS ÊTES EN INFÉRIORITÉ…."]
[7,1,"SURRENDER OR YOU WILL ALL DIE"]
[7,2,"RENDEZ-VOUS OU VOUS MOUREZ TOUS."]
[7,1,"SURRENDER ?! INFERIORITY ?!"]
[7,2,"REDDITION ?! INFÉRIORITÉ ?!"]
[7,1,"CHECK OUT THA FINGAH THAT YOU'LL SOON HAVE STUCK INTO YOUR BATTERY SLOT, COMPIUTAHBITCH"]
{"$rows_left_out":3230}
{"sheet":"LECTEUR","index":1,"n_rows":400,"n_cols":7,"rows_kept":400,"cut":false,"hidden":false,"merged":[[0,3,0,4]]}
[null,null,null,"       Aide en comm. cellule\n\nBarre de défilement comic\n Attendre 10s après clic"]
["","Comics Scripts VO / VF",null,null,null,"Index lu \nen cours",1]
[{"$f":"IF($G$2=INDEX(SCRIPTS!$A$3:$A$1048576,MATCH($G$2,SCRIPTS!$A$3:$A$1048576,0)+ROW(A3)-3),INDEX(SCRIPTS!$B$3:$B$1048576,MATCH($G$2,SCRIPTS!$A$3:$A$1048576,0)+ROW(A3)-3),\"\")","v":0},{"$f":"IF($G$2=INDEX(SCRIPTS!$A$3:$A$1048576,MATCH($G$2,SCRIPTS!$A$3:$A$1048576,0)+ROW(A3)-3),INDEX(SCRIPTS!$C$3:$C$1048576,MATCH($G$2,SCRIPTS!$A$3:$A$1048576,0)+ROW(A3)-3),\"\")","v":"http://i19.photobucket.com/albums/b187/wgallen/Misc/Infinity01.jpg"}]
[{"$f":"IF($G$2=INDEX(SCRIPTS!$A$3:$A$1048576,MATCH($G$2,SCRIPTS!$A$3:$A$1048576,0)+ROW(A4)-3),INDEX(SCRIPTS!$B$3:$B$1048576,MATCH($G$2,SCRIPTS!$A$3:$A$1048576,0)+ROW(A4)-3),\"\")","v":1},{"$f":"IF($G$2=INDEX(SCRIPTS!$A$3:$A$1048576,MATCH($G$2,SCRIPTS!$A$3:$A$1048576,0)+ROW(A4)-3),INDEX(SCRIPTS!$C$3:$C$1048576,MATCH($G$2,SCRIPTS!$A$3:$A$1048576,0)+ROW(A4)-3),\"\")","v":"… A SPEKTR, A NINJA, A CROCMAN…"}]
[{"$f":"IF($G$2=INDEX(SCRIPTS!$A$3:$A$1048576,MATCH($G$2,SCRIPTS!$A$3:$A$1048576,0)+ROW(A5)-3),INDEX(SCRIPTS!$B$3:$B$1048576,MATCH($G$2,SCRIPTS!$A$3:$A$1048576,0)+ROW(A5)-3),\"\")","v":2},{"$f":"IF($G$2=INDEX(SCRIPTS!$A$3:$A$1048576,MATCH($G$2,SCRIPTS!$A$3:$A$1048576,0)+ROW(A5)-3),INDEX(SCRIPTS!$C$3:$C$1048576,MATCH($G$2,SCRIPTS!$A$3:$A$1048576,0)+ROW(A5)-3),\"\")","v":"… UN SPEKTR, UN NINJA, UN CROCMAN ...."}]
[{"$f":"IF($G$2=INDEX(SCRIPTS!$A$3:$A$1048576,MATCH($G$2,SCRIPTS!$A$3:$A$1048576,0)+ROW(A6)-3),INDEX(SCRIPTS!$B$3:$B$1048576,MATCH($G$2,SCRIPTS!$A$3:$A$1048576,0)+ROW(A6)-3),\"\")","v":1},{"$f":"IF($G$2=INDEX(SCRIPTS!$A$3:$A$1048576,MATCH($G$2,SCRIPTS!$A$3:$A$1048576,0)+ROW(A6)-3),INDEX(SCRIPTS!$C$3:$C$1048576,MATCH($G$2,SCRIPTS!$A$3:$A$1048576,0)+ROW(A6)-3),\"\")","v":"AS MASTERS OF STEALTH SOMETIMES…"}]
[{"$f":"IF($G$2=INDEX(SCRIPTS!$A$3:$A$1048576,MATCH($G$2,SCRIPTS!$A$3:$A$1048576,0)+ROW(A7)-3),INDEX(SCRIPTS!$B$3:$B$1048576,MATCH($G$2,SCRIPTS!$A$3:$A$1048576,0)+ROW(A7)-3),\"\")","v":2},{"$f":"IF($G$2=INDEX(SCRIPTS!$A$3:$A$1048576,MATCH($G$2,SCRIPTS!$A$3:$A$1048576,0)+ROW(A7)-3),INDEX(SCRIPTS!$C$3:$C$1048576,MATCH($G$2,SCRIPTS!$A$3:$A$1048576,0)+ROW(A7)-3),\"\")","v":"SONT PARFOIS CONNUS COMME DES MAÎTRES DE LA FURTIVITÉ ...."}]
[{"$f":"IF($G$2=INDEX(SCRIPTS!$A$3:$A$1048576,MATCH($G$2,SCRIPTS!$A$3:$A$1048576,0)+ROW(A8)-3),INDEX(SCRIPTS!$B$3:$B$1048576,MATCH($G$2,SCRIPTS!$A$3:$A$1048576,0)+ROW(A8)-3),\"\")","v":1},{"$f":"IF($G$2=INDEX(SCRIPTS!$A$3:$A$1048576,MATCH($G$2,SCRIPTS!$A$3:$A$1048576,0)+ROW(A8)-3),INDEX(SCRIPTS!$C$3:$C$1048576,MATCH($G$2,SCRIPTS!$A$3:$A$1048576,0)+ROW(A8)-3),\"\")","v":"HIGHLANDER DAUGHTERS"}]
[{"$f":"IF($G$2=INDEX(SCRIPTS!$A$3:$A$1048576,MATCH($G$2,SCRIPTS!$A$3:$A$1048576,0)+ROW(A9)-3),INDEX(SCRIPTS!$B$3:$B$1048576,MATCH($G$2,SCRIPTS!$A$3:$A$1048576,0)+ROW(A9)-3),\"\")","v":2},{"$f":"IF($G$2=INDEX(SCRIPTS!$A$3:$A$1048576,MATCH($G$2,SCRIPTS!$A$3:$A$1048576,0)+ROW(A9)-3),INDEX(SCRIPTS!$C$3:$C$1048576,MATCH($G$2,SCRIPTS!$A$3:$A$1048576,0)+ROW(A9)-3),\"\")","v":"FILLES HIGHLANDER"}]
[{"$f":"IF($G$2=INDEX(SCRIPTS!$A$3:$A$1048576,MATCH($G$2,SCRIPTS!$A$3:$A$1048576,0)+ROW(A10)-3),INDEX(SCRIPTS!$B$3:$B$1048576,MATCH($G$2,SCRIPTS!$A$3:$A$1048576,0)+ROW(A10)-3),\"\")","v":1},{"$f":"IF($G$2=INDEX(SCRIPTS!$A$3:$A$1048576,MATCH($G$2,SCRIPTS!$A$3:$A$1048576,0)+ROW(A10)-3),INDEX(SCRIPTS!$C$3:$C$1048576,MATCH($G$2,SCRIPTS!$A$3:$A$1048576,0)+ROW(A10)-3),\"\")","v":"CREAK!"}]
[{"$f":"IF($G$2=INDEX(SCRIPTS!$A$3:$A$1048576,MATCH($G$2,SCRIPTS!$A$3:$A$1048576,0)+ROW(A11)-3),INDEX(SCRIPTS!$B$3:$B$1048576,MATCH($G$2,SCRIPTS!$A$3:$A$1048576,0)+ROW(A11)-3),\"\")","v":2},{"$f":"IF($G$2=INDEX(SCRIPTS!$A$3:$A$1048576,MATCH($G$2,SCRIPTS!$A$3:$A$1048576,0)+ROW(A11)-3),INDEX(SCRIPTS!$C$3:$C$1048576,MATCH($G$2,SCRIPTS!$A$3:$A$1048576,0)+ROW(A11)-3),\"\")","v":"CRAQUE !"}]
[{"$f":"IF($G$2=INDEX(SCRIPTS!$A$3:$A$1048576,MATCH($G$2,SCRIPTS!$A$3:$A$1048576,0)+ROW(A12)-3),INDEX(SCRIPTS!$B$3:$B$1048576,MATCH($G$2,SCRIPTS!$A$3:$A$1048576,0)+ROW(A12)-3),\"\")","v":1},{"$f":"IF($G$2=INDEX(SCRIPTS!$A$3:$A$1048576,MATCH($G$2,SCRIPTS!$A$3:$A$1048576,0)+ROW(A12)-3),INDEX(SCRIPTS!$C$3:$C$1048576,MATCH($G$2,SCRIPTS!$A$3:$A$1048576,0)+ROW(A12)-3),\"\")","v":"OUS ERE !!!"}]
[{"$f":"IF($G$2=INDEX(SCRIPTS!$A$3:$A$1048576,MATCH($G$2,SCRIPTS!$A$3:$A$1048576,0)+ROW(A13)-3),INDEX(SCRIPTS!$B$3:$B$1048576,MATCH($G$2,SCRIPTS!$A$3:$A$1048576,0)+ROW(A13)-3),\"\")","v":2},{"$f":"IF($G$2=INDEX(SCRIPTS!$A$3:$A$1048576,MATCH($G$2,SCRIPTS!$A$3:$A$1048576,0)+ROW(A13)-3),INDEX(SCRIPTS!$C$3:$C$1048576,MATCH($G$2,SCRIPTS!$A$3:$A$1048576,0)+ROW(A13)-3),\"\")","v":"QUI EST LÀ !!!"}]
[{"$f":"IF($G$2=INDEX(SCRIPTS!$A$3:$A$1048576,MATCH($G$2,SCRIPTS!$A$3:$A$1048576,0)+ROW(A14)-3),INDEX(SCRIPTS!$B$3:$B$1048576,MATCH($G$2,SCRIPTS!$A$3:$A$1048576,0)+ROW(A14)-3),\"\")","v":1},{"$f":"IF($G$2=INDEX(SCRIPTS!$A$3:$A$1048576,MATCH($G$2,SCRIPTS!$A$3:$A$1048576,0)+ROW(A14)-3),INDEX(SCRIPTS!$C$3:$C$1048576,MATCH($G$2,SCRIPTS!$A$3:$A$1048576,0)+ROW(A14)-3),\"\")","v":"… A QUICK MIND IS JUST AS IMPORTANT AS TO CAMO…"}]
[{"$f":"IF($G$2=INDEX(SCRIPTS!$A$3:$A$1048576,MATCH($G$2,SCRIPTS!$A$3:$A$1048576,0)+ROW(A15)-3),INDEX(SCRIPTS!$B$3:$B$1048576,MATCH($G$2,SCRIPTS!$A$3:$A$1048576,0)+ROW(A15)-3),\"\")","v":2},{"$f":"IF($G$2=INDEX(SCRIPTS!$A$3:$A$1048576,MATCH($G$2,SCRIPTS!$A$3:$A$1048576,0)+ROW(A15)-3),INDEX(SCRIPTS!$C$3:$C$1048576,MATCH($G$2,SCRIPTS!$A$3:$A$1048576,0)+ROW(A15)-3),\"\")","v":"... UN ESPRIT VIF EST TOUT AUSSI IMPORTANT QU'UN CAMOUFLAGE…."}]
[{"$f":"IF($G$2=INDEX(SCRIPTS!$A$3:$A$1048576,MATCH($G$2,SCRIPTS!$A$3:$A$1048576,0)+ROW(A16)-3),INDEX(SCRIPTS!$B$3:$B$1048576,MATCH($G$2,SCRIPTS!$A$3:$A$1048576,0)+ROW(A16)-3),\"\")","v":1},{"$f":"IF($G$2=INDEX(SCRIPTS!$A$3:$A$1048576,MATCH($G$2,SCRIPTS!$A$3:$A$1048576,0)+ROW(A16)-3),INDEX(SCRIPTS!$C$3:$C$1048576,MATCH($G$2,SCRIPTS!$A$3:$A$1048576,0)+ROW(A16)-3),\"\")","v":"MIAW!"}]
[{"$f":"IF($G$2=INDEX(SCRIPTS!$A$3:$A$1048576,MATCH($G$2,SCRIPTS!$A$3:$A$1048576,0)+ROW(A17)-3),INDEX(SCRIPTS!$B$3:$B$1048576,MATCH($G$2,SCRIPTS!$A$3:$A$1048576,0)+ROW(A17)-3),\"\")","v":2},{"$f":"IF($G$2=INDEX(SCRIPTS!$A$3:$A$1048576,MATCH($G$2,SCRIPTS!$A$3:$A$1048576,0)+ROW(A17)-3),INDEX(SCRIPTS!$C$3:$C$1048576,MATCH($G$2,SCRIPTS!$A$3:$A$1048576,0)+ROW(A17)-3),\"\")","v":"MIAOU !"}]
[{"$f":"IF($G$2=INDEX(SCRIPTS!$A$3:$A$1048576,MATCH($G$2,SCRIPTS!$A$3:$A$1048576,0)+ROW(A18)-3),INDEX(SCRIPTS!$B$3:$B$1048576,MATCH($G$2,SCRIPTS!$A$3:$A$1048576,0)+ROW(A18)-3),\"\")","v":1},{"$f":"IF($G$2=INDEX(SCRIPTS!$A$3:$A$1048576,MATCH($G$2,SCRIPTS!$A$3:$A$1048576,0)+ROW(A18)-3),INDEX(SCRIPTS!$C$3:$C$1048576,MATCH($G$2,SCRIPTS!$A$3:$A$1048576,0)+ROW(A18)-3),\"\")","v":"MIAW!"}]
[{"$f":"IF($G$2=INDEX(SCRIPTS!$A$3:$A$1048576,MATCH($G$2,SCRIPTS!$A$3:$A$1048576,0)+ROW(A19)-3),INDEX(SCRIPTS!$B$3:$B$1048576,MATCH($G$2,SCRIPTS!$A$3:$A$1048576,0)+ROW(A19)-3),\"\")","v":2},{"$f":"IF($G$2=INDEX(SCRIPTS!$A$3:$A$1048576,MATCH($G$2,SCRIPTS!$A$3:$A$1048576,0)+ROW(A19)-3),INDEX(SCRIPTS!$C$3:$C$1048576,MATCH($G$2,SCRIPTS!$A$3:$A$1048576,0)+ROW(A19)-3),\"\")","v":"MIAOU !"}]
[{"$f":"IF($G$2=INDEX(SCRIPTS!$A$3:$A$1048576,MATCH($G$2,SCRIPTS!$A$3:$A$1048576,0)+ROW(A20)-3),INDEX(SCRIPTS!$B$3:$B$1048576,MATCH($G$2,SCRIPTS!$A$3:$A$1048576,0)+ROW(A20)-3),\"\")","v":1},{"$f":"IF($G$2=INDEX(SCRIPTS!$A$3:$A$1048576,MATCH($G$2,SCRIPTS!$A$3:$A$1048576,0)+ROW(A20)-3),INDEX(SCRIPTS!$C$3:$C$1048576,MATCH($G$2,SCRIPTS!$A$3:$A$1048576,0)+ROW(A20)-3),\"\")","v":"THE CAT !"}]
[{"$f":"IF($G$2=INDEX(SCRIPTS!$A$3:$A$1048576,MATCH($G$2,SCRIPTS!$A$3:$A$1048576,0)+ROW(A21)-3),INDEX(SCRIPTS!$B$3:$B$1048576,MATCH($G$2,SCRIPTS!$A$3:$A$1048576,0)+ROW(A21)-3),\"\")","v":2},{"$f":"IF($G$2=INDEX(SCRIPTS!$A$3:$A$1048576,MATCH($G$2,SCRIPTS!$A$3:$A$1048576,0)+ROW(A21)-3),INDEX(SCRIPTS!$C$3:$C$1048576,MATCH($G$2,SCRIPTS!$A$3:$A$1048576,0)+ROW(A21)-3),\"\")","v":"C'EST LE CHAT !"}]
[{"$f":"IF($G$2=INDEX(SCRIPTS!$A$3:$A$1048576,MATCH($G$2,SCRIPTS!$A$3:$A$1048576,0)+ROW(A22)-3),INDEX(SCRIPTS!$B$3:$B$1048576,MATCH($G$2,SCRIPTS!$A$3:$A$1048576,0)+ROW(A22)-3),\"\")","v":""},{"$f":"IF($G$2=INDEX(SCRIPTS!$A$3:$A$1048576,MATCH($G$2,SCRIPTS!$A$3:$A$1048576,0)+ROW(A22)-3),INDEX(SCRIPTS!$C$3:$C$1048576,MATCH($G$2,SCRIPTS!$A$3:$A$1048576,0)+ROW(A22)-3),\"\")","v":""}]
[{"$f":"IF($G$2=INDEX(SCRIPTS!$A$3:$A$1048576,MATCH($G$2,SCRIPTS!$A$3:$A$1048576,0)+ROW(A23)-3),INDEX(SCRIPTS!$B$3:$B$1048576,MATCH($G$2,SCRIPTS!$A$3:$A$1048576,0)+ROW(A23)-3),\"\")","v":""},{"$f":"IF($G$2=INDEX(SCRIPTS!$A$3:$A$1048576,MATCH($G$2,SCRIPTS!$A$3:$A$1048576,0)+ROW(A23)-3),INDEX(SCRIPTS!$C$3:$C$1048576,MATCH($G$2,SCRIPTS!$A$3:$A$1048576,0)+ROW(A23)-3),\"\")","v":""}]
[{"$f":"IF($G$2=INDEX(SCRIPTS!$A$3:$A$1048576,MATCH($G$2,SCRIPTS!$A$3:$A$1048576,0)+ROW(A24)-3),INDEX(SCRIPTS!$B$3:$B$1048576,MATCH($G$2,SCRIPTS!$A$3:$A$1048576,0)+ROW(A24)-3),\"\")","v":""},{"$f":"IF($G$2=INDEX(SCRIPTS!$A$3:$A$1048576,MATCH($G$2,SCRIPTS!$A$3:$A$1048576,0)+ROW(A24)-3),INDEX(SCRIPTS!$C$3:$C$1048576,MATCH($G$2,SCRIPTS!$A$3:$A$1048576,0)+ROW(A24)-3),\"\")","v":""}]
[{"$f":"IF($G$2=INDEX(SCRIPTS!$A$3:$A$1048576,MATCH($G$2,SCRIPTS!$A$3:$A$1048576,0)+ROW(A25)-3),INDEX(SCRIPTS!$B$3:$B$1048576,MATCH($G$2,SCRIPTS!$A$3:$A$1048576,0)+ROW(A25)-3),\"\")","v":""},{"$f":"IF($G$2=INDEX(SCRIPTS!$A$3:$A$1048576,MATCH($G$2,SCRIPTS!$A$3:$A$1048576,0)+ROW(A25)-3),INDEX(SCRIPTS!$C$3:$C$1048576,MATCH($G$2,SCRIPTS!$A$3:$A$1048576,0)+ROW(A25)-3),\"\")","v":""}]
[{"$f":"IF($G$2=INDEX(SCRIPTS!$A$3:$A$1048576,MATCH($G$2,SCRIPTS!$A$3:$A$1048576,0)+ROW(A26)-3),INDEX(SCRIPTS!$B$3:$B$1048576,MATCH($G$2,SCRIPTS!$A$3:$A$1048576,0)+ROW(A26)-3),\"\")","v":""},{"$f":"IF($G$2=INDEX(SCRIPTS!$A$3:$A$1048576,MATCH($G$2,SCRIPTS!$A$3:$A$1048576,0)+ROW(A26)-3),INDEX(SCRIPTS!$C$3:$C$1048576,MATCH($G$2,SCRIPTS!$A$3:$A$1048576,0)+ROW(A26)-3),\"\")","v":""}]
[{"$f":"IF($G$2=INDEX(SCRIPTS!$A$3:$A$1048576,MATCH($G$2,SCRIPTS!$A$3:$A$1048576,0)+ROW(A27)-3),INDEX(SCRIPTS!$B$3:$B$1048576,MATCH($G$2,SCRIPTS!$A$3:$A$1048576,0)+ROW(A27)-3),\"\")","v":""},{"$f":"IF($G$2=INDEX(SCRIPTS!$A$3:$A$1048576,MATCH($G$2,SCRIPTS!$A$3:$A$1048576,0)+ROW(A27)-3),INDEX(SCRIPTS!$C$3:$C$1048576,MATCH($G$2,SCRIPTS!$A$3:$A$1048576,0)+ROW(A27)-3),\"\")","v":""}]
[{"$f":"IF($G$2=INDEX(SCRIPTS!$A$3:$A$1048576,MATCH($G$2,SCRIPTS!$A$3:$A$1048576,0)+ROW(A28)-3),INDEX(SCRIPTS!$B$3:$B$1048576,MATCH($G$2,SCRIPTS!$A$3:$A$1048576,0)+ROW(A28)-3),\"\")","v":""},{"$f":"IF($G$2=INDEX(SCRIPTS!$A$3:$A$1048576,MATCH($G$2,SCRIPTS!$A$3:$A$1048576,0)+ROW(A28)-3),INDEX(SCRIPTS!$C$3:$C$1048576,MATCH($G$2,SCRIPTS!$A$3:$A$1048576,0)+ROW(A28)-3),\"\")","v":""}]
[{"$f":"IF($G$2=INDEX(SCRIPTS!$A$3:$A$1048576,MATCH($G$2,SCRIPTS!$A$3:$A$1048576,0)+ROW(A29)-3),INDEX(SCRIPTS!$B$3:$B$1048576,MATCH($G$2,SCRIPTS!$A$3:$A$1048576,0)+ROW(A29)-3),\"\")","v":""},{"$f":"IF($G$2=INDEX(SCRIPTS!$A$3:$A$1048576,MATCH($G$2,SCRIPTS!$A$3:$A$1048576,0)+ROW(A29)-3),INDEX(SCRIPTS!$C$3:$C$1048576,MATCH($G$2,SCRIPTS!$A$3:$A$1048576,0)+ROW(A29)-3),\"\")","v":""}]
[{"$f":"IF($G$2=INDEX(SCRIPTS!$A$3:$A$1048576,MATCH($G$2,SCRIPTS!$A$3:$A$1048576,0)+ROW(A30)-3),INDEX(SCRIPTS!$B$3:$B$1048576,MATCH($G$2,SCRIPTS!$A$3:$A$1048576,0)+ROW(A30)-3),\"\")","v":""},{"$f":"IF($G$2=INDEX(SCRIPTS!$A$3:$A$1048576,MATCH($G$2,SCRIPTS!$A$3:$A$1048576,0)+ROW(A30)-3),INDEX(SCRIPTS!$C$3:$C$1048576,MATCH($G$2,SCRIPTS!$A$3:$A$1048576,0)+ROW(A30)-3),\"\")","v":""}]
[{"$f":"IF($G$2=INDEX(SCRIPTS!$A$3:$A$1048576,MATCH($G$2,SCRIPTS!$A$3:$A$1048576,0)+ROW(A31)-3),INDEX(SCRIPTS!$B$3:$B$1048576,MATCH($G$2,SCRIPTS!$A$3:$A$1048576,0)+ROW(A31)-3),\"\")","v":""},{"$f":"IF($G$2=INDEX(SCRIPTS!$A$3:$A$1048576,MATCH($G$2,SCRIPTS!$A$3:$A$1048576,0)+ROW(A31)-3),INDEX(SCRIPTS!$C$3:$C$1048576,MATCH($G$2,SCRIPTS!$A$3:$A$1048576,0)+ROW(A31)-3),\"\")","v":""}]
[{"$f":"IF($G$2=INDEX(SCRIPTS!$A$3:$A$1048576,MATCH($G$2,SCRIPTS!$A$3:$A$1048576,0)+ROW(A32)-3),INDEX(SCRIPTS!$B$3:$B$1048576,MATCH($G$2,SCRIPTS!$A$3:$A$1048576,0)+ROW(A32)-3),\"\")","v":""},{"$f":"IF($G$2=INDEX(SCRIPTS!$A$3:$A$1048576,MATCH($G$2,SCRIPTS!$A$3:$A$1048576,0)+ROW(A32)-3),INDEX(SCRIPTS!$C$3:$C$1048576,MATCH($G$2,SCRIPTS!$A$3:$A$1048576,0)+ROW(A32)-3),\"\")","v":""}]
[{"$f":"IF($G$2=INDEX(SCRIPTS!$A$3:$A$1048576,MATCH($G$2,SCRIPTS!$A$3:$A$1048576,0)+ROW(A33)-3),INDEX(SCRIPTS!$B$3:$B$1048576,MATCH($G$2,SCRIPTS!$A$3:$A$1048576,0)+ROW(A33)-3),\"\")","v":""},{"$f":"IF($G$2=INDEX(SCRIPTS!$A$3:$A$1048576,MATCH($G$2,SCRIPTS!$A$3:$A$1048576,0)+ROW(A33)-3),INDEX(SCRIPTS!$C$3:$C$1048576,MATCH($G$2,SCRIPTS!$A$3:$A$1048576,0)+ROW(A33)-3),\"\")","v":""}]
[{"$f":"IF($G$2=INDEX(SCRIPTS!$A$3:$A$1048576,MATCH($G$2,SCRIPTS!$A$3:$A$1048576,0)+ROW(A34)-3),INDEX(SCRIPTS!$B$3:$B$1048576,MATCH($G$2,SCRIPTS!$A$3:$A$1048576,0)+ROW(A34)-3),\"\")","v":""},{"$f":"IF($G$2=INDEX(SCRIPTS!$A$3:$A$1048576,MATCH($G$2,SCRIPTS!$A$3:$A$1048576,0)+ROW(A34)-3),INDEX(SCRIPTS!$C$3:$C$1048576,MATCH($G$2,SCRIPTS!$A$3:$A$1048576,0)+ROW(A34)-3),\"\")","v":""}]
[{"$f":"IF($G$2=INDEX(SCRIPTS!$A$3:$A$1048576,MATCH($G$2,SCRIPTS!$A$3:$A$1048576,0)+ROW(A35)-3),INDEX(SCRIPTS!$B$3:$B$1048576,MATCH($G$2,SCRIPTS!$A$3:$A$1048576,0)+ROW(A35)-3),\"\")","v":""},{"$f":"IF($G$2=INDEX(SCRIPTS!$A$3:$A$1048576,MATCH($G$2,SCRIPTS!$A$3:$A$1048576,0)+ROW(A35)-3),INDEX(SCRIPTS!$C$3:$C$1048576,MATCH($G$2,SCRIPTS!$A$3:$A$1048576,0)+ROW(A35)-3),\"\")","v":""}]
[{"$f":"IF($G$2=INDEX(SCRIPTS!$A$3:$A$1048576,MATCH($G$2,SCRIPTS!$A$3:$A$1048576,0)+ROW(A36)-3),INDEX(SCRIPTS!$B$3:$B$1048576,MATCH($G$2,SCRIPTS!$A$3:$A$1048576,0)+ROW(A36)-3),\"\")","v":""},{"$f":"IF($G$2=INDEX(SCRIPTS!$A$3:$A$1048576,MATCH($G$2,SCRIPTS!$A$3:$A$1048576,0)+ROW(A36)-3),INDEX(SCRIPTS!$C$3:$C$1048576,MATCH($G$2,SCRIPTS!$A$3:$A$1048576,0)+ROW(A36)-3),\"\")","v":""}]
[{"$f":"IF($G$2=INDEX(SCRIPTS!$A$3:$A$1048576,MATCH($G$2,SCRIPTS!$A$3:$A$1048576,0)+ROW(A37)-3),INDEX(SCRIPTS!$B$3:$B$1048576,MATCH($G$2,SCRIPTS!$A$3:$A$1048576,0)+ROW(A37)-3),\"\")","v":""},{"$f":"IF($G$2=INDEX(SCRIPTS!$A$3:$A$1048576,MATCH($G$2,SCRIPTS!$A$3:$A$1048576,0)+ROW(A37)-3),INDEX(SCRIPTS!$C$3:$C$1048576,MATCH($G$2,SCRIPTS!$A$3:$A$1048576,0)+ROW(A37)-3),\"\")","v":""}]
[{"$f":"IF($G$2=INDEX(SCRIPTS!$A$3:$A$1048576,MATCH($G$2,SCRIPTS!$A$3:$A$1048576,0)+ROW(A38)-3),INDEX(SCRIPTS!$B$3:$B$1048576,MATCH($G$2,SCRIPTS!$A$3:$A$1048576,0)+ROW(A38)-3),\"\")","v":""},{"$f":"IF($G$2=INDEX(SCRIPTS!$A$3:$A$1048576,MATCH($G$2,SCRIPTS!$A$3:$A$1048576,0)+ROW(A38)-3),INDEX(SCRIPTS!$C$3:$C$1048576,MATCH($G$2,SCRIPTS!$A$3:$A$1048576,0)+ROW(A38)-3),\"\")","v":""}]
[{"$f":"IF($G$2=INDEX(SCRIPTS!$A$3:$A$1048576,MATCH($G$2,SCRIPTS!$A$3:$A$1048576,0)+ROW(A39)-3),INDEX(SCRIPTS!$B$3:$B$1048576,MATCH($G$2,SCRIPTS!$A$3:$A$1048576,0)+ROW(A39)-3),\"\")","v":""},{"$f":"IF($G$2=INDEX(SCRIPTS!$A$3:$A$1048576,MATCH($G$2,SCRIPTS!$A$3:$A$1048576,0)+ROW(A39)-3),INDEX(SCRIPTS!$C$3:$C$1048576,MATCH($G$2,SCRIPTS!$A$3:$A$1048576,0)+ROW(A39)-3),\"\")","v":""}]
[{"$f":"IF($G$2=INDEX(SCRIPTS!$A$3:$A$1048576,MATCH($G$2,SCRIPTS!$A$3:$A$1048576,0)+ROW(A40)-3),INDEX(SCRIPTS!$B$3:$B$1048576,MATCH($G$2,SCRIPTS!$A$3:$A$1048576,0)+ROW(A40)-3),\"\")","v":""},{"$f":"IF($G$2=INDEX(SCRIPTS!$A$3:$A$1048576,MATCH($G$2,SCRIPTS!$A$3:$A$1048576,0)+ROW(A40)-3),INDEX(SCRIPTS!$C$3:$C$1048576,MATCH($G$2,SCRIPTS!$A$3:$A$1048576,0)+ROW(A40)-3),\"\")","v":""}]
[{"$f":"IF($G$2=INDEX(SCRIPTS!$A$3:$A$1048576,MATCH($G$2,SCRIPTS!$A$3:$A$1048576,0)+ROW(A41)-3),INDEX(SCRIPTS!$B$3:$B$1048576,MATCH($G$2,SCRIPTS!$A$3:$A$1048576,0)+ROW(A41)-3),\"\")","v":""},{"$f":"IF($G$2=INDEX(SCRIPTS!$A$3:$A$1048576,MATCH($G$2,SCRIPTS!$A$3:$A$1048576,0)+ROW(A41)-3),INDEX(SCRIPTS!$C$3:$C$1048576,MATCH($G$2,SCRIPTS!$A$3:$A$1048576,0)+ROW(A41)-3),\"\")","v":""}]
[{"$f":"IF($G$2=INDEX(SCRIPTS!$A$3:$A$1048576,MATCH($G$2,SCRIPTS!$A$3:$A$1048576,0)+ROW(A42)-3),INDEX(SCRIPTS!$B$3:$B$1048576,MATCH($G$2,SCRIPTS!$A$3:$A$1048576,0)+ROW(A42)-3),\"\")","v":""},{"$f":"IF($G$2=INDEX(SCRIPTS!$A$3:$A$1048576,MATCH($G$2,SCRIPTS!$A$3:$A$1048576,0)+ROW(A42)-3),INDEX(SCRIPTS!$C$3:$C$1048576,MATCH($G$2,SCRIPTS!$A$3:$A$1048576,0)+ROW(A42)-3),\"\")","v":""}]
[{"$f":"IF($G$2=INDEX(SCRIPTS!$A$3:$A$1048576,MATCH($G$2,SCRIPTS!$A$3:$A$1048576,0)+ROW(A43)-3),INDEX(SCRIPTS!$B$3:$B$1048576,MATCH($G$2,SCRIPTS!$A$3:$A$1048576,0)+ROW(A43)-3),\"\")","v":""},{"$f":"IF($G$2=INDEX(SCRIPTS!$A$3:$A$1048576,MATCH($G$2,SCRIPTS!$A$3:$A$1048576,0)+ROW(A43)-3),INDEX(SCRIPTS!$C$3:$C$1048576,MATCH($G$2,SCRIPTS!$A$3:$A$1048576,0)+ROW(A43)-3),\"\")","v":""}]
[{"$f":"IF($G$2=INDEX(SCRIPTS!$A$3:$A$1048576,MATCH($G$2,SCRIPTS!$A$3:$A$1048576,0)+ROW(A44)-3),INDEX(SCRIPTS!$B$3:$B$1048576,MATCH($G$2,SCRIPTS!$A$3:$A$1048576,0)+ROW(A44)-3),\"\")","v":""},{"$f":"IF($G$2=INDEX(SCRIPTS!$A$3:$A$1048576,MATCH($G$2,SCRIPTS!$A$3:$A$1048576,0)+ROW(A44)-3),INDEX(SCRIPTS!$C$3:$C$1048576,MATCH($G$2,SCRIPTS!$A$3:$A$1048576,0)+ROW(A44)-3),\"\")","v":""}]
[{"$f":"IF($G$2=INDEX(SCRIPTS!$A$3:$A$1048576,MATCH($G$2,SCRIPTS!$A$3:$A$1048576,0)+ROW(A45)-3),INDEX(SCRIPTS!$B$3:$B$1048576,MATCH($G$2,SCRIPTS!$A$3:$A$1048576,0)+ROW(A45)-3),\"\")","v":""},{"$f":"IF($G$2=INDEX(SCRIPTS!$A$3:$A$1048576,MATCH($G$2,SCRIPTS!$A$3:$A$1048576,0)+ROW(A45)-3),INDEX(SCRIPTS!$C$3:$C$1048576,MATCH($G$2,SCRIPTS!$A$3:$A$1048576,0)+ROW(A45)-3),\"\")","v":""}]
[{"$f":"IF($G$2=INDEX(SCRIPTS!$A$3:$A$1048576,MATCH($G$2,SCRIPTS!$A$3:$A$1048576,0)+ROW(A46)-3),INDEX(SCRIPTS!$B$3:$B$1048576,MATCH($G$2,SCRIPTS!$A$3:$A$1048576,0)+ROW(A46)-3),\"\")","v":""},{"$f":"IF($G$2=INDEX(SCRIPTS!$A$3:$A$1048576,MATCH($G$2,SCRIPTS!$A$3:$A$1048576,0)+ROW(A46)-3),INDEX(SCRIPTS!$C$3:$C$1048576,MATCH($G$2,SCRIPTS!$A$3:$A$1048576,0)+ROW(A46)-3),\"\")","v":""}]
[{"$f":"IF($G$2=INDEX(SCRIPTS!$A$3:$A$1048576,MATCH($G$2,SCRIPTS!$A$3:$A$1048576,0)+ROW(A47)-3),INDEX(SCRIPTS!$B$3:$B$1048576,MATCH($G$2,SCRIPTS!$A$3:$A$1048576,0)+ROW(A47)-3),\"\")","v":""},{"$f":"IF($G$2=INDEX(SCRIPTS!$A$3:$A$1048576,MATCH($G$2,SCRIPTS!$A$3:$A$1048576,0)+ROW(A47)-3),INDEX(SCRIPTS!$C$3:$C$1048576,MATCH($G$2,SCRIPTS!$A$3:$A$1048576,0)+ROW(A47)-3),\"\")","v":""}]
[{"$f":"IF($G$2=INDEX(SCRIPTS!$A$3:$A$1048576,MATCH($G$2,SCRIPTS!$A$3:$A$1048576,0)+ROW(A48)-3),INDEX(SCRIPTS!$B$3:$B$1048576,MATCH($G$2,SCRIPTS!$A$3:$A$1048576,0)+ROW(A48)-3),\"\")","v":""},{"$f":"IF($G$2=INDEX(SCRIPTS!$A$3:$A$1048576,MATCH($G$2,SCRIPTS!$A$3:$A$1048576,0)+ROW(A48)-3),INDEX(SCRIPTS!$C$3:$C$1048576,MATCH($G$2,SCRIPTS!$A$3:$A$1048576,0)+ROW(A48)-3),\"\")","v":""}]
[{"$f":"IF($G$2=INDEX(SCRIPTS!$A$3:$A$1048576,MATCH($G$2,SCRIPTS!$A$3:$A$1048576,0)+ROW(A49)-3),INDEX(SCRIPTS!$B$3:$B$1048576,MATCH($G$2,SCRIPTS!$A$3:$A$1048576,0)+ROW(A49)-3),\"\")","v":""},{"$f":"IF($G$2=INDEX(SCRIPTS!$A$3:$A$1048576,MATCH($G$2,SCRIPTS!$A$3:$A$1048576,0)+ROW(A49)-3),INDEX(SCRIPTS!$C$3:$C$1048576,MATCH($G$2,SCRIPTS!$A$3:$A$1048576,0)+ROW(A49)-3),\"\")","v":""}]
[{"$f":"IF($G$2=INDEX(SCRIPTS!$A$3:$A$1048576,MATCH($G$2,SCRIPTS!$A$3:$A$1048576,0)+ROW(A50)-3),INDEX(SCRIPTS!$B$3:$B$1048576,MATCH($G$2,SCRIPTS!$A$3:$A$1048576,0)+ROW(A50)-3),\"\")","v":""},{"$f":"IF($G$2=INDEX(SCRIPTS!$A$3:$A$1048576,MATCH($G$2,SCRIPTS!$A$3:$A$1048576,0)+ROW(A50)-3),INDEX(SCRIPTS!$C$3:$C$1048576,MATCH($G$2,SCRIPTS!$A$3:$A$1048576,0)+ROW(A50)-3),\"\")","v":""}]
[{"$f":"IF($G$2=INDEX(SCRIPTS!$A$3:$A$1048576,MATCH($G$2,SCRIPTS!$A$3:$A$1048576,0)+ROW(A51)-3),INDEX(SCRIPTS!$B$3:$B$1048576,MATCH($G$2,SCRIPTS!$A$3:$A$1048576,0)+ROW(A51)-3),\"\")","v":""},{"$f":"IF($G$2=INDEX(SCRIPTS!$A$3:$A$1048576,MATCH($G$2,SCRIPTS!$A$3:$A$1048576,0)+ROW(A51)-3),INDEX(SCRIPTS!$C$3:$C$1048576,MATCH($G$2,SCRIPTS!$A$3:$A$1048576,0)+ROW(A51)-3),\"\")","v":""}]
[{"$f":"IF($G$2=INDEX(SCRIPTS!$A$3:$A$1048576,MATCH($G$2,SCRIPTS!$A$3:$A$1048576,0)+ROW(A52)-3),INDEX(SCRIPTS!$B$3:$B$1048576,MATCH($G$2,SCRIPTS!$A$3:$A$1048576,0)+ROW(A52)-3),\"\")","v":""},{"$f":"IF($G$2=INDEX(SCRIPTS!$A$3:$A$1048576,MATCH($G$2,SCRIPTS!$A$3:$A$1048576,0)+ROW(A52)-3),INDEX(SCRIPTS!$C$3:$C$1048576,MATCH($G$2,SCRIPTS!$A$3:$A$1048576,0)+ROW(A52)-3),\"\")","v":""}]
[{"$f":"IF($G$2=INDEX(SCRIPTS!$A$3:$A$1048576,MATCH($G$2,SCRIPTS!$A$3:$A$1048576,0)+ROW(A53)-3),INDEX(SCRIPTS!$B$3:$B$1048576,MATCH($G$2,SCRIPTS!$A$3:$A$1048576,0)+ROW(A53)-3),\"\")","v":""},{"$f":"IF($G$2=INDEX(SCRIPTS!$A$3:$A$1048576,MATCH($G$2,SCRIPTS!$A$3:$A$1048576,0)+ROW(A53)-3),INDEX(SCRIPTS!$C$3:$C$1048576,MATCH($G$2,SCRIPTS!$A$3:$A$1048576,0)+ROW(A53)-3),\"\")","v":""}]
[{"$f":"IF($G$2=INDEX(SCRIPTS!$A$3:$A$1048576,MATCH($G$2,SCRIPTS!$A$3:$A$1048576,0)+ROW(A54)-3),INDEX(SCRIPTS!$B$3:$B$1048576,MATCH($G$2,SCRIPTS!$A$3:$A$1048576,0)+ROW(A54)-3),\"\")","v":""},{"$f":"IF($G$2=INDEX(SCRIPTS!$A$3:$A$1048576,MATCH($G$2,SCRIPTS!$A$3:$A$1048576,0)+ROW(A54)-3),INDEX(SCRIPTS!$C$3:$C$1048576,MATCH($G$2,SCRIPTS!$A$3:$A$1048576,0)+ROW(A54)-3),\"\")","v":""}]
[{"$f":"IF($G$2=INDEX(SCRIPTS!$A$3:$A$1048576,MATCH($G$2,SCRIPTS!$A$3:$A$1048576,0)+ROW(A55)-3),INDEX(SCRIPTS!$B$3:$B$1048576,MATCH($G$2,SCRIPTS!$A$3:$A$1048576,0)+ROW(A55)-3),\"\")","v":""},{"$f":"IF($G$2=INDEX(SCRIPTS!$A$3:$A$1048576,MATCH($G$2,SCRIPTS!$A$3:$A$1048576,0)+ROW(A55)-3),INDEX(SCRIPTS!$C$3:$C$1048576,MATCH($G$2,SCRIPTS!$A$3:$A$1048576,0)+ROW(A55)-3),\"\")","v":""}]
[{"$f":"IF($G$2=INDEX(SCRIPTS!$A$3:$A$1048576,MATCH($G$2,SCRIPTS!$A$3:$A$1048576,0)+ROW(A56)-3),INDEX(SCRIPTS!$B$3:$B$1048576,MATCH($G$2,SCRIPTS!$A$3:$A$1048576,0)+ROW(A56)-3),\"\")","v":""},{"$f":"IF($G$2=INDEX(SCRIPTS!$A$3:$A$1048576,MATCH($G$2,SCRIPTS!$A$3:$A$1048576,0)+ROW(A56)-3),INDEX(SCRIPTS!$C$3:$C$1048576,MATCH($G$2,SCRIPTS!$A$3:$A$1048576,0)+ROW(A56)-3),\"\")","v":""}]
[{"$f":"IF($G$2=INDEX(SCRIPTS!$A$3:$A$1048576,MATCH($G$2,SCRIPTS!$A$3:$A$1048576,0)+ROW(A57)-3),INDEX(SCRIPTS!$B$3:$B$1048576,MATCH($G$2,SCRIPTS!$A$3:$A$1048576,0)+ROW(A57)-3),\"\")","v":""},{"$f":"IF($G$2=INDEX(SCRIPTS!$A$3:$A$1048576,MATCH($G$2,SCRIPTS!$A$3:$A$1048576,0)+ROW(A57)-3),INDEX(SCRIPTS!$C$3:$C$1048576,MATCH($G$2,SCRIPTS!$A$3:$A$1048576,0)+ROW(A57)-3),\"\")","v":""}]
[{"$f":"IF($G$2=INDEX(SCRIPTS!$A$3:$A$1048576,MATCH($G$2,SCRIPTS!$A$3:$A$1048576,0)+ROW(A58)-3),INDEX(SCRIPTS!$B$3:$B$1048576,MATCH($G$2,SCRIPTS!$A$3:$A$1048576,0)+ROW(A58)-3),\"\")","v":""},{"$f":"IF($G$2=INDEX(SCRIPTS!$A$3:$A$1048576,MATCH($G$2,SCRIPTS!$A$3:$A$1048576,0)+ROW(A58)-3),INDEX(SCRIPTS!$C$3:$C$1048576,MATCH($G$2,SCRIPTS!$A$3:$A$1048576,0)+ROW(A58)-3),\"\")","v":""}]
[{"$f":"IF($G$2=INDEX(SCRIPTS!$A$3:$A$1048576,MATCH($G$2,SCRIPTS!$A$3:$A$1048576,0)+ROW(A59)-3),INDEX(SCRIPTS!$B$3:$B$1048576,MATCH($G$2,SCRIPTS!$A$3:$A$1048576,0)+ROW(A59)-3),\"\")","v":""},{"$f":"IF($G$2=INDEX(SCRIPTS!$A$3:$A$1048576,MATCH($G$2,SCRIPTS!$A$3:$A$1048576,0)+ROW(A59)-3),INDEX(SCRIPTS!$C$3:$C$1048576,MATCH($G$2,SCRIPTS!$A$3:$A$1048576,0)+ROW(A59)-3),\"\")","v":""}]
[{"$f":"IF($G$2=INDEX(SCRIPTS!$A$3:$A$1048576,MATCH($G$2,SCRIPTS!$A$3:$A$1048576,0)+ROW(A60)-3),INDEX(SCRIPTS!$B$3:$B$1048576,MATCH($G$2,SCRIPTS!$A$3:$A$1048576,0)+ROW(A60)-3),\"\")","v":""},{"$f":"IF($G$2=INDEX(SCRIPTS!$A$3:$A$1048576,MATCH($G$2,SCRIPTS!$A$3:$A$1048576,0)+ROW(A60)-3),INDEX(SCRIPTS!$C$3:$C$1048576,MATCH($G$2,SCRIPTS!$A$3:$A$1048576,0)+ROW(A60)-3),\"\")","v":""}]
{"$rows_left_out":340}