{"text_format":"1","workbook":"xlsx","n_sheets":2,"sheets":["FACTURE","Source jeu"],"not_rendered":{"charts":0,"images":2,"macros":1,"external_links":0,"defined_names":9,"comments":0,"pivot_tables":0},"unopened":[],"bounds":{"document_bytes":16777216,"sheet_cells":100000,"rows_first":2000,"rows_last":500,"rows_between":2000,"halvings":0,"cell_chars":16384,"cell_head_chars":4096},"cells_cut":0,"cells_raw":0,"read":"whole","date_system":"1900"}

{"sheet":"FACTURE","index":0,"n_rows":28,"n_cols":20,"rows_kept":28,"cut":false,"hidden":false,"merged":[[24,16,24,17],[25,16,25,17],[26,16,26,17],[19,16,19,17],[20,16,20,17],[21,16,21,17],[22,16,22,17],[23,16,23,17],[14,16,14,17],[15,16,15,17],[16,16,16,17],[17,16,17,17],[18,16,18,17],[24,6,24,11],[25,6,25,11],[26,6,26,11],[14,13,14,14],[15,13,15,14],[16,13,16,14],[17,13,17,14],[18,13,18,14],[19,13,19,14],[20,13,20,14],[21,13,21,14],[22,13,22,14],[23,13,23,14],[24,13,24,14],[25,13,25,14],[26,13,26,14],[19,6,19,11],[20,6,20,11],[21,6,21,11],[22,6,22,11],[23,6,23,11],[14,6,14,11],[15,6,15,11],[16,6,16,11],[17,6,17,11],[18,6,18,11],[25,0,25,1],[26,0,26,1],[14,3,14,4],[15,3,15,4],[16,3,16,4],[17,3,17,4],[18,3,18,4],[19,3,19,4],[20,3,20,4],[21,3,21,4],[22,3,22,4],[23,3,23,4],[24,3,24,4],[25,3,25,4],[26,3,26,4],[20,0,20,1],[21,0,21,1],[22,0,22,1],[23,0,23,1],[24,0,24,1],[27,16,27,17],[3,13,6,19],[12,0,12,1],[12,3,12,4],[12,16,12,17],[12,6,12,11],[12,13,12,14],[1,6,8,11],[10,0,10,6],[8,13,8,17],[14,0,14,1],[15,0,15,1],[16,0,16,1],[17,0,17,1],[18,0,18,1],[19,0,19,1]]}
[]
[null,null,null,null,null,null,"Le Petit Joueur\n\n06 \nFrance\n\nTel: 06 24 71 72 72\nmail: lepetitjoueur06@gmail.com\nweb: www.lepetitjoueur.fr\n"]
[]
[null,null,null,null,null,null,null,null,null,null,null,null,null,"Nom Prénom"]
[]
[]
[]
[]
[null,null,null,null,null,null,null,null,null,null,null,null,null,"DATE"]
[]
["facture:"]
[]
["reference",null,null,"nbr",null,null,"denomination",null,null,null,null,null,null,"prix unit.",null,null,"prix total",null,null,"tva"]
[]
[null,null,null,null,null,null,null,null,null,null,null,null,null,null,null,null,{"$f":"D15*N15","v":0},null,null,0]
[null,null,null,null,null,null,null,null,null,null,null,null,null,null,null,null,{"$f":"D16*N16","v":0}]
[null,null,null,null,null,null,null,null,null,null,null,null,null,null,null,null,{"$f":"D17*N17","v":0},null,null,0]
[null,null,null,null,null,null,null,null,null,null,null,null,null,null,null,null,{"$f":"D18*N18","v":0}]
[null,null,null,null,null,null,null,null,null,null,null,null,null,null,null,null,{"$f":"D19*N19","v":0},null,null,0]
[null,null,null,null,null,null,null,null,null,null,null,null,null,null,null,null,{"$f":"D20*N20","v":0}]
[null,null,null,null,null,null,null,null,null,null,null,null,null,null,null,null,{"$f":"D21*N21","v":0},null,null,0]
[null,null,null,null,null,null,null,null,null,null,null,null,null,null,null,null,{"$f":"D22*N22","v":0}]
[null,null,null,null,null,null,null,null,null,null,null,null,null,null,null,null,{"$f":"D23*N23","v":0},null,null,0]
[null,null,null,null,null,null,null,null,null,null,null,null,null,null,null,null,{"$f":"D24*N24","v":0}]
[null,null,null,null,null,null,null,null,null,null,null,null,null,null,null,null,{"$f":"D25*N25","v":0},null,null,0]
[null,null,null,null,null,null,null,null,null,null,null,null,null,null,null,null,{"$f":"D26*N26","v":0}]
[null,null,null,null,null,null,null,null,null,null,null,null,null,null,null,null,{"$f":"D27*N27","v":0},null,null,0]
[{"$f":"IF(ISBLANK(G28),\"\",VLOOKUP(G28,'Source jeu'!$B$3:$D$113,2,FALSE))","v":""},null,null,null,null,null,null,null,null,null,null,null,null,"TOTAL",null,null,{"$f":"SUM(Q15:Q27)","v":0}]

{"sheet":"Source jeu","index":1,"n_rows":501,"n_cols":9,"rows_kept":501,"cut":false,"hidden":false,"merged":[]}
[null,null,null,null,null,null,null,{"$f":"$I$3:INDEX($I$3:$I$501,MAX($H$3:$H$501),1)","v":{"$error":"#VALUE!"}}]
["CHERCHE","JEUX","REF","PRIX","Editeur","Distributeur","Match","Position","Grouper"]
[{"$f":"B3","v":"7 wonders"},"7 wonders","LPJ7WON",38.9,"Repos Production","Asmodée",{"$f":"--ISNUMBER(IFERROR(SEARCH(FACTURE!$G$15,'Source jeu'!$B$3:$B$501,1),\"\"))","v":1},{"$f":"IF(G3=1,COUNTIF($G$3:$G$3,1),\"\")","v":1},{"$f":"IFERROR(INDEX(JEUX,MATCH(ROWS($H$3:$H$3),Position,0)),\"\")","v":"7 wonders"}]
["Alhambra","Alhambra","LPJALHA",29.9,"Queen Games","Atalia",{"$f":"--ISNUMBER(IFERROR(SEARCH(FACTURE!$G$15,'Source jeu'!$B$3:$B$501,1),\"\"))","v":1},{"$f":"IF(G4=1,COUNTIF($G$3:G4,1),\"\")","v":2},{"$f":"IFERROR(INDEX(JEUX,MATCH(ROWS($H$3:H4),Position,0)),\"\")","v":"Alhambra"}]
["Andor","Andor","LPJANDO",23.5,"Kosmos","Iello",{"$f":"--ISNUMBER(IFERROR(SEARCH(FACTURE!$G$15,'Source jeu'!$B$3:$B$501,1),\"\"))","v":1},{"$f":"IF(G5=1,COUNTIF($G$3:G5,1),\"\")","v":3},{"$f":"IFERROR(INDEX(JEUX,MATCH(ROWS($H$3:H5),Position,0)),\"\")","v":"Andor"}]
["Andor: Chada & Thorn","Andor: Chada & Thorn","LPJANDCT",17.899999999999999,"Kosmos","Iello",{"$f":"--ISNUMBER(IFERROR(SEARCH(FACTURE!$G$15,'Source jeu'!$B$3:$B$501,1),\"\"))","v":1},{"$f":"IF(G6=1,COUNTIF($G$3:G6,1),\"\")","v":4},{"$f":"IFERROR(INDEX(JEUX,MATCH(ROWS($H$3:H6),Position,0)),\"\")","v":"Andor: Chada & Thorn"}]
["Andor: le dernier espoir","Andor: le dernier espoir","LPJANDDE",43.5,"Kosmos","Iello",{"$f":"--ISNUMBER(IFERROR(SEARCH(FACTURE!$G$15,'Source jeu'!$B$3:$B$501,1),\"\"))","v":1},{"$f":"IF(G7=1,COUNTIF($G$3:G7,1),\"\")","v":5},{"$f":"IFERROR(INDEX(JEUX,MATCH(ROWS($H$3:H7),Position,0)),\"\")","v":"Andor: le dernier espoir"}]
["Andor: Voyage vers le Nord","Andor: Voyage vers le Nord","NPJANDVN",39.9,"Kosmos","Iello",{"$f":"--ISNUMBER(IFERROR(SEARCH(FACTURE!$G$15,'Source jeu'!$B$3:$B$501,1),\"\"))","v":1},{"$f":"IF(G8=1,COUNTIF($G$3:G8,1),\"\")","v":6},{"$f":"IFERROR(INDEX(JEUX,MATCH(ROWS($H$3:H8),Position,0)),\"\")","v":"Andor: Voyage vers le Nord"}]
["Atlandice","Atlandice","LPJATL",24.9,"Ludonaute","Asmodée",{"$f":"--ISNUMBER(IFERROR(SEARCH(FACTURE!$G$15,'Source jeu'!$B$3:$B$501,1),\"\"))","v":1},{"$f":"IF(G9=1,COUNTIF($G$3:G9,1),\"\")","v":7},{"$f":"IFERROR(INDEX(JEUX,MATCH(ROWS($H$3:H9),Position,0)),\"\")","v":"Atlandice"}]
["Azul","Azul","LPJAZUL",35.9,"Plan B Games","Novalis",{"$f":"--ISNUMBER(IFERROR(SEARCH(FACTURE!$G$15,'Source jeu'!$B$3:$B$501,1),\"\"))","v":1},{"$f":"IF(G10=1,COUNTIF($G$3:G10,1),\"\")","v":8},{"$f":"IFERROR(INDEX(JEUX,MATCH(ROWS($H$3:H10),Position,0)),\"\")","v":"Azul"}]
["Azul: Les vitraux de Cintra","Azul: Les vitraux de Cintra","LPJAZULVC",35.9,"Plan B Games","Novalis",{"$f":"--ISNUMBER(IFERROR(SEARCH(FACTURE!$G$15,'Source jeu'!$B$3:$B$501,1),\"\"))","v":1},{"$f":"IF(G11=1,COUNTIF($G$3:G11,1),\"\")","v":9},{"$f":"IFERROR(INDEX(JEUX,MATCH(ROWS($H$3:H11),Position,0)),\"\")","v":"Azul: Les vitraux de Cintra"}]
["Bad bones","Bad bones","LPJBADB",43.9,"Sit Down","Atalia",{"$f":"--ISNUMBER(IFERROR(SEARCH(FACTURE!$G$15,'Source jeu'!$B$3:$B$501,1),\"\"))","v":1},{"$f":"IF(G12=1,COUNTIF($G$3:G12,1),\"\")","v":10},{"$f":"IFERROR(INDEX(JEUX,MATCH(ROWS($H$3:H12),Position,0)),\"\")","v":"Bad bones"}]
["Baobab","Baobab","LPJBAOB",14.5,"Blue Orange","Blackrock Games",{"$f":"--ISNUMBER(IFERROR(SEARCH(FACTURE!$G$15,'Source jeu'!$B$3:$B$501,1),\"\"))","v":1},{"$f":"IF(G13=1,COUNTIF($G$3:G13,1),\"\")","v":11},{"$f":"IFERROR(INDEX(JEUX,MATCH(ROWS($H$3:H13),Position,0)),\"\")","v":"Baobab"}]
["Battle Sheep","Battle Sheep","LPJBATSH",23,"Blue Orange","Blackrock Games",{"$f":"--ISNUMBER(IFERROR(SEARCH(FACTURE!$G$15,'Source jeu'!$B$3:$B$501,1),\"\"))","v":1},{"$f":"IF(G14=1,COUNTIF($G$3:G14,1),\"\")","v":12},{"$f":"IFERROR(INDEX(JEUX,MATCH(ROWS($H$3:H14),Position,0)),\"\")","v":"Battle Sheep"}]
["Blanc Manger Coco","Blanc Manger Coco","LPJBMC",26.9,"Hiboutatillus","Hiboutatillus",{"$f":"--ISNUMBER(IFERROR(SEARCH(FACTURE!$G$15,'Source jeu'!$B$3:$B$501,1),\"\"))","v":1},{"$f":"IF(G15=1,COUNTIF($G$3:G15,1),\"\")","v":13},{"$f":"IFERROR(INDEX(JEUX,MATCH(ROWS($H$3:H15),Position,0)),\"\")","v":"Blanc Manger Coco"}]
["Bunny Kingdom","Bunny Kingdom","LPJBUNKGD",40.5,"Iello","Iello",{"$f":"--ISNUMBER(IFERROR(SEARCH(FACTURE!$G$15,'Source jeu'!$B$3:$B$501,1),\"\"))","v":1},{"$f":"IF(G16=1,COUNTIF($G$3:G16,1),\"\")","v":14},{"$f":"IFERROR(INDEX(JEUX,MATCH(ROWS($H$3:H16),Position,0)),\"\")","v":"Bunny Kingdom"}]
["Carta Impera Victoria","Carta Impera Victoria","LPJCARIV",17.899999999999999,"Ludonaute","Blackrock Games",{"$f":"--ISNUMBER(IFERROR(SEARCH(FACTURE!$G$15,'Source jeu'!$B$3:$B$501,1),\"\"))","v":1},{"$f":"IF(G17=1,COUNTIF($G$3:G17,1),\"\")","v":15},{"$f":"IFERROR(INDEX(JEUX,MATCH(ROWS($H$3:H17),Position,0)),\"\")","v":"Carta Impera Victoria"}]
["Celestia","Celestia","LPJCELES",21.9,null,null,{"$f":"--ISNUMBER(IFERROR(SEARCH(FACTURE!$G$15,'Source jeu'!$B$3:$B$501,1),\"\"))","v":1},{"$f":"IF(G18=1,COUNTIF($G$3:G18,1),\"\")","v":16},{"$f":"IFERROR(INDEX(JEUX,MATCH(ROWS($H$3:H18),Position,0)),\"\")","v":"Celestia"}]
["Cerbere","Cerbere","LPJCERB",31.5,null,null,{"$f":"--ISNUMBER(IFERROR(SEARCH(FACTURE!$G$15,'Source jeu'!$B$3:$B$501,1),\"\"))","v":1},{"$f":"IF(G19=1,COUNTIF($G$3:G19,1),\"\")","v":17},{"$f":"IFERROR(INDEX(JEUX,MATCH(ROWS($H$3:H19),Position,0)),\"\")","v":"Cerbere"}]
["C'est toute la question","C'est toute la question","LPJCTLQ",17.899999999999999,null,null,{"$f":"--ISNUMBER(IFERROR(SEARCH(FACTURE!$G$15,'Source jeu'!$B$3:$B$501,1),\"\"))","v":1},{"$f":"IF(G20=1,COUNTIF($G$3:G20,1),\"\")","v":18},{"$f":"IFERROR(INDEX(JEUX,MATCH(ROWS($H$3:H20),Position,0)),\"\")","v":"C'est toute la question"}]
["Chakra","Chakra","LPJCHAK",19.899999999999999,null,null,{"$f":"--ISNUMBER(IFERROR(SEARCH(FACTURE!$G$15,'Source jeu'!$B$3:$B$501,1),\"\"))","v":1},{"$f":"IF(G21=1,COUNTIF($G$3:G21,1),\"\")","v":19},{"$f":"IFERROR(INDEX(JEUX,MATCH(ROWS($H$3:H21),Position,0)),\"\")","v":"Chakra"}]
["Chasseurs de Trésors","Chasseurs de Trésors","LPJCHATR",27,null,null,{"$f":"--ISNUMBER(IFERROR(SEARCH(FACTURE!$G$15,'Source jeu'!$B$3:$B$501,1),\"\"))","v":1},{"$f":"IF(G22=1,COUNTIF($G$3:G22,1),\"\")","v":20},{"$f":"IFERROR(INDEX(JEUX,MATCH(ROWS($H$3:H22),Position,0)),\"\")","v":"Chasseurs de Trésors"}]
["Chronicles of Crimes","Chronicles of Crimes","LPJCHROC",26.9,null,null,{"$f":"--ISNUMBER(IFERROR(SEARCH(FACTURE!$G$15,'Source jeu'!$B$3:$B$501,1),\"\"))","v":1},{"$f":"IF(G23=1,COUNTIF($G$3:G23,1),\"\")","v":21},{"$f":"IFERROR(INDEX(JEUX,MATCH(ROWS($H$3:H23),Position,0)),\"\")","v":"Chronicles of Crimes"}]
["Clank!","Clank!","LPJCLANK",44.9,null,null,{"$f":"--ISNUMBER(IFERROR(SEARCH(FACTURE!$G$15,'Source jeu'!$B$3:$B$501,1),\"\"))","v":1},{"$f":"IF(G24=1,COUNTIF($G$3:G24,1),\"\")","v":22},{"$f":"IFERROR(INDEX(JEUX,MATCH(ROWS($H$3:H24),Position,0)),\"\")","v":"Clank!"}]
["Clash of Rages","Clash of Rages","LPJCLSHFR",89.9,null,null,{"$f":"--ISNUMBER(IFERROR(SEARCH(FACTURE!$G$15,'Source jeu'!$B$3:$B$501,1),\"\"))","v":1},{"$f":"IF(G25=1,COUNTIF($G$3:G25,1),\"\")","v":23},{"$f":"IFERROR(INDEX(JEUX,MATCH(ROWS($H$3:H25),Position,0)),\"\")","v":"Clash of Rages"}]
["Codenames","Codenames","LPJCODN",17.899999999999999,null,null,{"$f":"--ISNUMBER(IFERROR(SEARCH(FACTURE!$G$15,'Source jeu'!$B$3:$B$501,1),\"\"))","v":1},{"$f":"IF(G26=1,COUNTIF($G$3:G26,1),\"\")","v":24},{"$f":"IFERROR(INDEX(JEUX,MATCH(ROWS($H$3:H26),Position,0)),\"\")","v":"Codenames"}]
["Codenames Duo","Codenames Duo","LPJCODND",17.899999999999999,null,null,{"$f":"--ISNUMBER(IFERROR(SEARCH(FACTURE!$G$15,'Source jeu'!$B$3:$B$501,1),\"\"))","v":1},{"$f":"IF(G27=1,COUNTIF($G$3:G27,1),\"\")","v":25},{"$f":"IFERROR(INDEX(JEUX,MATCH(ROWS($H$3:H27),Position,0)),\"\")","v":"Codenames Duo"}]
["Colt express","Colt express","LPJCOLTEX",26.9,null,null,{"$f":"--ISNUMBER(IFERROR(SEARCH(FACTURE!$G$15,'Source jeu'!$B$3:$B$501,1),\"\"))","v":1},{"$f":"IF(G28=1,COUNTIF($G$3:G28,1),\"\")","v":26},{"$f":"IFERROR(INDEX(JEUX,MATCH(ROWS($H$3:H28),Position,0)),\"\")","v":"Colt express"}]
["Concept","Concept","LPJCONCPT",27,null,null,{"$f":"--ISNUMBER(IFERROR(SEARCH(FACTURE!$G$15,'Source jeu'!$B$3:$B$501,1),\"\"))","v":1},{"$f":"IF(G29=1,COUNTIF($G$3:G29,1),\"\")","v":27},{"$f":"IFERROR(INDEX(JEUX,MATCH(ROWS($H$3:H29),Position,0)),\"\")","v":"Concept"}]
["Cortex","Cortex","LPJCORTEX",13.5,null,null,{"$f":"--ISNUMBER(IFERROR(SEARCH(FACTURE!$G$15,'Source jeu'!$B$3:$B$501,1),\"\"))","v":1},{"$f":"IF(G30=1,COUNTIF($G$3:G30,1),\"\")","v":28},{"$f":"IFERROR(INDEX(JEUX,MATCH(ROWS($H$3:H30),Position,0)),\"\")","v":"Cortex"}]
["Dany","Dany","LPJDANY",15.9,null,null,{"$f":"--ISNUMBER(IFERROR(SEARCH(FACTURE!$G$15,'Source jeu'!$B$3:$B$501,1),\"\"))","v":1},{"$f":"IF(G31=1,COUNTIF($G$3:G31,1),\"\")","v":29},{"$f":"IFERROR(INDEX(JEUX,MATCH(ROWS($H$3:H31),Position,0)),\"\")","v":"Dany"}]
["Detective","Detective","LPJDETCT",39.9,null,null,{"$f":"--ISNUMBER(IFERROR(SEARCH(FACTURE!$G$15,'Source jeu'!$B$3:$B$501,1),\"\"))","v":1},{"$f":"IF(G32=1,COUNTIF($G$3:G32,1),\"\")","v":30},{"$f":"IFERROR(INDEX(JEUX,MATCH(ROWS($H$3:H32),Position,0)),\"\")","v":"Detective"}]
["Diamant","Diamant","LPJDIAMT",22.5,null,null,{"$f":"--ISNUMBER(IFERROR(SEARCH(FACTURE!$G$15,'Source jeu'!$B$3:$B$501,1),\"\"))","v":1},{"$f":"IF(G33=1,COUNTIF($G$3:G33,1),\"\")","v":31},{"$f":"IFERROR(INDEX(JEUX,MATCH(ROWS($H$3:H33),Position,0)),\"\")","v":"Diamant"}]
["Dominion","Dominion","LPJDOMIN",40.5,null,null,{"$f":"--ISNUMBER(IFERROR(SEARCH(FACTURE!$G$15,'Source jeu'!$B$3:$B$501,1),\"\"))","v":1},{"$f":"IF(G34=1,COUNTIF($G$3:G34,1),\"\")","v":32},{"$f":"IFERROR(INDEX(JEUX,MATCH(ROWS($H$3:H34),Position,0)),\"\")","v":"Dominion"}]
["DownForce","DownForce","LPJDOWNF",28.9,null,null,{"$f":"--ISNUMBER(IFERROR(SEARCH(FACTURE!$G$15,'Source jeu'!$B$3:$B$501,1),\"\"))","v":1},{"$f":"IF(G35=1,COUNTIF($G$3:G35,1),\"\")","v":33},{"$f":"IFERROR(INDEX(JEUX,MATCH(ROWS($H$3:H35),Position,0)),\"\")","v":"DownForce"}]
["Draftausorus","Draftausorus","LPJDRAFTS",17.899999999999999,null,null,{"$f":"--ISNUMBER(IFERROR(SEARCH(FACTURE!$G$15,'Source jeu'!$B$3:$B$501,1),\"\"))","v":1},{"$f":"IF(G36=1,COUNTIF($G$3:G36,1),\"\")","v":34},{"$f":"IFERROR(INDEX(JEUX,MATCH(ROWS($H$3:H36),Position,0)),\"\")","v":"Draftausorus"}]
["Exit: La Cabane Abandonnée","Exit: La Cabane Abandonnée","LPJEXTCA",12.5,null,null,{"$f":"--ISNUMBER(IFERROR(SEARCH(FACTURE!$G$15,'Source jeu'!$B$3:$B$501,1),\"\"))","v":1},{"$f":"IF(G37=1,COUNTIF($G$3:G37,1),\"\")","v":35},{"$f":"IFERROR(INDEX(JEUX,MATCH(ROWS($H$3:H37),Position,0)),\"\")","v":"Exit: La Cabane Abandonnée"}]
["Exit: Le Cadavre de l'Orient Express","Exit: Le Cadavre de l'Orient Express","LPJEXTCO",12.5,null,null,{"$f":"--ISNUMBER(IFERROR(SEARCH(FACTURE!$G$15,'Source jeu'!$B$3:$B$501,1),\"\"))","v":1},{"$f":"IF(G38=1,COUNTIF($G$3:G38,1),\"\")","v":36},{"$f":"IFERROR(INDEX(JEUX,MATCH(ROWS($H$3:H38),Position,0)),\"\")","v":"Exit: Le Cadavre de l'Orient Express"}]
["Exit: Le laboratoire secret","Exit: Le laboratoire secret","LPJEXTLS",12.5,null,null,{"$f":"--ISNUMBER(IFERROR(SEARCH(FACTURE!$G$15,'Source jeu'!$B$3:$B$501,1),\"\"))","v":1},{"$f":"IF(G39=1,COUNTIF($G$3:G39,1),\"\")","v":37},{"$f":"IFERROR(INDEX(JEUX,MATCH(ROWS($H$3:H39),Position,0)),\"\")","v":"Exit: Le laboratoire secret"}]
["Exploding Kitten","Exploding Kitten","LPJEXPLDG",17.899999999999999,null,null,{"$f":"--ISNUMBER(IFERROR(SEARCH(FACTURE!$G$15,'Source jeu'!$B$3:$B$501,1),\"\"))","v":1},{"$f":"IF(G40=1,COUNTIF($G$3:G40,1),\"\")","v":38},{"$f":"IFERROR(INDEX(JEUX,MATCH(ROWS($H$3:H40),Position,0)),\"\")","v":"Exploding Kitten"}]
["Fairy Tile","Fairy Tile","LPJFAIRY",22.5,null,null,{"$f":"--ISNUMBER(IFERROR(SEARCH(FACTURE!$G$15,'Source jeu'!$B$3:$B$501,1),\"\"))","v":1},{"$f":"IF(G41=1,COUNTIF($G$3:G41,1),\"\")","v":39},{"$f":"IFERROR(INDEX(JEUX,MATCH(ROWS($H$3:H41),Position,0)),\"\")","v":"Fairy Tile"}]
["For sale","For sale","LPJFRSL",13.5,null,null,{"$f":"--ISNUMBER(IFERROR(SEARCH(FACTURE!$G$15,'Source jeu'!$B$3:$B$501,1),\"\"))","v":1},{"$f":"IF(G42=1,COUNTIF($G$3:G42,1),\"\")","v":40},{"$f":"IFERROR(INDEX(JEUX,MATCH(ROWS($H$3:H42),Position,0)),\"\")","v":"For sale"}]
["Fruit mix","Fruit mix","LPJFRTMX",14.5,null,null,{"$f":"--ISNUMBER(IFERROR(SEARCH(FACTURE!$G$15,'Source jeu'!$B$3:$B$501,1),\"\"))","v":1},{"$f":"IF(G43=1,COUNTIF($G$3:G43,1),\"\")","v":41},{"$f":"IFERROR(INDEX(JEUX,MATCH(ROWS($H$3:H43),Position,0)),\"\")","v":"Fruit mix"}]
["Galerapagos","Galerapagos","LPSGLRPGS",19.899999999999999,null,null,{"$f":"--ISNUMBER(IFERROR(SEARCH(FACTURE!$G$15,'Source jeu'!$B$3:$B$501,1),\"\"))","v":1},{"$f":"IF(G44=1,COUNTIF($G$3:G44,1),\"\")","v":42},{"$f":"IFERROR(INDEX(JEUX,MATCH(ROWS($H$3:H44),Position,0)),\"\")","v":"Galerapagos"}]
["Ghooost","Ghooost","LPSGHST",13.5,null,null,{"$f":"--ISNUMBER(IFERROR(SEARCH(FACTURE!$G$15,'Source jeu'!$B$3:$B$501,1),\"\"))","v":1},{"$f":"IF(G45=1,COUNTIF($G$3:G45,1),\"\")","v":43},{"$f":"IFERROR(INDEX(JEUX,MATCH(ROWS($H$3:H45),Position,0)),\"\")","v":"Ghooost"}]
["Giraffomètre","Giraffomètre","LPJGRFFM",18.899999999999999,null,null,{"$f":"--ISNUMBER(IFERROR(SEARCH(FACTURE!$G$15,'Source jeu'!$B$3:$B$501,1),\"\"))","v":1},{"$f":"IF(G46=1,COUNTIF($G$3:G46,1),\"\")","v":44},{"$f":"IFERROR(INDEX(JEUX,MATCH(ROWS($H$3:H46),Position,0)),\"\")","v":"Giraffomètre"}]
["Gravitrax","Gravitrax","LPJGRVTR",55.9,null,null,{"$f":"--ISNUMBER(IFERROR(SEARCH(FACTURE!$G$15,'Source jeu'!$B$3:$B$501,1),\"\"))","v":1},{"$f":"IF(G47=1,COUNTIF($G$3:G47,1),\"\")","v":45},{"$f":"IFERROR(INDEX(JEUX,MATCH(ROWS($H$3:H47),Position,0)),\"\")","v":"Gravitrax"}]
["Gravity Superstar","Gravity Superstar","LPJGRVTSP",26.9,null,null,{"$f":"--ISNUMBER(IFERROR(SEARCH(FACTURE!$G$15,'Source jeu'!$B$3:$B$501,1),\"\"))","v":1},{"$f":"IF(G48=1,COUNTIF($G$3:G48,1),\"\")","v":46},{"$f":"IFERROR(INDEX(JEUX,MATCH(ROWS($H$3:H48),Position,0)),\"\")","v":"Gravity Superstar"}]
["Greenville 1989","Greenville 1989","LPJGREEN",27,null,null,{"$f":"--ISNUMBER(IFERROR(SEARCH(FACTURE!$G$15,'Source jeu'!$B$3:$B$501,1),\"\"))","v":1},{"$f":"IF(G49=1,COUNTIF($G$3:G49,1),\"\")","v":47},{"$f":"IFERROR(INDEX(JEUX,MATCH(ROWS($H$3:H49),Position,0)),\"\")","v":"Greenville 1989"}]
["Gukimono","Gukimono","LPJGKMN",32.9,null,null,{"$f":"--ISNUMBER(IFERROR(SEARCH(FACTURE!$G$15,'Source jeu'!$B$3:$B$501,1),\"\"))","v":1},{"$f":"IF(G50=1,COUNTIF($G$3:G50,1),\"\")","v":48},{"$f":"IFERROR(INDEX(JEUX,MATCH(ROWS($H$3:H50),Position,0)),\"\")","v":"Gukimono"}]
["Héros à Louer","Héros à Louer","LPJHRSL",12,null,null,{"$f":"--ISNUMBER(IFERROR(SEARCH(FACTURE!$G$15,'Source jeu'!$B$3:$B$501,1),\"\"))","v":1},{"$f":"IF(G51=1,COUNTIF($G$3:G51,1),\"\")","v":49},{"$f":"IFERROR(INDEX(JEUX,MATCH(ROWS($H$3:H51),Position,0)),\"\")","v":"Héros à Louer"}]
["Icecool","Icecool","LPJICECO",31.5,null,null,{"$f":"--ISNUMBER(IFERROR(SEARCH(FACTURE!$G$15,'Source jeu'!$B$3:$B$501,1),\"\"))","v":1},{"$f":"IF(G52=1,COUNTIF($G$3:G52,1),\"\")","v":50},{"$f":"IFERROR(INDEX(JEUX,MATCH(ROWS($H$3:H52),Position,0)),\"\")","v":"Icecool"}]
["Icecool 2","Icecool 2","LPJICECO2",31.5,null,null,{"$f":"--ISNUMBER(IFERROR(SEARCH(FACTURE!$G$15,'Source jeu'!$B$3:$B$501,1),\"\"))","v":1},{"$f":"IF(G53=1,COUNTIF($G$3:G53,1),\"\")","v":51},{"$f":"IFERROR(INDEX(JEUX,MATCH(ROWS($H$3:H53),Position,0)),\"\")","v":"Icecool 2"}]
["Imhotep: Les Bâtisseurs d'Egypte","Imhotep: Les Bâtisseurs d'Egypte","LPJIMHT",40,null,null,{"$f":"--ISNUMBER(IFERROR(SEARCH(FACTURE!$G$15,'Source jeu'!$B$3:$B$501,1),\"\"))","v":1},{"$f":"IF(G54=1,COUNTIF($G$3:G54,1),\"\")","v":52},{"$f":"IFERROR(INDEX(JEUX,MATCH(ROWS($H$3:H54),Position,0)),\"\")","v":"Imhotep: Les Bâtisseurs d'Egypte"}]
["Jet Lag","Jet Lag","LPJJETLAG",13.5,null,null,{"$f":"--ISNUMBER(IFERROR(SEARCH(FACTURE!$G$15,'Source jeu'!$B$3:$B$501,1),\"\"))","v":1},{"$f":"IF(G55=1,COUNTIF($G$3:G55,1),\"\")","v":53},{"$f":"IFERROR(INDEX(JEUX,MATCH(ROWS($H$3:H55),Position,0)),\"\")","v":"Jet Lag"}]
["Just One","Just One","LPJJSTN",17.899999999999999,null,null,{"$f":"--ISNUMBER(IFERROR(SEARCH(FACTURE!$G$15,'Source jeu'!$B$3:$B$501,1),\"\"))","v":1},{"$f":"IF(G56=1,COUNTIF($G$3:G56,1),\"\")","v":54},{"$f":"IFERROR(INDEX(JEUX,MATCH(ROWS($H$3:H56),Position,0)),\"\")","v":"Just One"}]
["Kikafé","Kikafé","LPJKKF",8.5,null,null,{"$f":"--ISNUMBER(IFERROR(SEARCH(FACTURE!$G$15,'Source jeu'!$B$3:$B$501,1),\"\"))","v":1},{"$f":"IF(G57=1,COUNTIF($G$3:G57,1),\"\")","v":55},{"$f":"IFERROR(INDEX(JEUX,MATCH(ROWS($H$3:H57),Position,0)),\"\")","v":"Kikafé"}]
["King of Tokyo","King of Tokyo","LPJKNGFT",28.9,null,null,{"$f":"--ISNUMBER(IFERROR(SEARCH(FACTURE!$G$15,'Source jeu'!$B$3:$B$501,1),\"\"))","v":1},{"$f":"IF(G58=1,COUNTIF($G$3:G58,1),\"\")","v":56},{"$f":"IFERROR(INDEX(JEUX,MATCH(ROWS($H$3:H58),Position,0)),\"\")","v":"King of Tokyo"}]
["Kingdom Builder","Kingdom Builder","LPJKNGDB",35,null,null,{"$f":"--ISNUMBER(IFERROR(SEARCH(FACTURE!$G$15,'Source jeu'!$B$3:$B$501,1),\"\"))","v":1},{"$f":"IF(G59=1,COUNTIF($G$3:G59,1),\"\")","v":57},{"$f":"IFERROR(INDEX(JEUX,MATCH(ROWS($H$3:H59),Position,0)),\"\")","v":"Kingdom Builder"}]
["Kingdomino","Kingdomino","LPJKNGDM",17.5,null,null,{"$f":"--ISNUMBER(IFERROR(SEARCH(FACTURE!$G$15,'Source jeu'!$B$3:$B$501,1),\"\"))","v":1},{"$f":"IF(G60=1,COUNTIF($G$3:G60,1),\"\")","v":58},{"$f":"IFERROR(INDEX(JEUX,MATCH(ROWS($H$3:H60),Position,0)),\"\")","v":"Kingdomino"}]
{"$rows_left_out":441}