{"text_format":"1","workbook":"xlsx","n_sheets":8,"sheets":["Fiche_parcelle","Noms en colonnes","Feuil1","Adresse clean","Détail propriétaire","Etat complet","Propriétaires en tableau","Export Geomas"],"not_rendered":{"charts":0,"images":0,"macros":1,"external_links":0,"defined_names":5,"comments":0,"pivot_tables":0},"unopened":[],"bounds":{"document_bytes":16777216,"sheet_cells":100000,"rows_first":2000,"rows_last":500,"rows_between":2000,"halvings":0,"cell_chars":16384,"cell_head_chars":4096},"cells_cut":0,"cells_raw":0,"read":"whole","date_system":"1900"}

{"sheet":"Fiche_parcelle","index":0,"n_rows":3652,"n_cols":14,"rows_kept":3652,"cut":false,"hidden":false,"merged":[]}
["n0 p","Section","N° parcelle","Civilité","Nom de tous les propriétaires  (parcelle, BND, local)","Adresse de tous les propriétaires (parcelle, BND, local)","formule","nom de voie","code postal","ville",null,null,null,"Superficie"]
[1,"AP","10","Madame","A","Chemin des mimosas 04210 VILLE",{"$f":"SUMPRODUCT(ISNUMBER(MID(SUBSTITUTE(F2,\" \",\"|\"),ROW($1:$3552),5)*1)*ROW($1:$3552))","v":20},{"$f":"LEFT(F2,G2-1)","v":"Chemin des mimosas "},{"$f":"MID(F2,G2,5)","v":"04210"},{"$f":"MID(F2,G2+6,50)","v":"VILLE"},null,null,{"$f":"IF(E1=E2,CONCATENATE(M1,\",\",B2,C2),CONCATENATE(B2,C2))","v":"AP10"},388]
[{"$f":"IF(E2=E3,A2,A2+1)","v":2},"AP","10","Monsieur","B","Rue des Pâquerettes 04210 VILLE",21,"Rue des Pâquerettes ","04210","VILLE",null,null,{"$f":"IF(E2=E3,CONCATENATE(M2,\",\",B3,C3),CONCATENATE(B3,C3))","v":"AP10"},388]
[3,"AN","171","Monsieur","C","Boulevard des Lilas 04210 VILLE",21,"Boulevard des Lilas ","04210","VILLE",null,null,{"$f":"IF(E3=E4,CONCATENATE(M3,\",\",B4,C4),CONCATENATE(B4,C4))","v":"AN171"},515]
[4,"AP","115","Monsieur","D","Impasse des Champs 04210 VILLE",20,"Impasse des Champs ","04210","VILLE",null,null,{"$f":"IF(E4=E5,CONCATENATE(M4,\",\",B5,C5),CONCATENATE(B5,C5))","v":"AP115"},211]
[5,"AP","11","Société","E","Rue des Tilleuls 04210 VILLE",18,"Rue des Tilleuls ","04210","VILLE",null,null,{"$f":"CONCATENATE(B6,C6)","v":"AP11"},420]
[6,"D","1884","Madame","F","Place aux Roses 04210 VILLE",17,"Place aux Roses ","04210","VILLE",null,null,{"$f":"IF(E6=E7,CONCATENATE(M6,\",\",B7,C7),CONCATENATE(B7,C7))","v":"D1884"},604]
[6,"D","1885","Madame","F","Place aux Roses 04210 VILLE",17,"Place aux Roses ","04210","VILLE",null,null,"D1884,D1885",84]
[7,"AP","317","Madame","G","avenue Inconnue 04210 VILLE",17,"avenue Inconnue ","04210","VILLE",null,null,"AP317","1 135"]
[7,"D","3286","Madame","G","avenue Inconnue 04210 VILLE",17,"avenue Inconnue ","04210","VILLE",null,null,"AP317,D3286",480]
[7,"D","3287","Madame","G","avenue Inconnue 04210 VILLE",17,"avenue Inconnue ","04210","VILLE",null,null,"AP317,D3286,D3287",800]
[8,"AK","137","Monsieur","H","rue Sanom 04210 VILLE",11,"rue Sanom ","04210","VILLE",null,null,"AK137",477]
[8,"AK","140","Monsieur","H","rue Sanom 04210 VILLE",11,"rue Sanom ","04210","VILLE",null,null,"AK137,AK140",666]
[9,"AK","137","Monsieur","I","allée des Pins 04210 VILLE",16,"allée des Pins ","04210","VILLE",null,null,"AK137",477]
[9,"AK","140","Monsieur","I","allée des Pins 04210 VILLE",16,"allée des Pins ","04210","VILLE",null,null,"AK137,AK140",666]
[10,"AM","254","Société","J","place des Hêtres 04210 VILLE",18,"place des Hêtres ","04210","VILLE",null,null,"AM254",620]
[10,"AM","319","Société","J","place des Hêtres 04210 VILLE",18,"place des Hêtres ","04210","VILLE",null,null,"AM254,AM319",284]
[10,"AM","321","Société","J","place des Hêtres 04210 VILLE",18,"place des Hêtres ","04210","VILLE",null,null,"AM254,AM319,AM321",199]
[10,"AP","263","Société","J","place des Hêtres 04210 VILLE",18,"place des Hêtres ","04210","VILLE",null,null,"AM254,AM319,AM321,AP263",225]
[10,"AP","319","Société","J","place des Hêtres 04210 VILLE",18,"place des Hêtres ","04210","VILLE",null,null,"AM254,AM319,AM321,AP263,AP319",289]
[11,"AP","318","Madame","K","rue des Cyprès 04210 VILLE",16,"rue des Cyprès ","04210","VILLE",null,null,"AP318","1 048"]
[12,"AP","318","Monsieur","L","impasse fleurie 04210 VILLE",17,"impasse fleurie ","04210","VILLE",null,null,"AP318","1 048"]
[]
[]
[]
[]
[]
[]
[]
[]
[]
[]
[]
[]
[]
[]
[]
[]
[]
[]
[]
[]
[]
[]
[]
[]
[]
[]
[]
[]
[]
[]
[]
[]
[]
[]
[]
[]
[]
[]
[]
[]
[]
[]
[]
[]
[]
[]
[]
[]
[]
[]
[]
[]
[]
[]
[]
[]
[]
[]
[]
[]
[]
[]
[]
[]
[]
[]
[]
[]
[]
[]
[]
[]
[]
[]
[]
[]
[]
[]
[]
[]
[]
[]
[]
[]
[]
[]
[]
[]
[]
[]
[]
[]
[]
[]
[]
[]
[]
[]
[]
[]
[]
[]
[]
[]
[]
[]
[]
[]
[]
[]
[]
[]
[]
[]
[]
[]
[]
[]
[]
[]
[]
[]
[]
[]
[]
[]
[]
[]
[]
[]
[]
[]
[]
[]
[]
[]
[]
[]
[]
[]
[]
[]
[]
[]
[]
[]
[]
[]
[]
[]
[]
[]
[]
[]
[]
[]
[]
[]
[]
[]
[]
[]
[]
[]
[]
[]
[]
[]
[]
[]
[]
[]
[]
[]
[]
[]
[]
[]
[]
[]
[]
[]
[]
[]
[]
[]
[]
[]
[]
[]
[]
[]
[]
[]
[]
[]
[]
[]
[]
[]
[]
[]
[]
[]
[]
[]
[]
[]
[]
[]
[]
[]
[]
[]
[]
[]
[]
[]
[]
[]
[]
[]
[]
[]
[]
[]
[]
[]
[]
[]
[]
[]
[]
[]
[]
[]
[]
[]
[]
[]
[]
[]
[]
[]
[]
[]
[]
[]
[]
[]
[]
[]
[]
[]
[]
[]
[]
[]
[]
[]
[]
[]
[]
[]
[]
[]
[]
[]
[]
[]
[]
[]
[]
[]
[]
[]
[]
[]
[]
[]
[]
[]
[]
[]
[]
[]
[]
[]
[]
[]
[]
[]
[]
[]
[]
[]
[]
[]
[]
[]
[]
[]
[]
[]
[]
[]
[]
[]
[]
[]
[]
[]
[]
[]
[]
[]
[]
[]
[]
[]
[]
[]
[]
[]
[]
[]
[]
[]
[]
[]
[]
[]
[]
[]
[]
[]
[]
[]
[]
[]
[]
[]
[]
[]
[]
[]
[]
[]
[]
[]
[]
[]
[]
[]
[]
[]
[]
[]
[]
[]
[]
[]
[]
[]
[]
[]
[]
[]
[]
[]
[]
[]
[]
[]
[]
[]
[]
[]
[]
[]
[]
[]
[]
[]
[]
[]
[]
[]
[]
[]
[]
[]
[]
[]
[]
[]
[]
[]
[]
[]
[]
[]
[]
[]
[]
[]
[]
[]
[]
[]
[]
[]
[]
[]
[]
[]
[]
[]
[]
[]
[]
[]
[]
[]
[]
[]
[]
[]
[]
[]
[]
[]
[]
[]
[]
[]
[]
[]
[]
[]
[]
[]
[]
[]
[]
[]
[]
[]
[]
[]
[]
[]
[]
[]
[]
[]
[]
[]
[]
[]
[]
[]
[]
[]
[]
[]
[]
[]
[]
[]
[]
[]
[]
[]
[]
[]
[]
[]
[]
[]
[]
[]
[]
[]
[]
[]
[]
[]
[]
[]
[]
[]
[]
[]
[]
[]
[]
[]
[]
[]
[]
[]
[]
[]
[]
[]
[]
[]
[]
[]
[]
[]
[]
[]
[]
[]
[]
[]
[]
[]
[]
[]
[]
[]
[]
[]
[]
[]
[]
[]
[]
[]
[]
[]
[]
[]
[]
[]
[]
[]
[]
[]
[]
[]
[]
[]
[]
[]
[]
[]
[]
[]
[]
[]
[]
[]
[]
[]
[]
[]
[]
[]
[]
[]
[]
[]
[]
[]
[]
[]
[]
[]
[]
[]
[]
[]
[]
[]
[]
[]
[]
[]
[]
[]
[]
[]
[]
[]
[]
[]
[]
[]
[]
[]
[]
[]
[]
[]
[]
[]
[]
[]
[]
[]
[]
[]
[]
[]
[]
[]
[]
[]
[]
[]
[]
[]
[]
[]
[]
[]
[]
[]
[]
[]
[]
[]
[]
[]
[]
[]
[]
[]
[]
[]
[]
[]
[]
[]
[]
[]
[]
[]
[]
[]
[]
[]
[]
[]
[]
[]
[]
[]
[]
[]
[]
[]
[]
[]
[]
[]
[]
[]
[]
[]
[]
[]
[]
[]
[]
[]
[]
[]
[]
[]
[]
[]
[]
[]
[]
[]
[]
[]
[]
[]
[]
[]
[]
[]
[]
[]
[]
[]
[]
[]
[]
[]
[]
[]
[]
[]
[]
[]
[]
[]
[]
[]
[]
[]
[]
[]
[]
[]
[]
[]
[]
[]
[]
[]
[]
[]
[]
[]
[]
[]
[]
[]
[]
[]
[]
[]
[]
[]
[]
[]
[]
[]
[]
[]
[]
[]
[]
[]
[]
[]
[]
[]
[]
[]
[]
[]
[]
[]
[]
[]
[]
[]
[]
[]
[]
[]
[]
[]
[]
[]
[]
[]
[]
[]
[]
[]
[]
[]
[]
[]
[]
[]
[]
[]
[]
[]
[]
[]
[]
[]
[]
[]
[]
[]
[]
[]
[]
[]
[]
[]
[]
[]
[]
[]
[]
[]
[]
[]
[]
[]
[]
[]
[]
[]
[]
[]
[]
[]
[]
[]
[]
[]
[]
[]
[]
[]
[]
[]
[]
[]
[]
[]
[]
[]
[]
[]
[]
[]
[]
[]
[]
[]
[]
[]
[]
[]
[]
[]
[]
[]
[]
[]
[]
[]
[]
[]
[]
[]
[]
[]
[]
[]
[]
[]
[]
[]
[]
[]
[]
[]
[]
[]
[]
[]
[]
[]
[]
[]
[]
[]
[]
[]
[]
[]
[]
[]
[]
[]
[]
[]
[]
[]
[]
[]
[]
[]
[]
[]
[]
[]
[]
[]
[]
[]
[]
[]
[]
[]
[]
[]
[]
[]
[]
[]
[]
[]
[]
[]
[]
[]
[]
[]
[]
[]
[]
[]
[]
[]
[]
[]
[]
[]
[]
[]
[]
[]
[]
[]
[]
[]
[]
[]
[]
[]
[]
[]
[]
[]
[]
[]
[]
[]
[]
[]
[]
[]
[]
[]
[]
[]
[]
[]
[]
[]
[]
[]
[]
[]
[]
[]
[]
[]
[]
[]
[]
[]
[]
[]
[]
[]
[]
[]
[]
[]
[]
[]
[]
[]
[]
[]
[]
[]
[]
[]
[]
[]
[]
[]
[]
[]
[]
[]
[]
[]
[]
[]
[]
[]
[]
[]
[]
[]
[]
[]
[]
[]
[]
[]
[]
[]
[]
[]
[]
[]
[]
[]
[]
[]
[]
[]
[]
[]
[]
[]
[]
[]
[]
[]
[]
[]
[]
[]
[]
[]
[]
[]
[]
[]
[]
[]
[]
[]
[]
[]
[]
[]
[]
[]
[]
[]
[]
[]
[]
[]
[]
[]
[]
[]
[]
[]
[]
[]
[]
[]
[]
[]
[]
[]
[]
[]
[]
[]
[]
[]
[]
[]
[]
[]
[]
[]
[]
[]
[]
[]
[]
[]
[]
[]
[]
[]
[]
[]
[]
[]
[]
[]
[]
[]
[]
[]
[]
[]
[]
[]
[]
[]
[]
[]
[]
[]
[]
[]
[]
[]
[]
[]
[]
[]
[]
[]
[]
[]
[]
[]
[]
[]
[]
[]
[]
[]
[]
[]
[]
[]
[]
[]
[]
[]
[]
[]
[]
[]
[]
[]
[]
[]
[]
[]
[]
[]
[]
[]
[]
[]
[]
[]
[]
[]
[]
[]
[]
[]
[]
[]
[]
[]
[]
[]
[]
[]
[]
[]
[]
[]
[]
[]
[]
[]
[]
[]
[]
[]
[]
[]
[]
[]
[]
[]
[]
[]
[]
[]
[]
[]
[]
[]
[]
[]
[]
[]
[]
[]
[]
[]
[]
[]
[]
[]
[]
[]
[]
[]
[]
[]
[]
[]
[]
[]
[]
[]
[]
[]
[]
[]
[]
[]
[]
[]
[]
[]
[]
[]
[]
[]
[]
[]
[]
[]
[]
[]
[]
[]
[]
[]
[]
[]
[]
[]
[]
[]
[]
[]
[]
[]
[]
[]
[]
[]
[]
[]
[]
[]
[]
[]
[]
[]
[]
[]
[]
[]
[]
[]
[]
[]
[]
[]
[]
[]
[]
[]
[]
[]
[]
[]
[]
[]
[]
[]
[]
[]
[]
[]
[]
[]
[]
[]
[]
[]
[]
[]
[]
[]
[]
[]
[]
[]
[]
[]
[]
[]
[]
[]
[]
[]
[]
[]
[]
[]
[]
[]
[]
[]
[]
[]
[]
[]
[]
[]
[]
[]
[]
[]
[]
[]
[]
[]
[]
[]
[]
[]
[]
[]
[]
[]
[]
[]
[]
[]
[]
[]
[]
[]
[]
[]
[]
[]
[]
[]
[]
[]
[]
[]
[]
[]
[]
[]
[]
[]
[]
[]
[]
[]
[]
[]
[]
[]
[]
[]
[]
[]
[]
[]
[]
[]
[]
[]
[]
[]
[]
[]
[]
[]
[]
[]
[]
[]
[]
[]
[]
[]
[]
[]
[]
[]
[]
[]
[]
[]
[]
[]
[]
[]
[]
[]
[]
[]
[]
[]
[]
[]
[]
[]
[]
[]
[]
[]
[]
[]
[]
[]
[]
[]
[]
[]
[]
[]
[]
[]
[]
[]
[]
[]
[]
[]
[]
[]
[]
[]
[]
[]
[]
[]
[]
[]
[]
[]
[]
[]
[]
[]
[]
[]
[]
[]
[]
[]
[]
[]
[]
[]
[]
[]
[]
[]
[]
[]
[]
[]
[]
[]
[]
[]
[]
[]
[]
[]
[]
[]
[]
[]
[]
[]
[]
[]
[]
[]
[]
[]
[]
[]
[]
[]
[]
[]
[]
[]
[]
[]
[]
[]
[]
[]
[]
[]
[]
[]
[]
[]
[]
[]
[]
[]
[]
[]
[]
[]
[]
[]
[]
[]
[]
[]
[]
[]
[]
[]
[]
[]
[]
[]
[]
[]
[]
[]
[]
[]
[]
[]
[]
[]
[]
[]
[]
[]
[]
[]
[]
[]
[]
[]
[]
[]
[]
[]
[]
[]
[]
[]
[]
[]
[]
[]
[]
[]
[]
[]
[]
[]
[]
[]
[]
[]
[]
[]
[]
[]
[]
[]
[]
[]
[]
[]
[]
[]
[]
[]
[]
[]
[]
[]
[]
[]
[]
[]
[]
[]
[]
[]
[]
[]
[]
[]
[]
[]
[]
[]
[]
[]
[]
[]
[]
[]
[]
[]
[]
[]
[]
[]
[]
[]
[]
[]
[]
[]
[]
[]
[]
[]
[]
[]
[]
[]
[]
[]
[]
[]
[]
[]
[]
[]
[]
[]
[]
[]
[]
[]
[]
[]
[]
[]
[]
[]
[]
[]
[]
[]
[]
[]
[]
[]
[]
[]
[]
[]
[]
[]
[]
[]
[]
[]
[]
[]
[]
[]
[]
[]
[]
[]
[]
[]
[]
[]
[]
[]
[]
[]
[]
[]
[]
[]
[]
[]
[]
[]
[]
[]
[]
[]
[]
[]
[]
[]
[]
[]
[]
[]
[]
[]
[]
[]
[]
[]
[]
[]
[]
[]
[]
[]
[]
[]
[]
[]
[]
[]
[]
[]
[]
[]
[]
[]
[]
[]
[]
[]
[]
[]
[]
[]
[]
[]
[]
[]
[]
[]
[]
[]
[]
[]
[]
[]
[]
[]
[]
[]
[]
[]
[]
[]
[]
[]
[]
[]
[]
[]
[]
[]
[]
[]
[]
[]
[]
[]
[]
[]
[]
[]
[]
[]
[]
[]
[]
[]
[]
[]
[]
[]
[]
[]
[]
[]
[]
[]
[]
[]
[]
[]
[]
[]
[]
[]
[]
[]
[]
[]
[]
[]
[]
[]
[]
[]
[]
[]
[]
[]
[]
[]
[]
[]
[]
[]
[]
[]
[]
[]
[]
[]
[]
[]
[]
[]
[]
[]
[]
[]
[]
[]
[]
[]
[]
[]
[]
[]
[]
[]
[]
[]
[]
[]
[]
[]
[]
[]
[]
[]
[]
[]
[]
[]
[]
[]
[]
[]
[]
[]
[]
[]
[]
[]
[]
[]
[]
[]
[]
[]
[]
[]
[]
[]
[]
[]
[]
[]
[]
[]
[]
[]
[]
[]
[]
[]
[]
[]
[]
[]
[]
[]
[]
[]
[]
[]
[]
[]
[]
[]
[]
[]
[]
[]
[]
[]
[]
[]
[]
[]
[]
[]
[]
[]
[]
[]
[]
[]
[]
[]
[]
[]
[]
[]
[]
[]
[]
[]
[]
[]
[]
[]
[]
[]
[]
[]
[]
[]
[]
[]
[]
[]
[]
[]
[]
[]
[]
[]
[]
[]
[]
[]
[]
[]
[]
[]
[]
[]
[]
[]
[]
[]
[]
[]
[]
[]
[]
[]
[]
[]
[]
[]
[]
[]
[]
[]
[]
[]
[]
[]
[]
[]
[]
[]
[]
[]
[]
[]
[]
[]
[]
[]
[]
[]
[]
[]
[]
[]
[]
[]
[]
[]
[]
[]
[]
[]
[]
[]
[]
[]
[]
[]
[]
[]
[]
[]
[]
[]
[]
[]
[]
[]
[]
[]
[]
[]
[]
[]
[]
[]
[]
[]
[]
[]
[]
[]
[]
[]
[]
[]
[]
[]
[]
[]
[]
[]
[]
[]
[]
[]
[]
[]
[]
[]
[]
[]
[]
[]
[]
[]
[]
[]
[]
[]
[]
[]
[]
[]
[]
[]
[]
[]
[]
[]
[]
[]
[]
[]
[]
[]
[]
[]
[]
[]
[]
[]
[]
[]
[]
[]
[]
[]
[]
[]
[]
[]
[]
[]
[]
[]
[]
[]
[]
[]
[]
[]
[]
[]
[]
[]
[]
[]
[]
[]
[]
[]
[]
[]
[]
[]
[]
[]
[]
[]
[]
[]
[]
[]
[]
[]
[]
[]
[]
[]
[]
[]
[]
[]
[]
[]
[]
[]
[]
[]
[]
[]
[]
[]
[]
[]
[]
[]
[]
[]
[]
[]
[]
[]
[]
[]
[]
[]
[]
[]
[]
[]
[]
[]
[]
[]
[]
[]
[]
[]
[]
[]
[]
[]
[]
[]
[]
[]
[]
[]
[]
[]
[]
[]
[]
[]
[]
[]
[]
[]
[]
[]
[]
[]
[]
[]
[]
[]
[]
[]
[]
[]
[]
[]
[]
[]
[]
[]
[]
[]
[]
[]
[]
[]
[]
[]
[]
[]
[]
[]
[]
[]
[]
[]
[]
[]
[]
[]
[]
[]
[]
[]
[]
[]
[]
[]
[]
[]
[]
[]
[]
[]
[]
[]
[]
[]
[]
[]
[]
[]
[]
[]
[]
[]
[]
[]
[]
[]
[]
[]
[]
[]
[]
[]
[]
[]
[]
[]
[]
[]
[]
[]
[]
[]
[]
[]
[]
[]
[]
[]
[]
[]
[]
[]
[]
[]
[]
[]
[]
[]
[]
[]
[]
[]
[]
[]
[]
[]
[]
[]
[]
[]
[]
[]
[]
[]
[]
[]
[]
[]
[]
[]
[]
[]
[]
[]
[]
[]
[]
[]
[]
[]
[]
[]
[]
[]
[]
[]
[]
[]
[]
[]
[]
[]
[]
[]
[]
[]
[]
[]
[]
[]
[]
[]
[]
[]
[]
[]
[]
[]
[]
[]
[]
[]
[]
[]
[]
[]
[]
[]
[]
[]
[]
[]
[]
[]
[]
[]
[]
[]
[]
[]
[]
[]
[]
[]
[]
[]
[]
[]
[]
[]
[]
[]
[]
[]
[]
[]
[]
[]
[]
[]
[]
[]
[]
[]
[]
[]
[]
[]
[]
[]
[]
[]
[]
[]
[]
[]
[]
[]
[]
[]
[]
[]
[]
[]
[]
[]
[]
[]
[]
[]
[]
[]
[]
[]
[]
[]
[]
[]
[]
[]
[]
[]
[]
[]
[]
[]
[]
[]
[]
[]
[]
[]
[]
[]
[]
[]
[]
[]
[]
[]
[]
[]
[]
[]
[]
[]
[]
[]
[]
[]
[]
[]
[]
[]
[]
[]
[]
[]
[]
[]
[]
[]
[]
[]
[]
[]
[]
[]
[]
[]
[]
[]
[]
[]
[]
[]
[]
[]
[]
[]
[]
[]
[]
[]
[]
[]
[]
[]
[]
[]
[]
[]
[]
[]
[]
[]
[]
[]
[]
[]
[]
[]
[]
[]
[]
[]
[]
[]
[]
[]
[]
[]
[]
[]
[]
[]
[]
[]
[]
[]
[]
[]
[]
[]
[]
[]
[]
[]
[]
[]
[]
[]
[]
[]
[]
[]
[]
[]
[]
[]
[]
[]
[]
[]
[]
[]
[]
[]
[]
[]
[]
[]
[]
[]
[]
[]
[]
[]
[]
[]
[]
[]
[]
[]
[]
[]
[]
[]
[]
[]
[]
[]
[]
[]
[]
[]
[]
[]
[]
[]
[]
[]
[]
[]
[]
[]
[]
[]
[]
[]
[]
[]
[]
[]
[]
[]
[]
[]
[]
[]
[]
[]
[]
[]
[]
[]
[]
[]
[]
[]
[]
[]
[]
[]
[]
[]
[]
[]
[]
[]
[]
[]
[]
[]
[]
[]
[]
[]
[]
[]
[]
[]
[]
[]
[]
[]
[]
[]
[]
[]
[]
[]
[]
[]
[]
[]
[]
[]
[]
[]
[]
[]
[]
[]
[]
[]
[]
[]
[]
[]
[]
[]
[]
[]
[]
[]
[]
[]
[]
[]
[]
[]
[]
[]
[]
[]
[]
[]
[]
[]
[]
[]
[]
[]
[]
[]
[]
[]
[]
[]
[]
[]
[]
[]
[]
[]
[]
[]
[]
[]
[]
[]
[]
[]
[]
[]
[]
[]
[]
[]
[]
[]
[]
[]
[]
[]
[]
[]
[]
[]
[]
[]
[]
[]
[]
[]
[]
[]
[]
[]
[]
[]
[]
[]
[]
[]
[]
[]
[]
[]
[]
[]
[]
[]
[]
[]
[]
[]
[]
[]
[]
[]
[]
[]
[]
[]
[]
[]
[]
[]
[]
[]
[]
[]
[]
[]
[]
[]
[]
[]
[]
[]
[]
[]
[]
[]
[]
[]
[]
[]
[]
[]
[]
[]
[]
[]
[]
[]
[]
[]
[]
[]
[]
[]
[]
[]
[]
[]
[]
[]
[]
[]
[]
[]
[]
[]
[]
[]
[]
[]
[]
[]
[]
[]
[]
[]
[]
[]
[]
[]
[]
[]
[]
[]
[]
[]
[]
[]
[]
[]
[]
[]
[]
[]
[]
[]
[]
[]
[]
[]
[]
[]
[]
[]
[]
[]
[]
[]
[]
[]
[]
[]
[]
[]
[]
[]
[]
[]
[]
[]
[]
[]
[]
[]
[]
[]
[]
[]
[]
[]
[]
[]
[]
[]
[]
[]
[]
[]
[]
[]
[]
[]
[]
[]
[]
[]
[]
[]
[]
[]
[]
[]
[]
[]
[]
[]
[]
[]
[]
[]
[]
[]
[]
[]
[]
[]
[]
[]
[]
[]
[]
[]
[]
[]
[]
[]
[]
[]
[]
[]
[]
[]
[]
[]
[]
[]
[]
[]
[]
[]
[]
[]
[]
[]
[]
[]
[]
[]
[]
[]
[]
[]
[]
[]
[]
[]
[]
[]
[]
[]
[]
[]
[]
[]
[]
[]
[]
[]
[]
[]
[]
[]
[]
[]
[]
[]
[]
[]
[]
[]
[]
[]
[]
[]
[]
[]
[]
[]
[]
[]
[]
[]
[]
[]
[]
[]
[]
[]
[]
[]
[]
[]
[]
[]
[]
[]
[]
[]
[]
[]
[]
[]
[]
[]
[]
[]
[]
[]
[]
[]
[]
[]
[]
[]
[]
[]
[]
[]
[]
[]
[]
[]
[]
[]
[]
[]
[]
[]
[]
[]
[]
[]
[]
[]
[]
[]
[]
[]
[]
[]
[]
[]
[]
[]
[]
[]
[]
[]
[]
[]
[]
[]
[]
[]
[]
[]
[]
[]
[]
[]
[]
[]
[]
[]
[]
[]
[]
[]
[]
[]
[]
[]
[]
[]
[]
[]
[]
[]
[]
[]
[]
[]
[]
[]
[]
[]
[]
[]
[]
[]
[]
[]
[]
[]
[]
[]
[]
[]
[]
[]
[]
[]
[]
[]
[]
[]
[]
[]
[]
[]
[]
[]
[]
[]
[]
[]
[]
[]
[]
[]
[]
[]
[]
[]
[]
[]
[]
[]
[]
[]
[]
[]
[]
[]
[]
[]
[]
[]
[]
[]
[]
[]
[]
[]
[]
[]
[]
[]
[]
[]
[]
[]
[]
[]
[]
[]
[]
[]
[]
[]
[]
[]
[]
[]
[]
[]
[]
[]
[]
[]
[]
[]
[]
[]
[]
[]
[]
[]
[]
[]
[]
[]
[]
[]
[]
[]
[]
[]
[]
[]
[]
[]
[]
[]
[]
[]
[]
[]
[]
[]
[]
[]
[]
[]
[]
[]
[]
[]
[]
[]
[]
[]
[]
[]
[]
[]
[]
[]
[]
[]
[]
[]
[]
[]
[]
[]
[]
[]
[]
[]
[]
[]
[]
[]
[]
[]
[]
[]
[]
[]
[]
[]
[]
[]
[]
[]
[]
[]
[]
[]
[]
[]
[]
[]
[]
[]
[]
[]
[]
[]
[]
[]
[]
[]
[]
[]
[]
[]
[]
[]
[]
[]
[]
[]
[]
[]
[]
[]
[]
[]
[]
[]
[]
[]
[]
[]
[]
[]
[]
[]
[]
[]
[]
[]
[]
[]
[]
[]
[]
[]
[]
[]
[]
[]
[]
[]
[]
[]
[]
[]
[]
[]
[]
[]
[]
[]
[]
[]
[]
[]
[]
[]
[]
[]
[]
[]
[]
[]
[]
[]
[]
[]
[]
[]
[]
[]
[]
[]
[]
[]
[]
[]
[]
[]
[]
[]
[]
[]
[]
[]
[]
[]
[]
[]
[]
[]
[]
[]
[]
[]
[]
[]
[]
[]
[]
[]
[]
[]
[]
[]
[]
[]
[]
[]
[]
[]
[]
[]
[]
[]
[]
[]
[]
[]
[]
[]
[]
[]
[]
[]
[]
[]
[]
[]
[]
[]
[]
[]
[]
[]
[]
[]
[]
[]
[]
[]
[]
[]
[]
[]
[]
[]
[]
[]
[]
[]
[]
[]
[]
[]
[]
[]
[]
[]
[]
[]
[]
[]
[]
[]
[]
[]
[]
[]
[]
[]
[]
[]
[]
[]
[]
[]
[]
[]
[]
[]
[]
[]
[]
[]
[]
[]
[]
[]
[]
[]
[]
[]
[]
[]
[]
[]
[]
[]
[]
[]
[]
[]
[]
[]
[]
[]
[]
[]
[]
[]
[]
[]
[]
[]
[]
[]
[]
[]
[]
[]
[]
[]
[]
[]
[]
[]
[]
[]
[]
[]
[]
[]
[]
[]
[]
[]
[]
[]
[]
[]
[]
[]
[]
[]
[]
[]
[]
[]
[]
[]
[]
[]
[]
[]
[]
[]
[]
[]
[]
[]
[]
[]
[]
[]
[]
[]
[]
[]
[]
[]
[]
[]
[]
[]
[]
[]
[]
[]
[]
[]
[]
[]
[]
[]
[]
[]
[]
[]
[]
[]
[]
[]
[]
[]
[]
[]
[]
[]
[]
[]
[]
[]
[]
[]
[]
[]
[]
[]
[]
[]
[]
[]
[]
[]
[]
[]
[]
[]
[]
[]
[null,null,null,null,null,null,null,null,null,null,null,null,{"$f":"IF(E3542=E3543,CONCATENATE(M3642,\",\",B3543,C3543),CONCATENATE(B3543,C3543))","v":","}]
[null,null,null,null,null,null,null,null,null,null,null,null,",,"]
[null,null,null,null,null,null,null,null,null,null,null,null,",,,"]
[null,null,null,null,null,null,null,null,null,null,null,null,",,,,"]
[null,null,null,null,null,null,null,null,null,null,null,null,",,,,,"]
[null,null,null,null,null,null,null,null,null,null,null,null,",,,,,,"]
[null,null,null,null,null,null,null,null,null,null,null,null,",,,,,,,"]
[null,null,null,null,null,null,null,null,null,null,null,null,",,,,,,,,"]
[null,null,null,null,null,null,null,null,null,null,null,null,",,,,,,,,,"]
[null,null,null,null,null,null,null,null,null,null,null,null,",,,,,,,,,,"]

{"sheet":"Noms en colonnes","index":1,"n_rows":13,"n_cols":11,"rows_kept":13,"cut":false,"hidden":false,"merged":[]}
["n0 p","Civilité","Nom de tous les propriétaires  (parcelle, BND, local)","Nom",null,null,"Prénom 1","Prénom 2","Prénom 3","Prénom 4","Nom de jeune fille"]
[1,"Madame","ACERBIS DIT ALVARES VALERIE","A","ALVARES","ACERBIS","VALERIE",null,null,null,"M"]
[2,"Monsieur","ACERBIS PASCAL","B",null,"ACERBIS","PASCAL",null,null,null,{"$f":"IF(E3<>\"\",F3,\"\")","v":""}]
[3,"Monsieur","ALBERT DANIEL PAUL","C",null,"ALBERT","DANIEL","PAUL",null,null,{"$f":"IF(E4<>\"\",F4,\"\")","v":""}]
[4,"Monsieur","ALBERT JOSEPH MARTIN NAZAIRE","D",null,"ALBERT","JOSEPH","MARTIN","NAZAIRE",null,{"$f":"IF(E5<>\"\",F5,\"\")","v":""}]
[5,"Société","ALIX","E",null,"ALIX",null,null,null,null,{"$f":"IF(E6<>\"\",F6,\"\")","v":""}]
[6,"Madame","ANDRE ARLETTE EMILIA DIT FINE ARLETTE","F","FINE","ANDRE","ARLETTE","EMILIA",null,null,"N"]
[7,"Madame","ARDUIN ELVIRE MARCELLE LOUISE DIT CROSASSO ELVIRE","G","CROSASSO","ARDUIN","ELVIRE","MARCELLE","LOUISE",null,"O"]
[8,"Monsieur","ARNOUX JEAN-PAUL GASTON","H",null,"ARNOUX","JEAN-PAUL","GASTON",null,null,{"$f":"IF(E9<>\"\",F9,\"\")","v":""}]
[9,"Monsieur","ARNOUX PAUL MARC","I",null,"ARNOUX","PAUL","MARC",null,null,{"$f":"IF(E10<>\"\",F10,\"\")","v":""}]
[10,"Societe","ASS SYNDICALE DU GRAND CANAL","J",null,"ASS",null,null,null,null,{"$f":"IF(E11<>\"\",F11,\"\")","v":""}]
[11,"Madame","ASTIER ANNIE ODETTE DENISE DIT BAISSET ANNIE","K","BAISSET","ASTIER","ANNIE","ODETTE","DENISE",null,"P"]
[12,"Monsieur","ASTIER FABIEN ELIE","L",null,"ASTIER","FABIEN","ELIE",null,null,{"$f":"IF(E13<>\"\",F13,\"\")","v":""}]

{"sheet":"Feuil1","index":2,"n_rows":22,"n_cols":9,"rows_kept":22,"cut":false,"hidden":false,"merged":[]}
["N° extrait propriétaire","Concaténé",null,null,"essai","Liste parcelles",null,null,"Liste parcelles"]
[{"$f":"Fiche_parcelle!A2","v":1},{"$f":"CONCATENATE('Etat complet'!B2,'Etat complet'!C2)","v":"AP10"},null,null,{"$f":"A2","v":1},{"$f":"IF(E2<>\"\",B2,\"\")","v":"AP10"},null,1,"AP10"]
[{"$f":"Fiche_parcelle!A3","v":2},{"$f":"IF('Etat complet'!A3='Etat complet'!A2,CONCATENATE(B2,\", \",'Etat complet'!B3,'Etat complet'!C3),CONCATENATE('Etat complet'!B3,'Etat complet'!C3))","v":"AP10"},null,null,{"$f":"IF(A3=A4,\"\",CONCATENATE(A3))","v":"2"},"AP10",null,2,"AP10"]
[{"$f":"Fiche_parcelle!A4","v":3},{"$f":"IF('Etat complet'!A4='Etat complet'!A3,CONCATENATE(B3,\", \",'Etat complet'!B4,'Etat complet'!C4),CONCATENATE('Etat complet'!B4,'Etat complet'!C4))","v":"AN171"},null,null,"3","AN171",null,3,"AN171"]
[{"$f":"Fiche_parcelle!A5","v":4},{"$f":"IF('Etat complet'!A5='Etat complet'!A4,CONCATENATE(B4,\", \",'Etat complet'!B5,'Etat complet'!C5),CONCATENATE('Etat complet'!B5,'Etat complet'!C5))","v":"AP115"},null,null,"4","AP115",null,4,"AP115"]
[{"$f":"Fiche_parcelle!A6","v":5},{"$f":"IF('Etat complet'!A6='Etat complet'!A5,CONCATENATE(B5,\", \",'Etat complet'!B6,'Etat complet'!C6),CONCATENATE('Etat complet'!B6,'Etat complet'!C6))","v":"AP11"},null,null,"5","AP11",null,5,"AP11"]
[{"$f":"Fiche_parcelle!A7","v":6},{"$f":"IF('Etat complet'!A7='Etat complet'!A6,CONCATENATE(B6,\", \",'Etat complet'!B7,'Etat complet'!C7),CONCATENATE('Etat complet'!B7,'Etat complet'!C7))","v":"D1884"},null,null,"","",null,6,"D1884, D1885"]
[{"$f":"Fiche_parcelle!A8","v":6},{"$f":"IF('Etat complet'!A8='Etat complet'!A7,CONCATENATE(B7,\", \",'Etat complet'!B8,'Etat complet'!C8),CONCATENATE('Etat complet'!B8,'Etat complet'!C8))","v":"D1884, D1885"},null,null,"6","D1884, D1885",null,7,"AP317, D3286, D3287"]
[{"$f":"Fiche_parcelle!A9","v":7},{"$f":"IF('Etat complet'!A9='Etat complet'!A8,CONCATENATE(B8,\", \",'Etat complet'!B9,'Etat complet'!C9),CONCATENATE('Etat complet'!B9,'Etat complet'!C9))","v":"AP317"},null,null,"","",null,8,"AK137, AK140"]
[{"$f":"Fiche_parcelle!A10","v":7},{"$f":"IF('Etat complet'!A10='Etat complet'!A9,CONCATENATE(B9,\", \",'Etat complet'!B10,'Etat complet'!C10),CONCATENATE('Etat complet'!B10,'Etat complet'!C10))","v":"AP317, D3286"},null,null,"","",null,9,"AK137, AK140"]
[{"$f":"Fiche_parcelle!A11","v":7},{"$f":"IF('Etat complet'!A11='Etat complet'!A10,CONCATENATE(B10,\", \",'Etat complet'!B11,'Etat complet'!C11),CONCATENATE('Etat complet'!B11,'Etat complet'!C11))","v":"AP317, D3286, D3287"},null,null,"7","AP317, D3286, D3287",null,10,"AM254, AM319, AM321, AP263, AP319"]
[{"$f":"Fiche_parcelle!A12","v":8},{"$f":"IF('Etat complet'!A12='Etat complet'!A11,CONCATENATE(B11,\", \",'Etat complet'!B12,'Etat complet'!C12),CONCATENATE('Etat complet'!B12,'Etat complet'!C12))","v":"AK137"},null,null,"","",null,11,"AP318"]
[{"$f":"Fiche_parcelle!A13","v":8},{"$f":"IF('Etat complet'!A13='Etat complet'!A12,CONCATENATE(B12,\", \",'Etat complet'!B13,'Etat complet'!C13),CONCATENATE('Etat complet'!B13,'Etat complet'!C13))","v":"AK137, AK140"},null,null,"8","AK137, AK140",null,12,"AP318"]
[{"$f":"Fiche_parcelle!A14","v":9},{"$f":"IF('Etat complet'!A14='Etat complet'!A13,CONCATENATE(B13,\", \",'Etat complet'!B14,'Etat complet'!C14),CONCATENATE('Etat complet'!B14,'Etat complet'!C14))","v":"AK137"},null,null,"","",null,13,"AP318"]
[{"$f":"Fiche_parcelle!A15","v":9},{"$f":"IF('Etat complet'!A15='Etat complet'!A14,CONCATENATE(B14,\", \",'Etat complet'!B15,'Etat complet'!C15),CONCATENATE('Etat complet'!B15,'Etat complet'!C15))","v":"AK137, AK140"},null,null,"9","AK137, AK140",null,14,"AP318"]
[{"$f":"Fiche_parcelle!A16","v":10},{"$f":"IF('Etat complet'!A16='Etat complet'!A15,CONCATENATE(B15,\", \",'Etat complet'!B16,'Etat complet'!C16),CONCATENATE('Etat complet'!B16,'Etat complet'!C16))","v":"AM254"},null,null,"","",null,15,"AP318"]
[{"$f":"Fiche_parcelle!A17","v":10},{"$f":"IF('Etat complet'!A17='Etat complet'!A16,CONCATENATE(B16,\", \",'Etat complet'!B17,'Etat complet'!C17),CONCATENATE('Etat complet'!B17,'Etat complet'!C17))","v":"AM254, AM319"},null,null,"","",null,16,"AP318"]
[{"$f":"Fiche_parcelle!A18","v":10},{"$f":"IF('Etat complet'!A18='Etat complet'!A17,CONCATENATE(B17,\", \",'Etat complet'!B18,'Etat complet'!C18),CONCATENATE('Etat complet'!B18,'Etat complet'!C18))","v":"AM254, AM319, AM321"},null,null,"","",null,17,"AK137, AK140"]
[{"$f":"Fiche_parcelle!A19","v":10},{"$f":"IF('Etat complet'!A19='Etat complet'!A18,CONCATENATE(B18,\", \",'Etat complet'!B19,'Etat complet'!C19),CONCATENATE('Etat complet'!B19,'Etat complet'!C19))","v":"AM254, AM319, AM321, AP263"},null,null,"","",null,18,"AK137, AK140"]
[{"$f":"Fiche_parcelle!A20","v":10},{"$f":"IF('Etat complet'!A20='Etat complet'!A19,CONCATENATE(B19,\", \",'Etat complet'!B20,'Etat complet'!C20),CONCATENATE('Etat complet'!B20,'Etat complet'!C20))","v":"AM254, AM319, AM321, AP263, AP319"},null,null,"10","AM254, AM319, AM321, AP263, AP319",null,19,"AP57"]
[{"$f":"Fiche_parcelle!A21","v":11},{"$f":"IF('Etat complet'!A21='Etat complet'!A20,CONCATENATE(B20,\", \",'Etat complet'!B21,'Etat complet'!C21),CONCATENATE('Etat complet'!B21,'Etat complet'!C21))","v":"AP318"},null,null,"11","AP318",null,20,"D3293"]
[{"$f":"Fiche_parcelle!A22","v":12},{"$f":"IF('Etat complet'!A22='Etat complet'!A21,CONCATENATE(B21,\", \",'Etat complet'!B22,'Etat complet'!C22),CONCATENATE('Etat complet'!B22,'Etat complet'!C22))","v":"AP318"},null,null,"12","AP318",null,21,"AK364"]

{"sheet":"Adresse clean","index":3,"n_rows":13,"n_cols":4,"rows_kept":13,"cut":false,"hidden":false,"merged":[]}
["n0 p","Ligne d'adresse 1","Code postal","ville"]
[1,{"$f":"VLOOKUP(A2,Fiche_parcelle!$A$1:$N$22,8,FALSE)","v":"Chemin des mimosas "},{"$f":"VLOOKUP(A2,Fiche_parcelle!$A$1:$N$22,9,FALSE)","v":"04210"},{"$f":"VLOOKUP(A2,Fiche_parcelle!$A$1:$N$22,10,FALSE)","v":"VILLE"}]
[2,{"$f":"VLOOKUP(A3,Fiche_parcelle!$A$1:$N$22,8,FALSE)","v":"Rue des Pâquerettes "},{"$f":"VLOOKUP(A3,Fiche_parcelle!$A$1:$N$22,9,FALSE)","v":"04210"},{"$f":"VLOOKUP(A3,Fiche_parcelle!$A$1:$N$22,10,FALSE)","v":"VILLE"}]
[3,{"$f":"VLOOKUP(A4,Fiche_parcelle!$A$1:$N$22,8,FALSE)","v":"Boulevard des Lilas "},{"$f":"VLOOKUP(A4,Fiche_parcelle!$A$1:$N$22,9,FALSE)","v":"04210"},{"$f":"VLOOKUP(A4,Fiche_parcelle!$A$1:$N$22,10,FALSE)","v":"VILLE"}]
[4,{"$f":"VLOOKUP(A5,Fiche_parcelle!$A$1:$N$22,8,FALSE)","v":"Impasse des Champs "},{"$f":"VLOOKUP(A5,Fiche_parcelle!$A$1:$N$22,9,FALSE)","v":"04210"},{"$f":"VLOOKUP(A5,Fiche_parcelle!$A$1:$N$22,10,FALSE)","v":"VILLE"}]
[5,{"$f":"VLOOKUP(A6,Fiche_parcelle!$A$1:$N$22,8,FALSE)","v":"Rue des Tilleuls "},{"$f":"VLOOKUP(A6,Fiche_parcelle!$A$1:$N$22,9,FALSE)","v":"04210"},{"$f":"VLOOKUP(A6,Fiche_parcelle!$A$1:$N$22,10,FALSE)","v":"VILLE"}]
[6,{"$f":"VLOOKUP(A7,Fiche_parcelle!$A$1:$N$22,8,FALSE)","v":"Place aux Roses "},{"$f":"VLOOKUP(A7,Fiche_parcelle!$A$1:$N$22,9,FALSE)","v":"04210"},{"$f":"VLOOKUP(A7,Fiche_parcelle!$A$1:$N$22,10,FALSE)","v":"VILLE"}]
[7,{"$f":"VLOOKUP(A8,Fiche_parcelle!$A$1:$N$22,8,FALSE)","v":"avenue Inconnue "},{"$f":"VLOOKUP(A8,Fiche_parcelle!$A$1:$N$22,9,FALSE)","v":"04210"},{"$f":"VLOOKUP(A8,Fiche_parcelle!$A$1:$N$22,10,FALSE)","v":"VILLE"}]
[8,{"$f":"VLOOKUP(A9,Fiche_parcelle!$A$1:$N$22,8,FALSE)","v":"rue Sanom "},{"$f":"VLOOKUP(A9,Fiche_parcelle!$A$1:$N$22,9,FALSE)","v":"04210"},{"$f":"VLOOKUP(A9,Fiche_parcelle!$A$1:$N$22,10,FALSE)","v":"VILLE"}]
[9,{"$f":"VLOOKUP(A10,Fiche_parcelle!$A$1:$N$22,8,FALSE)","v":"allée des Pins "},{"$f":"VLOOKUP(A10,Fiche_parcelle!$A$1:$N$22,9,FALSE)","v":"04210"},{"$f":"VLOOKUP(A10,Fiche_parcelle!$A$1:$N$22,10,FALSE)","v":"VILLE"}]
[10,{"$f":"VLOOKUP(A11,Fiche_parcelle!$A$1:$N$22,8,FALSE)","v":"place des Hêtres "},{"$f":"VLOOKUP(A11,Fiche_parcelle!$A$1:$N$22,9,FALSE)","v":"04210"},{"$f":"VLOOKUP(A11,Fiche_parcelle!$A$1:$N$22,10,FALSE)","v":"VILLE"}]
[11,{"$f":"VLOOKUP(A12,Fiche_parcelle!$A$1:$N$22,8,FALSE)","v":"rue des Cyprès "},{"$f":"VLOOKUP(A12,Fiche_parcelle!$A$1:$N$22,9,FALSE)","v":"04210"},{"$f":"VLOOKUP(A12,Fiche_parcelle!$A$1:$N$22,10,FALSE)","v":"VILLE"}]
[12,{"$f":"VLOOKUP(A13,Fiche_parcelle!$A$1:$N$22,8,FALSE)","v":"impasse fleurie "},{"$f":"VLOOKUP(A13,Fiche_parcelle!$A$1:$N$22,9,FALSE)","v":"04210"},{"$f":"VLOOKUP(A13,Fiche_parcelle!$A$1:$N$22,10,FALSE)","v":"VILLE"}]

{"sheet":"Détail propriétaire","index":4,"n_rows":13,"n_cols":15,"rows_kept":13,"cut":false,"hidden":false,"merged":[]}
["N° prop","Civilité","NOM","Prénom 1","Prénom 2","Prénom 3","Nom de jeune fille","Adresse",null,null,null,"Parcelle(s)","Date naissance","Lieu de naissance","Profession"]
[1,{"$f":"'Noms en colonnes'!B2","v":"Madame"},{"$f":"'Noms en colonnes'!D2","v":"A"},{"$f":"PROPER('Noms en colonnes'!G2)","v":"Valerie"},{"$f":"PROPER('Noms en colonnes'!H2)","v":""},{"$f":"PROPER('Noms en colonnes'!I2)","v":""},{"$f":"IF(AND(B2=\"Madame\",'Noms en colonnes'!K2<>\"\"),CONCATENATE(\"née \",'Noms en colonnes'!K2),\"\")","v":"née M"},{"$f":"CONCATENATE(\"demeurant \"&PROPER('Adresse clean'!B2)&\" \"&'Adresse clean'!C2&\" \"&'Adresse clean'!D2)","v":"demeurant Chemin Des Mimosas  04210 VILLE"},null,null,null,{"$f":"VLOOKUP(A2,Feuil1!H:I,2,FALSE)","v":"AP10"},{"$f":"CONCATENATE(\"le \")","v":"le "},{"$f":"CONCATENATE(\"à \")","v":"à "},"exerçant la profession de "]
[2,{"$f":"'Noms en colonnes'!B3","v":"Monsieur"},{"$f":"'Noms en colonnes'!D3","v":"B"},{"$f":"PROPER('Noms en colonnes'!G3)","v":"Pascal"},{"$f":"PROPER('Noms en colonnes'!H3)","v":""},{"$f":"PROPER('Noms en colonnes'!I3)","v":""},{"$f":"IF(AND(B3=\"Madame\",'Noms en colonnes'!K3<>\"\"),CONCATENATE(\"née \",'Noms en colonnes'!K3),\"\")","v":""},{"$f":"CONCATENATE(\"demeurant \"&PROPER('Adresse clean'!B3)&\" \"&'Adresse clean'!C3&\" \"&'Adresse clean'!D3)","v":"demeurant Rue Des Pâquerettes  04210 VILLE"},null,null,null,{"$f":"VLOOKUP(A3,Feuil1!H:I,2,FALSE)","v":"AP10"},{"$f":"CONCATENATE(\"le \")","v":"le "},{"$f":"CONCATENATE(\"à \")","v":"à "},"exerçant la profession de "]
[3,{"$f":"'Noms en colonnes'!B4","v":"Monsieur"},{"$f":"'Noms en colonnes'!D4","v":"C"},{"$f":"PROPER('Noms en colonnes'!G4)","v":"Daniel"},{"$f":"PROPER('Noms en colonnes'!H4)","v":"Paul"},{"$f":"PROPER('Noms en colonnes'!I4)","v":""},{"$f":"IF(AND(B4=\"Madame\",'Noms en colonnes'!K4<>\"\"),CONCATENATE(\"née \",'Noms en colonnes'!K4),\"\")","v":""},{"$f":"CONCATENATE(\"demeurant \"&PROPER('Adresse clean'!B4)&\" \"&'Adresse clean'!C4&\" \"&'Adresse clean'!D4)","v":"demeurant Boulevard Des Lilas  04210 VILLE"},null,null,null,{"$f":"VLOOKUP(A4,Feuil1!H:I,2,FALSE)","v":"AN171"},"le ","à ","exerçant la profession de "]
[4,{"$f":"'Noms en colonnes'!B5","v":"Monsieur"},{"$f":"'Noms en colonnes'!D5","v":"D"},{"$f":"PROPER('Noms en colonnes'!G5)","v":"Joseph"},{"$f":"PROPER('Noms en colonnes'!H5)","v":"Martin"},{"$f":"PROPER('Noms en colonnes'!I5)","v":"Nazaire"},{"$f":"IF(AND(B5=\"Madame\",'Noms en colonnes'!K5<>\"\"),CONCATENATE(\"née \",'Noms en colonnes'!K5),\"\")","v":""},{"$f":"CONCATENATE(\"demeurant \"&PROPER('Adresse clean'!B5)&\" \"&'Adresse clean'!C5&\" \"&'Adresse clean'!D5)","v":"demeurant Impasse Des Champs  04210 VILLE"},null,null,null,{"$f":"VLOOKUP(A5,Feuil1!H:I,2,FALSE)","v":"AP115"},"le ","à ","exerçant la profession de "]
[5,{"$f":"'Noms en colonnes'!B6","v":"Société"},{"$f":"'Noms en colonnes'!D6","v":"E"},{"$f":"PROPER('Noms en colonnes'!G6)","v":""},{"$f":"PROPER('Noms en colonnes'!H6)","v":""},{"$f":"PROPER('Noms en colonnes'!I6)","v":""},{"$f":"IF(AND(B6=\"Madame\",'Noms en colonnes'!K6<>\"\"),CONCATENATE(\"née \",'Noms en colonnes'!K6),\"\")","v":""},{"$f":"CONCATENATE(\"demeurant \"&PROPER('Adresse clean'!B6)&\" \"&'Adresse clean'!C6&\" \"&'Adresse clean'!D6)","v":"demeurant Rue Des Tilleuls  04210 VILLE"},null,null,null,{"$f":"VLOOKUP(A6,Feuil1!H:I,2,FALSE)","v":"AP11"},"le ","à ","exerçant la profession de "]
[6,{"$f":"'Noms en colonnes'!B7","v":"Madame"},{"$f":"'Noms en colonnes'!D7","v":"F"},{"$f":"PROPER('Noms en colonnes'!G7)","v":"Arlette"},{"$f":"PROPER('Noms en colonnes'!H7)","v":"Emilia"},{"$f":"PROPER('Noms en colonnes'!I7)","v":""},{"$f":"IF(AND(B7=\"Madame\",'Noms en colonnes'!K7<>\"\"),CONCATENATE(\"née \",'Noms en colonnes'!K7),\"\")","v":"née N"},{"$f":"CONCATENATE(\"demeurant \"&PROPER('Adresse clean'!B7)&\" \"&'Adresse clean'!C7&\" \"&'Adresse clean'!D7)","v":"demeurant Place Aux Roses  04210 VILLE"},null,null,null,{"$f":"VLOOKUP(A7,Feuil1!H:I,2,FALSE)","v":"D1884, D1885"},"le ","à ","exerçant la profession de "]
[7,{"$f":"'Noms en colonnes'!B8","v":"Madame"},{"$f":"'Noms en colonnes'!D8","v":"G"},{"$f":"PROPER('Noms en colonnes'!G8)","v":"Elvire"},{"$f":"PROPER('Noms en colonnes'!H8)","v":"Marcelle"},{"$f":"PROPER('Noms en colonnes'!I8)","v":"Louise"},{"$f":"IF(AND(B8=\"Madame\",'Noms en colonnes'!K8<>\"\"),CONCATENATE(\"née \",'Noms en colonnes'!K8),\"\")","v":"née O"},{"$f":"CONCATENATE(\"demeurant \"&PROPER('Adresse clean'!B8)&\" \"&'Adresse clean'!C8&\" \"&'Adresse clean'!D8)","v":"demeurant Avenue Inconnue  04210 VILLE"},null,null,null,{"$f":"VLOOKUP(A8,Feuil1!H:I,2,FALSE)","v":"AP317, D3286, D3287"},"le ","à ","exerçant la profession de "]
[8,{"$f":"'Noms en colonnes'!B9","v":"Monsieur"},{"$f":"'Noms en colonnes'!D9","v":"H"},{"$f":"PROPER('Noms en colonnes'!G9)","v":"Jean-Paul"},{"$f":"PROPER('Noms en colonnes'!H9)","v":"Gaston"},{"$f":"PROPER('Noms en colonnes'!I9)","v":""},{"$f":"IF(AND(B9=\"Madame\",'Noms en colonnes'!K9<>\"\"),CONCATENATE(\"née \",'Noms en colonnes'!K9),\"\")","v":""},{"$f":"CONCATENATE(\"demeurant \"&PROPER('Adresse clean'!B9)&\" \"&'Adresse clean'!C9&\" \"&'Adresse clean'!D9)","v":"demeurant Rue Sanom  04210 VILLE"},null,null,null,{"$f":"VLOOKUP(A9,Feuil1!H:I,2,FALSE)","v":"AK137, AK140"},"le ","à ","exerçant la profession de "]
[9,{"$f":"'Noms en colonnes'!B10","v":"Monsieur"},{"$f":"'Noms en colonnes'!D10","v":"I"},{"$f":"PROPER('Noms en colonnes'!G10)","v":"Paul"},{"$f":"PROPER('Noms en colonnes'!H10)","v":"Marc"},{"$f":"PROPER('Noms en colonnes'!I10)","v":""},{"$f":"IF(AND(B10=\"Madame\",'Noms en colonnes'!K10<>\"\"),CONCATENATE(\"née \",'Noms en colonnes'!K10),\"\")","v":""},{"$f":"CONCATENATE(\"demeurant \"&PROPER('Adresse clean'!B10)&\" \"&'Adresse clean'!C10&\" \"&'Adresse clean'!D10)","v":"demeurant Allée Des Pins  04210 VILLE"},null,null,null,{"$f":"VLOOKUP(A10,Feuil1!H:I,2,FALSE)","v":"AK137, AK140"},"le ","à ","exerçant la profession de "]
[10,{"$f":"'Noms en colonnes'!B11","v":"Societe"},{"$f":"'Noms en colonnes'!D11","v":"J"},{"$f":"PROPER('Noms en colonnes'!G11)","v":""},{"$f":"PROPER('Noms en colonnes'!H11)","v":""},{"$f":"PROPER('Noms en colonnes'!I11)","v":""},{"$f":"IF(AND(B11=\"Madame\",'Noms en colonnes'!K11<>\"\"),CONCATENATE(\"née \",'Noms en colonnes'!K11),\"\")","v":""},{"$f":"CONCATENATE(\"demeurant \"&PROPER('Adresse clean'!B11)&\" \"&'Adresse clean'!C11&\" \"&'Adresse clean'!D11)","v":"demeurant Place Des Hêtres  04210 VILLE"},null,null,null,{"$f":"VLOOKUP(A11,Feuil1!H:I,2,FALSE)","v":"AM254, AM319, AM321, AP263, AP319"},"le ","à ","exerçant la profession de "]
[11,{"$f":"'Noms en colonnes'!B12","v":"Madame"},{"$f":"'Noms en colonnes'!D12","v":"K"},{"$f":"PROPER('Noms en colonnes'!G12)","v":"Annie"},{"$f":"PROPER('Noms en colonnes'!H12)","v":"Odette"},{"$f":"PROPER('Noms en colonnes'!I12)","v":"Denise"},{"$f":"IF(AND(B12=\"Madame\",'Noms en colonnes'!K12<>\"\"),CONCATENATE(\"née \",'Noms en colonnes'!K12),\"\")","v":"née P"},{"$f":"CONCATENATE(\"demeurant \"&PROPER('Adresse clean'!B12)&\" \"&'Adresse clean'!C12&\" \"&'Adresse clean'!D12)","v":"demeurant Rue Des Cyprès  04210 VILLE"},null,null,null,{"$f":"VLOOKUP(A12,Feuil1!H:I,2,FALSE)","v":"AP318"},"le ","à ","exerçant la profession de "]
[12,{"$f":"'Noms en colonnes'!B13","v":"Monsieur"},{"$f":"'Noms en colonnes'!D13","v":"L"},{"$f":"PROPER('Noms en colonnes'!G13)","v":"Fabien"},{"$f":"PROPER('Noms en colonnes'!H13)","v":"Elie"},{"$f":"PROPER('Noms en colonnes'!I13)","v":""},{"$f":"IF(AND(B13=\"Madame\",'Noms en colonnes'!K13<>\"\"),CONCATENATE(\"née \",'Noms en colonnes'!K13),\"\")","v":""},{"$f":"CONCATENATE(\"demeurant \"&PROPER('Adresse clean'!B13)&\" \"&'Adresse clean'!C13&\" \"&'Adresse clean'!D13)","v":"demeurant Impasse Fleurie  04210 VILLE"},null,null,null,{"$f":"VLOOKUP(A13,Feuil1!H:I,2,FALSE)","v":"AP318"},"le ","à ","exerçant la profession de "]

{"sheet":"Etat complet","index":5,"n_rows":22,"n_cols":8,"rows_kept":22,"cut":false,"hidden":false,"merged":[]}
["N° extrait propriétaire","Section","Parcelle","Concat","Contenance","Emprise","Reliquat"]
[{"$f":"Fiche_parcelle!A2","v":1},{"$f":"Fiche_parcelle!B2","v":"AP"},{"$f":"Fiche_parcelle!C2","v":"10"},"AP10",{"$f":"INDEX('Export Geomas'!J:J,MATCH('Etat complet'!D2,'Export Geomas'!L:L,0))","v":388},69,319,{"$f":"A2&\"-\"&COUNTIF(A$2:A2,A2)","v":"1-1"}]
[{"$f":"Fiche_parcelle!A3","v":2},{"$f":"Fiche_parcelle!B3","v":"AP"},{"$f":"Fiche_parcelle!C3","v":"10"},{"$f":"CONCATENATE(B3,C3)","v":"AP10"},{"$f":"INDEX('Export Geomas'!J:J,MATCH('Etat complet'!D3,'Export Geomas'!L:L,0))","v":388},{"$f":"VLOOKUP(D3,'Export Geomas'!L:N,2,FALSE)","v":69},{"$f":"VLOOKUP(D3,'Export Geomas'!L:N,3,FALSE)","v":319},{"$f":"A3&\"-\"&COUNTIF(A$2:A3,A3)","v":"2-1"}]
[{"$f":"Fiche_parcelle!A4","v":3},{"$f":"Fiche_parcelle!B4","v":"AN"},{"$f":"Fiche_parcelle!C4","v":"171"},"AN171",{"$f":"INDEX('Export Geomas'!J:J,MATCH('Etat complet'!D4,'Export Geomas'!L:L,0))","v":515},{"$f":"VLOOKUP(D4,'Export Geomas'!L:N,2,FALSE)","v":9},{"$f":"VLOOKUP(D4,'Export Geomas'!L:N,3,FALSE)","v":506},{"$f":"A4&\"-\"&COUNTIF(A$2:A4,A4)","v":"3-1"}]
[{"$f":"Fiche_parcelle!A5","v":4},{"$f":"Fiche_parcelle!B5","v":"AP"},{"$f":"Fiche_parcelle!C5","v":"115"},"AP115",{"$f":"INDEX('Export Geomas'!J:J,MATCH('Etat complet'!D5,'Export Geomas'!L:L,0))","v":211},{"$f":"VLOOKUP(D5,'Export Geomas'!L:N,2,FALSE)","v":52},{"$f":"VLOOKUP(D5,'Export Geomas'!L:N,3,FALSE)","v":159},{"$f":"A5&\"-\"&COUNTIF(A$2:A5,A5)","v":"4-1"}]
[{"$f":"Fiche_parcelle!A6","v":5},{"$f":"Fiche_parcelle!B6","v":"AP"},{"$f":"Fiche_parcelle!C6","v":"11"},"AP11",{"$f":"INDEX('Export Geomas'!J:J,MATCH('Etat complet'!D6,'Export Geomas'!L:L,0))","v":420},{"$f":"VLOOKUP(D6,'Export Geomas'!L:N,2,FALSE)","v":98},{"$f":"VLOOKUP(D6,'Export Geomas'!L:N,3,FALSE)","v":322},{"$f":"A6&\"-\"&COUNTIF(A$2:A6,A6)","v":"5-1"}]
[{"$f":"Fiche_parcelle!A7","v":6},{"$f":"Fiche_parcelle!B7","v":"D"},{"$f":"Fiche_parcelle!C7","v":"1884"},"D1884",{"$f":"INDEX('Export Geomas'!J:J,MATCH('Etat complet'!D7,'Export Geomas'!L:L,0))","v":604},{"$f":"VLOOKUP(D7,'Export Geomas'!L:N,2,FALSE)","v":16},{"$f":"VLOOKUP(D7,'Export Geomas'!L:N,3,FALSE)","v":588},{"$f":"A7&\"-\"&COUNTIF(A$2:A7,A7)","v":"6-1"}]
[{"$f":"Fiche_parcelle!A8","v":6},{"$f":"Fiche_parcelle!B8","v":"D"},{"$f":"Fiche_parcelle!C8","v":"1885"},"D1885",{"$f":"INDEX('Export Geomas'!J:J,MATCH('Etat complet'!D8,'Export Geomas'!L:L,0))","v":84},{"$f":"VLOOKUP(D8,'Export Geomas'!L:N,2,FALSE)","v":55},{"$f":"VLOOKUP(D8,'Export Geomas'!L:N,3,FALSE)","v":29},{"$f":"A8&\"-\"&COUNTIF(A$2:A8,A8)","v":"6-2"}]
[{"$f":"Fiche_parcelle!A9","v":7},{"$f":"Fiche_parcelle!B9","v":"AP"},{"$f":"Fiche_parcelle!C9","v":"317"},"AP317",{"$f":"INDEX('Export Geomas'!J:J,MATCH('Etat complet'!D9,'Export Geomas'!L:L,0))","v":1135},{"$f":"VLOOKUP(D9,'Export Geomas'!L:N,2,FALSE)","v":8},{"$f":"VLOOKUP(D9,'Export Geomas'!L:N,3,FALSE)","v":1127},{"$f":"A9&\"-\"&COUNTIF(A$2:A9,A9)","v":"7-1"}]
[{"$f":"Fiche_parcelle!A10","v":7},{"$f":"Fiche_parcelle!B10","v":"D"},{"$f":"Fiche_parcelle!C10","v":"3286"},"D3286",{"$f":"INDEX('Export Geomas'!J:J,MATCH('Etat complet'!D10,'Export Geomas'!L:L,0))","v":480},{"$f":"VLOOKUP(D10,'Export Geomas'!L:N,2,FALSE)","v":130},{"$f":"VLOOKUP(D10,'Export Geomas'!L:N,3,FALSE)","v":350},{"$f":"A10&\"-\"&COUNTIF(A$2:A10,A10)","v":"7-2"}]
[{"$f":"Fiche_parcelle!A11","v":7},{"$f":"Fiche_parcelle!B11","v":"D"},{"$f":"Fiche_parcelle!C11","v":"3287"},"D3287",{"$f":"INDEX('Export Geomas'!J:J,MATCH('Etat complet'!D11,'Export Geomas'!L:L,0))","v":800},{"$f":"VLOOKUP(D11,'Export Geomas'!L:N,2,FALSE)","v":200},{"$f":"VLOOKUP(D11,'Export Geomas'!L:N,3,FALSE)","v":600},{"$f":"A11&\"-\"&COUNTIF(A$2:A11,A11)","v":"7-3"}]
[{"$f":"Fiche_parcelle!A12","v":8},{"$f":"Fiche_parcelle!B12","v":"AK"},{"$f":"Fiche_parcelle!C12","v":"137"},"AK137",{"$f":"INDEX('Export Geomas'!J:J,MATCH('Etat complet'!D12,'Export Geomas'!L:L,0))","v":477},{"$f":"VLOOKUP(D12,'Export Geomas'!L:N,2,FALSE)","v":36},{"$f":"VLOOKUP(D12,'Export Geomas'!L:N,3,FALSE)","v":441},{"$f":"A12&\"-\"&COUNTIF(A$2:A12,A12)","v":"8-1"}]
[{"$f":"Fiche_parcelle!A13","v":8},{"$f":"Fiche_parcelle!B13","v":"AK"},{"$f":"Fiche_parcelle!C13","v":"140"},"AK140",{"$f":"INDEX('Export Geomas'!J:J,MATCH('Etat complet'!D13,'Export Geomas'!L:L,0))","v":666},{"$f":"VLOOKUP(D13,'Export Geomas'!L:N,2,FALSE)","v":138},{"$f":"VLOOKUP(D13,'Export Geomas'!L:N,3,FALSE)","v":528},{"$f":"A13&\"-\"&COUNTIF(A$2:A13,A13)","v":"8-2"}]
[{"$f":"Fiche_parcelle!A14","v":9},{"$f":"Fiche_parcelle!B14","v":"AK"},{"$f":"Fiche_parcelle!C14","v":"137"},"AK137",{"$f":"INDEX('Export Geomas'!J:J,MATCH('Etat complet'!D14,'Export Geomas'!L:L,0))","v":477},{"$f":"VLOOKUP(D14,'Export Geomas'!L:N,2,FALSE)","v":36},{"$f":"VLOOKUP(D14,'Export Geomas'!L:N,3,FALSE)","v":441},{"$f":"A14&\"-\"&COUNTIF(A$2:A14,A14)","v":"9-1"}]
[{"$f":"Fiche_parcelle!A15","v":9},{"$f":"Fiche_parcelle!B15","v":"AK"},{"$f":"Fiche_parcelle!C15","v":"140"},"AK140",{"$f":"INDEX('Export Geomas'!J:J,MATCH('Etat complet'!D15,'Export Geomas'!L:L,0))","v":666},{"$f":"VLOOKUP(D15,'Export Geomas'!L:N,2,FALSE)","v":138},{"$f":"VLOOKUP(D15,'Export Geomas'!L:N,3,FALSE)","v":528},{"$f":"A15&\"-\"&COUNTIF(A$2:A15,A15)","v":"9-2"}]
[{"$f":"Fiche_parcelle!A16","v":10},{"$f":"Fiche_parcelle!B16","v":"AM"},{"$f":"Fiche_parcelle!C16","v":"254"},"AM254",{"$f":"INDEX('Export Geomas'!J:J,MATCH('Etat complet'!D16,'Export Geomas'!L:L,0))","v":620},{"$f":"VLOOKUP(D16,'Export Geomas'!L:N,2,FALSE)","v":9},{"$f":"VLOOKUP(D16,'Export Geomas'!L:N,3,FALSE)","v":611},{"$f":"A16&\"-\"&COUNTIF(A$2:A16,A16)","v":"10-1"}]
[{"$f":"Fiche_parcelle!A17","v":10},{"$f":"Fiche_parcelle!B17","v":"AM"},{"$f":"Fiche_parcelle!C17","v":"319"},"AM319",{"$f":"INDEX('Export Geomas'!J:J,MATCH('Etat complet'!D17,'Export Geomas'!L:L,0))","v":284},{"$f":"VLOOKUP(D17,'Export Geomas'!L:N,2,FALSE)","v":16},{"$f":"VLOOKUP(D17,'Export Geomas'!L:N,3,FALSE)","v":268},{"$f":"A17&\"-\"&COUNTIF(A$2:A17,A17)","v":"10-2"}]
[{"$f":"Fiche_parcelle!A18","v":10},{"$f":"Fiche_parcelle!B18","v":"AM"},{"$f":"Fiche_parcelle!C18","v":"321"},"AM321",{"$f":"INDEX('Export Geomas'!J:J,MATCH('Etat complet'!D18,'Export Geomas'!L:L,0))","v":199},{"$f":"VLOOKUP(D18,'Export Geomas'!L:N,2,FALSE)","v":163},{"$f":"VLOOKUP(D18,'Export Geomas'!L:N,3,FALSE)","v":36},{"$f":"A18&\"-\"&COUNTIF(A$2:A18,A18)","v":"10-3"}]
[{"$f":"Fiche_parcelle!A19","v":10},{"$f":"Fiche_parcelle!B19","v":"AP"},{"$f":"Fiche_parcelle!C19","v":"263"},"AP263",{"$f":"INDEX('Export Geomas'!J:J,MATCH('Etat complet'!D19,'Export Geomas'!L:L,0))","v":225},{"$f":"VLOOKUP(D19,'Export Geomas'!L:N,2,FALSE)","v":22},{"$f":"VLOOKUP(D19,'Export Geomas'!L:N,3,FALSE)","v":203},{"$f":"A19&\"-\"&COUNTIF(A$2:A19,A19)","v":"10-4"}]
[{"$f":"Fiche_parcelle!A20","v":10},{"$f":"Fiche_parcelle!B20","v":"AP"},{"$f":"Fiche_parcelle!C20","v":"319"},"AP319",{"$f":"INDEX('Export Geomas'!J:J,MATCH('Etat complet'!D20,'Export Geomas'!L:L,0))","v":289},{"$f":"VLOOKUP(D20,'Export Geomas'!L:N,2,FALSE)","v":39},{"$f":"VLOOKUP(D20,'Export Geomas'!L:N,3,FALSE)","v":250},{"$f":"A20&\"-\"&COUNTIF(A$2:A20,A20)","v":"10-5"}]
[{"$f":"Fiche_parcelle!A21","v":11},{"$f":"Fiche_parcelle!B21","v":"AP"},{"$f":"Fiche_parcelle!C21","v":"318"},"AP318",{"$f":"INDEX('Export Geomas'!J:J,MATCH('Etat complet'!D21,'Export Geomas'!L:L,0))","v":1048},{"$f":"VLOOKUP(D21,'Export Geomas'!L:N,2,FALSE)","v":101},{"$f":"VLOOKUP(D21,'Export Geomas'!L:N,3,FALSE)","v":947},{"$f":"A21&\"-\"&COUNTIF(A$2:A21,A21)","v":"11-1"}]
[{"$f":"Fiche_parcelle!A22","v":12},{"$f":"Fiche_parcelle!B22","v":"AP"},{"$f":"Fiche_parcelle!C22","v":"318"},"AP318",{"$f":"INDEX('Export Geomas'!J:J,MATCH('Etat complet'!D22,'Export Geomas'!L:L,0))","v":1048},{"$f":"VLOOKUP(D22,'Export Geomas'!L:N,2,FALSE)","v":101},{"$f":"VLOOKUP(D22,'Export Geomas'!L:N,3,FALSE)","v":947},{"$f":"A22&\"-\"&COUNTIF(A$2:A22,A22)","v":"12-1"}]

{"sheet":"Propriétaires en tableau","index":6,"n_rows":60,"n_cols":46,"rows_kept":60,"cut":false,"hidden":false,"merged":[[32,2,32,5],[37,2,37,5],[42,2,42,5],[47,2,47,5],[52,2,52,5],[57,2,57,5],[2,2,2,5],[7,2,7,5],[12,2,12,5],[17,2,17,5],[22,2,22,5],[27,2,27,5]]}
["Propriétaire numéro",1]
[{"$f":"VLOOKUP(B1,'Détail propriétaire'!$1:$1048576,2,FALSE)&\" \"&VLOOKUP(B1,'Détail propriétaire'!$1:$1048576,3,FALSE)&\" \"&VLOOKUP(B1,'Détail propriétaire'!$1:$1048576,4,FALSE)&\" \"&VLOOKUP(B1,'Détail propriétaire'!$1:$1048576,5,FALSE)&\" \"&VLOOKUP(B1,'Détail propriétaire'!$1:$1048576,6,FALSE)&\" \"&VLOOKUP(B1,'Détail propriétaire'!$1:$1048576,7,FALSE)","v":"Madame A Valerie   née M"}]
[{"$f":"VLOOKUP(B1,'Détail propriétaire'!$1:$1048576,8,FALSE)","v":"demeurant Chemin Des Mimosas  04210 VILLE"},null,"TOTAL",null,null,null,1,null,null,null,2,null,null,null,3,null,null,null,4,null,null,null,5,null,null,null,6,null,null,null,7,null,null,null,8,null,null,null,9,null,null,null,10]
[null,null,"Parcelles","Surface cadastrale","Emprise servitude","Reliquat","Parcelle","Surface cadastrale","Emprise servitude","Reliquat","Parcelle","Surface cadastrale","Emprise servitude","Reliquat","Parcelle","Surface cadastrale","Emprise servitude","Reliquat","Parcelle","Surface cadastrale","Emprise servitude","Reliquat","Parcelle","Surface cadastrale","Emprise servitude","Reliquat","Parcelle","Surface cadastrale","Emprise servitude","Reliquat","Parcelle","Surface cadastrale","Emprise servitude","Reliquat","Parcelle","Surface cadastrale","Emprise servitude","Reliquat","Parcelle","Surface cadastrale","Emprise servitude","Reliquat","Parcelle","Surface cadastrale","Emprise servitude","Reliquat"]
[null,null,{"$f":"G5&\" \"&K5&\" \"&O5&\" \"&S5&\" \"&W5&\" \"&AA5&\" \"&AE5&\" \"&AI5&\" \"&AM5&\" \"&AQ5","v":"AP10         "},{"$f":"SUMIF($G4:$AT4,D4,$G5:$AT5)","v":388},{"$f":"SUMIF($G4:$AT4,E4,$G5:$AT5)","v":69},319,{"$f":"INDEX('Etat complet'!D:D,MATCH($B1&\"-\"&$G3,'Etat complet'!$H:$H,0))","v":"AP10"},{"$f":"INDEX('Etat complet'!E:E,MATCH($B1&\"-\"&$G3,'Etat complet'!$H:$H,0))","v":388},{"$f":"INDEX('Etat complet'!F:F,MATCH($B1&\"-\"&$G3,'Etat complet'!$H:$H,0))","v":69},{"$f":"INDEX('Etat complet'!G:G,MATCH($B1&\"-\"&$G3,'Etat complet'!$H:$H,0))","v":319},{"$f":"IFERROR(INDEX('Etat complet'!D:D,MATCH($B1&\"-\"&$K3,'Etat complet'!$H:$H,0)),\"\")","v":""},{"$f":"IFERROR(INDEX('Etat complet'!E:E,MATCH($B1&\"-\"&$K3,'Etat complet'!$H:$H,0)),\"\")","v":""},{"$f":"IFERROR(INDEX('Etat complet'!F:F,MATCH($B1&\"-\"&$K3,'Etat complet'!$H:$H,0)),\"\")","v":""},{"$f":"IFERROR(INDEX('Etat complet'!G:G,MATCH($B1&\"-\"&$K3,'Etat complet'!$H:$H,0)),\"\")","v":""},{"$f":"IFERROR(INDEX('Etat complet'!D:D,MATCH($B1&\"-\"&$O3,'Etat complet'!$H:$H,0)),\"\")","v":""},{"$f":"IFERROR(INDEX('Etat complet'!E:E,MATCH($B1&\"-\"&$O3,'Etat complet'!$H:$H,0)),\"\")","v":""},{"$f":"IFERROR(INDEX('Etat complet'!F:F,MATCH($B1&\"-\"&$O3,'Etat complet'!$H:$H,0)),\"\")","v":""},{"$f":"IFERROR(INDEX('Etat complet'!G:G,MATCH($B1&\"-\"&$O3,'Etat complet'!$H:$H,0)),\"\")","v":""},{"$f":"IFERROR(INDEX('Etat complet'!D:D,MATCH($B1&\"-\"&$S3,'Etat complet'!$H:$H,0)),\"\")","v":""},{"$f":"IFERROR(INDEX('Etat complet'!E:E,MATCH($B1&\"-\"&$S3,'Etat complet'!$H:$H,0)),\"\")","v":""},{"$f":"IFERROR(INDEX('Etat complet'!F:F,MATCH($B1&\"-\"&$S3,'Etat complet'!$H:$H,0)),\"\")","v":""},{"$f":"IFERROR(INDEX('Etat complet'!G:G,MATCH($B1&\"-\"&$S3,'Etat complet'!$H:$H,0)),\"\")","v":""},{"$f":"IFERROR(INDEX('Etat complet'!D:D,MATCH($B1&\"-\"&$W3,'Etat complet'!$H:$H,0)),\"\")","v":""},{"$f":"IFERROR(INDEX('Etat complet'!E:E,MATCH($B1&\"-\"&$W3,'Etat complet'!$H:$H,0)),\"\")","v":""},{"$f":"IFERROR(INDEX('Etat complet'!F:F,MATCH($B1&\"-\"&$W3,'Etat complet'!$H:$H,0)),\"\")","v":""},{"$f":"IFERROR(INDEX('Etat complet'!G:G,MATCH($B1&\"-\"&$W3,'Etat complet'!$H:$H,0)),\"\")","v":""},{"$f":"IFERROR(INDEX('Etat complet'!D:D,MATCH($B1&\"-\"&$AA3,'Etat complet'!$H:$H,0)),\"\")","v":""},{"$f":"IFERROR(INDEX('Etat complet'!E:E,MATCH($B1&\"-\"&$AA3,'Etat complet'!$H:$H,0)),\"\")","v":""},{"$f":"IFERROR(INDEX('Etat complet'!F:F,MATCH($B1&\"-\"&$AA3,'Etat complet'!$H:$H,0)),\"\")","v":""},{"$f":"IFERROR(INDEX('Etat complet'!G:G,MATCH($B1&\"-\"&$AA3,'Etat complet'!$H:$H,0)),\"\")","v":""},{"$f":"IFERROR(INDEX('Etat complet'!D:D,MATCH($B1&\"-\"&$AE3,'Etat complet'!$H:$H,0)),\"\")","v":""},{"$f":"IFERROR(INDEX('Etat complet'!E:E,MATCH($B1&\"-\"&$AE3,'Etat complet'!$H:$H,0)),\"\")","v":""},{"$f":"IFERROR(INDEX('Etat complet'!F:F,MATCH($B1&\"-\"&$AE3,'Etat complet'!$H:$H,0)),\"\")","v":""},{"$f":"IFERROR(INDEX('Etat complet'!G:G,MATCH($B1&\"-\"&$AE3,'Etat complet'!$H:$H,0)),\"\")","v":""},{"$f":"IFERROR(INDEX('Etat complet'!D:D,MATCH($B1&\"-\"&$AI3,'Etat complet'!$H:$H,0)),\"\")","v":""},{"$f":"IFERROR(INDEX('Etat complet'!E:E,MATCH($B1&\"-\"&$AI3,'Etat complet'!$H:$H,0)),\"\")","v":""},{"$f":"IFERROR(INDEX('Etat complet'!F:F,MATCH($B1&\"-\"&$AI3,'Etat complet'!$H:$H,0)),\"\")","v":""},{"$f":"IFERROR(INDEX('Etat complet'!G:G,MATCH($B1&\"-\"&$AI3,'Etat complet'!$H:$H,0)),\"\")","v":""},{"$f":"IFERROR(INDEX('Etat complet'!D:D,MATCH($B1&\"-\"&$AM3,'Etat complet'!$H:$H,0)),\"\")","v":""},{"$f":"IFERROR(INDEX('Etat complet'!E:E,MATCH($B1&\"-\"&$AM3,'Etat complet'!$H:$H,0)),\"\")","v":""},{"$f":"IFERROR(INDEX('Etat complet'!F:F,MATCH($B1&\"-\"&$AM3,'Etat complet'!$H:$H,0)),\"\")","v":""},{"$f":"IFERROR(INDEX('Etat complet'!G:G,MATCH($B1&\"-\"&$AM3,'Etat complet'!$H:$H,0)),\"\")","v":""},{"$f":"IFERROR(INDEX('Etat complet'!D:D,MATCH($B1&\"-\"&$AQ3,'Etat complet'!$H:$H,0)),\"\")","v":""},{"$f":"IFERROR(INDEX('Etat complet'!E:E,MATCH($B1&\"-\"&$AQ3,'Etat complet'!$H:$H,0)),\"\")","v":""},{"$f":"IFERROR(INDEX('Etat complet'!F:F,MATCH($B1&\"-\"&$AQ3,'Etat complet'!$H:$H,0)),\"\")","v":""},{"$f":"IFERROR(INDEX('Etat complet'!G:G,MATCH($B1&\"-\"&$AQ3,'Etat complet'!$H:$H,0)),\"\")","v":""}]
["Propriétaire numéro",2]
[{"$f":"VLOOKUP(B6,'Détail propriétaire'!$1:$1048576,2,FALSE)&\" \"&VLOOKUP(B6,'Détail propriétaire'!$1:$1048576,3,FALSE)&\" \"&VLOOKUP(B6,'Détail propriétaire'!$1:$1048576,4,FALSE)&\" \"&VLOOKUP(B6,'Détail propriétaire'!$1:$1048576,5,FALSE)&\" \"&VLOOKUP(B6,'Détail propriétaire'!$1:$1048576,6,FALSE)&\" \"&VLOOKUP(B6,'Détail propriétaire'!$1:$1048576,7,FALSE)","v":"Monsieur B Pascal   "}]
[{"$f":"VLOOKUP(B6,'Détail propriétaire'!$1:$1048576,8,FALSE)","v":"demeurant Rue Des Pâquerettes  04210 VILLE"},null,"TOTAL",null,null,null,1,null,null,null,2,null,null,null,3,null,null,null,4,null,null,null,5,null,null,null,6,null,null,null,7,null,null,null,8,null,null,null,9,null,null,null,10]
[null,null,"Parcelles","Surface cadastrale","Emprise servitude","Reliquat","Parcelle","Surface cadastrale","Emprise servitude","Reliquat","Parcelle","Surface cadastrale","Emprise servitude","Reliquat","Parcelle","Surface cadastrale","Emprise servitude","Reliquat","Parcelle","Surface cadastrale","Emprise servitude","Reliquat","Parcelle","Surface cadastrale","Emprise servitude","Reliquat","Parcelle","Surface cadastrale","Emprise servitude","Reliquat","Parcelle","Surface cadastrale","Emprise servitude","Reliquat","Parcelle","Surface cadastrale","Emprise servitude","Reliquat","Parcelle","Surface cadastrale","Emprise servitude","Reliquat","Parcelle","Surface cadastrale","Emprise servitude","Reliquat"]
[null,null,{"$f":"G10&\" \"&K10&\" \"&O10&\" \"&S10&\" \"&W10&\" \"&AA10&\" \"&AE10&\" \"&AI10&\" \"&AM10&\" \"&AQ10","v":"AP10         "},{"$f":"SUMIF($G9:$AT9,D9,$G10:$AT10)","v":388},{"$f":"SUMIF($G9:$AT9,E9,$G10:$AT10)","v":69},{"$f":"SUMIF($G9:$AT9,F9,$G10:$AT10)","v":319},{"$f":"INDEX('Etat complet'!D:D,MATCH($B6&\"-\"&$G8,'Etat complet'!$H:$H,0))","v":"AP10"},{"$f":"INDEX('Etat complet'!E:E,MATCH($B6&\"-\"&$G8,'Etat complet'!$H:$H,0))","v":388},{"$f":"INDEX('Etat complet'!F:F,MATCH($B6&\"-\"&$G8,'Etat complet'!$H:$H,0))","v":69},{"$f":"INDEX('Etat complet'!G:G,MATCH($B6&\"-\"&$G8,'Etat complet'!$H:$H,0))","v":319},{"$f":"IFERROR(INDEX('Etat complet'!D:D,MATCH($B6&\"-\"&$K8,'Etat complet'!$H:$H,0)),\"\")","v":""},{"$f":"IFERROR(INDEX('Etat complet'!E:E,MATCH($B6&\"-\"&$K8,'Etat complet'!$H:$H,0)),\"\")","v":""},{"$f":"IFERROR(INDEX('Etat complet'!F:F,MATCH($B6&\"-\"&$K8,'Etat complet'!$H:$H,0)),\"\")","v":""},{"$f":"IFERROR(INDEX('Etat complet'!G:G,MATCH($B6&\"-\"&$K8,'Etat complet'!$H:$H,0)),\"\")","v":""},{"$f":"IFERROR(INDEX('Etat complet'!D:D,MATCH($B6&\"-\"&$O8,'Etat complet'!$H:$H,0)),\"\")","v":""},{"$f":"IFERROR(INDEX('Etat complet'!E:E,MATCH($B6&\"-\"&$O8,'Etat complet'!$H:$H,0)),\"\")","v":""},{"$f":"IFERROR(INDEX('Etat complet'!F:F,MATCH($B6&\"-\"&$O8,'Etat complet'!$H:$H,0)),\"\")","v":""},{"$f":"IFERROR(INDEX('Etat complet'!G:G,MATCH($B6&\"-\"&$O8,'Etat complet'!$H:$H,0)),\"\")","v":""},{"$f":"IFERROR(INDEX('Etat complet'!D:D,MATCH($B6&\"-\"&$S8,'Etat complet'!$H:$H,0)),\"\")","v":""},{"$f":"IFERROR(INDEX('Etat complet'!E:E,MATCH($B6&\"-\"&$S8,'Etat complet'!$H:$H,0)),\"\")","v":""},{"$f":"IFERROR(INDEX('Etat complet'!F:F,MATCH($B6&\"-\"&$S8,'Etat complet'!$H:$H,0)),\"\")","v":""},{"$f":"IFERROR(INDEX('Etat complet'!G:G,MATCH($B6&\"-\"&$S8,'Etat complet'!$H:$H,0)),\"\")","v":""},{"$f":"IFERROR(INDEX('Etat complet'!D:D,MATCH($B6&\"-\"&$W8,'Etat complet'!$H:$H,0)),\"\")","v":""},{"$f":"IFERROR(INDEX('Etat complet'!E:E,MATCH($B6&\"-\"&$W8,'Etat complet'!$H:$H,0)),\"\")","v":""},{"$f":"IFERROR(INDEX('Etat complet'!F:F,MATCH($B6&\"-\"&$W8,'Etat complet'!$H:$H,0)),\"\")","v":""},{"$f":"IFERROR(INDEX('Etat complet'!G:G,MATCH($B6&\"-\"&$W8,'Etat complet'!$H:$H,0)),\"\")","v":""},{"$f":"IFERROR(INDEX('Etat complet'!D:D,MATCH($B6&\"-\"&$AA8,'Etat complet'!$H:$H,0)),\"\")","v":""},{"$f":"IFERROR(INDEX('Etat complet'!E:E,MATCH($B6&\"-\"&$AA8,'Etat complet'!$H:$H,0)),\"\")","v":""},{"$f":"IFERROR(INDEX('Etat complet'!F:F,MATCH($B6&\"-\"&$AA8,'Etat complet'!$H:$H,0)),\"\")","v":""},{"$f":"IFERROR(INDEX('Etat complet'!G:G,MATCH($B6&\"-\"&$AA8,'Etat complet'!$H:$H,0)),\"\")","v":""},{"$f":"IFERROR(INDEX('Etat complet'!D:D,MATCH($B6&\"-\"&$AE8,'Etat complet'!$H:$H,0)),\"\")","v":""},{"$f":"IFERROR(INDEX('Etat complet'!E:E,MATCH($B6&\"-\"&$AE8,'Etat complet'!$H:$H,0)),\"\")","v":""},{"$f":"IFERROR(INDEX('Etat complet'!F:F,MATCH($B6&\"-\"&$AE8,'Etat complet'!$H:$H,0)),\"\")","v":""},{"$f":"IFERROR(INDEX('Etat complet'!G:G,MATCH($B6&\"-\"&$AE8,'Etat complet'!$H:$H,0)),\"\")","v":""},{"$f":"IFERROR(INDEX('Etat complet'!D:D,MATCH($B6&\"-\"&$AI8,'Etat complet'!$H:$H,0)),\"\")","v":""},{"$f":"IFERROR(INDEX('Etat complet'!E:E,MATCH($B6&\"-\"&$AI8,'Etat complet'!$H:$H,0)),\"\")","v":""},{"$f":"IFERROR(INDEX('Etat complet'!F:F,MATCH($B6&\"-\"&$AI8,'Etat complet'!$H:$H,0)),\"\")","v":""},{"$f":"IFERROR(INDEX('Etat complet'!G:G,MATCH($B6&\"-\"&$AI8,'Etat complet'!$H:$H,0)),\"\")","v":""},{"$f":"IFERROR(INDEX('Etat complet'!D:D,MATCH($B6&\"-\"&$AM8,'Etat complet'!$H:$H,0)),\"\")","v":""},{"$f":"IFERROR(INDEX('Etat complet'!E:E,MATCH($B6&\"-\"&$AM8,'Etat complet'!$H:$H,0)),\"\")","v":""},{"$f":"IFERROR(INDEX('Etat complet'!F:F,MATCH($B6&\"-\"&$AM8,'Etat complet'!$H:$H,0)),\"\")","v":""},{"$f":"IFERROR(INDEX('Etat complet'!G:G,MATCH($B6&\"-\"&$AM8,'Etat complet'!$H:$H,0)),\"\")","v":""},{"$f":"IFERROR(INDEX('Etat complet'!D:D,MATCH($B6&\"-\"&$AQ8,'Etat complet'!$H:$H,0)),\"\")","v":""},{"$f":"IFERROR(INDEX('Etat complet'!E:E,MATCH($B6&\"-\"&$AQ8,'Etat complet'!$H:$H,0)),\"\")","v":""},{"$f":"IFERROR(INDEX('Etat complet'!F:F,MATCH($B6&\"-\"&$AQ8,'Etat complet'!$H:$H,0)),\"\")","v":""},{"$f":"IFERROR(INDEX('Etat complet'!G:G,MATCH($B6&\"-\"&$AQ8,'Etat complet'!$H:$H,0)),\"\")","v":""}]
["Propriétaire numéro",3]
[{"$f":"VLOOKUP(B11,'Détail propriétaire'!$1:$1048576,2,FALSE)&\" \"&VLOOKUP(B11,'Détail propriétaire'!$1:$1048576,3,FALSE)&\" \"&VLOOKUP(B11,'Détail propriétaire'!$1:$1048576,4,FALSE)&\" \"&VLOOKUP(B11,'Détail propriétaire'!$1:$1048576,5,FALSE)&\" \"&VLOOKUP(B11,'Détail propriétaire'!$1:$1048576,6,FALSE)&\" \"&VLOOKUP(B11,'Détail propriétaire'!$1:$1048576,7,FALSE)","v":"Monsieur C Daniel Paul  "}]
[{"$f":"VLOOKUP(B11,'Détail propriétaire'!$1:$1048576,8,FALSE)","v":"demeurant Boulevard Des Lilas  04210 VILLE"},null,"TOTAL",null,null,null,1,null,null,null,2,null,null,null,3,null,null,null,4,null,null,null,5,null,null,null,6,null,null,null,7,null,null,null,8,null,null,null,9,null,null,null,10]
[null,null,"Parcelles","Surface cadastrale","Emprise servitude","Reliquat","Parcelle","Surface cadastrale","Emprise servitude","Reliquat","Parcelle","Surface cadastrale","Emprise servitude","Reliquat","Parcelle","Surface cadastrale","Emprise servitude","Reliquat","Parcelle","Surface cadastrale","Emprise servitude","Reliquat","Parcelle","Surface cadastrale","Emprise servitude","Reliquat","Parcelle","Surface cadastrale","Emprise servitude","Reliquat","Parcelle","Surface cadastrale","Emprise servitude","Reliquat","Parcelle","Surface cadastrale","Emprise servitude","Reliquat","Parcelle","Surface cadastrale","Emprise servitude","Reliquat","Parcelle","Surface cadastrale","Emprise servitude","Reliquat"]
[null,null,{"$f":"G15&\" \"&K15&\" \"&O15&\" \"&S15&\" \"&W15&\" \"&AA15&\" \"&AE15&\" \"&AI15&\" \"&AM15&\" \"&AQ15","v":"AN171         "},{"$f":"SUMIF($G14:$AT14,D14,$G15:$AT15)","v":515},{"$f":"SUMIF($G14:$AT14,E14,$G15:$AT15)","v":9},{"$f":"SUMIF($G14:$AT14,F14,$G15:$AT15)","v":506},{"$f":"INDEX('Etat complet'!D:D,MATCH($B11&\"-\"&$G13,'Etat complet'!$H:$H,0))","v":"AN171"},{"$f":"INDEX('Etat complet'!E:E,MATCH($B11&\"-\"&$G13,'Etat complet'!$H:$H,0))","v":515},{"$f":"INDEX('Etat complet'!F:F,MATCH($B11&\"-\"&$G13,'Etat complet'!$H:$H,0))","v":9},{"$f":"INDEX('Etat complet'!G:G,MATCH($B11&\"-\"&$G13,'Etat complet'!$H:$H,0))","v":506},{"$f":"IFERROR(INDEX('Etat complet'!D:D,MATCH($B11&\"-\"&$K13,'Etat complet'!$H:$H,0)),\"\")","v":""},{"$f":"IFERROR(INDEX('Etat complet'!E:E,MATCH($B11&\"-\"&$K13,'Etat complet'!$H:$H,0)),\"\")","v":""},{"$f":"IFERROR(INDEX('Etat complet'!F:F,MATCH($B11&\"-\"&$K13,'Etat complet'!$H:$H,0)),\"\")","v":""},{"$f":"IFERROR(INDEX('Etat complet'!G:G,MATCH($B11&\"-\"&$K13,'Etat complet'!$H:$H,0)),\"\")","v":""},{"$f":"IFERROR(INDEX('Etat complet'!D:D,MATCH($B11&\"-\"&$O13,'Etat complet'!$H:$H,0)),\"\")","v":""},{"$f":"IFERROR(INDEX('Etat complet'!E:E,MATCH($B11&\"-\"&$O13,'Etat complet'!$H:$H,0)),\"\")","v":""},{"$f":"IFERROR(INDEX('Etat complet'!F:F,MATCH($B11&\"-\"&$O13,'Etat complet'!$H:$H,0)),\"\")","v":""},{"$f":"IFERROR(INDEX('Etat complet'!G:G,MATCH($B11&\"-\"&$O13,'Etat complet'!$H:$H,0)),\"\")","v":""},{"$f":"IFERROR(INDEX('Etat complet'!D:D,MATCH($B11&\"-\"&$S13,'Etat complet'!$H:$H,0)),\"\")","v":""},{"$f":"IFERROR(INDEX('Etat complet'!E:E,MATCH($B11&\"-\"&$S13,'Etat complet'!$H:$H,0)),\"\")","v":""},{"$f":"IFERROR(INDEX('Etat complet'!F:F,MATCH($B11&\"-\"&$S13,'Etat complet'!$H:$H,0)),\"\")","v":""},{"$f":"IFERROR(INDEX('Etat complet'!G:G,MATCH($B11&\"-\"&$S13,'Etat complet'!$H:$H,0)),\"\")","v":""},{"$f":"IFERROR(INDEX('Etat complet'!D:D,MATCH($B11&\"-\"&$W13,'Etat complet'!$H:$H,0)),\"\")","v":""},{"$f":"IFERROR(INDEX('Etat complet'!E:E,MATCH($B11&\"-\"&$W13,'Etat complet'!$H:$H,0)),\"\")","v":""},{"$f":"IFERROR(INDEX('Etat complet'!F:F,MATCH($B11&\"-\"&$W13,'Etat complet'!$H:$H,0)),\"\")","v":""},{"$f":"IFERROR(INDEX('Etat complet'!G:G,MATCH($B11&\"-\"&$W13,'Etat complet'!$H:$H,0)),\"\")","v":""},{"$f":"IFERROR(INDEX('Etat complet'!D:D,MATCH($B11&\"-\"&$AA13,'Etat complet'!$H:$H,0)),\"\")","v":""},{"$f":"IFERROR(INDEX('Etat complet'!E:E,MATCH($B11&\"-\"&$AA13,'Etat complet'!$H:$H,0)),\"\")","v":""},{"$f":"IFERROR(INDEX('Etat complet'!F:F,MATCH($B11&\"-\"&$AA13,'Etat complet'!$H:$H,0)),\"\")","v":""},{"$f":"IFERROR(INDEX('Etat complet'!G:G,MATCH($B11&\"-\"&$AA13,'Etat complet'!$H:$H,0)),\"\")","v":""},{"$f":"IFERROR(INDEX('Etat complet'!D:D,MATCH($B11&\"-\"&$AE13,'Etat complet'!$H:$H,0)),\"\")","v":""},{"$f":"IFERROR(INDEX('Etat complet'!E:E,MATCH($B11&\"-\"&$AE13,'Etat complet'!$H:$H,0)),\"\")","v":""},{"$f":"IFERROR(INDEX('Etat complet'!F:F,MATCH($B11&\"-\"&$AE13,'Etat complet'!$H:$H,0)),\"\")","v":""},{"$f":"IFERROR(INDEX('Etat complet'!G:G,MATCH($B11&\"-\"&$AE13,'Etat complet'!$H:$H,0)),\"\")","v":""},{"$f":"IFERROR(INDEX('Etat complet'!D:D,MATCH($B11&\"-\"&$AI13,'Etat complet'!$H:$H,0)),\"\")","v":""},{"$f":"IFERROR(INDEX('Etat complet'!E:E,MATCH($B11&\"-\"&$AI13,'Etat complet'!$H:$H,0)),\"\")","v":""},{"$f":"IFERROR(INDEX('Etat complet'!F:F,MATCH($B11&\"-\"&$AI13,'Etat complet'!$H:$H,0)),\"\")","v":""},{"$f":"IFERROR(INDEX('Etat complet'!G:G,MATCH($B11&\"-\"&$AI13,'Etat complet'!$H:$H,0)),\"\")","v":""},{"$f":"IFERROR(INDEX('Etat complet'!D:D,MATCH($B11&\"-\"&$AM13,'Etat complet'!$H:$H,0)),\"\")","v":""},{"$f":"IFERROR(INDEX('Etat complet'!E:E,MATCH($B11&\"-\"&$AM13,'Etat complet'!$H:$H,0)),\"\")","v":""},{"$f":"IFERROR(INDEX('Etat complet'!F:F,MATCH($B11&\"-\"&$AM13,'Etat complet'!$H:$H,0)),\"\")","v":""},{"$f":"IFERROR(INDEX('Etat complet'!G:G,MATCH($B11&\"-\"&$AM13,'Etat complet'!$H:$H,0)),\"\")","v":""},{"$f":"IFERROR(INDEX('Etat complet'!D:D,MATCH($B11&\"-\"&$AQ13,'Etat complet'!$H:$H,0)),\"\")","v":""},{"$f":"IFERROR(INDEX('Etat complet'!E:E,MATCH($B11&\"-\"&$AQ13,'Etat complet'!$H:$H,0)),\"\")","v":""},{"$f":"IFERROR(INDEX('Etat complet'!F:F,MATCH($B11&\"-\"&$AQ13,'Etat complet'!$H:$H,0)),\"\")","v":""},{"$f":"IFERROR(INDEX('Etat complet'!G:G,MATCH($B11&\"-\"&$AQ13,'Etat complet'!$H:$H,0)),\"\")","v":""}]
["Propriétaire numéro",4]
[{"$f":"VLOOKUP(B16,'Détail propriétaire'!$1:$1048576,2,FALSE)&\" \"&VLOOKUP(B16,'Détail propriétaire'!$1:$1048576,3,FALSE)&\" \"&VLOOKUP(B16,'Détail propriétaire'!$1:$1048576,4,FALSE)&\" \"&VLOOKUP(B16,'Détail propriétaire'!$1:$1048576,5,FALSE)&\" \"&VLOOKUP(B16,'Détail propriétaire'!$1:$1048576,6,FALSE)&\" \"&VLOOKUP(B16,'Détail propriétaire'!$1:$1048576,7,FALSE)","v":"Monsieur D Joseph Martin Nazaire "}]
[{"$f":"VLOOKUP(B16,'Détail propriétaire'!$1:$1048576,8,FALSE)","v":"demeurant Impasse Des Champs  04210 VILLE"},null,"TOTAL",null,null,null,1,null,null,null,2,null,null,null,3,null,null,null,4,null,null,null,5,null,null,null,6,null,null,null,7,null,null,null,8,null,null,null,9,null,null,null,10]
[null,null,"Parcelles","Surface cadastrale","Emprise servitude","Reliquat","Parcelle","Surface cadastrale","Emprise servitude","Reliquat","Parcelle","Surface cadastrale","Emprise servitude","Reliquat","Parcelle","Surface cadastrale","Emprise servitude","Reliquat","Parcelle","Surface cadastrale","Emprise servitude","Reliquat","Parcelle","Surface cadastrale","Emprise servitude","Reliquat","Parcelle","Surface cadastrale","Emprise servitude","Reliquat","Parcelle","Surface cadastrale","Emprise servitude","Reliquat","Parcelle","Surface cadastrale","Emprise servitude","Reliquat","Parcelle","Surface cadastrale","Emprise servitude","Reliquat","Parcelle","Surface cadastrale","Emprise servitude","Reliquat"]
[null,null,{"$f":"G20&\" \"&K20&\" \"&O20&\" \"&S20&\" \"&W20&\" \"&AA20&\" \"&AE20&\" \"&AI20&\" \"&AM20&\" \"&AQ20","v":"AP115         "},{"$f":"SUMIF($G19:$AT19,D19,$G20:$AT20)","v":211},{"$f":"SUMIF($G19:$AT19,E19,$G20:$AT20)","v":52},{"$f":"SUMIF($G19:$AT19,F19,$G20:$AT20)","v":159},{"$f":"INDEX('Etat complet'!D:D,MATCH($B16&\"-\"&$G18,'Etat complet'!$H:$H,0))","v":"AP115"},{"$f":"INDEX('Etat complet'!E:E,MATCH($B16&\"-\"&$G18,'Etat complet'!$H:$H,0))","v":211},{"$f":"INDEX('Etat complet'!F:F,MATCH($B16&\"-\"&$G18,'Etat complet'!$H:$H,0))","v":52},{"$f":"INDEX('Etat complet'!G:G,MATCH($B16&\"-\"&$G18,'Etat complet'!$H:$H,0))","v":159},{"$f":"IFERROR(INDEX('Etat complet'!D:D,MATCH($B16&\"-\"&$K18,'Etat complet'!$H:$H,0)),\"\")","v":""},{"$f":"IFERROR(INDEX('Etat complet'!E:E,MATCH($B16&\"-\"&$K18,'Etat complet'!$H:$H,0)),\"\")","v":""},{"$f":"IFERROR(INDEX('Etat complet'!F:F,MATCH($B16&\"-\"&$K18,'Etat complet'!$H:$H,0)),\"\")","v":""},{"$f":"IFERROR(INDEX('Etat complet'!G:G,MATCH($B16&\"-\"&$K18,'Etat complet'!$H:$H,0)),\"\")","v":""},{"$f":"IFERROR(INDEX('Etat complet'!D:D,MATCH($B16&\"-\"&$O18,'Etat complet'!$H:$H,0)),\"\")","v":""},{"$f":"IFERROR(INDEX('Etat complet'!E:E,MATCH($B16&\"-\"&$O18,'Etat complet'!$H:$H,0)),\"\")","v":""},{"$f":"IFERROR(INDEX('Etat complet'!F:F,MATCH($B16&\"-\"&$O18,'Etat complet'!$H:$H,0)),\"\")","v":""},{"$f":"IFERROR(INDEX('Etat complet'!G:G,MATCH($B16&\"-\"&$O18,'Etat complet'!$H:$H,0)),\"\")","v":""},{"$f":"IFERROR(INDEX('Etat complet'!D:D,MATCH($B16&\"-\"&$S18,'Etat complet'!$H:$H,0)),\"\")","v":""},{"$f":"IFERROR(INDEX('Etat complet'!E:E,MATCH($B16&\"-\"&$S18,'Etat complet'!$H:$H,0)),\"\")","v":""},{"$f":"IFERROR(INDEX('Etat complet'!F:F,MATCH($B16&\"-\"&$S18,'Etat complet'!$H:$H,0)),\"\")","v":""},{"$f":"IFERROR(INDEX('Etat complet'!G:G,MATCH($B16&\"-\"&$S18,'Etat complet'!$H:$H,0)),\"\")","v":""},{"$f":"IFERROR(INDEX('Etat complet'!D:D,MATCH($B16&\"-\"&$W18,'Etat complet'!$H:$H,0)),\"\")","v":""},{"$f":"IFERROR(INDEX('Etat complet'!E:E,MATCH($B16&\"-\"&$W18,'Etat complet'!$H:$H,0)),\"\")","v":""},{"$f":"IFERROR(INDEX('Etat complet'!F:F,MATCH($B16&\"-\"&$W18,'Etat complet'!$H:$H,0)),\"\")","v":""},{"$f":"IFERROR(INDEX('Etat complet'!G:G,MATCH($B16&\"-\"&$W18,'Etat complet'!$H:$H,0)),\"\")","v":""},{"$f":"IFERROR(INDEX('Etat complet'!D:D,MATCH($B16&\"-\"&$AA18,'Etat complet'!$H:$H,0)),\"\")","v":""},{"$f":"IFERROR(INDEX('Etat complet'!E:E,MATCH($B16&\"-\"&$AA18,'Etat complet'!$H:$H,0)),\"\")","v":""},{"$f":"IFERROR(INDEX('Etat complet'!F:F,MATCH($B16&\"-\"&$AA18,'Etat complet'!$H:$H,0)),\"\")","v":""},{"$f":"IFERROR(INDEX('Etat complet'!G:G,MATCH($B16&\"-\"&$AA18,'Etat complet'!$H:$H,0)),\"\")","v":""},{"$f":"IFERROR(INDEX('Etat complet'!D:D,MATCH($B16&\"-\"&$AE18,'Etat complet'!$H:$H,0)),\"\")","v":""},{"$f":"IFERROR(INDEX('Etat complet'!E:E,MATCH($B16&\"-\"&$AE18,'Etat complet'!$H:$H,0)),\"\")","v":""},{"$f":"IFERROR(INDEX('Etat complet'!F:F,MATCH($B16&\"-\"&$AE18,'Etat complet'!$H:$H,0)),\"\")","v":""},{"$f":"IFERROR(INDEX('Etat complet'!G:G,MATCH($B16&\"-\"&$AE18,'Etat complet'!$H:$H,0)),\"\")","v":""},{"$f":"IFERROR(INDEX('Etat complet'!D:D,MATCH($B16&\"-\"&$AI18,'Etat complet'!$H:$H,0)),\"\")","v":""},{"$f":"IFERROR(INDEX('Etat complet'!E:E,MATCH($B16&\"-\"&$AI18,'Etat complet'!$H:$H,0)),\"\")","v":""},{"$f":"IFERROR(INDEX('Etat complet'!F:F,MATCH($B16&\"-\"&$AI18,'Etat complet'!$H:$H,0)),\"\")","v":""},{"$f":"IFERROR(INDEX('Etat complet'!G:G,MATCH($B16&\"-\"&$AI18,'Etat complet'!$H:$H,0)),\"\")","v":""},{"$f":"IFERROR(INDEX('Etat complet'!D:D,MATCH($B16&\"-\"&$AM18,'Etat complet'!$H:$H,0)),\"\")","v":""},{"$f":"IFERROR(INDEX('Etat complet'!E:E,MATCH($B16&\"-\"&$AM18,'Etat complet'!$H:$H,0)),\"\")","v":""},{"$f":"IFERROR(INDEX('Etat complet'!F:F,MATCH($B16&\"-\"&$AM18,'Etat complet'!$H:$H,0)),\"\")","v":""},{"$f":"IFERROR(INDEX('Etat complet'!G:G,MATCH($B16&\"-\"&$AM18,'Etat complet'!$H:$H,0)),\"\")","v":""},{"$f":"IFERROR(INDEX('Etat complet'!D:D,MATCH($B16&\"-\"&$AQ18,'Etat complet'!$H:$H,0)),\"\")","v":""},{"$f":"IFERROR(INDEX('Etat complet'!E:E,MATCH($B16&\"-\"&$AQ18,'Etat complet'!$H:$H,0)),\"\")","v":""},{"$f":"IFERROR(INDEX('Etat complet'!F:F,MATCH($B16&\"-\"&$AQ18,'Etat complet'!$H:$H,0)),\"\")","v":""},{"$f":"IFERROR(INDEX('Etat complet'!G:G,MATCH($B16&\"-\"&$AQ18,'Etat complet'!$H:$H,0)),\"\")","v":""}]
["Propriétaire numéro",5]
[{"$f":"VLOOKUP(B21,'Détail propriétaire'!$1:$1048576,2,FALSE)&\" \"&VLOOKUP(B21,'Détail propriétaire'!$1:$1048576,3,FALSE)&\" \"&VLOOKUP(B21,'Détail propriétaire'!$1:$1048576,4,FALSE)&\" \"&VLOOKUP(B21,'Détail propriétaire'!$1:$1048576,5,FALSE)&\" \"&VLOOKUP(B21,'Détail propriétaire'!$1:$1048576,6,FALSE)&\" \"&VLOOKUP(B21,'Détail propriétaire'!$1:$1048576,7,FALSE)","v":"Société E    "}]
[{"$f":"VLOOKUP(B21,'Détail propriétaire'!$1:$1048576,8,FALSE)","v":"demeurant Rue Des Tilleuls  04210 VILLE"},null,"TOTAL",null,null,null,1,null,null,null,2,null,null,null,3,null,null,null,4,null,null,null,5,null,null,null,6,null,null,null,7,null,null,null,8,null,null,null,9,null,null,null,10]
[null,null,"Parcelles","Surface cadastrale","Emprise servitude","Reliquat","Parcelle","Surface cadastrale","Emprise servitude","Reliquat","Parcelle","Surface cadastrale","Emprise servitude","Reliquat","Parcelle","Surface cadastrale","Emprise servitude","Reliquat","Parcelle","Surface cadastrale","Emprise servitude","Reliquat","Parcelle","Surface cadastrale","Emprise servitude","Reliquat","Parcelle","Surface cadastrale","Emprise servitude","Reliquat","Parcelle","Surface cadastrale","Emprise servitude","Reliquat","Parcelle","Surface cadastrale","Emprise servitude","Reliquat","Parcelle","Surface cadastrale","Emprise servitude","Reliquat","Parcelle","Surface cadastrale","Emprise servitude","Reliquat"]
[null,null,null,{"$f":"SUMIF($G24:$AT24,D24,$G25:$AT25)","v":420},{"$f":"SUMIF($G24:$AT24,E24,$G25:$AT25)","v":98},{"$f":"SUMIF($G24:$AT24,F24,$G25:$AT25)","v":322},{"$f":"INDEX('Etat complet'!D:D,MATCH($B21&\"-\"&$G23,'Etat complet'!$H:$H,0))","v":"AP11"},{"$f":"INDEX('Etat complet'!E:E,MATCH($B21&\"-\"&$G23,'Etat complet'!$H:$H,0))","v":420},{"$f":"INDEX('Etat complet'!F:F,MATCH($B21&\"-\"&$G23,'Etat complet'!$H:$H,0))","v":98},{"$f":"INDEX('Etat complet'!G:G,MATCH($B21&\"-\"&$G23,'Etat complet'!$H:$H,0))","v":322},{"$f":"IFERROR(INDEX('Etat complet'!D:D,MATCH($B21&\"-\"&$K23,'Etat complet'!$H:$H,0)),\"\")","v":""},{"$f":"IFERROR(INDEX('Etat complet'!E:E,MATCH($B21&\"-\"&$K23,'Etat complet'!$H:$H,0)),\"\")","v":""},{"$f":"IFERROR(INDEX('Etat complet'!F:F,MATCH($B21&\"-\"&$K23,'Etat complet'!$H:$H,0)),\"\")","v":""},{"$f":"IFERROR(INDEX('Etat complet'!G:G,MATCH($B21&\"-\"&$K23,'Etat complet'!$H:$H,0)),\"\")","v":""},{"$f":"IFERROR(INDEX('Etat complet'!D:D,MATCH($B21&\"-\"&$O23,'Etat complet'!$H:$H,0)),\"\")","v":""},{"$f":"IFERROR(INDEX('Etat complet'!E:E,MATCH($B21&\"-\"&$O23,'Etat complet'!$H:$H,0)),\"\")","v":""},{"$f":"IFERROR(INDEX('Etat complet'!F:F,MATCH($B21&\"-\"&$O23,'Etat complet'!$H:$H,0)),\"\")","v":""},{"$f":"IFERROR(INDEX('Etat complet'!G:G,MATCH($B21&\"-\"&$O23,'Etat complet'!$H:$H,0)),\"\")","v":""},{"$f":"IFERROR(INDEX('Etat complet'!D:D,MATCH($B21&\"-\"&$S23,'Etat complet'!$H:$H,0)),\"\")","v":""},{"$f":"IFERROR(INDEX('Etat complet'!E:E,MATCH($B21&\"-\"&$S23,'Etat complet'!$H:$H,0)),\"\")","v":""},{"$f":"IFERROR(INDEX('Etat complet'!F:F,MATCH($B21&\"-\"&$S23,'Etat complet'!$H:$H,0)),\"\")","v":""},{"$f":"IFERROR(INDEX('Etat complet'!G:G,MATCH($B21&\"-\"&$S23,'Etat complet'!$H:$H,0)),\"\")","v":""},{"$f":"IFERROR(INDEX('Etat complet'!D:D,MATCH($B21&\"-\"&$W23,'Etat complet'!$H:$H,0)),\"\")","v":""},{"$f":"IFERROR(INDEX('Etat complet'!E:E,MATCH($B21&\"-\"&$W23,'Etat complet'!$H:$H,0)),\"\")","v":""},{"$f":"IFERROR(INDEX('Etat complet'!F:F,MATCH($B21&\"-\"&$W23,'Etat complet'!$H:$H,0)),\"\")","v":""},{"$f":"IFERROR(INDEX('Etat complet'!G:G,MATCH($B21&\"-\"&$W23,'Etat complet'!$H:$H,0)),\"\")","v":""},{"$f":"IFERROR(INDEX('Etat complet'!D:D,MATCH($B21&\"-\"&$AA23,'Etat complet'!$H:$H,0)),\"\")","v":""},{"$f":"IFERROR(INDEX('Etat complet'!E:E,MATCH($B21&\"-\"&$AA23,'Etat complet'!$H:$H,0)),\"\")","v":""},{"$f":"IFERROR(INDEX('Etat complet'!F:F,MATCH($B21&\"-\"&$AA23,'Etat complet'!$H:$H,0)),\"\")","v":""},{"$f":"IFERROR(INDEX('Etat complet'!G:G,MATCH($B21&\"-\"&$AA23,'Etat complet'!$H:$H,0)),\"\")","v":""},{"$f":"IFERROR(INDEX('Etat complet'!D:D,MATCH($B21&\"-\"&$AE23,'Etat complet'!$H:$H,0)),\"\")","v":""},{"$f":"IFERROR(INDEX('Etat complet'!E:E,MATCH($B21&\"-\"&$AE23,'Etat complet'!$H:$H,0)),\"\")","v":""},{"$f":"IFERROR(INDEX('Etat complet'!F:F,MATCH($B21&\"-\"&$AE23,'Etat complet'!$H:$H,0)),\"\")","v":""},{"$f":"IFERROR(INDEX('Etat complet'!G:G,MATCH($B21&\"-\"&$AE23,'Etat complet'!$H:$H,0)),\"\")","v":""},{"$f":"IFERROR(INDEX('Etat complet'!D:D,MATCH($B21&\"-\"&$AI23,'Etat complet'!$H:$H,0)),\"\")","v":""},{"$f":"IFERROR(INDEX('Etat complet'!E:E,MATCH($B21&\"-\"&$AI23,'Etat complet'!$H:$H,0)),\"\")","v":""},{"$f":"IFERROR(INDEX('Etat complet'!F:F,MATCH($B21&\"-\"&$AI23,'Etat complet'!$H:$H,0)),\"\")","v":""},{"$f":"IFERROR(INDEX('Etat complet'!G:G,MATCH($B21&\"-\"&$AI23,'Etat complet'!$H:$H,0)),\"\")","v":""},{"$f":"IFERROR(INDEX('Etat complet'!D:D,MATCH($B21&\"-\"&$AM23,'Etat complet'!$H:$H,0)),\"\")","v":""},{"$f":"IFERROR(INDEX('Etat complet'!E:E,MATCH($B21&\"-\"&$AM23,'Etat complet'!$H:$H,0)),\"\")","v":""},{"$f":"IFERROR(INDEX('Etat complet'!F:F,MATCH($B21&\"-\"&$AM23,'Etat complet'!$H:$H,0)),\"\")","v":""},{"$f":"IFERROR(INDEX('Etat complet'!G:G,MATCH($B21&\"-\"&$AM23,'Etat complet'!$H:$H,0)),\"\")","v":""},{"$f":"IFERROR(INDEX('Etat complet'!D:D,MATCH($B21&\"-\"&$AQ23,'Etat complet'!$H:$H,0)),\"\")","v":""},{"$f":"IFERROR(INDEX('Etat complet'!E:E,MATCH($B21&\"-\"&$AQ23,'Etat complet'!$H:$H,0)),\"\")","v":""},{"$f":"IFERROR(INDEX('Etat complet'!F:F,MATCH($B21&\"-\"&$AQ23,'Etat complet'!$H:$H,0)),\"\")","v":""},{"$f":"IFERROR(INDEX('Etat complet'!G:G,MATCH($B21&\"-\"&$AQ23,'Etat complet'!$H:$H,0)),\"\")","v":""}]
["Propriétaire numéro",6]
[{"$f":"VLOOKUP(B26,'Détail propriétaire'!$1:$1048576,2,FALSE)&\" \"&VLOOKUP(B26,'Détail propriétaire'!$1:$1048576,3,FALSE)&\" \"&VLOOKUP(B26,'Détail propriétaire'!$1:$1048576,4,FALSE)&\" \"&VLOOKUP(B26,'Détail propriétaire'!$1:$1048576,5,FALSE)&\" \"&VLOOKUP(B26,'Détail propriétaire'!$1:$1048576,6,FALSE)&\" \"&VLOOKUP(B26,'Détail propriétaire'!$1:$1048576,7,FALSE)","v":"Madame F Arlette Emilia  née N"}]
[{"$f":"VLOOKUP(B26,'Détail propriétaire'!$1:$1048576,8,FALSE)","v":"demeurant Place Aux Roses  04210 VILLE"},null,"TOTAL",null,null,null,1,null,null,null,2,null,null,null,3,null,null,null,4,null,null,null,5,null,null,null,6,null,null,null,7,null,null,null,8,null,null,null,9,null,null,null,10]
[null,null,"Parcelles","Surface cadastrale","Emprise servitude","Reliquat","Parcelle","Surface cadastrale","Emprise servitude","Reliquat","Parcelle","Surface cadastrale","Emprise servitude","Reliquat","Parcelle","Surface cadastrale","Emprise servitude","Reliquat","Parcelle","Surface cadastrale","Emprise servitude","Reliquat","Parcelle","Surface cadastrale","Emprise servitude","Reliquat","Parcelle","Surface cadastrale","Emprise servitude","Reliquat","Parcelle","Surface cadastrale","Emprise servitude","Reliquat","Parcelle","Surface cadastrale","Emprise servitude","Reliquat","Parcelle","Surface cadastrale","Emprise servitude","Reliquat","Parcelle","Surface cadastrale","Emprise servitude","Reliquat"]
[null,null,{"$f":"G30&\" \"&K30&\" \"&O30&\" \"&S30&\" \"&W30&\" \"&AA30&\" \"&AE30&\" \"&AI30&\" \"&AM30&\" \"&AQ30","v":"D1884 D1885        "},{"$f":"SUMIF($G29:$AT29,D29,$G30:$AT30)","v":688},{"$f":"SUMIF($G29:$AT29,E29,$G30:$AT30)","v":71},{"$f":"SUMIF($G29:$AT29,F29,$G30:$AT30)","v":617},{"$f":"INDEX('Etat complet'!D:D,MATCH($B26&\"-\"&$G28,'Etat complet'!$H:$H,0))","v":"D1884"},{"$f":"INDEX('Etat complet'!E:E,MATCH($B26&\"-\"&$G28,'Etat complet'!$H:$H,0))","v":604},{"$f":"INDEX('Etat complet'!F:F,MATCH($B26&\"-\"&$G28,'Etat complet'!$H:$H,0))","v":16},{"$f":"INDEX('Etat complet'!G:G,MATCH($B26&\"-\"&$G28,'Etat complet'!$H:$H,0))","v":588},{"$f":"IFERROR(INDEX('Etat complet'!D:D,MATCH($B26&\"-\"&$K28,'Etat complet'!$H:$H,0)),\"\")","v":"D1885"},{"$f":"IFERROR(INDEX('Etat complet'!E:E,MATCH($B26&\"-\"&$K28,'Etat complet'!$H:$H,0)),\"\")","v":84},{"$f":"IFERROR(INDEX('Etat complet'!F:F,MATCH($B26&\"-\"&$K28,'Etat complet'!$H:$H,0)),\"\")","v":55},{"$f":"IFERROR(INDEX('Etat complet'!G:G,MATCH($B26&\"-\"&$K28,'Etat complet'!$H:$H,0)),\"\")","v":29},{"$f":"IFERROR(INDEX('Etat complet'!D:D,MATCH($B26&\"-\"&$O28,'Etat complet'!$H:$H,0)),\"\")","v":""},{"$f":"IFERROR(INDEX('Etat complet'!E:E,MATCH($B26&\"-\"&$O28,'Etat complet'!$H:$H,0)),\"\")","v":""},{"$f":"IFERROR(INDEX('Etat complet'!F:F,MATCH($B26&\"-\"&$O28,'Etat complet'!$H:$H,0)),\"\")","v":""},{"$f":"IFERROR(INDEX('Etat complet'!G:G,MATCH($B26&\"-\"&$O28,'Etat complet'!$H:$H,0)),\"\")","v":""},{"$f":"IFERROR(INDEX('Etat complet'!D:D,MATCH($B26&\"-\"&$S28,'Etat complet'!$H:$H,0)),\"\")","v":""},{"$f":"IFERROR(INDEX('Etat complet'!E:E,MATCH($B26&\"-\"&$S28,'Etat complet'!$H:$H,0)),\"\")","v":""},{"$f":"IFERROR(INDEX('Etat complet'!F:F,MATCH($B26&\"-\"&$S28,'Etat complet'!$H:$H,0)),\"\")","v":""},{"$f":"IFERROR(INDEX('Etat complet'!G:G,MATCH($B26&\"-\"&$S28,'Etat complet'!$H:$H,0)),\"\")","v":""},{"$f":"IFERROR(INDEX('Etat complet'!D:D,MATCH($B26&\"-\"&$W28,'Etat complet'!$H:$H,0)),\"\")","v":""},{"$f":"IFERROR(INDEX('Etat complet'!E:E,MATCH($B26&\"-\"&$W28,'Etat complet'!$H:$H,0)),\"\")","v":""},{"$f":"IFERROR(INDEX('Etat complet'!F:F,MATCH($B26&\"-\"&$W28,'Etat complet'!$H:$H,0)),\"\")","v":""},{"$f":"IFERROR(INDEX('Etat complet'!G:G,MATCH($B26&\"-\"&$W28,'Etat complet'!$H:$H,0)),\"\")","v":""},{"$f":"IFERROR(INDEX('Etat complet'!D:D,MATCH($B26&\"-\"&$AA28,'Etat complet'!$H:$H,0)),\"\")","v":""},{"$f":"IFERROR(INDEX('Etat complet'!E:E,MATCH($B26&\"-\"&$AA28,'Etat complet'!$H:$H,0)),\"\")","v":""},{"$f":"IFERROR(INDEX('Etat complet'!F:F,MATCH($B26&\"-\"&$AA28,'Etat complet'!$H:$H,0)),\"\")","v":""},{"$f":"IFERROR(INDEX('Etat complet'!G:G,MATCH($B26&\"-\"&$AA28,'Etat complet'!$H:$H,0)),\"\")","v":""},{"$f":"IFERROR(INDEX('Etat complet'!D:D,MATCH($B26&\"-\"&$AE28,'Etat complet'!$H:$H,0)),\"\")","v":""},{"$f":"IFERROR(INDEX('Etat complet'!E:E,MATCH($B26&\"-\"&$AE28,'Etat complet'!$H:$H,0)),\"\")","v":""},{"$f":"IFERROR(INDEX('Etat complet'!F:F,MATCH($B26&\"-\"&$AE28,'Etat complet'!$H:$H,0)),\"\")","v":""},{"$f":"IFERROR(INDEX('Etat complet'!G:G,MATCH($B26&\"-\"&$AE28,'Etat complet'!$H:$H,0)),\"\")","v":""},{"$f":"IFERROR(INDEX('Etat complet'!D:D,MATCH($B26&\"-\"&$AI28,'Etat complet'!$H:$H,0)),\"\")","v":""},{"$f":"IFERROR(INDEX('Etat complet'!E:E,MATCH($B26&\"-\"&$AI28,'Etat complet'!$H:$H,0)),\"\")","v":""},{"$f":"IFERROR(INDEX('Etat complet'!F:F,MATCH($B26&\"-\"&$AI28,'Etat complet'!$H:$H,0)),\"\")","v":""},{"$f":"IFERROR(INDEX('Etat complet'!G:G,MATCH($B26&\"-\"&$AI28,'Etat complet'!$H:$H,0)),\"\")","v":""},{"$f":"IFERROR(INDEX('Etat complet'!D:D,MATCH($B26&\"-\"&$AM28,'Etat complet'!$H:$H,0)),\"\")","v":""},{"$f":"IFERROR(INDEX('Etat complet'!E:E,MATCH($B26&\"-\"&$AM28,'Etat complet'!$H:$H,0)),\"\")","v":""},{"$f":"IFERROR(INDEX('Etat complet'!F:F,MATCH($B26&\"-\"&$AM28,'Etat complet'!$H:$H,0)),\"\")","v":""},{"$f":"IFERROR(INDEX('Etat complet'!G:G,MATCH($B26&\"-\"&$AM28,'Etat complet'!$H:$H,0)),\"\")","v":""},{"$f":"IFERROR(INDEX('Etat complet'!D:D,MATCH($B26&\"-\"&$AQ28,'Etat complet'!$H:$H,0)),\"\")","v":""},{"$f":"IFERROR(INDEX('Etat complet'!E:E,MATCH($B26&\"-\"&$AQ28,'Etat complet'!$H:$H,0)),\"\")","v":""},{"$f":"IFERROR(INDEX('Etat complet'!F:F,MATCH($B26&\"-\"&$AQ28,'Etat complet'!$H:$H,0)),\"\")","v":""},{"$f":"IFERROR(INDEX('Etat complet'!G:G,MATCH($B26&\"-\"&$AQ28,'Etat complet'!$H:$H,0)),\"\")","v":""}]
["Propriétaire numéro",7]
[{"$f":"VLOOKUP(B31,'Détail propriétaire'!$1:$1048576,2,FALSE)&\" \"&VLOOKUP(B31,'Détail propriétaire'!$1:$1048576,3,FALSE)&\" \"&VLOOKUP(B31,'Détail propriétaire'!$1:$1048576,4,FALSE)&\" \"&VLOOKUP(B31,'Détail propriétaire'!$1:$1048576,5,FALSE)&\" \"&VLOOKUP(B31,'Détail propriétaire'!$1:$1048576,6,FALSE)&\" \"&VLOOKUP(B31,'Détail propriétaire'!$1:$1048576,7,FALSE)","v":"Madame G Elvire Marcelle Louise née O"}]
[{"$f":"VLOOKUP(B31,'Détail propriétaire'!$1:$1048576,8,FALSE)","v":"demeurant Avenue Inconnue  04210 VILLE"},null,"TOTAL",null,null,null,1,null,null,null,2,null,null,null,3,null,null,null,4,null,null,null,5,null,null,null,6,null,null,null,7,null,null,null,8,null,null,null,9,null,null,null,10]
[null,null,"Parcelles","Surface cadastrale","Emprise servitude","Reliquat","Parcelle","Surface cadastrale","Emprise servitude","Reliquat","Parcelle","Surface cadastrale","Emprise servitude","Reliquat","Parcelle","Surface cadastrale","Emprise servitude","Reliquat","Parcelle","Surface cadastrale","Emprise servitude","Reliquat","Parcelle","Surface cadastrale","Emprise servitude","Reliquat","Parcelle","Surface cadastrale","Emprise servitude","Reliquat","Parcelle","Surface cadastrale","Emprise servitude","Reliquat","Parcelle","Surface cadastrale","Emprise servitude","Reliquat","Parcelle","Surface cadastrale","Emprise servitude","Reliquat","Parcelle","Surface cadastrale","Emprise servitude","Reliquat"]
[null,null,{"$f":"G35&\" \"&K35&\" \"&O35&\" \"&S35&\" \"&W35&\" \"&AA35&\" \"&AE35&\" \"&AI35&\" \"&AM35&\" \"&AQ35","v":"AP317 D3286 D3287       "},{"$f":"SUMIF($G34:$AT34,D34,$G35:$AT35)","v":2415},{"$f":"SUMIF($G34:$AT34,E34,$G35:$AT35)","v":338},{"$f":"SUMIF($G34:$AT34,F34,$G35:$AT35)","v":2077},{"$f":"INDEX('Etat complet'!D:D,MATCH($B31&\"-\"&$G33,'Etat complet'!$H:$H,0))","v":"AP317"},{"$f":"INDEX('Etat complet'!E:E,MATCH($B31&\"-\"&$G33,'Etat complet'!$H:$H,0))","v":1135},{"$f":"INDEX('Etat complet'!F:F,MATCH($B31&\"-\"&$G33,'Etat complet'!$H:$H,0))","v":8},{"$f":"INDEX('Etat complet'!G:G,MATCH($B31&\"-\"&$G33,'Etat complet'!$H:$H,0))","v":1127},{"$f":"IFERROR(INDEX('Etat complet'!D:D,MATCH($B31&\"-\"&$K33,'Etat complet'!$H:$H,0)),\"\")","v":"D3286"},{"$f":"IFERROR(INDEX('Etat complet'!E:E,MATCH($B31&\"-\"&$K33,'Etat complet'!$H:$H,0)),\"\")","v":480},{"$f":"IFERROR(INDEX('Etat complet'!F:F,MATCH($B31&\"-\"&$K33,'Etat complet'!$H:$H,0)),\"\")","v":130},{"$f":"IFERROR(INDEX('Etat complet'!G:G,MATCH($B31&\"-\"&$K33,'Etat complet'!$H:$H,0)),\"\")","v":350},{"$f":"IFERROR(INDEX('Etat complet'!D:D,MATCH($B31&\"-\"&$O33,'Etat complet'!$H:$H,0)),\"\")","v":"D3287"},{"$f":"IFERROR(INDEX('Etat complet'!E:E,MATCH($B31&\"-\"&$O33,'Etat complet'!$H:$H,0)),\"\")","v":800},{"$f":"IFERROR(INDEX('Etat complet'!F:F,MATCH($B31&\"-\"&$O33,'Etat complet'!$H:$H,0)),\"\")","v":200},{"$f":"IFERROR(INDEX('Etat complet'!G:G,MATCH($B31&\"-\"&$O33,'Etat complet'!$H:$H,0)),\"\")","v":600},{"$f":"IFERROR(INDEX('Etat complet'!D:D,MATCH($B31&\"-\"&$S33,'Etat complet'!$H:$H,0)),\"\")","v":""},{"$f":"IFERROR(INDEX('Etat complet'!E:E,MATCH($B31&\"-\"&$S33,'Etat complet'!$H:$H,0)),\"\")","v":""},{"$f":"IFERROR(INDEX('Etat complet'!F:F,MATCH($B31&\"-\"&$S33,'Etat complet'!$H:$H,0)),\"\")","v":""},{"$f":"IFERROR(INDEX('Etat complet'!G:G,MATCH($B31&\"-\"&$S33,'Etat complet'!$H:$H,0)),\"\")","v":""},{"$f":"IFERROR(INDEX('Etat complet'!D:D,MATCH($B31&\"-\"&$W33,'Etat complet'!$H:$H,0)),\"\")","v":""},{"$f":"IFERROR(INDEX('Etat complet'!E:E,MATCH($B31&\"-\"&$W33,'Etat complet'!$H:$H,0)),\"\")","v":""},{"$f":"IFERROR(INDEX('Etat complet'!F:F,MATCH($B31&\"-\"&$W33,'Etat complet'!$H:$H,0)),\"\")","v":""},{"$f":"IFERROR(INDEX('Etat complet'!G:G,MATCH($B31&\"-\"&$W33,'Etat complet'!$H:$H,0)),\"\")","v":""},{"$f":"IFERROR(INDEX('Etat complet'!D:D,MATCH($B31&\"-\"&$AA33,'Etat complet'!$H:$H,0)),\"\")","v":""},{"$f":"IFERROR(INDEX('Etat complet'!E:E,MATCH($B31&\"-\"&$AA33,'Etat complet'!$H:$H,0)),\"\")","v":""},{"$f":"IFERROR(INDEX('Etat complet'!F:F,MATCH($B31&\"-\"&$AA33,'Etat complet'!$H:$H,0)),\"\")","v":""},{"$f":"IFERROR(INDEX('Etat complet'!G:G,MATCH($B31&\"-\"&$AA33,'Etat complet'!$H:$H,0)),\"\")","v":""},{"$f":"IFERROR(INDEX('Etat complet'!D:D,MATCH($B31&\"-\"&$AE33,'Etat complet'!$H:$H,0)),\"\")","v":""},{"$f":"IFERROR(INDEX('Etat complet'!E:E,MATCH($B31&\"-\"&$AE33,'Etat complet'!$H:$H,0)),\"\")","v":""},{"$f":"IFERROR(INDEX('Etat complet'!F:F,MATCH($B31&\"-\"&$AE33,'Etat complet'!$H:$H,0)),\"\")","v":""},{"$f":"IFERROR(INDEX('Etat complet'!G:G,MATCH($B31&\"-\"&$AE33,'Etat complet'!$H:$H,0)),\"\")","v":""},{"$f":"IFERROR(INDEX('Etat complet'!D:D,MATCH($B31&\"-\"&$AI33,'Etat complet'!$H:$H,0)),\"\")","v":""},{"$f":"IFERROR(INDEX('Etat complet'!E:E,MATCH($B31&\"-\"&$AI33,'Etat complet'!$H:$H,0)),\"\")","v":""},{"$f":"IFERROR(INDEX('Etat complet'!F:F,MATCH($B31&\"-\"&$AI33,'Etat complet'!$H:$H,0)),\"\")","v":""},{"$f":"IFERROR(INDEX('Etat complet'!G:G,MATCH($B31&\"-\"&$AI33,'Etat complet'!$H:$H,0)),\"\")","v":""},{"$f":"IFERROR(INDEX('Etat complet'!D:D,MATCH($B31&\"-\"&$AM33,'Etat complet'!$H:$H,0)),\"\")","v":""},{"$f":"IFERROR(INDEX('Etat complet'!E:E,MATCH($B31&\"-\"&$AM33,'Etat complet'!$H:$H,0)),\"\")","v":""},{"$f":"IFERROR(INDEX('Etat complet'!F:F,MATCH($B31&\"-\"&$AM33,'Etat complet'!$H:$H,0)),\"\")","v":""},{"$f":"IFERROR(INDEX('Etat complet'!G:G,MATCH($B31&\"-\"&$AM33,'Etat complet'!$H:$H,0)),\"\")","v":""},{"$f":"IFERROR(INDEX('Etat complet'!D:D,MATCH($B31&\"-\"&$AQ33,'Etat complet'!$H:$H,0)),\"\")","v":""},{"$f":"IFERROR(INDEX('Etat complet'!E:E,MATCH($B31&\"-\"&$AQ33,'Etat complet'!$H:$H,0)),\"\")","v":""},{"$f":"IFERROR(INDEX('Etat complet'!F:F,MATCH($B31&\"-\"&$AQ33,'Etat complet'!$H:$H,0)),\"\")","v":""},{"$f":"IFERROR(INDEX('Etat complet'!G:G,MATCH($B31&\"-\"&$AQ33,'Etat complet'!$H:$H,0)),\"\")","v":""}]
["Propriétaire numéro",8]
[{"$f":"VLOOKUP(B36,'Détail propriétaire'!$1:$1048576,2,FALSE)&\" \"&VLOOKUP(B36,'Détail propriétaire'!$1:$1048576,3,FALSE)&\" \"&VLOOKUP(B36,'Détail propriétaire'!$1:$1048576,4,FALSE)&\" \"&VLOOKUP(B36,'Détail propriétaire'!$1:$1048576,5,FALSE)&\" \"&VLOOKUP(B36,'Détail propriétaire'!$1:$1048576,6,FALSE)&\" \"&VLOOKUP(B36,'Détail propriétaire'!$1:$1048576,7,FALSE)","v":"Monsieur H Jean-Paul Gaston  "}]
[{"$f":"VLOOKUP(B36,'Détail propriétaire'!$1:$1048576,8,FALSE)","v":"demeurant Rue Sanom  04210 VILLE"},null,"TOTAL",null,null,null,1,null,null,null,2,null,null,null,3,null,null,null,4,null,null,null,5,null,null,null,6,null,null,null,7,null,null,null,8,null,null,null,9,null,null,null,10]
[null,null,"Parcelles","Surface cadastrale","Emprise servitude","Reliquat","Parcelle","Surface cadastrale","Emprise servitude","Reliquat","Parcelle","Surface cadastrale","Emprise servitude","Reliquat","Parcelle","Surface cadastrale","Emprise servitude","Reliquat","Parcelle","Surface cadastrale","Emprise servitude","Reliquat","Parcelle","Surface cadastrale","Emprise servitude","Reliquat","Parcelle","Surface cadastrale","Emprise servitude","Reliquat","Parcelle","Surface cadastrale","Emprise servitude","Reliquat","Parcelle","Surface cadastrale","Emprise servitude","Reliquat","Parcelle","Surface cadastrale","Emprise servitude","Reliquat","Parcelle","Surface cadastrale","Emprise servitude","Reliquat"]
[null,null,null,{"$f":"SUMIF($G39:$AT39,D39,$G40:$AT40)","v":1143},{"$f":"SUMIF($G39:$AT39,E39,$G40:$AT40)","v":174},{"$f":"SUMIF($G39:$AT39,F39,$G40:$AT40)","v":969},{"$f":"INDEX('Etat complet'!D:D,MATCH($B36&\"-\"&$G38,'Etat complet'!$H:$H,0))","v":"AK137"},{"$f":"INDEX('Etat complet'!E:E,MATCH($B36&\"-\"&$G38,'Etat complet'!$H:$H,0))","v":477},{"$f":"INDEX('Etat complet'!F:F,MATCH($B36&\"-\"&$G38,'Etat complet'!$H:$H,0))","v":36},{"$f":"INDEX('Etat complet'!G:G,MATCH($B36&\"-\"&$G38,'Etat complet'!$H:$H,0))","v":441},{"$f":"IFERROR(INDEX('Etat complet'!D:D,MATCH($B36&\"-\"&$K38,'Etat complet'!$H:$H,0)),\"\")","v":"AK140"},{"$f":"IFERROR(INDEX('Etat complet'!E:E,MATCH($B36&\"-\"&$K38,'Etat complet'!$H:$H,0)),\"\")","v":666},{"$f":"IFERROR(INDEX('Etat complet'!F:F,MATCH($B36&\"-\"&$K38,'Etat complet'!$H:$H,0)),\"\")","v":138},{"$f":"IFERROR(INDEX('Etat complet'!G:G,MATCH($B36&\"-\"&$K38,'Etat complet'!$H:$H,0)),\"\")","v":528},{"$f":"IFERROR(INDEX('Etat complet'!D:D,MATCH($B36&\"-\"&$O38,'Etat complet'!$H:$H,0)),\"\")","v":""},{"$f":"IFERROR(INDEX('Etat complet'!E:E,MATCH($B36&\"-\"&$O38,'Etat complet'!$H:$H,0)),\"\")","v":""},{"$f":"IFERROR(INDEX('Etat complet'!F:F,MATCH($B36&\"-\"&$O38,'Etat complet'!$H:$H,0)),\"\")","v":""},{"$f":"IFERROR(INDEX('Etat complet'!G:G,MATCH($B36&\"-\"&$O38,'Etat complet'!$H:$H,0)),\"\")","v":""},{"$f":"IFERROR(INDEX('Etat complet'!D:D,MATCH($B36&\"-\"&$S38,'Etat complet'!$H:$H,0)),\"\")","v":""},{"$f":"IFERROR(INDEX('Etat complet'!E:E,MATCH($B36&\"-\"&$S38,'Etat complet'!$H:$H,0)),\"\")","v":""},{"$f":"IFERROR(INDEX('Etat complet'!F:F,MATCH($B36&\"-\"&$S38,'Etat complet'!$H:$H,0)),\"\")","v":""},{"$f":"IFERROR(INDEX('Etat complet'!G:G,MATCH($B36&\"-\"&$S38,'Etat complet'!$H:$H,0)),\"\")","v":""},{"$f":"IFERROR(INDEX('Etat complet'!D:D,MATCH($B36&\"-\"&$W38,'Etat complet'!$H:$H,0)),\"\")","v":""},{"$f":"IFERROR(INDEX('Etat complet'!E:E,MATCH($B36&\"-\"&$W38,'Etat complet'!$H:$H,0)),\"\")","v":""},{"$f":"IFERROR(INDEX('Etat complet'!F:F,MATCH($B36&\"-\"&$W38,'Etat complet'!$H:$H,0)),\"\")","v":""},{"$f":"IFERROR(INDEX('Etat complet'!G:G,MATCH($B36&\"-\"&$W38,'Etat complet'!$H:$H,0)),\"\")","v":""},{"$f":"IFERROR(INDEX('Etat complet'!D:D,MATCH($B36&\"-\"&$AA38,'Etat complet'!$H:$H,0)),\"\")","v":""},{"$f":"IFERROR(INDEX('Etat complet'!E:E,MATCH($B36&\"-\"&$AA38,'Etat complet'!$H:$H,0)),\"\")","v":""},{"$f":"IFERROR(INDEX('Etat complet'!F:F,MATCH($B36&\"-\"&$AA38,'Etat complet'!$H:$H,0)),\"\")","v":""},{"$f":"IFERROR(INDEX('Etat complet'!G:G,MATCH($B36&\"-\"&$AA38,'Etat complet'!$H:$H,0)),\"\")","v":""},{"$f":"IFERROR(INDEX('Etat complet'!D:D,MATCH($B36&\"-\"&$AE38,'Etat complet'!$H:$H,0)),\"\")","v":""},{"$f":"IFERROR(INDEX('Etat complet'!E:E,MATCH($B36&\"-\"&$AE38,'Etat complet'!$H:$H,0)),\"\")","v":""},{"$f":"IFERROR(INDEX('Etat complet'!F:F,MATCH($B36&\"-\"&$AE38,'Etat complet'!$H:$H,0)),\"\")","v":""},{"$f":"IFERROR(INDEX('Etat complet'!G:G,MATCH($B36&\"-\"&$AE38,'Etat complet'!$H:$H,0)),\"\")","v":""},{"$f":"IFERROR(INDEX('Etat complet'!D:D,MATCH($B36&\"-\"&$AI38,'Etat complet'!$H:$H,0)),\"\")","v":""},{"$f":"IFERROR(INDEX('Etat complet'!E:E,MATCH($B36&\"-\"&$AI38,'Etat complet'!$H:$H,0)),\"\")","v":""},{"$f":"IFERROR(INDEX('Etat complet'!F:F,MATCH($B36&\"-\"&$AI38,'Etat complet'!$H:$H,0)),\"\")","v":""},{"$f":"IFERROR(INDEX('Etat complet'!G:G,MATCH($B36&\"-\"&$AI38,'Etat complet'!$H:$H,0)),\"\")","v":""},{"$f":"IFERROR(INDEX('Etat complet'!D:D,MATCH($B36&\"-\"&$AM38,'Etat complet'!$H:$H,0)),\"\")","v":""},{"$f":"IFERROR(INDEX('Etat complet'!E:E,MATCH($B36&\"-\"&$AM38,'Etat complet'!$H:$H,0)),\"\")","v":""},{"$f":"IFERROR(INDEX('Etat complet'!F:F,MATCH($B36&\"-\"&$AM38,'Etat complet'!$H:$H,0)),\"\")","v":""},{"$f":"IFERROR(INDEX('Etat complet'!G:G,MATCH($B36&\"-\"&$AM38,'Etat complet'!$H:$H,0)),\"\")","v":""},{"$f":"IFERROR(INDEX('Etat complet'!D:D,MATCH($B36&\"-\"&$AQ38,'Etat complet'!$H:$H,0)),\"\")","v":""},{"$f":"IFERROR(INDEX('Etat complet'!E:E,MATCH($B36&\"-\"&$AQ38,'Etat complet'!$H:$H,0)),\"\")","v":""},{"$f":"IFERROR(INDEX('Etat complet'!F:F,MATCH($B36&\"-\"&$AQ38,'Etat complet'!$H:$H,0)),\"\")","v":""},{"$f":"IFERROR(INDEX('Etat complet'!G:G,MATCH($B36&\"-\"&$AQ38,'Etat complet'!$H:$H,0)),\"\")","v":""}]
["Propriétaire numéro",9]
[{"$f":"VLOOKUP(B41,'Détail propriétaire'!$1:$1048576,2,FALSE)&\" \"&VLOOKUP(B41,'Détail propriétaire'!$1:$1048576,3,FALSE)&\" \"&VLOOKUP(B41,'Détail propriétaire'!$1:$1048576,4,FALSE)&\" \"&VLOOKUP(B41,'Détail propriétaire'!$1:$1048576,5,FALSE)&\" \"&VLOOKUP(B41,'Détail propriétaire'!$1:$1048576,6,FALSE)&\" \"&VLOOKUP(B41,'Détail propriétaire'!$1:$1048576,7,FALSE)","v":"Monsieur I Paul Marc  "}]
[{"$f":"VLOOKUP(B41,'Détail propriétaire'!$1:$1048576,8,FALSE)","v":"demeurant Allée Des Pins  04210 VILLE"},null,"TOTAL",null,null,null,1,null,null,null,2,null,null,null,3,null,null,null,4,null,null,null,5,null,null,null,6,null,null,null,7,null,null,null,8,null,null,null,9,null,null,null,10]
[null,null,"Parcelles","Surface cadastrale","Emprise servitude","Reliquat","Parcelle","Surface cadastrale","Emprise servitude","Reliquat","Parcelle","Surface cadastrale","Emprise servitude","Reliquat","Parcelle","Surface cadastrale","Emprise servitude","Reliquat","Parcelle","Surface cadastrale","Emprise servitude","Reliquat","Parcelle","Surface cadastrale","Emprise servitude","Reliquat","Parcelle","Surface cadastrale","Emprise servitude","Reliquat","Parcelle","Surface cadastrale","Emprise servitude","Reliquat","Parcelle","Surface cadastrale","Emprise servitude","Reliquat","Parcelle","Surface cadastrale","Emprise servitude","Reliquat","Parcelle","Surface cadastrale","Emprise servitude","Reliquat"]
[null,null,{"$f":"G45&\" \"&K45&\" \"&O45&\" \"&S45&\" \"&W45&\" \"&AA45&\" \"&AE45&\" \"&AI45&\" \"&AM45&\" \"&AQ45","v":"AK137 AK140        "},{"$f":"SUMIF($G44:$AT44,D44,$G45:$AT45)","v":1143},{"$f":"SUMIF($G44:$AT44,E44,$G45:$AT45)","v":174},{"$f":"SUMIF($G44:$AT44,F44,$G45:$AT45)","v":969},{"$f":"INDEX('Etat complet'!D:D,MATCH($B41&\"-\"&$G43,'Etat complet'!$H:$H,0))","v":"AK137"},{"$f":"INDEX('Etat complet'!E:E,MATCH($B41&\"-\"&$G43,'Etat complet'!$H:$H,0))","v":477},{"$f":"INDEX('Etat complet'!F:F,MATCH($B41&\"-\"&$G43,'Etat complet'!$H:$H,0))","v":36},{"$f":"INDEX('Etat complet'!G:G,MATCH($B41&\"-\"&$G43,'Etat complet'!$H:$H,0))","v":441},{"$f":"IFERROR(INDEX('Etat complet'!D:D,MATCH($B41&\"-\"&$K43,'Etat complet'!$H:$H,0)),\"\")","v":"AK140"},{"$f":"IFERROR(INDEX('Etat complet'!E:E,MATCH($B41&\"-\"&$K43,'Etat complet'!$H:$H,0)),\"\")","v":666},{"$f":"IFERROR(INDEX('Etat complet'!F:F,MATCH($B41&\"-\"&$K43,'Etat complet'!$H:$H,0)),\"\")","v":138},{"$f":"IFERROR(INDEX('Etat complet'!G:G,MATCH($B41&\"-\"&$K43,'Etat complet'!$H:$H,0)),\"\")","v":528},{"$f":"IFERROR(INDEX('Etat complet'!D:D,MATCH($B41&\"-\"&$O43,'Etat complet'!$H:$H,0)),\"\")","v":""},{"$f":"IFERROR(INDEX('Etat complet'!E:E,MATCH($B41&\"-\"&$O43,'Etat complet'!$H:$H,0)),\"\")","v":""},{"$f":"IFERROR(INDEX('Etat complet'!F:F,MATCH($B41&\"-\"&$O43,'Etat complet'!$H:$H,0)),\"\")","v":""},{"$f":"IFERROR(INDEX('Etat complet'!G:G,MATCH($B41&\"-\"&$O43,'Etat complet'!$H:$H,0)),\"\")","v":""},{"$f":"IFERROR(INDEX('Etat complet'!D:D,MATCH($B41&\"-\"&$S43,'Etat complet'!$H:$H,0)),\"\")","v":""},{"$f":"IFERROR(INDEX('Etat complet'!E:E,MATCH($B41&\"-\"&$S43,'Etat complet'!$H:$H,0)),\"\")","v":""},{"$f":"IFERROR(INDEX('Etat complet'!F:F,MATCH($B41&\"-\"&$S43,'Etat complet'!$H:$H,0)),\"\")","v":""},{"$f":"IFERROR(INDEX('Etat complet'!G:G,MATCH($B41&\"-\"&$S43,'Etat complet'!$H:$H,0)),\"\")","v":""},{"$f":"IFERROR(INDEX('Etat complet'!D:D,MATCH($B41&\"-\"&$W43,'Etat complet'!$H:$H,0)),\"\")","v":""},{"$f":"IFERROR(INDEX('Etat complet'!E:E,MATCH($B41&\"-\"&$W43,'Etat complet'!$H:$H,0)),\"\")","v":""},{"$f":"IFERROR(INDEX('Etat complet'!F:F,MATCH($B41&\"-\"&$W43,'Etat complet'!$H:$H,0)),\"\")","v":""},{"$f":"IFERROR(INDEX('Etat complet'!G:G,MATCH($B41&\"-\"&$W43,'Etat complet'!$H:$H,0)),\"\")","v":""},{"$f":"IFERROR(INDEX('Etat complet'!D:D,MATCH($B41&\"-\"&$AA43,'Etat complet'!$H:$H,0)),\"\")","v":""},{"$f":"IFERROR(INDEX('Etat complet'!E:E,MATCH($B41&\"-\"&$AA43,'Etat complet'!$H:$H,0)),\"\")","v":""},{"$f":"IFERROR(INDEX('Etat complet'!F:F,MATCH($B41&\"-\"&$AA43,'Etat complet'!$H:$H,0)),\"\")","v":""},{"$f":"IFERROR(INDEX('Etat complet'!G:G,MATCH($B41&\"-\"&$AA43,'Etat complet'!$H:$H,0)),\"\")","v":""},{"$f":"IFERROR(INDEX('Etat complet'!D:D,MATCH($B41&\"-\"&$AE43,'Etat complet'!$H:$H,0)),\"\")","v":""},{"$f":"IFERROR(INDEX('Etat complet'!E:E,MATCH($B41&\"-\"&$AE43,'Etat complet'!$H:$H,0)),\"\")","v":""},{"$f":"IFERROR(INDEX('Etat complet'!F:F,MATCH($B41&\"-\"&$AE43,'Etat complet'!$H:$H,0)),\"\")","v":""},{"$f":"IFERROR(INDEX('Etat complet'!G:G,MATCH($B41&\"-\"&$AE43,'Etat complet'!$H:$H,0)),\"\")","v":""},{"$f":"IFERROR(INDEX('Etat complet'!D:D,MATCH($B41&\"-\"&$AI43,'Etat complet'!$H:$H,0)),\"\")","v":""},{"$f":"IFERROR(INDEX('Etat complet'!E:E,MATCH($B41&\"-\"&$AI43,'Etat complet'!$H:$H,0)),\"\")","v":""},{"$f":"IFERROR(INDEX('Etat complet'!F:F,MATCH($B41&\"-\"&$AI43,'Etat complet'!$H:$H,0)),\"\")","v":""},{"$f":"IFERROR(INDEX('Etat complet'!G:G,MATCH($B41&\"-\"&$AI43,'Etat complet'!$H:$H,0)),\"\")","v":""},{"$f":"IFERROR(INDEX('Etat complet'!D:D,MATCH($B41&\"-\"&$AM43,'Etat complet'!$H:$H,0)),\"\")","v":""},{"$f":"IFERROR(INDEX('Etat complet'!E:E,MATCH($B41&\"-\"&$AM43,'Etat complet'!$H:$H,0)),\"\")","v":""},{"$f":"IFERROR(INDEX('Etat complet'!F:F,MATCH($B41&\"-\"&$AM43,'Etat complet'!$H:$H,0)),\"\")","v":""},{"$f":"IFERROR(INDEX('Etat complet'!G:G,MATCH($B41&\"-\"&$AM43,'Etat complet'!$H:$H,0)),\"\")","v":""},{"$f":"IFERROR(INDEX('Etat complet'!D:D,MATCH($B41&\"-\"&$AQ43,'Etat complet'!$H:$H,0)),\"\")","v":""},{"$f":"IFERROR(INDEX('Etat complet'!E:E,MATCH($B41&\"-\"&$AQ43,'Etat complet'!$H:$H,0)),\"\")","v":""},{"$f":"IFERROR(INDEX('Etat complet'!F:F,MATCH($B41&\"-\"&$AQ43,'Etat complet'!$H:$H,0)),\"\")","v":""},{"$f":"IFERROR(INDEX('Etat complet'!G:G,MATCH($B41&\"-\"&$AQ43,'Etat complet'!$H:$H,0)),\"\")","v":""}]
["Propriétaire numéro",10]
[{"$f":"VLOOKUP(B46,'Détail propriétaire'!$1:$1048576,2,FALSE)&\" \"&VLOOKUP(B46,'Détail propriétaire'!$1:$1048576,3,FALSE)&\" \"&VLOOKUP(B46,'Détail propriétaire'!$1:$1048576,4,FALSE)&\" \"&VLOOKUP(B46,'Détail propriétaire'!$1:$1048576,5,FALSE)&\" \"&VLOOKUP(B46,'Détail propriétaire'!$1:$1048576,6,FALSE)&\" \"&VLOOKUP(B46,'Détail propriétaire'!$1:$1048576,7,FALSE)","v":"Societe J    "}]
[{"$f":"VLOOKUP(B46,'Détail propriétaire'!$1:$1048576,8,FALSE)","v":"demeurant Place Des Hêtres  04210 VILLE"},null,"TOTAL",null,null,null,1,null,null,null,2,null,null,null,3,null,null,null,4,null,null,null,5,null,null,null,6,null,null,null,7,null,null,null,8,null,null,null,9,null,null,null,10]
[null,null,"Parcelles","Surface cadastrale","Emprise servitude","Reliquat","Parcelle","Surface cadastrale","Emprise servitude","Reliquat","Parcelle","Surface cadastrale","Emprise servitude","Reliquat","Parcelle","Surface cadastrale","Emprise servitude","Reliquat","Parcelle","Surface cadastrale","Emprise servitude","Reliquat","Parcelle","Surface cadastrale","Emprise servitude","Reliquat","Parcelle","Surface cadastrale","Emprise servitude","Reliquat","Parcelle","Surface cadastrale","Emprise servitude","Reliquat","Parcelle","Surface cadastrale","Emprise servitude","Reliquat","Parcelle","Surface cadastrale","Emprise servitude","Reliquat","Parcelle","Surface cadastrale","Emprise servitude","Reliquat"]
[null,null,{"$f":"G50&\" \"&K50&\" \"&O50&\" \"&S50&\" \"&W50&\" \"&AA50&\" \"&AE50&\" \"&AI50&\" \"&AM50&\" \"&AQ50","v":"AM254 AM319 AM321 AP263 AP319     "},{"$f":"SUMIF($G49:$AT49,D49,$G50:$AT50)","v":1617},{"$f":"SUMIF($G49:$AT49,E49,$G50:$AT50)","v":249},{"$f":"SUMIF($G49:$AT49,F49,$G50:$AT50)","v":1368},{"$f":"INDEX('Etat complet'!D:D,MATCH($B46&\"-\"&$G48,'Etat complet'!$H:$H,0))","v":"AM254"},{"$f":"INDEX('Etat complet'!E:E,MATCH($B46&\"-\"&$G48,'Etat complet'!$H:$H,0))","v":620},{"$f":"INDEX('Etat complet'!F:F,MATCH($B46&\"-\"&$G48,'Etat complet'!$H:$H,0))","v":9},{"$f":"INDEX('Etat complet'!G:G,MATCH($B46&\"-\"&$G48,'Etat complet'!$H:$H,0))","v":611},{"$f":"IFERROR(INDEX('Etat complet'!D:D,MATCH($B46&\"-\"&$K48,'Etat complet'!$H:$H,0)),\"\")","v":"AM319"},{"$f":"IFERROR(INDEX('Etat complet'!E:E,MATCH($B46&\"-\"&$K48,'Etat complet'!$H:$H,0)),\"\")","v":284},{"$f":"IFERROR(INDEX('Etat complet'!F:F,MATCH($B46&\"-\"&$K48,'Etat complet'!$H:$H,0)),\"\")","v":16},{"$f":"IFERROR(INDEX('Etat complet'!G:G,MATCH($B46&\"-\"&$K48,'Etat complet'!$H:$H,0)),\"\")","v":268},{"$f":"IFERROR(INDEX('Etat complet'!D:D,MATCH($B46&\"-\"&$O48,'Etat complet'!$H:$H,0)),\"\")","v":"AM321"},{"$f":"IFERROR(INDEX('Etat complet'!E:E,MATCH($B46&\"-\"&$O48,'Etat complet'!$H:$H,0)),\"\")","v":199},{"$f":"IFERROR(INDEX('Etat complet'!F:F,MATCH($B46&\"-\"&$O48,'Etat complet'!$H:$H,0)),\"\")","v":163},{"$f":"IFERROR(INDEX('Etat complet'!G:G,MATCH($B46&\"-\"&$O48,'Etat complet'!$H:$H,0)),\"\")","v":36},{"$f":"IFERROR(INDEX('Etat complet'!D:D,MATCH($B46&\"-\"&$S48,'Etat complet'!$H:$H,0)),\"\")","v":"AP263"},{"$f":"IFERROR(INDEX('Etat complet'!E:E,MATCH($B46&\"-\"&$S48,'Etat complet'!$H:$H,0)),\"\")","v":225},{"$f":"IFERROR(INDEX('Etat complet'!F:F,MATCH($B46&\"-\"&$S48,'Etat complet'!$H:$H,0)),\"\")","v":22},{"$f":"IFERROR(INDEX('Etat complet'!G:G,MATCH($B46&\"-\"&$S48,'Etat complet'!$H:$H,0)),\"\")","v":203},{"$f":"IFERROR(INDEX('Etat complet'!D:D,MATCH($B46&\"-\"&$W48,'Etat complet'!$H:$H,0)),\"\")","v":"AP319"},{"$f":"IFERROR(INDEX('Etat complet'!E:E,MATCH($B46&\"-\"&$W48,'Etat complet'!$H:$H,0)),\"\")","v":289},{"$f":"IFERROR(INDEX('Etat complet'!F:F,MATCH($B46&\"-\"&$W48,'Etat complet'!$H:$H,0)),\"\")","v":39},{"$f":"IFERROR(INDEX('Etat complet'!G:G,MATCH($B46&\"-\"&$W48,'Etat complet'!$H:$H,0)),\"\")","v":250},{"$f":"IFERROR(INDEX('Etat complet'!D:D,MATCH($B46&\"-\"&$AA48,'Etat complet'!$H:$H,0)),\"\")","v":""},{"$f":"IFERROR(INDEX('Etat complet'!E:E,MATCH($B46&\"-\"&$AA48,'Etat complet'!$H:$H,0)),\"\")","v":""},{"$f":"IFERROR(INDEX('Etat complet'!F:F,MATCH($B46&\"-\"&$AA48,'Etat complet'!$H:$H,0)),\"\")","v":""},{"$f":"IFERROR(INDEX('Etat complet'!G:G,MATCH($B46&\"-\"&$AA48,'Etat complet'!$H:$H,0)),\"\")","v":""},{"$f":"IFERROR(INDEX('Etat complet'!D:D,MATCH($B46&\"-\"&$AE48,'Etat complet'!$H:$H,0)),\"\")","v":""},{"$f":"IFERROR(INDEX('Etat complet'!E:E,MATCH($B46&\"-\"&$AE48,'Etat complet'!$H:$H,0)),\"\")","v":""},{"$f":"IFERROR(INDEX('Etat complet'!F:F,MATCH($B46&\"-\"&$AE48,'Etat complet'!$H:$H,0)),\"\")","v":""},{"$f":"IFERROR(INDEX('Etat complet'!G:G,MATCH($B46&\"-\"&$AE48,'Etat complet'!$H:$H,0)),\"\")","v":""},{"$f":"IFERROR(INDEX('Etat complet'!D:D,MATCH($B46&\"-\"&$AI48,'Etat complet'!$H:$H,0)),\"\")","v":""},{"$f":"IFERROR(INDEX('Etat complet'!E:E,MATCH($B46&\"-\"&$AI48,'Etat complet'!$H:$H,0)),\"\")","v":""},{"$f":"IFERROR(INDEX('Etat complet'!F:F,MATCH($B46&\"-\"&$AI48,'Etat complet'!$H:$H,0)),\"\")","v":""},{"$f":"IFERROR(INDEX('Etat complet'!G:G,MATCH($B46&\"-\"&$AI48,'Etat complet'!$H:$H,0)),\"\")","v":""},{"$f":"IFERROR(INDEX('Etat complet'!D:D,MATCH($B46&\"-\"&$AM48,'Etat complet'!$H:$H,0)),\"\")","v":""},{"$f":"IFERROR(INDEX('Etat complet'!E:E,MATCH($B46&\"-\"&$AM48,'Etat complet'!$H:$H,0)),\"\")","v":""},{"$f":"IFERROR(INDEX('Etat complet'!F:F,MATCH($B46&\"-\"&$AM48,'Etat complet'!$H:$H,0)),\"\")","v":""},{"$f":"IFERROR(INDEX('Etat complet'!G:G,MATCH($B46&\"-\"&$AM48,'Etat complet'!$H:$H,0)),\"\")","v":""},{"$f":"IFERROR(INDEX('Etat complet'!D:D,MATCH($B46&\"-\"&$AQ48,'Etat complet'!$H:$H,0)),\"\")","v":""},{"$f":"IFERROR(INDEX('Etat complet'!E:E,MATCH($B46&\"-\"&$AQ48,'Etat complet'!$H:$H,0)),\"\")","v":""},{"$f":"IFERROR(INDEX('Etat complet'!F:F,MATCH($B46&\"-\"&$AQ48,'Etat complet'!$H:$H,0)),\"\")","v":""},{"$f":"IFERROR(INDEX('Etat complet'!G:G,MATCH($B46&\"-\"&$AQ48,'Etat complet'!$H:$H,0)),\"\")","v":""}]
["Propriétaire numéro",11]
[{"$f":"VLOOKUP(B51,'Détail propriétaire'!$1:$1048576,2,FALSE)&\" \"&VLOOKUP(B51,'Détail propriétaire'!$1:$1048576,3,FALSE)&\" \"&VLOOKUP(B51,'Détail propriétaire'!$1:$1048576,4,FALSE)&\" \"&VLOOKUP(B51,'Détail propriétaire'!$1:$1048576,5,FALSE)&\" \"&VLOOKUP(B51,'Détail propriétaire'!$1:$1048576,6,FALSE)&\" \"&VLOOKUP(B51,'Détail propriétaire'!$1:$1048576,7,FALSE)","v":"Madame K Annie Odette Denise née P"}]
[{"$f":"VLOOKUP(B51,'Détail propriétaire'!$1:$1048576,8,FALSE)","v":"demeurant Rue Des Cyprès  04210 VILLE"},null,"TOTAL",null,null,null,1,null,null,null,2,null,null,null,3,null,null,null,4,null,null,null,5,null,null,null,6,null,null,null,7,null,null,null,8,null,null,null,9,null,null,null,10]
[null,null,"Parcelles","Surface cadastrale","Emprise servitude","Reliquat","Parcelle","Surface cadastrale","Emprise servitude","Reliquat","Parcelle","Surface cadastrale","Emprise servitude","Reliquat","Parcelle","Surface cadastrale","Emprise servitude","Reliquat","Parcelle","Surface cadastrale","Emprise servitude","Reliquat","Parcelle","Surface cadastrale","Emprise servitude","Reliquat","Parcelle","Surface cadastrale","Emprise servitude","Reliquat","Parcelle","Surface cadastrale","Emprise servitude","Reliquat","Parcelle","Surface cadastrale","Emprise servitude","Reliquat","Parcelle","Surface cadastrale","Emprise servitude","Reliquat","Parcelle","Surface cadastrale","Emprise servitude","Reliquat"]
[null,null,{"$f":"G55&\" \"&K55&\" \"&O55&\" \"&S55&\" \"&W55&\" \"&AA55&\" \"&AE55&\" \"&AI55&\" \"&AM55&\" \"&AQ55","v":"AP318         "},{"$f":"SUMIF($G54:$AT54,D54,$G55:$AT55)","v":1048},{"$f":"SUMIF($G54:$AT54,E54,$G55:$AT55)","v":101},{"$f":"SUMIF($G54:$AT54,F54,$G55:$AT55)","v":947},{"$f":"INDEX('Etat complet'!D:D,MATCH($B51&\"-\"&$G53,'Etat complet'!$H:$H,0))","v":"AP318"},{"$f":"INDEX('Etat complet'!E:E,MATCH($B51&\"-\"&$G53,'Etat complet'!$H:$H,0))","v":1048},{"$f":"INDEX('Etat complet'!F:F,MATCH($B51&\"-\"&$G53,'Etat complet'!$H:$H,0))","v":101},{"$f":"INDEX('Etat complet'!G:G,MATCH($B51&\"-\"&$G53,'Etat complet'!$H:$H,0))","v":947},{"$f":"IFERROR(INDEX('Etat complet'!D:D,MATCH($B51&\"-\"&$K53,'Etat complet'!$H:$H,0)),\"\")","v":""},{"$f":"IFERROR(INDEX('Etat complet'!E:E,MATCH($B51&\"-\"&$K53,'Etat complet'!$H:$H,0)),\"\")","v":""},{"$f":"IFERROR(INDEX('Etat complet'!F:F,MATCH($B51&\"-\"&$K53,'Etat complet'!$H:$H,0)),\"\")","v":""},{"$f":"IFERROR(INDEX('Etat complet'!G:G,MATCH($B51&\"-\"&$K53,'Etat complet'!$H:$H,0)),\"\")","v":""},{"$f":"IFERROR(INDEX('Etat complet'!D:D,MATCH($B51&\"-\"&$O53,'Etat complet'!$H:$H,0)),\"\")","v":""},{"$f":"IFERROR(INDEX('Etat complet'!E:E,MATCH($B51&\"-\"&$O53,'Etat complet'!$H:$H,0)),\"\")","v":""},{"$f":"IFERROR(INDEX('Etat complet'!F:F,MATCH($B51&\"-\"&$O53,'Etat complet'!$H:$H,0)),\"\")","v":""},{"$f":"IFERROR(INDEX('Etat complet'!G:G,MATCH($B51&\"-\"&$O53,'Etat complet'!$H:$H,0)),\"\")","v":""},{"$f":"IFERROR(INDEX('Etat complet'!D:D,MATCH($B51&\"-\"&$S53,'Etat complet'!$H:$H,0)),\"\")","v":""},{"$f":"IFERROR(INDEX('Etat complet'!E:E,MATCH($B51&\"-\"&$S53,'Etat complet'!$H:$H,0)),\"\")","v":""},{"$f":"IFERROR(INDEX('Etat complet'!F:F,MATCH($B51&\"-\"&$S53,'Etat complet'!$H:$H,0)),\"\")","v":""},{"$f":"IFERROR(INDEX('Etat complet'!G:G,MATCH($B51&\"-\"&$S53,'Etat complet'!$H:$H,0)),\"\")","v":""},{"$f":"IFERROR(INDEX('Etat complet'!D:D,MATCH($B51&\"-\"&$W53,'Etat complet'!$H:$H,0)),\"\")","v":""},{"$f":"IFERROR(INDEX('Etat complet'!E:E,MATCH($B51&\"-\"&$W53,'Etat complet'!$H:$H,0)),\"\")","v":""},{"$f":"IFERROR(INDEX('Etat complet'!F:F,MATCH($B51&\"-\"&$W53,'Etat complet'!$H:$H,0)),\"\")","v":""},{"$f":"IFERROR(INDEX('Etat complet'!G:G,MATCH($B51&\"-\"&$W53,'Etat complet'!$H:$H,0)),\"\")","v":""},{"$f":"IFERROR(INDEX('Etat complet'!D:D,MATCH($B51&\"-\"&$AA53,'Etat complet'!$H:$H,0)),\"\")","v":""},{"$f":"IFERROR(INDEX('Etat complet'!E:E,MATCH($B51&\"-\"&$AA53,'Etat complet'!$H:$H,0)),\"\")","v":""},{"$f":"IFERROR(INDEX('Etat complet'!F:F,MATCH($B51&\"-\"&$AA53,'Etat complet'!$H:$H,0)),\"\")","v":""},{"$f":"IFERROR(INDEX('Etat complet'!G:G,MATCH($B51&\"-\"&$AA53,'Etat complet'!$H:$H,0)),\"\")","v":""},{"$f":"IFERROR(INDEX('Etat complet'!D:D,MATCH($B51&\"-\"&$AE53,'Etat complet'!$H:$H,0)),\"\")","v":""},{"$f":"IFERROR(INDEX('Etat complet'!E:E,MATCH($B51&\"-\"&$AE53,'Etat complet'!$H:$H,0)),\"\")","v":""},{"$f":"IFERROR(INDEX('Etat complet'!F:F,MATCH($B51&\"-\"&$AE53,'Etat complet'!$H:$H,0)),\"\")","v":""},{"$f":"IFERROR(INDEX('Etat complet'!G:G,MATCH($B51&\"-\"&$AE53,'Etat complet'!$H:$H,0)),\"\")","v":""},{"$f":"IFERROR(INDEX('Etat complet'!D:D,MATCH($B51&\"-\"&$AI53,'Etat complet'!$H:$H,0)),\"\")","v":""},{"$f":"IFERROR(INDEX('Etat complet'!E:E,MATCH($B51&\"-\"&$AI53,'Etat complet'!$H:$H,0)),\"\")","v":""},{"$f":"IFERROR(INDEX('Etat complet'!F:F,MATCH($B51&\"-\"&$AI53,'Etat complet'!$H:$H,0)),\"\")","v":""},{"$f":"IFERROR(INDEX('Etat complet'!G:G,MATCH($B51&\"-\"&$AI53,'Etat complet'!$H:$H,0)),\"\")","v":""},{"$f":"IFERROR(INDEX('Etat complet'!D:D,MATCH($B51&\"-\"&$AM53,'Etat complet'!$H:$H,0)),\"\")","v":""},{"$f":"IFERROR(INDEX('Etat complet'!E:E,MATCH($B51&\"-\"&$AM53,'Etat complet'!$H:$H,0)),\"\")","v":""},{"$f":"IFERROR(INDEX('Etat complet'!F:F,MATCH($B51&\"-\"&$AM53,'Etat complet'!$H:$H,0)),\"\")","v":""},{"$f":"IFERROR(INDEX('Etat complet'!G:G,MATCH($B51&\"-\"&$AM53,'Etat complet'!$H:$H,0)),\"\")","v":""},{"$f":"IFERROR(INDEX('Etat complet'!D:D,MATCH($B51&\"-\"&$AQ53,'Etat complet'!$H:$H,0)),\"\")","v":""},{"$f":"IFERROR(INDEX('Etat complet'!E:E,MATCH($B51&\"-\"&$AQ53,'Etat complet'!$H:$H,0)),\"\")","v":""},{"$f":"IFERROR(INDEX('Etat complet'!F:F,MATCH($B51&\"-\"&$AQ53,'Etat complet'!$H:$H,0)),\"\")","v":""},{"$f":"IFERROR(INDEX('Etat complet'!G:G,MATCH($B51&\"-\"&$AQ53,'Etat complet'!$H:$H,0)),\"\")","v":""}]
["Propriétaire numéro",12]
[{"$f":"VLOOKUP(B56,'Détail propriétaire'!$1:$1048576,2,FALSE)&\" \"&VLOOKUP(B56,'Détail propriétaire'!$1:$1048576,3,FALSE)&\" \"&VLOOKUP(B56,'Détail propriétaire'!$1:$1048576,4,FALSE)&\" \"&VLOOKUP(B56,'Détail propriétaire'!$1:$1048576,5,FALSE)&\" \"&VLOOKUP(B56,'Détail propriétaire'!$1:$1048576,6,FALSE)&\" \"&VLOOKUP(B56,'Détail propriétaire'!$1:$1048576,7,FALSE)","v":"Monsieur L Fabien Elie  "}]
[{"$f":"VLOOKUP(B56,'Détail propriétaire'!$1:$1048576,8,FALSE)","v":"demeurant Impasse Fleurie  04210 VILLE"},null,"TOTAL",null,null,null,1,null,null,null,2,null,null,null,3,null,null,null,4,null,null,null,5,null,null,null,6,null,null,null,7,null,null,null,8,null,null,null,9,null,null,null,10]
[null,null,"Parcelles","Surface cadastrale","Emprise servitude","Reliquat","Parcelle","Surface cadastrale","Emprise servitude","Reliquat","Parcelle","Surface cadastrale","Emprise servitude","Reliquat","Parcelle","Surface cadastrale","Emprise servitude","Reliquat","Parcelle","Surface cadastrale","Emprise servitude","Reliquat","Parcelle","Surface cadastrale","Emprise servitude","Reliquat","Parcelle","Surface cadastrale","Emprise servitude","Reliquat","Parcelle","Surface cadastrale","Emprise servitude","Reliquat","Parcelle","Surface cadastrale","Emprise servitude","Reliquat","Parcelle","Surface cadastrale","Emprise servitude","Reliquat","Parcelle","Surface cadastrale","Emprise servitude","Reliquat"]
[null,null,{"$f":"G60&\" \"&K60&\" \"&O60&\" \"&S60&\" \"&W60&\" \"&AA60&\" \"&AE60&\" \"&AI60&\" \"&AM60&\" \"&AQ60","v":"AP318         "},{"$f":"SUMIF($G59:$AT59,D59,$G60:$AT60)","v":1048},{"$f":"SUMIF($G59:$AT59,E59,$G60:$AT60)","v":101},{"$f":"SUMIF($G59:$AT59,F59,$G60:$AT60)","v":947},{"$f":"INDEX('Etat complet'!D:D,MATCH($B56&\"-\"&$G58,'Etat complet'!$H:$H,0))","v":"AP318"},{"$f":"INDEX('Etat complet'!E:E,MATCH($B56&\"-\"&$G58,'Etat complet'!$H:$H,0))","v":1048},{"$f":"INDEX('Etat complet'!F:F,MATCH($B56&\"-\"&$G58,'Etat complet'!$H:$H,0))","v":101},{"$f":"INDEX('Etat complet'!G:G,MATCH($B56&\"-\"&$G58,'Etat complet'!$H:$H,0))","v":947},{"$f":"IFERROR(INDEX('Etat complet'!D:D,MATCH($B56&\"-\"&$K58,'Etat complet'!$H:$H,0)),\"\")","v":""},{"$f":"IFERROR(INDEX('Etat complet'!E:E,MATCH($B56&\"-\"&$K58,'Etat complet'!$H:$H,0)),\"\")","v":""},{"$f":"IFERROR(INDEX('Etat complet'!F:F,MATCH($B56&\"-\"&$K58,'Etat complet'!$H:$H,0)),\"\")","v":""},{"$f":"IFERROR(INDEX('Etat complet'!G:G,MATCH($B56&\"-\"&$K58,'Etat complet'!$H:$H,0)),\"\")","v":""},{"$f":"IFERROR(INDEX('Etat complet'!D:D,MATCH($B56&\"-\"&$O58,'Etat complet'!$H:$H,0)),\"\")","v":""},{"$f":"IFERROR(INDEX('Etat complet'!E:E,MATCH($B56&\"-\"&$O58,'Etat complet'!$H:$H,0)),\"\")","v":""},{"$f":"IFERROR(INDEX('Etat complet'!F:F,MATCH($B56&\"-\"&$O58,'Etat complet'!$H:$H,0)),\"\")","v":""},{"$f":"IFERROR(INDEX('Etat complet'!G:G,MATCH($B56&\"-\"&$O58,'Etat complet'!$H:$H,0)),\"\")","v":""},{"$f":"IFERROR(INDEX('Etat complet'!D:D,MATCH($B56&\"-\"&$S58,'Etat complet'!$H:$H,0)),\"\")","v":""},{"$f":"IFERROR(INDEX('Etat complet'!E:E,MATCH($B56&\"-\"&$S58,'Etat complet'!$H:$H,0)),\"\")","v":""},{"$f":"IFERROR(INDEX('Etat complet'!F:F,MATCH($B56&\"-\"&$S58,'Etat complet'!$H:$H,0)),\"\")","v":""},{"$f":"IFERROR(INDEX('Etat complet'!G:G,MATCH($B56&\"-\"&$S58,'Etat complet'!$H:$H,0)),\"\")","v":""},{"$f":"IFERROR(INDEX('Etat complet'!D:D,MATCH($B56&\"-\"&$W58,'Etat complet'!$H:$H,0)),\"\")","v":""},{"$f":"IFERROR(INDEX('Etat complet'!E:E,MATCH($B56&\"-\"&$W58,'Etat complet'!$H:$H,0)),\"\")","v":""},{"$f":"IFERROR(INDEX('Etat complet'!F:F,MATCH($B56&\"-\"&$W58,'Etat complet'!$H:$H,0)),\"\")","v":""},{"$f":"IFERROR(INDEX('Etat complet'!G:G,MATCH($B56&\"-\"&$W58,'Etat complet'!$H:$H,0)),\"\")","v":""},{"$f":"IFERROR(INDEX('Etat complet'!D:D,MATCH($B56&\"-\"&$AA58,'Etat complet'!$H:$H,0)),\"\")","v":""},{"$f":"IFERROR(INDEX('Etat complet'!E:E,MATCH($B56&\"-\"&$AA58,'Etat complet'!$H:$H,0)),\"\")","v":""},{"$f":"IFERROR(INDEX('Etat complet'!F:F,MATCH($B56&\"-\"&$AA58,'Etat complet'!$H:$H,0)),\"\")","v":""},{"$f":"IFERROR(INDEX('Etat complet'!G:G,MATCH($B56&\"-\"&$AA58,'Etat complet'!$H:$H,0)),\"\")","v":""},{"$f":"IFERROR(INDEX('Etat complet'!D:D,MATCH($B56&\"-\"&$AE58,'Etat complet'!$H:$H,0)),\"\")","v":""},{"$f":"IFERROR(INDEX('Etat complet'!E:E,MATCH($B56&\"-\"&$AE58,'Etat complet'!$H:$H,0)),\"\")","v":""},{"$f":"IFERROR(INDEX('Etat complet'!F:F,MATCH($B56&\"-\"&$AE58,'Etat complet'!$H:$H,0)),\"\")","v":""},{"$f":"IFERROR(INDEX('Etat complet'!G:G,MATCH($B56&\"-\"&$AE58,'Etat complet'!$H:$H,0)),\"\")","v":""},{"$f":"IFERROR(INDEX('Etat complet'!D:D,MATCH($B56&\"-\"&$AI58,'Etat complet'!$H:$H,0)),\"\")","v":""},{"$f":"IFERROR(INDEX('Etat complet'!E:E,MATCH($B56&\"-\"&$AI58,'Etat complet'!$H:$H,0)),\"\")","v":""},{"$f":"IFERROR(INDEX('Etat complet'!F:F,MATCH($B56&\"-\"&$AI58,'Etat complet'!$H:$H,0)),\"\")","v":""},{"$f":"IFERROR(INDEX('Etat complet'!G:G,MATCH($B56&\"-\"&$AI58,'Etat complet'!$H:$H,0)),\"\")","v":""},{"$f":"IFERROR(INDEX('Etat complet'!D:D,MATCH($B56&\"-\"&$AM58,'Etat complet'!$H:$H,0)),\"\")","v":""},{"$f":"IFERROR(INDEX('Etat complet'!E:E,MATCH($B56&\"-\"&$AM58,'Etat complet'!$H:$H,0)),\"\")","v":""},{"$f":"IFERROR(INDEX('Etat complet'!F:F,MATCH($B56&\"-\"&$AM58,'Etat complet'!$H:$H,0)),\"\")","v":""},{"$f":"IFERROR(INDEX('Etat complet'!G:G,MATCH($B56&\"-\"&$AM58,'Etat complet'!$H:$H,0)),\"\")","v":""},{"$f":"IFERROR(INDEX('Etat complet'!D:D,MATCH($B56&\"-\"&$AQ58,'Etat complet'!$H:$H,0)),\"\")","v":""},{"$f":"IFERROR(INDEX('Etat complet'!E:E,MATCH($B56&\"-\"&$AQ58,'Etat complet'!$H:$H,0)),\"\")","v":""},{"$f":"IFERROR(INDEX('Etat complet'!F:F,MATCH($B56&\"-\"&$AQ58,'Etat complet'!$H:$H,0)),\"\")","v":""},{"$f":"IFERROR(INDEX('Etat complet'!G:G,MATCH($B56&\"-\"&$AQ58,'Etat complet'!$H:$H,0)),\"\")","v":""}]

{"sheet":"Export Geomas","index":7,"n_rows":220,"n_cols":14,"rows_kept":220,"cut":false,"hidden":false,"merged":[]}
["id","idu","insee_com","code_com","section","num_parc","coar","indp","indp_code","supf","tex","Concat","Emprise","Restant"]
["9699","161000AI0420","05161","161","AI","0420",null,"Parcelle figurée au plan","01",7180,"420",{"$f":"CONCATENATE(E2,K2)","v":"AI420"},240,{"$f":"J2-M2","v":6940}]
["9134","161000AI0453","05161","161","AI","0453",null,"Parcelle figurée au plan","01",480,"453","AI453",18,{"$f":"J3-M3","v":462}]
["9978","161000AK0113","05161","161","AK","0113",null,"Parcelle figurée au plan","01",743,"113","AK113",78,665]
["9994","161000AK0121","05161","161","AK","0121",null,"Parcelle figurée au plan","01",562,"121","AK121",78,484]
["9992","161000AK0124","05161","161","AK","0124",null,"Parcelle figurée au plan","01",542,"124","AK124",111,431]
["9965","161000AK0127","05161","161","AK","0127",null,"Parcelle figurée au plan","01",2300,"127","AK127",123,2177]
["9969","161000AK0128","05161","161","AK","0128",null,"Parcelle figurée au plan","01",713,"128","AK128",119,594]
["9968","161000AK0132","05161","161","AK","0132",null,"Parcelle figurée au plan","01",576,"132","AK132",133,443]
["9967","161000AK0133","05161","161","AK","0133",null,"Parcelle figurée au plan","01",492,"133","AK133",67,425]
["9882","161000AK0137","05161","161","AK","0137",null,"Parcelle figurée au plan","01",477,"137","AK137",36,441]
["9881","161000AK0138","05161","161","AK","0138",null,"Parcelle figurée au plan","01",160,"138","AK138",34,126]
["9883","161000AK0139","05161","161","AK","0139",null,"Parcelle figurée au plan","01",233,"139","AK139",47,186]
["9880","161000AK0140","05161","161","AK","0140",null,"Parcelle figurée au plan","01",666,"140","AK140",138,528]
["9867","161000AK0144","05161","161","AK","0144",null,"Parcelle figurée au plan","01",2251,"144","AK144",330,1921]
["9871","161000AK0148","05161","161","AK","0148",null,"Parcelle figurée au plan","01",1210,"148","AK148",7,1203]
["9873","161000AK0150","05161","161","AK","0150",null,"Parcelle figurée au plan","01",2480,"150","AK150",289,2191]
["9850","161000AK0151","05161","161","AK","0151",null,"Parcelle figurée au plan","01",724,"151","AK151",45,679]
["9846","161000AK0166","05161","161","AK","0166",null,"Parcelle figurée au plan","01",1069,"166","AK166",57,1012]
["9823","161000AK0167","05161","161","AK","0167",null,"Parcelle figurée au plan","01",4,"167","AK167",0,4]
["9847","161000AK0168","05161","161","AK","0168",null,"Parcelle figurée au plan","01",1004,"168","AK168",291,713]
["9845","161000AK0170","05161","161","AK","0170",null,"Parcelle figurée au plan","01",666,"170","AK170",17,649]
["9840","161000AK0171","05161","161","AK","0171",null,"Parcelle figurée au plan","01",2085,"171","AK171",295,1790]
["9841","161000AK0178","05161","161","AK","0178",null,"Parcelle figurée au plan","01",830,"178","AK178",10,820]
["9827","161000AK0188","05161","161","AK","0188",null,"Parcelle figurée au plan","01",492,"188","AK188",31,461]
["9835","161000AK0189","05161","161","AK","0189",null,"Parcelle figurée au plan","01",1011,"189","AK189",272,739]
["9834","161000AK0190","05161","161","AK","0190",null,"Parcelle figurée au plan","01",831,"190","AK190",2,829]
["9852","161000AK0194","05161","161","AK","0194",null,"Parcelle figurée au plan","01",835,"194","AK194",8,827]
["9851","161000AK0195","05161","161","AK","0195",null,"Parcelle figurée au plan","01",255,"195","AK195",50,205]
["9809","161000AK0359","05161","161","AK","0359",null,"Parcelle figurée au plan","01",1245,"359","AK359",7,1238]
["9810","161000AK0360","05161","161","AK","0360",null,"Parcelle figurée au plan","01",547,"360","AK360",85,462]
["9811","161000AK0361","05161","161","AK","0361",null,"Parcelle figurée au plan","01",764,"361","AK361",107,657]
["9812","161000AK0362","05161","161","AK","0362",null,"Parcelle figurée au plan","01",1559,"362","AK362",206,1353]
["9813","161000AK0363","05161","161","AK","0363",null,"Parcelle figurée au plan","01",172,"363","AK363",53,119]
["9814","161000AK0364","05161","161","AK","0364",null,"Parcelle figurée au plan","01",344,"364","AK364",75,269]
["9815","161000AK0365","05161","161","AK","0365",null,"Parcelle figurée au plan","01",1136,"365","AK365",88,1048]
["9816","161000AK0366","05161","161","AK","0366",null,"Parcelle figurée au plan","01",3168,"366","AK366",295,2873]
["10067","161000AL0051","05161","161","AL","0051",null,"Parcelle figurée au plan","01",1315,"51","AL51",84,1231]
["10090","161000AL0053","05161","161","AL","0053",null,"Parcelle figurée au plan","01",1315,"53","AL53",188,1127]
["10091","161000AL0061","05161","161","AL","0061",null,"Parcelle figurée au plan","01",928,"61","AL61",3,925]
["10052","161000AL0062","05161","161","AL","0062",null,"Parcelle figurée au plan","01",880,"62","AL62",16,864]
["10084","161000AL0067","05161","161","AL","0067",null,"Parcelle figurée au plan","01",60,"67","AL67",7,53]
["10083","161000AL0068","05161","161","AL","0068",null,"Parcelle figurée au plan","01",50,"68","AL68",49,1]
["10079","161000AL0069","05161","161","AL","0069",null,"Parcelle figurée au plan","01",54,"69","AL69",47,7]
["10078","161000AL0070","05161","161","AL","0070",null,"Parcelle figurée au plan","01",53,"70","AL70",43,10]
["10077","161000AL0071","05161","161","AL","0071",null,"Parcelle figurée au plan","01",59,"71","AL71",54,5]
["10076","161000AL0072","05161","161","AL","0072",null,"Parcelle figurée au plan","01",80,"72","AL72",14,66]
["10082","161000AL0075","05161","161","AL","0075",null,"Parcelle figurée au plan","01",79,"75","AL75",2,77]
["10087","161000AL0076","05161","161","AL","0076",null,"Parcelle figurée au plan","01",547,"76","AL76",192,355]
["10088","161000AL0082","05161","161","AL","0082",null,"Parcelle figurée au plan","01",1335,"82","AL82",65,1270]
["10039","161000AL0171","05161","161","AL","0171",null,"Parcelle figurée au plan","01",2106,"171","AL171",8,2098]
["10040","161000AL0172","05161","161","AL","0172",null,"Parcelle figurée au plan","01",1000,"172","AL172",151,849]
["10041","161000AL0173","05161","161","AL","0173",null,"Parcelle figurée au plan","01",1100,"173","AL173",190,910]
["10042","161000AL0174","05161","161","AL","0174",null,"Parcelle figurée au plan","01",1442,"174","AL174",212,1230]
["10043","161000AL0175","05161","161","AL","0175",null,"Parcelle figurée au plan","01",1116,"175","AL175",146,970]
["10445","161000AM0254","05161","161","AM","0254",null,"Parcelle figurée au plan","01",620,"254","AM254",9,611]
["10328","161000AM0271","05161","161","AM","0271",null,"Parcelle figurée au plan","01",2044,"271","AM271",164,1880]
["10327","161000AM0273","05161","161","AM","0273",null,"Parcelle figurée au plan","01",377,"273","AM273",56,321]
["10326","161000AM0274","05161","161","AM","0274",null,"Parcelle figurée au plan","01",579,"274","AM274",24,555]
["10324","161000AM0276","05161","161","AM","0276",null,"Parcelle figurée au plan","01",246,"276","AM276",0,246]
["10323","161000AM0278","05161","161","AM","0278",null,"Parcelle figurée au plan","01",173,"278","AM278",31,142]
["10322","161000AM0279","05161","161","AM","0279",null,"Parcelle figurée au plan","01",290,"279","AM279",67,223]
["10479","161000AM0319","05161","161","AM","0319",null,"Parcelle figurée au plan","01",284,"319","AM319",16,268]
["10232","161000AM0320","05161","161","AM","0320",null,"Parcelle figurée au plan","01",1724,"320","AM320",182,1542]
["10480","161000AM0321","05161","161","AM","0321",null,"Parcelle figurée au plan","01",199,"321","AM321",163,36]
["10211","161000AM0322","05161","161","AM","0322",null,"Parcelle figurée au plan","01",590,"322",{"$f":"CONCATENATE(E66,K66)","v":"AM322"},86,504]
["10210","161000AM0323","05161","161","AM","0323",null,"Parcelle figurée au plan","01",310,"323","AM323",104,{"$f":"J67-M67","v":206}]
["10208","161000AM0324","05161","161","AM","0324",null,"Parcelle figurée au plan","01",134,"324","AM324",66,68]
["10265","161000AM0499","05161","161","AM","0499",null,"Parcelle figurée au plan","01",127,"499","AM499",2,125]
["10263","161000AM0501","05161","161","AM","0501",null,"Parcelle figurée au plan","01",384,"501","AM501",71,313]
["10243","161000AM0780","05161","161","AM","0780",null,"Parcelle figurée au plan","01",3397,"780","AM780",151,3246]
["10986","161000AN0169","05161","161","AN","0169",null,"Parcelle figurée au plan","01",105,"169","AN169",1,104]
["10577","161000AN0171","05161","161","AN","0171",null,"Parcelle figurée au plan","01",515,"171","AN171",9,506]
["10580","161000AN0172","05161","161","AN","0172",null,"Parcelle figurée au plan","01",214,"172","AN172",0,214]
["10585","161000AN0177","05161","161","AN","0177",null,"Parcelle figurée au plan","01",4146,"177","AN177",6,4140]
["11010","161000AO0017","05161","161","AO","0017",null,"Parcelle figurée au plan","01",29850,"17","AO17",1508,28342]
["11716","161000AP0005","05161","161","AP","0005",null,"Parcelle figurée au plan","01",140,"5","AP5",11,129]
["11720","161000AP0007","05161","161","AP","0007",null,"Parcelle figurée au plan","01",2568,"7","AP7",2,2566]
["11708","161000AP0008","05161","161","AP","0008",null,"Parcelle figurée au plan","01",546,"8","AP8",87,459]
["11445","161000AP0009","05161","161","AP","0009",null,"Parcelle figurée au plan","01",568,"9","AP9",53,515]
["11446","161000AP0010","05161","161","AP","0010",null,"Parcelle figurée au plan","01",388,"10","AP10",69,319]
["11447","161000AP0011","05161","161","AP","0011",null,"Parcelle figurée au plan","01",420,"11","AP11",98,322]
["11448","161000AP0012","05161","161","AP","0012",null,"Parcelle figurée au plan","01",40,"12","AP12",19,21]
["11743","161000AP0019","05161","161","AP","0019",null,"Parcelle figurée au plan","01",130,"19","AP19",0,130]
["11444","161000AP0020","05161","161","AP","0020",null,"Parcelle figurée au plan","01",1485,"20","AP20",0,1485]
["11675","161000AP0045","05161","161","AP","0045",null,"Parcelle figurée au plan","01",671,"45","AP45",43,628]
["11703","161000AP0052","05161","161","AP","0052",null,"Parcelle figurée au plan","01",852,"52","AP52",132,720]
["11704","161000AP0053","05161","161","AP","0053",null,"Parcelle figurée au plan","01",468,"53","AP53",93,375]
["11707","161000AP0056","05161","161","AP","0056",null,"Parcelle figurée au plan","01",451,"56","AP56",33,418]
["11705","161000AP0057","05161","161","AP","0057",null,"Parcelle figurée au plan","01",505,"57","AP57",46,459]
["11706","161000AP0058","05161","161","AP","0058",null,"Parcelle figurée au plan","01",875,"58","AP58",68,807]
["11714","161000AP0059","05161","161","AP","0059",null,"Parcelle figurée au plan","01",736,"59","AP59",83,653]
["11678","161000AP0080","05161","161","AP","0080",null,"Parcelle figurée au plan","01",587,"80","AP80",86,501]
["11677","161000AP0081","05161","161","AP","0081",null,"Parcelle figurée au plan","01",771,"81","AP81",132,639]
["11683","161000AP0084","05161","161","AP","0084",null,"Parcelle figurée au plan","01",567,"84","AP84",35,532]
["11684","161000AP0085","05161","161","AP","0085",null,"Parcelle figurée au plan","01",542,"85","AP85",32,510]
["11668","161000AP0086","05161","161","AP","0086",null,"Parcelle figurée au plan","01",136,"86","AP86",32,104]
["11685","161000AP0087","05161","161","AP","0087",null,"Parcelle figurée au plan","01",863,"87","AP87",36,827]
["11667","161000AP0088","05161","161","AP","0088",null,"Parcelle figurée au plan","01",1106,"88","AP88",46,1060]
["11659","161000AP0094","05161","161","AP","0094",null,"Parcelle figurée au plan","01",1538,"94","AP94",5,1533]
["11653","161000AP0095","05161","161","AP","0095",null,"Parcelle figurée au plan","01",695,"95","AP95",204,491]
["11658","161000AP0096","05161","161","AP","0096",null,"Parcelle figurée au plan","01",240,"96","AP96",17,223]
["11652","161000AP0103","05161","161","AP","0103",null,"Parcelle figurée au plan","01",454,"103","AP103",116,338]
["11650","161000AP0105","05161","161","AP","0105",null,"Parcelle figurée au plan","01",402,"105","AP105",72,330]
["11649","161000AP0106","05161","161","AP","0106",null,"Parcelle figurée au plan","01",552,"106","AP106",115,437]
["11629","161000AP0109","05161","161","AP","0109",null,"Parcelle figurée au plan","01",597,"109","AP109",82,515]
["11630","161000AP0110","05161","161","AP","0110",null,"Parcelle figurée au plan","01",772,"110","AP110",48,724]
["11624","161000AP0111","05161","161","AP","0111",null,"Parcelle figurée au plan","01",390,"111","AP111",5,385]
["11628","161000AP0115","05161","161","AP","0115",null,"Parcelle figurée au plan","01",211,"115","AP115",52,159]
["11627","161000AP0116","05161","161","AP","0116",null,"Parcelle figurée au plan","01",236,"116","AP116",63,173]
["11626","161000AP0117","05161","161","AP","0117",null,"Parcelle figurée au plan","01",309,"117","AP117",42,267]
["11463","161000AP0152","05161","161","AP","0152",null,"Parcelle figurée au plan","01",535,"152","AP152",112,423]
["11465","161000AP0153","05161","161","AP","0153",null,"Parcelle figurée au plan","01",167,"153","AP153",49,118]
["11464","161000AP0154","05161","161","AP","0154",null,"Parcelle figurée au plan","01",290,"154","AP154",17,273]
["11455","161000AP0161","05161","161","AP","0161",null,"Parcelle figurée au plan","01",710,"161","AP161",1,709]
["11467","161000AP0162","05161","161","AP","0162",null,"Parcelle figurée au plan","01",564,"162","AP162",89,475]
["11466","161000AP0163","05161","161","AP","0163",null,"Parcelle figurée au plan","01",260,"163","AP163",41,219]
["11730","161000AP0164","05161","161","AP","0164",null,"Parcelle figurée au plan","01",52,"164","AP164",3,49]
["11503","161000AP0174","05161","161","AP","0174",null,"Parcelle figurée au plan","01",243,"174","AP174",20,223]
["11504","161000AP0175","05161","161","AP","0175",null,"Parcelle figurée au plan","01",152,"175","AP175",20,132]
["11499","161000AP0176","05161","161","AP","0176",null,"Parcelle figurée au plan","01",457,"176","AP176",40,417]
["11505","161000AP0177","05161","161","AP","0177",null,"Parcelle figurée au plan","01",605,"177","AP177",50,555]
["11506","161000AP0180","05161","161","AP","0180",null,"Parcelle figurée au plan","01",950,"180","AP180",78,872]
["11507","161000AP0181","05161","161","AP","0181",null,"Parcelle figurée au plan","01",293,"181","AP181",28,265]
["11489","161000AP0182","05161","161","AP","0182",null,"Parcelle figurée au plan","01",766,"182","AP182",31,735]
["11510","161000AP0183","05161","161","AP","0183",null,"Parcelle figurée au plan","01",845,"183","AP183",65,780]
["11511","161000AP0188","05161","161","AP","0188",null,"Parcelle figurée au plan","01",1918,"188","AP188",211,1707]
["11513","161000AP0190","05161","161","AP","0190",null,"Parcelle figurée au plan","01",1239,"190","AP190",141,1098]
["11514","161000AP0191","05161","161","AP","0191",null,"Parcelle figurée au plan","01",1239,"191","AP191",162,1077]
["11515","161000AP0192","05161","161","AP","0192",null,"Parcelle figurée au plan","01",718,"192",{"$f":"CONCATENATE(E130,K130)","v":"AP192"},33,685]
["11741","161000AP0193","05161","161","AP","0193",null,"Parcelle figurée au plan","01",367,"193","AP193",7,{"$f":"J131-M131","v":360}]
["11633","161000AP0194","05161","161","AP","0194",null,"Parcelle figurée au plan","01",1562,"194","AP194",152,1410]
["11580","161000AP0234","05161","161","AP","0234",null,"Parcelle figurée au plan","01",648,"234","AP234",22,626]
["11342","161000AP0258","05161","161","AP","0258",null,"Parcelle figurée au plan","01",488,"258","AP258",179,309]
["11750","161000AP0263","05161","161","AP","0263",null,"Parcelle figurée au plan","01",225,"263","AP263",22,203]
["11739","161000AP0273","05161","161","AP","0273",null,"Parcelle figurée au plan","01",230,"273","AP273",5,225]
["11540","161000AP0274","05161","161","AP","0274",null,"Parcelle figurée au plan","01",530,"274","AP274",43,487]
["11539","161000AP0275","05161","161","AP","0275",null,"Parcelle figurée au plan","01",685,"275","AP275",172,513]
["11538","161000AP0276","05161","161","AP","0276",null,"Parcelle figurée au plan","01",670,"276","AP276",56,614]
["11345","161000AP0294","05161","161","AP","0294",null,"Parcelle figurée au plan","01",3558,"294","AP294",459,3099]
["11346","161000AP0295","05161","161","AP","0295",null,"Parcelle figurée au plan","01",980,"295","AP295",128,852]
["11740","161000AP0301","05161","161","AP","0301",null,"Parcelle figurée au plan","01",140,"301","AP301",3,137]
["11529","161000AP0304","05161","161","AP","0304",null,"Parcelle figurée au plan","01",808,"304","AP304",6,802]
["11530","161000AP0305","05161","161","AP","0305",null,"Parcelle figurée au plan","01",450,"305","AP305",125,325]
["11534","161000AP0309","05161","161","AP","0309",null,"Parcelle figurée au plan","01",196,"309","AP309",5,191]
["11533","161000AP0310","05161","161","AP","0310",null,"Parcelle figurée au plan","01",412,"310","AP310",34,378]
["11528","161000AP0314","05161","161","AP","0314",null,"Parcelle figurée au plan","01",596,"314","AP314",90,506]
["11526","161000AP0315","05161","161","AP","0315",null,"Parcelle figurée au plan","01",1292,"315","AP315",148,1144]
["11520","161000AP0317","05161","161","AP","0317",null,"Parcelle figurée au plan","01",1135,"317","AP317",8,1127]
["11527","161000AP0318","05161","161","AP","0318",null,"Parcelle figurée au plan","01",1048,"318","AP318",101,947]
["11749","161000AP0319","05161","161","AP","0319",null,"Parcelle figurée au plan","01",289,"319","AP319",39,250]
["11347","161000AP0320","05161","161","AP","0320",null,"Parcelle figurée au plan","01",2310,"320","AP320",91,2219]
["11532","161000AP0410","05161","161","AP","0410",null,"Parcelle figurée au plan","01",595,"410","AP410",171,424]
["11531","161000AP0411","05161","161","AP","0411",null,"Parcelle figurée au plan","01",967,"411","AP411",230,737]
["11334","161000AP0414","05161","161","AP","0414",null,"Parcelle figurée au plan","01",319,"414","AP414",13,306]
["11344","161000AP0415","05161","161","AP","0415","A","Parcelle figurée au plan","01",1350,"415","AP415",205,1145]
["11343","161000AP0416","05161","161","AP","0416","A","Parcelle figurée au plan","01",1018,"416","AP416",225,793]
["11582","161000AP0422","05161","161","AP","0422",null,"Parcelle figurée au plan","01",313,"422","AP422",155,158]
["11330","161000AP0459","05161","161","AP","0459",null,"Parcelle figurée au plan","01",977,"459","AP459",92,885]
["11331","161000AP0460","05161","161","AP","0460","A","Parcelle figurée au plan","01",1148,"460","AP460",4,1144]
["4315","1610000D1335","05161","161","D","1335",null,"Parcelle figurée au plan","01",440,"1335","D1335",98,342]
["4316","1610000D1338","05161","161","D","1338",null,"Parcelle figurée au plan","01",590,"1338","D1338",126,464]
["4321","1610000D1339","05161","161","D","1339",null,"Parcelle figurée au plan","01",1265,"1339","D1339",51,1214]
["4317","1610000D1341","05161","161","D","1341",null,"Parcelle figurée au plan","01",2132,"1341","D1341",71,2061]
["4351","1610000D1342","05161","161","D","1342",null,"Parcelle figurée au plan","01",2133,"1342","D1342",698,1435]
["4318","1610000D1343","05161","161","D","1343",null,"Parcelle figurée au plan","01",1915,"1343","D1343",561,1354]
["4319","1610000D1344","05161","161","D","1344",null,"Parcelle figurée au plan","01",1766,"1344","D1344",690,1076]
["4320","1610000D1345","05161","161","D","1345",null,"Parcelle figurée au plan","01",2246,"1345","D1345",315,1931]
["4322","1610000D1349","05161","161","D","1349",null,"Parcelle figurée au plan","01",790,"1349","D1349",80,710]
["4323","1610000D1350","05161","161","D","1350",null,"Parcelle figurée au plan","01",430,"1350","D1350",2,428]
["4325","1610000D1351","05161","161","D","1351",null,"Parcelle figurée au plan","01",150,"1351","D1351",74,76]
["4324","1610000D1355","05161","161","D","1355",null,"Parcelle figurée au plan","01",750,"1355","D1355",82,668]
["4335","1610000D1356","05161","161","D","1356",null,"Parcelle figurée au plan","01",360,"1356","D1356",45,315]
["4330","1610000D1357","05161","161","D","1357",null,"Parcelle figurée au plan","01",426,"1357","D1357",101,325]
["4331","1610000D1358","05161","161","D","1358",null,"Parcelle figurée au plan","01",879,"1358","D1358",385,494]
["4332","1610000D1359","05161","161","D","1359",null,"Parcelle figurée au plan","01",677,"1359","D1359",38,639]
["4334","1610000D1361","05161","161","D","1361",null,"Parcelle figurée au plan","01",1669,"1361","D1361",100,1569]
["4347","1610000D1362","05161","161","D","1362",null,"Parcelle figurée au plan","01",493,"1362","D1362",34,459]
["4348","1610000D1363","05161","161","D","1363",null,"Parcelle figurée au plan","01",379,"1363","D1363",54,325]
["4349","1610000D1365","05161","161","D","1365",null,"Parcelle figurée au plan","01",624,"1365","D1365",45,579]
["4344","1610000D1368","05161","161","D","1368",null,"Parcelle figurée au plan","01",543,"1368","D1368",66,477]
["4338","1610000D1369","05161","161","D","1369",null,"Parcelle figurée au plan","01",807,"1369","D1369",76,731]
["4521","1610000D1374","05161","161","D","1374",null,"Parcelle figurée au plan","01",320,"1374","D1374",30,290]
["4337","1610000D1375","05161","161","D","1375",null,"Parcelle figurée au plan","01",301,"1375","D1375",153,148]
["4346","1610000D1376","05161","161","D","1376",null,"Parcelle figurée au plan","01",134,"1376","D1376",40,94]
["4345","1610000D1378","05161","161","D","1378",null,"Parcelle figurée au plan","01",136,"1378","D1378",63,73]
["4336","1610000D1379","05161","161","D","1379",null,"Parcelle figurée au plan","01",330,"1379","D1379",148,182]
["4329","1610000D1380","05161","161","D","1380",null,"Parcelle figurée au plan","01",490,"1380","D1380",142,348]
["4328","1610000D1381","05161","161","D","1381",null,"Parcelle figurée au plan","01",500,"1381","D1381",9,491]
["4327","1610000D1382","05161","161","D","1382",null,"Parcelle figurée au plan","01",780,"1382","D1382",202,578]
["5335","1610000D1876","05161","161","D","1876",null,"Parcelle figurée au plan","01",1230,"1876","D1876",1,1229]
["5169","1610000D1884","05161","161","D","1884",null,"Parcelle figurée au plan","01",604,"1884","D1884",16,588]
["5174","1610000D1885","05161","161","D","1885",null,"Parcelle figurée au plan","01",84,"1885","D1885",55,29]
["4178","1610000D3268","05161","161","D","3268",null,"Parcelle figurée au plan","01",2367,"3268",{"$f":"CONCATENATE(E194,K194)","v":"D3268"},310,2057]
["4179","1610000D3269","05161","161","D","3269",null,"Parcelle figurée au plan","01",331,"3269","D3269",2,{"$f":"J195-M195","v":329}]
["4180","1610000D3270","05161","161","D","3270",null,"Parcelle figurée au plan","01",500,"3270","D3270",16,484]
["4181","1610000D3271","05161","161","D","3271",null,"Parcelle figurée au plan","01",660,"3271","D3271",74,586]
["4183","1610000D3273","05161","161","D","3273",null,"Parcelle figurée au plan","01",786,"3273","D3273",1,785]
["4184","1610000D3274","05161","161","D","3274",null,"Parcelle figurée au plan","01",820,"3274","D3274",38,782]
["4185","1610000D3275","05161","161","D","3275",null,"Parcelle figurée au plan","01",640,"3275","D3275",54,586]
["4913","1610000D3283","05161","161","D","3283",null,"Parcelle figurée au plan","01",410,"3283","D3283",159,251]
["4914","1610000D3284","05161","161","D","3284",null,"Parcelle figurée au plan","01",1235,"3284","D3284",48,1187]
["4915","1610000D3285","05161","161","D","3285",null,"Parcelle figurée au plan","01",169,"3285","D3285",7,162]
["4916","1610000D3286","05161","161","D","3286",null,"Parcelle figurée au plan","01",480,"3286","D3286",130,350]
["4917","1610000D3287","05161","161","D","3287",null,"Parcelle figurée au plan","01",800,"3287","D3287",200,600]
["4918","1610000D3288","05161","161","D","3288",null,"Parcelle figurée au plan","01",2560,"3288","D3288",58,2502]
["4919","1610000D3289","05161","161","D","3289",null,"Parcelle figurée au plan","01",720,"3289","D3289",167,553]
["4920","1610000D3290","05161","161","D","3290",null,"Parcelle figurée au plan","01",1018,"3290","D3290",186,832]
["4193","1610000D3291","05161","161","D","3291",null,"Parcelle figurée au plan","01",963,"3291","D3291",171,792]
["4194","1610000D3292","05161","161","D","3292",null,"Parcelle figurée au plan","01",825,"3292","D3292",106,719]
["4195","1610000D3293","05161","161","D","3293",null,"Parcelle figurée au plan","01",1408,"3293","D3293",154,1254]
["4196","1610000D3294","05161","161","D","3294",null,"Parcelle figurée au plan","01",940,"3294","D3294",147,793]
["4197","1610000D3295","05161","161","D","3295",null,"Parcelle figurée au plan","01",1889,"3295","D3295",80,1809]
["4198","1610000D3296","05161","161","D","3296",null,"Parcelle figurée au plan","01",2237,"3296","D3296",147,2090]
["4199","1610000D3297","05161","161","D","3297",null,"Parcelle figurée au plan","01",1690,"3297","D3297",52,1638]
["4200","1610000D3298","05161","161","D","3298",null,"Parcelle figurée au plan","01",1670,"3298","D3298",203,1467]
["4201","1610000D3299","05161","161","D","3299",null,"Parcelle figurée au plan","01",717,"3299","D3299",77,640]
["4202","1610000D3300","05161","161","D","3300",null,"Parcelle figurée au plan","01",2560,"3300","D3300",394,2166]
["4203","1610000D3301","05161","161","D","3301",null,"Parcelle figurée au plan","01",1326,"3301","D3301",190,1136]
["4204","1610000D3302","05161","161","D","3302",null,"Parcelle figurée au plan","01",1296,"3302","D3302",171,1125]