{"text_format":"1","workbook":"xlsx","n_sheets":8,"sheets":["Fiche_parcelle","Noms en colonnes","Feuil1","Adresse clean","Détail propriétaire","Etat complet","Propriétaires en tableau","Export Geomas"],"not_rendered":{"charts":0,"images":0,"macros":1,"external_links":0,"defined_names":5,"comments":0,"pivot_tables":0},"unopened":[],"bounds":{"document_bytes":16777216,"sheet_cells":100000,"rows_first":2000,"rows_last":500,"rows_between":2000,"halvings":0,"cell_chars":16384,"cell_head_chars":4096},"cells_cut":0,"cells_raw":0,"read":"whole","date_system":"1900"}

{"sheet":"Fiche_parcelle","index":0,"n_rows":3652,"n_cols":14,"rows_kept":3652,"cut":false,"hidden":false,"merged":[]}
["n0 p","Section","N° parcelle","Civilité","Nom de tous les propriétaires  (parcelle, BND, local)","Adresse de tous les propriétaires (parcelle, BND, local)","formule","nom de voie","code postal","ville",null,null,null,"Superficie"]
[1,"AP","10","Madame","A","Chemin des mimosas 04210 VILLE",{"$f":"SUMPRODUCT(ISNUMBER(MID(SUBSTITUTE(F2,\" \",\"|\"),ROW($1:$3552),5)*1)*ROW($1:$3552))","v":20},{"$f":"LEFT(F2,G2-1)","v":"Chemin des mimosas "},{"$f":"MID(F2,G2,5)","v":"04210"},{"$f":"MID(F2,G2+6,50)","v":"VILLE"},null,null,{"$f":"IF(E1=E2,CONCATENATE(M1,\",\",B2,C2),CONCATENATE(B2,C2))","v":"AP10"},388]
[{"$f":"IF(E2=E3,A2,A2+1)","v":2},"AP","10","Monsieur","B","Rue des Pâquerettes 04210 VILLE",21,"Rue des Pâquerettes ","04210","VILLE",null,null,{"$f":"IF(E2=E3,CONCATENATE(M2,\",\",B3,C3),CONCATENATE(B3,C3))","v":"AP10"},388]
[3,"AN","171","Monsieur","C","Boulevard des Lilas 04210 VILLE",21,"Boulevard des Lilas ","04210","VILLE",null,null,{"$f":"IF(E3=E4,CONCATENATE(M3,\",\",B4,C4),CONCATENATE(B4,C4))","v":"AN171"},515]
[4,"AP","115","Monsieur","D","Impasse des Champs 04210 VILLE",20,"Impasse des Champs ","04210","VILLE",null,null,{"$f":"IF(E4=E5,CONCATENATE(M4,\",\",B5,C5),CONCATENATE(B5,C5))","v":"AP115"},211]
[5,"AP","11","Société","E","Rue des Tilleuls 04210 VILLE",18,"Rue des Tilleuls ","04210","VILLE",null,null,{"$f":"CONCATENATE(B6,C6)","v":"AP11"},420]
[6,"D","1884","Madame","F","Place aux Roses 04210 VILLE",17,"Place aux Roses ","04210","VILLE",null,null,{"$f":"IF(E6=E7,CONCATENATE(M6,\",\",B7,C7),CONCATENATE(B7,C7))","v":"D1884"},604]
[6,"D","1885","Madame","F","Place aux Roses 04210 VILLE",17,"Place aux Roses ","04210","VILLE",null,null,"D1884,D1885",84]
{"$rows_left_out":3645}
{"sheet":"Noms en colonnes","index":1,"n_rows":13,"n_cols":11,"rows_kept":13,"cut":false,"hidden":false,"merged":[]}
["n0 p","Civilité","Nom de tous les propriétaires  (parcelle, BND, local)","Nom",null,null,"Prénom 1","Prénom 2","Prénom 3","Prénom 4","Nom de jeune fille"]
[1,"Madame","ACERBIS DIT ALVARES VALERIE","A","ALVARES","ACERBIS","VALERIE",null,null,null,"M"]
[2,"Monsieur","ACERBIS PASCAL","B",null,"ACERBIS","PASCAL",null,null,null,{"$f":"IF(E3<>\"\",F3,\"\")","v":""}]
[3,"Monsieur","ALBERT DANIEL PAUL","C",null,"ALBERT","DANIEL","PAUL",null,null,{"$f":"IF(E4<>\"\",F4,\"\")","v":""}]
[4,"Monsieur","ALBERT JOSEPH MARTIN NAZAIRE","D",null,"ALBERT","JOSEPH","MARTIN","NAZAIRE",null,{"$f":"IF(E5<>\"\",F5,\"\")","v":""}]
[5,"Société","ALIX","E",null,"ALIX",null,null,null,null,{"$f":"IF(E6<>\"\",F6,\"\")","v":""}]
[6,"Madame","ANDRE ARLETTE EMILIA DIT FINE ARLETTE","F","FINE","ANDRE","ARLETTE","EMILIA",null,null,"N"]
[7,"Madame","ARDUIN ELVIRE MARCELLE LOUISE DIT CROSASSO ELVIRE","G","CROSASSO","ARDUIN","ELVIRE","MARCELLE","LOUISE",null,"O"]
{"$rows_left_out":6}
{"sheet":"Feuil1","index":2,"n_rows":22,"n_cols":9,"rows_kept":22,"cut":false,"hidden":false,"merged":[]}
["N° extrait propriétaire","Concaténé",null,null,"essai","Liste parcelles",null,null,"Liste parcelles"]
[{"$f":"Fiche_parcelle!A2","v":1},{"$f":"CONCATENATE('Etat complet'!B2,'Etat complet'!C2)","v":"AP10"},null,null,{"$f":"A2","v":1},{"$f":"IF(E2<>\"\",B2,\"\")","v":"AP10"},null,1,"AP10"]
[{"$f":"Fiche_parcelle!A3","v":2},{"$f":"IF('Etat complet'!A3='Etat complet'!A2,CONCATENATE(B2,\", \",'Etat complet'!B3,'Etat complet'!C3),CONCATENATE('Etat complet'!B3,'Etat complet'!C3))","v":"AP10"},null,null,{"$f":"IF(A3=A4,\"\",CONCATENATE(A3))","v":"2"},"AP10",null,2,"AP10"]
[{"$f":"Fiche_parcelle!A4","v":3},{"$f":"IF('Etat complet'!A4='Etat complet'!A3,CONCATENATE(B3,\", \",'Etat complet'!B4,'Etat complet'!C4),CONCATENATE('Etat complet'!B4,'Etat complet'!C4))","v":"AN171"},null,null,"3","AN171",null,3,"AN171"]
[{"$f":"Fiche_parcelle!A5","v":4},{"$f":"IF('Etat complet'!A5='Etat complet'!A4,CONCATENATE(B4,\", \",'Etat complet'!B5,'Etat complet'!C5),CONCATENATE('Etat complet'!B5,'Etat complet'!C5))","v":"AP115"},null,null,"4","AP115",null,4,"AP115"]
[{"$f":"Fiche_parcelle!A6","v":5},{"$f":"IF('Etat complet'!A6='Etat complet'!A5,CONCATENATE(B5,\", \",'Etat complet'!B6,'Etat complet'!C6),CONCATENATE('Etat complet'!B6,'Etat complet'!C6))","v":"AP11"},null,null,"5","AP11",null,5,"AP11"]
[{"$f":"Fiche_parcelle!A7","v":6},{"$f":"IF('Etat complet'!A7='Etat complet'!A6,CONCATENATE(B6,\", \",'Etat complet'!B7,'Etat complet'!C7),CONCATENATE('Etat complet'!B7,'Etat complet'!C7))","v":"D1884"},null,null,"","",null,6,"D1884, D1885"]
[{"$f":"Fiche_parcelle!A8","v":6},{"$f":"IF('Etat complet'!A8='Etat complet'!A7,CONCATENATE(B7,\", \",'Etat complet'!B8,'Etat complet'!C8),CONCATENATE('Etat complet'!B8,'Etat complet'!C8))","v":"D1884, D1885"},null,null,"6","D1884, D1885",null,7,"AP317, D3286, D3287"]
{"$rows_left_out":15}
{"sheet":"Adresse clean","index":3,"n_rows":13,"n_cols":4,"rows_kept":13,"cut":false,"hidden":false,"merged":[]}
["n0 p","Ligne d'adresse 1","Code postal","ville"]
[1,{"$f":"VLOOKUP(A2,Fiche_parcelle!$A$1:$N$22,8,FALSE)","v":"Chemin des mimosas "},{"$f":"VLOOKUP(A2,Fiche_parcelle!$A$1:$N$22,9,FALSE)","v":"04210"},{"$f":"VLOOKUP(A2,Fiche_parcelle!$A$1:$N$22,10,FALSE)","v":"VILLE"}]
[2,{"$f":"VLOOKUP(A3,Fiche_parcelle!$A$1:$N$22,8,FALSE)","v":"Rue des Pâquerettes "},{"$f":"VLOOKUP(A3,Fiche_parcelle!$A$1:$N$22,9,FALSE)","v":"04210"},{"$f":"VLOOKUP(A3,Fiche_parcelle!$A$1:$N$22,10,FALSE)","v":"VILLE"}]
[3,{"$f":"VLOOKUP(A4,Fiche_parcelle!$A$1:$N$22,8,FALSE)","v":"Boulevard des Lilas "},{"$f":"VLOOKUP(A4,Fiche_parcelle!$A$1:$N$22,9,FALSE)","v":"04210"},{"$f":"VLOOKUP(A4,Fiche_parcelle!$A$1:$N$22,10,FALSE)","v":"VILLE"}]
[4,{"$f":"VLOOKUP(A5,Fiche_parcelle!$A$1:$N$22,8,FALSE)","v":"Impasse des Champs "},{"$f":"VLOOKUP(A5,Fiche_parcelle!$A$1:$N$22,9,FALSE)","v":"04210"},{"$f":"VLOOKUP(A5,Fiche_parcelle!$A$1:$N$22,10,FALSE)","v":"VILLE"}]
[5,{"$f":"VLOOKUP(A6,Fiche_parcelle!$A$1:$N$22,8,FALSE)","v":"Rue des Tilleuls "},{"$f":"VLOOKUP(A6,Fiche_parcelle!$A$1:$N$22,9,FALSE)","v":"04210"},{"$f":"VLOOKUP(A6,Fiche_parcelle!$A$1:$N$22,10,FALSE)","v":"VILLE"}]
[6,{"$f":"VLOOKUP(A7,Fiche_parcelle!$A$1:$N$22,8,FALSE)","v":"Place aux Roses "},{"$f":"VLOOKUP(A7,Fiche_parcelle!$A$1:$N$22,9,FALSE)","v":"04210"},{"$f":"VLOOKUP(A7,Fiche_parcelle!$A$1:$N$22,10,FALSE)","v":"VILLE"}]
[7,{"$f":"VLOOKUP(A8,Fiche_parcelle!$A$1:$N$22,8,FALSE)","v":"avenue Inconnue "},{"$f":"VLOOKUP(A8,Fiche_parcelle!$A$1:$N$22,9,FALSE)","v":"04210"},{"$f":"VLOOKUP(A8,Fiche_parcelle!$A$1:$N$22,10,FALSE)","v":"VILLE"}]
{"$rows_left_out":6}
{"sheet":"Détail propriétaire","index":4,"n_rows":13,"n_cols":15,"rows_kept":13,"cut":false,"hidden":false,"merged":[]}
["N° prop","Civilité","NOM","Prénom 1","Prénom 2","Prénom 3","Nom de jeune fille","Adresse",null,null,null,"Parcelle(s)","Date naissance","Lieu de naissance","Profession"]
[1,{"$f":"'Noms en colonnes'!B2","v":"Madame"},{"$f":"'Noms en colonnes'!D2","v":"A"},{"$f":"PROPER('Noms en colonnes'!G2)","v":"Valerie"},{"$f":"PROPER('Noms en colonnes'!H2)","v":""},{"$f":"PROPER('Noms en colonnes'!I2)","v":""},{"$f":"IF(AND(B2=\"Madame\",'Noms en colonnes'!K2<>\"\"),CONCATENATE(\"née \",'Noms en colonnes'!K2),\"\")","v":"née M"},{"$f":"CONCATENATE(\"demeurant \"&PROPER('Adresse clean'!B2)&\" \"&'Adresse clean'!C2&\" \"&'Adresse clean'!D2)","v":"demeurant Chemin Des Mimosas  04210 VILLE"},null,null,null,{"$f":"VLOOKUP(A2,Feuil1!H:I,2,FALSE)","v":"AP10"},{"$f":"CONCATENATE(\"le \")","v":"le "},{"$f":"CONCATENATE(\"à \")","v":"à "},"exerçant la profession de "]
[2,{"$f":"'Noms en colonnes'!B3","v":"Monsieur"},{"$f":"'Noms en colonnes'!D3","v":"B"},{"$f":"PROPER('Noms en colonnes'!G3)","v":"Pascal"},{"$f":"PROPER('Noms en colonnes'!H3)","v":""},{"$f":"PROPER('Noms en colonnes'!I3)","v":""},{"$f":"IF(AND(B3=\"Madame\",'Noms en colonnes'!K3<>\"\"),CONCATENATE(\"née \",'Noms en colonnes'!K3),\"\")","v":""},{"$f":"CONCATENATE(\"demeurant \"&PROPER('Adresse clean'!B3)&\" \"&'Adresse clean'!C3&\" \"&'Adresse clean'!D3)","v":"demeurant Rue Des Pâquerettes  04210 VILLE"},null,null,null,{"$f":"VLOOKUP(A3,Feuil1!H:I,2,FALSE)","v":"AP10"},{"$f":"CONCATENATE(\"le \")","v":"le "},{"$f":"CONCATENATE(\"à \")","v":"à "},"exerçant la profession de "]
[3,{"$f":"'Noms en colonnes'!B4","v":"Monsieur"},{"$f":"'Noms en colonnes'!D4","v":"C"},{"$f":"PROPER('Noms en colonnes'!G4)","v":"Daniel"},{"$f":"PROPER('Noms en colonnes'!H4)","v":"Paul"},{"$f":"PROPER('Noms en colonnes'!I4)","v":""},{"$f":"IF(AND(B4=\"Madame\",'Noms en colonnes'!K4<>\"\"),CONCATENATE(\"née \",'Noms en colonnes'!K4),\"\")","v":""},{"$f":"CONCATENATE(\"demeurant \"&PROPER('Adresse clean'!B4)&\" \"&'Adresse clean'!C4&\" \"&'Adresse clean'!D4)","v":"demeurant Boulevard Des Lilas  04210 VILLE"},null,null,null,{"$f":"VLOOKUP(A4,Feuil1!H:I,2,FALSE)","v":"AN171"},"le ","à ","exerçant la profession de "]
[4,{"$f":"'Noms en colonnes'!B5","v":"Monsieur"},{"$f":"'Noms en colonnes'!D5","v":"D"},{"$f":"PROPER('Noms en colonnes'!G5)","v":"Joseph"},{"$f":"PROPER('Noms en colonnes'!H5)","v":"Martin"},{"$f":"PROPER('Noms en colonnes'!I5)","v":"Nazaire"},{"$f":"IF(AND(B5=\"Madame\",'Noms en colonnes'!K5<>\"\"),CONCATENATE(\"née \",'Noms en colonnes'!K5),\"\")","v":""},{"$f":"CONCATENATE(\"demeurant \"&PROPER('Adresse clean'!B5)&\" \"&'Adresse clean'!C5&\" \"&'Adresse clean'!D5)","v":"demeurant Impasse Des Champs  04210 VILLE"},null,null,null,{"$f":"VLOOKUP(A5,Feuil1!H:I,2,FALSE)","v":"AP115"},"le ","à ","exerçant la profession de "]
[5,{"$f":"'Noms en colonnes'!B6","v":"Société"},{"$f":"'Noms en colonnes'!D6","v":"E"},{"$f":"PROPER('Noms en colonnes'!G6)","v":""},{"$f":"PROPER('Noms en colonnes'!H6)","v":""},{"$f":"PROPER('Noms en colonnes'!I6)","v":""},{"$f":"IF(AND(B6=\"Madame\",'Noms en colonnes'!K6<>\"\"),CONCATENATE(\"née \",'Noms en colonnes'!K6),\"\")","v":""},{"$f":"CONCATENATE(\"demeurant \"&PROPER('Adresse clean'!B6)&\" \"&'Adresse clean'!C6&\" \"&'Adresse clean'!D6)","v":"demeurant Rue Des Tilleuls  04210 VILLE"},null,null,null,{"$f":"VLOOKUP(A6,Feuil1!H:I,2,FALSE)","v":"AP11"},"le ","à ","exerçant la profession de "]
[6,{"$f":"'Noms en colonnes'!B7","v":"Madame"},{"$f":"'Noms en colonnes'!D7","v":"F"},{"$f":"PROPER('Noms en colonnes'!G7)","v":"Arlette"},{"$f":"PROPER('Noms en colonnes'!H7)","v":"Emilia"},{"$f":"PROPER('Noms en colonnes'!I7)","v":""},{"$f":"IF(AND(B7=\"Madame\",'Noms en colonnes'!K7<>\"\"),CONCATENATE(\"née \",'Noms en colonnes'!K7),\"\")","v":"née N"},{"$f":"CONCATENATE(\"demeurant \"&PROPER('Adresse clean'!B7)&\" \"&'Adresse clean'!C7&\" \"&'Adresse clean'!D7)","v":"demeurant Place Aux Roses  04210 VILLE"},null,null,null,{"$f":"VLOOKUP(A7,Feuil1!H:I,2,FALSE)","v":"D1884, D1885"},"le ","à ","exerçant la profession de "]
[7,{"$f":"'Noms en colonnes'!B8","v":"Madame"},{"$f":"'Noms en colonnes'!D8","v":"G"},{"$f":"PROPER('Noms en colonnes'!G8)","v":"Elvire"},{"$f":"PROPER('Noms en colonnes'!H8)","v":"Marcelle"},{"$f":"PROPER('Noms en colonnes'!I8)","v":"Louise"},{"$f":"IF(AND(B8=\"Madame\",'Noms en colonnes'!K8<>\"\"),CONCATENATE(\"née \",'Noms en colonnes'!K8),\"\")","v":"née O"},{"$f":"CONCATENATE(\"demeurant \"&PROPER('Adresse clean'!B8)&\" \"&'Adresse clean'!C8&\" \"&'Adresse clean'!D8)","v":"demeurant Avenue Inconnue  04210 VILLE"},null,null,null,{"$f":"VLOOKUP(A8,Feuil1!H:I,2,FALSE)","v":"AP317, D3286, D3287"},"le ","à ","exerçant la profession de "]
{"$rows_left_out":6}
{"sheet":"Etat complet","index":5,"n_rows":22,"n_cols":8,"rows_kept":22,"cut":false,"hidden":false,"merged":[]}
["N° extrait propriétaire","Section","Parcelle","Concat","Contenance","Emprise","Reliquat"]
[{"$f":"Fiche_parcelle!A2","v":1},{"$f":"Fiche_parcelle!B2","v":"AP"},{"$f":"Fiche_parcelle!C2","v":"10"},"AP10",{"$f":"INDEX('Export Geomas'!J:J,MATCH('Etat complet'!D2,'Export Geomas'!L:L,0))","v":388},69,319,{"$f":"A2&\"-\"&COUNTIF(A$2:A2,A2)","v":"1-1"}]
[{"$f":"Fiche_parcelle!A3","v":2},{"$f":"Fiche_parcelle!B3","v":"AP"},{"$f":"Fiche_parcelle!C3","v":"10"},{"$f":"CONCATENATE(B3,C3)","v":"AP10"},{"$f":"INDEX('Export Geomas'!J:J,MATCH('Etat complet'!D3,'Export Geomas'!L:L,0))","v":388},{"$f":"VLOOKUP(D3,'Export Geomas'!L:N,2,FALSE)","v":69},{"$f":"VLOOKUP(D3,'Export Geomas'!L:N,3,FALSE)","v":319},{"$f":"A3&\"-\"&COUNTIF(A$2:A3,A3)","v":"2-1"}]
[{"$f":"Fiche_parcelle!A4","v":3},{"$f":"Fiche_parcelle!B4","v":"AN"},{"$f":"Fiche_parcelle!C4","v":"171"},"AN171",{"$f":"INDEX('Export Geomas'!J:J,MATCH('Etat complet'!D4,'Export Geomas'!L:L,0))","v":515},{"$f":"VLOOKUP(D4,'Export Geomas'!L:N,2,FALSE)","v":9},{"$f":"VLOOKUP(D4,'Export Geomas'!L:N,3,FALSE)","v":506},{"$f":"A4&\"-\"&COUNTIF(A$2:A4,A4)","v":"3-1"}]
[{"$f":"Fiche_parcelle!A5","v":4},{"$f":"Fiche_parcelle!B5","v":"AP"},{"$f":"Fiche_parcelle!C5","v":"115"},"AP115",{"$f":"INDEX('Export Geomas'!J:J,MATCH('Etat complet'!D5,'Export Geomas'!L:L,0))","v":211},{"$f":"VLOOKUP(D5,'Export Geomas'!L:N,2,FALSE)","v":52},{"$f":"VLOOKUP(D5,'Export Geomas'!L:N,3,FALSE)","v":159},{"$f":"A5&\"-\"&COUNTIF(A$2:A5,A5)","v":"4-1"}]
[{"$f":"Fiche_parcelle!A6","v":5},{"$f":"Fiche_parcelle!B6","v":"AP"},{"$f":"Fiche_parcelle!C6","v":"11"},"AP11",{"$f":"INDEX('Export Geomas'!J:J,MATCH('Etat complet'!D6,'Export Geomas'!L:L,0))","v":420},{"$f":"VLOOKUP(D6,'Export Geomas'!L:N,2,FALSE)","v":98},{"$f":"VLOOKUP(D6,'Export Geomas'!L:N,3,FALSE)","v":322},{"$f":"A6&\"-\"&COUNTIF(A$2:A6,A6)","v":"5-1"}]
[{"$f":"Fiche_parcelle!A7","v":6},{"$f":"Fiche_parcelle!B7","v":"D"},{"$f":"Fiche_parcelle!C7","v":"1884"},"D1884",{"$f":"INDEX('Export Geomas'!J:J,MATCH('Etat complet'!D7,'Export Geomas'!L:L,0))","v":604},{"$f":"VLOOKUP(D7,'Export Geomas'!L:N,2,FALSE)","v":16},{"$f":"VLOOKUP(D7,'Export Geomas'!L:N,3,FALSE)","v":588},{"$f":"A7&\"-\"&COUNTIF(A$2:A7,A7)","v":"6-1"}]
[{"$f":"Fiche_parcelle!A8","v":6},{"$f":"Fiche_parcelle!B8","v":"D"},{"$f":"Fiche_parcelle!C8","v":"1885"},"D1885",{"$f":"INDEX('Export Geomas'!J:J,MATCH('Etat complet'!D8,'Export Geomas'!L:L,0))","v":84},{"$f":"VLOOKUP(D8,'Export Geomas'!L:N,2,FALSE)","v":55},{"$f":"VLOOKUP(D8,'Export Geomas'!L:N,3,FALSE)","v":29},{"$f":"A8&\"-\"&COUNTIF(A$2:A8,A8)","v":"6-2"}]
{"$rows_left_out":15}
{"sheet":"Propriétaires en tableau","index":6,"n_rows":60,"n_cols":46,"rows_kept":60,"cut":false,"hidden":false,"merged":[[32,2,32,5],[37,2,37,5],[42,2,42,5],[47,2,47,5],[52,2,52,5],[57,2,57,5],[2,2,2,5],[7,2,7,5],[12,2,12,5],[17,2,17,5],[22,2,22,5],[27,2,27,5]]}
["Propriétaire numéro",1]
[{"$f":"VLOOKUP(B1,'Détail propriétaire'!$1:$1048576,2,FALSE)&\" \"&VLOOKUP(B1,'Détail propriétaire'!$1:$1048576,3,FALSE)&\" \"&VLOOKUP(B1,'Détail propriétaire'!$1:$1048576,4,FALSE)&\" \"&VLOOKUP(B1,'Détail propriétaire'!$1:$1048576,5,FALSE)&\" \"&VLOOKUP(B1,'Détail propriétaire'!$1:$1048576,6,FALSE)&\" \"&VLOOKUP(B1,'Détail propriétaire'!$1:$1048576,7,FALSE)","v":"Madame A Valerie   née M"}]
[{"$f":"VLOOKUP(B1,'Détail propriétaire'!$1:$1048576,8,FALSE)","v":"demeurant Chemin Des Mimosas  04210 VILLE"},null,"TOTAL",null,null,null,1,null,null,null,2,null,null,null,3,null,null,null,4,null,null,null,5,null,null,null,6,null,null,null,7,null,null,null,8,null,null,null,9,null,null,null,10]
[null,null,"Parcelles","Surface cadastrale","Emprise servitude","Reliquat","Parcelle","Surface cadastrale","Emprise servitude","Reliquat","Parcelle","Surface cadastrale","Emprise servitude","Reliquat","Parcelle","Surface cadastrale","Emprise servitude","Reliquat","Parcelle","Surface cadastrale","Emprise servitude","Reliquat","Parcelle","Surface cadastrale","Emprise servitude","Reliquat","Parcelle","Surface cadastrale","Emprise servitude","Reliquat","Parcelle","Surface cadastrale","Emprise servitude","Reliquat","Parcelle","Surface cadastrale","Emprise servitude","Reliquat","Parcelle","Surface cadastrale","Emprise servitude","Reliquat","Parcelle","Surface cadastrale","Emprise servitude","Reliquat"]
[null,null,{"$f":"G5&\" \"&K5&\" \"&O5&\" \"&S5&\" \"&W5&\" \"&AA5&\" \"&AE5&\" \"&AI5&\" \"&AM5&\" \"&AQ5","v":"AP10         "},{"$f":"SUMIF($G4:$AT4,D4,$G5:$AT5)","v":388},{"$f":"SUMIF($G4:$AT4,E4,$G5:$AT5)","v":69},319,{"$f":"INDEX('Etat complet'!D:D,MATCH($B1&\"-\"&$G3,'Etat complet'!$H:$H,0))","v":"AP10"},{"$f":"INDEX('Etat complet'!E:E,MATCH($B1&\"-\"&$G3,'Etat complet'!$H:$H,0))","v":388},{"$f":"INDEX('Etat complet'!F:F,MATCH($B1&\"-\"&$G3,'Etat complet'!$H:$H,0))","v":69},{"$f":"INDEX('Etat complet'!G:G,MATCH($B1&\"-\"&$G3,'Etat complet'!$H:$H,0))","v":319},{"$f":"IFERROR(INDEX('Etat complet'!D:D,MATCH($B1&\"-\"&$K3,'Etat complet'!$H:$H,0)),\"\")","v":""},{"$f":"IFERROR(INDEX('Etat complet'!E:E,MATCH($B1&\"-\"&$K3,'Etat complet'!$H:$H,0)),\"\")","v":""},{"$f":"IFERROR(INDEX('Etat complet'!F:F,MATCH($B1&\"-\"&$K3,'Etat complet'!$H:$H,0)),\"\")","v":""},{"$f":"IFERROR(INDEX('Etat complet'!G:G,MATCH($B1&\"-\"&$K3,'Etat complet'!$H:$H,0)),\"\")","v":""},{"$f":"IFERROR(INDEX('Etat complet'!D:D,MATCH($B1&\"-\"&$O3,'Etat complet'!$H:$H,0)),\"\")","v":""},{"$f":"IFERROR(INDEX('Etat complet'!E:E,MATCH($B1&\"-\"&$O3,'Etat complet'!$H:$H,0)),\"\")","v":""},{"$f":"IFERROR(INDEX('Etat complet'!F:F,MATCH($B1&\"-\"&$O3,'Etat complet'!$H:$H,0)),\"\")","v":""},{"$f":"IFERROR(INDEX('Etat complet'!G:G,MATCH($B1&\"-\"&$O3,'Etat complet'!$H:$H,0)),\"\")","v":""},{"$f":"IFERROR(INDEX('Etat complet'!D:D,MATCH($B1&\"-\"&$S3,'Etat complet'!$H:$H,0)),\"\")","v":""},{"$f":"IFERROR(INDEX('Etat complet'!E:E,MATCH($B1&\"-\"&$S3,'Etat complet'!$H:$H,0)),\"\")","v":""},{"$f":"IFERROR(INDEX('Etat complet'!F:F,MATCH($B1&\"-\"&$S3,'Etat complet'!$H:$H,0)),\"\")","v":""},{"$f":"IFERROR(INDEX('Etat complet'!G:G,MATCH($B1&\"-\"&$S3,'Etat complet'!$H:$H,0)),\"\")","v":""},{"$f":"IFERROR(INDEX('Etat complet'!D:D,MATCH($B1&\"-\"&$W3,'Etat complet'!$H:$H,0)),\"\")","v":""},{"$f":"IFERROR(INDEX('Etat complet'!E:E,MATCH($B1&\"-\"&$W3,'Etat complet'!$H:$H,0)),\"\")","v":""},{"$f":"IFERROR(INDEX('Etat complet'!F:F,MATCH($B1&\"-\"&$W3,'Etat complet'!$H:$H,0)),\"\")","v":""},{"$f":"IFERROR(INDEX('Etat complet'!G:G,MATCH($B1&\"-\"&$W3,'Etat complet'!$H:$H,0)),\"\")","v":""},{"$f":"IFERROR(INDEX('Etat complet'!D:D,MATCH($B1&\"-\"&$AA3,'Etat complet'!$H:$H,0)),\"\")","v":""},{"$f":"IFERROR(INDEX('Etat complet'!E:E,MATCH($B1&\"-\"&$AA3,'Etat complet'!$H:$H,0)),\"\")","v":""},{"$f":"IFERROR(INDEX('Etat complet'!F:F,MATCH($B1&\"-\"&$AA3,'Etat complet'!$H:$H,0)),\"\")","v":""},{"$f":"IFERROR(INDEX('Etat complet'!G:G,MATCH($B1&\"-\"&$AA3,'Etat complet'!$H:$H,0)),\"\")","v":""},{"$f":"IFERROR(INDEX('Etat complet'!D:D,MATCH($B1&\"-\"&$AE3,'Etat complet'!$H:$H,0)),\"\")","v":""},{"$f":"IFERROR(INDEX('Etat complet'!E:E,MATCH($B1&\"-\"&$AE3,'Etat complet'!$H:$H,0)),\"\")","v":""},{"$f":"IFERROR(INDEX('Etat complet'!F:F,MATCH($B1&\"-\"&$AE3,'Etat complet'!$H:$H,0)),\"\")","v":""},{"$f":"IFERROR(INDEX('Etat complet'!G:G,MATCH($B1&\"-\"&$AE3,'Etat complet'!$H:$H,0)),\"\")","v":""},{"$f":"IFERROR(INDEX('Etat complet'!D:D,MATCH($B1&\"-\"&$AI3,'Etat complet'!$H:$H,0)),\"\")","v":""},{"$f":"IFERROR(INDEX('Etat complet'!E:E,MATCH($B1&\"-\"&$AI3,'Etat complet'!$H:$H,0)),\"\")","v":""},{"$f":"IFERROR(INDEX('Etat complet'!F:F,MATCH($B1&\"-\"&$AI3,'Etat complet'!$H:$H,0)),\"\")","v":""},{"$f":"IFERROR(INDEX('Etat complet'!G:G,MATCH($B1&\"-\"&$AI3,'Etat complet'!$H:$H,0)),\"\")","v":""},{"$f":"IFERROR(INDEX('Etat complet'!D:D,MATCH($B1&\"-\"&$AM3,'Etat complet'!$H:$H,0)),\"\")","v":""},{"$f":"IFERROR(INDEX('Etat complet'!E:E,MATCH($B1&\"-\"&$AM3,'Etat complet'!$H:$H,0)),\"\")","v":""},{"$f":"IFERROR(INDEX('Etat complet'!F:F,MATCH($B1&\"-\"&$AM3,'Etat complet'!$H:$H,0)),\"\")","v":""},{"$f":"IFERROR(INDEX('Etat complet'!G:G,MATCH($B1&\"-\"&$AM3,'Etat complet'!$H:$H,0)),\"\")","v":""},{"$f":"IFERROR(INDEX('Etat complet'!D:D,MATCH($B1&\"-\"&$AQ3,'Etat complet'!$H:$H,0)),\"\")","v":""},{"$f":"IFERROR(INDEX('Etat complet'!E:E,MATCH($B1&\"-\"&$AQ3,'Etat complet'!$H:$H,0)),\"\")","v":""},{"$f":"IFERROR(INDEX('Etat complet'!F:F,MATCH($B1&\"-\"&$AQ3,'Etat complet'!$H:$H,0)),\"\")","v":""},{"$f":"IFERROR(INDEX('Etat complet'!G:G,MATCH($B1&\"-\"&$AQ3,'Etat complet'!$H:$H,0)),\"\")","v":""}]
["Propriétaire numéro",2]
[{"$f":"VLOOKUP(B6,'Détail propriétaire'!$1:$1048576,2,FALSE)&\" \"&VLOOKUP(B6,'Détail propriétaire'!$1:$1048576,3,FALSE)&\" \"&VLOOKUP(B6,'Détail propriétaire'!$1:$1048576,4,FALSE)&\" \"&VLOOKUP(B6,'Détail propriétaire'!$1:$1048576,5,FALSE)&\" \"&VLOOKUP(B6,'Détail propriétaire'!$1:$1048576,6,FALSE)&\" \"&VLOOKUP(B6,'Détail propriétaire'!$1:$1048576,7,FALSE)","v":"Monsieur B Pascal   "}]
[{"$f":"VLOOKUP(B6,'Détail propriétaire'!$1:$1048576,8,FALSE)","v":"demeurant Rue Des Pâquerettes  04210 VILLE"},null,"TOTAL",null,null,null,1,null,null,null,2,null,null,null,3,null,null,null,4,null,null,null,5,null,null,null,6,null,null,null,7,null,null,null,8,null,null,null,9,null,null,null,10]
{"$rows_left_out":53}
{"sheet":"Export Geomas","index":7,"n_rows":220,"n_cols":14,"rows_kept":220,"cut":false,"hidden":false,"merged":[]}
["id","idu","insee_com","code_com","section","num_parc","coar","indp","indp_code","supf","tex","Concat","Emprise","Restant"]
["9699","161000AI0420","05161","161","AI","0420",null,"Parcelle figurée au plan","01",7180,"420",{"$f":"CONCATENATE(E2,K2)","v":"AI420"},240,{"$f":"J2-M2","v":6940}]
["9134","161000AI0453","05161","161","AI","0453",null,"Parcelle figurée au plan","01",480,"453","AI453",18,{"$f":"J3-M3","v":462}]
["9978","161000AK0113","05161","161","AK","0113",null,"Parcelle figurée au plan","01",743,"113","AK113",78,665]
["9994","161000AK0121","05161","161","AK","0121",null,"Parcelle figurée au plan","01",562,"121","AK121",78,484]
["9992","161000AK0124","05161","161","AK","0124",null,"Parcelle figurée au plan","01",542,"124","AK124",111,431]
["9965","161000AK0127","05161","161","AK","0127",null,"Parcelle figurée au plan","01",2300,"127","AK127",123,2177]
["9969","161000AK0128","05161","161","AK","0128",null,"Parcelle figurée au plan","01",713,"128","AK128",119,594]
{"$rows_left_out":212}