{"text_format":"1","workbook":"xlsx","n_sheets":5,"sheets":["Liste choix référentiels","Accueil","SRP","Modifier référentiels produits","Liste produits"],"not_rendered":{"charts":0,"images":3,"macros":1,"external_links":0,"defined_names":19,"comments":0,"pivot_tables":0},"unopened":[],"bounds":{"document_bytes":16777216,"sheet_cells":100000,"rows_first":2000,"rows_last":500,"rows_between":2000,"halvings":0,"cell_chars":16384,"cell_head_chars":4096},"cells_cut":0,"cells_raw":0,"read":"whole","date_system":"1900"}

{"sheet":"Liste choix référentiels","index":0,"n_rows":121,"n_cols":18,"rows_kept":121,"cut":false,"hidden":false,"merged":[]}
["Liste codes catégorie produit","Liste noms catégorie produit","Liste codes produits","Liste noms prouits","Liste codes observations","Liste noms observations","Liste codes période concernée","Liste noms période concernée","Liste codes période viandes weekend","Liste noms période viandes weekend","Liste codes jours produit","Liste noms jours produit","Liste codes conditionnement produit","Liste noms conditionnement produit","Liste codes destiantion produit","Liste noms destiantion produit","Liste codes à modifier produit","Liste noms à modifier produit"]
["CC01","DMR","DMR01","Pomme","O01","Armistice du 11 novembre 1918","PC01","Janvier","PVWE01","Viande weekend premier semestre","CJ01","Dimanche midi","CC01","1 bocal ou 1 boîte pour 1 repas","CD01","Menus journaliers","LCÀM01","Non"]
["CC02","DS","DS01","Pomme","O02","Ascension","PC02","Février","PVWE02","Viande weekend deuxième semestre","CJ02","Dimanche midi et soir","CC02","1 boîte de six œufs. 3 œufs pour 1 repas","CD02","Menus midi retraite","LCÀM02","Oui"]
["CC03","DWE","DWE01","Ananas","O03","Assomption","PC03","Mars",null,null,"CJ03","Dimanche soir","CC03","1 boîte ou 1 pot pour 1 repas","CD03","Menus viandes weekend"]
["CC04","LMR","DWE02","Autres fruits","O04","Fête du travail","PC04","Avril",null,null,"CJ04","Lundi à dimanche soirs","CC04","1 boîte pour 1 repas"]
["CC05","LSLM","DWE03","Avocats","O05","Fête nationale","PC05","Mai",null,null,"CJ05","Lundi à vendredi midis","CC05","1 boîte pour 2 repas"]
["CC06","LSMJ","DWE04","Bananes","O06","Jour de l'an","PC06","Juin",null,null,"CJ06","lundi à vendredi soirs","CC06","1 botte ou 1 sachet pour 1 repas"]
["CC07","LSV","DWE05","Clémentines","O07","Lundi de Pâques","PC07","Juillet",null,null,"CJ07","Lundi et mardi soirs","CC07","1 botte ou 1 sachet pour 2 repas"]
["CC08","LWED","DWE06","Crème","O08","Lundi de Pentecôte","PC08","Août",null,null,"CJ08","Mercredi et jeudi soirs","CC08","1 morceau de 400 grammes (Leclerc) pour 3 repas"]
["CC09","LWES","DWE07","Dattes","O09","Noël","PC09","Septembre",null,null,"CJ09","Samedi et dimanche midis","CC09","1 morceau de 500 grammes pour 5 repas"]
["CC10","VMR","DWE08","Figues","O10","Pâques","PC10","Octobre",null,null,"CJ10","Samedi et dimanche midis et soirs","CC10","1 pack de 4 pots pour le week-end. 1 pot pour 1 repas"]
["CC11","VS","DWE09","Fromage blanc","O11","Pentecôte","PC11","Novembre",null,null,"CJ11","Samedi midi et soir","CC11","1 pack de 6 pots. 3 pots pour 1 repas"]
["CC12","VWE","DWE10","Fruits au sirop","O12","Toussaint","PC12","Décembre",null,null,"CJ12","Vendredi soir","CC12","1 paquet pour 1 repas"]
[null,null,"DWE11","Fruits de saison","O13","Victoire du 08 mai 1945",null,null,null,null,null,null,"CC13","1 paquet pour 2 repas"]
[null,null,"DWE12","Gâteau de riz",null,null,null,null,null,null,null,null,"CC14","1 paquet pour 2 repas. 1 ou 2 saucisses pour 1 repas"]
[null,null,"DWE13","Gâteau de semoule",null,null,null,null,null,null,null,null,"CC15","1 paquet pour 4 repas"]
[null,null,"DWE14","Gâteaux samedi dimanche",null,null,null,null,null,null,null,null,"CC16","1 sachet de 2 kilogrammes. 1 pomme pour 1 repas"]
[null,null,"DWE15","Mousse au chocolat",null,null,null,null,null,null,null,null,"CC17","1 sachet pour 2 repas"]
[null,null,"DWE16","Oranges",null,null,null,null,null,null,null,null,"CC18","1 sachet pour 4 repas"]
[null,null,"DWE17","Petits suisses",null,null,null,null,null,null,null,null,"CC19","1 tranche pour 1 repas"]
[null,null,"DWE18","Pruneaux",null,null,null,null,null,null,null,null,"CC20","1 tranche pour 2 repas"]
[null,null,"DWE19","Riz au lait",null,null,null,null,null,null,null,null,"CC21","125 grammes pour 1 repas"]
[null,null,"DWE20","Tapioca",null,null,null,null,null,null,null,null,"CC22","20 frites pour 1 repas"]
[null,null,"DWE21","Yaourts",null,null,null,null,null,null,null,null,"CC23","25 grammes pour 1 repas"]
[null,null,"DWE22","Tapioca",null,null,null,null,null,null,null,null,"CC24","3 tranches pour 1 repas"]
[null,null,"DWE23","Yaourts",null,null,null,null,null,null,null,null,"CC25","5 cuillères pour 1 repas"]
[null,null,"LMR01","Asperges",null,null,null,null,null,null,null,null,"CC26","Unité : 1 branche pour 1 repas"]
[null,null,"LMR02","Avocat",null,null,null,null,null,null,null,null,"CC27","Unité : 1 morceau pour 2 repas"]
[null,null,"LMR03","Carottes",null,null,null,null,null,null,null,null,"CC28","Unité : 1 pour 1 repas"]
[null,null,"LMR04","Céleri",null,null,null,null,null,null,null,null,"CC29","Unité : 1 pour 2 repas"]
[null,null,"LMR05","Champignons",null,null,null,null,null,null,null,null,"CC30","Unité : 1 pour 4 repas"]
[null,null,"LMR06","Concombre",null,null,null,null,null,null,null,null,"CC31","Unité : 1 tête pour 1 repas"]
[null,null,"LMR07","Couscous",null,null,null,null,null,null,null,null,"CC32","Unité : 2 à 4 pour 1 repas"]
[null,null,"LMR08","Maïs",null,null,null,null,null,null,null,null,"CC33","Unité : 2 pour 1 repas"]
[null,null,"LMR09","Pâtes à la sauce tomates"]
[null,null,"LMR10","Pâtes au beurre"]
[null,null,"LMR11","Poireau"]
[null,null,"LMR12","Pomme de terre"]
[null,null,"LMR13","Purée"]
[null,null,"LMR14","Radis"]
[null,null,"LMR15","Riz"]
[null,null,"LMR16","Salade"]
[null,null,"LMR17","Tomates"]
[null,null,"LSLM01","Cassoulet"]
[null,null,"LSLM02","Choucroute"]
[null,null,"LSLM03","Chou-fleur"]
[null,null,"LSLM04","Choux de Bruxelles"]
[null,null,"LSLM05","Couscous"]
[null,null,"LSLM06","Endives"]
[null,null,"LSLM07","Haricots verts"]
[null,null,"LSLM08","Maïs"]
[null,null,"LSLM09","Paella"]
[null,null,"LSLM10","Poireau"]
[null,null,"LSLM11","Pomme de terre"]
[null,null,"LSLM12","Purée"]
[null,null,"LSLM13","Quenelles"]
[null,null,"LSLM14","Riz"]
[null,null,"LSMJ01","Macédoine de légumes"]
[null,null,"LSMJ02","Petits pois"]
[null,null,"LSMJ03","Petits pois et jeunes carottes"]
[null,null,"LSMJ04","Ratatouille"]
[null,null,"LSMJ05","Raviolis"]
[null,null,"LSMJ06","Tomates pelées"]
[null,null,"LSV01","Asperges"]
[null,null,"LSV02","Avocat"]
[null,null,"LSV03","Betterave rouge"]
[null,null,"LSV04","Carottes"]
[null,null,"LSV05","Céleri"]
[null,null,"LSV06","Champignons"]
[null,null,"LSV07","Concombre"]
[null,null,"LSV08","Radis"]
[null,null,"LSV09","Salade"]
[null,null,"LSV10","Salsifis"]
[null,null,"LSV11","Tomates "]
[null,null,"LWED01","Asperges"]
[null,null,"LWED02","Chips"]
[null,null,"LWED03","Frites"]
[null,null,"LWED04","Haricots verts"]
[null,null,"LWES01","Pâtes à la sauce tomates"]
[null,null,"LWES02","Pâtes au beurre"]
[null,null,"LWES03","Pâtes au fromage râpé"]
[null,null,"VMR01","Rôti d'agneau"]
[null,null,"VMR02","Rôti de bœuf"]
[null,null,"VMR03","Rôti de cheval"]
[null,null,"VMR04","Rôti de porc"]
[null,null,"VMR05","Rôti de veau"]
[null,null,"VS01","Bifteck haché de bœuf"]
[null,null,"VS02","Bifteck haché de cheval"]
[null,null,"VS03","Bifteck haché de veau"]
[null,null,"VS04","Bouchée à la reine"]
[null,null,"VS05","Boudin"]
[null,null,"VS06","Cervelas"]
[null,null,"VS07","Cœur"]
[null,null,"VS08","Croque-monsieur"]
[null,null,"VS09","Foie"]
[null,null,"VS10","Fromage de tête"]
[null,null,"VS11","Jambon"]
[null,null,"VS12","Jambonneau"]
[null,null,"VS13","Mortadelle"]
[null,null,"VS14","Œufs"]
[null,null,"VS15","Pizza"]
[null,null,"VS16","Poisson"]
[null,null,"VS17","Quiche lorraine"]
[null,null,"VS18","Roulade à la pistache"]
[null,null,"VS19","Roulé au fromage"]
[null,null,"VS20","Salami"]
[null,null,"VS21","Saucisses"]
[null,null,"VS22","Saucisson"]
[null,null,"VS23","Tête persillée"]
[null,null,"VS24","Tête roulée"]
[null,null,"VS25","Thon"]
[null,null,"VS26","Viande cassoulet"]
[null,null,"VS27","Viande choucroute"]
[null,null,"VS28","Viande paella"]
[null,null,"VWE01","Agneau"]
[null,null,"VWE02","Bœuf"]
[null,null,"VWE03","Cheval"]
[null,null,"VWE04","Dinde"]
[null,null,"VWE05","Poisson"]
[null,null,"VWE06","Porc"]
[null,null,"VWE07","Veau"]

{"sheet":"Accueil","index":1,"n_rows":0,"n_cols":0,"rows_kept":0,"cut":false,"hidden":false,"merged":[]}

{"sheet":"SRP","index":2,"n_rows":16,"n_cols":2,"rows_kept":16,"cut":false,"hidden":false,"merged":[]}
["Création d'un produit"]
[]
["Numéro création produits",6]
["Liste codes catégorie produits","CC03"]
["Liste noms catégorie produits",{"$f":"IFERROR(INDEX(Liste_nom_catégorie_produit,MATCH($B$4,Liste_codes_catégorie_produit,0)),\"-\")","v":"DWE"}]
["Liste codes produits","DWE04"]
["Liste noms produits",{"$f":"IFERROR(INDEX(Liste_noms_produits,MATCH($B$6,Liste_codes_produits,0)),\"-\")","v":"Bananes"}]
["Liste codes jours produits","CJ10"]
["Liste noms jours produits",{"$f":"IFERROR(INDEX(Liste_noms_jours_produit,MATCH($B$8,Liste_codes_jours_produit,0)),\"-\")","v":"Samedi et dimanche midis et soirs"}]
["Liste codes conditionnement produits","CC32"]
["Liste noms conditionnement produits",{"$f":"IFERROR(INDEX(Liste_noms_conditionnement,MATCH($B$10,Liste_codes_conditionnement_produit,0)),\"-\")","v":"Unité : 2 à 4 pour 1 repas"}]
["Liste codes destination produits","CD01"]
["Liste noms destination produits",{"$f":"IFERROR(INDEX(Liste_noms_destination_produit,MATCH($B$12,Liste_codes_destination_produit,0)),\"-\")","v":"Menus journaliers"}]
["Date création produits","2019-04-11"]
["Liste codes à modifier produits","LCÀM01"]
["Liste noms à modifier produits","Non"]

{"sheet":"Modifier référentiels produits","index":3,"n_rows":16,"n_cols":1,"rows_kept":16,"cut":false,"hidden":false,"merged":[]}
[]
[]
["Numéro création produit"]
["Liste code catégorie produit"]
["Liste nom catégorie produit"]
["Liste code produit"]
["Liste nom produit"]
["Liste code jour produit"]
["Liste nom jour produit"]
["Liste code conditionnement produit"]
["Liste nom conditionnement produit"]
["Liste code destination produit"]
["Liste nom destination produit"]
["Date création produit"]
["Liste code à modifier produit"]
["Liste nom à modifier produit"]

{"sheet":"Liste produits","index":4,"n_rows":7,"n_cols":180,"rows_kept":7,"cut":false,"hidden":false,"merged":[]}
["Numéro création dessert midi retraite","Liste code catégorie dessert midi retraite","Liste nom catégorie dessert midi retraite","Liste code dessert midi retraite","Liste nom dessert midi retraite","Liste code jour dessert midi retraite","Liste nom jour dessert midi retraite","Liste code conditionnement dessert midi retraite","Liste nom conditionnement dessert midi retraite","Liste code destination dessert midi retraite","Liste nom destination dessert midi retraite","Date création dessert midi retraite","Liste code à modifier dessert midi retraite","Liste nom à modifier dessert midi retraite","Numéro création dessert soir","Liste code catégorie dessert soir","Liste nom catégorie dessert soir","Liste code dessert soir","Liste nom dessert soir","Liste code jour dessert soir","Liste nom jour dessert soir","Liste code conditionnement dessert soir","Liste nom conditionnement dessert soir","Liste code destination dessert soir","Liste nom destination dessert soir","Date création dessert soir","Liste code à modifier dessert soir","Liste nom à modifier dessert soir","Numéro création desserts weekend","Liste code catégorie desserts weekend","Liste nom catégorie desserts weekend","Liste code desserts weekend","Liste nom desserts weekend","Liste code jour desserts weekend","Liste nom jour desserts weekend","Liste code conditionnement desserts weekend","Liste nom conditionnement desserts weekend","Liste code destination desserts weekend","Liste nom destination desserts weekend","Date création desserts weekend","Liste code à modifier desserts weekend","Liste nom à modifier desserts weekend","Numéro création légumes midi retraite","Liste code catégorie légumes midi retraite","Liste nom catégorie légumes midi retraite","Liste code légumes midi retraite","Liste nom légumes midi retraite","Liste code jour légumes midi retraite","Liste nom jour légumes midi retraite","Liste code conditionnement légumes midi retraite","Liste nom conditionnement légumes midi retraite","Liste code destination légumes midi retraite","Liste nom destination légumes midi retraite","Date création légumes midi retraite","Liste code à modifier légumes midi retraite","Liste nom à modifier légumes midi retraite","Numéro création légumes soirs lundi mardi","Liste code catégorie légumes soirs lundi mardi","Liste nom catégorie légumes soirs lundi mardi","Liste code légumes soirs lundi mardi","Liste nom légumes soirs lundi mardi","Liste code jour légumes soirs lundi mardi","Liste nom jour légumes soirs lundi mardi","Liste code conditionnement légumes soirs lundi mardi","Liste nom conditionnement légumes soirs lundi mardi","Liste code destination légumes soirs lundi mardi","Liste nom destination légumes soirs lundi mardi","Date création légumes soirs lundi mardi","Liste code à modifier légumes soirs lundi mardi","Liste nom à modifier légumes soirs lundi mardi","Numéro création légumes soirs mercredi jeudi","Liste code catégorie légumes soirs mercredi jeudi","Liste nom catégorie légumes soirs mercredi jeudi","Liste code légumes soirs mercredi jeudi","Liste nom légumes soirs mercredi jeudi","Liste code jour légumes soirs mercredi jeudi","Liste nom jour légumes soirs mercredi jeudi","Liste code conditionnement légumes soirs mercredi jeudi","Liste nom conditionnement légumes soirs mercredi jeudi","Liste code destination légumes soirs mercredi jeudi","Liste nom destination légumes soirs mercredi jeudi","Date création légumes soirs mercredi jeudi","Liste code à modifier légumes soirs mercredi jeudi","Liste nom à modifier légumes soirs mercredi jeudi","Numéro création légumes soir vendredi","Liste code catégorie légumes soir vendredi","Liste nom catégorie légumes soir vendredi","Liste code légumes soir vendredi","Liste nom légumes soir vendredi","Liste code jour légumes soir vendredi","Liste nom jour légumes soir vendredi","Liste code conditionnement légumes soir vendredi","Liste nom conditionnement légumes soir vendredi","Liste code destination légumes soir vendredi","Liste nom destination légumes soir vendredi","Date création légumes soir vendredi","Liste code à modifier légumes soir vendredi","Liste nom à modifier légumes soir vendredi","Numéro création légumes weekend dimanche","Liste code catégorie légumes weekend dimanche","Liste nom catégorie légumes weekend dimanche","Liste code légumes weekend dimanche","Liste nom légumes weekend dimanche","Liste code jour légumes weekend dimanche","Liste nom jour légumes weekend dimanche","Liste code conditionnement légumes weekend dimanche","Liste nom conditionnement légumes weekend dimanche","Liste code destination légumes weekend dimanche","Liste nom destination légumes weekend dimanche","Date création légumes weekend dimanche","Liste code à modifier légumes weekend dimanche","Liste nom à modifier légumes weekend dimanche","Numéro création légumes weekend samedi","Liste code catégorie légumes weekend samedi","Liste nom catégorie légumes weekend samedi","Liste code légumes weekend samedi","Liste nom légumes weekend samedi","Liste code jour légumes weekend samedi","Liste nom jour légumes weekend samedi","Liste code conditionnement légumes weekend samedi","Liste nom conditionnement légumes weekend samedi","Liste code destination légumes weekend samedi","Liste nom destination légumes weekend samedi","Date création légumes weekend samedi","Liste code à modifier légumes weekend samedi","Liste nom à modifier légumes weekend samedi","Numéro création viandes midi retraite","Liste code catégorie viandes midi retraite","Liste nom catégorie viandes midi retraite","Liste code viandes midi retraite","Liste nom viandes midi retraite","Liste code jour viandes midi retraite","Liste nom jour viandes midi retraite","Liste code conditionnement viandes midi retraite","Liste nom conditionnement viandes midi retraite","Liste code destination viandes midi retraite","Liste nom destination viandes midi retraite","Date création viandes midi retraite","Liste code à modifier viandes midi retraite","Liste nom à modifier viandes midi retraite","Numéro création viandes soirs","Liste code catégorie viandes soirs","Liste nom catégorie viandes soirs","Liste code viandes soirs","Liste nom viandes soirs","Liste code jour viandes soirs","Liste nom jour viandes soirs","Liste code conditionnement viandes soirs","Liste nom conditionnement viandes soirs","Liste code destination viandes soirs","Liste nom destination viandes soirs","Date création viandes soirs","Liste code à modifier viandes soirs","Liste nom à modifier viandes soirs","Numéro création viandes weekend","Liste code catégorie viandes weekend","Liste nom catégorie viandes weekend","Liste code viandes weekend","Liste nom viandes weekend","Liste code jour viandes weekend","Liste nom jour viandes weekend","Liste code conditionnement viandes weekend","Liste nom conditionnement viandes weekend","Liste code destination viandes weekend","Liste nom destination viandes weekend","Date création viandes weekend","Liste code à modifier viandes weekend","Liste nom à modifier viandes weekend","Dessert midi retraite","Dessert soir","Desserts weekend","Légumes midi retraite","Légumes soirs lundi mardi","Légumes soirs mercredi jeudi","Légumes soir vendredi","Légumes weekend dimanche","Légumes weekend samedi","Viandes midi retraite","Viandes soirs","Viandes weekend"]
[1,"CC01","DMR","DMR01","Pomme","CJ05","Lundi à vendredi midis","CC16","1 sachet de 2 kilogrammes. 1 pomme pour 1 repas","CD02","Menus midi retraite","2019-04-11","LCÀM02","Oui",1,"CC02","DS","DS01","Pomme","CJ06","lundi à vendredi soirs","CC16","1 sachet de 2 kilogrammes. 1 pomme pour 1 repas","CD01","Menus journaliers","2019-04-11","LCÀM02","Oui",1,"CC03","DWE","DWE01","Ananas","CJ10","Samedi et dimanche midis et soirs","CC30","Unité : 1 pour 4 repas","CD01","Menus journaliers","2019-04-11","LCÀM01","Non",null,null,null,null,null,null,null,null,null,null,null,null,null,null,null,null,null,null,null,null,null,null,null,null,null,null,null,null,null,null,null,null,null,null,null,null,null,null,null,null,null,null,null,null,null,null,null,null,null,null,null,null,null,null,null,null,null,null,null,null,null,null,null,null,null,null,null,null,null,null,null,null,null,null,null,null,null,null,null,null,null,null,null,null,null,null,null,null,null,null,null,null,null,null,null,null,null,null,null,null,null,null,null,null,null,null,null,null,null,null,null,null,null,null,null,null,null,null,null,null,null,null,null,null,null,null,{"$f":"MAX(A:A)","v":1},{"$f":"MAX(O:O)","v":1},{"$f":"MAX(AC:AC)","v":6},{"$f":"MAX(AQ:AQ)","v":0},{"$f":"MAX(BE:BE)","v":0},{"$f":"MAX(BS:BS)","v":0},{"$f":"MAX(CG:CG)","v":0},{"$f":"MAX(CU:CU)","v":0},{"$f":"MAX(DI:DI)","v":0},{"$f":"MAX(DW:DW)","v":0},{"$f":"MAX(EK:EK)","v":0},{"$f":"MAX(EY:EY)","v":0}]
[null,null,null,null,null,null,null,null,null,null,null,null,null,null,null,null,null,null,null,null,null,null,null,null,null,null,null,null,3,"CC03","DWE","DWE02","Autres fruits","CJ10","Samedi et dimanche midis et soirs","CC32","Unité : 2 à 4 pour 1 repas","CD01","Menus journaliers","2019-04-11","LCÀM01","Non"]
[null,null,null,null,null,null,null,null,null,null,null,null,null,null,null,null,null,null,null,null,null,null,null,null,null,null,null,null,2,"CC03","DWE","DWE03","Avocats","CJ10","Samedi et dimanche midis et soirs","CC28","Unité : 1 pour 1 repas","CD01","Menus journaliers","2019-04-11","LCÀM01","Non"]
[null,null,null,null,null,null,null,null,null,null,null,null,null,null,null,null,null,null,null,null,null,null,null,null,null,null,null,null,6,"CC03","DWE","DWE04","Bananes","CJ10","Samedi et dimanche midis et soirs","CC32","Unité : 2 à 4 pour 1 repas","CD01","Menus journaliers","2019-04-11","LCÀM01","Non"]
[null,null,null,null,null,null,null,null,null,null,null,null,null,null,null,null,null,null,null,null,null,null,null,null,null,null,null,null,4,"CC03","DWE","DWE05","Clémentines","CJ10","Samedi et dimanche midis et soirs","CC32","Unité : 2 à 4 pour 1 repas","CD01","Menus journaliers","2019-04-11","LCÀM01","Non"]
[null,null,null,null,null,null,null,null,null,null,null,null,null,null,null,null,null,null,null,null,null,null,null,null,null,null,null,null,5,"CC03","DWE","DWE06","Crème","CJ10","Samedi et dimanche midis et soirs","CC32","Unité : 2 à 4 pour 1 repas","CD01","Menus journaliers","2019-04-11","LCÀM01","Non"]