{"text_format":"1","workbook":"xlsx","n_sheets":3,"sheets":["Planning de roulement","Rapport annuel","Variable entreprise"],"not_rendered":{"charts":0,"images":0,"macros":1,"external_links":0,"defined_names":4,"comments":0,"pivot_tables":0},"unopened":[],"bounds":{"document_bytes":16777216,"sheet_cells":100000,"rows_first":2000,"rows_last":500,"rows_between":2000,"halvings":0,"cell_chars":16384,"cell_head_chars":4096},"cells_cut":0,"cells_raw":0,"read":"whole","date_system":"1900"}

{"sheet":"Planning de roulement","index":0,"n_rows":80,"n_cols":59,"rows_kept":80,"cut":false,"hidden":false,"merged":[[0,56,0,62],[37,0,46,0],[48,0,57,0],[59,0,68,0],[70,0,79,0],[15,0,24,0],[26,0,35,0],[4,0,13,0],[2,56,2,58],[25,56,25,58],[0,1,1,3],[0,44,0,54],[1,44,1,54]]}
[null,"Planning de transport",null,null,null,null,null,null,null,null,null,null,null,null,null,null,null,null,null,null,null,null,null,null,null,null,null,null,null,null,null,null,null,null,null,null,null,null,null,null,null,null,null,"Pour la semaine débutant le lundi : ","2019-04-15",null,null,null,null,null,null,null,null,null,null,null,"Rapport de planning"]
[null,null,null,null,null,null,null,null,null,null,null,null,null,null,null,null,null,null,null,null,null,null,null,null,null,null,null,null,null,null,null,null,null,null,null,null,null,null,null,null,null,null,null,"Nom du responsable : "]
[null,null,null,null,null,null,null,null,null,null,null,null,null,null,null,null,null,null,null,null,null,null,null,null,null,null,null,null,null,null,null,null,null,null,null,null,null,null,null,null,null,null,null,null,null,null,null,null,null,null,null,null,null,null,null,null,"Aucun transport d'effectuer cette semaine"]
[null,"Chauffeur","N° immatriculation","Heure de départ","Heure de d'arrivé","Marchandise","Durée","00:00:00","00:30:00","01:00:00","01:30:00","02:00:00","02:30:00","03:00:00","03:30:00","04:00:00","04:30:00","05:00:00","05:30:00","06:00:00","06:30:00","07:00:00","07:30:00","08:00:00","08:30:00","09:00:00","09:30:00","10:00:00","10:30:00","11:00:00","11:30:00","12:00:00","12:30:00","13:00:00","13:30:00","14:00:00","14:30:00","15:00:00","15:30:00","16:00:00","16:30:00","17:00:00","17:30:00","18:00:00","18:30:00","19:00:00","19:30:00","20:00:00","20:30:00","21:00:00","21:30:00","22:00:00","22:30:00","23:00:00","23:30:00",null,"Chauffeur","Nombre de transport","Nombre d'heure de transport"]
[{"$f":"\"Lundi le \"&TEXT(AS1,\"J mmmm\")","v":"Lundi le 15 avril"},null,null,null,null,null,{"$f":"IF(D5=\"\",\"\",E5-D5)","v":""},{"$f":"IF($G5=\"\",\"\",IF(AND(H$4>=$D5,H$4<=$E5),\" \",\"\"))","v":""},"","","","","","","","","",{"$f":"IF($G5=\"\",\"\",IF(AND(R$4>=$D5,R$4<=$E5),\" \",\"\"))","v":""},"","","","","","","","","",{"$f":"IF($G5=\"\",\"\",IF(AND(AB$4>=$D5,AB$4<=$E5),\" \",\"\"))","v":""},"","","","","","","","","",{"$f":"IF($G5=\"\",\"\",IF(AND(AL$4>=$D5,AL$4<=$E5),\" \",\"\"))","v":""},"","","","","","","","","",{"$f":"IF($G5=\"\",\"\",IF(AND(AV$4>=$D5,AV$4<=$E5),\" \",\"\"))","v":""},"","","","","","","",null,{"$f":"IF('Variable entreprise'!B3=\"\",\"\",'Variable entreprise'!B3)","v":"AROUDJ Samir"},{"$f":"IF(BE5=\"\",\"\",COUNTIFS($B$5:$B$80,BE5))","v":0},{"$f":"IF(BE5=\"\",\"\",SUMIF($B$5:$B$80,BE5,$G$5:$G$80))","v":0}]
[null,null,null,null,null,null,"","","","","","","","","","","","","","","","","","","","","","","","","","","","","","","","","","","","","","","","","","","","","","","","","",null,{"$f":"IF('Variable entreprise'!B4=\"\",\"\",'Variable entreprise'!B4)","v":"BLAIRON Jean-Marc"},{"$f":"IF(BE6=\"\",\"\",COUNTIFS($B$5:$B$80,BE6))","v":0},0]
[null,null,null,null,null,null,"","","","","","","","","","","","","","","","","","","","","","","","","","","","","","","","","","","","","","","","","","","","","","","","","",null,{"$f":"IF('Variable entreprise'!B5=\"\",\"\",'Variable entreprise'!B5)","v":"BUTTIGIEG Marcel"},0,0]
[null,null,null,null,null,null,"","","","","","","","","","","","","","","","","","","","","","","","","","","","","","","","","","","","","","","","","","","","","","","","","",null,{"$f":"IF('Variable entreprise'!B6=\"\",\"\",'Variable entreprise'!B6)","v":"DINARDO Bruno"},0,0]
[null,null,null,null,null,null,"","","","","","","","","","","","","","","","","","","","","","","","","","","","","","","","","","","","","","","","","","","","","","","","","",null,{"$f":"IF('Variable entreprise'!B7=\"\",\"\",'Variable entreprise'!B7)","v":"DUCLOVEL Alexandre"},0,0]
[null,null,null,null,null,null,"","","","","","","","","","","","","","","","","","","","","","","","","","","","","","","","","","","","","","","","","","","","","","","","","",null,{"$f":"IF('Variable entreprise'!B8=\"\",\"\",'Variable entreprise'!B8)","v":"FILIPPI Gabriel"},0,0]
[null,null,null,null,null,null,"","","","","","","","","","","","","","","","","","","","","","","","","","","","","","","","","","","","","","","","","","","","","","","","","",null,{"$f":"IF('Variable entreprise'!B9=\"\",\"\",'Variable entreprise'!B9)","v":"HERNANDEZ Michel"},0,0]
[null,null,null,null,null,null,"","","","","","","","","","","","","","","","","","","","","","","","","","","","","","","","","","","","","","","","","","","","","","","","","",null,{"$f":"IF('Variable entreprise'!B10=\"\",\"\",'Variable entreprise'!B10)","v":"PROTO Anthony"},{"$f":"IF(BE12=\"\",\"\",COUNTIFS($B$5:$B$80,BE12))","v":0},0]
[null,null,null,null,null,null,"","","","","","","","","","","","","","","","","","","","","","","","","","","","","","","","","","","","","","","","","","","","","","","","","",null,{"$f":"IF('Variable entreprise'!B11=\"\",\"\",'Variable entreprise'!B11)","v":"PROTO Charles"},0,0]
[null,null,null,null,null,null,"","","","","","","","","","","","","","","","","","","","","","","","","","","","","","","","","","","","","","","","","","","","","","","","","",null,{"$f":"IF('Variable entreprise'!B12=\"\",\"\",'Variable entreprise'!B12)","v":"TOUAZI Cathy"},0,0]
[null,null,null,null,null,null,null,null,null,null,null,null,null,null,null,null,null,null,null,null,null,null,null,null,null,null,null,null,null,null,null,null,null,null,null,null,null,null,null,null,null,null,null,null,null,null,null,null,null,null,null,null,null,null,null,null,{"$f":"IF('Variable entreprise'!B13=\"\",\"\",'Variable entreprise'!B13)","v":""},"",""]
[{"$f":"\"Mardi le \"&(TEXT(AS1+1,\"J mmmm\"))","v":"Mardi le 16 avril"},null,null,null,null,null,{"$f":"IF(D16=\"\",\"\",E16-D16)","v":""},{"$f":"IF($G16=\"\",\"\",IF(AND(H$4>=$D16,H$4<=$E16),\" \",\"\"))","v":""},"","","","","","","","","",{"$f":"IF($G16=\"\",\"\",IF(AND(R$4>=$D16,R$4<=$E16),\" \",\"\"))","v":""},"","","","","","","","","",{"$f":"IF($G16=\"\",\"\",IF(AND(AB$4>=$D16,AB$4<=$E16),\" \",\"\"))","v":""},"","","","","","","","","",{"$f":"IF($G16=\"\",\"\",IF(AND(AL$4>=$D16,AL$4<=$E16),\" \",\"\"))","v":""},"","","","","","","","","",{"$f":"IF($G16=\"\",\"\",IF(AND(AV$4>=$D16,AV$4<=$E16),\" \",\"\"))","v":""},"","","","","","","",null,{"$f":"IF('Variable entreprise'!B14=\"\",\"\",'Variable entreprise'!B14)","v":""},"",""]
[null,null,null,null,null,null,"","","","","","","","","","","","","","","","","","","","","","","","","","","","","","","","","","","","","","","","","","","","","","","","","",null,{"$f":"IF('Variable entreprise'!B15=\"\",\"\",'Variable entreprise'!B15)","v":""},"",""]
[null,null,null,null,null,null,"","","","","","","","","","","","","","","","","","","","","","","","","","","","","","","","","","","","","","","","","","","","","","","","","",null,{"$f":"IF('Variable entreprise'!B16=\"\",\"\",'Variable entreprise'!B16)","v":""},"",""]
[null,null,null,null,null,null,"","","","","","","","","","","","","","","","","","","","","","","","","","","","","","","","","","","","","","","","","","","","","","","","","",null,{"$f":"IF('Variable entreprise'!B17=\"\",\"\",'Variable entreprise'!B17)","v":""},"",""]
[null,null,null,null,null,null,"","","","","","","","","","","","","","","","","","","","","","","","","","","","","","","","","","","","","","","","","","","","","","","","","",null,{"$f":"IF('Variable entreprise'!B18=\"\",\"\",'Variable entreprise'!B18)","v":""},"",""]
[null,null,null,null,null,null,"","","","","","","","","","","","","","","","","","","","","","","","","","","","","","","","","","","","","","","","","","","","","","","","","",null,{"$f":"IF('Variable entreprise'!B19=\"\",\"\",'Variable entreprise'!B19)","v":""},"",""]
[null,null,null,null,null,null,"","","","","","","","","","","","","","","","","","","","","","","","","","","","","","","","","","","","","","","","","","","","","","","","","",null,{"$f":"IF('Variable entreprise'!B20=\"\",\"\",'Variable entreprise'!B20)","v":""},"",""]
[null,null,null,null,null,null,"","","","","","","","","","","","","","","","","","","","","","","","","","","","","","","","","","","","","","","","","","","","","","","","","",null,{"$f":"IF('Variable entreprise'!B21=\"\",\"\",'Variable entreprise'!B21)","v":""},"",""]
[null,null,null,null,null,null,"","","","","","","","","","","","","","","","","","","","","","","","","","","","","","","","","","","","","","","","","","","","","","","","","",null,{"$f":"IF('Variable entreprise'!B22=\"\",\"\",'Variable entreprise'!B22)","v":""},"",""]
[null,null,null,null,null,null,"","","","","","","","","","","","","","","","","","","","","","","","","","","","","","","","","","","","","","","","","","","","","","","","","",null,{"$f":"IF('Variable entreprise'!B23=\"\",\"\",'Variable entreprise'!B23)","v":""},"",""]
[null,null,null,null,null,null,null,null,null,null,null,null,null,null,null,null,null,null,null,null,null,null,null,null,null,null,null,null,null,null,null,null,null,null,null,null,null,null,null,null,null,null,null,null,null,null,null,null,null,null,null,null,null,null,null,null,"Mettre à jour la liste des chauffeur dans les variables"]
[{"$f":"\"Mercredi le \"&(TEXT(AS1+2,\"J mmmm\"))","v":"Mercredi le 17 avril"},null,null,null,null,null,{"$f":"IF(D27=\"\",\"\",E27-D27)","v":""},{"$f":"IF($G27=\"\",\"\",IF(AND(H$4>=$D27,H$4<=$E27),\" \",\"\"))","v":""},"","","","","","","","","",{"$f":"IF($G27=\"\",\"\",IF(AND(R$4>=$D27,R$4<=$E27),\" \",\"\"))","v":""},"","","","","","","","","",{"$f":"IF($G27=\"\",\"\",IF(AND(AB$4>=$D27,AB$4<=$E27),\" \",\"\"))","v":""},"","","","","","","","","",{"$f":"IF($G27=\"\",\"\",IF(AND(AL$4>=$D27,AL$4<=$E27),\" \",\"\"))","v":""},"","","","","","","","","",{"$f":"IF($G27=\"\",\"\",IF(AND(AV$4>=$D27,AV$4<=$E27),\" \",\"\"))","v":""},"","","","","","",""]
[null,null,null,null,null,null,"","","","","","","","","","","","","","","","","","","","","","","","","","","","","","","","","","","","","","","","","","","","","","","","",""]
[null,null,null,null,null,null,"","","","","","","","","","","","","","","","","","","","","","","","","","","","","","","","","","","","","","","","","","","","","","","","",""]
[null,null,null,null,null,null,"","","","","","","","","","","","","","","","","","","","","","","","","","","","","","","","","","","","","","","","","","","","","","","","",""]
[null,null,null,null,null,null,"","","","","","","","","","","","","","","","","","","","","","","","","","","","","","","","","","","","","","","","","","","","","","","","",""]
[null,null,null,null,null,null,"","","","","","","","","","","","","","","","","","","","","","","","","","","","","","","","","","","","","","","","","","","","","","","","",""]
[null,null,null,null,null,null,"","","","","","","","","","","","","","","","","","","","","","","","","","","","","","","","","","","","","","","","","","","","","","","","",""]
[null,null,null,null,null,null,"","","","","","","","","","","","","","","","","","","","","","","","","","","","","","","","","","","","","","","","","","","","","","","","",""]
[null,null,null,null,null,null,"","","","","","","","","","","","","","","","","","","","","","","","","","","","","","","","","","","","","","","","","","","","","","","","",""]
[null,null,null,null,null,null,"","","","","","","","","","","","","","","","","","","","","","","","","","","","","","","","","","","","","","","","","","","","","","","","",""]
[]
[{"$f":"\"Jeudi le \"&(TEXT(AS1+3,\"J mmmm\"))","v":"Jeudi le 18 avril"},null,null,null,null,null,{"$f":"IF(D38=\"\",\"\",E38-D38)","v":""},{"$f":"IF($G38=\"\",\"\",IF(AND(H$4>=$D38,H$4<=$E38),\" \",\"\"))","v":""},"","","","","","","","","",{"$f":"IF($G38=\"\",\"\",IF(AND(R$4>=$D38,R$4<=$E38),\" \",\"\"))","v":""},"","","","","","","","","",{"$f":"IF($G38=\"\",\"\",IF(AND(AB$4>=$D38,AB$4<=$E38),\" \",\"\"))","v":""},"","","","","","","","","",{"$f":"IF($G38=\"\",\"\",IF(AND(AL$4>=$D38,AL$4<=$E38),\" \",\"\"))","v":""},"","","","","","","","","",{"$f":"IF($G38=\"\",\"\",IF(AND(AV$4>=$D38,AV$4<=$E38),\" \",\"\"))","v":""},"","","","","","",""]
[null,null,null,null,null,null,"","","","","","","","","","","","","","","","","","","","","","","","","","","","","","","","","","","","","","","","","","","","","","","","",""]
[null,null,null,null,null,null,"","","","","","","","","","","","","","","","","","","","","","","","","","","","","","","","","","","","","","","","","","","","","","","","",""]
[null,null,null,null,null,null,"","","","","","","","","","","","","","","","","","","","","","","","","","","","","","","","","","","","","","","","","","","","","","","","",""]
[null,null,null,null,null,null,"","","","","","","","","","","","","","","","","","","","","","","","","","","","","","","","","","","","","","","","","","","","","","","","",""]
[null,null,null,null,null,null,"","","","","","","","","","","","","","","","","","","","","","","","","","","","","","","","","","","","","","","","","","","","","","","","",""]
[null,null,null,null,null,null,"","","","","","","","","","","","","","","","","","","","","","","","","","","","","","","","","","","","","","","","","","","","","","","","",""]
[null,null,null,null,null,null,"","","","","","","","","","","","","","","","","","","","","","","","","","","","","","","","","","","","","","","","","","","","","","","","",""]
[null,null,null,null,null,null,"","","","","","","","","","","","","","","","","","","","","","","","","","","","","","","","","","","","","","","","","","","","","","","","",""]
[null,null,null,null,null,null,"","","","","","","","","","","","","","","","","","","","","","","","","","","","","","","","","","","","","","","","","","","","","","","","",""]
[]
[{"$f":"\"Vendredi le \"&(TEXT(AS1+4,\"j mmmm\"))","v":"Vendredi le 19 avril"},null,null,null,null,null,{"$f":"IF(D49=\"\",\"\",E49-D49)","v":""},{"$f":"IF($G49=\"\",\"\",IF(AND(H$4>=$D49,H$4<=$E49),\" \",\"\"))","v":""},"","","","","","","","","",{"$f":"IF($G49=\"\",\"\",IF(AND(R$4>=$D49,R$4<=$E49),\" \",\"\"))","v":""},"","","","","","","","","",{"$f":"IF($G49=\"\",\"\",IF(AND(AB$4>=$D49,AB$4<=$E49),\" \",\"\"))","v":""},"","","","","","","","","",{"$f":"IF($G49=\"\",\"\",IF(AND(AL$4>=$D49,AL$4<=$E49),\" \",\"\"))","v":""},"","","","","","","","","",{"$f":"IF($G49=\"\",\"\",IF(AND(AV$4>=$D49,AV$4<=$E49),\" \",\"\"))","v":""},"","","","","","",""]
[null,null,null,null,null,null,"","","","","","","","","","","","","","","","","","","","","","","","","","","","","","","","","","","","","","","","","","","","","","","","",""]
[null,null,null,null,null,null,"","","","","","","","","","","","","","","","","","","","","","","","","","","","","","","","","","","","","","","","","","","","","","","","",""]
[null,null,null,null,null,null,"","","","","","","","","","","","","","","","","","","","","","","","","","","","","","","","","","","","","","","","","","","","","","","","",""]
[null,null,null,null,null,null,"","","","","","","","","","","","","","","","","","","","","","","","","","","","","","","","","","","","","","","","","","","","","","","","",""]
[null,null,null,null,null,null,"","","","","","","","","","","","","","","","","","","","","","","","","","","","","","","","","","","","","","","","","","","","","","","","",""]
[null,null,null,null,null,null,"","","","","","","","","","","","","","","","","","","","","","","","","","","","","","","","","","","","","","","","","","","","","","","","",""]
[null,null,null,null,null,null,"","","","","","","","","","","","","","","","","","","","","","","","","","","","","","","","","","","","","","","","","","","","","","","","",""]
[null,null,null,null,null,null,"","","","","","","","","","","","","","","","","","","","","","","","","","","","","","","","","","","","","","","","","","","","","","","","",""]
[null,null,null,null,null,null,"","","","","","","","","","","","","","","","","","","","","","","","","","","","","","","","","","","","","","","","","","","","","","","","",""]
[]
[{"$f":"\"Samedi le \"&(TEXT(AS1+5,\"J mmmm\"))","v":"Samedi le 20 avril"},null,null,null,null,null,{"$f":"IF(D60=\"\",\"\",E60-D60)","v":""},{"$f":"IF($G60=\"\",\"\",IF(AND(H$4>=$D60,H$4<=$E60),\" \",\"\"))","v":""},"","","","","","","","","",{"$f":"IF($G60=\"\",\"\",IF(AND(R$4>=$D60,R$4<=$E60),\" \",\"\"))","v":""},"","","","","","","","","",{"$f":"IF($G60=\"\",\"\",IF(AND(AB$4>=$D60,AB$4<=$E60),\" \",\"\"))","v":""},"","","","","","","","","",{"$f":"IF($G60=\"\",\"\",IF(AND(AL$4>=$D60,AL$4<=$E60),\" \",\"\"))","v":""},"","","","","","","","","",{"$f":"IF($G60=\"\",\"\",IF(AND(AV$4>=$D60,AV$4<=$E60),\" \",\"\"))","v":""},"","","","","","",""]
[null,null,null,null,null,null,"","","","","","","","","","","","","","","","","","","","","","","","","","","","","","","","","","","","","","","","","","","","","","","","",""]
[null,null,null,null,null,null,"","","","","","","","","","","","","","","","","","","","","","","","","","","","","","","","","","","","","","","","","","","","","","","","",""]
[null,null,null,null,null,null,"","","","","","","","","","","","","","","","","","","","","","","","","","","","","","","","","","","","","","","","","","","","","","","","",""]
[null,null,null,null,null,null,"","","","","","","","","","","","","","","","","","","","","","","","","","","","","","","","","","","","","","","","","","","","","","","","",""]
[null,null,null,null,null,null,"","","","","","","","","","","","","","","","","","","","","","","","","","","","","","","","","","","","","","","","","","","","","","","","",""]
[null,null,null,null,null,null,"","","","","","","","","","","","","","","","","","","","","","","","","","","","","","","","","","","","","","","","","","","","","","","","",""]
[null,null,null,null,null,null,"","","","","","","","","","","","","","","","","","","","","","","","","","","","","","","","","","","","","","","","","","","","","","","","",""]
[null,null,null,null,null,null,"","","","","","","","","","","","","","","","","","","","","","","","","","","","","","","","","","","","","","","","","","","","","","","","",""]
[null,null,null,null,null,null,"","","","","","","","","","","","","","","","","","","","","","","","","","","","","","","","","","","","","","","","","","","","","","","","",""]
[]
[{"$f":"\"Dimanche le \"&(TEXT(AS1+6,\"J mmmm\"))","v":"Dimanche le 21 avril"},null,null,null,null,null,{"$f":"IF(D71=\"\",\"\",E71-D71)","v":""},{"$f":"IF($G71=\"\",\"\",IF(AND(H$4>=$D71,H$4<=$E71),\" \",\"\"))","v":""},"","","","","","","","","",{"$f":"IF($G71=\"\",\"\",IF(AND(R$4>=$D71,R$4<=$E71),\" \",\"\"))","v":""},"","","","","","","","","",{"$f":"IF($G71=\"\",\"\",IF(AND(AB$4>=$D71,AB$4<=$E71),\" \",\"\"))","v":""},"","","","","","","","","",{"$f":"IF($G71=\"\",\"\",IF(AND(AL$4>=$D71,AL$4<=$E71),\" \",\"\"))","v":""},"","","","","","","","","",{"$f":"IF($G71=\"\",\"\",IF(AND(AV$4>=$D71,AV$4<=$E71),\" \",\"\"))","v":""},"","","","","","",""]
[null,null,null,null,null,null,"","","","","","","","","","","","","","","","","","","","","","","","","","","","","","","","","","","","","","","","","","","","","","","","",""]
[null,null,null,null,null,null,"","","","","","","","","","","","","","","","","","","","","","","","","","","","","","","","","","","","","","","","","","","","","","","","",""]
[null,null,null,null,null,null,"","","","","","","","","","","","","","","","","","","","","","","","","","","","","","","","","","","","","","","","","","","","","","","","",""]
[null,null,null,null,null,null,"","","","","","","","","","","","","","","","","","","","","","","","","","","","","","","","","","","","","","","","","","","","","","","","",""]
[null,null,null,null,null,null,"","","","","","","","","","","","","","","","","","","","","","","","","","","","","","","","","","","","","","","","","","","","","","","","",""]
[null,null,null,null,null,null,"","","","","","","","","","","","","","","","","","","","","","","","","","","","","","","","","","","","","","","","","","","","","","","","",""]
[null,null,null,null,null,null,"","","","","","","","","","","","","","","","","","","","","","","","","","","","","","","","","","","","","","","","","","","","","","","","",""]
[null,null,null,null,null,null,"","","","","","","","","","","","","","","","","","","","","","","","","","","","","","","","","","","","","","","","","","","","","","","","",""]
[null,null,null,null,null,null,"","","","","","","","","","","","","","","","","","","","","","","","","","","","","","","","","","","","","","","","","","","","","","","","",""]

{"sheet":"Rapport annuel","index":1,"n_rows":26,"n_cols":11,"rows_kept":26,"cut":false,"hidden":false,"merged":[[0,8,0,14],[2,8,2,10],[25,8,25,10]]}
[null,"Rapport de planning de transport annuel",null,null,null,null,null,null,"Rapport de planning"]
[]
[null,"Chauffeur","N° immatriculation","Heure de départ","Heure de d'arrivé","Marchandise","Durée",null,"Aucun transport d'effectuer cette année"]
[null,null,null,null,null,null,null,null,"Chauffeur","Nombre de transport","Nombre d'heure de transport"]
[null,null,null,null,null,null,null,null,{"$f":"IF('Variable entreprise'!B3=\"\",\"\",'Variable entreprise'!B3)","v":"AROUDJ Samir"},{"$f":"IF(I5=\"\",\"\",COUNTIFS($B$4:$B$5000,I5))","v":0},{"$f":"IF(I5=\"\",\"\",SUMIF($B$4:$B$5000,I5,$G$4:$G$5000))","v":0}]
[null,null,null,null,null,null,null,null,{"$f":"IF('Variable entreprise'!B4=\"\",\"\",'Variable entreprise'!B4)","v":"BLAIRON Jean-Marc"},{"$f":"IF(I6=\"\",\"\",COUNTIFS($B$4:$B$5000,I6))","v":0},{"$f":"IF(I6=\"\",\"\",SUMIF($B$4:$B$5000,I6,$G$4:$G$5000))","v":0}]
[null,null,null,null,null,null,null,null,{"$f":"IF('Variable entreprise'!B5=\"\",\"\",'Variable entreprise'!B5)","v":"BUTTIGIEG Marcel"},0,0]
[null,null,null,null,null,null,null,null,{"$f":"IF('Variable entreprise'!B6=\"\",\"\",'Variable entreprise'!B6)","v":"DINARDO Bruno"},0,0]
[null,null,null,null,null,null,null,null,{"$f":"IF('Variable entreprise'!B7=\"\",\"\",'Variable entreprise'!B7)","v":"DUCLOVEL Alexandre"},0,0]
[null,null,null,null,null,null,null,null,{"$f":"IF('Variable entreprise'!B8=\"\",\"\",'Variable entreprise'!B8)","v":"FILIPPI Gabriel"},0,0]
[null,null,null,null,null,null,null,null,{"$f":"IF('Variable entreprise'!B9=\"\",\"\",'Variable entreprise'!B9)","v":"HERNANDEZ Michel"},0,0]
[null,null,null,null,null,null,null,null,{"$f":"IF('Variable entreprise'!B10=\"\",\"\",'Variable entreprise'!B10)","v":"PROTO Anthony"},0,{"$f":"IF(I12=\"\",\"\",SUMIF($B$4:$B$5000,I12,$G$4:$G$5000))","v":0}]
[null,null,null,null,null,null,null,null,{"$f":"IF('Variable entreprise'!B11=\"\",\"\",'Variable entreprise'!B11)","v":"PROTO Charles"},0,0]
[null,null,null,null,null,null,null,null,{"$f":"IF('Variable entreprise'!B12=\"\",\"\",'Variable entreprise'!B12)","v":"TOUAZI Cathy"},0,0]
[null,null,null,null,null,null,null,null,{"$f":"IF('Variable entreprise'!B13=\"\",\"\",'Variable entreprise'!B13)","v":""},"",""]
[null,null,null,null,null,null,null,null,{"$f":"IF('Variable entreprise'!B14=\"\",\"\",'Variable entreprise'!B14)","v":""},"",""]
[null,null,null,null,null,null,null,null,{"$f":"IF('Variable entreprise'!B15=\"\",\"\",'Variable entreprise'!B15)","v":""},"",""]
[null,null,null,null,null,null,null,null,{"$f":"IF('Variable entreprise'!B16=\"\",\"\",'Variable entreprise'!B16)","v":""},"",""]
[null,null,null,null,null,null,null,null,{"$f":"IF('Variable entreprise'!B17=\"\",\"\",'Variable entreprise'!B17)","v":""},"",""]
[null,null,null,null,null,null,null,null,{"$f":"IF('Variable entreprise'!B18=\"\",\"\",'Variable entreprise'!B18)","v":""},"",""]
[null,null,null,null,null,null,null,null,{"$f":"IF('Variable entreprise'!B19=\"\",\"\",'Variable entreprise'!B19)","v":""},"",""]
[null,null,null,null,null,null,null,null,{"$f":"IF('Variable entreprise'!B20=\"\",\"\",'Variable entreprise'!B20)","v":""},"",""]
[null,null,null,null,null,null,null,null,{"$f":"IF('Variable entreprise'!B21=\"\",\"\",'Variable entreprise'!B21)","v":""},"",""]
[null,null,null,null,null,null,null,null,{"$f":"IF('Variable entreprise'!B22=\"\",\"\",'Variable entreprise'!B22)","v":""},"",""]
[null,null,null,null,null,null,null,null,{"$f":"IF('Variable entreprise'!B23=\"\",\"\",'Variable entreprise'!B23)","v":""},"",""]
[null,null,null,null,null,null,null,null,"Mettre à jour la liste des chauffeur dans les variables"]

{"sheet":"Variable entreprise","index":2,"n_rows":12,"n_cols":4,"rows_kept":12,"cut":false,"hidden":false,"merged":[]}
[]
[null,"Liste employé",null,"N° immatriculation"]
[null,"AROUDJ Samir",null,"VDL 57 places : ES 766 VD"]
[null,"BLAIRON Jean-Marc",null,"IRIZAR 53 places: EY 876 XF"]
[null,"BUTTIGIEG Marcel",null,"SCANIA 55 places: DH 966 LE"]
[null,"DINARDO Bruno",null,"BOVA 49 places: BA 281 XH"]
[null,"DUCLOVEL Alexandre",null,"BOVA 63 places: AP 098 EX"]
[null,"FILIPPI Gabriel",null,"MAGELYS 55 places: DE 410 MP"]
[null,"HERNANDEZ Michel"]
[null,"PROTO Anthony"]
[null,"PROTO Charles"]
[null,"TOUAZI Cathy"]