{"text_format":"1","workbook":"xlsx","n_sheets":6,"sheets":["1° sem 2019","2° sem 2019","spa","QUALIF","SPA S1","Feuil1"],"not_rendered":{"charts":2,"images":1,"macros":1,"external_links":1,"defined_names":36,"comments":3,"pivot_tables":0},"unopened":[],"bounds":{"document_bytes":16777216,"sheet_cells":100000,"rows_first":2000,"rows_last":500,"rows_between":2000,"halvings":0,"cell_chars":16384,"cell_head_chars":4096},"cells_cut":0,"cells_raw":0,"read":"whole","date_system":"1900"}

{"sheet":"1° sem 2019","index":0,"n_rows":67,"n_cols":184,"rows_kept":67,"cut":false,"hidden":false,"merged":[[0,0,1,2],[0,3,0,33],[0,34,0,61],[0,62,0,92],[0,93,0,122],[1,100,1,106],[1,107,1,113],[1,114,1,120],[1,121,1,127],[0,123,0,153],[1,135,1,141],[1,142,1,148],[1,149,1,155],[0,154,0,183],[1,3,1,8],[1,9,1,15],[1,16,1,22],[1,23,1,29],[1,30,1,36],[1,37,1,43],[1,44,1,50],[1,51,1,57],[1,58,1,64],[1,65,1,71],[1,72,1,78],[1,79,1,85],[1,86,1,92],[1,93,1,99],[1,128,1,134],[1,156,1,162],[1,163,1,169],[1,170,1,176],[1,177,1,183],[13,3,13,8],[13,9,13,15],[13,16,13,22],[13,23,13,29],[13,30,13,36],[13,37,13,43],[13,44,13,50],[13,51,13,57],[13,58,13,64],[13,65,13,71],[13,72,13,78],[13,79,13,85],[13,156,13,162],[13,163,13,169],[13,170,13,176],[13,177,13,183],[13,121,13,127],[13,128,13,134],[13,135,13,141],[13,142,13,148],[13,149,13,155],[13,0,13,2],[13,93,13,99],[13,100,13,106],[13,107,13,113],[13,114,13,120],[13,86,13,92]]}
[2019,null,null,"JANVIER",null,null,null,null,null,null,null,null,null,null,null,null,null,null,null,null,null,null,null,null,null,null,null,null,null,null,null,null,null,null,"FEVRIER",null,null,null,null,null,null,null,null,null,null,null,null,null,null,null,null,null,null,null,null,null,null,null,null,null,null,null,"MARS",null,null,null,null,null,null,null,null,null,null,null,null,null,null,null,null,null,null,null,null,null,null,null,null,null,null,null,null,null,null,"AVRIL",null,null,null,null,null,null,null,null,null,null,null,null,null,null,null,null,null,null,null,null,null,null,null,null,null,null,null,null,null,"MAI",null,null,null,null,null,null,null,null,null,null,null,null,null,null,null,null,null,null,null,null,null,null,null,null,null,null,null,null,null,null,"JUIN"]
[null,null,null,{"$f":"\"S\"&\" \"&TEXT(WEEKNUM(D4),\"jj\")","v":"S 01"},null,null,null,null,null,{"$f":"\"S\"&\" \"&TEXT(WEEKNUM(J4),\"jj\")","v":"S 02"},null,null,null,null,null,null,{"$f":"\"S\"&\" \"&TEXT(WEEKNUM(Q4),\"jj\")","v":"S 03"},null,null,null,null,null,null,{"$f":"\"S\"&\" \"&TEXT(WEEKNUM(X4),\"jj\")","v":"S 04"},null,null,null,null,null,null,{"$f":"\"S\"&\" \"&TEXT(WEEKNUM(AE4),\"jj\")","v":"S 05"},null,null,null,null,null,null,{"$f":"\"S\"&\" \"&TEXT(WEEKNUM(AL4),\"jj\")","v":"S 06"},null,null,null,null,null,null,{"$f":"\"S\"&\" \"&TEXT(WEEKNUM(AS4),\"jj\")","v":"S 07"},null,null,null,null,null,null,{"$f":"\"S\"&\" \"&TEXT(WEEKNUM(AZ4),\"jj\")","v":"S 08"},null,null,null,null,null,null,{"$f":"\"S\"&\" \"&TEXT(WEEKNUM(BG4),\"jj\")","v":"S 09"},null,null,null,null,null,null,{"$f":"\"S\"&\" \"&TEXT(WEEKNUM(BN4),\"jj\")","v":"S 10"},null,null,null,null,null,null,{"$f":"\"S\"&\" \"&TEXT(WEEKNUM(BU4),\"jj\")","v":"S 11"},null,null,null,null,null,null,{"$f":"\"S\"&\" \"&TEXT(WEEKNUM(CB4),\"jj\")","v":"S 12"},null,null,null,null,null,null,{"$f":"\"S\"&\" \"&TEXT(WEEKNUM(CI4),\"jj\")","v":"S 13"},null,null,null,null,null,null,{"$f":"\"S\"&\" \"&TEXT(WEEKNUM(CP4),\"jj\")","v":"S 14"},null,null,null,null,null,null,{"$f":"\"S\"&\" \"&TEXT(WEEKNUM(CW4),\"jj\")","v":"S 15"},null,null,null,null,null,null,{"$f":"\"S\"&\" \"&TEXT(WEEKNUM(DD4),\"jj\")","v":"S 16"},null,null,null,null,null,null,{"$f":"\"S\"&\" \"&TEXT(WEEKNUM(DK4),\"jj\")","v":"S 17"},null,null,null,null,null,null,{"$f":"\"S\"&\" \"&TEXT(WEEKNUM(DR4),\"jj\")","v":"S 18"},null,null,null,null,null,null,{"$f":"\"S\"&\" \"&TEXT(WEEKNUM(DY4),\"jj\")","v":"S 19"},null,null,null,null,null,null,{"$f":"\"S\"&\" \"&TEXT(WEEKNUM(EF4),\"jj\")","v":"S 20"},null,null,null,null,null,null,{"$f":"\"S\"&\" \"&TEXT(WEEKNUM(EM4),\"jj\")","v":"S 21"},null,null,null,null,null,null,{"$f":"\"S\"&\" \"&TEXT(WEEKNUM(ET4),\"jj\")","v":"S 22"},null,null,null,null,null,null,{"$f":"\"S\"&\" \"&TEXT(WEEKNUM(FA4),\"jj\")","v":"S 23"},null,null,null,null,null,null,{"$f":"\"S\"&\" \"&TEXT(WEEKNUM(FH4),\"jj\")","v":"S 24"},null,null,null,null,null,null,{"$f":"\"S\"&\" \"&TEXT(WEEKNUM(FO4),\"jj\")","v":"S 25"},null,null,null,null,null,null,{"$f":"\"S\"&\" \"&TEXT(WEEKNUM(FV4),\"jj\")","v":"S 26"}]
[null,null,null,{"$f":"TEXT(WEEKDAY(D4,1), \"jjj\")","v":"mar"},{"$f":"TEXT(WEEKDAY(E4,1), \"jjj\")","v":"mer"},"jeu","ven","sam","dim","lun","mar","mer","jeu","ven","sam","dim","lun","mar","mer","jeu","ven","sam","dim","lun","mar","mer","jeu","ven","sam","dim","lun","mar","mer","jeu","ven","sam","dim","lun","mar","mer","jeu","ven","sam","dim","lun","mar","mer","jeu","ven","sam","dim","lun","mar","mer","jeu","ven","sam","dim","lun","mar","mer","jeu","ven","sam","dim","lun","mar","mer",{"$f":"TEXT(WEEKDAY(BQ4,1), \"jjj\")","v":"jeu"},"ven","sam","dim","lun","mar","mer","jeu","ven","sam","dim","lun","mar","mer","jeu","ven","sam","dim","lun","mar","mer","jeu","ven","sam","dim","lun","mar","mer","jeu","ven","sam","dim","lun","mar","mer","jeu","ven","sam","dim","lun","mar","mer","jeu","ven","sam","dim","lun","mar","mer","jeu","ven","sam","dim","lun","mar","mer","jeu","ven","sam","dim","lun","mar","mer","jeu",{"$f":"TEXT(WEEKDAY(EC4,1), \"jjj\")","v":"ven"},"sam","dim","lun","mar","mer","jeu","ven","sam","dim","lun","mar","mer","jeu","ven","sam","dim","lun","mar","mer","jeu","ven","sam","dim","lun","mar","mer","jeu","ven","sam","dim","lun","mar","mer","jeu","ven","sam","dim","lun","mar","mer","jeu","ven","sam","dim","lun","mar","mer","jeu","ven","sam","dim"]
[null,null,null,"2019-01-01","2019-01-02","2019-01-03","2019-01-04","2019-01-05","2019-01-06","2019-01-07","2019-01-08","2019-01-09","2019-01-10","2019-01-11","2019-01-12","2019-01-13","2019-01-14","2019-01-15","2019-01-16","2019-01-17","2019-01-18","2019-01-19","2019-01-20","2019-01-21","2019-01-22","2019-01-23","2019-01-24","2019-01-25","2019-01-26","2019-01-27","2019-01-28","2019-01-29","2019-01-30","2019-01-31","2019-02-01","2019-02-02","2019-02-03","2019-02-04","2019-02-05","2019-02-06","2019-02-07","2019-02-08","2019-02-09","2019-02-10","2019-02-11","2019-02-12","2019-02-13","2019-02-14","2019-02-15","2019-02-16","2019-02-17","2019-02-18","2019-02-19","2019-02-20","2019-02-21","2019-02-22","2019-02-23","2019-02-24","2019-02-25","2019-02-26","2019-02-27","2019-02-28","2019-03-01","2019-03-02","2019-03-03","2019-03-04","2019-03-05","2019-03-06","2019-03-07","2019-03-08","2019-03-09","2019-03-10","2019-03-11","2019-03-12","2019-03-13","2019-03-14","2019-03-15","2019-03-16","2019-03-17","2019-03-18","2019-03-19","2019-03-20","2019-03-21","2019-03-22","2019-03-23","2019-03-24","2019-03-25","2019-03-26","2019-03-27","2019-03-28","2019-03-29","2019-03-30","2019-03-31","2019-04-01","2019-04-02","2019-04-03","2019-04-04","2019-04-05","2019-04-06","2019-04-07","2019-04-08","2019-04-09","2019-04-10","2019-04-11","2019-04-12","2019-04-13","2019-04-14","2019-04-15","2019-04-16","2019-04-17","2019-04-18","2019-04-19","2019-04-20","2019-04-21","2019-04-22","2019-04-23","2019-04-24","2019-04-25","2019-04-26","2019-04-27","2019-04-28","2019-04-29","2019-04-30","2019-05-01","2019-05-02","2019-05-03","2019-05-04","2019-05-05","2019-05-06","2019-05-07","2019-05-08","2019-05-09","2019-05-10","2019-05-11","2019-05-12","2019-05-13","2019-05-14","2019-05-15","2019-05-16","2019-05-17","2019-05-18","2019-05-19","2019-05-20","2019-05-21","2019-05-22","2019-05-23","2019-05-24","2019-05-25","2019-05-26","2019-05-27","2019-05-28","2019-05-29","2019-05-30","2019-05-31","2019-06-01","2019-06-02","2019-06-03","2019-06-04","2019-06-05","2019-06-06","2019-06-07","2019-06-08","2019-06-09","2019-06-10","2019-06-11","2019-06-12","2019-06-13","2019-06-14","2019-06-15","2019-06-16","2019-06-17","2019-06-18","2019-06-19","2019-06-20","2019-06-21","2019-06-22","2019-06-23","2019-06-24","2019-06-25","2019-06-26","2019-06-27","2019-06-28","2019-06-29","2019-06-30"]
[null,null,null,null,null,null,null,null,null,null,null,null,null,null,null,null,null,null,null,null,null,null,null,null,null,null,null,null,null,null,null,null,null,null,null,null,null,null,null,null,null,null,null,null,null,null,"TEST SC2",null,null,null,null,null,null,null,null,null,null,null,null,null,null,null,null,null,null,null,null,null,null,null,null,null,null,null,"J+N",null,null,null,null,null,null,null,null,"SERVICE GRANDE SEMAINE",null,null,null,null,null,null,null,null,null,"FA VAB N°4",null,null,null,null,null,null,"FA VAB N°4",null,null,null,null,"PLD",null,null,null,null,null,null,null,null,null,null,null,null,null,null,null,"FA UMO",null,null,null,null,null,null,"FA VAB N°5",null,null,null,null,null,null,"FA VAB N°5",null,null,null,null,null,null,null,"TIR",null,null,null,null,null,null,"PASSCOM",null,null,null,null,null,null,null,"TIR","SENTINELLE T33"]
[null,null,null,null,null,null,null,null,null,null,null,null,null,null,null,null,null,null,null,null,null,null,null,null,null,null,null,null,null,null,null,null,null,null,null,null,null,null,null,null,null,null,null,null,null,null,null,null,null,null,null,null,null,null,null,null,null,null,"FA VAB N°3",null,null,null,null,null,null,"FA VAB N°3",null,null,null,null,null,null,null,null,null,null,null,null,null,"EQUIPE GRIMAGE 27BIM",null,null,null,null,null,null,"PREPA VTA",null,null,null,null,null,null,"PREPA VTA",null,null,null,null,null,null,"VTA",null,null,null,null,null,null,null,"EXPOSE DES CDU",null,null,null,null,null,"FA SITEL",null,null,null,null,null,null,null,null,null,null,null,null,null,null,null,null,null,null,null,null,"MONIT PSE1/2",null,null,null,null,null,null,null,null,null,null,"SERVICE GRANDE SEMAINE",null,null,null,null,null,null,null,null,null,"FA VAB N°5",null,null,null,null,null,null,"FA VAB N°5",null,null,null,null,null,null,null,null,"J+N+TIR+MONTAGE PC",null,null,null,null,"AGUERRISSEMENT"]
[null,null,null,null,null,null,null,null,"PLD CIE","PREPA SC2",null,null,null,null,null,null,"SC2 INITIAL",null,null,null,null,null,null,null,null,"FOOTING RGTr",null,null,null,null,null,null,null,null,null,null,null,"IEC VL",null,null,null,null,null,null,"IEC VL",null,null,null,null,null,null,null,null,null,null,null,null,null,null,null,null,null,null,null,null,"IEC VL + PL",null,null,null,null,null,null,"IEC VL + PL",null,null,null,null,null,null,null,null,null,null,null,null,null,null,null,"MARCE CIE",null,null,null,null,null,null,"366-12 LTN DA",null,null,null,null,null,null,"J+N+TIR",null,null,null,"ENCADREMENT FMIR",null,null,null,null,null,null,null,null,null,null,null,null,null,null,null,null,null,null,null,null,null,null,null,null,null,null,null,null,null,null,"TIR",null,null,null,null,null,null,null,null,null,null,null,null,null,null,null,null,null,null,"FA UMDA",null,null,null,null,null,null,null,null,null,null,"SERVICE GRANDE SEMAINE",null,null,null,null,null,null,null,null,null,"FA VAB N°6"]
[null,null,null,null,null,null,null,null,null,"FAMI HIVER PMM VALLOIRE",null,null,null,null,null,null,null,null,null,null,null,null,null,"IEC VL + PL",null,null,null,null,null,null,"IEC VL + PL",null,null,null,null,null,null,null,null,null,null,null,null,null,null,null,null,null,null,null,null,null,null,null,null,null,null,null,"MONIT C-IED",null,null,null,null,null,null,"MONIT C-IED",null,null,null,null,null,"MCF CAYLUS",null,null,null,null,null,null,null,null,null,null,null,null,null,null,null,null,null,null,null,null,null,"ICC VL + PL",null,null,null,null,null,null,"ICC VL + PL",null,null,null,null,null,null,null,null,null,null,null,null,null,"FCM FGE",null,null,null,null,null,null,null,null,null,null,null,null,null,"FGE 2",null,null,null,null,null,null,null,null,null,null,null,null,null,null,null,null,null,null,null,null,null,null,null,null,null,null,null,null,null,null,null,null,null,null,null,null,null,null,null,null,null,"FA PPLOG",null,null,null,null,null,null,"FA PPLOG",null,null,null,"SERVICE PETITE SEMAINE"]
[null,null,null,null,null,null,null,null,null,"FTE TIOR",null,null,null,null,null,null,"FTE TIOR",null,null,null,null,null,null,"ICC VL FTS",null,null,null,null,null,null,null,null,null,null,null,null,null,null,null,null,null,null,null,null,null,null,null,null,null,null,null,null,null,null,null,null,null,null,"PREPA CAMP",null,null,null,null,null,null,"PREPA CAMP",null,null,null,null,null,null,"CAMP RGTR LCT",null,null,null,null,null,null,null,null,null,null,null,null,null,"REMEC CAMP",null,null,null,null,null,null,null,null,null,null,null,null,null,null,"SEMINAIRE CDU CMOLOG",null,null,null,null,null,null,null,null,null,null,null,null,null,null,null,null,null,null,null,null,null,null,null,null,null,null,null,null,null,null,null,null,null,"MCF SENTINELLE"]
[null,null,null,null,null,null,null,null,null,null,null,null,null,null,null,null,"FORCO SC1",null,"FORCO PSC1",null,null,null,null,"FA VAB 1",null,null,null,null,null,null,"FA VAB 1",null,null,null,null,null,null,"FA VAB 2",null,null,null,null,null,null,"FA VAB 2",null,null,null,null,null,null,null,null,null,null,null,null,null,null,null,null,null,null,null,null,null,null,null,null,null,null,null,"FA PPLOG"]
[null,null,null,null,null,null,null,null,null,null,null,null,null,null,null,null,null,null,null,null,null,null,null,null,null,null,null,null,null,null,null,null,null,null,null,null,null,null,null,null,null,null,null,null,null,null,null,null,null,null,null,null,null,null,null,null,null,null,null,null,null,null,null,null,null,null,null,null,null,null,null,null,null,null,null,null,null,null,null,"FA UMDA"]
[]
[null,null,null,null,null,null,null,null,null,null,null,null,null,"SVC PETITE SEMAINE",null,null,null,null,null,null,null,null,null,null,null,null,null,null,null,null,null,"J+N",null,null,null,null,null,null,null,null,null,null,null,null,null,null,null,null,null,null,null,null,null,null,null,null,null,null,"SAUTS ETAP",null,null,null,null,null,null,null,null,null,null,null,null,null,null,null,null,null,null,null,null,null,null,null,null,null,null,null,null,null,null,null,null,null,"SAUTS ETAP",null,null,null,null,null,null,null,null,null,null,null,null,null,null,null,null,null,null,null,null,"SAUTS ETAP",null,null,null,null,null,null,null,null,null,null,null,null,null,null,null,null,null,null,null,null,null,null,null,null,null,null,null,null,null,null,null,null,null,null,"SAUTS ETAP",null,null,null,null,null,null,null,null,null,null,null,null,null,null,null,null,null,null,null,null,"SAUTS ETAP"]
[null,null,null,{"$f":"D2","v":"S 01"},null,null,null,null,null,{"$f":"J2","v":"S 02"},null,null,null,null,null,null,{"$f":"Q2","v":"S 03"},null,null,null,null,null,null,{"$f":"X2","v":"S 04"},null,null,null,null,null,null,{"$f":"AE2","v":"S 05"},null,null,null,null,null,null,{"$f":"AL2","v":"S 06"},null,null,null,null,null,null,{"$f":"AS2","v":"S 07"},null,null,null,null,null,null,{"$f":"AZ2","v":"S 08"},null,null,null,null,null,null,{"$f":"BG2","v":"S 09"},null,null,null,null,null,null,{"$f":"BN2","v":"S 10"},null,null,null,null,null,null,{"$f":"BU2","v":"S 11"},null,null,null,null,null,null,{"$f":"CB2","v":"S 12"},null,null,null,null,null,null,{"$f":"CI2","v":"S 13"},null,null,null,null,null,null,{"$f":"CP2","v":"S 14"},null,null,null,null,null,null,{"$f":"CW2","v":"S 15"},null,null,null,null,null,null,{"$f":"DD2","v":"S 16"},null,null,null,null,null,null,{"$f":"DK2","v":"S 17"},null,null,null,null,null,null,{"$f":"DR2","v":"S 18"},null,null,null,null,null,null,{"$f":"DY2","v":"S 19"},null,null,null,null,null,null,{"$f":"EF2","v":"S 20"},null,null,null,null,null,null,{"$f":"EM2","v":"S 21"},null,null,null,null,null,null,{"$f":"ET2","v":"S 22"},null,null,null,null,null,null,{"$f":"FA2","v":"S 23"},null,null,null,null,null,null,{"$f":"FH2","v":"S 24"},null,null,null,null,null,null,{"$f":"FO2","v":"S 25"},null,null,null,null,null,null,{"$f":"FV2","v":"S 26"}]
["SECTION","GRADE","NOM","2019-01-01","2019-01-02","2019-01-03","2019-01-04","2019-01-05","2019-01-06","2019-01-07","2019-01-08","2019-01-09","2019-01-10","2019-01-11","2019-01-12","2019-01-13","2019-01-14","2019-01-15","2019-01-16","2019-01-17","2019-01-18","2019-01-19","2019-01-20","2019-01-21","2019-01-22","2019-01-23","2019-01-24","2019-01-25","2019-01-26","2019-01-27","2019-01-28","2019-01-29","2019-01-30","2019-01-31","2019-02-01","2019-02-02","2019-02-03","2019-02-04","2019-02-05","2019-02-06","2019-02-07","2019-02-08","2019-02-09","2019-02-10","2019-02-11","2019-02-12","2019-02-13","2019-02-14","2019-02-15","2019-02-16","2019-02-17","2019-02-18","2019-02-19","2019-02-20","2019-02-21","2019-02-22","2019-02-23","2019-02-24","2019-02-25","2019-02-26","2019-02-27","2019-02-28","2019-03-01","2019-03-02","2019-03-03","2019-03-04","2019-03-05","2019-03-06","2019-03-07","2019-03-08","2019-03-09","2019-03-10","2019-03-11","2019-03-12","2019-03-13","2019-03-14","2019-03-15","2019-03-16","2019-03-17","2019-03-18","2019-03-19","2019-03-20","2019-03-21","2019-03-22","2019-03-23","2019-03-24","2019-03-25","2019-03-26","2019-03-27","2019-03-28","2019-03-29","2019-03-30","2019-03-31","2019-04-01","2019-04-02","2019-04-03","2019-04-04","2019-04-05","2019-04-06","2019-04-07","2019-04-08","2019-04-09","2019-04-10","2019-04-11","2019-04-12","2019-04-13","2019-04-14","2019-04-15","2019-04-16","2019-04-17","2019-04-18","2019-04-19","2019-04-20","2019-04-21","2019-04-22","2019-04-23","2019-04-24","2019-04-25","2019-04-26","2019-04-27","2019-04-28","2019-04-29","2019-04-30","2019-05-01","2019-05-02","2019-05-03","2019-05-04","2019-05-05","2019-05-06","2019-05-07","2019-05-08","2019-05-09","2019-05-10","2019-05-11","2019-05-12","2019-05-13","2019-05-14","2019-05-15","2019-05-16","2019-05-17","2019-05-18","2019-05-19","2019-05-20","2019-05-21","2019-05-22","2019-05-23","2019-05-24","2019-05-25","2019-05-26","2019-05-27","2019-05-28","2019-05-29","2019-05-30","2019-05-31","2019-06-01","2019-06-02","2019-06-03","2019-06-04","2019-06-05","2019-06-06","2019-06-07","2019-06-08","2019-06-09","2019-06-10","2019-06-11","2019-06-12","2019-06-13","2019-06-14","2019-06-15","2019-06-16","2019-06-17","2019-06-18","2019-06-19","2019-06-20","2019-06-21","2019-06-22","2019-06-23","2019-06-24","2019-06-25","2019-06-26","2019-06-27","2019-06-28","2019-06-29","2019-06-30"]
["S1 / TAP","LTN","SAMELOR","PLD",null,null,null,null,null,null,null,null,null,null,null,null,null,null,null,null,null,null,null,null,null,null,null,null,null,null,null,"J+N",null,null,null,null,null,null,null,null,null,null,null,null,null,null,"PLD",null,null,null,null,null,null,null,null,"CP",null,null,null,null,null,null,null,null,null,"AP 354-5 LA COURTINE SOUTIEN ETLO",null,null,null,null,null,null,null,null,null,null,null,"CAMP REGIMENTAIRE LCT",null,null,null,null,null,null,null,null,null,null,null,"CHAMBARAN",null,null,null,null,null,null,null,null,null,null,null,null,null,null,null,null,null,"FCM FGE 2",null,null,null,null,null,null,null,null,null,null,null,null,null,"FA UMO",null,null,null,null,null,null,"FGE 2"]
[null,"SCH","RAMEL","PLD",null,null,null,null,null,"ARRET MALADIE",null,null,null,null,null,null,null,null,null,null,null,null,null,null,null,null,null,null,null,null,null,"J+N",null,null,null,null,null,null,null,null,null,null,null,null,null,null,null,null,"PLD",null,null,null,null,"PLD","EMSOME",null,null,null,null,null,null,"PLD",null,null,null,null,"PLD",null,null,null,null,null,"CAMP REGIMENTAIRE LCT",null,null,null,null,null,null,null,null,null,null,null,null,null,null,null,null,null,null,null,null,null,null,null,null,null,null,null,null,null,null,null,null,null,null,null,null,null,null,null,null,null,"FA SITEL",null,null,null,null,null,null,"FA UMO",null,null,null,null,"PLD AVANT TSHM"]
["S1 / TAP","SGT","MOHIMONT","PLD",null,null,null,null,null,null,null,null,null,null,null,null,null,"GILLOIS",null,null,null,null,null,null,null,null,null,null,null,null,null,"J+N",null,null,"SEMAINE",null,null,null,null,null,null,null,null,null,"PLD",null,"VSA","PLD",null,"PLD",null,null,null,null,null,null,null,null,"PLD",null,null,null,null,null,null,null,null,null,null,null,null,null,"CAMP REGIMENTAIRE LCT",null,null,null,null,null,null,null,null,null,null,null,null,null,null,null,null,null,"SEMAINE",null,null,null,null,null,null,null,null,null,null,null,null,null,null,"PLD",null,null,null,null,null,null,null,null,null,null,null,null,null,null,null,"FA UMO",null,null,null,null,null,null,"RC",null,null,null,null,null,null,"MONIT PSE1/2",null,null,null,null,null,null,null,null,null,null,null,null,null,null,null,null,null,null,null,null,null,null,null,"SENTINELLE T33"]
["S1","SGT","DOVERGNE","PLD",null,null,null,null,null,null,null,null,null,null,null,null,null,null,null,null,null,null,null,null,null,null,null,null,null,null,null,null,null,null,null,null,null,"PLD",null,null,null,null,null,null,"ARRET MALADIE",null,null,null,null,"PLD",null,null,null,null,null,null,null,null,"PLD",null,null,null,null,null,null,"AP 354-5 LA COURTINE SOUTIEN ETLO",null,null,null,null,null,null,null,null,null,null,null,"CAMP REGIMENTAIRE LCT",null,null,null,null,null,null,null,null,null,null,null,null,null,null,null,null,null,null,null,null,null,null,null,null,null,null,null,null,null,null,null,null,null,null,null,null,null,null,null,null,null,null,null,"FA UMO",null,null,null,null,null,null,"RC",null,null,null,null,null,null,null,null,null,null,null,null,null,null,null,null,null,null,null,null,null,null,null,null,null,null,null,null,null,null,"SENTINELLE T33"]
["S1 / TAP","CC1","FALSARELLA","IRAK",null,null,null,null,null,null,null,null,null,null,null,null,null,null,null,null,null,null,null,null,null,null,null,null,"IRAK",null,null,null,null,null,null,null,null,null,null,null,null,null,null,null,null,null,null,null,null,null,null,null,null,null,null,"IRAK",null,null,null,"PLD",null,null,null,null,null,null,null,null,null,null,null,null,null,null,null,null,"SEMAINE",null,null,null,null,null,null,null,null,null,null,null,null,null,null,null,null,null,null,null,null,null,null,null,null,null,null,null,null,null,null,null,null,null,null,null,null,null,null,null,null,null,null,null,null,"FA UMO",null,null,null,null,null,null,"RC",null,null,null,null,null,null,null,null,null,null,null,null,null,null,null,null,null,null,null,null,null,null,null,null,null,null,null,null,null,null,"SENTINELLE T33"]
["S1 / TAP","CC1","GOMEZ-GRANA","NIGER",null,null,null,null,null,null,null,null,null,null,null,null,null,null,null,null,null,null,null,null,null,null,null,null,"NIGER",null,null,null,null,null,null,null,null,null,null,null,null,null,null,null,null,null,null,"PLD",null,null,null,null,null,null,null,null,null,null,"PLD",null,null,null,null,null,null,null,null,null,null,null,null,null,null,null,null,null,null,null,null,null,null,null,null,null,null,null,null,null,null,null,null,null,null,null,null,null,null,null,null,null,null,null,null,null,null,null,"ENCADREMENT FMIR",null,null,null,null,null,null,null,null,null,null,null,null,null,null,"FA UMO",null,null,null,null,null,null,"RC"]
["S1 / TAP","CC1","HUYGHE","LIBAN",null,null,null,null,null,null,null,null,null,null,null,null,null,null,null,null,null,null,null,null,null,null,null,null,"LIBAN",null,null,null,null,null,null,null,null,null,null,null,null,null,null,null,null,null,null,null,null,null,null,null,null,null,null,null,null,null,null,null,null,null,null,"LIBAN",null,null,null,null,null,null,null,null,null,null,null,null,null,null,null,"PLD",null,null,null,null,null,null,null,null,null,null,null,null,null,null,null,null,null,null,null,null,null,null,null,null,null,null,null,null,null,null,null,null,null,null,null,null,null,null,null,null,null,"FA UMO",null,null,null,null,null,null,"RC"]
["S1 / TAP","CC1","LEBOURG","MALI",null,null,null,null,null,null,null,null,null,null,null,null,null,null,null,null,null,null,null,null,null,null,null,null,"MALI",null,null,null,null,null,null,null,null,null,null,null,null,null,null,null,null,null,null,null,null,null,null,null,null,null,null,null,"PLD",null,null,null,null,null,null,null,null,null,null,null,null,null,null,null,"CAMP REGIMENTAIRE LCT",null,null,null,null,null,null,null,null,null,null,null,null,null,null,null,null,null,null,null,null,null,null,null,null,null,null,null,null,null,null,null,null,null,null,null,null,null,null,null,null,null,null,null,null,null,null,null,null,"FA UMO",null,null,null,null,null,null,"RC"]
["S1 / TAP","CCH","AHMED","PLD",null,null,null,null,null,null,null,null,null,null,null,null,"FA SITTEL",null,null,null,null,null,null,"FA CDB",null,null,null,null,null,null,"FA CDB",null,null,null,null,null,null,"SEMAINE IEC",null,null,null,null,null,null,null,null,null,null,null,null,null,null,null,"CREIL","CREIL","PLD",null,null,null,null,null,null,"SEMAINE",null,null,null,null,null,null,null,null,"GAP",null,null,null,null,"GAP",null,null,"EQUIPE GRIMAGE 27BIM",null,null,null,null,null,null,"RC",null,null,null,null,null,"CANJUERS",null,null,null,"CANJUERS",null,null,null,"RC",null,null,null,null,null,null,null,null,null,null,null,null,null,null,null,null,null,null,null,null,"FA UMO",null,null,null,null,null,null,"RC",null,null,null,null,null,null,null,null,null,null,null,null,null,null,null,null,null,null,null,null,null,null,null,null,null,null,null,null,null,null,"SENTINELLE T33"]
["S1 / TAP","CCH","ANLLI","MALI",null,null,null,null,null,null,null,null,null,null,null,null,null,null,null,null,null,null,null,null,null,null,null,null,"MALI",null,null,null,"PLD",null,null,null,null,null,null,null,null,null,null,null,null,null,null,null,null,null,null,null,null,"PLD",null,null,null,null,null,"DEMO DYNAMIQUE",null,null,null,null,null,"AP 354-5 LA COURTINE SOUTIEN ETLO",null,null,null,null,null,null,null,null,null,null,null,"CAMP REGIMENTAIRE LCT",null,null,null,null,null,null,null,null,null,null,null,null,null,null,null,null,null,null,null,null,null,null,null,null,null,null,null,null,null,null,null,null,null,null,null,null,null,null,null,null,"SEMAINE",null,null,null,null,null,null,null,null,null,null,null,null,null,null,null,null,null,null,null,null,null,null,null,null,null,null,null,null,null,null,null,null,null,null,null,null,null,null,null,null,"SENTINELLE T33"]
["S1 / TAP","CCH","BACO","PLD",null,null,null,null,null,null,null,null,"SC1",null,null,null,"FA SITTEL",null,null,null,null,null,null,null,null,null,null,null,null,null,null,null,null,null,null,null,"ACHEMINEMENT ROT CETIA ",null,null,null,null,"GILLOIS",null,null,"GILLLOIS",null,null,null,null,null,null,null,null,null,null,null,null,null,"PLD",null,null,null,null,null,null,"AP 354-5 LA COURTINE SOUTIEN ETLO",null,null,null,null,null,null,null,null,null,null,null,"CAMP REGIMENTAIRE LCT",null,null,null,null,null,null,null,null,null,null,null,null,null,"PLD",null,null,null,null,null,null,null,null,null,null,"MOBILITE DEFENSE",null,null,null,null,null,null,null,null,null,null,null,null,null,null,null,null,null,null,"FA UMO",null,null,null,null,null,null,"RC",null,null,null,null,null,null,null,null,null,null,null,null,null,null,null,null,null,null,null,null,null,null,null,null,null,"FFDJ - DJIBOUTI"]
["S1 / TAP","CCH","BERNOUD","PLD",null,null,null,null,null,null,null,null,null,null,null,null,null,null,null,null,"PLD",null,null,"ARRET MALADIE",null,null,null,null,"ARRET MALADIE",null,null,null,null,null,null,null,null,null,null,null,null,null,null,null,null,null,null,null,null,null,null,"ARRET MALADIE",null,null,null,null,null,null,"AT",null,null,null,null,null,null,null,null,null,null,"SEMAINE",null,null,null,null,null,null,null,null,null,null,null,null,null,null,null,null,null,null,null,null,null,null,null,null,null,null,null,null,null,null,null,null,null,null,null,null,null,null,null,null,null,null,null,null,null,null,null,null,null,null,null,"FA UMO",null,null,null,null,null,null,"RC"]
["S1","CCH","CREBASSA","MALI",null,null,null,null,null,null,null,null,null,null,null,null,null,null,null,null,null,null,null,null,null,null,null,null,null,null,null,null,null,null,null,null,null,null,null,null,null,"PLD",null,null,null,null,null,null,null,null,null,null,null,null,null,null,null,null,"PLD",null,null,null,null,null,null,null,null,null,null,null,null,null,"CAMP REGIMENTAIRE LCT",null,null,null,null,null,null,null,null,null,null,null,null,null,null,null,null,null,null,null,null,null,null,null,null,null,null,null,null,null,null,null,null,null,null,null,null,null,null,null,null,null,null,null,null,null,null,null,null,null,null,null,null,"SEMAINE",null,null,null,null,null,null,null,null,null,null,null,null,null,null,null,null,null,null,null,null,null,null,null,null,null,null,null,null,null,null,null,null,null,"SENTINELLE T33"]
["S1 / TAP","CCH","GERMAIN",null,null,null,null,null,null,null,null,null,"SC1",null,null,"PLD",null,null,null,null,null,null,null,null,null,null,null,null,null,null,null,null,null,"PLD","NIGER",null,null,null,null,null,null,null,null,null,null,null,null,null,null,null,null,"NIGER",null,null,null,null,null,null,"NIGER",null,null,null,null,null,null,null,null,null,null,null,null,null,"NIGER",null,null,null,null,null,null,null,null,null,null,null,null,null,null,null,null,null,null,null,null,"NIGER",null,null,null,null,null,null,null,null,null,null,null,null,null,null,null,null,null,null,null,null,"NIGER",null,null,null,null,null,null,null,null,null,null,null,null,null,null,null,null,null,null,null,null,"NIGER",null,null,null,null,null,null,null,null,null,null,null,null,null,null,null,null,null,null,null,null,null,"PLD"]
["S1 / TAP","CCH","HEDDAD","DJIBOUTI",null,null,null,null,null,null,null,null,null,null,null,null,null,null,null,null,null,null,null,null,null,null,null,null,"DJIBOUTI",null,null,null,null,null,null,null,null,null,null,null,null,null,null,null,null,null,null,null,null,null,null,null,null,null,null,null,null,null,"FFDJ",null,null,null,null,null,null,"PLD",null,null,null,null,null,null,null,null,null,null,null,null,null,null,null,null,null,null,null,null,null,null,null,null,null,null,null,null,null,null,null,null,null,null,null,null,null,null,null,null,null,null,null,null,null,null,null,null,null,null,null,null,null,null,null,"FA UMO",null,null,null,null,null,null,"RC",null,null,null,null,null,null,null,null,null,null,null,null,null,null,null,null,null,null,null,null,null,null,null,null,null,null,null,null,null,null,null,null,null,null,null,null,null,null,null,null,null,null,null,null,null,null,null,null,null,null,null,null,"SEMAINE"]
["S1","CPL","JAWORSKI","NIGER",null,null,null,null,null,null,null,null,null,null,null,null,null,null,null,null,null,null,null,null,null,null,null,null,"NIGER",null,null,null,null,null,null,null,null,null,null,null,"PLD",null,"PLD",null,null,null,null,null,null,null,null,null,null,null,null,null,null,null,"PLD",null,null,null,null,null,null,null,null,null,null,null,null,null,"CAMP REGIMENTAIRE LCT",null,null,null,null,null,null,null,null,null,null,null,null,null,null,null,null,null,null,null,null,null,null,null,null,null,null,null,null,null,null,null,null,null,null,null,null,null,null,null,null,null,null,null,null,null,null,null,null,"FA UMO",null,null,null,null,null,null,"RC",null,null,null,null,null,null,null,null,null,null,null,null,null,null,null,null,null,null,null,null,null,null,null,null,null,null,null,null,null,null,"SENTINELLE T33"]
["S1","CCH","PHILLIPS","SENEGAL",null,null,null,null,null,null,null,null,null,null,null,null,null,null,null,null,null,null,null,null,null,null,null,null,"SENEGAL",null,null,null,null,null,null,null,null,null,null,null,null,null,null,null,null,null,null,null,null,null,null,null,null,null,null,null,null,null,"FFDJ",null,null,null,null,null,null,null,null,null,null,null,null,null,null,null,null,null,null,null,null,null,null,null,null,null,null,null,null,null,null,null,null,null,null,null,null,null,null,null,null,null,null,null,null,null,null,null,null,null,null,null,null,null,null,null,null,null,null,null,null,null,null,"FA UMO",null,null,null,null,null,null,"RC",null,null,null,null,null,null,null,null,null,null,null,null,null,null,null,null,null,"SEMAINE",null,null,null,null,null,null,null,null,null,null,null,null,"SENTINELLE T33"]
["S1 / TAP","CCH","VERET","SENEGAL",null,null,null,null,null,null,null,null,null,null,null,null,null,null,null,null,null,null,null,null,null,null,null,null,"SENEGAL",null,null,null,null,null,null,null,null,null,null,null,null,null,null,null,null,null,null,null,null,null,null,null,null,null,null,null,null,null,"FFDJ",null,null,null,null,null,null,null,null,null,null,null,null,null,null,null,null,null,null,null,null,null,null,null,null,null,"PLD",null,null,null,null,null,null,null,null,null,null,null,null,null,null,null,null,null,null,null,null,"PLD",null,null,null,null,null,null,null,null,null,null,null,null,null,null,null,null,null,null,null,null,null,null,null,null,null,null,null,null,null,null,null,null,null,null,null,null,null,null,null,null,null,null,null,null,null,null,null,"SEMAINE"]
["S1 / TAP","CPL","ANNAERT","GUYANE",null,null,null,null,null,null,null,null,null,null,null,null,null,null,null,null,"PLD",null,null,null,null,null,null,null,null,null,null,null,null,null,null,null,null,"PLD",null,null,null,null,null,null,null,null,null,null,null,null,null,"PLD",null,null,null,null,null,null,null,"DEMO DYNAMIQUE",null,null,null,null,null,"AP 354-5 LA COURTINE SOUTIEN ETLO",null,null,null,null,null,null,null,null,null,null,null,"CAMP REGIMENTAIRE LCT",null,null,null,null,null,null,null,null,null,null,null,null,null,null,null,null,null,null,null,null,null,null,null,null,null,null,null,null,null,null,null,null,null,null,null,null,null,null,null,null,null,null,null,"FA UMO",null,null,null,null,null,null,"PREPA SC2 GISS",null,null,null,null,null,null,"SC2 INIT",null,null,null,null,null,null,"SC2 INIT",null,null,null,null,null,null,"RC",null,null,null,null,null,null,null,null,null,"SENTINELLE T33"]
["S1 / TAP","CPL","BANGELINA","MALI",null,null,null,null,null,null,null,null,null,null,null,null,null,null,null,null,null,null,null,null,null,null,null,null,"MALI",null,null,null,"PLD",null,null,null,null,null,null,null,null,null,null,null,null,null,null,null,null,null,null,null,null,null,null,null,null,null,"PLD","DEMO DYNAMIQUE",null,"PLD",null,null,null,"AP 354-5 LA COURTINE SOUTIEN ETLO",null,null,null,null,null,null,null,null,null,null,null,"CAMP REGIMENTAIRE LCT",null,null,null,null,null,null,null,null,null,null,null,null,null,null,null,null,null,null,null,null,null,null,null,null,null,null,null,null,null,null,null,null,null,null,null,null,null,null,null,null,null,null,null,"FA UMO",null,null,null,null,null,null,"RC",null,null,null,null,null,null,null,null,null,null,null,null,null,null,null,null,null,null,null,null,null,null,null,null,null,null,null,null,null,null,"SENTINELLE T33"]
["S1 / TAP","CPL","CHOLLAT","GUYANE",null,null,null,null,null,null,null,null,null,null,null,null,null,null,null,null,"PLD",null,null,null,null,null,null,null,null,null,null,null,null,null,"PLD",null,null,null,null,null,null,null,null,null,"PLD",null,null,null,null,null,null,null,null,"CREIL","CREIL","AUTO D'ABS",null,null,null,null,null,null,null,null,"AEROPORT",null,null,"SIGNATURE CONTRAT",null,"SEMAINE",null,"CAYLUS",null,null,null,null,null,null,null,null,null,null,"CAYLUS",null,null,null,"PREPA SC2",null,null,null,null,null,null,"SC2 INIT",null,null,null,null,null,null,"SC2 INIT",null,null,null,null,null,null,null,null,null,null,null,null,null,"FCM FGE",null,null,null,null,null,null,null,null,null,null,null,null,null,"FGE 2",null,null,null,null,null,null,null,null,null,null,null,null,null,null,null,null,null,null,null,null,null,null,null,null,null,null,null,null,null,null,null,null,null,null,null,null,null,null,null,null,null,null,null,null,null,"SEMAINE"]
["S1","CPL","COSPOLITE","PLD",null,null,null,null,null,null,null,null,"CONDUCTEUR PERMANENCE",null,null,null,null,null,null,null,"PLD",null,null,null,null,null,null,null,null,null,null,null,null,null,null,null,null,null,null,null,"AEROPORT",null,null,null,null,null,null,null,null,null,null,"CREIL",null,null,"RENFORT SC2 AU GISS",null,null,null,null,null,null,null,null,null,null,"AP 354-5 LA COURTINE SOUTIEN ETLO",null,null,null,null,null,null,null,null,null,null,null,"CAMP REGIMENTAIRE LCT",null,null,null,null,null,null,null,null,"PLD",null,null,null,null,null,null,null,null,null,null,null,null,null,null,null,null,null,null,null,null,null,null,null,null,null,null,null,null,null,null,null,null,null,null,null,null,null,null,null,null,null,null,null,null,null,null,null,null,null,null,null,null,null,null,null,null,null,null,null,null,null,null,null,null,null,null,null,null,null,null,null,null,"SENTINELLE T33"]
["S1","CPL","DENIS","COTE D'IVOIRE",null,null,null,null,null,null,null,null,null,null,null,null,null,null,null,null,null,null,null,null,null,null,null,null,"COTE D'IVOIRE",null,null,null,null,null,null,null,null,null,null,null,null,null,null,null,null,null,null,"PLD",null,null,null,null,null,null,null,null,null,null,"PLD",null,null,null,null,null,null,null,null,null,null,null,null,null,null,null,null,null,null,null,null,null,null,null,null,null,null,null,null,null,null,null,null,null,null,null,null,null,null,null,null,null,null,null,null,null,null,null,null,null,null,null,null,null,null,null,null,null,null,null,null,null,null,"FA UMO",null,null,null,null,null,null,"RC",null,null,null,null,null,null,null,null,null,null,null,null,null,null,null,null,null,null,null,null,null,null,null,null,null,null,null,null,null,null,"SENTINELLE T33"]
["S1","CPL","FELIP","PLD",null,null,null,null,null,null,null,"PLD","SC1",null,null,null,"GUYANE",null,null,null,null,null,null,null,null,null,null,null,null,null,null,null,null,null,null,null,null,null,null,null,null,null,null,null,null,null,null,null,null,null,null,null,null,null,null,null,null,null,"GUYANE",null,null,null,null,null,null,null,null,null,null,null,null,null,null,null,null,null,null,null,null,null,null,null,null,null,null,null,null,null,null,null,null,null,null,null,null,null,null,null,null,null,null,null,null,null,null,null,null,null,null,null,null,null,null,null,null,null,null,null,null,null,null,null,null,null,null,null,null,null,null,null,null,null,null,null,null,null,null,null,null,null,null,null,"PLD"]
["S1 / TAP","CPL","FIMIEZ","MALI",null,null,null,null,null,null,null,null,null,null,null,null,null,null,null,null,null,null,null,"PLD",null,null,null,null,null,null,null,null,null,null,null,null,null,null,null,null,null,null,null,null,null,null,null,null,null,null,null,null,null,null,null,null,null,null,"PLD",null,null,null,null,null,null,null,null,null,null,null,null,null,"CPG",null,null,null,null,null,null,"CPG",null,null,null,null,null,null,"CPG",null,null,null,null,null,null,"CPG",null,null,null,null,null,null,"CPG",null,null,null,null,null,null,"CPG",null,null,null,null,null,null,"CPG",null,null,null,null,null,null,"CPG",null,null,null,null,null,null,"CPG",null,null,null,null,null,null,"CPG",null,null,null,null,null,null,"CPG",null,null,null,null,null,null,"CPG",null,null,null,null,null,null,"CPG",null,null,null,null,null,null,"CPG"]
["S1 / TAP","CPL","GOURVENEC","PLD",null,null,null,null,null,null,null,null,null,null,null,null,null,null,null,null,"SEMAINE",null,null,null,null,null,null,null,null,null,null,null,null,null,null,null,null,null,null,null,null,"ARMURERIE",null,null,null,null,"TEST SC2",null,null,null,null,null,null,null,null,null,null,"AEROPORT","FA VAB N°3",null,null,null,null,null,null,"FA VAB N°3",null,null,null,null,null,"AMPHI OPEX GAP",null,null,null,null,null,null,null,null,null,null,null,null,null,null,null,null,null,null,null,null,"MCF CANJUERS",null,null,null,null,null,null,null,null,null,null,null,null,null,null,null,null,null,null,null,null,null,null,null,null,null,null,null,null,"FA UMO",null,null,null,null,null,null,"RC",null,null,null,null,null,null,null,null,null,null,null,null,null,null,null,null,null,null,null,null,null,null,null,null,null,"BSS BARKHANE - MALI"]
["S1","CPL","GRANATO","NOUVELLE CALEDONIE",null,null,null,null,null,null,null,null,null,null,null,null,null,null,null,null,null,null,null,null,null,null,null,null,"NOUVELLE CALEDONIE",null,null,null,null,null,null,null,null,null,null,null,null,null,null,null,null,null,null,null,null,null,null,null,null,null,null,null,null,null,null,null,null,null,null,null,null,null,null,null,null,null,null,null,null,null,null,null,null,null,null,null,null,null,null,null,null,null,null,null,null,null,null,null,null,null,null,null,null,null,null,null,null,null,null,null,null,null,null,"PLD",null,null,null,null,null,null,null,null,null,null,null,null,null,"FA UMO",null,null,null,null,null,null,"RC",null,null,null,null,null,null,null,null,null,null,null,null,null,null,null,null,null,null,null,null,null,null,null,null,null,null,null,null,null,null,"SENTINELLE T33"]
["S1","CPL","GRANDCHAMP","COTE D'IVOIRE",null,null,null,null,null,null,null,null,null,null,null,null,null,null,null,null,null,null,null,null,null,null,null,null,null,null,null,null,null,null,null,null,null,null,null,null,null,null,null,null,null,null,null,null,null,null,null,null,null,null,"PLD",null,null,null,"PLD",null,null,null,null,null,null,"PLD",null,null,null,null,null,null,"PLD",null,null,null,null,null,null,"PLD",null,null,null,null,null,null,null,null,null,null,null,null,null,null,null,null,null,null,null,null,null,null,null,null,null,null,null,null,null,null,null,null,null,null,null,null,null,null,null,null,null,"FA UMO",null,null,null,null,null,null,"RC",null,null,null,null,null,null,null,null,null,null,null,null,null,null,null,null,null,null,null,null,null,null,null,null,null,null,null,null,null,null,"SENTINELLE T33"]
["S1 / TAP","1CL","HAMZA","PLD",null,null,null,null,null,null,null,null,null,"SEMAINE",null,null,"MCF SENTINELLE",null,null,null,null,null,null,null,null,null,null,null,null,null,null,null,null,null,null,null,null,"SENTINELLE LYON",null,null,null,null,null,null,null,null,null,null,null,null,null,null,null,null,null,null,null,null,"STL T31",null,null,null,null,null,null,null,null,"FORCO PSE1/2",null,null,null,null,null,null,null,null,null,null,null,null,null,null,null,null,null,null,null,null,null,null,null,null,null,null,null,null,"N.CAL",null,null,null,"N.CAL",null,null,null,null,null,null,"N.CAL",null,null,null,null,null,null,"N.CAL",null,null,null,null,null,null,"N.CAL",null,null,null,null,null,null,"N.CAL",null,null,null,null,null,null,"N.CAL",null,null,null,null,null,null,"N.CAL",null,null,null,null,null,null,"N.CAL",null,null,null,null,null,null,"N.CAL",null,null,null,null,null,null,"N.CAL",null,null,null,null,null,null,"N.CAL",null,null,null,null,null,null,"N.CAL"]
["S1 / TAP","CPL","HIROUF","MALI",null,null,null,null,null,null,null,null,null,null,null,null,null,null,null,null,null,null,null,null,null,null,null,null,"MALI",null,null,null,null,null,null,null,null,null,null,null,null,null,null,null,null,null,null,null,null,null,null,null,null,null,null,null,null,null,"MALI",null,null,"MALI","PREVISION PLD A POSER",null,null,null,"PLD",null,null,null,null,null,"PLD",null,null,null,null,null,null,"PLD",null,null,null,null,null,null,"PLD",null,null,null,null,null,null,null,null,null,null,null,null,null,null,null,null,null,null,null,null,null,null,null,null,null,null,null,null,null,null,null,null,null,null,"FA UMO",null,null,null,null,null,null,"RC",null,null,null,null,null,null,null,null,null,null,null,null,null,null,null,null,null,null,null,null,null,null,null,null,null,null,null,null,null,null,"SENTINELLE T33"]
["S1","CPL","KAWASÉ","NOUVELLE CALEDONIE",null,null,null,null,null,null,null,null,null,null,null,null,null,null,null,null,null,null,null,null,null,null,null,null,"NOUVELLE CALEDONIE",null,null,null,null,null,null,null,null,null,null,null,null,null,null,null,null,null,null,null,null,null,null,null,null,null,null,null,null,null,"N.CAL",null,null,null,null,null,null,null,null,null,null,null,null,null,null,null,null,null,null,null,null,null,null,null,null,null,null,null,null,null,null,null,null,null,null,"NC",null,null,null,null,null,null,null,null,null,null,null,null,null,"PLD",null,null,null,null,null,null,null,null,null,null,null,null,null,"FA UMO",null,null,null,null,null,null,"RC",null,null,null,null,null,null,null,null,null,null,null,null,null,null,null,null,null,null,null,null,null,null,null,null,null,null,null,null,null,null,"SENTINELLE T33"]
["S1","CPL","KONATÉ","PLD",null,null,null,null,null,null,null,null,null,null,null,null,"GILLOIS",null,"GILLOIS",null,null,null,null,"IEC PL",null,null,null,null,null,null,"IEC PL",null,null,null,null,null,null,null,null,null,"AEROPORT",null,null,null,"COND PERM",null,"TEST SC2",null,null,null,null,null,null,null,null,null,null,"AEROPORT",null,null,null,null,null,null,null,"AP 354-5 LA COURTINE SOUTIEN ETLO",null,null,null,null,null,null,null,null,null,null,null,"CAMP REGIMENTAIRE LCT",null,null,null,null,null,null,null,null,null,null,null,null,null,null,null,null,null,null,null,null,null,null,null,null,null,null,null,null,null,null,null,null,null,null,null,null,null,null,null,null,null,null,null,"FA UMO",null,null,null,null,null,null,"RC",null,null,null,null,null,null,null,null,null,null,null,null,null,null,null,null,null,null,null,null,null,null,null,null,null,"FFCI - COTE D'IVOIRE"]
["S1","CPL","PATHA","LIBAN",null,null,null,null,null,null,null,null,null,null,null,null,null,null,null,null,null,null,null,null,null,null,null,null,null,null,null,null,null,null,null,null,null,null,null,null,null,null,null,null,null,null,null,null,null,null,null,null,null,null,null,null,null,null,"RCI",null,null,null,null,null,null,null,null,null,null,null,null,null,"RCI",null,null,null,null,null,null,null,null,null,null,null,null,null,null,null,null,null,null,null,null,null,null,null,null,null,null,null,null,null,null,null,null,null,null,null,null,null,null,null,null,null,null,null,null,null,null,null,null,"FA UMO",null,null,null,null,null,null,"RC",null,null,null,null,null,null,null,null,null,null,null,null,null,null,null,null,null,null,null,null,null,null,null,null,null,null,null,null,null,null,"SENTINELLE T33"]
["S1","CPL","MAHAGNE","LIBAN",null,null,null,null,null,null,null,null,null,null,null,null,null,null,null,null,null,null,null,null,null,null,null,null,"LIBAN",null,null,null,null,null,null,null,null,null,null,null,null,null,null,null,null,null,null,null,null,null,null,null,null,null,null,null,null,null,"LIBAN",null,null,null,null,null,null,null,null,null,null,null,null,null,null,null,null,null,null,null,null,null,null,null,null,null,null,null,null,null,null,null,null,null,null,null,null,null,null,null,null,null,null,null,null,null,null,null,"ENCADREMENT FMIR",null,null,null,null,null,null,null,null,null,null,null,null,null,null,"FA UMO",null,null,null,null,null,null,"RC",null,null,null,null,null,null,null,null,null,null,null,null,null,null,null,null,null,null,null,null,null,null,null,null,null,null,null,null,null,null,"SENTINELLE T33"]
["S1","CPL","RICHARDSON","RCA",null,null,null,null,null,null,null,null,null,null,null,null,null,null,null,null,null,null,null,null,null,null,null,null,"RCA",null,null,null,null,null,null,null,null,null,null,null,null,null,null,null,null,null,null,null,null,null,null,null,null,null,null,null,null,null,"RCA",null,null,null,null,null,null,null,null,null,null,null,null,null,null,null,null,null,null,null,null,null,null,null,null,null,null,null,null,null,null,null,null,null,null,null,null,null,null,null,null,null,null,null,null,null,null,null,null,null,null,null,null,null,null,null,null,null,null,null,null,null,null,"FA UMO",null,null,null,null,null,null,"RC",null,null,null,null,null,null,null,null,null,null,null,null,null,null,null,null,null,null,null,null,null,null,null,null,null,null,null,null,null,null,"SENTINELLE T33"]
["S1","CPL","STRAZEL","LA REUNION",null,null,null,null,null,null,null,null,null,null,null,null,null,null,null,null,null,null,null,null,null,null,null,null,"LA REUNION",null,null,null,null,null,null,null,null,null,null,null,null,null,null,null,null,null,null,null,null,null,null,null,null,null,null,null,null,null,"FAZOI",null,null,null,null,null,null,null,null,null,null,null,null,null,null,null,null,null,null,null,null,null,null,null,null,null,null,null,null,null,null,null,null,null,null,"PLD",null,null,null,null,null,null,null,null,null,null,null,null,null,null,null,null,null,null,null,null,null,null,null,null,null,null,null,"FA UMO",null,null,null,null,null,null,"RC",null,null,null,null,null,null,null,null,null,null,null,null,null,null,null,null,null,null,null,null,null,null,null,null,null,null,null,null,null,null,"SENTINELLE T33"]
["S1","1CL","BOURLON","PLD",null,null,null,null,null,null,null,null,null,"COULEURS",null,null,"FA SITTEL",null,null,null,null,null,"AEROPORT",null,null,null,null,null,null,null,null,"AEROPORT",null,null,null,null,null,"VSA","AEROPORT",null,null,null,null,null,null,null,"TEST SC2",null,null,null,null,"AEROPORT",null,null,"PLD",null,null,null,"PLD",null,null,null,null,null,"AEROPORT",null,null,null,null,null,null,null,null,null,null,"AEROPORT",null,null,null,null,null,null,null,null,null,null,null,null,null,null,"SEMAINE",null,null,null,null,null,null,null,null,null,null,null,null,null,null,null,null,null,null,null,null,null,null,null,null,null,null,null,null,null,null,"FA UMO",null,null,null,null,null,null,"RC",null,null,null,null,null,null,null,null,null,null,null,null,null,null,null,null,null,null,null,null,null,null,null,null,null,null,null,null,null,null,null,null,null,null,null,null,null,null,"SEMAINE"]
["S1","1CL","BRISSET","RCA",null,null,null,null,null,null,null,null,null,null,null,null,null,null,null,null,null,null,null,null,null,null,null,null,null,null,null,null,null,null,"RCA",null,null,null,null,null,null,null,null,null,null,null,null,null,null,null,null,null,null,null,null,null,null,null,null,null,null,null,null,null,null,null,null,null,null,null,null,null,null,null,null,null,null,null,null,null,null,null,null,null,null,null,null,null,null,null,null,null,null,null,null,null,null,null,null,null,null,null,null,null,null,null,null,null,null,null,null,null,null,null,null,null,null,null,null,null,null,"FA UMO",null,null,null,null,null,null,"RC",null,null,null,null,null,null,null,null,null,null,null,null,null,null,null,null,null,null,null,null,null,null,null,null,null,null,null,null,null,null,"SENTINELLE T33"]
["S1","1CL","BRONDEAU","PLD",null,null,null,null,null,"FTE TIOR",null,null,null,null,null,null,"FTE TIOR",null,null,null,null,null,null,null,null,null,null,null,null,null,null,"J+N",null,null,null,null,null,"IEC VL",null,null,null,null,null,null,"IEC VL",null,null,null,null,"PLD",null,null,null,null,null,null,null,null,"PLD",null,null,null,null,null,null,null,null,null,null,null,null,null,"CAMP REGIMENTAIRE LCT",null,null,null,null,null,null,null,null,null,null,null,null,null,null,null,null,null,null,null,null,null,null,null,null,null,null,null,null,null,null,null,null,null,null,null,null,null,null,null,null,null,null,null,null,null,null,null,null,"FA UMO",null,null,null,null,null,null,"RC",null,null,null,null,null,null,null,null,null,null,null,null,null,null,null,null,null,null,null,null,null,null,null,null,null,null,null,null,null,null,"SENTINELLE T33"]
["S2","1CL","CLAVEAU","PLD",null,null,null,null,null,"FTE TIOR",null,null,null,null,null,null,"FTE TIOR",null,null,null,null,null,null,"ICC VL",null,null,null,null,null,null,null,"J+N",null,null,null,null,null,null,null,null,null,"PLD",null,null,null,null,null,null,null,null,null,null,null,null,null,null,null,null,null,null,null,null,null,null,null,null,null,null,null,null,null,null,"CAMP REGIMENTAIRE LCT",null,null,null,null,null,null,null,null,null,null,null,null,null,null,null,null,null,null,null,null,null,null,null,null,null,null,null,null,null,null,null,null,null,null,null,null,null,null,null,null,null,null,null,null,null,null,null,null,"FA UMO",null,null,null,null,null,null,"RC",null,null,null,null,null,null,null,null,null,null,null,null,null,null,null,null,null,null,null,null,null,null,null,null,null,null,null,null,null,null,"SENTINELLE T33"]
["S1","1CL","CZERBAKOFF","PLD",null,null,null,null,null,null,null,null,null,null,null,null,"COULEURS",null,null,null,"ARRET MALADIE",null,null,null,null,null,null,null,null,null,"SEMAINE",null,null,null,null,"PLD",null,"PLD",null,null,null,null,null,null,null,null,null,"PLD",null,null,null,null,null,null,null,null,null,null,null,null,null,null,null,"PLD",null,null,null,null,null,null,null,null,"CAMP REGIMENTAIRE LCT",null,null,null,null,null,null,null,null,null,null,null,null,null,null,null,null,null,null,null,null,null,null,null,null,null,null,null,null,null,null,null,null,null,null,null,null,null,null,null,null,null,null,null,null,null,null,null,null,"FA UMO",null,null,null,null,null,null,"RC"]
["S1","1CL","D'AGOSTINO",null,null,null,null,null,null,null,null,null,null,null,null,null,null,null,null,null,null,null,null,null,null,null,null,null,null,null,null,null,null,null,null,null,null,null,null,null,null,null,null,null,null,null,null,null,null,null,null,"AR",null,"AR","ARRET MALADIE",null,null,null,null,null,null,null,null,"INSTANCE DE REFORME",null,null,null,null,null,null,null,null,"INSTANCE DE REFORME",null,null,null,null,null,null,"INSTANCE DE REFORME",null,null,null,null,null,null,"INSTANCE DE REFORME",null,null,null,null,null,null,"INSTANCE DE REFORME",null,null,null,null,null,null,"INSTANCE DE REFORME",null,null,null,null,null,null,"INSTANCE DE REFORME",null,null,null,null,null,null,"INSTANCE DE REFORME",null,null,null,null,null,null,"INSTANCE DE REFORME",null,null,null,null,null,null,"INSTANCE DE REFORME",null,null,null,null,null,null,"INSTANCE DE REFORME",null,null,null,null,null,null,"INSTANCE DE REFORME",null,null,null,null,null,null,"INSTANCE DE REFORME",null,null,null,null,null,null,"INSTANCE DE REFORME",null,null,null,null,null,null,"INSTANCE DE REFORME",null,null,null,null,null,null,"INSTANCE DE REFORME",null,null,null,null,null,null,"INSTANCE DE REFORME"]
["S1","1CL","DESCHAMPS","PLD",null,null,null,null,null,null,null,null,"SC1",null,null,null,null,null,null,null,null,null,null,null,null,null,null,null,null,null,null,null,null,null,"PLD",null,null,null,null,null,null,null,null,null,null,null,null,null,null,null,null,null,null,null,null,null,null,null,null,null,null,null,null,null,null,null,null,null,null,null,null,"MCF CAYLUS","CAMP REGIMENTAIRE LCT",null,null,null,null,null,null,null,null,null,null,null,null,null,null,null,null,null,null,null,null,null,null,null,null,null,null,null,null,null,null,null,null,null,null,null,null,null,null,null,null,null,null,null,null,null,null,null,null,"FA UMO",null,null,null,null,null,null,"RC",null,null,null,null,null,null,null,null,null,null,null,null,null,null,null,null,null,null,null,null,null,null,null,null,null,"DOM COM - GUYANE"]
["S1","1CL","GAY","PLD",null,null,null,null,null,"FTE TIOR",null,null,null,null,null,null,"FTE TIOR",null,null,null,null,null,null,null,null,null,null,null,null,null,null,"J+N",null,null,null,null,null,null,null,null,null,null,null,null,"PLD",null,null,null,null,null,null,null,null,null,null,null,null,null,null,null,null,null,null,null,null,null,null,null,null,null,null,null,"CAMP REGIMENTAIRE LCT",null,null,null,null,null,null,null,null,null,null,null,null,null,null,null,null,null,null,null,null,null,null,null,null,null,null,null,null,null,null,null,null,null,null,null,null,null,null,null,null,null,null,null,null,null,null,null,null,"FA UMO",null,null,null,null,null,null,"RC",null,null,null,null,null,null,null,null,null,null,null,null,null,null,null,null,null,null,null,null,null,null,null,null,null,null,null,null,null,null,"SENTINELLE T33"]
["S1","1CL","HOKAUPOKO","PLD",null,null,null,null,null,"FTE TIOR",null,null,null,null,null,null,"FTE TIOR",null,null,null,null,null,null,"ICC VL",null,null,null,null,null,null,null,"J+N",null,null,null,null,null,null,null,null,null,null,null,null,null,null,null,null,null,"PLD",null,null,null,null,null,null,null,null,"PLD",null,null,null,null,null,null,null,null,null,null,null,null,null,"CAMP REGIMENTAIRE LCT",null,null,null,null,null,null,null,null,null,null,null,null,null,null,null,null,null,null,null,null,null,null,null,null,null,null,null,null,null,null,null,null,null,null,null,null,null,null,null,null,null,null,null,null,null,null,null,null,"FA UMO",null,null,null,null,null,null,"RC",null,null,null,null,null,null,null,null,null,null,null,null,null,null,null,null,null,null,null,null,null,null,null,null,null,null,null,null,null,null,"SENTINELLE T33"]
["S1","1CL","HUBERT","FTS AUX SAN",null,null,null,null,null,null,null,null,null,null,null,null,null,null,null,null,null,null,null,null,null,null,null,null,null,null,null,null,null,null,null,null,null,null,null,null,null,null,null,null,null,null,null,null,null,null,null,null,null,null,null,null,null,null,"FTS",null,null,null,"ARRET MALADIE"]
["S1","1CL","LE BRETON","PLD",null,null,null,null,null,"PREPA SC2",null,null,null,null,null,null,"SC2 INITIAL",null,null,null,null,null,null,"SC2 INITIAL",null,null,null,null,null,null,null,null,null,null,null,null,null,"IEC PL",null,null,null,null,null,null,"IEC PL",null,null,null,null,null,null,"ICC  PL",null,null,null,null,null,null,"ICC  PL",null,null,null,null,null,null,null,null,null,null,null,null,"MCF CAYLUS",null,null,null,null,null,null,null,null,null,null,null,null,null,null,null,null,null,null,null,null,null,null,null,null,null,null,null,null,null,null,null,null,null,null,null,null,null,null,null,null,null,null,null,null,null,null,null,null,null,"FA UMO",null,null,null,null,null,null,"RC",null,null,null,null,null,null,null,null,null,null,null,null,null,null,null,null,null,null,null,null,null,null,null,null,null,"DOM COM - GUYANE"]
["S1","1CL","LE STRAT","ANTILLES",null,null,null,null,null,null,null,null,null,null,null,null,null,null,null,null,null,null,null,null,null,null,null,null,"ANTILLES",null,null,null,null,null,null,null,null,null,null,null,null,null,null,null,"PLD","PLD",null,null,null,null,null,null,null,null,null,null,null,null,"PLD",null,null,null,null,null,null,null,null,null,null,null,null,null,"CAMP REGIMENTAIRE LCT",null,null,null,null,null,null,null,null,null,null,null,null,null,null,null,null,null,null,null,"CANJUERS",null,null,null,"CANJUERS",null,null,null,null,null,null,null,null,null,null,null,null,null,null,null,null,null,null,null,null,null,null,null,null,"FA UMO",null,null,null,null,null,null,"RC",null,null,null,null,null,null,null,null,null,null,null,null,null,null,null,null,null,null,null,null,null,null,null,null,null,null,null,null,null,null,"SENTINELLE T33"]
["S1","CPL","MARTIN","PLD",null,null,null,null,null,null,null,null,null,null,null,null,"SEMAINE",null,null,null,null,null,null,"FA VAB",null,null,null,null,null,null,"FA VAB",null,null,null,null,null,null,"FA VAB",null,null,null,null,null,null,"PLD",null,null,null,null,null,null,null,null,null,null,null,null,null,null,null,null,null,null,null,null,null,null,null,null,null,null,null,"CAMP REGIMENTAIRE LCT",null,null,null,null,null,null,null,null,null,null,null,null,null,null,null,null,null,null,null,null,null,null,null,null,null,null,null,null,null,null,null,null,null,null,null,null,null,null,null,null,null,null,null,null,null,null,null,null,"FA UMO",null,null,null,null,null,null,"RC",null,null,null,null,null,null,null,null,null,null,null,null,null,null,null,null,null,null,null,null,null,null,null,null,null,null,null,null,null,null,"SENTINELLE T33"]
["S1","1CL","PASCALIN","ANTILLES",null,null,null,null,null,null,null,null,null,null,null,null,null,null,null,null,null,null,null,null,null,null,null,null,"ANTILLES",null,null,null,null,null,null,null,null,null,null,null,null,null,"PLD",null,null,null,null,null,null,null,null,"PLD",null,null,null,null,null,null,"PLD",null,null,null,null,null,null,null,null,null,null,null,null,null,"CAMP REGIMENTAIRE LCT",null,null,null,null,null,null,null,null,null,null,null,null,null,null,null,null,null,null,null,null,null,null,null,null,null,null,null,null,null,null,null,null,null,null,null,null,null,null,null,null,null,null,null,null,null,null,null,null,"FA UMO",null,null,null,null,null,null,"RC",null,null,null,null,null,null,null,null,null,null,null,null,null,null,null,null,null,null,null,null,null,null,null,null,null,null,null,null,null,null,"SENTINELLE T33"]
["S1","1CL","PIETRZYK","PLD",null,null,null,null,null,"FTE TIOR",null,null,null,null,null,null,"FTE TIOR",null,null,null,null,null,null,null,null,null,null,"MODULE CMA (CeFOS)",null,null,null,null,null,null,"MODULE CMA (CeFOS)",null,null,null,null,null,null,"MODULE OPS (CeFOS)",null,null,null,null,null,null,null,"PLD",null,null,null,null,null,null,null,null,"PLD",null,null,null,null,null,null,null,null,null,null,null,null,null,"CAMP REGIMENTAIRE LCT",null,null,null,null,null,null,null,null,null,null,null,null,null,null,null,null,null,null,null,null,null,null,null,null,null,null,null,null,null,null,null,null,null,null,null,null,null,null,null,null,null,null,null,null,null,null,null,null,"FA UMO",null,null,null,null,null,null,"RC",null,null,null,null,null,null,null,null,null,null,null,null,null,null,null,null,null,null,null,null,null,null,null,null,null,null,null,null,null,null,"SENTINELLE T33"]
["S1","1CL","THIERY","PLD",null,null,null,null,null,"FTE TIOR",null,null,null,null,null,null,"FTE TIOR",null,null,null,null,null,null,null,null,null,null,null,null,null,null,"J+N",null,null,null,null,null,"IEC VL",null,null,null,null,null,null,"IEC VL",null,null,null,null,"PLD",null,null,null,null,null,null,null,null,"PLD",null,null,null,null,null,null,null,null,null,null,null,null,null,"CAMP REGIMENTAIRE LCT",null,null,null,null,null,null,null,null,null,null,null,null,null,null,null,null,null,null,null,null,null,null,null,null,null,null,null,null,null,null,null,null,null,null,null,null,null,null,null,null,null,null,null,null,null,null,null,null,"FA UMO",null,null,null,null,null,null,"RC",null,null,null,null,null,null,null,null,null,null,null,null,null,null,null,null,null,null,null,null,null,null,null,null,null,null,null,null,null,null,"SENTINELLE T33"]

{"sheet":"2° sem 2019","index":1,"n_rows":66,"n_cols":187,"rows_kept":66,"cut":false,"hidden":false,"merged":[[1,150,1,156],[1,157,1,163],[1,164,1,170],[1,171,1,177],[1,178,1,184],[1,115,1,121],[1,122,1,128],[1,129,1,135],[1,136,1,142],[1,143,1,149],[1,80,1,86],[1,87,1,93],[1,94,1,100],[1,101,1,107],[1,108,1,114],[1,45,1,51],[1,52,1,58],[1,59,1,65],[1,66,1,72],[1,73,1,79],[1,10,1,16],[1,17,1,23],[1,24,1,30],[1,31,1,37],[1,38,1,44],[13,178,13,184],[13,185,13,186],[13,66,13,72],[13,73,13,79],[13,80,13,86],[13,87,13,93],[13,94,13,100],[13,101,13,107],[13,108,13,114],[13,115,13,121],[13,122,13,128],[13,157,13,163],[13,171,13,177],[0,0,1,2],[0,3,0,33],[0,34,0,64],[1,3,1,9],[13,164,13,170],[0,65,0,94],[0,95,0,125],[0,126,0,155],[0,156,0,186],[13,0,13,2],[13,129,13,135],[13,136,13,142],[13,143,13,149],[13,150,13,156],[13,3,13,9],[13,10,13,16],[13,52,13,58],[13,59,13,65],[13,17,13,23],[13,24,13,30],[13,31,13,37],[13,38,13,44],[13,45,13,51]]}
[{"$f":"AnnéeCalendrier","v":2019},null,null,"JUILLET",null,null,null,null,null,null,null,null,null,null,null,null,null,null,null,null,null,null,null,null,null,null,null,null,null,null,null,null,null,null,"AOUT",null,null,null,null,null,null,null,null,null,null,null,null,null,null,null,null,null,null,null,null,null,null,null,null,null,null,null,null,null,null,"SEPTEMBRE",null,null,null,null,null,null,null,null,null,null,null,null,null,null,null,null,null,null,null,null,null,null,null,null,null,null,null,null,null,"OCTOBRE",null,null,null,null,null,null,null,null,null,null,null,null,null,null,null,null,null,null,null,null,null,null,null,null,null,null,null,null,null,null,"NOVEMBRE",null,null,null,null,null,null,null,null,null,null,null,null,null,null,null,null,null,null,null,null,null,null,null,null,null,null,null,null,null,"DECEMBRE"]
[null,null,null,{"$f":"\"S\"&\" \"&TEXT(WEEKNUM(D4),\"jj\")","v":"S 27"},null,null,null,null,null,null,{"$f":"\"S\"&\" \"&TEXT(WEEKNUM(K4),\"jj\")","v":"S 28"},null,null,null,null,null,null,{"$f":"\"S\"&\" \"&TEXT(WEEKNUM(R4),\"jj\")","v":"S 29"},null,null,null,null,null,null,{"$f":"\"S\"&\" \"&TEXT(WEEKNUM(Y4),\"jj\")","v":"S 30"},null,null,null,null,null,null,{"$f":"\"S\"&\" \"&TEXT(WEEKNUM(AF4),\"jj\")","v":"S 31"},null,null,null,null,null,null,"S32",null,null,null,null,null,null,"S33",null,null,null,null,null,null,"S34",null,null,null,null,null,null,"S35",null,null,null,null,null,null,"S36",null,null,null,null,null,null,"S37",null,null,null,null,null,null,"S38",null,null,null,null,null,null,"S39",null,null,null,null,null,null,"S40",null,null,null,null,null,null,"S41",null,null,null,null,null,null,"S42",null,null,null,null,null,null,"S43",null,null,null,null,null,null,"S44",null,null,null,null,null,null,"S45",null,null,null,null,null,null,"S46",null,null,null,null,null,null,"S47",null,null,null,null,null,null,"S48",null,null,null,null,null,null,"S49",null,null,null,null,null,null,"S50",null,null,null,null,null,null,"S51",null,null,null,null,null,null,"S52"]
[null,null,null,{"$f":"TEXT(WEEKDAY(D4,1), \"jjj\")","v":"lun"},{"$f":"TEXT(WEEKDAY(E4,1), \"jjj\")","v":"mar"},"mer","jeu","ven","sam","dim","lun","mar","mer","jeu","ven","sam","dim","lun","mar","mer","jeu","ven","sam","dim","lun","mar","mer","jeu","ven","sam","dim","lun","mar","mer","jeu","ven","sam","dim","lun","mar","mer","jeu","ven","sam","dim","lun","mar","mer","jeu","ven","sam","dim","lun","mar","mer","jeu","ven","sam","dim","lun","mar","mer","jeu","ven","sam","dim","lun","mar",{"$f":"TEXT(WEEKDAY(BQ4,1), \"jjj\")","v":"mer"},"jeu","ven","sam","dim","lun","mar","mer","jeu","ven","sam","dim","lun","mar","mer","jeu","ven","sam","dim","lun","mar","mer","jeu","ven","sam","dim","lun","mar","mer","jeu","ven","sam","dim","lun","mar","mer","jeu","ven","sam","dim","lun","mar","mer","jeu","ven","sam","dim","lun","mar","mer","jeu","ven","sam","dim","lun","mar","mer","jeu","ven","sam","dim","lun","mar","mer",{"$f":"TEXT(WEEKDAY(EC4,1), \"jjj\")","v":"jeu"},"ven","sam","dim","lun","mar","mer","jeu","ven","sam","dim","lun","mar","mer","jeu","ven","sam","dim","lun","mar","mer","jeu","ven","sam","dim","lun","mar","mer","jeu","ven","sam","dim","lun","mar","mer","jeu","ven","sam","dim","lun","mar","mer","jeu","ven","sam","dim","lun","mar","mer","jeu","ven","sam"]
[null,null,null,"2019-07-01","2019-07-02","2019-07-03","2019-07-04","2019-07-05","2019-07-06","2019-07-07","2019-07-08","2019-07-09","2019-07-10","2019-07-11","2019-07-12","2019-07-13","2019-07-14","2019-07-15","2019-07-16","2019-07-17","2019-07-18","2019-07-19","2019-07-20","2019-07-21","2019-07-22","2019-07-23","2019-07-24","2019-07-25","2019-07-26","2019-07-27","2019-07-28","2019-07-29","2019-07-30","2019-07-31","2019-08-01","2019-08-02","2019-08-03","2019-08-04","2019-08-05","2019-08-06","2019-08-07","2019-08-08","2019-08-09","2019-08-10","2019-08-11","2019-08-12","2019-08-13","2019-08-14","2019-08-15","2019-08-16","2019-08-17","2019-08-18","2019-08-19","2019-08-20","2019-08-21","2019-08-22","2019-08-23","2019-08-24","2019-08-25","2019-08-26","2019-08-27","2019-08-28","2019-08-29","2019-08-30","2019-08-31","2019-09-01","2019-09-02","2019-09-03","2019-09-04","2019-09-05","2019-09-06","2019-09-07","2019-09-08","2019-09-09","2019-09-10","2019-09-11","2019-09-12","2019-09-13","2019-09-14","2019-09-15","2019-09-16","2019-09-17","2019-09-18","2019-09-19","2019-09-20","2019-09-21","2019-09-22","2019-09-23","2019-09-24","2019-09-25","2019-09-26","2019-09-27","2019-09-28","2019-09-29","2019-09-30","2019-10-01","2019-10-02","2019-10-03","2019-10-04","2019-10-05","2019-10-06","2019-10-07","2019-10-08","2019-10-09","2019-10-10","2019-10-11","2019-10-12","2019-10-13","2019-10-14","2019-10-15","2019-10-16","2019-10-17","2019-10-18","2019-10-19","2019-10-20","2019-10-21","2019-10-22","2019-10-23","2019-10-24","2019-10-25","2019-10-26","2019-10-27","2019-10-28","2019-10-29","2019-10-30","2019-10-31","2019-11-01","2019-11-02","2019-11-03","2019-11-04","2019-11-05","2019-11-06","2019-11-07","2019-11-08","2019-11-09","2019-11-10","2019-11-11","2019-11-12","2019-11-13","2019-11-14","2019-11-15","2019-11-16","2019-11-17","2019-11-18","2019-11-19","2019-11-20","2019-11-21","2019-11-22","2019-11-23","2019-11-24","2019-11-25","2019-11-26","2019-11-27","2019-11-28","2019-11-29","2019-11-30","2019-12-01","2019-12-02","2019-12-03","2019-12-04","2019-12-05","2019-12-06","2019-12-07","2019-12-08","2019-12-09","2019-12-10","2019-12-11","2019-12-12","2019-12-13","2019-12-14","2019-12-15","2019-12-16","2019-12-17","2019-12-18","2019-12-19","2019-12-20","2019-12-21","2019-12-22","2019-12-23","2019-12-24","2019-12-25","2019-12-26","2019-12-27","2019-12-28","2019-12-29","2019-12-30","2019-12-31"]
[null,null,null,"STL T33"]
[null,null,null,"AGUERRISSEMENT",null,null,null,null,null,null,null,null,"TIR",null,null,null,"DRAPEAU + 2UP1 BOURG EN BRESSE","PLD"]
[null,null,null,"FA VAB N°6"]
[null,null,null,"SERVICE PETITE SEMAINE"]
[null,null,null,"FGI 2",null,null,null,null,null,null,null,null,null,null,null,null,null,null,null,null,null,null,null,null,null,null,null,null,null,null,null,null,null,null,null,null,null,null,null,null,null,null,null,null,null,null,null,null,null,null,null,null,null,null,null,null,null,null,null,null,null,null,null,null,null,null,null,null,null,null,null,null,null,null,null,null,null,null,null,null,null,null,null,null,null,null,null,null,null,null,null,null,null,null,null,null,null,null,null,null,null,null,null,null,null,null,null,null,null,null,null,null,null,null,null,null,null,null,null,null,"FTS 2"]
[]
[]
[]
[null,null,null,"SAUTS ETAP",null,null,null,null,null,null,null,null,null,null,null,null,null,null,null,null,null,null,null,null,null,null,null,null,null,null,null,null,null,null,null,null,null,null,null,null,null,null,null,null,null,null,null,null,null,null,null,null,null,null,null,null,null,null,"SAUTS ETAP",null,null,null,null,null,null,null,"STAFF RIDE S.TAP",null,null,null,null,null,null,null,null,null,null,null,null,"SAUTS ETAP",null,null,null,null,null,null,null,null,null,null,null,null,null,"SAUTS ETAP",null,null,null,null,null,null,null,null,null,null,null,null,null,null,null,null,null,null,null,null,null,null,null,null,null,null,null,null,null,null,null,null,null,null,"SAUTS ETAP"]
[null,null,null,"S 27",null,null,null,null,null,null,"S 28",null,null,null,null,null,null,"S 29",null,null,null,null,null,null,"S 30",null,null,null,null,null,null,"S 31",null,null,null,null,null,null,"S 32",null,null,null,null,null,null,"S 33",null,null,null,null,null,null,"S 34",null,null,null,null,null,null,"S 35",null,null,null,null,null,null,"S 36",null,null,null,null,null,null,"S 37",null,null,null,null,null,null,"S 38",null,null,null,null,null,null,"S 39",null,null,null,null,null,null,"S 40",null,null,null,null,null,null,"S 41",null,null,null,null,null,null,"S 42",null,null,null,null,null,null,"S 43",null,null,null,null,null,null,"S 44",null,null,null,null,null,null,"S 45",null,null,null,null,null,null,"S 46",null,null,null,null,null,null,"S 47",null,null,null,null,null,null,"S 48",null,null,null,null,null,null,"S 49",null,null,null,null,null,null,"S 50",null,null,null,null,null,null,"S 51",null,null,null,null,null,null,"S 52",null,null,null,null,null,null,"S 01","S53"]
["SECTION","GRADE","NOM","2018-07-01","2018-07-02","2018-07-03","2018-07-04","2018-07-05","2018-07-06","2018-07-07","2018-07-08","2018-07-09","2018-07-10","2018-07-11","2018-07-12","2018-07-13","2018-07-14","2018-07-15","2018-07-16","2018-07-17","2018-07-18","2018-07-19","2018-07-20","2018-07-21","2018-07-22","2018-07-23","2018-07-24","2018-07-25","2018-07-26","2018-07-27","2018-07-28","2018-07-29","2018-07-30","2018-07-31","2018-08-01","2018-08-02","2018-08-03","2018-08-04","2018-08-05","2018-08-06","2018-08-07","2018-08-08","2018-08-09","2018-08-10","2018-08-11","2018-08-12","2018-08-13","2018-08-14","2018-08-15","2018-08-16","2018-08-17","2018-08-18","2018-08-19","2018-08-20","2018-08-21","2018-08-22","2018-08-23","2018-08-24","2018-08-25","2018-08-26","2018-08-27","2018-08-28","2018-08-29","2018-08-30","2018-08-31","2018-09-01","2018-09-02","2018-09-03","2018-09-04","2018-09-05","2018-09-06","2018-09-07","2018-09-08","2018-09-09","2018-09-10","2018-09-11","2018-09-12","2018-09-13","2018-09-14","2018-09-15","2018-09-16","2018-09-17","2018-09-18","2018-09-19","2018-09-20","2018-09-21","2018-09-22","2018-09-23","2018-09-24","2018-09-25","2018-09-26","2018-09-27","2018-09-28","2018-09-29","2018-09-30","2018-10-01","2018-10-02","2018-10-03","2018-10-04","2018-10-05","2018-10-06","2018-10-07","2018-10-08","2018-10-09","2018-10-10","2018-10-11","2018-10-12","2018-10-13","2018-10-14","2018-10-15","2018-10-16","2018-10-17","2018-10-18","2018-10-19","2018-10-20","2018-10-21","2018-10-22","2018-10-23","2018-10-24","2018-10-25","2018-10-26","2018-10-27","2018-10-28","2018-10-29","2018-10-30","2018-10-31","2018-11-01","2018-11-02","2018-11-03","2018-11-04","2018-11-05","2018-11-06","2018-11-07","2018-11-08","2018-11-09","2018-11-10","2018-11-11","2018-11-12","2018-11-13","2018-11-14","2018-11-15","2018-11-16","2018-11-17","2018-11-18","2018-11-19","2018-11-20","2018-11-21","2018-11-22","2018-11-23","2018-11-24","2018-11-25","2018-11-26","2018-11-27","2018-11-28","2018-11-29","2018-11-30","2018-12-01","2018-12-02","2018-12-03","2018-12-04","2018-12-05","2018-12-06","2018-12-07","2018-12-08","2018-12-09","2018-12-10","2018-12-11","2018-12-12","2018-12-13","2018-12-14","2018-12-15","2018-12-16","2018-12-17","2018-12-18","2018-12-19","2018-12-20","2018-12-21","2018-12-22","2018-12-23","2018-12-24","2018-12-25","2018-12-26","2018-12-27","2018-12-28","2018-12-29","2018-12-30","2018-12-31"]
["S1 / TAP","LTN","SAMELOR",null,null,null,null,null,null,null,null,null,null,null,null,null,null,null,null,null,null,null,null,null,null,null,null,null,null,null,null,null,null,null,null,null,null,null,null,null,null,null,null,null,null,null,null,null,null,null,null,null,null,null,null,null,null,null,null,null,null,null,null,null,null,null,"STAFF RIDE S.TAP",null,null,null,null,null,null,null,null,null,null,null,null,"SAUTS ETAP"]
[null,"SCH","RAMEL",null,null,null,null,null,null,null,null,null,null,null,null,null,null,null,null,null,null,null,null,null,null,null,null,null,null,null,null,null,null,null,null,null,null,null,null,null,null,null,null,null,null,null,null,null,null,null,null,null,null,null,null,null,null,null,null,null,null,null,null,null,null,null,"STAFF RIDE S.TAP",null,null,null,null,null,null,null,null,null,null,null,null,"SAUTS ETAP"]
["S1 / TAP","SGT","MOHIMONT"]
["S1","SGT","DOVERGNE"]
["S1","CC1","FALSARELLA",null,null,null,null,null,null,null,null,null,null,null,null,null,null,null,null,null,null,null,null,null,null,null,null,null,null,null,null,null,null,null,null,null,null,null,null,null,null,null,null,null,null,null,null,null,null,null,null,null,null,null,null,null,null,null,null,null,null,null,null,null,null,null,"STAFF RIDE S.TAP",null,null,null,null,null,null,null,null,null,null,null,null,"SAUTS ETAP"]
["S1 / TAP","CC1","GOMEZ-GRANA",null,null,null,null,null,null,null,null,null,null,null,null,null,null,null,null,null,null,null,null,null,null,null,null,null,null,null,null,null,null,null,null,null,null,null,null,null,null,null,null,null,null,null,null,null,null,null,null,null,null,null,null,null,null,null,null,null,null,null,null,null,null,null,"STAFF RIDE S.TAP",null,null,null,null,null,null,null,null,null,null,null,null,"SAUTS ETAP"]
["S1 / TAP","CC1","HUYGHE",null,null,null,null,null,null,null,null,null,null,null,null,null,null,null,null,null,null,null,null,null,null,null,null,null,null,null,null,null,null,null,null,null,null,null,null,null,null,null,null,null,null,null,null,null,null,null,null,null,null,null,null,null,null,null,null,null,null,null,null,null,null,null,"STAFF RIDE S.TAP",null,null,null,null,null,null,null,null,null,null,null,null,"SAUTS ETAP"]
["S1 / TAP","CC1","LEBOURG",null,null,null,null,null,null,null,null,null,null,null,null,null,null,null,null,null,null,null,null,null,null,null,null,null,null,null,null,null,null,null,null,null,null,null,null,null,null,null,null,null,null,null,null,null,null,null,null,null,null,null,null,null,null,null,null,null,null,null,null,null,null,null,"STAFF RIDE S.TAP",null,null,null,null,null,null,null,null,null,null,null,null,"SAUTS ETAP"]
["S1 / TAP","CCH","AHMED",null,null,null,null,null,null,null,null,null,null,null,null,null,null,null,null,null,null,null,null,null,null,null,null,null,null,null,null,null,null,null,null,null,null,null,null,null,null,null,null,null,null,null,null,null,null,null,null,null,null,null,null,null,null,null,null,null,null,null,null,null,null,null,"STAFF RIDE S.TAP",null,null,null,null,null,null,null,null,null,null,null,null,"SAUTS ETAP"]
["S1 / TAP","CCH","ANLLI",null,null,null,null,null,null,null,null,null,null,null,null,null,null,null,null,null,null,null,null,null,null,null,null,null,null,null,null,null,null,null,null,null,null,null,null,null,null,null,null,null,null,null,null,null,null,null,null,null,null,null,null,null,null,null,null,null,null,null,null,null,null,null,"STAFF RIDE S.TAP",null,null,null,null,null,null,null,null,null,null,null,null,"SAUTS ETAP"]
["S1 / TAP","CCH","BACO","FFDJ - DJIBOUTI"]
["S1 / TAP","CCH","BERNOUD"]
["S1","CCH","CREBASSA",null,null,null,null,null,null,null,null,null,null,null,null,null,null,null,null,null,null,null,null,null,null,null,null,null,null,null,null,null,null,null,null,null,null,null,null,null,null,null,null,null,null,null,null,null,null,null,null,null,null,null,null,null,null,null,null,null,null,null,null,null,null,null,"STAFF RIDE S.TAP",null,null,null,null,null,null,null,null,null,null,null,null,"SAUTS ETAP"]
["S1 / TAP","CCH","GERMAIN",null,null,null,null,null,null,null,null,null,null,null,null,null,null,null,null,null,null,null,null,null,null,null,null,null,null,null,null,null,null,null,null,null,null,null,null,null,null,null,null,null,null,null,null,null,null,null,null,null,null,null,null,null,null,null,null,null,null,null,null,null,null,null,"STAFF RIDE S.TAP",null,null,null,null,null,null,null,null,null,null,null,null,"SAUTS ETAP"]
["S1 / TAP","CCH","HEDDAD"]
["S1","CPL","JAWORSKI"]
["S1","CCH","PHILLIPS",null,null,null,null,null,null,null,null,null,null,null,null,null,null,null,null,null,null,null,null,null,null,null,null,null,null,null,null,null,null,null,null,null,null,null,null,null,null,null,null,null,null,null,null,null,null,null,null,null,null,null,null,null,null,null,null,null,null,null,null,null,null,null,"STAFF RIDE S.TAP",null,null,null,null,null,null,null,null,null,null,null,null,"SAUTS ETAP"]
["S1 / TAP","CCH","VERET",null,null,null,null,null,null,null,null,null,null,null,null,null,null,null,null,null,null,null,null,null,null,null,null,null,null,null,null,null,null,null,null,null,null,null,null,null,null,null,null,null,null,null,null,null,null,null,null,null,null,null,null,null,null,null,null,null,null,null,null,null,null,null,"STAFF RIDE S.TAP",null,null,null,null,null,null,null,null,null,null,null,null,"SAUTS ETAP"]
["S1 / TAP","CPL","ANNAERT",null,null,null,null,null,null,null,null,null,null,null,null,null,null,null,null,null,null,null,null,null,null,null,null,null,null,null,null,null,null,null,null,null,null,null,null,null,null,null,null,null,null,null,null,null,null,null,null,null,null,null,null,null,null,null,null,null,null,null,null,null,null,null,"STAFF RIDE S.TAP",null,null,null,null,null,null,null,null,null,null,null,null,"SAUTS ETAP"]
["S1","CPL","BANGELINA"]
["S1 / TAP","1CL","CHOLLAT",null,null,null,null,null,null,null,null,null,null,null,null,null,null,null,null,null,null,null,null,null,null,null,null,null,null,null,null,null,null,null,null,null,null,null,null,null,null,null,null,null,null,null,null,null,null,null,null,null,null,null,null,null,null,null,null,null,null,null,null,null,null,null,"STAFF RIDE S.TAP",null,null,null,null,null,null,null,null,null,null,null,null,"SAUTS ETAP"]
["S1","CPL","COSPOLITE"]
["S1","CPL","DENIS"]
["S1","CPL","FELIP",null,null,null,null,null,null,null,null,null,null,null,null,null,null,null,null,null,null,null,null,null,null,null,null,null,null,null,null,null,null,null,null,null,null,null,null,null,null,null,null,null,null,null,null,null,null,null,null,null,null,null,null,null,null,null,null,null,null,null,null,null,null,null,"STAFF RIDE S.TAP",null,null,null,null,null,null,null,null,null,null,null,null,"SAUTS ETAP"]
["S1 / TAP","CPL","FIMIEZ",null,null,null,null,null,null,null,null,null,null,null,null,null,null,null,null,null,null,null,null,null,null,null,null,null,null,null,null,null,null,null,null,null,null,null,null,null,null,null,null,null,null,null,null,null,null,null,null,null,null,null,null,null,null,null,null,null,null,null,null,null,null,null,"STAFF RIDE S.TAP",null,null,null,null,null,null,null,null,null,null,null,null,"SAUTS ETAP"]
["S1 / TAP","CPL","GOURVENEC","MALI"]
["S1","CPL","GRANATO",null,null,null,null,null,null,null,null,null,null,null,null,null,null,null,null,null,null,null,null,null,null,null,null,null,null,null,null,null,null,null,null,null,null,null,null,null,null,null,null,null,null,null,null,null,null,null,null,null,null,null,null,null,null,null,null,null,null,null,null,null,null,null,"STAFF RIDE S.TAP",null,null,null,null,null,null,null,null,null,null,null,null,"SAUTS ETAP"]
["S1","CPL","GRANDCHAMP"]
["S1 / TAP","1CL","HAMZA",null,null,null,null,null,null,null,null,null,null,null,null,null,null,null,null,null,null,null,null,null,null,null,null,null,null,null,null,null,null,null,null,null,null,null,null,null,null,null,null,null,null,null,null,null,null,null,null,null,null,null,null,null,null,null,null,null,null,null,null,null,null,null,"STAFF RIDE S.TAP",null,null,null,null,null,null,null,null,null,null,null,null,"SAUTS ETAP"]
["S1 / TAP","CPL","HIROUF"]
["S1","CPL","KAWASÉ"]
["S1","CPL","KONATÉ","FFCI - COTE D'IVOIRE"]
["S1","CPL","PATHA"]
["S1","CPL","MAHAGNE"]
["S1","CPL","RICHARDSON"]
["S1","CPL","STRAZEL"]
["S1","1CL","BOURLON"]
["S1","1CL","BRISSET"]
["S1","1CL","BRONDEAU"]
["S1 / TAP","1CL","CLAVEAU"]
["S1","1CL","CZERBAKOFF"]
["S1","1CL","DESCHAMPS","DOM COM - GUYANE"]
["S1","1CL","GAY"]
["S1","1CL","HOKAUPOKO"]
["S1","1CL","HUBERT"]
["S1","1CL","LE BRETON","DOM COM - GUYANE"]
["S1","1CL","LE STRAT"]
["S1","1CL","MARTIN"]
["S1","1CL","PASCALIN"]
["S1","1CL","PIETRZYK"]
["S1","1CL","THIERY"]

{"sheet":"spa","index":2,"n_rows":202,"n_cols":19,"rows_kept":202,"cut":false,"hidden":false,"merged":[[2,2,2,4],[0,8,0,11],[17,6,18,18]]}
["LE",{"$f":"C24","v":"2019-05-06"},null,"SPA ","S1",null,"Situation au ",null,{"$f":"C24","v":"2019-05-06"}]
[]
[null,null,null,null,null,"TOTAL"]
[null,"THEORIQUE",{"$f":"SUM(C5:C17)","v":1},{"$f":"SUM(D5:D17)","v":3},{"$f":"SUM(E5:E17)","v":48},{"$f":"SUM(C4:E4)","v":52}]
[null,"PRESENTS (disponibles)",0,0,2,2]
[null,"OPEX / MCD",0,0,3,3]
[null,"OPINT",0,0,0,0]
[null,"MISSIONS",0,0,0,0]
[null,"STAGE INTERNE",1,0,2,3]
[null,"STAGE EXTERNE",0,0,0,0]
[null,"MANŒUVRE /EXERCICE",0,0,0,0]
[null,"SERVICE",0,0,1,1]
[null,"PLD / RC",0,3,38,41]
[null,"ARRET MALADIE",0,0,1,1]
[null,"AI / AR",0,0,0,0]
[null,"RECONV / REFORM / CLM…..",0,0,1,1]
[null,"Prévisions",0,0,0,0]
[null,"ABSENT",{"$f":"SUM(C6,C7,C8,C9,C10,C13,C14,C15,C16,C17,C11)","v":1},{"$f":"SUM(D6,D7,D8,D9,D10,D13,D14,D15,D16,D17,D11)","v":3},{"$f":"SUM(E6,E7,E8,E10,E13,E14,E15,E16,E11)","v":43},47,"QUALIFICATIONS"]
[null,"PRESENTS",{"$f":"C5+C12","v":0},{"$f":"D5+D12","v":0},{"$f":"E5+E12+E9+E17","v":5},5]
[null,null,null,null,null,null,{"$f":"COUNTIF(G22:G202,\"X\")","v":41},{"$f":"COUNTIF(H22:H202,\"X\")","v":30},20,13,39,41,41,25,22,6,2,1,1]
[null,null,null,null,null,null,{"$f":"QUALIF!F2","v":"VL"},{"$f":"QUALIF!G2","v":"PL"},{"$f":"QUALIF!H2","v":"VAB"},{"$f":"QUALIF!I2","v":"SC2"},{"$f":"QUALIF!J2","v":"TIOR"},{"$f":"QUALIF!K2","v":"SC1"},{"$f":"QUALIF!L2","v":"PSC1"},{"$f":"QUALIF!M2","v":"PSE1"},{"$f":"QUALIF!N2","v":"PSE2"},{"$f":"QUALIF!O2","v":"GRIMEUR"},{"$f":"QUALIF!P2","v":"FACQAA"},{"$f":"QUALIF!Q2","v":"FA UMDA"},{"$f":"QUALIF!R2","v":"FS UMDA"}]
[null,null,null,null,null,{"$f":"A22&\" \"&B22","v":" "},{"$f":"IF($B22=\"\",\"\",VLOOKUP($B22:$B22,QUALIF!$C$3:$R$56,4,FALSE))","v":""},{"$f":"IF($B22=\"\",\"\",VLOOKUP($B22:$B22,QUALIF!$C$3:$R$56,5,FALSE))","v":""},{"$f":"IF($B22=\"\",\"\",VLOOKUP($B22:$B22,QUALIF!$C$3:$R$56,6,FALSE))","v":""},{"$f":"IF($B22=\"\",\"\",VLOOKUP($B22:$B22,QUALIF!$C$3:$R$56,7,FALSE))","v":""},{"$f":"IF($B22=\"\",\"\",VLOOKUP($B22:$B22,QUALIF!$C$3:$R$56,8,FALSE))","v":""},{"$f":"IF($B22=\"\",\"\",VLOOKUP($B22:$B22,QUALIF!$C$3:$R$56,9,FALSE))","v":""},{"$f":"IF($B22=\"\",\"\",VLOOKUP($B22:$B22,QUALIF!$C$3:$R$56,10,FALSE))","v":""},{"$f":"IF($B22=\"\",\"\",VLOOKUP($B22:$B22,QUALIF!$C$3:$R$56,11,FALSE))","v":""},{"$f":"IF($B22=\"\",\"\",VLOOKUP($B22:$B22,QUALIF!$C$3:$R$56,12,FALSE))","v":""},{"$f":"IF($B22=\"\",\"\",VLOOKUP($B22:$B22,QUALIF!$C$3:$R$56,13,FALSE))","v":""},{"$f":"IF($B22=\"\",\"\",VLOOKUP($B22:$B22,QUALIF!$C$3:$R$56,14,FALSE))","v":""},{"$f":"IF($B22=\"\",\"\",VLOOKUP($B22:$B22,QUALIF!$C$3:$R$56,15,FALSE))","v":""},{"$f":"IF($B22=\"\",\"\",VLOOKUP($B22:$B22,QUALIF!$C$3:$R$56,16,FALSE))","v":""}]
[null,null,null,null,null,{"$f":"A23&\" \"&B23","v":" "},{"$f":"IF($B23=\"\",\"\",VLOOKUP($B23:$B23,QUALIF!$C$3:$R$56,4,FALSE))","v":""},{"$f":"IF($B23=\"\",\"\",VLOOKUP($B23:$B23,QUALIF!$C$3:$R$56,5,FALSE))","v":""},{"$f":"IF($B23=\"\",\"\",VLOOKUP($B23:$B23,QUALIF!$C$3:$R$56,6,FALSE))","v":""},{"$f":"IF($B23=\"\",\"\",VLOOKUP($B23:$B23,QUALIF!$C$3:$R$56,7,FALSE))","v":""},{"$f":"IF($B23=\"\",\"\",VLOOKUP($B23:$B23,QUALIF!$C$3:$R$56,8,FALSE))","v":""},{"$f":"IF($B23=\"\",\"\",VLOOKUP($B23:$B23,QUALIF!$C$3:$R$56,9,FALSE))","v":""},{"$f":"IF($B23=\"\",\"\",VLOOKUP($B23:$B23,QUALIF!$C$3:$R$56,10,FALSE))","v":""},{"$f":"IF($B23=\"\",\"\",VLOOKUP($B23:$B23,QUALIF!$C$3:$R$56,11,FALSE))","v":""},{"$f":"IF($B23=\"\",\"\",VLOOKUP($B23:$B23,QUALIF!$C$3:$R$56,12,FALSE))","v":""},{"$f":"IF($B23=\"\",\"\",VLOOKUP($B23:$B23,QUALIF!$C$3:$R$56,13,FALSE))","v":""},{"$f":"IF($B23=\"\",\"\",VLOOKUP($B23:$B23,QUALIF!$C$3:$R$56,14,FALSE))","v":""},{"$f":"IF($B23=\"\",\"\",VLOOKUP($B23:$B23,QUALIF!$C$3:$R$56,15,FALSE))","v":""},{"$f":"IF($B23=\"\",\"\",VLOOKUP($B23:$B23,QUALIF!$C$3:$R$56,16,FALSE))","v":""}]
[null,null,"2019-05-06",null,null," ",{"$f":"IF($B24=\"\",\"\",VLOOKUP($B24:$B24,QUALIF!$C$3:$R$56,4,FALSE))","v":""},{"$f":"IF($B24=\"\",\"\",VLOOKUP($B24:$B24,QUALIF!$C$3:$R$56,5,FALSE))","v":""},{"$f":"IF($B24=\"\",\"\",VLOOKUP($B24:$B24,QUALIF!$C$3:$R$56,6,FALSE))","v":""},{"$f":"IF($B24=\"\",\"\",VLOOKUP($B24:$B24,QUALIF!$C$3:$R$56,7,FALSE))","v":""},{"$f":"IF($B24=\"\",\"\",VLOOKUP($B24:$B24,QUALIF!$C$3:$R$56,8,FALSE))","v":""},{"$f":"IF($B24=\"\",\"\",VLOOKUP($B24:$B24,QUALIF!$C$3:$R$56,9,FALSE))","v":""},{"$f":"IF($B24=\"\",\"\",VLOOKUP($B24:$B24,QUALIF!$C$3:$R$56,10,FALSE))","v":""},{"$f":"IF($B24=\"\",\"\",VLOOKUP($B24:$B24,QUALIF!$C$3:$R$56,11,FALSE))","v":""},{"$f":"IF($B24=\"\",\"\",VLOOKUP($B24:$B24,QUALIF!$C$3:$R$56,12,FALSE))","v":""},{"$f":"IF($B24=\"\",\"\",VLOOKUP($B24:$B24,QUALIF!$C$3:$R$56,13,FALSE))","v":""},{"$f":"IF($B24=\"\",\"\",VLOOKUP($B24:$B24,QUALIF!$C$3:$R$56,14,FALSE))","v":""},{"$f":"IF($B24=\"\",\"\",VLOOKUP($B24:$B24,QUALIF!$C$3:$R$56,15,FALSE))","v":""},{"$f":"IF($B24=\"\",\"\",VLOOKUP($B24:$B24,QUALIF!$C$3:$R$56,16,FALSE))","v":""}]
["LTN","SAMELOR","FGE 2","FORMATION INTERNE",null,"LTN SAMELOR",{"$f":"IF($B25=\"\",\"\",VLOOKUP($B25:$B25,QUALIF!$C$3:$R$56,4,FALSE))","v":"X"},{"$f":"IF($B25=\"\",\"\",VLOOKUP($B25:$B25,QUALIF!$C$3:$R$56,5,FALSE))","v":"X"},{"$f":"IF($B25=\"\",\"\",VLOOKUP($B25:$B25,QUALIF!$C$3:$R$56,6,FALSE))","v":0},{"$f":"IF($B25=\"\",\"\",VLOOKUP($B25:$B25,QUALIF!$C$3:$R$56,7,FALSE))","v":0},{"$f":"IF($B25=\"\",\"\",VLOOKUP($B25:$B25,QUALIF!$C$3:$R$56,8,FALSE))","v":"X"},{"$f":"IF($B25=\"\",\"\",VLOOKUP($B25:$B25,QUALIF!$C$3:$R$56,9,FALSE))","v":"X"},{"$f":"IF($B25=\"\",\"\",VLOOKUP($B25:$B25,QUALIF!$C$3:$R$56,10,FALSE))","v":"X"},{"$f":"IF($B25=\"\",\"\",VLOOKUP($B25:$B25,QUALIF!$C$3:$R$56,11,FALSE))","v":0},{"$f":"IF($B25=\"\",\"\",VLOOKUP($B25:$B25,QUALIF!$C$3:$R$56,12,FALSE))","v":0},{"$f":"IF($B25=\"\",\"\",VLOOKUP($B25:$B25,QUALIF!$C$3:$R$56,13,FALSE))","v":0},{"$f":"IF($B25=\"\",\"\",VLOOKUP($B25:$B25,QUALIF!$C$3:$R$56,14,FALSE))","v":0},{"$f":"IF($B25=\"\",\"\",VLOOKUP($B25:$B25,QUALIF!$C$3:$R$56,15,FALSE))","v":0},{"$f":"IF($B25=\"\",\"\",VLOOKUP($B25:$B25,QUALIF!$C$3:$R$56,16,FALSE))","v":" "}]
["SCH","RAMEL",null,"PERMISSION",null,"SCH RAMEL",{"$f":"IF($B26=\"\",\"\",VLOOKUP($B26:$B26,QUALIF!$C$3:$R$56,4,FALSE))","v":"X"},{"$f":"IF($B26=\"\",\"\",VLOOKUP($B26:$B26,QUALIF!$C$3:$R$56,5,FALSE))","v":"X"},{"$f":"IF($B26=\"\",\"\",VLOOKUP($B26:$B26,QUALIF!$C$3:$R$56,6,FALSE))","v":0},{"$f":"IF($B26=\"\",\"\",VLOOKUP($B26:$B26,QUALIF!$C$3:$R$56,7,FALSE))","v":0},{"$f":"IF($B26=\"\",\"\",VLOOKUP($B26:$B26,QUALIF!$C$3:$R$56,8,FALSE))","v":"X"},{"$f":"IF($B26=\"\",\"\",VLOOKUP($B26:$B26,QUALIF!$C$3:$R$56,9,FALSE))","v":"X"},{"$f":"IF($B26=\"\",\"\",VLOOKUP($B26:$B26,QUALIF!$C$3:$R$56,10,FALSE))","v":"X"},{"$f":"IF($B26=\"\",\"\",VLOOKUP($B26:$B26,QUALIF!$C$3:$R$56,11,FALSE))","v":0},{"$f":"IF($B26=\"\",\"\",VLOOKUP($B26:$B26,QUALIF!$C$3:$R$56,12,FALSE))","v":0},{"$f":"IF($B26=\"\",\"\",VLOOKUP($B26:$B26,QUALIF!$C$3:$R$56,13,FALSE))","v":0},{"$f":"IF($B26=\"\",\"\",VLOOKUP($B26:$B26,QUALIF!$C$3:$R$56,14,FALSE))","v":0},{"$f":"IF($B26=\"\",\"\",VLOOKUP($B26:$B26,QUALIF!$C$3:$R$56,15,FALSE))","v":0},{"$f":"IF($B26=\"\",\"\",VLOOKUP($B26:$B26,QUALIF!$C$3:$R$56,16,FALSE))","v":0}]
["SGT","MOHIMONT","RC","PERMISSION",null,"SGT MOHIMONT",{"$f":"IF($B27=\"\",\"\",VLOOKUP($B27:$B27,QUALIF!$C$3:$R$56,4,FALSE))","v":"X"},{"$f":"IF($B27=\"\",\"\",VLOOKUP($B27:$B27,QUALIF!$C$3:$R$56,5,FALSE))","v":"X"},{"$f":"IF($B27=\"\",\"\",VLOOKUP($B27:$B27,QUALIF!$C$3:$R$56,6,FALSE))","v":0},{"$f":"IF($B27=\"\",\"\",VLOOKUP($B27:$B27,QUALIF!$C$3:$R$56,7,FALSE))","v":0},{"$f":"IF($B27=\"\",\"\",VLOOKUP($B27:$B27,QUALIF!$C$3:$R$56,8,FALSE))","v":"X"},{"$f":"IF($B27=\"\",\"\",VLOOKUP($B27:$B27,QUALIF!$C$3:$R$56,9,FALSE))","v":"X"},{"$f":"IF($B27=\"\",\"\",VLOOKUP($B27:$B27,QUALIF!$C$3:$R$56,10,FALSE))","v":"X"},{"$f":"IF($B27=\"\",\"\",VLOOKUP($B27:$B27,QUALIF!$C$3:$R$56,11,FALSE))","v":0},{"$f":"IF($B27=\"\",\"\",VLOOKUP($B27:$B27,QUALIF!$C$3:$R$56,12,FALSE))","v":0},{"$f":"IF($B27=\"\",\"\",VLOOKUP($B27:$B27,QUALIF!$C$3:$R$56,13,FALSE))","v":0},{"$f":"IF($B27=\"\",\"\",VLOOKUP($B27:$B27,QUALIF!$C$3:$R$56,14,FALSE))","v":0},{"$f":"IF($B27=\"\",\"\",VLOOKUP($B27:$B27,QUALIF!$C$3:$R$56,15,FALSE))","v":0},{"$f":"IF($B27=\"\",\"\",VLOOKUP($B27:$B27,QUALIF!$C$3:$R$56,16,FALSE))","v":0}]
["SGT","DOVERGNE","RC","PERMISSION",null,"SGT DOVERGNE",{"$f":"IF($B28=\"\",\"\",VLOOKUP($B28:$B28,QUALIF!$C$3:$R$56,4,FALSE))","v":"X"},{"$f":"IF($B28=\"\",\"\",VLOOKUP($B28:$B28,QUALIF!$C$3:$R$56,5,FALSE))","v":"X"},{"$f":"IF($B28=\"\",\"\",VLOOKUP($B28:$B28,QUALIF!$C$3:$R$56,6,FALSE))","v":"X"},{"$f":"IF($B28=\"\",\"\",VLOOKUP($B28:$B28,QUALIF!$C$3:$R$56,7,FALSE))","v":"X"},{"$f":"IF($B28=\"\",\"\",VLOOKUP($B28:$B28,QUALIF!$C$3:$R$56,8,FALSE))","v":"X"},{"$f":"IF($B28=\"\",\"\",VLOOKUP($B28:$B28,QUALIF!$C$3:$R$56,9,FALSE))","v":"X"},{"$f":"IF($B28=\"\",\"\",VLOOKUP($B28:$B28,QUALIF!$C$3:$R$56,10,FALSE))","v":"X"},{"$f":"IF($B28=\"\",\"\",VLOOKUP($B28:$B28,QUALIF!$C$3:$R$56,11,FALSE))","v":"X"},{"$f":"IF($B28=\"\",\"\",VLOOKUP($B28:$B28,QUALIF!$C$3:$R$56,12,FALSE))","v":"X"},{"$f":"IF($B28=\"\",\"\",VLOOKUP($B28:$B28,QUALIF!$C$3:$R$56,13,FALSE))","v":0},{"$f":"IF($B28=\"\",\"\",VLOOKUP($B28:$B28,QUALIF!$C$3:$R$56,14,FALSE))","v":0},{"$f":"IF($B28=\"\",\"\",VLOOKUP($B28:$B28,QUALIF!$C$3:$R$56,15,FALSE))","v":"X"},{"$f":"IF($B28=\"\",\"\",VLOOKUP($B28:$B28,QUALIF!$C$3:$R$56,16,FALSE))","v":"X"}]
["CC1","FALSARELLA","RC","PERMISSION",null,"CC1 FALSARELLA",{"$f":"IF($B29=\"\",\"\",VLOOKUP($B29:$B29,QUALIF!$C$3:$R$56,4,FALSE))","v":"X"},{"$f":"IF($B29=\"\",\"\",VLOOKUP($B29:$B29,QUALIF!$C$3:$R$56,5,FALSE))","v":"X"},{"$f":"IF($B29=\"\",\"\",VLOOKUP($B29:$B29,QUALIF!$C$3:$R$56,6,FALSE))","v":0},{"$f":"IF($B29=\"\",\"\",VLOOKUP($B29:$B29,QUALIF!$C$3:$R$56,7,FALSE))","v":0},{"$f":"IF($B29=\"\",\"\",VLOOKUP($B29:$B29,QUALIF!$C$3:$R$56,8,FALSE))","v":"X"},{"$f":"IF($B29=\"\",\"\",VLOOKUP($B29:$B29,QUALIF!$C$3:$R$56,9,FALSE))","v":"X"},{"$f":"IF($B29=\"\",\"\",VLOOKUP($B29:$B29,QUALIF!$C$3:$R$56,10,FALSE))","v":"X"},{"$f":"IF($B29=\"\",\"\",VLOOKUP($B29:$B29,QUALIF!$C$3:$R$56,11,FALSE))","v":0},{"$f":"IF($B29=\"\",\"\",VLOOKUP($B29:$B29,QUALIF!$C$3:$R$56,12,FALSE))","v":0},{"$f":"IF($B29=\"\",\"\",VLOOKUP($B29:$B29,QUALIF!$C$3:$R$56,13,FALSE))","v":0},{"$f":"IF($B29=\"\",\"\",VLOOKUP($B29:$B29,QUALIF!$C$3:$R$56,14,FALSE))","v":0},{"$f":"IF($B29=\"\",\"\",VLOOKUP($B29:$B29,QUALIF!$C$3:$R$56,15,FALSE))","v":0},{"$f":"IF($B29=\"\",\"\",VLOOKUP($B29:$B29,QUALIF!$C$3:$R$56,16,FALSE))","v":0}]
["CC1","GOMEZ-GRANA","RC","PERMISSION",null,"CC1 GOMEZ-GRANA",{"$f":"IF($B30=\"\",\"\",VLOOKUP($B30:$B30,QUALIF!$C$3:$R$56,4,FALSE))","v":"X"},{"$f":"IF($B30=\"\",\"\",VLOOKUP($B30:$B30,QUALIF!$C$3:$R$56,5,FALSE))","v":"X"},{"$f":"IF($B30=\"\",\"\",VLOOKUP($B30:$B30,QUALIF!$C$3:$R$56,6,FALSE))","v":"X"},{"$f":"IF($B30=\"\",\"\",VLOOKUP($B30:$B30,QUALIF!$C$3:$R$56,7,FALSE))","v":"X"},{"$f":"IF($B30=\"\",\"\",VLOOKUP($B30:$B30,QUALIF!$C$3:$R$56,8,FALSE))","v":"X"},{"$f":"IF($B30=\"\",\"\",VLOOKUP($B30:$B30,QUALIF!$C$3:$R$56,9,FALSE))","v":"X"},{"$f":"IF($B30=\"\",\"\",VLOOKUP($B30:$B30,QUALIF!$C$3:$R$56,10,FALSE))","v":"X"},{"$f":"IF($B30=\"\",\"\",VLOOKUP($B30:$B30,QUALIF!$C$3:$R$56,11,FALSE))","v":"X"},{"$f":"IF($B30=\"\",\"\",VLOOKUP($B30:$B30,QUALIF!$C$3:$R$56,12,FALSE))","v":"X"},{"$f":"IF($B30=\"\",\"\",VLOOKUP($B30:$B30,QUALIF!$C$3:$R$56,13,FALSE))","v":"X"},{"$f":"IF($B30=\"\",\"\",VLOOKUP($B30:$B30,QUALIF!$C$3:$R$56,14,FALSE))","v":0},{"$f":"IF($B30=\"\",\"\",VLOOKUP($B30:$B30,QUALIF!$C$3:$R$56,15,FALSE))","v":0},{"$f":"IF($B30=\"\",\"\",VLOOKUP($B30:$B30,QUALIF!$C$3:$R$56,16,FALSE))","v":0}]
["CC1","HUYGHE","RC","PERMISSION",null,"CC1 HUYGHE",{"$f":"IF($B31=\"\",\"\",VLOOKUP($B31:$B31,QUALIF!$C$3:$R$56,4,FALSE))","v":"X"},{"$f":"IF($B31=\"\",\"\",VLOOKUP($B31:$B31,QUALIF!$C$3:$R$56,5,FALSE))","v":"X"},{"$f":"IF($B31=\"\",\"\",VLOOKUP($B31:$B31,QUALIF!$C$3:$R$56,6,FALSE))","v":"X"},{"$f":"IF($B31=\"\",\"\",VLOOKUP($B31:$B31,QUALIF!$C$3:$R$56,7,FALSE))","v":"X"},{"$f":"IF($B31=\"\",\"\",VLOOKUP($B31:$B31,QUALIF!$C$3:$R$56,8,FALSE))","v":"X"},{"$f":"IF($B31=\"\",\"\",VLOOKUP($B31:$B31,QUALIF!$C$3:$R$56,9,FALSE))","v":"X"},{"$f":"IF($B31=\"\",\"\",VLOOKUP($B31:$B31,QUALIF!$C$3:$R$56,10,FALSE))","v":"X"},{"$f":"IF($B31=\"\",\"\",VLOOKUP($B31:$B31,QUALIF!$C$3:$R$56,11,FALSE))","v":"X"},{"$f":"IF($B31=\"\",\"\",VLOOKUP($B31:$B31,QUALIF!$C$3:$R$56,12,FALSE))","v":"X"},{"$f":"IF($B31=\"\",\"\",VLOOKUP($B31:$B31,QUALIF!$C$3:$R$56,13,FALSE))","v":0},{"$f":"IF($B31=\"\",\"\",VLOOKUP($B31:$B31,QUALIF!$C$3:$R$56,14,FALSE))","v":0},{"$f":"IF($B31=\"\",\"\",VLOOKUP($B31:$B31,QUALIF!$C$3:$R$56,15,FALSE))","v":0},{"$f":"IF($B31=\"\",\"\",VLOOKUP($B31:$B31,QUALIF!$C$3:$R$56,16,FALSE))","v":0}]
["CC1","LEBOURG","RC","PERMISSION",null,"CC1 LEBOURG",{"$f":"IF($B32=\"\",\"\",VLOOKUP($B32:$B32,QUALIF!$C$3:$R$56,4,FALSE))","v":"X"},{"$f":"IF($B32=\"\",\"\",VLOOKUP($B32:$B32,QUALIF!$C$3:$R$56,5,FALSE))","v":"X"},{"$f":"IF($B32=\"\",\"\",VLOOKUP($B32:$B32,QUALIF!$C$3:$R$56,6,FALSE))","v":"X"},{"$f":"IF($B32=\"\",\"\",VLOOKUP($B32:$B32,QUALIF!$C$3:$R$56,7,FALSE))","v":"X"},{"$f":"IF($B32=\"\",\"\",VLOOKUP($B32:$B32,QUALIF!$C$3:$R$56,8,FALSE))","v":"X"},{"$f":"IF($B32=\"\",\"\",VLOOKUP($B32:$B32,QUALIF!$C$3:$R$56,9,FALSE))","v":"X"},{"$f":"IF($B32=\"\",\"\",VLOOKUP($B32:$B32,QUALIF!$C$3:$R$56,10,FALSE))","v":"X"},{"$f":"IF($B32=\"\",\"\",VLOOKUP($B32:$B32,QUALIF!$C$3:$R$56,11,FALSE))","v":"X"},{"$f":"IF($B32=\"\",\"\",VLOOKUP($B32:$B32,QUALIF!$C$3:$R$56,12,FALSE))","v":0},{"$f":"IF($B32=\"\",\"\",VLOOKUP($B32:$B32,QUALIF!$C$3:$R$56,13,FALSE))","v":0},{"$f":"IF($B32=\"\",\"\",VLOOKUP($B32:$B32,QUALIF!$C$3:$R$56,14,FALSE))","v":0},{"$f":"IF($B32=\"\",\"\",VLOOKUP($B32:$B32,QUALIF!$C$3:$R$56,15,FALSE))","v":0},{"$f":"IF($B32=\"\",\"\",VLOOKUP($B32:$B32,QUALIF!$C$3:$R$56,16,FALSE))","v":0}]
["CCH","AHMED","RC","PERMISSION",null,"CCH AHMED",{"$f":"IF($B33=\"\",\"\",VLOOKUP($B33:$B33,QUALIF!$C$3:$R$56,4,FALSE))","v":"X"},{"$f":"IF($B33=\"\",\"\",VLOOKUP($B33:$B33,QUALIF!$C$3:$R$56,5,FALSE))","v":"X"},{"$f":"IF($B33=\"\",\"\",VLOOKUP($B33:$B33,QUALIF!$C$3:$R$56,6,FALSE))","v":"X"},{"$f":"IF($B33=\"\",\"\",VLOOKUP($B33:$B33,QUALIF!$C$3:$R$56,7,FALSE))","v":0},{"$f":"IF($B33=\"\",\"\",VLOOKUP($B33:$B33,QUALIF!$C$3:$R$56,8,FALSE))","v":"X"},{"$f":"IF($B33=\"\",\"\",VLOOKUP($B33:$B33,QUALIF!$C$3:$R$56,9,FALSE))","v":"X"},{"$f":"IF($B33=\"\",\"\",VLOOKUP($B33:$B33,QUALIF!$C$3:$R$56,10,FALSE))","v":"X"},{"$f":"IF($B33=\"\",\"\",VLOOKUP($B33:$B33,QUALIF!$C$3:$R$56,11,FALSE))","v":0},{"$f":"IF($B33=\"\",\"\",VLOOKUP($B33:$B33,QUALIF!$C$3:$R$56,12,FALSE))","v":0},{"$f":"IF($B33=\"\",\"\",VLOOKUP($B33:$B33,QUALIF!$C$3:$R$56,13,FALSE))","v":"X"},{"$f":"IF($B33=\"\",\"\",VLOOKUP($B33:$B33,QUALIF!$C$3:$R$56,14,FALSE))","v":0},{"$f":"IF($B33=\"\",\"\",VLOOKUP($B33:$B33,QUALIF!$C$3:$R$56,15,FALSE))","v":0},{"$f":"IF($B33=\"\",\"\",VLOOKUP($B33:$B33,QUALIF!$C$3:$R$56,16,FALSE))","v":0}]
["CCH","ANLLI","X",null,null,"CCH ANLLI",{"$f":"IF($B34=\"\",\"\",VLOOKUP($B34:$B34,QUALIF!$C$3:$R$56,4,FALSE))","v":"X"},{"$f":"IF($B34=\"\",\"\",VLOOKUP($B34:$B34,QUALIF!$C$3:$R$56,5,FALSE))","v":"X"},{"$f":"IF($B34=\"\",\"\",VLOOKUP($B34:$B34,QUALIF!$C$3:$R$56,6,FALSE))","v":"X"},{"$f":"IF($B34=\"\",\"\",VLOOKUP($B34:$B34,QUALIF!$C$3:$R$56,7,FALSE))","v":0},{"$f":"IF($B34=\"\",\"\",VLOOKUP($B34:$B34,QUALIF!$C$3:$R$56,8,FALSE))","v":"X"},{"$f":"IF($B34=\"\",\"\",VLOOKUP($B34:$B34,QUALIF!$C$3:$R$56,9,FALSE))","v":"X"},{"$f":"IF($B34=\"\",\"\",VLOOKUP($B34:$B34,QUALIF!$C$3:$R$56,10,FALSE))","v":"X"},{"$f":"IF($B34=\"\",\"\",VLOOKUP($B34:$B34,QUALIF!$C$3:$R$56,11,FALSE))","v":0},{"$f":"IF($B34=\"\",\"\",VLOOKUP($B34:$B34,QUALIF!$C$3:$R$56,12,FALSE))","v":0},{"$f":"IF($B34=\"\",\"\",VLOOKUP($B34:$B34,QUALIF!$C$3:$R$56,13,FALSE))","v":0},{"$f":"IF($B34=\"\",\"\",VLOOKUP($B34:$B34,QUALIF!$C$3:$R$56,14,FALSE))","v":0},{"$f":"IF($B34=\"\",\"\",VLOOKUP($B34:$B34,QUALIF!$C$3:$R$56,15,FALSE))","v":0},{"$f":"IF($B34=\"\",\"\",VLOOKUP($B34:$B34,QUALIF!$C$3:$R$56,16,FALSE))","v":0}]
["CCH","BACO","RC","PERMISSION",null,"CCH BACO",{"$f":"IF($B35=\"\",\"\",VLOOKUP($B35:$B35,QUALIF!$C$3:$R$56,4,FALSE))","v":"X"},{"$f":"IF($B35=\"\",\"\",VLOOKUP($B35:$B35,QUALIF!$C$3:$R$56,5,FALSE))","v":"X"},{"$f":"IF($B35=\"\",\"\",VLOOKUP($B35:$B35,QUALIF!$C$3:$R$56,6,FALSE))","v":"X"},{"$f":"IF($B35=\"\",\"\",VLOOKUP($B35:$B35,QUALIF!$C$3:$R$56,7,FALSE))","v":"X"},{"$f":"IF($B35=\"\",\"\",VLOOKUP($B35:$B35,QUALIF!$C$3:$R$56,8,FALSE))","v":"X"},{"$f":"IF($B35=\"\",\"\",VLOOKUP($B35:$B35,QUALIF!$C$3:$R$56,9,FALSE))","v":"X"},{"$f":"IF($B35=\"\",\"\",VLOOKUP($B35:$B35,QUALIF!$C$3:$R$56,10,FALSE))","v":"X"},{"$f":"IF($B35=\"\",\"\",VLOOKUP($B35:$B35,QUALIF!$C$3:$R$56,11,FALSE))","v":0},{"$f":"IF($B35=\"\",\"\",VLOOKUP($B35:$B35,QUALIF!$C$3:$R$56,12,FALSE))","v":0},{"$f":"IF($B35=\"\",\"\",VLOOKUP($B35:$B35,QUALIF!$C$3:$R$56,13,FALSE))","v":0},{"$f":"IF($B35=\"\",\"\",VLOOKUP($B35:$B35,QUALIF!$C$3:$R$56,14,FALSE))","v":"X"},{"$f":"IF($B35=\"\",\"\",VLOOKUP($B35:$B35,QUALIF!$C$3:$R$56,15,FALSE))","v":0},{"$f":"IF($B35=\"\",\"\",VLOOKUP($B35:$B35,QUALIF!$C$3:$R$56,16,FALSE))","v":0}]
["CCH","BERNOUD","RC","PERMISSION",null,"CCH BERNOUD",{"$f":"IF($B36=\"\",\"\",VLOOKUP($B36:$B36,QUALIF!$C$3:$R$56,4,FALSE))","v":"X"},{"$f":"IF($B36=\"\",\"\",VLOOKUP($B36:$B36,QUALIF!$C$3:$R$56,5,FALSE))","v":"X"},{"$f":"IF($B36=\"\",\"\",VLOOKUP($B36:$B36,QUALIF!$C$3:$R$56,6,FALSE))","v":"X"},{"$f":"IF($B36=\"\",\"\",VLOOKUP($B36:$B36,QUALIF!$C$3:$R$56,7,FALSE))","v":"X"},{"$f":"IF($B36=\"\",\"\",VLOOKUP($B36:$B36,QUALIF!$C$3:$R$56,8,FALSE))","v":"X"},{"$f":"IF($B36=\"\",\"\",VLOOKUP($B36:$B36,QUALIF!$C$3:$R$56,9,FALSE))","v":"X"},{"$f":"IF($B36=\"\",\"\",VLOOKUP($B36:$B36,QUALIF!$C$3:$R$56,10,FALSE))","v":"X"},{"$f":"IF($B36=\"\",\"\",VLOOKUP($B36:$B36,QUALIF!$C$3:$R$56,11,FALSE))","v":"X"},{"$f":"IF($B36=\"\",\"\",VLOOKUP($B36:$B36,QUALIF!$C$3:$R$56,12,FALSE))","v":"X"},{"$f":"IF($B36=\"\",\"\",VLOOKUP($B36:$B36,QUALIF!$C$3:$R$56,13,FALSE))","v":0},{"$f":"IF($B36=\"\",\"\",VLOOKUP($B36:$B36,QUALIF!$C$3:$R$56,14,FALSE))","v":0},{"$f":"IF($B36=\"\",\"\",VLOOKUP($B36:$B36,QUALIF!$C$3:$R$56,15,FALSE))","v":0},{"$f":"IF($B36=\"\",\"\",VLOOKUP($B36:$B36,QUALIF!$C$3:$R$56,16,FALSE))","v":0}]
["CCH","CREBASSA",null,"SERVICE",null,"CCH CREBASSA",{"$f":"IF($B37=\"\",\"\",VLOOKUP($B37:$B37,QUALIF!$C$3:$R$56,4,FALSE))","v":"X"},{"$f":"IF($B37=\"\",\"\",VLOOKUP($B37:$B37,QUALIF!$C$3:$R$56,5,FALSE))","v":"X"},{"$f":"IF($B37=\"\",\"\",VLOOKUP($B37:$B37,QUALIF!$C$3:$R$56,6,FALSE))","v":"X"},{"$f":"IF($B37=\"\",\"\",VLOOKUP($B37:$B37,QUALIF!$C$3:$R$56,7,FALSE))","v":0},{"$f":"IF($B37=\"\",\"\",VLOOKUP($B37:$B37,QUALIF!$C$3:$R$56,8,FALSE))","v":"X"},{"$f":"IF($B37=\"\",\"\",VLOOKUP($B37:$B37,QUALIF!$C$3:$R$56,9,FALSE))","v":"X"},{"$f":"IF($B37=\"\",\"\",VLOOKUP($B37:$B37,QUALIF!$C$3:$R$56,10,FALSE))","v":"X"},{"$f":"IF($B37=\"\",\"\",VLOOKUP($B37:$B37,QUALIF!$C$3:$R$56,11,FALSE))","v":0},{"$f":"IF($B37=\"\",\"\",VLOOKUP($B37:$B37,QUALIF!$C$3:$R$56,12,FALSE))","v":0},{"$f":"IF($B37=\"\",\"\",VLOOKUP($B37:$B37,QUALIF!$C$3:$R$56,13,FALSE))","v":"X"},{"$f":"IF($B37=\"\",\"\",VLOOKUP($B37:$B37,QUALIF!$C$3:$R$56,14,FALSE))","v":0},{"$f":"IF($B37=\"\",\"\",VLOOKUP($B37:$B37,QUALIF!$C$3:$R$56,15,FALSE))","v":0},{"$f":"IF($B37=\"\",\"\",VLOOKUP($B37:$B37,QUALIF!$C$3:$R$56,16,FALSE))","v":0}]
["CCH","GERMAIN",null,"OPEX / MCD",null,"CCH GERMAIN",{"$f":"IF($B38=\"\",\"\",VLOOKUP($B38:$B38,QUALIF!$C$3:$R$56,4,FALSE))","v":"X"},{"$f":"IF($B38=\"\",\"\",VLOOKUP($B38:$B38,QUALIF!$C$3:$R$56,5,FALSE))","v":"X"},{"$f":"IF($B38=\"\",\"\",VLOOKUP($B38:$B38,QUALIF!$C$3:$R$56,6,FALSE))","v":"X"},{"$f":"IF($B38=\"\",\"\",VLOOKUP($B38:$B38,QUALIF!$C$3:$R$56,7,FALSE))","v":"X"},{"$f":"IF($B38=\"\",\"\",VLOOKUP($B38:$B38,QUALIF!$C$3:$R$56,8,FALSE))","v":"X"},{"$f":"IF($B38=\"\",\"\",VLOOKUP($B38:$B38,QUALIF!$C$3:$R$56,9,FALSE))","v":"X"},{"$f":"IF($B38=\"\",\"\",VLOOKUP($B38:$B38,QUALIF!$C$3:$R$56,10,FALSE))","v":"X"},{"$f":"IF($B38=\"\",\"\",VLOOKUP($B38:$B38,QUALIF!$C$3:$R$56,11,FALSE))","v":0},{"$f":"IF($B38=\"\",\"\",VLOOKUP($B38:$B38,QUALIF!$C$3:$R$56,12,FALSE))","v":0},{"$f":"IF($B38=\"\",\"\",VLOOKUP($B38:$B38,QUALIF!$C$3:$R$56,13,FALSE))","v":0},{"$f":"IF($B38=\"\",\"\",VLOOKUP($B38:$B38,QUALIF!$C$3:$R$56,14,FALSE))","v":0},{"$f":"IF($B38=\"\",\"\",VLOOKUP($B38:$B38,QUALIF!$C$3:$R$56,15,FALSE))","v":0},{"$f":"IF($B38=\"\",\"\",VLOOKUP($B38:$B38,QUALIF!$C$3:$R$56,16,FALSE))","v":0}]
["CCH","HEDDAD","RC","PERMISSION",null,"CCH HEDDAD",{"$f":"IF($B39=\"\",\"\",VLOOKUP($B39:$B39,QUALIF!$C$3:$R$56,4,FALSE))","v":"X"},{"$f":"IF($B39=\"\",\"\",VLOOKUP($B39:$B39,QUALIF!$C$3:$R$56,5,FALSE))","v":"X"},{"$f":"IF($B39=\"\",\"\",VLOOKUP($B39:$B39,QUALIF!$C$3:$R$56,6,FALSE))","v":"X"},{"$f":"IF($B39=\"\",\"\",VLOOKUP($B39:$B39,QUALIF!$C$3:$R$56,7,FALSE))","v":"X"},{"$f":"IF($B39=\"\",\"\",VLOOKUP($B39:$B39,QUALIF!$C$3:$R$56,8,FALSE))","v":"X"},{"$f":"IF($B39=\"\",\"\",VLOOKUP($B39:$B39,QUALIF!$C$3:$R$56,9,FALSE))","v":"X"},{"$f":"IF($B39=\"\",\"\",VLOOKUP($B39:$B39,QUALIF!$C$3:$R$56,10,FALSE))","v":"X"},{"$f":"IF($B39=\"\",\"\",VLOOKUP($B39:$B39,QUALIF!$C$3:$R$56,11,FALSE))","v":0},{"$f":"IF($B39=\"\",\"\",VLOOKUP($B39:$B39,QUALIF!$C$3:$R$56,12,FALSE))","v":0},{"$f":"IF($B39=\"\",\"\",VLOOKUP($B39:$B39,QUALIF!$C$3:$R$56,13,FALSE))","v":"X"},{"$f":"IF($B39=\"\",\"\",VLOOKUP($B39:$B39,QUALIF!$C$3:$R$56,14,FALSE))","v":0},{"$f":"IF($B39=\"\",\"\",VLOOKUP($B39:$B39,QUALIF!$C$3:$R$56,15,FALSE))","v":0},{"$f":"IF($B39=\"\",\"\",VLOOKUP($B39:$B39,QUALIF!$C$3:$R$56,16,FALSE))","v":0}]
["CPL","JAWORSKI","RC","PERMISSION",null,"CPL JAWORSKI",{"$f":"IF($B40=\"\",\"\",VLOOKUP($B40:$B40,QUALIF!$C$3:$R$56,4,FALSE))","v":"X"},{"$f":"IF($B40=\"\",\"\",VLOOKUP($B40:$B40,QUALIF!$C$3:$R$56,5,FALSE))","v":0},{"$f":"IF($B40=\"\",\"\",VLOOKUP($B40:$B40,QUALIF!$C$3:$R$56,6,FALSE))","v":0},{"$f":"IF($B40=\"\",\"\",VLOOKUP($B40:$B40,QUALIF!$C$3:$R$56,7,FALSE))","v":0},{"$f":"IF($B40=\"\",\"\",VLOOKUP($B40:$B40,QUALIF!$C$3:$R$56,8,FALSE))","v":"X"},{"$f":"IF($B40=\"\",\"\",VLOOKUP($B40:$B40,QUALIF!$C$3:$R$56,9,FALSE))","v":"X"},{"$f":"IF($B40=\"\",\"\",VLOOKUP($B40:$B40,QUALIF!$C$3:$R$56,10,FALSE))","v":"X"},{"$f":"IF($B40=\"\",\"\",VLOOKUP($B40:$B40,QUALIF!$C$3:$R$56,11,FALSE))","v":"X"},{"$f":"IF($B40=\"\",\"\",VLOOKUP($B40:$B40,QUALIF!$C$3:$R$56,12,FALSE))","v":"X"},{"$f":"IF($B40=\"\",\"\",VLOOKUP($B40:$B40,QUALIF!$C$3:$R$56,13,FALSE))","v":0},{"$f":"IF($B40=\"\",\"\",VLOOKUP($B40:$B40,QUALIF!$C$3:$R$56,14,FALSE))","v":0},{"$f":"IF($B40=\"\",\"\",VLOOKUP($B40:$B40,QUALIF!$C$3:$R$56,15,FALSE))","v":0},{"$f":"IF($B40=\"\",\"\",VLOOKUP($B40:$B40,QUALIF!$C$3:$R$56,16,FALSE))","v":0}]
["CCH","PHILLIPS","RC","PERMISSION",null,"CCH PHILLIPS",{"$f":"IF($B41=\"\",\"\",VLOOKUP($B41:$B41,QUALIF!$C$3:$R$56,4,FALSE))","v":"X"},{"$f":"IF($B41=\"\",\"\",VLOOKUP($B41:$B41,QUALIF!$C$3:$R$56,5,FALSE))","v":"X"},{"$f":"IF($B41=\"\",\"\",VLOOKUP($B41:$B41,QUALIF!$C$3:$R$56,6,FALSE))","v":"X"},{"$f":"IF($B41=\"\",\"\",VLOOKUP($B41:$B41,QUALIF!$C$3:$R$56,7,FALSE))","v":0},{"$f":"IF($B41=\"\",\"\",VLOOKUP($B41:$B41,QUALIF!$C$3:$R$56,8,FALSE))","v":"X"},{"$f":"IF($B41=\"\",\"\",VLOOKUP($B41:$B41,QUALIF!$C$3:$R$56,9,FALSE))","v":"X"},{"$f":"IF($B41=\"\",\"\",VLOOKUP($B41:$B41,QUALIF!$C$3:$R$56,10,FALSE))","v":"X"},{"$f":"IF($B41=\"\",\"\",VLOOKUP($B41:$B41,QUALIF!$C$3:$R$56,11,FALSE))","v":0},{"$f":"IF($B41=\"\",\"\",VLOOKUP($B41:$B41,QUALIF!$C$3:$R$56,12,FALSE))","v":0},{"$f":"IF($B41=\"\",\"\",VLOOKUP($B41:$B41,QUALIF!$C$3:$R$56,13,FALSE))","v":0},{"$f":"IF($B41=\"\",\"\",VLOOKUP($B41:$B41,QUALIF!$C$3:$R$56,14,FALSE))","v":0},{"$f":"IF($B41=\"\",\"\",VLOOKUP($B41:$B41,QUALIF!$C$3:$R$56,15,FALSE))","v":0},{"$f":"IF($B41=\"\",\"\",VLOOKUP($B41:$B41,QUALIF!$C$3:$R$56,16,FALSE))","v":0}]
["CCH","VERET",null,"PERMISSION",null,"CCH VERET",{"$f":"IF($B42=\"\",\"\",VLOOKUP($B42:$B42,QUALIF!$C$3:$R$56,4,FALSE))","v":"X"},{"$f":"IF($B42=\"\",\"\",VLOOKUP($B42:$B42,QUALIF!$C$3:$R$56,5,FALSE))","v":"X"},{"$f":"IF($B42=\"\",\"\",VLOOKUP($B42:$B42,QUALIF!$C$3:$R$56,6,FALSE))","v":"X"},{"$f":"IF($B42=\"\",\"\",VLOOKUP($B42:$B42,QUALIF!$C$3:$R$56,7,FALSE))","v":0},{"$f":"IF($B42=\"\",\"\",VLOOKUP($B42:$B42,QUALIF!$C$3:$R$56,8,FALSE))","v":"X"},{"$f":"IF($B42=\"\",\"\",VLOOKUP($B42:$B42,QUALIF!$C$3:$R$56,9,FALSE))","v":"X"},{"$f":"IF($B42=\"\",\"\",VLOOKUP($B42:$B42,QUALIF!$C$3:$R$56,10,FALSE))","v":"X"},{"$f":"IF($B42=\"\",\"\",VLOOKUP($B42:$B42,QUALIF!$C$3:$R$56,11,FALSE))","v":"X"},{"$f":"IF($B42=\"\",\"\",VLOOKUP($B42:$B42,QUALIF!$C$3:$R$56,12,FALSE))","v":"X"},{"$f":"IF($B42=\"\",\"\",VLOOKUP($B42:$B42,QUALIF!$C$3:$R$56,13,FALSE))","v":0},{"$f":"IF($B42=\"\",\"\",VLOOKUP($B42:$B42,QUALIF!$C$3:$R$56,14,FALSE))","v":0},{"$f":"IF($B42=\"\",\"\",VLOOKUP($B42:$B42,QUALIF!$C$3:$R$56,15,FALSE))","v":0},{"$f":"IF($B42=\"\",\"\",VLOOKUP($B42:$B42,QUALIF!$C$3:$R$56,16,FALSE))","v":0}]
["CPL","ANNAERT","PREPA SC2 GISS","FORMATION INTERNE",null,"CPL ANNAERT",{"$f":"IF($B43=\"\",\"\",VLOOKUP($B43:$B43,QUALIF!$C$3:$R$56,4,FALSE))","v":"X"},{"$f":"IF($B43=\"\",\"\",VLOOKUP($B43:$B43,QUALIF!$C$3:$R$56,5,FALSE))","v":"X"},{"$f":"IF($B43=\"\",\"\",VLOOKUP($B43:$B43,QUALIF!$C$3:$R$56,6,FALSE))","v":"X"},{"$f":"IF($B43=\"\",\"\",VLOOKUP($B43:$B43,QUALIF!$C$3:$R$56,7,FALSE))","v":0},{"$f":"IF($B43=\"\",\"\",VLOOKUP($B43:$B43,QUALIF!$C$3:$R$56,8,FALSE))","v":"X"},{"$f":"IF($B43=\"\",\"\",VLOOKUP($B43:$B43,QUALIF!$C$3:$R$56,9,FALSE))","v":"X"},{"$f":"IF($B43=\"\",\"\",VLOOKUP($B43:$B43,QUALIF!$C$3:$R$56,10,FALSE))","v":"X"},{"$f":"IF($B43=\"\",\"\",VLOOKUP($B43:$B43,QUALIF!$C$3:$R$56,11,FALSE))","v":"X"},{"$f":"IF($B43=\"\",\"\",VLOOKUP($B43:$B43,QUALIF!$C$3:$R$56,12,FALSE))","v":0},{"$f":"IF($B43=\"\",\"\",VLOOKUP($B43:$B43,QUALIF!$C$3:$R$56,13,FALSE))","v":0},{"$f":"IF($B43=\"\",\"\",VLOOKUP($B43:$B43,QUALIF!$C$3:$R$56,14,FALSE))","v":0},{"$f":"IF($B43=\"\",\"\",VLOOKUP($B43:$B43,QUALIF!$C$3:$R$56,15,FALSE))","v":0},{"$f":"IF($B43=\"\",\"\",VLOOKUP($B43:$B43,QUALIF!$C$3:$R$56,16,FALSE))","v":0}]
["CPL","BANGELINA","RC","PERMISSION",null,"CPL BANGELINA",{"$f":"IF($B44=\"\",\"\",VLOOKUP($B44:$B44,QUALIF!$C$3:$R$56,4,FALSE))","v":"X"},{"$f":"IF($B44=\"\",\"\",VLOOKUP($B44:$B44,QUALIF!$C$3:$R$56,5,FALSE))","v":"X"},{"$f":"IF($B44=\"\",\"\",VLOOKUP($B44:$B44,QUALIF!$C$3:$R$56,6,FALSE))","v":"X"},{"$f":"IF($B44=\"\",\"\",VLOOKUP($B44:$B44,QUALIF!$C$3:$R$56,7,FALSE))","v":"X"},{"$f":"IF($B44=\"\",\"\",VLOOKUP($B44:$B44,QUALIF!$C$3:$R$56,8,FALSE))","v":"X"},{"$f":"IF($B44=\"\",\"\",VLOOKUP($B44:$B44,QUALIF!$C$3:$R$56,9,FALSE))","v":"X"},{"$f":"IF($B44=\"\",\"\",VLOOKUP($B44:$B44,QUALIF!$C$3:$R$56,10,FALSE))","v":"X"},{"$f":"IF($B44=\"\",\"\",VLOOKUP($B44:$B44,QUALIF!$C$3:$R$56,11,FALSE))","v":0},{"$f":"IF($B44=\"\",\"\",VLOOKUP($B44:$B44,QUALIF!$C$3:$R$56,12,FALSE))","v":0},{"$f":"IF($B44=\"\",\"\",VLOOKUP($B44:$B44,QUALIF!$C$3:$R$56,13,FALSE))","v":"X"},{"$f":"IF($B44=\"\",\"\",VLOOKUP($B44:$B44,QUALIF!$C$3:$R$56,14,FALSE))","v":0},{"$f":"IF($B44=\"\",\"\",VLOOKUP($B44:$B44,QUALIF!$C$3:$R$56,15,FALSE))","v":0},{"$f":"IF($B44=\"\",\"\",VLOOKUP($B44:$B44,QUALIF!$C$3:$R$56,16,FALSE))","v":0}]
["CPL","CHOLLAT","FGE 2","FORMATION INTERNE",null,"CPL CHOLLAT",{"$f":"IF($B45=\"\",\"\",VLOOKUP($B45:$B45,QUALIF!$C$3:$R$56,4,FALSE))","v":"X"},{"$f":"IF($B45=\"\",\"\",VLOOKUP($B45:$B45,QUALIF!$C$3:$R$56,5,FALSE))","v":0},{"$f":"IF($B45=\"\",\"\",VLOOKUP($B45:$B45,QUALIF!$C$3:$R$56,6,FALSE))","v":0},{"$f":"IF($B45=\"\",\"\",VLOOKUP($B45:$B45,QUALIF!$C$3:$R$56,7,FALSE))","v":0},{"$f":"IF($B45=\"\",\"\",VLOOKUP($B45:$B45,QUALIF!$C$3:$R$56,8,FALSE))","v":0},{"$f":"IF($B45=\"\",\"\",VLOOKUP($B45:$B45,QUALIF!$C$3:$R$56,9,FALSE))","v":"X"},{"$f":"IF($B45=\"\",\"\",VLOOKUP($B45:$B45,QUALIF!$C$3:$R$56,10,FALSE))","v":"X"},{"$f":"IF($B45=\"\",\"\",VLOOKUP($B45:$B45,QUALIF!$C$3:$R$56,11,FALSE))","v":"X"},{"$f":"IF($B45=\"\",\"\",VLOOKUP($B45:$B45,QUALIF!$C$3:$R$56,12,FALSE))","v":"X"},{"$f":"IF($B45=\"\",\"\",VLOOKUP($B45:$B45,QUALIF!$C$3:$R$56,13,FALSE))","v":0},{"$f":"IF($B45=\"\",\"\",VLOOKUP($B45:$B45,QUALIF!$C$3:$R$56,14,FALSE))","v":0},{"$f":"IF($B45=\"\",\"\",VLOOKUP($B45:$B45,QUALIF!$C$3:$R$56,15,FALSE))","v":0},{"$f":"IF($B45=\"\",\"\",VLOOKUP($B45:$B45,QUALIF!$C$3:$R$56,16,FALSE))","v":0}]
["CPL","COSPOLITE","X",null,null,"CPL COSPOLITE",{"$f":"IF($B46=\"\",\"\",VLOOKUP($B46:$B46,QUALIF!$C$3:$R$56,4,FALSE))","v":{"$error":"#N/A"}},{"$f":"IF($B46=\"\",\"\",VLOOKUP($B46:$B46,QUALIF!$C$3:$R$56,5,FALSE))","v":{"$error":"#N/A"}},{"$f":"IF($B46=\"\",\"\",VLOOKUP($B46:$B46,QUALIF!$C$3:$R$56,6,FALSE))","v":{"$error":"#N/A"}},{"$f":"IF($B46=\"\",\"\",VLOOKUP($B46:$B46,QUALIF!$C$3:$R$56,7,FALSE))","v":{"$error":"#N/A"}},{"$f":"IF($B46=\"\",\"\",VLOOKUP($B46:$B46,QUALIF!$C$3:$R$56,8,FALSE))","v":{"$error":"#N/A"}},{"$f":"IF($B46=\"\",\"\",VLOOKUP($B46:$B46,QUALIF!$C$3:$R$56,9,FALSE))","v":{"$error":"#N/A"}},{"$f":"IF($B46=\"\",\"\",VLOOKUP($B46:$B46,QUALIF!$C$3:$R$56,10,FALSE))","v":{"$error":"#N/A"}},{"$f":"IF($B46=\"\",\"\",VLOOKUP($B46:$B46,QUALIF!$C$3:$R$56,11,FALSE))","v":{"$error":"#N/A"}},{"$f":"IF($B46=\"\",\"\",VLOOKUP($B46:$B46,QUALIF!$C$3:$R$56,12,FALSE))","v":{"$error":"#N/A"}},{"$f":"IF($B46=\"\",\"\",VLOOKUP($B46:$B46,QUALIF!$C$3:$R$56,13,FALSE))","v":{"$error":"#N/A"}},{"$f":"IF($B46=\"\",\"\",VLOOKUP($B46:$B46,QUALIF!$C$3:$R$56,14,FALSE))","v":{"$error":"#N/A"}},{"$f":"IF($B46=\"\",\"\",VLOOKUP($B46:$B46,QUALIF!$C$3:$R$56,15,FALSE))","v":{"$error":"#N/A"}},{"$f":"IF($B46=\"\",\"\",VLOOKUP($B46:$B46,QUALIF!$C$3:$R$56,16,FALSE))","v":{"$error":"#N/A"}}]
["CPL","DENIS","RC","PERMISSION",null,"CPL DENIS",{"$f":"IF($B47=\"\",\"\",VLOOKUP($B47:$B47,QUALIF!$C$3:$R$56,4,FALSE))","v":"X"},{"$f":"IF($B47=\"\",\"\",VLOOKUP($B47:$B47,QUALIF!$C$3:$R$56,5,FALSE))","v":"X"},{"$f":"IF($B47=\"\",\"\",VLOOKUP($B47:$B47,QUALIF!$C$3:$R$56,6,FALSE))","v":0},{"$f":"IF($B47=\"\",\"\",VLOOKUP($B47:$B47,QUALIF!$C$3:$R$56,7,FALSE))","v":"X"},{"$f":"IF($B47=\"\",\"\",VLOOKUP($B47:$B47,QUALIF!$C$3:$R$56,8,FALSE))","v":"X"},{"$f":"IF($B47=\"\",\"\",VLOOKUP($B47:$B47,QUALIF!$C$3:$R$56,9,FALSE))","v":"X"},{"$f":"IF($B47=\"\",\"\",VLOOKUP($B47:$B47,QUALIF!$C$3:$R$56,10,FALSE))","v":"X"},{"$f":"IF($B47=\"\",\"\",VLOOKUP($B47:$B47,QUALIF!$C$3:$R$56,11,FALSE))","v":"X"},{"$f":"IF($B47=\"\",\"\",VLOOKUP($B47:$B47,QUALIF!$C$3:$R$56,12,FALSE))","v":0},{"$f":"IF($B47=\"\",\"\",VLOOKUP($B47:$B47,QUALIF!$C$3:$R$56,13,FALSE))","v":0},{"$f":"IF($B47=\"\",\"\",VLOOKUP($B47:$B47,QUALIF!$C$3:$R$56,14,FALSE))","v":0},{"$f":"IF($B47=\"\",\"\",VLOOKUP($B47:$B47,QUALIF!$C$3:$R$56,15,FALSE))","v":0},{"$f":"IF($B47=\"\",\"\",VLOOKUP($B47:$B47,QUALIF!$C$3:$R$56,16,FALSE))","v":0}]
["CPL","FELIP",null,"OPEX / MCD",null,"CPL FELIP",{"$f":"IF($B48=\"\",\"\",VLOOKUP($B48:$B48,QUALIF!$C$3:$R$56,4,FALSE))","v":"X"},{"$f":"IF($B48=\"\",\"\",VLOOKUP($B48:$B48,QUALIF!$C$3:$R$56,5,FALSE))","v":"X"},{"$f":"IF($B48=\"\",\"\",VLOOKUP($B48:$B48,QUALIF!$C$3:$R$56,6,FALSE))","v":"X"},{"$f":"IF($B48=\"\",\"\",VLOOKUP($B48:$B48,QUALIF!$C$3:$R$56,7,FALSE))","v":"X"},{"$f":"IF($B48=\"\",\"\",VLOOKUP($B48:$B48,QUALIF!$C$3:$R$56,8,FALSE))","v":"X"},{"$f":"IF($B48=\"\",\"\",VLOOKUP($B48:$B48,QUALIF!$C$3:$R$56,9,FALSE))","v":"X"},{"$f":"IF($B48=\"\",\"\",VLOOKUP($B48:$B48,QUALIF!$C$3:$R$56,10,FALSE))","v":"X"},{"$f":"IF($B48=\"\",\"\",VLOOKUP($B48:$B48,QUALIF!$C$3:$R$56,11,FALSE))","v":0},{"$f":"IF($B48=\"\",\"\",VLOOKUP($B48:$B48,QUALIF!$C$3:$R$56,12,FALSE))","v":0},{"$f":"IF($B48=\"\",\"\",VLOOKUP($B48:$B48,QUALIF!$C$3:$R$56,13,FALSE))","v":"X"},{"$f":"IF($B48=\"\",\"\",VLOOKUP($B48:$B48,QUALIF!$C$3:$R$56,14,FALSE))","v":0},{"$f":"IF($B48=\"\",\"\",VLOOKUP($B48:$B48,QUALIF!$C$3:$R$56,15,FALSE))","v":0},{"$f":"IF($B48=\"\",\"\",VLOOKUP($B48:$B48,QUALIF!$C$3:$R$56,16,FALSE))","v":0}]
["CPL","FIMIEZ","CPG","PERMISSION",null,"CPL FIMIEZ",{"$f":"IF($B49=\"\",\"\",VLOOKUP($B49:$B49,QUALIF!$C$3:$R$56,4,FALSE))","v":"X"},{"$f":"IF($B49=\"\",\"\",VLOOKUP($B49:$B49,QUALIF!$C$3:$R$56,5,FALSE))","v":"X"},{"$f":"IF($B49=\"\",\"\",VLOOKUP($B49:$B49,QUALIF!$C$3:$R$56,6,FALSE))","v":"X"},{"$f":"IF($B49=\"\",\"\",VLOOKUP($B49:$B49,QUALIF!$C$3:$R$56,7,FALSE))","v":0},{"$f":"IF($B49=\"\",\"\",VLOOKUP($B49:$B49,QUALIF!$C$3:$R$56,8,FALSE))","v":"X"},{"$f":"IF($B49=\"\",\"\",VLOOKUP($B49:$B49,QUALIF!$C$3:$R$56,9,FALSE))","v":"X"},{"$f":"IF($B49=\"\",\"\",VLOOKUP($B49:$B49,QUALIF!$C$3:$R$56,10,FALSE))","v":"X"},{"$f":"IF($B49=\"\",\"\",VLOOKUP($B49:$B49,QUALIF!$C$3:$R$56,11,FALSE))","v":0},{"$f":"IF($B49=\"\",\"\",VLOOKUP($B49:$B49,QUALIF!$C$3:$R$56,12,FALSE))","v":0},{"$f":"IF($B49=\"\",\"\",VLOOKUP($B49:$B49,QUALIF!$C$3:$R$56,13,FALSE))","v":0},{"$f":"IF($B49=\"\",\"\",VLOOKUP($B49:$B49,QUALIF!$C$3:$R$56,14,FALSE))","v":0},{"$f":"IF($B49=\"\",\"\",VLOOKUP($B49:$B49,QUALIF!$C$3:$R$56,15,FALSE))","v":0},{"$f":"IF($B49=\"\",\"\",VLOOKUP($B49:$B49,QUALIF!$C$3:$R$56,16,FALSE))","v":0}]
["CPL","GOURVENEC","RC","PERMISSION",null,"CPL GOURVENEC",{"$f":"IF($B50=\"\",\"\",VLOOKUP($B50:$B50,QUALIF!$C$3:$R$56,4,FALSE))","v":"X"},{"$f":"IF($B50=\"\",\"\",VLOOKUP($B50:$B50,QUALIF!$C$3:$R$56,5,FALSE))","v":"X"},{"$f":"IF($B50=\"\",\"\",VLOOKUP($B50:$B50,QUALIF!$C$3:$R$56,6,FALSE))","v":"X"},{"$f":"IF($B50=\"\",\"\",VLOOKUP($B50:$B50,QUALIF!$C$3:$R$56,7,FALSE))","v":0},{"$f":"IF($B50=\"\",\"\",VLOOKUP($B50:$B50,QUALIF!$C$3:$R$56,8,FALSE))","v":"X"},{"$f":"IF($B50=\"\",\"\",VLOOKUP($B50:$B50,QUALIF!$C$3:$R$56,9,FALSE))","v":"X"},{"$f":"IF($B50=\"\",\"\",VLOOKUP($B50:$B50,QUALIF!$C$3:$R$56,10,FALSE))","v":"X"},{"$f":"IF($B50=\"\",\"\",VLOOKUP($B50:$B50,QUALIF!$C$3:$R$56,11,FALSE))","v":0},{"$f":"IF($B50=\"\",\"\",VLOOKUP($B50:$B50,QUALIF!$C$3:$R$56,12,FALSE))","v":0},{"$f":"IF($B50=\"\",\"\",VLOOKUP($B50:$B50,QUALIF!$C$3:$R$56,13,FALSE))","v":0},{"$f":"IF($B50=\"\",\"\",VLOOKUP($B50:$B50,QUALIF!$C$3:$R$56,14,FALSE))","v":0},{"$f":"IF($B50=\"\",\"\",VLOOKUP($B50:$B50,QUALIF!$C$3:$R$56,15,FALSE))","v":0},{"$f":"IF($B50=\"\",\"\",VLOOKUP($B50:$B50,QUALIF!$C$3:$R$56,16,FALSE))","v":0}]
["CPL","GRANATO","RC","PERMISSION",null,"CPL GRANATO",{"$f":"IF($B51=\"\",\"\",VLOOKUP($B51:$B51,QUALIF!$C$3:$R$56,4,FALSE))","v":"X"},{"$f":"IF($B51=\"\",\"\",VLOOKUP($B51:$B51,QUALIF!$C$3:$R$56,5,FALSE))","v":"X"},{"$f":"IF($B51=\"\",\"\",VLOOKUP($B51:$B51,QUALIF!$C$3:$R$56,6,FALSE))","v":"X"},{"$f":"IF($B51=\"\",\"\",VLOOKUP($B51:$B51,QUALIF!$C$3:$R$56,7,FALSE))","v":0},{"$f":"IF($B51=\"\",\"\",VLOOKUP($B51:$B51,QUALIF!$C$3:$R$56,8,FALSE))","v":"X"},{"$f":"IF($B51=\"\",\"\",VLOOKUP($B51:$B51,QUALIF!$C$3:$R$56,9,FALSE))","v":"X"},{"$f":"IF($B51=\"\",\"\",VLOOKUP($B51:$B51,QUALIF!$C$3:$R$56,10,FALSE))","v":"X"},{"$f":"IF($B51=\"\",\"\",VLOOKUP($B51:$B51,QUALIF!$C$3:$R$56,11,FALSE))","v":"X"},{"$f":"IF($B51=\"\",\"\",VLOOKUP($B51:$B51,QUALIF!$C$3:$R$56,12,FALSE))","v":"X"},{"$f":"IF($B51=\"\",\"\",VLOOKUP($B51:$B51,QUALIF!$C$3:$R$56,13,FALSE))","v":0},{"$f":"IF($B51=\"\",\"\",VLOOKUP($B51:$B51,QUALIF!$C$3:$R$56,14,FALSE))","v":0},{"$f":"IF($B51=\"\",\"\",VLOOKUP($B51:$B51,QUALIF!$C$3:$R$56,15,FALSE))","v":0},{"$f":"IF($B51=\"\",\"\",VLOOKUP($B51:$B51,QUALIF!$C$3:$R$56,16,FALSE))","v":0}]
["CPL","GRANDCHAMP","RC","PERMISSION",null,"CPL GRANDCHAMP",{"$f":"IF($B52=\"\",\"\",VLOOKUP($B52:$B52,QUALIF!$C$3:$R$56,4,FALSE))","v":"X"},{"$f":"IF($B52=\"\",\"\",VLOOKUP($B52:$B52,QUALIF!$C$3:$R$56,5,FALSE))","v":"X"},{"$f":"IF($B52=\"\",\"\",VLOOKUP($B52:$B52,QUALIF!$C$3:$R$56,6,FALSE))","v":"X"},{"$f":"IF($B52=\"\",\"\",VLOOKUP($B52:$B52,QUALIF!$C$3:$R$56,7,FALSE))","v":"X"},{"$f":"IF($B52=\"\",\"\",VLOOKUP($B52:$B52,QUALIF!$C$3:$R$56,8,FALSE))","v":"X"},{"$f":"IF($B52=\"\",\"\",VLOOKUP($B52:$B52,QUALIF!$C$3:$R$56,9,FALSE))","v":"X"},{"$f":"IF($B52=\"\",\"\",VLOOKUP($B52:$B52,QUALIF!$C$3:$R$56,10,FALSE))","v":"X"},{"$f":"IF($B52=\"\",\"\",VLOOKUP($B52:$B52,QUALIF!$C$3:$R$56,11,FALSE))","v":0},{"$f":"IF($B52=\"\",\"\",VLOOKUP($B52:$B52,QUALIF!$C$3:$R$56,12,FALSE))","v":0},{"$f":"IF($B52=\"\",\"\",VLOOKUP($B52:$B52,QUALIF!$C$3:$R$56,13,FALSE))","v":0},{"$f":"IF($B52=\"\",\"\",VLOOKUP($B52:$B52,QUALIF!$C$3:$R$56,14,FALSE))","v":0},{"$f":"IF($B52=\"\",\"\",VLOOKUP($B52:$B52,QUALIF!$C$3:$R$56,15,FALSE))","v":0},{"$f":"IF($B52=\"\",\"\",VLOOKUP($B52:$B52,QUALIF!$C$3:$R$56,16,FALSE))","v":0}]
["1CL","HAMZA","N.CAL","OPEX / MCD",null,"1CL HAMZA",{"$f":"IF($B53=\"\",\"\",VLOOKUP($B53:$B53,QUALIF!$C$3:$R$56,4,FALSE))","v":"X"},{"$f":"IF($B53=\"\",\"\",VLOOKUP($B53:$B53,QUALIF!$C$3:$R$56,5,FALSE))","v":0},{"$f":"IF($B53=\"\",\"\",VLOOKUP($B53:$B53,QUALIF!$C$3:$R$56,6,FALSE))","v":0},{"$f":"IF($B53=\"\",\"\",VLOOKUP($B53:$B53,QUALIF!$C$3:$R$56,7,FALSE))","v":0},{"$f":"IF($B53=\"\",\"\",VLOOKUP($B53:$B53,QUALIF!$C$3:$R$56,8,FALSE))","v":"X"},{"$f":"IF($B53=\"\",\"\",VLOOKUP($B53:$B53,QUALIF!$C$3:$R$56,9,FALSE))","v":"X"},{"$f":"IF($B53=\"\",\"\",VLOOKUP($B53:$B53,QUALIF!$C$3:$R$56,10,FALSE))","v":"X"},{"$f":"IF($B53=\"\",\"\",VLOOKUP($B53:$B53,QUALIF!$C$3:$R$56,11,FALSE))","v":"X"},{"$f":"IF($B53=\"\",\"\",VLOOKUP($B53:$B53,QUALIF!$C$3:$R$56,12,FALSE))","v":"X"},{"$f":"IF($B53=\"\",\"\",VLOOKUP($B53:$B53,QUALIF!$C$3:$R$56,13,FALSE))","v":0},{"$f":"IF($B53=\"\",\"\",VLOOKUP($B53:$B53,QUALIF!$C$3:$R$56,14,FALSE))","v":0},{"$f":"IF($B53=\"\",\"\",VLOOKUP($B53:$B53,QUALIF!$C$3:$R$56,15,FALSE))","v":0},{"$f":"IF($B53=\"\",\"\",VLOOKUP($B53:$B53,QUALIF!$C$3:$R$56,16,FALSE))","v":0}]
["CPL","HIROUF","RC","PERMISSION",null,"CPL HIROUF",{"$f":"IF($B54=\"\",\"\",VLOOKUP($B54:$B54,QUALIF!$C$3:$R$56,4,FALSE))","v":"X"},{"$f":"IF($B54=\"\",\"\",VLOOKUP($B54:$B54,QUALIF!$C$3:$R$56,5,FALSE))","v":0},{"$f":"IF($B54=\"\",\"\",VLOOKUP($B54:$B54,QUALIF!$C$3:$R$56,6,FALSE))","v":0},{"$f":"IF($B54=\"\",\"\",VLOOKUP($B54:$B54,QUALIF!$C$3:$R$56,7,FALSE))","v":0},{"$f":"IF($B54=\"\",\"\",VLOOKUP($B54:$B54,QUALIF!$C$3:$R$56,8,FALSE))","v":"X"},{"$f":"IF($B54=\"\",\"\",VLOOKUP($B54:$B54,QUALIF!$C$3:$R$56,9,FALSE))","v":"X"},{"$f":"IF($B54=\"\",\"\",VLOOKUP($B54:$B54,QUALIF!$C$3:$R$56,10,FALSE))","v":"X"},{"$f":"IF($B54=\"\",\"\",VLOOKUP($B54:$B54,QUALIF!$C$3:$R$56,11,FALSE))","v":"X"},{"$f":"IF($B54=\"\",\"\",VLOOKUP($B54:$B54,QUALIF!$C$3:$R$56,12,FALSE))","v":"X"},{"$f":"IF($B54=\"\",\"\",VLOOKUP($B54:$B54,QUALIF!$C$3:$R$56,13,FALSE))","v":0},{"$f":"IF($B54=\"\",\"\",VLOOKUP($B54:$B54,QUALIF!$C$3:$R$56,14,FALSE))","v":0},{"$f":"IF($B54=\"\",\"\",VLOOKUP($B54:$B54,QUALIF!$C$3:$R$56,15,FALSE))","v":0},{"$f":"IF($B54=\"\",\"\",VLOOKUP($B54:$B54,QUALIF!$C$3:$R$56,16,FALSE))","v":0}]
["CPL","KAWASÉ","RC","PERMISSION",null,"CPL KAWASÉ",{"$f":"IF($B55=\"\",\"\",VLOOKUP($B55:$B55,QUALIF!$C$3:$R$56,4,FALSE))","v":"X"},{"$f":"IF($B55=\"\",\"\",VLOOKUP($B55:$B55,QUALIF!$C$3:$R$56,5,FALSE))","v":"X"},{"$f":"IF($B55=\"\",\"\",VLOOKUP($B55:$B55,QUALIF!$C$3:$R$56,6,FALSE))","v":0},{"$f":"IF($B55=\"\",\"\",VLOOKUP($B55:$B55,QUALIF!$C$3:$R$56,7,FALSE))","v":"X"},{"$f":"IF($B55=\"\",\"\",VLOOKUP($B55:$B55,QUALIF!$C$3:$R$56,8,FALSE))","v":"X"},{"$f":"IF($B55=\"\",\"\",VLOOKUP($B55:$B55,QUALIF!$C$3:$R$56,9,FALSE))","v":"X"},{"$f":"IF($B55=\"\",\"\",VLOOKUP($B55:$B55,QUALIF!$C$3:$R$56,10,FALSE))","v":"X"},{"$f":"IF($B55=\"\",\"\",VLOOKUP($B55:$B55,QUALIF!$C$3:$R$56,11,FALSE))","v":"X"},{"$f":"IF($B55=\"\",\"\",VLOOKUP($B55:$B55,QUALIF!$C$3:$R$56,12,FALSE))","v":"X"},{"$f":"IF($B55=\"\",\"\",VLOOKUP($B55:$B55,QUALIF!$C$3:$R$56,13,FALSE))","v":0},{"$f":"IF($B55=\"\",\"\",VLOOKUP($B55:$B55,QUALIF!$C$3:$R$56,14,FALSE))","v":"X"},{"$f":"IF($B55=\"\",\"\",VLOOKUP($B55:$B55,QUALIF!$C$3:$R$56,15,FALSE))","v":0},{"$f":"IF($B55=\"\",\"\",VLOOKUP($B55:$B55,QUALIF!$C$3:$R$56,16,FALSE))","v":0}]
["CPL","KONATÉ","RC","PERMISSION",null,"CPL KONATÉ",{"$f":"IF($B56=\"\",\"\",VLOOKUP($B56:$B56,QUALIF!$C$3:$R$56,4,FALSE))","v":"X"},{"$f":"IF($B56=\"\",\"\",VLOOKUP($B56:$B56,QUALIF!$C$3:$R$56,5,FALSE))","v":0},{"$f":"IF($B56=\"\",\"\",VLOOKUP($B56:$B56,QUALIF!$C$3:$R$56,6,FALSE))","v":0},{"$f":"IF($B56=\"\",\"\",VLOOKUP($B56:$B56,QUALIF!$C$3:$R$56,7,FALSE))","v":0},{"$f":"IF($B56=\"\",\"\",VLOOKUP($B56:$B56,QUALIF!$C$3:$R$56,8,FALSE))","v":"X"},{"$f":"IF($B56=\"\",\"\",VLOOKUP($B56:$B56,QUALIF!$C$3:$R$56,9,FALSE))","v":"X"},{"$f":"IF($B56=\"\",\"\",VLOOKUP($B56:$B56,QUALIF!$C$3:$R$56,10,FALSE))","v":"X"},{"$f":"IF($B56=\"\",\"\",VLOOKUP($B56:$B56,QUALIF!$C$3:$R$56,11,FALSE))","v":"X"},{"$f":"IF($B56=\"\",\"\",VLOOKUP($B56:$B56,QUALIF!$C$3:$R$56,12,FALSE))","v":"X"},{"$f":"IF($B56=\"\",\"\",VLOOKUP($B56:$B56,QUALIF!$C$3:$R$56,13,FALSE))","v":0},{"$f":"IF($B56=\"\",\"\",VLOOKUP($B56:$B56,QUALIF!$C$3:$R$56,14,FALSE))","v":0},{"$f":"IF($B56=\"\",\"\",VLOOKUP($B56:$B56,QUALIF!$C$3:$R$56,15,FALSE))","v":0},{"$f":"IF($B56=\"\",\"\",VLOOKUP($B56:$B56,QUALIF!$C$3:$R$56,16,FALSE))","v":0}]
["CPL","PATHA","RC","PERMISSION",null,"CPL PATHA",{"$f":"IF($B57=\"\",\"\",VLOOKUP($B57:$B57,QUALIF!$C$3:$R$56,4,FALSE))","v":"X"},{"$f":"IF($B57=\"\",\"\",VLOOKUP($B57:$B57,QUALIF!$C$3:$R$56,5,FALSE))","v":"X"},{"$f":"IF($B57=\"\",\"\",VLOOKUP($B57:$B57,QUALIF!$C$3:$R$56,6,FALSE))","v":0},{"$f":"IF($B57=\"\",\"\",VLOOKUP($B57:$B57,QUALIF!$C$3:$R$56,7,FALSE))","v":0},{"$f":"IF($B57=\"\",\"\",VLOOKUP($B57:$B57,QUALIF!$C$3:$R$56,8,FALSE))","v":"X"},{"$f":"IF($B57=\"\",\"\",VLOOKUP($B57:$B57,QUALIF!$C$3:$R$56,9,FALSE))","v":"X"},{"$f":"IF($B57=\"\",\"\",VLOOKUP($B57:$B57,QUALIF!$C$3:$R$56,10,FALSE))","v":"X"},{"$f":"IF($B57=\"\",\"\",VLOOKUP($B57:$B57,QUALIF!$C$3:$R$56,11,FALSE))","v":"X"},{"$f":"IF($B57=\"\",\"\",VLOOKUP($B57:$B57,QUALIF!$C$3:$R$56,12,FALSE))","v":"X"},{"$f":"IF($B57=\"\",\"\",VLOOKUP($B57:$B57,QUALIF!$C$3:$R$56,13,FALSE))","v":0},{"$f":"IF($B57=\"\",\"\",VLOOKUP($B57:$B57,QUALIF!$C$3:$R$56,14,FALSE))","v":0},{"$f":"IF($B57=\"\",\"\",VLOOKUP($B57:$B57,QUALIF!$C$3:$R$56,15,FALSE))","v":0},{"$f":"IF($B57=\"\",\"\",VLOOKUP($B57:$B57,QUALIF!$C$3:$R$56,16,FALSE))","v":0}]
["CPL","MAHAGNE","RC","PERMISSION",null,"CPL MAHAGNE",{"$f":"IF($B58=\"\",\"\",VLOOKUP($B58:$B58,QUALIF!$C$3:$R$56,4,FALSE))","v":"X"},{"$f":"IF($B58=\"\",\"\",VLOOKUP($B58:$B58,QUALIF!$C$3:$R$56,5,FALSE))","v":0},{"$f":"IF($B58=\"\",\"\",VLOOKUP($B58:$B58,QUALIF!$C$3:$R$56,6,FALSE))","v":0},{"$f":"IF($B58=\"\",\"\",VLOOKUP($B58:$B58,QUALIF!$C$3:$R$56,7,FALSE))","v":0},{"$f":"IF($B58=\"\",\"\",VLOOKUP($B58:$B58,QUALIF!$C$3:$R$56,8,FALSE))","v":"X"},{"$f":"IF($B58=\"\",\"\",VLOOKUP($B58:$B58,QUALIF!$C$3:$R$56,9,FALSE))","v":"X"},{"$f":"IF($B58=\"\",\"\",VLOOKUP($B58:$B58,QUALIF!$C$3:$R$56,10,FALSE))","v":"X"},{"$f":"IF($B58=\"\",\"\",VLOOKUP($B58:$B58,QUALIF!$C$3:$R$56,11,FALSE))","v":"X"},{"$f":"IF($B58=\"\",\"\",VLOOKUP($B58:$B58,QUALIF!$C$3:$R$56,12,FALSE))","v":"X"},{"$f":"IF($B58=\"\",\"\",VLOOKUP($B58:$B58,QUALIF!$C$3:$R$56,13,FALSE))","v":0},{"$f":"IF($B58=\"\",\"\",VLOOKUP($B58:$B58,QUALIF!$C$3:$R$56,14,FALSE))","v":0},{"$f":"IF($B58=\"\",\"\",VLOOKUP($B58:$B58,QUALIF!$C$3:$R$56,15,FALSE))","v":0},{"$f":"IF($B58=\"\",\"\",VLOOKUP($B58:$B58,QUALIF!$C$3:$R$56,16,FALSE))","v":0}]
["CPL","RICHARDSON","RC","PERMISSION",null,"CPL RICHARDSON",{"$f":"IF($B59=\"\",\"\",VLOOKUP($B59:$B59,QUALIF!$C$3:$R$56,4,FALSE))","v":"X"},{"$f":"IF($B59=\"\",\"\",VLOOKUP($B59:$B59,QUALIF!$C$3:$R$56,5,FALSE))","v":0},{"$f":"IF($B59=\"\",\"\",VLOOKUP($B59:$B59,QUALIF!$C$3:$R$56,6,FALSE))","v":0},{"$f":"IF($B59=\"\",\"\",VLOOKUP($B59:$B59,QUALIF!$C$3:$R$56,7,FALSE))","v":0},{"$f":"IF($B59=\"\",\"\",VLOOKUP($B59:$B59,QUALIF!$C$3:$R$56,8,FALSE))","v":"X"},{"$f":"IF($B59=\"\",\"\",VLOOKUP($B59:$B59,QUALIF!$C$3:$R$56,9,FALSE))","v":"X"},{"$f":"IF($B59=\"\",\"\",VLOOKUP($B59:$B59,QUALIF!$C$3:$R$56,10,FALSE))","v":"X"},{"$f":"IF($B59=\"\",\"\",VLOOKUP($B59:$B59,QUALIF!$C$3:$R$56,11,FALSE))","v":"X"},{"$f":"IF($B59=\"\",\"\",VLOOKUP($B59:$B59,QUALIF!$C$3:$R$56,12,FALSE))","v":"X"},{"$f":"IF($B59=\"\",\"\",VLOOKUP($B59:$B59,QUALIF!$C$3:$R$56,13,FALSE))","v":0},{"$f":"IF($B59=\"\",\"\",VLOOKUP($B59:$B59,QUALIF!$C$3:$R$56,14,FALSE))","v":0},{"$f":"IF($B59=\"\",\"\",VLOOKUP($B59:$B59,QUALIF!$C$3:$R$56,15,FALSE))","v":0},{"$f":"IF($B59=\"\",\"\",VLOOKUP($B59:$B59,QUALIF!$C$3:$R$56,16,FALSE))","v":0}]
["CPL","STRAZEL","RC","PERMISSION",null,"CPL STRAZEL",{"$f":"IF($B60=\"\",\"\",VLOOKUP($B60:$B60,QUALIF!$C$3:$R$56,4,FALSE))","v":"X"},{"$f":"IF($B60=\"\",\"\",VLOOKUP($B60:$B60,QUALIF!$C$3:$R$56,5,FALSE))","v":0},{"$f":"IF($B60=\"\",\"\",VLOOKUP($B60:$B60,QUALIF!$C$3:$R$56,6,FALSE))","v":0},{"$f":"IF($B60=\"\",\"\",VLOOKUP($B60:$B60,QUALIF!$C$3:$R$56,7,FALSE))","v":0},{"$f":"IF($B60=\"\",\"\",VLOOKUP($B60:$B60,QUALIF!$C$3:$R$56,8,FALSE))","v":"X"},{"$f":"IF($B60=\"\",\"\",VLOOKUP($B60:$B60,QUALIF!$C$3:$R$56,9,FALSE))","v":"X"},{"$f":"IF($B60=\"\",\"\",VLOOKUP($B60:$B60,QUALIF!$C$3:$R$56,10,FALSE))","v":"X"},{"$f":"IF($B60=\"\",\"\",VLOOKUP($B60:$B60,QUALIF!$C$3:$R$56,11,FALSE))","v":"X"},{"$f":"IF($B60=\"\",\"\",VLOOKUP($B60:$B60,QUALIF!$C$3:$R$56,12,FALSE))","v":"X"},{"$f":"IF($B60=\"\",\"\",VLOOKUP($B60:$B60,QUALIF!$C$3:$R$56,13,FALSE))","v":0},{"$f":"IF($B60=\"\",\"\",VLOOKUP($B60:$B60,QUALIF!$C$3:$R$56,14,FALSE))","v":0},{"$f":"IF($B60=\"\",\"\",VLOOKUP($B60:$B60,QUALIF!$C$3:$R$56,15,FALSE))","v":0},{"$f":"IF($B60=\"\",\"\",VLOOKUP($B60:$B60,QUALIF!$C$3:$R$56,16,FALSE))","v":0}]
["1CL","BOURLON","RC","PERMISSION",null,"1CL BOURLON",{"$f":"IF($B61=\"\",\"\",VLOOKUP($B61:$B61,QUALIF!$C$3:$R$56,4,FALSE))","v":"X"},{"$f":"IF($B61=\"\",\"\",VLOOKUP($B61:$B61,QUALIF!$C$3:$R$56,5,FALSE))","v":0},{"$f":"IF($B61=\"\",\"\",VLOOKUP($B61:$B61,QUALIF!$C$3:$R$56,6,FALSE))","v":0},{"$f":"IF($B61=\"\",\"\",VLOOKUP($B61:$B61,QUALIF!$C$3:$R$56,7,FALSE))","v":0},{"$f":"IF($B61=\"\",\"\",VLOOKUP($B61:$B61,QUALIF!$C$3:$R$56,8,FALSE))","v":"X"},{"$f":"IF($B61=\"\",\"\",VLOOKUP($B61:$B61,QUALIF!$C$3:$R$56,9,FALSE))","v":"X"},{"$f":"IF($B61=\"\",\"\",VLOOKUP($B61:$B61,QUALIF!$C$3:$R$56,10,FALSE))","v":"X"},{"$f":"IF($B61=\"\",\"\",VLOOKUP($B61:$B61,QUALIF!$C$3:$R$56,11,FALSE))","v":"X"},{"$f":"IF($B61=\"\",\"\",VLOOKUP($B61:$B61,QUALIF!$C$3:$R$56,12,FALSE))","v":"X"},{"$f":"IF($B61=\"\",\"\",VLOOKUP($B61:$B61,QUALIF!$C$3:$R$56,13,FALSE))","v":0},{"$f":"IF($B61=\"\",\"\",VLOOKUP($B61:$B61,QUALIF!$C$3:$R$56,14,FALSE))","v":0},{"$f":"IF($B61=\"\",\"\",VLOOKUP($B61:$B61,QUALIF!$C$3:$R$56,15,FALSE))","v":0},{"$f":"IF($B61=\"\",\"\",VLOOKUP($B61:$B61,QUALIF!$C$3:$R$56,16,FALSE))","v":0}]
["1CL","BRISSET","RC","PERMISSION",null,"1CL BRISSET",{"$f":"IF($B62=\"\",\"\",VLOOKUP($B62:$B62,QUALIF!$C$3:$R$56,4,FALSE))","v":"X"},{"$f":"IF($B62=\"\",\"\",VLOOKUP($B62:$B62,QUALIF!$C$3:$R$56,5,FALSE))","v":"X"},{"$f":"IF($B62=\"\",\"\",VLOOKUP($B62:$B62,QUALIF!$C$3:$R$56,6,FALSE))","v":0},{"$f":"IF($B62=\"\",\"\",VLOOKUP($B62:$B62,QUALIF!$C$3:$R$56,7,FALSE))","v":0},{"$f":"IF($B62=\"\",\"\",VLOOKUP($B62:$B62,QUALIF!$C$3:$R$56,8,FALSE))","v":"X"},{"$f":"IF($B62=\"\",\"\",VLOOKUP($B62:$B62,QUALIF!$C$3:$R$56,9,FALSE))","v":"X"},{"$f":"IF($B62=\"\",\"\",VLOOKUP($B62:$B62,QUALIF!$C$3:$R$56,10,FALSE))","v":"X"},{"$f":"IF($B62=\"\",\"\",VLOOKUP($B62:$B62,QUALIF!$C$3:$R$56,11,FALSE))","v":"X"},{"$f":"IF($B62=\"\",\"\",VLOOKUP($B62:$B62,QUALIF!$C$3:$R$56,12,FALSE))","v":"X"},{"$f":"IF($B62=\"\",\"\",VLOOKUP($B62:$B62,QUALIF!$C$3:$R$56,13,FALSE))","v":0},{"$f":"IF($B62=\"\",\"\",VLOOKUP($B62:$B62,QUALIF!$C$3:$R$56,14,FALSE))","v":0},{"$f":"IF($B62=\"\",\"\",VLOOKUP($B62:$B62,QUALIF!$C$3:$R$56,15,FALSE))","v":0},{"$f":"IF($B62=\"\",\"\",VLOOKUP($B62:$B62,QUALIF!$C$3:$R$56,16,FALSE))","v":0}]
["1CL","BRONDEAU","RC","PERMISSION",null,"1CL BRONDEAU",{"$f":"IF($B63=\"\",\"\",VLOOKUP($B63:$B63,QUALIF!$C$3:$R$56,4,FALSE))","v":"X"},{"$f":"IF($B63=\"\",\"\",VLOOKUP($B63:$B63,QUALIF!$C$3:$R$56,5,FALSE))","v":0},{"$f":"IF($B63=\"\",\"\",VLOOKUP($B63:$B63,QUALIF!$C$3:$R$56,6,FALSE))","v":0},{"$f":"IF($B63=\"\",\"\",VLOOKUP($B63:$B63,QUALIF!$C$3:$R$56,7,FALSE))","v":0},{"$f":"IF($B63=\"\",\"\",VLOOKUP($B63:$B63,QUALIF!$C$3:$R$56,8,FALSE))","v":"X"},{"$f":"IF($B63=\"\",\"\",VLOOKUP($B63:$B63,QUALIF!$C$3:$R$56,9,FALSE))","v":"X"},{"$f":"IF($B63=\"\",\"\",VLOOKUP($B63:$B63,QUALIF!$C$3:$R$56,10,FALSE))","v":"X"},{"$f":"IF($B63=\"\",\"\",VLOOKUP($B63:$B63,QUALIF!$C$3:$R$56,11,FALSE))","v":"X"},{"$f":"IF($B63=\"\",\"\",VLOOKUP($B63:$B63,QUALIF!$C$3:$R$56,12,FALSE))","v":"X"},{"$f":"IF($B63=\"\",\"\",VLOOKUP($B63:$B63,QUALIF!$C$3:$R$56,13,FALSE))","v":0},{"$f":"IF($B63=\"\",\"\",VLOOKUP($B63:$B63,QUALIF!$C$3:$R$56,14,FALSE))","v":0},{"$f":"IF($B63=\"\",\"\",VLOOKUP($B63:$B63,QUALIF!$C$3:$R$56,15,FALSE))","v":0},{"$f":"IF($B63=\"\",\"\",VLOOKUP($B63:$B63,QUALIF!$C$3:$R$56,16,FALSE))","v":0}]
["1CL","CLAVEAU","RC","PERMISSION",null,"1CL CLAVEAU",{"$f":"IF($B64=\"\",\"\",VLOOKUP($B64:$B64,QUALIF!$C$3:$R$56,4,FALSE))","v":"X"},{"$f":"IF($B64=\"\",\"\",VLOOKUP($B64:$B64,QUALIF!$C$3:$R$56,5,FALSE))","v":"X"},{"$f":"IF($B64=\"\",\"\",VLOOKUP($B64:$B64,QUALIF!$C$3:$R$56,6,FALSE))","v":0},{"$f":"IF($B64=\"\",\"\",VLOOKUP($B64:$B64,QUALIF!$C$3:$R$56,7,FALSE))","v":0},{"$f":"IF($B64=\"\",\"\",VLOOKUP($B64:$B64,QUALIF!$C$3:$R$56,8,FALSE))","v":0},{"$f":"IF($B64=\"\",\"\",VLOOKUP($B64:$B64,QUALIF!$C$3:$R$56,9,FALSE))","v":"X"},{"$f":"IF($B64=\"\",\"\",VLOOKUP($B64:$B64,QUALIF!$C$3:$R$56,10,FALSE))","v":"X"},{"$f":"IF($B64=\"\",\"\",VLOOKUP($B64:$B64,QUALIF!$C$3:$R$56,11,FALSE))","v":"X"},{"$f":"IF($B64=\"\",\"\",VLOOKUP($B64:$B64,QUALIF!$C$3:$R$56,12,FALSE))","v":"X"},{"$f":"IF($B64=\"\",\"\",VLOOKUP($B64:$B64,QUALIF!$C$3:$R$56,13,FALSE))","v":0},{"$f":"IF($B64=\"\",\"\",VLOOKUP($B64:$B64,QUALIF!$C$3:$R$56,14,FALSE))","v":0},{"$f":"IF($B64=\"\",\"\",VLOOKUP($B64:$B64,QUALIF!$C$3:$R$56,15,FALSE))","v":0},{"$f":"IF($B64=\"\",\"\",VLOOKUP($B64:$B64,QUALIF!$C$3:$R$56,16,FALSE))","v":0}]
["1CL","CZERBAKOFF","RC","PERMISSION",null,"1CL CZERBAKOFF",{"$f":"IF($B65=\"\",\"\",VLOOKUP($B65:$B65,QUALIF!$C$3:$R$56,4,FALSE))","v":"X"},{"$f":"IF($B65=\"\",\"\",VLOOKUP($B65:$B65,QUALIF!$C$3:$R$56,5,FALSE))","v":"X"},{"$f":"IF($B65=\"\",\"\",VLOOKUP($B65:$B65,QUALIF!$C$3:$R$56,6,FALSE))","v":0},{"$f":"IF($B65=\"\",\"\",VLOOKUP($B65:$B65,QUALIF!$C$3:$R$56,7,FALSE))","v":0},{"$f":"IF($B65=\"\",\"\",VLOOKUP($B65:$B65,QUALIF!$C$3:$R$56,8,FALSE))","v":"X"},{"$f":"IF($B65=\"\",\"\",VLOOKUP($B65:$B65,QUALIF!$C$3:$R$56,9,FALSE))","v":"X"},{"$f":"IF($B65=\"\",\"\",VLOOKUP($B65:$B65,QUALIF!$C$3:$R$56,10,FALSE))","v":"X"},{"$f":"IF($B65=\"\",\"\",VLOOKUP($B65:$B65,QUALIF!$C$3:$R$56,11,FALSE))","v":"X"},{"$f":"IF($B65=\"\",\"\",VLOOKUP($B65:$B65,QUALIF!$C$3:$R$56,12,FALSE))","v":"X"},{"$f":"IF($B65=\"\",\"\",VLOOKUP($B65:$B65,QUALIF!$C$3:$R$56,13,FALSE))","v":0},{"$f":"IF($B65=\"\",\"\",VLOOKUP($B65:$B65,QUALIF!$C$3:$R$56,14,FALSE))","v":0},{"$f":"IF($B65=\"\",\"\",VLOOKUP($B65:$B65,QUALIF!$C$3:$R$56,15,FALSE))","v":0},{"$f":"IF($B65=\"\",\"\",VLOOKUP($B65:$B65,QUALIF!$C$3:$R$56,16,FALSE))","v":0}]
["1CL","D'AGOSTINO","INSTANCE DE REFORME","HOSPITALISATION",null,"1CL D'AGOSTINO",{"$f":"IF($B66=\"\",\"\",VLOOKUP($B66:$B66,QUALIF!$C$3:$R$56,4,FALSE))","v":{"$error":"#N/A"}},{"$f":"IF($B66=\"\",\"\",VLOOKUP($B66:$B66,QUALIF!$C$3:$R$56,5,FALSE))","v":{"$error":"#N/A"}},{"$f":"IF($B66=\"\",\"\",VLOOKUP($B66:$B66,QUALIF!$C$3:$R$56,6,FALSE))","v":{"$error":"#N/A"}},{"$f":"IF($B66=\"\",\"\",VLOOKUP($B66:$B66,QUALIF!$C$3:$R$56,7,FALSE))","v":{"$error":"#N/A"}},{"$f":"IF($B66=\"\",\"\",VLOOKUP($B66:$B66,QUALIF!$C$3:$R$56,8,FALSE))","v":{"$error":"#N/A"}},{"$f":"IF($B66=\"\",\"\",VLOOKUP($B66:$B66,QUALIF!$C$3:$R$56,9,FALSE))","v":{"$error":"#N/A"}},{"$f":"IF($B66=\"\",\"\",VLOOKUP($B66:$B66,QUALIF!$C$3:$R$56,10,FALSE))","v":{"$error":"#N/A"}},{"$f":"IF($B66=\"\",\"\",VLOOKUP($B66:$B66,QUALIF!$C$3:$R$56,11,FALSE))","v":{"$error":"#N/A"}},{"$f":"IF($B66=\"\",\"\",VLOOKUP($B66:$B66,QUALIF!$C$3:$R$56,12,FALSE))","v":{"$error":"#N/A"}},{"$f":"IF($B66=\"\",\"\",VLOOKUP($B66:$B66,QUALIF!$C$3:$R$56,13,FALSE))","v":{"$error":"#N/A"}},{"$f":"IF($B66=\"\",\"\",VLOOKUP($B66:$B66,QUALIF!$C$3:$R$56,14,FALSE))","v":{"$error":"#N/A"}},{"$f":"IF($B66=\"\",\"\",VLOOKUP($B66:$B66,QUALIF!$C$3:$R$56,15,FALSE))","v":{"$error":"#N/A"}},{"$f":"IF($B66=\"\",\"\",VLOOKUP($B66:$B66,QUALIF!$C$3:$R$56,16,FALSE))","v":{"$error":"#N/A"}}]
["1CL","DESCHAMPS","RC","PERMISSION",null,"1CL DESCHAMPS",{"$f":"IF($B67=\"\",\"\",VLOOKUP($B67:$B67,QUALIF!$C$3:$R$56,4,FALSE))","v":"X"},{"$f":"IF($B67=\"\",\"\",VLOOKUP($B67:$B67,QUALIF!$C$3:$R$56,5,FALSE))","v":0},{"$f":"IF($B67=\"\",\"\",VLOOKUP($B67:$B67,QUALIF!$C$3:$R$56,6,FALSE))","v":0},{"$f":"IF($B67=\"\",\"\",VLOOKUP($B67:$B67,QUALIF!$C$3:$R$56,7,FALSE))","v":0},{"$f":"IF($B67=\"\",\"\",VLOOKUP($B67:$B67,QUALIF!$C$3:$R$56,8,FALSE))","v":"X"},{"$f":"IF($B67=\"\",\"\",VLOOKUP($B67:$B67,QUALIF!$C$3:$R$56,9,FALSE))","v":"X"},{"$f":"IF($B67=\"\",\"\",VLOOKUP($B67:$B67,QUALIF!$C$3:$R$56,10,FALSE))","v":"X"},{"$f":"IF($B67=\"\",\"\",VLOOKUP($B67:$B67,QUALIF!$C$3:$R$56,11,FALSE))","v":"X"},{"$f":"IF($B67=\"\",\"\",VLOOKUP($B67:$B67,QUALIF!$C$3:$R$56,12,FALSE))","v":"X"},{"$f":"IF($B67=\"\",\"\",VLOOKUP($B67:$B67,QUALIF!$C$3:$R$56,13,FALSE))","v":0},{"$f":"IF($B67=\"\",\"\",VLOOKUP($B67:$B67,QUALIF!$C$3:$R$56,14,FALSE))","v":0},{"$f":"IF($B67=\"\",\"\",VLOOKUP($B67:$B67,QUALIF!$C$3:$R$56,15,FALSE))","v":0},{"$f":"IF($B67=\"\",\"\",VLOOKUP($B67:$B67,QUALIF!$C$3:$R$56,16,FALSE))","v":0}]
["1CL","GAY","RC","PERMISSION",null,"1CL GAY",{"$f":"IF($B68=\"\",\"\",VLOOKUP($B68:$B68,QUALIF!$C$3:$R$56,4,FALSE))","v":0},{"$f":"IF($B68=\"\",\"\",VLOOKUP($B68:$B68,QUALIF!$C$3:$R$56,5,FALSE))","v":0},{"$f":"IF($B68=\"\",\"\",VLOOKUP($B68:$B68,QUALIF!$C$3:$R$56,6,FALSE))","v":0},{"$f":"IF($B68=\"\",\"\",VLOOKUP($B68:$B68,QUALIF!$C$3:$R$56,7,FALSE))","v":0},{"$f":"IF($B68=\"\",\"\",VLOOKUP($B68:$B68,QUALIF!$C$3:$R$56,8,FALSE))","v":0},{"$f":"IF($B68=\"\",\"\",VLOOKUP($B68:$B68,QUALIF!$C$3:$R$56,9,FALSE))","v":0},{"$f":"IF($B68=\"\",\"\",VLOOKUP($B68:$B68,QUALIF!$C$3:$R$56,10,FALSE))","v":0},{"$f":"IF($B68=\"\",\"\",VLOOKUP($B68:$B68,QUALIF!$C$3:$R$56,11,FALSE))","v":0},{"$f":"IF($B68=\"\",\"\",VLOOKUP($B68:$B68,QUALIF!$C$3:$R$56,12,FALSE))","v":0},{"$f":"IF($B68=\"\",\"\",VLOOKUP($B68:$B68,QUALIF!$C$3:$R$56,13,FALSE))","v":0},{"$f":"IF($B68=\"\",\"\",VLOOKUP($B68:$B68,QUALIF!$C$3:$R$56,14,FALSE))","v":0},{"$f":"IF($B68=\"\",\"\",VLOOKUP($B68:$B68,QUALIF!$C$3:$R$56,15,FALSE))","v":0},{"$f":"IF($B68=\"\",\"\",VLOOKUP($B68:$B68,QUALIF!$C$3:$R$56,16,FALSE))","v":0}]
["1CL","HOKAUPOKO","RC","PERMISSION",null,"1CL HOKAUPOKO",{"$f":"IF($B69=\"\",\"\",VLOOKUP($B69:$B69,QUALIF!$C$3:$R$56,4,FALSE))","v":0},{"$f":"IF($B69=\"\",\"\",VLOOKUP($B69:$B69,QUALIF!$C$3:$R$56,5,FALSE))","v":0},{"$f":"IF($B69=\"\",\"\",VLOOKUP($B69:$B69,QUALIF!$C$3:$R$56,6,FALSE))","v":0},{"$f":"IF($B69=\"\",\"\",VLOOKUP($B69:$B69,QUALIF!$C$3:$R$56,7,FALSE))","v":0},{"$f":"IF($B69=\"\",\"\",VLOOKUP($B69:$B69,QUALIF!$C$3:$R$56,8,FALSE))","v":0},{"$f":"IF($B69=\"\",\"\",VLOOKUP($B69:$B69,QUALIF!$C$3:$R$56,9,FALSE))","v":0},{"$f":"IF($B69=\"\",\"\",VLOOKUP($B69:$B69,QUALIF!$C$3:$R$56,10,FALSE))","v":0},{"$f":"IF($B69=\"\",\"\",VLOOKUP($B69:$B69,QUALIF!$C$3:$R$56,11,FALSE))","v":0},{"$f":"IF($B69=\"\",\"\",VLOOKUP($B69:$B69,QUALIF!$C$3:$R$56,12,FALSE))","v":0},{"$f":"IF($B69=\"\",\"\",VLOOKUP($B69:$B69,QUALIF!$C$3:$R$56,13,FALSE))","v":0},{"$f":"IF($B69=\"\",\"\",VLOOKUP($B69:$B69,QUALIF!$C$3:$R$56,14,FALSE))","v":0},{"$f":"IF($B69=\"\",\"\",VLOOKUP($B69:$B69,QUALIF!$C$3:$R$56,15,FALSE))","v":0},{"$f":"IF($B69=\"\",\"\",VLOOKUP($B69:$B69,QUALIF!$C$3:$R$56,16,FALSE))","v":0}]
["1CL","HUBERT",null,"MALADE DANS SES FOYERS",null,"1CL HUBERT",{"$f":"IF($B70=\"\",\"\",VLOOKUP($B70:$B70,QUALIF!$C$3:$R$56,4,FALSE))","v":0},{"$f":"IF($B70=\"\",\"\",VLOOKUP($B70:$B70,QUALIF!$C$3:$R$56,5,FALSE))","v":0},{"$f":"IF($B70=\"\",\"\",VLOOKUP($B70:$B70,QUALIF!$C$3:$R$56,6,FALSE))","v":0},{"$f":"IF($B70=\"\",\"\",VLOOKUP($B70:$B70,QUALIF!$C$3:$R$56,7,FALSE))","v":0},{"$f":"IF($B70=\"\",\"\",VLOOKUP($B70:$B70,QUALIF!$C$3:$R$56,8,FALSE))","v":0},{"$f":"IF($B70=\"\",\"\",VLOOKUP($B70:$B70,QUALIF!$C$3:$R$56,9,FALSE))","v":0},{"$f":"IF($B70=\"\",\"\",VLOOKUP($B70:$B70,QUALIF!$C$3:$R$56,10,FALSE))","v":0},{"$f":"IF($B70=\"\",\"\",VLOOKUP($B70:$B70,QUALIF!$C$3:$R$56,11,FALSE))","v":0},{"$f":"IF($B70=\"\",\"\",VLOOKUP($B70:$B70,QUALIF!$C$3:$R$56,12,FALSE))","v":0},{"$f":"IF($B70=\"\",\"\",VLOOKUP($B70:$B70,QUALIF!$C$3:$R$56,13,FALSE))","v":0},{"$f":"IF($B70=\"\",\"\",VLOOKUP($B70:$B70,QUALIF!$C$3:$R$56,14,FALSE))","v":0},{"$f":"IF($B70=\"\",\"\",VLOOKUP($B70:$B70,QUALIF!$C$3:$R$56,15,FALSE))","v":0},{"$f":"IF($B70=\"\",\"\",VLOOKUP($B70:$B70,QUALIF!$C$3:$R$56,16,FALSE))","v":0}]
["1CL","LE BRETON","RC","PERMISSION",null,"1CL LE BRETON",{"$f":"IF($B71=\"\",\"\",VLOOKUP($B71:$B71,QUALIF!$C$3:$R$56,4,FALSE))","v":0},{"$f":"IF($B71=\"\",\"\",VLOOKUP($B71:$B71,QUALIF!$C$3:$R$56,5,FALSE))","v":0},{"$f":"IF($B71=\"\",\"\",VLOOKUP($B71:$B71,QUALIF!$C$3:$R$56,6,FALSE))","v":0},{"$f":"IF($B71=\"\",\"\",VLOOKUP($B71:$B71,QUALIF!$C$3:$R$56,7,FALSE))","v":0},{"$f":"IF($B71=\"\",\"\",VLOOKUP($B71:$B71,QUALIF!$C$3:$R$56,8,FALSE))","v":0},{"$f":"IF($B71=\"\",\"\",VLOOKUP($B71:$B71,QUALIF!$C$3:$R$56,9,FALSE))","v":0},{"$f":"IF($B71=\"\",\"\",VLOOKUP($B71:$B71,QUALIF!$C$3:$R$56,10,FALSE))","v":0},{"$f":"IF($B71=\"\",\"\",VLOOKUP($B71:$B71,QUALIF!$C$3:$R$56,11,FALSE))","v":0},{"$f":"IF($B71=\"\",\"\",VLOOKUP($B71:$B71,QUALIF!$C$3:$R$56,12,FALSE))","v":0},{"$f":"IF($B71=\"\",\"\",VLOOKUP($B71:$B71,QUALIF!$C$3:$R$56,13,FALSE))","v":0},{"$f":"IF($B71=\"\",\"\",VLOOKUP($B71:$B71,QUALIF!$C$3:$R$56,14,FALSE))","v":0},{"$f":"IF($B71=\"\",\"\",VLOOKUP($B71:$B71,QUALIF!$C$3:$R$56,15,FALSE))","v":0},{"$f":"IF($B71=\"\",\"\",VLOOKUP($B71:$B71,QUALIF!$C$3:$R$56,16,FALSE))","v":0}]
["1CL","LE STRAT","RC","PERMISSION",null,"1CL LE STRAT",{"$f":"IF($B72=\"\",\"\",VLOOKUP($B72:$B72,QUALIF!$C$3:$R$56,4,FALSE))","v":0},{"$f":"IF($B72=\"\",\"\",VLOOKUP($B72:$B72,QUALIF!$C$3:$R$56,5,FALSE))","v":0},{"$f":"IF($B72=\"\",\"\",VLOOKUP($B72:$B72,QUALIF!$C$3:$R$56,6,FALSE))","v":0},{"$f":"IF($B72=\"\",\"\",VLOOKUP($B72:$B72,QUALIF!$C$3:$R$56,7,FALSE))","v":0},{"$f":"IF($B72=\"\",\"\",VLOOKUP($B72:$B72,QUALIF!$C$3:$R$56,8,FALSE))","v":0},{"$f":"IF($B72=\"\",\"\",VLOOKUP($B72:$B72,QUALIF!$C$3:$R$56,9,FALSE))","v":0},{"$f":"IF($B72=\"\",\"\",VLOOKUP($B72:$B72,QUALIF!$C$3:$R$56,10,FALSE))","v":0},{"$f":"IF($B72=\"\",\"\",VLOOKUP($B72:$B72,QUALIF!$C$3:$R$56,11,FALSE))","v":0},{"$f":"IF($B72=\"\",\"\",VLOOKUP($B72:$B72,QUALIF!$C$3:$R$56,12,FALSE))","v":0},{"$f":"IF($B72=\"\",\"\",VLOOKUP($B72:$B72,QUALIF!$C$3:$R$56,13,FALSE))","v":0},{"$f":"IF($B72=\"\",\"\",VLOOKUP($B72:$B72,QUALIF!$C$3:$R$56,14,FALSE))","v":0},{"$f":"IF($B72=\"\",\"\",VLOOKUP($B72:$B72,QUALIF!$C$3:$R$56,15,FALSE))","v":0},{"$f":"IF($B72=\"\",\"\",VLOOKUP($B72:$B72,QUALIF!$C$3:$R$56,16,FALSE))","v":0}]
["CPL","MARTIN","RC","PERMISSION",null,"CPL MARTIN",{"$f":"IF($B73=\"\",\"\",VLOOKUP($B73:$B73,QUALIF!$C$3:$R$56,4,FALSE))","v":0},{"$f":"IF($B73=\"\",\"\",VLOOKUP($B73:$B73,QUALIF!$C$3:$R$56,5,FALSE))","v":0},{"$f":"IF($B73=\"\",\"\",VLOOKUP($B73:$B73,QUALIF!$C$3:$R$56,6,FALSE))","v":0},{"$f":"IF($B73=\"\",\"\",VLOOKUP($B73:$B73,QUALIF!$C$3:$R$56,7,FALSE))","v":0},{"$f":"IF($B73=\"\",\"\",VLOOKUP($B73:$B73,QUALIF!$C$3:$R$56,8,FALSE))","v":0},{"$f":"IF($B73=\"\",\"\",VLOOKUP($B73:$B73,QUALIF!$C$3:$R$56,9,FALSE))","v":0},{"$f":"IF($B73=\"\",\"\",VLOOKUP($B73:$B73,QUALIF!$C$3:$R$56,10,FALSE))","v":0},{"$f":"IF($B73=\"\",\"\",VLOOKUP($B73:$B73,QUALIF!$C$3:$R$56,11,FALSE))","v":0},{"$f":"IF($B73=\"\",\"\",VLOOKUP($B73:$B73,QUALIF!$C$3:$R$56,12,FALSE))","v":0},{"$f":"IF($B73=\"\",\"\",VLOOKUP($B73:$B73,QUALIF!$C$3:$R$56,13,FALSE))","v":0},{"$f":"IF($B73=\"\",\"\",VLOOKUP($B73:$B73,QUALIF!$C$3:$R$56,14,FALSE))","v":0},{"$f":"IF($B73=\"\",\"\",VLOOKUP($B73:$B73,QUALIF!$C$3:$R$56,15,FALSE))","v":0},{"$f":"IF($B73=\"\",\"\",VLOOKUP($B73:$B73,QUALIF!$C$3:$R$56,16,FALSE))","v":0}]
["1CL","PASCALIN","RC","PERMISSION",null,"1CL PASCALIN",{"$f":"IF($B74=\"\",\"\",VLOOKUP($B74:$B74,QUALIF!$C$3:$R$56,4,FALSE))","v":0},{"$f":"IF($B74=\"\",\"\",VLOOKUP($B74:$B74,QUALIF!$C$3:$R$56,5,FALSE))","v":0},{"$f":"IF($B74=\"\",\"\",VLOOKUP($B74:$B74,QUALIF!$C$3:$R$56,6,FALSE))","v":0},{"$f":"IF($B74=\"\",\"\",VLOOKUP($B74:$B74,QUALIF!$C$3:$R$56,7,FALSE))","v":0},{"$f":"IF($B74=\"\",\"\",VLOOKUP($B74:$B74,QUALIF!$C$3:$R$56,8,FALSE))","v":0},{"$f":"IF($B74=\"\",\"\",VLOOKUP($B74:$B74,QUALIF!$C$3:$R$56,9,FALSE))","v":0},{"$f":"IF($B74=\"\",\"\",VLOOKUP($B74:$B74,QUALIF!$C$3:$R$56,10,FALSE))","v":0},{"$f":"IF($B74=\"\",\"\",VLOOKUP($B74:$B74,QUALIF!$C$3:$R$56,11,FALSE))","v":0},{"$f":"IF($B74=\"\",\"\",VLOOKUP($B74:$B74,QUALIF!$C$3:$R$56,12,FALSE))","v":0},{"$f":"IF($B74=\"\",\"\",VLOOKUP($B74:$B74,QUALIF!$C$3:$R$56,13,FALSE))","v":0},{"$f":"IF($B74=\"\",\"\",VLOOKUP($B74:$B74,QUALIF!$C$3:$R$56,14,FALSE))","v":0},{"$f":"IF($B74=\"\",\"\",VLOOKUP($B74:$B74,QUALIF!$C$3:$R$56,15,FALSE))","v":0},{"$f":"IF($B74=\"\",\"\",VLOOKUP($B74:$B74,QUALIF!$C$3:$R$56,16,FALSE))","v":0}]
["1CL","PIETRZYK","RC","PERMISSION",null,"1CL PIETRZYK",{"$f":"IF($B75=\"\",\"\",VLOOKUP($B75:$B75,QUALIF!$C$3:$R$56,4,FALSE))","v":0},{"$f":"IF($B75=\"\",\"\",VLOOKUP($B75:$B75,QUALIF!$C$3:$R$56,5,FALSE))","v":0},{"$f":"IF($B75=\"\",\"\",VLOOKUP($B75:$B75,QUALIF!$C$3:$R$56,6,FALSE))","v":0},{"$f":"IF($B75=\"\",\"\",VLOOKUP($B75:$B75,QUALIF!$C$3:$R$56,7,FALSE))","v":0},{"$f":"IF($B75=\"\",\"\",VLOOKUP($B75:$B75,QUALIF!$C$3:$R$56,8,FALSE))","v":0},{"$f":"IF($B75=\"\",\"\",VLOOKUP($B75:$B75,QUALIF!$C$3:$R$56,9,FALSE))","v":0},{"$f":"IF($B75=\"\",\"\",VLOOKUP($B75:$B75,QUALIF!$C$3:$R$56,10,FALSE))","v":0},{"$f":"IF($B75=\"\",\"\",VLOOKUP($B75:$B75,QUALIF!$C$3:$R$56,11,FALSE))","v":0},{"$f":"IF($B75=\"\",\"\",VLOOKUP($B75:$B75,QUALIF!$C$3:$R$56,12,FALSE))","v":0},{"$f":"IF($B75=\"\",\"\",VLOOKUP($B75:$B75,QUALIF!$C$3:$R$56,13,FALSE))","v":0},{"$f":"IF($B75=\"\",\"\",VLOOKUP($B75:$B75,QUALIF!$C$3:$R$56,14,FALSE))","v":0},{"$f":"IF($B75=\"\",\"\",VLOOKUP($B75:$B75,QUALIF!$C$3:$R$56,15,FALSE))","v":0},{"$f":"IF($B75=\"\",\"\",VLOOKUP($B75:$B75,QUALIF!$C$3:$R$56,16,FALSE))","v":0}]
["1CL","THIERY","RC","PERMISSION",null,"1CL THIERY",{"$f":"IF($B76=\"\",\"\",VLOOKUP($B76:$B76,QUALIF!$C$3:$R$56,4,FALSE))","v":0},{"$f":"IF($B76=\"\",\"\",VLOOKUP($B76:$B76,QUALIF!$C$3:$R$56,5,FALSE))","v":0},{"$f":"IF($B76=\"\",\"\",VLOOKUP($B76:$B76,QUALIF!$C$3:$R$56,6,FALSE))","v":0},{"$f":"IF($B76=\"\",\"\",VLOOKUP($B76:$B76,QUALIF!$C$3:$R$56,7,FALSE))","v":0},{"$f":"IF($B76=\"\",\"\",VLOOKUP($B76:$B76,QUALIF!$C$3:$R$56,8,FALSE))","v":0},{"$f":"IF($B76=\"\",\"\",VLOOKUP($B76:$B76,QUALIF!$C$3:$R$56,9,FALSE))","v":0},{"$f":"IF($B76=\"\",\"\",VLOOKUP($B76:$B76,QUALIF!$C$3:$R$56,10,FALSE))","v":0},{"$f":"IF($B76=\"\",\"\",VLOOKUP($B76:$B76,QUALIF!$C$3:$R$56,11,FALSE))","v":0},{"$f":"IF($B76=\"\",\"\",VLOOKUP($B76:$B76,QUALIF!$C$3:$R$56,12,FALSE))","v":0},{"$f":"IF($B76=\"\",\"\",VLOOKUP($B76:$B76,QUALIF!$C$3:$R$56,13,FALSE))","v":0},{"$f":"IF($B76=\"\",\"\",VLOOKUP($B76:$B76,QUALIF!$C$3:$R$56,14,FALSE))","v":0},{"$f":"IF($B76=\"\",\"\",VLOOKUP($B76:$B76,QUALIF!$C$3:$R$56,15,FALSE))","v":0},{"$f":"IF($B76=\"\",\"\",VLOOKUP($B76:$B76,QUALIF!$C$3:$R$56,16,FALSE))","v":0}]
[null,null,null,null,null," ",{"$f":"IF($B77=\"\",\"\",VLOOKUP($B77:$B77,QUALIF!$C$3:$R$56,4,FALSE))","v":""},{"$f":"IF($B77=\"\",\"\",VLOOKUP($B77:$B77,QUALIF!$C$3:$R$56,5,FALSE))","v":""},{"$f":"IF($B77=\"\",\"\",VLOOKUP($B77:$B77,QUALIF!$C$3:$R$56,6,FALSE))","v":""},{"$f":"IF($B77=\"\",\"\",VLOOKUP($B77:$B77,QUALIF!$C$3:$R$56,7,FALSE))","v":""},{"$f":"IF($B77=\"\",\"\",VLOOKUP($B77:$B77,QUALIF!$C$3:$R$56,8,FALSE))","v":""},{"$f":"IF($B77=\"\",\"\",VLOOKUP($B77:$B77,QUALIF!$C$3:$R$56,9,FALSE))","v":""},{"$f":"IF($B77=\"\",\"\",VLOOKUP($B77:$B77,QUALIF!$C$3:$R$56,10,FALSE))","v":""},{"$f":"IF($B77=\"\",\"\",VLOOKUP($B77:$B77,QUALIF!$C$3:$R$56,11,FALSE))","v":""},{"$f":"IF($B77=\"\",\"\",VLOOKUP($B77:$B77,QUALIF!$C$3:$R$56,12,FALSE))","v":""},{"$f":"IF($B77=\"\",\"\",VLOOKUP($B77:$B77,QUALIF!$C$3:$R$56,13,FALSE))","v":""},{"$f":"IF($B77=\"\",\"\",VLOOKUP($B77:$B77,QUALIF!$C$3:$R$56,14,FALSE))","v":""},{"$f":"IF($B77=\"\",\"\",VLOOKUP($B77:$B77,QUALIF!$C$3:$R$56,15,FALSE))","v":""},{"$f":"IF($B77=\"\",\"\",VLOOKUP($B77:$B77,QUALIF!$C$3:$R$56,16,FALSE))","v":""}]
[null,null,null,null,null," ",{"$f":"IF($B78=\"\",\"\",VLOOKUP($B78:$B78,QUALIF!$C$3:$R$56,4,FALSE))","v":""},{"$f":"IF($B78=\"\",\"\",VLOOKUP($B78:$B78,QUALIF!$C$3:$R$56,5,FALSE))","v":""},{"$f":"IF($B78=\"\",\"\",VLOOKUP($B78:$B78,QUALIF!$C$3:$R$56,6,FALSE))","v":""},{"$f":"IF($B78=\"\",\"\",VLOOKUP($B78:$B78,QUALIF!$C$3:$R$56,7,FALSE))","v":""},{"$f":"IF($B78=\"\",\"\",VLOOKUP($B78:$B78,QUALIF!$C$3:$R$56,8,FALSE))","v":""},{"$f":"IF($B78=\"\",\"\",VLOOKUP($B78:$B78,QUALIF!$C$3:$R$56,9,FALSE))","v":""},{"$f":"IF($B78=\"\",\"\",VLOOKUP($B78:$B78,QUALIF!$C$3:$R$56,10,FALSE))","v":""},{"$f":"IF($B78=\"\",\"\",VLOOKUP($B78:$B78,QUALIF!$C$3:$R$56,11,FALSE))","v":""},{"$f":"IF($B78=\"\",\"\",VLOOKUP($B78:$B78,QUALIF!$C$3:$R$56,12,FALSE))","v":""},{"$f":"IF($B78=\"\",\"\",VLOOKUP($B78:$B78,QUALIF!$C$3:$R$56,13,FALSE))","v":""},{"$f":"IF($B78=\"\",\"\",VLOOKUP($B78:$B78,QUALIF!$C$3:$R$56,14,FALSE))","v":""},{"$f":"IF($B78=\"\",\"\",VLOOKUP($B78:$B78,QUALIF!$C$3:$R$56,15,FALSE))","v":""},{"$f":"IF($B78=\"\",\"\",VLOOKUP($B78:$B78,QUALIF!$C$3:$R$56,16,FALSE))","v":""}]
[null,null,null,null,null," ",{"$f":"IF($B79=\"\",\"\",VLOOKUP($B79:$B79,QUALIF!$C$3:$R$56,4,FALSE))","v":""},{"$f":"IF($B79=\"\",\"\",VLOOKUP($B79:$B79,QUALIF!$C$3:$R$56,5,FALSE))","v":""},{"$f":"IF($B79=\"\",\"\",VLOOKUP($B79:$B79,QUALIF!$C$3:$R$56,6,FALSE))","v":""},{"$f":"IF($B79=\"\",\"\",VLOOKUP($B79:$B79,QUALIF!$C$3:$R$56,7,FALSE))","v":""},{"$f":"IF($B79=\"\",\"\",VLOOKUP($B79:$B79,QUALIF!$C$3:$R$56,8,FALSE))","v":""},{"$f":"IF($B79=\"\",\"\",VLOOKUP($B79:$B79,QUALIF!$C$3:$R$56,9,FALSE))","v":""},{"$f":"IF($B79=\"\",\"\",VLOOKUP($B79:$B79,QUALIF!$C$3:$R$56,10,FALSE))","v":""},{"$f":"IF($B79=\"\",\"\",VLOOKUP($B79:$B79,QUALIF!$C$3:$R$56,11,FALSE))","v":""},{"$f":"IF($B79=\"\",\"\",VLOOKUP($B79:$B79,QUALIF!$C$3:$R$56,12,FALSE))","v":""},{"$f":"IF($B79=\"\",\"\",VLOOKUP($B79:$B79,QUALIF!$C$3:$R$56,13,FALSE))","v":""},{"$f":"IF($B79=\"\",\"\",VLOOKUP($B79:$B79,QUALIF!$C$3:$R$56,14,FALSE))","v":""},{"$f":"IF($B79=\"\",\"\",VLOOKUP($B79:$B79,QUALIF!$C$3:$R$56,15,FALSE))","v":""},{"$f":"IF($B79=\"\",\"\",VLOOKUP($B79:$B79,QUALIF!$C$3:$R$56,16,FALSE))","v":""}]
[null,null,null,null,null," ",{"$f":"IF($B80=\"\",\"\",VLOOKUP($B80:$B80,QUALIF!$C$3:$R$56,4,FALSE))","v":""},{"$f":"IF($B80=\"\",\"\",VLOOKUP($B80:$B80,QUALIF!$C$3:$R$56,5,FALSE))","v":""},{"$f":"IF($B80=\"\",\"\",VLOOKUP($B80:$B80,QUALIF!$C$3:$R$56,6,FALSE))","v":""},{"$f":"IF($B80=\"\",\"\",VLOOKUP($B80:$B80,QUALIF!$C$3:$R$56,7,FALSE))","v":""},{"$f":"IF($B80=\"\",\"\",VLOOKUP($B80:$B80,QUALIF!$C$3:$R$56,8,FALSE))","v":""},{"$f":"IF($B80=\"\",\"\",VLOOKUP($B80:$B80,QUALIF!$C$3:$R$56,9,FALSE))","v":""},{"$f":"IF($B80=\"\",\"\",VLOOKUP($B80:$B80,QUALIF!$C$3:$R$56,10,FALSE))","v":""},{"$f":"IF($B80=\"\",\"\",VLOOKUP($B80:$B80,QUALIF!$C$3:$R$56,11,FALSE))","v":""},{"$f":"IF($B80=\"\",\"\",VLOOKUP($B80:$B80,QUALIF!$C$3:$R$56,12,FALSE))","v":""},{"$f":"IF($B80=\"\",\"\",VLOOKUP($B80:$B80,QUALIF!$C$3:$R$56,13,FALSE))","v":""},{"$f":"IF($B80=\"\",\"\",VLOOKUP($B80:$B80,QUALIF!$C$3:$R$56,14,FALSE))","v":""},{"$f":"IF($B80=\"\",\"\",VLOOKUP($B80:$B80,QUALIF!$C$3:$R$56,15,FALSE))","v":""},{"$f":"IF($B80=\"\",\"\",VLOOKUP($B80:$B80,QUALIF!$C$3:$R$56,16,FALSE))","v":""}]
[null,null,null,null,null," ",{"$f":"IF($B81=\"\",\"\",VLOOKUP($B81:$B81,QUALIF!$C$3:$R$56,4,FALSE))","v":""},{"$f":"IF($B81=\"\",\"\",VLOOKUP($B81:$B81,QUALIF!$C$3:$R$56,5,FALSE))","v":""},{"$f":"IF($B81=\"\",\"\",VLOOKUP($B81:$B81,QUALIF!$C$3:$R$56,6,FALSE))","v":""},{"$f":"IF($B81=\"\",\"\",VLOOKUP($B81:$B81,QUALIF!$C$3:$R$56,7,FALSE))","v":""},{"$f":"IF($B81=\"\",\"\",VLOOKUP($B81:$B81,QUALIF!$C$3:$R$56,8,FALSE))","v":""},{"$f":"IF($B81=\"\",\"\",VLOOKUP($B81:$B81,QUALIF!$C$3:$R$56,9,FALSE))","v":""},{"$f":"IF($B81=\"\",\"\",VLOOKUP($B81:$B81,QUALIF!$C$3:$R$56,10,FALSE))","v":""},{"$f":"IF($B81=\"\",\"\",VLOOKUP($B81:$B81,QUALIF!$C$3:$R$56,11,FALSE))","v":""},{"$f":"IF($B81=\"\",\"\",VLOOKUP($B81:$B81,QUALIF!$C$3:$R$56,12,FALSE))","v":""},{"$f":"IF($B81=\"\",\"\",VLOOKUP($B81:$B81,QUALIF!$C$3:$R$56,13,FALSE))","v":""},{"$f":"IF($B81=\"\",\"\",VLOOKUP($B81:$B81,QUALIF!$C$3:$R$56,14,FALSE))","v":""},{"$f":"IF($B81=\"\",\"\",VLOOKUP($B81:$B81,QUALIF!$C$3:$R$56,15,FALSE))","v":""},{"$f":"IF($B81=\"\",\"\",VLOOKUP($B81:$B81,QUALIF!$C$3:$R$56,16,FALSE))","v":""}]
[null,null,null,null,null," ",{"$f":"IF($B82=\"\",\"\",VLOOKUP($B82:$B82,QUALIF!$C$3:$R$56,4,FALSE))","v":""},{"$f":"IF($B82=\"\",\"\",VLOOKUP($B82:$B82,QUALIF!$C$3:$R$56,5,FALSE))","v":""},{"$f":"IF($B82=\"\",\"\",VLOOKUP($B82:$B82,QUALIF!$C$3:$R$56,6,FALSE))","v":""},{"$f":"IF($B82=\"\",\"\",VLOOKUP($B82:$B82,QUALIF!$C$3:$R$56,7,FALSE))","v":""},{"$f":"IF($B82=\"\",\"\",VLOOKUP($B82:$B82,QUALIF!$C$3:$R$56,8,FALSE))","v":""},{"$f":"IF($B82=\"\",\"\",VLOOKUP($B82:$B82,QUALIF!$C$3:$R$56,9,FALSE))","v":""},{"$f":"IF($B82=\"\",\"\",VLOOKUP($B82:$B82,QUALIF!$C$3:$R$56,10,FALSE))","v":""},{"$f":"IF($B82=\"\",\"\",VLOOKUP($B82:$B82,QUALIF!$C$3:$R$56,11,FALSE))","v":""},{"$f":"IF($B82=\"\",\"\",VLOOKUP($B82:$B82,QUALIF!$C$3:$R$56,12,FALSE))","v":""},{"$f":"IF($B82=\"\",\"\",VLOOKUP($B82:$B82,QUALIF!$C$3:$R$56,13,FALSE))","v":""},{"$f":"IF($B82=\"\",\"\",VLOOKUP($B82:$B82,QUALIF!$C$3:$R$56,14,FALSE))","v":""},{"$f":"IF($B82=\"\",\"\",VLOOKUP($B82:$B82,QUALIF!$C$3:$R$56,15,FALSE))","v":""},{"$f":"IF($B82=\"\",\"\",VLOOKUP($B82:$B82,QUALIF!$C$3:$R$56,16,FALSE))","v":""}]
[null,null,null,null,null," ",{"$f":"IF($B83=\"\",\"\",VLOOKUP($B83:$B83,QUALIF!$C$3:$R$56,4,FALSE))","v":""},{"$f":"IF($B83=\"\",\"\",VLOOKUP($B83:$B83,QUALIF!$C$3:$R$56,5,FALSE))","v":""},{"$f":"IF($B83=\"\",\"\",VLOOKUP($B83:$B83,QUALIF!$C$3:$R$56,6,FALSE))","v":""},{"$f":"IF($B83=\"\",\"\",VLOOKUP($B83:$B83,QUALIF!$C$3:$R$56,7,FALSE))","v":""},{"$f":"IF($B83=\"\",\"\",VLOOKUP($B83:$B83,QUALIF!$C$3:$R$56,8,FALSE))","v":""},{"$f":"IF($B83=\"\",\"\",VLOOKUP($B83:$B83,QUALIF!$C$3:$R$56,9,FALSE))","v":""},{"$f":"IF($B83=\"\",\"\",VLOOKUP($B83:$B83,QUALIF!$C$3:$R$56,10,FALSE))","v":""},{"$f":"IF($B83=\"\",\"\",VLOOKUP($B83:$B83,QUALIF!$C$3:$R$56,11,FALSE))","v":""},{"$f":"IF($B83=\"\",\"\",VLOOKUP($B83:$B83,QUALIF!$C$3:$R$56,12,FALSE))","v":""},{"$f":"IF($B83=\"\",\"\",VLOOKUP($B83:$B83,QUALIF!$C$3:$R$56,13,FALSE))","v":""},{"$f":"IF($B83=\"\",\"\",VLOOKUP($B83:$B83,QUALIF!$C$3:$R$56,14,FALSE))","v":""},{"$f":"IF($B83=\"\",\"\",VLOOKUP($B83:$B83,QUALIF!$C$3:$R$56,15,FALSE))","v":""},{"$f":"IF($B83=\"\",\"\",VLOOKUP($B83:$B83,QUALIF!$C$3:$R$56,16,FALSE))","v":""}]
[null,null,null,null,null," ",{"$f":"IF($B84=\"\",\"\",VLOOKUP($B84:$B84,QUALIF!$C$3:$R$56,4,FALSE))","v":""},{"$f":"IF($B84=\"\",\"\",VLOOKUP($B84:$B84,QUALIF!$C$3:$R$56,5,FALSE))","v":""},{"$f":"IF($B84=\"\",\"\",VLOOKUP($B84:$B84,QUALIF!$C$3:$R$56,6,FALSE))","v":""},{"$f":"IF($B84=\"\",\"\",VLOOKUP($B84:$B84,QUALIF!$C$3:$R$56,7,FALSE))","v":""},{"$f":"IF($B84=\"\",\"\",VLOOKUP($B84:$B84,QUALIF!$C$3:$R$56,8,FALSE))","v":""},{"$f":"IF($B84=\"\",\"\",VLOOKUP($B84:$B84,QUALIF!$C$3:$R$56,9,FALSE))","v":""},{"$f":"IF($B84=\"\",\"\",VLOOKUP($B84:$B84,QUALIF!$C$3:$R$56,10,FALSE))","v":""},{"$f":"IF($B84=\"\",\"\",VLOOKUP($B84:$B84,QUALIF!$C$3:$R$56,11,FALSE))","v":""},{"$f":"IF($B84=\"\",\"\",VLOOKUP($B84:$B84,QUALIF!$C$3:$R$56,12,FALSE))","v":""},{"$f":"IF($B84=\"\",\"\",VLOOKUP($B84:$B84,QUALIF!$C$3:$R$56,13,FALSE))","v":""},{"$f":"IF($B84=\"\",\"\",VLOOKUP($B84:$B84,QUALIF!$C$3:$R$56,14,FALSE))","v":""},{"$f":"IF($B84=\"\",\"\",VLOOKUP($B84:$B84,QUALIF!$C$3:$R$56,15,FALSE))","v":""},{"$f":"IF($B84=\"\",\"\",VLOOKUP($B84:$B84,QUALIF!$C$3:$R$56,16,FALSE))","v":""}]
[null,null,null,null,null," ",{"$f":"IF($B85=\"\",\"\",VLOOKUP($B85:$B85,QUALIF!$C$3:$R$56,4,FALSE))","v":""},{"$f":"IF($B85=\"\",\"\",VLOOKUP($B85:$B85,QUALIF!$C$3:$R$56,5,FALSE))","v":""},{"$f":"IF($B85=\"\",\"\",VLOOKUP($B85:$B85,QUALIF!$C$3:$R$56,6,FALSE))","v":""},{"$f":"IF($B85=\"\",\"\",VLOOKUP($B85:$B85,QUALIF!$C$3:$R$56,7,FALSE))","v":""},{"$f":"IF($B85=\"\",\"\",VLOOKUP($B85:$B85,QUALIF!$C$3:$R$56,8,FALSE))","v":""},{"$f":"IF($B85=\"\",\"\",VLOOKUP($B85:$B85,QUALIF!$C$3:$R$56,9,FALSE))","v":""},{"$f":"IF($B85=\"\",\"\",VLOOKUP($B85:$B85,QUALIF!$C$3:$R$56,10,FALSE))","v":""},{"$f":"IF($B85=\"\",\"\",VLOOKUP($B85:$B85,QUALIF!$C$3:$R$56,11,FALSE))","v":""},{"$f":"IF($B85=\"\",\"\",VLOOKUP($B85:$B85,QUALIF!$C$3:$R$56,12,FALSE))","v":""},{"$f":"IF($B85=\"\",\"\",VLOOKUP($B85:$B85,QUALIF!$C$3:$R$56,13,FALSE))","v":""},{"$f":"IF($B85=\"\",\"\",VLOOKUP($B85:$B85,QUALIF!$C$3:$R$56,14,FALSE))","v":""},{"$f":"IF($B85=\"\",\"\",VLOOKUP($B85:$B85,QUALIF!$C$3:$R$56,15,FALSE))","v":""},{"$f":"IF($B85=\"\",\"\",VLOOKUP($B85:$B85,QUALIF!$C$3:$R$56,16,FALSE))","v":""}]
[null,null,null,null,null," ",{"$f":"IF($B86=\"\",\"\",VLOOKUP($B86:$B86,QUALIF!$C$3:$R$56,4,FALSE))","v":""},{"$f":"IF($B86=\"\",\"\",VLOOKUP($B86:$B86,QUALIF!$C$3:$R$56,5,FALSE))","v":""},{"$f":"IF($B86=\"\",\"\",VLOOKUP($B86:$B86,QUALIF!$C$3:$R$56,6,FALSE))","v":""},{"$f":"IF($B86=\"\",\"\",VLOOKUP($B86:$B86,QUALIF!$C$3:$R$56,7,FALSE))","v":""},{"$f":"IF($B86=\"\",\"\",VLOOKUP($B86:$B86,QUALIF!$C$3:$R$56,8,FALSE))","v":""},{"$f":"IF($B86=\"\",\"\",VLOOKUP($B86:$B86,QUALIF!$C$3:$R$56,9,FALSE))","v":""},{"$f":"IF($B86=\"\",\"\",VLOOKUP($B86:$B86,QUALIF!$C$3:$R$56,10,FALSE))","v":""},{"$f":"IF($B86=\"\",\"\",VLOOKUP($B86:$B86,QUALIF!$C$3:$R$56,11,FALSE))","v":""},{"$f":"IF($B86=\"\",\"\",VLOOKUP($B86:$B86,QUALIF!$C$3:$R$56,12,FALSE))","v":""},{"$f":"IF($B86=\"\",\"\",VLOOKUP($B86:$B86,QUALIF!$C$3:$R$56,13,FALSE))","v":""},{"$f":"IF($B86=\"\",\"\",VLOOKUP($B86:$B86,QUALIF!$C$3:$R$56,14,FALSE))","v":""},{"$f":"IF($B86=\"\",\"\",VLOOKUP($B86:$B86,QUALIF!$C$3:$R$56,15,FALSE))","v":""},{"$f":"IF($B86=\"\",\"\",VLOOKUP($B86:$B86,QUALIF!$C$3:$R$56,16,FALSE))","v":""}]
[null,null,null,null,null,{"$f":"A87&\" \"&B87","v":" "},{"$f":"IF($B87=\"\",\"\",VLOOKUP($B87:$B87,QUALIF!$C$3:$R$56,4,FALSE))","v":""},{"$f":"IF($B87=\"\",\"\",VLOOKUP($B87:$B87,QUALIF!$C$3:$R$56,5,FALSE))","v":""},{"$f":"IF($B87=\"\",\"\",VLOOKUP($B87:$B87,QUALIF!$C$3:$R$56,6,FALSE))","v":""},{"$f":"IF($B87=\"\",\"\",VLOOKUP($B87:$B87,QUALIF!$C$3:$R$56,7,FALSE))","v":""},{"$f":"IF($B87=\"\",\"\",VLOOKUP($B87:$B87,QUALIF!$C$3:$R$56,8,FALSE))","v":""},{"$f":"IF($B87=\"\",\"\",VLOOKUP($B87:$B87,QUALIF!$C$3:$R$56,9,FALSE))","v":""},{"$f":"IF($B87=\"\",\"\",VLOOKUP($B87:$B87,QUALIF!$C$3:$R$56,10,FALSE))","v":""},{"$f":"IF($B87=\"\",\"\",VLOOKUP($B87:$B87,QUALIF!$C$3:$R$56,11,FALSE))","v":""},{"$f":"IF($B87=\"\",\"\",VLOOKUP($B87:$B87,QUALIF!$C$3:$R$56,12,FALSE))","v":""},{"$f":"IF($B87=\"\",\"\",VLOOKUP($B87:$B87,QUALIF!$C$3:$R$56,13,FALSE))","v":""},{"$f":"IF($B87=\"\",\"\",VLOOKUP($B87:$B87,QUALIF!$C$3:$R$56,14,FALSE))","v":""},{"$f":"IF($B87=\"\",\"\",VLOOKUP($B87:$B87,QUALIF!$C$3:$R$56,15,FALSE))","v":""},{"$f":"IF($B87=\"\",\"\",VLOOKUP($B87:$B87,QUALIF!$C$3:$R$56,16,FALSE))","v":""}]
[null,null,null,null,null," ",{"$f":"IF($B88=\"\",\"\",VLOOKUP($B88:$B88,QUALIF!$C$3:$R$56,4,FALSE))","v":""},{"$f":"IF($B88=\"\",\"\",VLOOKUP($B88:$B88,QUALIF!$C$3:$R$56,5,FALSE))","v":""},{"$f":"IF($B88=\"\",\"\",VLOOKUP($B88:$B88,QUALIF!$C$3:$R$56,6,FALSE))","v":""},{"$f":"IF($B88=\"\",\"\",VLOOKUP($B88:$B88,QUALIF!$C$3:$R$56,7,FALSE))","v":""},{"$f":"IF($B88=\"\",\"\",VLOOKUP($B88:$B88,QUALIF!$C$3:$R$56,8,FALSE))","v":""},{"$f":"IF($B88=\"\",\"\",VLOOKUP($B88:$B88,QUALIF!$C$3:$R$56,9,FALSE))","v":""},{"$f":"IF($B88=\"\",\"\",VLOOKUP($B88:$B88,QUALIF!$C$3:$R$56,10,FALSE))","v":""},{"$f":"IF($B88=\"\",\"\",VLOOKUP($B88:$B88,QUALIF!$C$3:$R$56,11,FALSE))","v":""},{"$f":"IF($B88=\"\",\"\",VLOOKUP($B88:$B88,QUALIF!$C$3:$R$56,12,FALSE))","v":""},{"$f":"IF($B88=\"\",\"\",VLOOKUP($B88:$B88,QUALIF!$C$3:$R$56,13,FALSE))","v":""},{"$f":"IF($B88=\"\",\"\",VLOOKUP($B88:$B88,QUALIF!$C$3:$R$56,14,FALSE))","v":""},{"$f":"IF($B88=\"\",\"\",VLOOKUP($B88:$B88,QUALIF!$C$3:$R$56,15,FALSE))","v":""},{"$f":"IF($B88=\"\",\"\",VLOOKUP($B88:$B88,QUALIF!$C$3:$R$56,16,FALSE))","v":""}]
[null,null,null,null,null," ",{"$f":"IF($B89=\"\",\"\",VLOOKUP($B89:$B89,QUALIF!$C$3:$R$56,4,FALSE))","v":""},{"$f":"IF($B89=\"\",\"\",VLOOKUP($B89:$B89,QUALIF!$C$3:$R$56,5,FALSE))","v":""},{"$f":"IF($B89=\"\",\"\",VLOOKUP($B89:$B89,QUALIF!$C$3:$R$56,6,FALSE))","v":""},{"$f":"IF($B89=\"\",\"\",VLOOKUP($B89:$B89,QUALIF!$C$3:$R$56,7,FALSE))","v":""},{"$f":"IF($B89=\"\",\"\",VLOOKUP($B89:$B89,QUALIF!$C$3:$R$56,8,FALSE))","v":""},{"$f":"IF($B89=\"\",\"\",VLOOKUP($B89:$B89,QUALIF!$C$3:$R$56,9,FALSE))","v":""},{"$f":"IF($B89=\"\",\"\",VLOOKUP($B89:$B89,QUALIF!$C$3:$R$56,10,FALSE))","v":""},{"$f":"IF($B89=\"\",\"\",VLOOKUP($B89:$B89,QUALIF!$C$3:$R$56,11,FALSE))","v":""},{"$f":"IF($B89=\"\",\"\",VLOOKUP($B89:$B89,QUALIF!$C$3:$R$56,12,FALSE))","v":""},{"$f":"IF($B89=\"\",\"\",VLOOKUP($B89:$B89,QUALIF!$C$3:$R$56,13,FALSE))","v":""},{"$f":"IF($B89=\"\",\"\",VLOOKUP($B89:$B89,QUALIF!$C$3:$R$56,14,FALSE))","v":""},{"$f":"IF($B89=\"\",\"\",VLOOKUP($B89:$B89,QUALIF!$C$3:$R$56,15,FALSE))","v":""},{"$f":"IF($B89=\"\",\"\",VLOOKUP($B89:$B89,QUALIF!$C$3:$R$56,16,FALSE))","v":""}]
[null,null,null,null,null," ",{"$f":"IF($B90=\"\",\"\",VLOOKUP($B90:$B90,QUALIF!$C$3:$R$56,4,FALSE))","v":""},{"$f":"IF($B90=\"\",\"\",VLOOKUP($B90:$B90,QUALIF!$C$3:$R$56,5,FALSE))","v":""},{"$f":"IF($B90=\"\",\"\",VLOOKUP($B90:$B90,QUALIF!$C$3:$R$56,6,FALSE))","v":""},{"$f":"IF($B90=\"\",\"\",VLOOKUP($B90:$B90,QUALIF!$C$3:$R$56,7,FALSE))","v":""},{"$f":"IF($B90=\"\",\"\",VLOOKUP($B90:$B90,QUALIF!$C$3:$R$56,8,FALSE))","v":""},{"$f":"IF($B90=\"\",\"\",VLOOKUP($B90:$B90,QUALIF!$C$3:$R$56,9,FALSE))","v":""},{"$f":"IF($B90=\"\",\"\",VLOOKUP($B90:$B90,QUALIF!$C$3:$R$56,10,FALSE))","v":""},{"$f":"IF($B90=\"\",\"\",VLOOKUP($B90:$B90,QUALIF!$C$3:$R$56,11,FALSE))","v":""},{"$f":"IF($B90=\"\",\"\",VLOOKUP($B90:$B90,QUALIF!$C$3:$R$56,12,FALSE))","v":""},{"$f":"IF($B90=\"\",\"\",VLOOKUP($B90:$B90,QUALIF!$C$3:$R$56,13,FALSE))","v":""},{"$f":"IF($B90=\"\",\"\",VLOOKUP($B90:$B90,QUALIF!$C$3:$R$56,14,FALSE))","v":""},{"$f":"IF($B90=\"\",\"\",VLOOKUP($B90:$B90,QUALIF!$C$3:$R$56,15,FALSE))","v":""},{"$f":"IF($B90=\"\",\"\",VLOOKUP($B90:$B90,QUALIF!$C$3:$R$56,16,FALSE))","v":""}]
[null,null,null,null,null," ",{"$f":"IF($B91=\"\",\"\",VLOOKUP($B91:$B91,QUALIF!$C$3:$R$56,4,FALSE))","v":""},{"$f":"IF($B91=\"\",\"\",VLOOKUP($B91:$B91,QUALIF!$C$3:$R$56,5,FALSE))","v":""},{"$f":"IF($B91=\"\",\"\",VLOOKUP($B91:$B91,QUALIF!$C$3:$R$56,6,FALSE))","v":""},{"$f":"IF($B91=\"\",\"\",VLOOKUP($B91:$B91,QUALIF!$C$3:$R$56,7,FALSE))","v":""},{"$f":"IF($B91=\"\",\"\",VLOOKUP($B91:$B91,QUALIF!$C$3:$R$56,8,FALSE))","v":""},{"$f":"IF($B91=\"\",\"\",VLOOKUP($B91:$B91,QUALIF!$C$3:$R$56,9,FALSE))","v":""},{"$f":"IF($B91=\"\",\"\",VLOOKUP($B91:$B91,QUALIF!$C$3:$R$56,10,FALSE))","v":""},{"$f":"IF($B91=\"\",\"\",VLOOKUP($B91:$B91,QUALIF!$C$3:$R$56,11,FALSE))","v":""},{"$f":"IF($B91=\"\",\"\",VLOOKUP($B91:$B91,QUALIF!$C$3:$R$56,12,FALSE))","v":""},{"$f":"IF($B91=\"\",\"\",VLOOKUP($B91:$B91,QUALIF!$C$3:$R$56,13,FALSE))","v":""},{"$f":"IF($B91=\"\",\"\",VLOOKUP($B91:$B91,QUALIF!$C$3:$R$56,14,FALSE))","v":""},{"$f":"IF($B91=\"\",\"\",VLOOKUP($B91:$B91,QUALIF!$C$3:$R$56,15,FALSE))","v":""},{"$f":"IF($B91=\"\",\"\",VLOOKUP($B91:$B91,QUALIF!$C$3:$R$56,16,FALSE))","v":""}]
[null,null,null,null,null," ",{"$f":"IF($B92=\"\",\"\",VLOOKUP($B92:$B92,QUALIF!$C$3:$R$56,4,FALSE))","v":""},{"$f":"IF($B92=\"\",\"\",VLOOKUP($B92:$B92,QUALIF!$C$3:$R$56,5,FALSE))","v":""},{"$f":"IF($B92=\"\",\"\",VLOOKUP($B92:$B92,QUALIF!$C$3:$R$56,6,FALSE))","v":""},{"$f":"IF($B92=\"\",\"\",VLOOKUP($B92:$B92,QUALIF!$C$3:$R$56,7,FALSE))","v":""},{"$f":"IF($B92=\"\",\"\",VLOOKUP($B92:$B92,QUALIF!$C$3:$R$56,8,FALSE))","v":""},{"$f":"IF($B92=\"\",\"\",VLOOKUP($B92:$B92,QUALIF!$C$3:$R$56,9,FALSE))","v":""},{"$f":"IF($B92=\"\",\"\",VLOOKUP($B92:$B92,QUALIF!$C$3:$R$56,10,FALSE))","v":""},{"$f":"IF($B92=\"\",\"\",VLOOKUP($B92:$B92,QUALIF!$C$3:$R$56,11,FALSE))","v":""},{"$f":"IF($B92=\"\",\"\",VLOOKUP($B92:$B92,QUALIF!$C$3:$R$56,12,FALSE))","v":""},{"$f":"IF($B92=\"\",\"\",VLOOKUP($B92:$B92,QUALIF!$C$3:$R$56,13,FALSE))","v":""},{"$f":"IF($B92=\"\",\"\",VLOOKUP($B92:$B92,QUALIF!$C$3:$R$56,14,FALSE))","v":""},{"$f":"IF($B92=\"\",\"\",VLOOKUP($B92:$B92,QUALIF!$C$3:$R$56,15,FALSE))","v":""},{"$f":"IF($B92=\"\",\"\",VLOOKUP($B92:$B92,QUALIF!$C$3:$R$56,16,FALSE))","v":""}]
[null,null,null,null,null," ",{"$f":"IF($B93=\"\",\"\",VLOOKUP($B93:$B93,QUALIF!$C$3:$R$56,4,FALSE))","v":""},{"$f":"IF($B93=\"\",\"\",VLOOKUP($B93:$B93,QUALIF!$C$3:$R$56,5,FALSE))","v":""},{"$f":"IF($B93=\"\",\"\",VLOOKUP($B93:$B93,QUALIF!$C$3:$R$56,6,FALSE))","v":""},{"$f":"IF($B93=\"\",\"\",VLOOKUP($B93:$B93,QUALIF!$C$3:$R$56,7,FALSE))","v":""},{"$f":"IF($B93=\"\",\"\",VLOOKUP($B93:$B93,QUALIF!$C$3:$R$56,8,FALSE))","v":""},{"$f":"IF($B93=\"\",\"\",VLOOKUP($B93:$B93,QUALIF!$C$3:$R$56,9,FALSE))","v":""},{"$f":"IF($B93=\"\",\"\",VLOOKUP($B93:$B93,QUALIF!$C$3:$R$56,10,FALSE))","v":""},{"$f":"IF($B93=\"\",\"\",VLOOKUP($B93:$B93,QUALIF!$C$3:$R$56,11,FALSE))","v":""},{"$f":"IF($B93=\"\",\"\",VLOOKUP($B93:$B93,QUALIF!$C$3:$R$56,12,FALSE))","v":""},{"$f":"IF($B93=\"\",\"\",VLOOKUP($B93:$B93,QUALIF!$C$3:$R$56,13,FALSE))","v":""},{"$f":"IF($B93=\"\",\"\",VLOOKUP($B93:$B93,QUALIF!$C$3:$R$56,14,FALSE))","v":""},{"$f":"IF($B93=\"\",\"\",VLOOKUP($B93:$B93,QUALIF!$C$3:$R$56,15,FALSE))","v":""},{"$f":"IF($B93=\"\",\"\",VLOOKUP($B93:$B93,QUALIF!$C$3:$R$56,16,FALSE))","v":""}]
[null,null,null,null,null," ",{"$f":"IF($B94=\"\",\"\",VLOOKUP($B94:$B94,QUALIF!$C$3:$R$56,4,FALSE))","v":""},{"$f":"IF($B94=\"\",\"\",VLOOKUP($B94:$B94,QUALIF!$C$3:$R$56,5,FALSE))","v":""},{"$f":"IF($B94=\"\",\"\",VLOOKUP($B94:$B94,QUALIF!$C$3:$R$56,6,FALSE))","v":""},{"$f":"IF($B94=\"\",\"\",VLOOKUP($B94:$B94,QUALIF!$C$3:$R$56,7,FALSE))","v":""},{"$f":"IF($B94=\"\",\"\",VLOOKUP($B94:$B94,QUALIF!$C$3:$R$56,8,FALSE))","v":""},{"$f":"IF($B94=\"\",\"\",VLOOKUP($B94:$B94,QUALIF!$C$3:$R$56,9,FALSE))","v":""},{"$f":"IF($B94=\"\",\"\",VLOOKUP($B94:$B94,QUALIF!$C$3:$R$56,10,FALSE))","v":""},{"$f":"IF($B94=\"\",\"\",VLOOKUP($B94:$B94,QUALIF!$C$3:$R$56,11,FALSE))","v":""},{"$f":"IF($B94=\"\",\"\",VLOOKUP($B94:$B94,QUALIF!$C$3:$R$56,12,FALSE))","v":""},{"$f":"IF($B94=\"\",\"\",VLOOKUP($B94:$B94,QUALIF!$C$3:$R$56,13,FALSE))","v":""},{"$f":"IF($B94=\"\",\"\",VLOOKUP($B94:$B94,QUALIF!$C$3:$R$56,14,FALSE))","v":""},{"$f":"IF($B94=\"\",\"\",VLOOKUP($B94:$B94,QUALIF!$C$3:$R$56,15,FALSE))","v":""},{"$f":"IF($B94=\"\",\"\",VLOOKUP($B94:$B94,QUALIF!$C$3:$R$56,16,FALSE))","v":""}]
[null,null,null,null,null," ",{"$f":"IF($B95=\"\",\"\",VLOOKUP($B95:$B95,QUALIF!$C$3:$R$56,4,FALSE))","v":""},{"$f":"IF($B95=\"\",\"\",VLOOKUP($B95:$B95,QUALIF!$C$3:$R$56,5,FALSE))","v":""},{"$f":"IF($B95=\"\",\"\",VLOOKUP($B95:$B95,QUALIF!$C$3:$R$56,6,FALSE))","v":""},{"$f":"IF($B95=\"\",\"\",VLOOKUP($B95:$B95,QUALIF!$C$3:$R$56,7,FALSE))","v":""},{"$f":"IF($B95=\"\",\"\",VLOOKUP($B95:$B95,QUALIF!$C$3:$R$56,8,FALSE))","v":""},{"$f":"IF($B95=\"\",\"\",VLOOKUP($B95:$B95,QUALIF!$C$3:$R$56,9,FALSE))","v":""},{"$f":"IF($B95=\"\",\"\",VLOOKUP($B95:$B95,QUALIF!$C$3:$R$56,10,FALSE))","v":""},{"$f":"IF($B95=\"\",\"\",VLOOKUP($B95:$B95,QUALIF!$C$3:$R$56,11,FALSE))","v":""},{"$f":"IF($B95=\"\",\"\",VLOOKUP($B95:$B95,QUALIF!$C$3:$R$56,12,FALSE))","v":""},{"$f":"IF($B95=\"\",\"\",VLOOKUP($B95:$B95,QUALIF!$C$3:$R$56,13,FALSE))","v":""},{"$f":"IF($B95=\"\",\"\",VLOOKUP($B95:$B95,QUALIF!$C$3:$R$56,14,FALSE))","v":""},{"$f":"IF($B95=\"\",\"\",VLOOKUP($B95:$B95,QUALIF!$C$3:$R$56,15,FALSE))","v":""},{"$f":"IF($B95=\"\",\"\",VLOOKUP($B95:$B95,QUALIF!$C$3:$R$56,16,FALSE))","v":""}]
[null,null,null,null,null," ",{"$f":"IF($B96=\"\",\"\",VLOOKUP($B96:$B96,QUALIF!$C$3:$R$38,4,FALSE))","v":""},{"$f":"IF($B96=\"\",\"\",VLOOKUP($B96:$B96,QUALIF!$C$3:$R$38,5,FALSE))","v":""},{"$f":"IF($B96=\"\",\"\",VLOOKUP($B96:$B96,QUALIF!$C$3:$R$38,6,FALSE))","v":""},{"$f":"IF($B96=\"\",\"\",VLOOKUP($B96:$B96,QUALIF!$C$3:$R$38,7,FALSE))","v":""},{"$f":"IF($B96=\"\",\"\",VLOOKUP($B96:$B96,QUALIF!$C$3:$R$38,8,FALSE))","v":""},{"$f":"IF($B96=\"\",\"\",VLOOKUP($B96:$B96,QUALIF!$C$3:$R$38,9,FALSE))","v":""},{"$f":"IF($B96=\"\",\"\",VLOOKUP($B96:$B96,QUALIF!$C$3:$R$38,10,FALSE))","v":""},{"$f":"IF($B96=\"\",\"\",VLOOKUP($B96:$B96,QUALIF!$C$3:$R$38,11,FALSE))","v":""},{"$f":"IF($B96=\"\",\"\",VLOOKUP($B96:$B96,QUALIF!$C$3:$R$38,12,FALSE))","v":""},{"$f":"IF($B96=\"\",\"\",VLOOKUP($B96:$B96,QUALIF!$C$3:$R$38,13,FALSE))","v":""},{"$f":"IF($B96=\"\",\"\",VLOOKUP($B96:$B96,QUALIF!$C$3:$R$38,14,FALSE))","v":""},{"$f":"IF($B96=\"\",\"\",VLOOKUP($B96:$B96,QUALIF!$C$3:$R$38,15,FALSE))","v":""},{"$f":"IF($B96=\"\",\"\",VLOOKUP($B96:$B96,QUALIF!$C$3:$R$38,16,FALSE))","v":""}]
[null,null,null,null,null," ",{"$f":"IF($B97=\"\",\"\",VLOOKUP($B97:$B97,QUALIF!$C$3:$R$38,4,FALSE))","v":""},{"$f":"IF($B97=\"\",\"\",VLOOKUP($B97:$B97,QUALIF!$C$3:$R$38,5,FALSE))","v":""},{"$f":"IF($B97=\"\",\"\",VLOOKUP($B97:$B97,QUALIF!$C$3:$R$38,6,FALSE))","v":""},{"$f":"IF($B97=\"\",\"\",VLOOKUP($B97:$B97,QUALIF!$C$3:$R$38,7,FALSE))","v":""},{"$f":"IF($B97=\"\",\"\",VLOOKUP($B97:$B97,QUALIF!$C$3:$R$38,8,FALSE))","v":""},{"$f":"IF($B97=\"\",\"\",VLOOKUP($B97:$B97,QUALIF!$C$3:$R$38,9,FALSE))","v":""},{"$f":"IF($B97=\"\",\"\",VLOOKUP($B97:$B97,QUALIF!$C$3:$R$38,10,FALSE))","v":""},{"$f":"IF($B97=\"\",\"\",VLOOKUP($B97:$B97,QUALIF!$C$3:$R$38,11,FALSE))","v":""},{"$f":"IF($B97=\"\",\"\",VLOOKUP($B97:$B97,QUALIF!$C$3:$R$38,12,FALSE))","v":""},{"$f":"IF($B97=\"\",\"\",VLOOKUP($B97:$B97,QUALIF!$C$3:$R$38,13,FALSE))","v":""},{"$f":"IF($B97=\"\",\"\",VLOOKUP($B97:$B97,QUALIF!$C$3:$R$38,14,FALSE))","v":""},{"$f":"IF($B97=\"\",\"\",VLOOKUP($B97:$B97,QUALIF!$C$3:$R$38,15,FALSE))","v":""},{"$f":"IF($B97=\"\",\"\",VLOOKUP($B97:$B97,QUALIF!$C$3:$R$38,16,FALSE))","v":""}]
[null,null,null,null,null," ",{"$f":"IF($B98=\"\",\"\",VLOOKUP($B98:$B98,QUALIF!$C$3:$R$38,4,FALSE))","v":""},{"$f":"IF($B98=\"\",\"\",VLOOKUP($B98:$B98,QUALIF!$C$3:$R$38,5,FALSE))","v":""},{"$f":"IF($B98=\"\",\"\",VLOOKUP($B98:$B98,QUALIF!$C$3:$R$38,6,FALSE))","v":""},{"$f":"IF($B98=\"\",\"\",VLOOKUP($B98:$B98,QUALIF!$C$3:$R$38,7,FALSE))","v":""},{"$f":"IF($B98=\"\",\"\",VLOOKUP($B98:$B98,QUALIF!$C$3:$R$38,8,FALSE))","v":""},{"$f":"IF($B98=\"\",\"\",VLOOKUP($B98:$B98,QUALIF!$C$3:$R$38,9,FALSE))","v":""},{"$f":"IF($B98=\"\",\"\",VLOOKUP($B98:$B98,QUALIF!$C$3:$R$38,10,FALSE))","v":""},{"$f":"IF($B98=\"\",\"\",VLOOKUP($B98:$B98,QUALIF!$C$3:$R$38,11,FALSE))","v":""},{"$f":"IF($B98=\"\",\"\",VLOOKUP($B98:$B98,QUALIF!$C$3:$R$38,12,FALSE))","v":""},{"$f":"IF($B98=\"\",\"\",VLOOKUP($B98:$B98,QUALIF!$C$3:$R$38,13,FALSE))","v":""},{"$f":"IF($B98=\"\",\"\",VLOOKUP($B98:$B98,QUALIF!$C$3:$R$38,14,FALSE))","v":""},{"$f":"IF($B98=\"\",\"\",VLOOKUP($B98:$B98,QUALIF!$C$3:$R$38,15,FALSE))","v":""},{"$f":"IF($B98=\"\",\"\",VLOOKUP($B98:$B98,QUALIF!$C$3:$R$38,16,FALSE))","v":""}]
[null,null,null,null,null," ",{"$f":"IF($B99=\"\",\"\",VLOOKUP($B99:$B99,QUALIF!$C$3:$R$38,4,FALSE))","v":""},{"$f":"IF($B99=\"\",\"\",VLOOKUP($B99:$B99,QUALIF!$C$3:$R$38,5,FALSE))","v":""},{"$f":"IF($B99=\"\",\"\",VLOOKUP($B99:$B99,QUALIF!$C$3:$R$38,6,FALSE))","v":""},{"$f":"IF($B99=\"\",\"\",VLOOKUP($B99:$B99,QUALIF!$C$3:$R$38,7,FALSE))","v":""},{"$f":"IF($B99=\"\",\"\",VLOOKUP($B99:$B99,QUALIF!$C$3:$R$38,8,FALSE))","v":""},{"$f":"IF($B99=\"\",\"\",VLOOKUP($B99:$B99,QUALIF!$C$3:$R$38,9,FALSE))","v":""},{"$f":"IF($B99=\"\",\"\",VLOOKUP($B99:$B99,QUALIF!$C$3:$R$38,10,FALSE))","v":""},{"$f":"IF($B99=\"\",\"\",VLOOKUP($B99:$B99,QUALIF!$C$3:$R$38,11,FALSE))","v":""},{"$f":"IF($B99=\"\",\"\",VLOOKUP($B99:$B99,QUALIF!$C$3:$R$38,12,FALSE))","v":""},{"$f":"IF($B99=\"\",\"\",VLOOKUP($B99:$B99,QUALIF!$C$3:$R$38,13,FALSE))","v":""},{"$f":"IF($B99=\"\",\"\",VLOOKUP($B99:$B99,QUALIF!$C$3:$R$38,14,FALSE))","v":""},{"$f":"IF($B99=\"\",\"\",VLOOKUP($B99:$B99,QUALIF!$C$3:$R$38,15,FALSE))","v":""},{"$f":"IF($B99=\"\",\"\",VLOOKUP($B99:$B99,QUALIF!$C$3:$R$38,16,FALSE))","v":""}]
[null,null,null,null,null," ",{"$f":"IF($B100=\"\",\"\",VLOOKUP($B100:$B100,QUALIF!$C$3:$R$38,4,FALSE))","v":""},{"$f":"IF($B100=\"\",\"\",VLOOKUP($B100:$B100,QUALIF!$C$3:$R$38,5,FALSE))","v":""},{"$f":"IF($B100=\"\",\"\",VLOOKUP($B100:$B100,QUALIF!$C$3:$R$38,6,FALSE))","v":""},{"$f":"IF($B100=\"\",\"\",VLOOKUP($B100:$B100,QUALIF!$C$3:$R$38,7,FALSE))","v":""},{"$f":"IF($B100=\"\",\"\",VLOOKUP($B100:$B100,QUALIF!$C$3:$R$38,8,FALSE))","v":""},{"$f":"IF($B100=\"\",\"\",VLOOKUP($B100:$B100,QUALIF!$C$3:$R$38,9,FALSE))","v":""},{"$f":"IF($B100=\"\",\"\",VLOOKUP($B100:$B100,QUALIF!$C$3:$R$38,10,FALSE))","v":""},{"$f":"IF($B100=\"\",\"\",VLOOKUP($B100:$B100,QUALIF!$C$3:$R$38,11,FALSE))","v":""},{"$f":"IF($B100=\"\",\"\",VLOOKUP($B100:$B100,QUALIF!$C$3:$R$38,12,FALSE))","v":""},{"$f":"IF($B100=\"\",\"\",VLOOKUP($B100:$B100,QUALIF!$C$3:$R$38,13,FALSE))","v":""},{"$f":"IF($B100=\"\",\"\",VLOOKUP($B100:$B100,QUALIF!$C$3:$R$38,14,FALSE))","v":""},{"$f":"IF($B100=\"\",\"\",VLOOKUP($B100:$B100,QUALIF!$C$3:$R$38,15,FALSE))","v":""},{"$f":"IF($B100=\"\",\"\",VLOOKUP($B100:$B100,QUALIF!$C$3:$R$38,16,FALSE))","v":""}]
[null,null,null,null,null," ",{"$f":"IF($B101=\"\",\"\",VLOOKUP($B101:$B101,QUALIF!$C$3:$R$38,4,FALSE))","v":""},{"$f":"IF($B101=\"\",\"\",VLOOKUP($B101:$B101,QUALIF!$C$3:$R$38,5,FALSE))","v":""},{"$f":"IF($B101=\"\",\"\",VLOOKUP($B101:$B101,QUALIF!$C$3:$R$38,6,FALSE))","v":""},{"$f":"IF($B101=\"\",\"\",VLOOKUP($B101:$B101,QUALIF!$C$3:$R$38,7,FALSE))","v":""},{"$f":"IF($B101=\"\",\"\",VLOOKUP($B101:$B101,QUALIF!$C$3:$R$38,8,FALSE))","v":""},{"$f":"IF($B101=\"\",\"\",VLOOKUP($B101:$B101,QUALIF!$C$3:$R$38,9,FALSE))","v":""},{"$f":"IF($B101=\"\",\"\",VLOOKUP($B101:$B101,QUALIF!$C$3:$R$38,10,FALSE))","v":""},{"$f":"IF($B101=\"\",\"\",VLOOKUP($B101:$B101,QUALIF!$C$3:$R$38,11,FALSE))","v":""},{"$f":"IF($B101=\"\",\"\",VLOOKUP($B101:$B101,QUALIF!$C$3:$R$38,12,FALSE))","v":""},{"$f":"IF($B101=\"\",\"\",VLOOKUP($B101:$B101,QUALIF!$C$3:$R$38,13,FALSE))","v":""},{"$f":"IF($B101=\"\",\"\",VLOOKUP($B101:$B101,QUALIF!$C$3:$R$38,14,FALSE))","v":""},{"$f":"IF($B101=\"\",\"\",VLOOKUP($B101:$B101,QUALIF!$C$3:$R$38,15,FALSE))","v":""},{"$f":"IF($B101=\"\",\"\",VLOOKUP($B101:$B101,QUALIF!$C$3:$R$38,16,FALSE))","v":""}]
[null,null,null,null,null," ",{"$f":"IF($B102=\"\",\"\",VLOOKUP($B102:$B102,QUALIF!$C$3:$R$38,4,FALSE))","v":""},{"$f":"IF($B102=\"\",\"\",VLOOKUP($B102:$B102,QUALIF!$C$3:$R$38,5,FALSE))","v":""},{"$f":"IF($B102=\"\",\"\",VLOOKUP($B102:$B102,QUALIF!$C$3:$R$38,6,FALSE))","v":""},{"$f":"IF($B102=\"\",\"\",VLOOKUP($B102:$B102,QUALIF!$C$3:$R$38,7,FALSE))","v":""},{"$f":"IF($B102=\"\",\"\",VLOOKUP($B102:$B102,QUALIF!$C$3:$R$38,8,FALSE))","v":""},{"$f":"IF($B102=\"\",\"\",VLOOKUP($B102:$B102,QUALIF!$C$3:$R$38,9,FALSE))","v":""},{"$f":"IF($B102=\"\",\"\",VLOOKUP($B102:$B102,QUALIF!$C$3:$R$38,10,FALSE))","v":""},{"$f":"IF($B102=\"\",\"\",VLOOKUP($B102:$B102,QUALIF!$C$3:$R$38,11,FALSE))","v":""},{"$f":"IF($B102=\"\",\"\",VLOOKUP($B102:$B102,QUALIF!$C$3:$R$38,12,FALSE))","v":""},{"$f":"IF($B102=\"\",\"\",VLOOKUP($B102:$B102,QUALIF!$C$3:$R$38,13,FALSE))","v":""},{"$f":"IF($B102=\"\",\"\",VLOOKUP($B102:$B102,QUALIF!$C$3:$R$38,14,FALSE))","v":""},{"$f":"IF($B102=\"\",\"\",VLOOKUP($B102:$B102,QUALIF!$C$3:$R$38,15,FALSE))","v":""},{"$f":"IF($B102=\"\",\"\",VLOOKUP($B102:$B102,QUALIF!$C$3:$R$38,16,FALSE))","v":""}]
[null,null,null,null,null," ",{"$f":"IF($B103=\"\",\"\",VLOOKUP($B103:$B103,QUALIF!$C$3:$R$38,4,FALSE))","v":""},{"$f":"IF($B103=\"\",\"\",VLOOKUP($B103:$B103,QUALIF!$C$3:$R$38,5,FALSE))","v":""},{"$f":"IF($B103=\"\",\"\",VLOOKUP($B103:$B103,QUALIF!$C$3:$R$38,6,FALSE))","v":""},{"$f":"IF($B103=\"\",\"\",VLOOKUP($B103:$B103,QUALIF!$C$3:$R$38,7,FALSE))","v":""},{"$f":"IF($B103=\"\",\"\",VLOOKUP($B103:$B103,QUALIF!$C$3:$R$38,8,FALSE))","v":""},{"$f":"IF($B103=\"\",\"\",VLOOKUP($B103:$B103,QUALIF!$C$3:$R$38,9,FALSE))","v":""},{"$f":"IF($B103=\"\",\"\",VLOOKUP($B103:$B103,QUALIF!$C$3:$R$38,10,FALSE))","v":""},{"$f":"IF($B103=\"\",\"\",VLOOKUP($B103:$B103,QUALIF!$C$3:$R$38,11,FALSE))","v":""},{"$f":"IF($B103=\"\",\"\",VLOOKUP($B103:$B103,QUALIF!$C$3:$R$38,12,FALSE))","v":""},{"$f":"IF($B103=\"\",\"\",VLOOKUP($B103:$B103,QUALIF!$C$3:$R$38,13,FALSE))","v":""},{"$f":"IF($B103=\"\",\"\",VLOOKUP($B103:$B103,QUALIF!$C$3:$R$38,14,FALSE))","v":""},{"$f":"IF($B103=\"\",\"\",VLOOKUP($B103:$B103,QUALIF!$C$3:$R$38,15,FALSE))","v":""},{"$f":"IF($B103=\"\",\"\",VLOOKUP($B103:$B103,QUALIF!$C$3:$R$38,16,FALSE))","v":""}]
[null,null,null,null,null," ",{"$f":"IF($B104=\"\",\"\",VLOOKUP($B104:$B104,QUALIF!$C$3:$R$38,4,FALSE))","v":""},{"$f":"IF($B104=\"\",\"\",VLOOKUP($B104:$B104,QUALIF!$C$3:$R$38,5,FALSE))","v":""},{"$f":"IF($B104=\"\",\"\",VLOOKUP($B104:$B104,QUALIF!$C$3:$R$38,6,FALSE))","v":""},{"$f":"IF($B104=\"\",\"\",VLOOKUP($B104:$B104,QUALIF!$C$3:$R$38,7,FALSE))","v":""},{"$f":"IF($B104=\"\",\"\",VLOOKUP($B104:$B104,QUALIF!$C$3:$R$38,8,FALSE))","v":""},{"$f":"IF($B104=\"\",\"\",VLOOKUP($B104:$B104,QUALIF!$C$3:$R$38,9,FALSE))","v":""},{"$f":"IF($B104=\"\",\"\",VLOOKUP($B104:$B104,QUALIF!$C$3:$R$38,10,FALSE))","v":""},{"$f":"IF($B104=\"\",\"\",VLOOKUP($B104:$B104,QUALIF!$C$3:$R$38,11,FALSE))","v":""},{"$f":"IF($B104=\"\",\"\",VLOOKUP($B104:$B104,QUALIF!$C$3:$R$38,12,FALSE))","v":""},{"$f":"IF($B104=\"\",\"\",VLOOKUP($B104:$B104,QUALIF!$C$3:$R$38,13,FALSE))","v":""},{"$f":"IF($B104=\"\",\"\",VLOOKUP($B104:$B104,QUALIF!$C$3:$R$38,14,FALSE))","v":""},{"$f":"IF($B104=\"\",\"\",VLOOKUP($B104:$B104,QUALIF!$C$3:$R$38,15,FALSE))","v":""},{"$f":"IF($B104=\"\",\"\",VLOOKUP($B104:$B104,QUALIF!$C$3:$R$38,16,FALSE))","v":""}]
[null,null,null,null,null," ",{"$f":"IF($B105=\"\",\"\",VLOOKUP($B105:$B105,QUALIF!$C$3:$R$38,4,FALSE))","v":""},{"$f":"IF($B105=\"\",\"\",VLOOKUP($B105:$B105,QUALIF!$C$3:$R$38,5,FALSE))","v":""},{"$f":"IF($B105=\"\",\"\",VLOOKUP($B105:$B105,QUALIF!$C$3:$R$38,6,FALSE))","v":""},{"$f":"IF($B105=\"\",\"\",VLOOKUP($B105:$B105,QUALIF!$C$3:$R$38,7,FALSE))","v":""},{"$f":"IF($B105=\"\",\"\",VLOOKUP($B105:$B105,QUALIF!$C$3:$R$38,8,FALSE))","v":""},{"$f":"IF($B105=\"\",\"\",VLOOKUP($B105:$B105,QUALIF!$C$3:$R$38,9,FALSE))","v":""},{"$f":"IF($B105=\"\",\"\",VLOOKUP($B105:$B105,QUALIF!$C$3:$R$38,10,FALSE))","v":""},{"$f":"IF($B105=\"\",\"\",VLOOKUP($B105:$B105,QUALIF!$C$3:$R$38,11,FALSE))","v":""},{"$f":"IF($B105=\"\",\"\",VLOOKUP($B105:$B105,QUALIF!$C$3:$R$38,12,FALSE))","v":""},{"$f":"IF($B105=\"\",\"\",VLOOKUP($B105:$B105,QUALIF!$C$3:$R$38,13,FALSE))","v":""},{"$f":"IF($B105=\"\",\"\",VLOOKUP($B105:$B105,QUALIF!$C$3:$R$38,14,FALSE))","v":""},{"$f":"IF($B105=\"\",\"\",VLOOKUP($B105:$B105,QUALIF!$C$3:$R$38,15,FALSE))","v":""},{"$f":"IF($B105=\"\",\"\",VLOOKUP($B105:$B105,QUALIF!$C$3:$R$38,16,FALSE))","v":""}]
[null,null,null,null,null," ",{"$f":"IF($B106=\"\",\"\",VLOOKUP($B106:$B106,QUALIF!$C$3:$R$38,4,FALSE))","v":""},{"$f":"IF($B106=\"\",\"\",VLOOKUP($B106:$B106,QUALIF!$C$3:$R$38,5,FALSE))","v":""},{"$f":"IF($B106=\"\",\"\",VLOOKUP($B106:$B106,QUALIF!$C$3:$R$38,6,FALSE))","v":""},{"$f":"IF($B106=\"\",\"\",VLOOKUP($B106:$B106,QUALIF!$C$3:$R$38,7,FALSE))","v":""},{"$f":"IF($B106=\"\",\"\",VLOOKUP($B106:$B106,QUALIF!$C$3:$R$38,8,FALSE))","v":""},{"$f":"IF($B106=\"\",\"\",VLOOKUP($B106:$B106,QUALIF!$C$3:$R$38,9,FALSE))","v":""},{"$f":"IF($B106=\"\",\"\",VLOOKUP($B106:$B106,QUALIF!$C$3:$R$38,10,FALSE))","v":""},{"$f":"IF($B106=\"\",\"\",VLOOKUP($B106:$B106,QUALIF!$C$3:$R$38,11,FALSE))","v":""},{"$f":"IF($B106=\"\",\"\",VLOOKUP($B106:$B106,QUALIF!$C$3:$R$38,12,FALSE))","v":""},{"$f":"IF($B106=\"\",\"\",VLOOKUP($B106:$B106,QUALIF!$C$3:$R$38,13,FALSE))","v":""},{"$f":"IF($B106=\"\",\"\",VLOOKUP($B106:$B106,QUALIF!$C$3:$R$38,14,FALSE))","v":""},{"$f":"IF($B106=\"\",\"\",VLOOKUP($B106:$B106,QUALIF!$C$3:$R$38,15,FALSE))","v":""},{"$f":"IF($B106=\"\",\"\",VLOOKUP($B106:$B106,QUALIF!$C$3:$R$38,16,FALSE))","v":""}]
[null,null,null,null,null," ",{"$f":"IF($B107=\"\",\"\",VLOOKUP($B107:$B107,QUALIF!$C$3:$R$38,4,FALSE))","v":""},{"$f":"IF($B107=\"\",\"\",VLOOKUP($B107:$B107,QUALIF!$C$3:$R$38,5,FALSE))","v":""},{"$f":"IF($B107=\"\",\"\",VLOOKUP($B107:$B107,QUALIF!$C$3:$R$38,6,FALSE))","v":""},{"$f":"IF($B107=\"\",\"\",VLOOKUP($B107:$B107,QUALIF!$C$3:$R$38,7,FALSE))","v":""},{"$f":"IF($B107=\"\",\"\",VLOOKUP($B107:$B107,QUALIF!$C$3:$R$38,8,FALSE))","v":""},{"$f":"IF($B107=\"\",\"\",VLOOKUP($B107:$B107,QUALIF!$C$3:$R$38,9,FALSE))","v":""},{"$f":"IF($B107=\"\",\"\",VLOOKUP($B107:$B107,QUALIF!$C$3:$R$38,10,FALSE))","v":""},{"$f":"IF($B107=\"\",\"\",VLOOKUP($B107:$B107,QUALIF!$C$3:$R$38,11,FALSE))","v":""},{"$f":"IF($B107=\"\",\"\",VLOOKUP($B107:$B107,QUALIF!$C$3:$R$38,12,FALSE))","v":""},{"$f":"IF($B107=\"\",\"\",VLOOKUP($B107:$B107,QUALIF!$C$3:$R$38,13,FALSE))","v":""},{"$f":"IF($B107=\"\",\"\",VLOOKUP($B107:$B107,QUALIF!$C$3:$R$38,14,FALSE))","v":""},{"$f":"IF($B107=\"\",\"\",VLOOKUP($B107:$B107,QUALIF!$C$3:$R$38,15,FALSE))","v":""},{"$f":"IF($B107=\"\",\"\",VLOOKUP($B107:$B107,QUALIF!$C$3:$R$38,16,FALSE))","v":""}]
[null,null,null,null,null," ",{"$f":"IF($B108=\"\",\"\",VLOOKUP($B108:$B108,QUALIF!$C$3:$R$38,4,FALSE))","v":""},{"$f":"IF($B108=\"\",\"\",VLOOKUP($B108:$B108,QUALIF!$C$3:$R$38,5,FALSE))","v":""},{"$f":"IF($B108=\"\",\"\",VLOOKUP($B108:$B108,QUALIF!$C$3:$R$38,6,FALSE))","v":""},{"$f":"IF($B108=\"\",\"\",VLOOKUP($B108:$B108,QUALIF!$C$3:$R$38,7,FALSE))","v":""},{"$f":"IF($B108=\"\",\"\",VLOOKUP($B108:$B108,QUALIF!$C$3:$R$38,8,FALSE))","v":""},{"$f":"IF($B108=\"\",\"\",VLOOKUP($B108:$B108,QUALIF!$C$3:$R$38,9,FALSE))","v":""},{"$f":"IF($B108=\"\",\"\",VLOOKUP($B108:$B108,QUALIF!$C$3:$R$38,10,FALSE))","v":""},{"$f":"IF($B108=\"\",\"\",VLOOKUP($B108:$B108,QUALIF!$C$3:$R$38,11,FALSE))","v":""},{"$f":"IF($B108=\"\",\"\",VLOOKUP($B108:$B108,QUALIF!$C$3:$R$38,12,FALSE))","v":""},{"$f":"IF($B108=\"\",\"\",VLOOKUP($B108:$B108,QUALIF!$C$3:$R$38,13,FALSE))","v":""},{"$f":"IF($B108=\"\",\"\",VLOOKUP($B108:$B108,QUALIF!$C$3:$R$38,14,FALSE))","v":""},{"$f":"IF($B108=\"\",\"\",VLOOKUP($B108:$B108,QUALIF!$C$3:$R$38,15,FALSE))","v":""},{"$f":"IF($B108=\"\",\"\",VLOOKUP($B108:$B108,QUALIF!$C$3:$R$38,16,FALSE))","v":""}]
[null,null,null,null,null," ",{"$f":"IF($B109=\"\",\"\",VLOOKUP($B109:$B109,QUALIF!$C$3:$R$38,4,FALSE))","v":""},{"$f":"IF($B109=\"\",\"\",VLOOKUP($B109:$B109,QUALIF!$C$3:$R$38,5,FALSE))","v":""},{"$f":"IF($B109=\"\",\"\",VLOOKUP($B109:$B109,QUALIF!$C$3:$R$38,6,FALSE))","v":""},{"$f":"IF($B109=\"\",\"\",VLOOKUP($B109:$B109,QUALIF!$C$3:$R$38,7,FALSE))","v":""},{"$f":"IF($B109=\"\",\"\",VLOOKUP($B109:$B109,QUALIF!$C$3:$R$38,8,FALSE))","v":""},{"$f":"IF($B109=\"\",\"\",VLOOKUP($B109:$B109,QUALIF!$C$3:$R$38,9,FALSE))","v":""},{"$f":"IF($B109=\"\",\"\",VLOOKUP($B109:$B109,QUALIF!$C$3:$R$38,10,FALSE))","v":""},{"$f":"IF($B109=\"\",\"\",VLOOKUP($B109:$B109,QUALIF!$C$3:$R$38,11,FALSE))","v":""},{"$f":"IF($B109=\"\",\"\",VLOOKUP($B109:$B109,QUALIF!$C$3:$R$38,12,FALSE))","v":""},{"$f":"IF($B109=\"\",\"\",VLOOKUP($B109:$B109,QUALIF!$C$3:$R$38,13,FALSE))","v":""},{"$f":"IF($B109=\"\",\"\",VLOOKUP($B109:$B109,QUALIF!$C$3:$R$38,14,FALSE))","v":""},{"$f":"IF($B109=\"\",\"\",VLOOKUP($B109:$B109,QUALIF!$C$3:$R$38,15,FALSE))","v":""},{"$f":"IF($B109=\"\",\"\",VLOOKUP($B109:$B109,QUALIF!$C$3:$R$38,16,FALSE))","v":""}]
[null,null,null,null,null," ",{"$f":"IF($B110=\"\",\"\",VLOOKUP($B110:$B110,QUALIF!$C$3:$R$38,4,FALSE))","v":""},{"$f":"IF($B110=\"\",\"\",VLOOKUP($B110:$B110,QUALIF!$C$3:$R$38,5,FALSE))","v":""},{"$f":"IF($B110=\"\",\"\",VLOOKUP($B110:$B110,QUALIF!$C$3:$R$38,6,FALSE))","v":""},{"$f":"IF($B110=\"\",\"\",VLOOKUP($B110:$B110,QUALIF!$C$3:$R$38,7,FALSE))","v":""},{"$f":"IF($B110=\"\",\"\",VLOOKUP($B110:$B110,QUALIF!$C$3:$R$38,8,FALSE))","v":""},{"$f":"IF($B110=\"\",\"\",VLOOKUP($B110:$B110,QUALIF!$C$3:$R$38,9,FALSE))","v":""},{"$f":"IF($B110=\"\",\"\",VLOOKUP($B110:$B110,QUALIF!$C$3:$R$38,10,FALSE))","v":""},{"$f":"IF($B110=\"\",\"\",VLOOKUP($B110:$B110,QUALIF!$C$3:$R$38,11,FALSE))","v":""},{"$f":"IF($B110=\"\",\"\",VLOOKUP($B110:$B110,QUALIF!$C$3:$R$38,12,FALSE))","v":""},{"$f":"IF($B110=\"\",\"\",VLOOKUP($B110:$B110,QUALIF!$C$3:$R$38,13,FALSE))","v":""},{"$f":"IF($B110=\"\",\"\",VLOOKUP($B110:$B110,QUALIF!$C$3:$R$38,14,FALSE))","v":""},{"$f":"IF($B110=\"\",\"\",VLOOKUP($B110:$B110,QUALIF!$C$3:$R$38,15,FALSE))","v":""},{"$f":"IF($B110=\"\",\"\",VLOOKUP($B110:$B110,QUALIF!$C$3:$R$38,16,FALSE))","v":""}]
[null,null,null,null,null," ",{"$f":"IF($B111=\"\",\"\",VLOOKUP($B111:$B111,QUALIF!$C$3:$R$38,4,FALSE))","v":""},{"$f":"IF($B111=\"\",\"\",VLOOKUP($B111:$B111,QUALIF!$C$3:$R$38,5,FALSE))","v":""},{"$f":"IF($B111=\"\",\"\",VLOOKUP($B111:$B111,QUALIF!$C$3:$R$38,6,FALSE))","v":""},{"$f":"IF($B111=\"\",\"\",VLOOKUP($B111:$B111,QUALIF!$C$3:$R$38,7,FALSE))","v":""},{"$f":"IF($B111=\"\",\"\",VLOOKUP($B111:$B111,QUALIF!$C$3:$R$38,8,FALSE))","v":""},{"$f":"IF($B111=\"\",\"\",VLOOKUP($B111:$B111,QUALIF!$C$3:$R$38,9,FALSE))","v":""},{"$f":"IF($B111=\"\",\"\",VLOOKUP($B111:$B111,QUALIF!$C$3:$R$38,10,FALSE))","v":""},{"$f":"IF($B111=\"\",\"\",VLOOKUP($B111:$B111,QUALIF!$C$3:$R$38,11,FALSE))","v":""},{"$f":"IF($B111=\"\",\"\",VLOOKUP($B111:$B111,QUALIF!$C$3:$R$38,12,FALSE))","v":""},{"$f":"IF($B111=\"\",\"\",VLOOKUP($B111:$B111,QUALIF!$C$3:$R$38,13,FALSE))","v":""},{"$f":"IF($B111=\"\",\"\",VLOOKUP($B111:$B111,QUALIF!$C$3:$R$38,14,FALSE))","v":""},{"$f":"IF($B111=\"\",\"\",VLOOKUP($B111:$B111,QUALIF!$C$3:$R$38,15,FALSE))","v":""},{"$f":"IF($B111=\"\",\"\",VLOOKUP($B111:$B111,QUALIF!$C$3:$R$38,16,FALSE))","v":""}]
[null,null,null,null,null," ",{"$f":"IF($B112=\"\",\"\",VLOOKUP($B112:$B112,QUALIF!$C$3:$R$38,4,FALSE))","v":""},{"$f":"IF($B112=\"\",\"\",VLOOKUP($B112:$B112,QUALIF!$C$3:$R$38,5,FALSE))","v":""},{"$f":"IF($B112=\"\",\"\",VLOOKUP($B112:$B112,QUALIF!$C$3:$R$38,6,FALSE))","v":""},{"$f":"IF($B112=\"\",\"\",VLOOKUP($B112:$B112,QUALIF!$C$3:$R$38,7,FALSE))","v":""},{"$f":"IF($B112=\"\",\"\",VLOOKUP($B112:$B112,QUALIF!$C$3:$R$38,8,FALSE))","v":""},{"$f":"IF($B112=\"\",\"\",VLOOKUP($B112:$B112,QUALIF!$C$3:$R$38,9,FALSE))","v":""},{"$f":"IF($B112=\"\",\"\",VLOOKUP($B112:$B112,QUALIF!$C$3:$R$38,10,FALSE))","v":""},{"$f":"IF($B112=\"\",\"\",VLOOKUP($B112:$B112,QUALIF!$C$3:$R$38,11,FALSE))","v":""},{"$f":"IF($B112=\"\",\"\",VLOOKUP($B112:$B112,QUALIF!$C$3:$R$38,12,FALSE))","v":""},{"$f":"IF($B112=\"\",\"\",VLOOKUP($B112:$B112,QUALIF!$C$3:$R$38,13,FALSE))","v":""},{"$f":"IF($B112=\"\",\"\",VLOOKUP($B112:$B112,QUALIF!$C$3:$R$38,14,FALSE))","v":""},{"$f":"IF($B112=\"\",\"\",VLOOKUP($B112:$B112,QUALIF!$C$3:$R$38,15,FALSE))","v":""},{"$f":"IF($B112=\"\",\"\",VLOOKUP($B112:$B112,QUALIF!$C$3:$R$38,16,FALSE))","v":""}]
[null,null,null,null,null," ",{"$f":"IF($B113=\"\",\"\",VLOOKUP($B113:$B113,QUALIF!$C$3:$R$38,4,FALSE))","v":""},{"$f":"IF($B113=\"\",\"\",VLOOKUP($B113:$B113,QUALIF!$C$3:$R$38,5,FALSE))","v":""},{"$f":"IF($B113=\"\",\"\",VLOOKUP($B113:$B113,QUALIF!$C$3:$R$38,6,FALSE))","v":""},{"$f":"IF($B113=\"\",\"\",VLOOKUP($B113:$B113,QUALIF!$C$3:$R$38,7,FALSE))","v":""},{"$f":"IF($B113=\"\",\"\",VLOOKUP($B113:$B113,QUALIF!$C$3:$R$38,8,FALSE))","v":""},{"$f":"IF($B113=\"\",\"\",VLOOKUP($B113:$B113,QUALIF!$C$3:$R$38,9,FALSE))","v":""},{"$f":"IF($B113=\"\",\"\",VLOOKUP($B113:$B113,QUALIF!$C$3:$R$38,10,FALSE))","v":""},{"$f":"IF($B113=\"\",\"\",VLOOKUP($B113:$B113,QUALIF!$C$3:$R$38,11,FALSE))","v":""},{"$f":"IF($B113=\"\",\"\",VLOOKUP($B113:$B113,QUALIF!$C$3:$R$38,12,FALSE))","v":""},{"$f":"IF($B113=\"\",\"\",VLOOKUP($B113:$B113,QUALIF!$C$3:$R$38,13,FALSE))","v":""},{"$f":"IF($B113=\"\",\"\",VLOOKUP($B113:$B113,QUALIF!$C$3:$R$38,14,FALSE))","v":""},{"$f":"IF($B113=\"\",\"\",VLOOKUP($B113:$B113,QUALIF!$C$3:$R$38,15,FALSE))","v":""},{"$f":"IF($B113=\"\",\"\",VLOOKUP($B113:$B113,QUALIF!$C$3:$R$38,16,FALSE))","v":""}]
[null,null,null,null,null," ",{"$f":"IF($B114=\"\",\"\",VLOOKUP($B114:$B114,QUALIF!$C$3:$R$38,4,FALSE))","v":""},{"$f":"IF($B114=\"\",\"\",VLOOKUP($B114:$B114,QUALIF!$C$3:$R$38,5,FALSE))","v":""},{"$f":"IF($B114=\"\",\"\",VLOOKUP($B114:$B114,QUALIF!$C$3:$R$38,6,FALSE))","v":""},{"$f":"IF($B114=\"\",\"\",VLOOKUP($B114:$B114,QUALIF!$C$3:$R$38,7,FALSE))","v":""},{"$f":"IF($B114=\"\",\"\",VLOOKUP($B114:$B114,QUALIF!$C$3:$R$38,8,FALSE))","v":""},{"$f":"IF($B114=\"\",\"\",VLOOKUP($B114:$B114,QUALIF!$C$3:$R$38,9,FALSE))","v":""},{"$f":"IF($B114=\"\",\"\",VLOOKUP($B114:$B114,QUALIF!$C$3:$R$38,10,FALSE))","v":""},{"$f":"IF($B114=\"\",\"\",VLOOKUP($B114:$B114,QUALIF!$C$3:$R$38,11,FALSE))","v":""},{"$f":"IF($B114=\"\",\"\",VLOOKUP($B114:$B114,QUALIF!$C$3:$R$38,12,FALSE))","v":""},{"$f":"IF($B114=\"\",\"\",VLOOKUP($B114:$B114,QUALIF!$C$3:$R$38,13,FALSE))","v":""},{"$f":"IF($B114=\"\",\"\",VLOOKUP($B114:$B114,QUALIF!$C$3:$R$38,14,FALSE))","v":""},{"$f":"IF($B114=\"\",\"\",VLOOKUP($B114:$B114,QUALIF!$C$3:$R$38,15,FALSE))","v":""},{"$f":"IF($B114=\"\",\"\",VLOOKUP($B114:$B114,QUALIF!$C$3:$R$38,16,FALSE))","v":""}]
[null,null,null,null,null," ",{"$f":"IF($B115=\"\",\"\",VLOOKUP($B115:$B115,QUALIF!$C$3:$R$38,4,FALSE))","v":""},{"$f":"IF($B115=\"\",\"\",VLOOKUP($B115:$B115,QUALIF!$C$3:$R$38,5,FALSE))","v":""},{"$f":"IF($B115=\"\",\"\",VLOOKUP($B115:$B115,QUALIF!$C$3:$R$38,6,FALSE))","v":""},{"$f":"IF($B115=\"\",\"\",VLOOKUP($B115:$B115,QUALIF!$C$3:$R$38,7,FALSE))","v":""},{"$f":"IF($B115=\"\",\"\",VLOOKUP($B115:$B115,QUALIF!$C$3:$R$38,8,FALSE))","v":""},{"$f":"IF($B115=\"\",\"\",VLOOKUP($B115:$B115,QUALIF!$C$3:$R$38,9,FALSE))","v":""},{"$f":"IF($B115=\"\",\"\",VLOOKUP($B115:$B115,QUALIF!$C$3:$R$38,10,FALSE))","v":""},{"$f":"IF($B115=\"\",\"\",VLOOKUP($B115:$B115,QUALIF!$C$3:$R$38,11,FALSE))","v":""},{"$f":"IF($B115=\"\",\"\",VLOOKUP($B115:$B115,QUALIF!$C$3:$R$38,12,FALSE))","v":""},{"$f":"IF($B115=\"\",\"\",VLOOKUP($B115:$B115,QUALIF!$C$3:$R$38,13,FALSE))","v":""},{"$f":"IF($B115=\"\",\"\",VLOOKUP($B115:$B115,QUALIF!$C$3:$R$38,14,FALSE))","v":""},{"$f":"IF($B115=\"\",\"\",VLOOKUP($B115:$B115,QUALIF!$C$3:$R$38,15,FALSE))","v":""},{"$f":"IF($B115=\"\",\"\",VLOOKUP($B115:$B115,QUALIF!$C$3:$R$38,16,FALSE))","v":""}]
[null,null,null,null,null," ",{"$f":"IF($B116=\"\",\"\",VLOOKUP($B116:$B116,QUALIF!$C$3:$R$38,4,FALSE))","v":""},{"$f":"IF($B116=\"\",\"\",VLOOKUP($B116:$B116,QUALIF!$C$3:$R$38,5,FALSE))","v":""},{"$f":"IF($B116=\"\",\"\",VLOOKUP($B116:$B116,QUALIF!$C$3:$R$38,6,FALSE))","v":""},{"$f":"IF($B116=\"\",\"\",VLOOKUP($B116:$B116,QUALIF!$C$3:$R$38,7,FALSE))","v":""},{"$f":"IF($B116=\"\",\"\",VLOOKUP($B116:$B116,QUALIF!$C$3:$R$38,8,FALSE))","v":""},{"$f":"IF($B116=\"\",\"\",VLOOKUP($B116:$B116,QUALIF!$C$3:$R$38,9,FALSE))","v":""},{"$f":"IF($B116=\"\",\"\",VLOOKUP($B116:$B116,QUALIF!$C$3:$R$38,10,FALSE))","v":""},{"$f":"IF($B116=\"\",\"\",VLOOKUP($B116:$B116,QUALIF!$C$3:$R$38,11,FALSE))","v":""},{"$f":"IF($B116=\"\",\"\",VLOOKUP($B116:$B116,QUALIF!$C$3:$R$38,12,FALSE))","v":""},{"$f":"IF($B116=\"\",\"\",VLOOKUP($B116:$B116,QUALIF!$C$3:$R$38,13,FALSE))","v":""},{"$f":"IF($B116=\"\",\"\",VLOOKUP($B116:$B116,QUALIF!$C$3:$R$38,14,FALSE))","v":""},{"$f":"IF($B116=\"\",\"\",VLOOKUP($B116:$B116,QUALIF!$C$3:$R$38,15,FALSE))","v":""},{"$f":"IF($B116=\"\",\"\",VLOOKUP($B116:$B116,QUALIF!$C$3:$R$38,16,FALSE))","v":""}]
[null,null,null,null,null," ",{"$f":"IF($B117=\"\",\"\",VLOOKUP($B117:$B117,QUALIF!$C$3:$R$38,4,FALSE))","v":""},{"$f":"IF($B117=\"\",\"\",VLOOKUP($B117:$B117,QUALIF!$C$3:$R$38,5,FALSE))","v":""},{"$f":"IF($B117=\"\",\"\",VLOOKUP($B117:$B117,QUALIF!$C$3:$R$38,6,FALSE))","v":""},{"$f":"IF($B117=\"\",\"\",VLOOKUP($B117:$B117,QUALIF!$C$3:$R$38,7,FALSE))","v":""},{"$f":"IF($B117=\"\",\"\",VLOOKUP($B117:$B117,QUALIF!$C$3:$R$38,8,FALSE))","v":""},{"$f":"IF($B117=\"\",\"\",VLOOKUP($B117:$B117,QUALIF!$C$3:$R$38,9,FALSE))","v":""},{"$f":"IF($B117=\"\",\"\",VLOOKUP($B117:$B117,QUALIF!$C$3:$R$38,10,FALSE))","v":""},{"$f":"IF($B117=\"\",\"\",VLOOKUP($B117:$B117,QUALIF!$C$3:$R$38,11,FALSE))","v":""},{"$f":"IF($B117=\"\",\"\",VLOOKUP($B117:$B117,QUALIF!$C$3:$R$38,12,FALSE))","v":""},{"$f":"IF($B117=\"\",\"\",VLOOKUP($B117:$B117,QUALIF!$C$3:$R$38,13,FALSE))","v":""},{"$f":"IF($B117=\"\",\"\",VLOOKUP($B117:$B117,QUALIF!$C$3:$R$38,14,FALSE))","v":""},{"$f":"IF($B117=\"\",\"\",VLOOKUP($B117:$B117,QUALIF!$C$3:$R$38,15,FALSE))","v":""},{"$f":"IF($B117=\"\",\"\",VLOOKUP($B117:$B117,QUALIF!$C$3:$R$38,16,FALSE))","v":""}]
[null,null,null,null,null," ",{"$f":"IF($B118=\"\",\"\",VLOOKUP($B118:$B118,QUALIF!$C$3:$R$38,4,FALSE))","v":""},{"$f":"IF($B118=\"\",\"\",VLOOKUP($B118:$B118,QUALIF!$C$3:$R$38,5,FALSE))","v":""},{"$f":"IF($B118=\"\",\"\",VLOOKUP($B118:$B118,QUALIF!$C$3:$R$38,6,FALSE))","v":""},{"$f":"IF($B118=\"\",\"\",VLOOKUP($B118:$B118,QUALIF!$C$3:$R$38,7,FALSE))","v":""},{"$f":"IF($B118=\"\",\"\",VLOOKUP($B118:$B118,QUALIF!$C$3:$R$38,8,FALSE))","v":""},{"$f":"IF($B118=\"\",\"\",VLOOKUP($B118:$B118,QUALIF!$C$3:$R$38,9,FALSE))","v":""},{"$f":"IF($B118=\"\",\"\",VLOOKUP($B118:$B118,QUALIF!$C$3:$R$38,10,FALSE))","v":""},{"$f":"IF($B118=\"\",\"\",VLOOKUP($B118:$B118,QUALIF!$C$3:$R$38,11,FALSE))","v":""},{"$f":"IF($B118=\"\",\"\",VLOOKUP($B118:$B118,QUALIF!$C$3:$R$38,12,FALSE))","v":""},{"$f":"IF($B118=\"\",\"\",VLOOKUP($B118:$B118,QUALIF!$C$3:$R$38,13,FALSE))","v":""},{"$f":"IF($B118=\"\",\"\",VLOOKUP($B118:$B118,QUALIF!$C$3:$R$38,14,FALSE))","v":""},{"$f":"IF($B118=\"\",\"\",VLOOKUP($B118:$B118,QUALIF!$C$3:$R$38,15,FALSE))","v":""},{"$f":"IF($B118=\"\",\"\",VLOOKUP($B118:$B118,QUALIF!$C$3:$R$38,16,FALSE))","v":""}]
[null,null,null,null,null," ",{"$f":"IF($B119=\"\",\"\",VLOOKUP($B119:$B119,QUALIF!$C$3:$R$38,4,FALSE))","v":""},{"$f":"IF($B119=\"\",\"\",VLOOKUP($B119:$B119,QUALIF!$C$3:$R$38,5,FALSE))","v":""},{"$f":"IF($B119=\"\",\"\",VLOOKUP($B119:$B119,QUALIF!$C$3:$R$38,6,FALSE))","v":""},{"$f":"IF($B119=\"\",\"\",VLOOKUP($B119:$B119,QUALIF!$C$3:$R$38,7,FALSE))","v":""},{"$f":"IF($B119=\"\",\"\",VLOOKUP($B119:$B119,QUALIF!$C$3:$R$38,8,FALSE))","v":""},{"$f":"IF($B119=\"\",\"\",VLOOKUP($B119:$B119,QUALIF!$C$3:$R$38,9,FALSE))","v":""},{"$f":"IF($B119=\"\",\"\",VLOOKUP($B119:$B119,QUALIF!$C$3:$R$38,10,FALSE))","v":""},{"$f":"IF($B119=\"\",\"\",VLOOKUP($B119:$B119,QUALIF!$C$3:$R$38,11,FALSE))","v":""},{"$f":"IF($B119=\"\",\"\",VLOOKUP($B119:$B119,QUALIF!$C$3:$R$38,12,FALSE))","v":""},{"$f":"IF($B119=\"\",\"\",VLOOKUP($B119:$B119,QUALIF!$C$3:$R$38,13,FALSE))","v":""},{"$f":"IF($B119=\"\",\"\",VLOOKUP($B119:$B119,QUALIF!$C$3:$R$38,14,FALSE))","v":""},{"$f":"IF($B119=\"\",\"\",VLOOKUP($B119:$B119,QUALIF!$C$3:$R$38,15,FALSE))","v":""},{"$f":"IF($B119=\"\",\"\",VLOOKUP($B119:$B119,QUALIF!$C$3:$R$38,16,FALSE))","v":""}]
[null,null,null,null,null," ",{"$f":"IF($B120=\"\",\"\",VLOOKUP($B120:$B120,QUALIF!$C$3:$R$38,4,FALSE))","v":""},{"$f":"IF($B120=\"\",\"\",VLOOKUP($B120:$B120,QUALIF!$C$3:$R$38,5,FALSE))","v":""},{"$f":"IF($B120=\"\",\"\",VLOOKUP($B120:$B120,QUALIF!$C$3:$R$38,6,FALSE))","v":""},{"$f":"IF($B120=\"\",\"\",VLOOKUP($B120:$B120,QUALIF!$C$3:$R$38,7,FALSE))","v":""},{"$f":"IF($B120=\"\",\"\",VLOOKUP($B120:$B120,QUALIF!$C$3:$R$38,8,FALSE))","v":""},{"$f":"IF($B120=\"\",\"\",VLOOKUP($B120:$B120,QUALIF!$C$3:$R$38,9,FALSE))","v":""},{"$f":"IF($B120=\"\",\"\",VLOOKUP($B120:$B120,QUALIF!$C$3:$R$38,10,FALSE))","v":""},{"$f":"IF($B120=\"\",\"\",VLOOKUP($B120:$B120,QUALIF!$C$3:$R$38,11,FALSE))","v":""},{"$f":"IF($B120=\"\",\"\",VLOOKUP($B120:$B120,QUALIF!$C$3:$R$38,12,FALSE))","v":""},{"$f":"IF($B120=\"\",\"\",VLOOKUP($B120:$B120,QUALIF!$C$3:$R$38,13,FALSE))","v":""},{"$f":"IF($B120=\"\",\"\",VLOOKUP($B120:$B120,QUALIF!$C$3:$R$38,14,FALSE))","v":""},{"$f":"IF($B120=\"\",\"\",VLOOKUP($B120:$B120,QUALIF!$C$3:$R$38,15,FALSE))","v":""},{"$f":"IF($B120=\"\",\"\",VLOOKUP($B120:$B120,QUALIF!$C$3:$R$38,16,FALSE))","v":""}]
[null,null,null,null,null," ",{"$f":"IF($B121=\"\",\"\",VLOOKUP($B121:$B121,QUALIF!$C$3:$R$38,4,FALSE))","v":""},{"$f":"IF($B121=\"\",\"\",VLOOKUP($B121:$B121,QUALIF!$C$3:$R$38,5,FALSE))","v":""},{"$f":"IF($B121=\"\",\"\",VLOOKUP($B121:$B121,QUALIF!$C$3:$R$38,6,FALSE))","v":""},{"$f":"IF($B121=\"\",\"\",VLOOKUP($B121:$B121,QUALIF!$C$3:$R$38,7,FALSE))","v":""},{"$f":"IF($B121=\"\",\"\",VLOOKUP($B121:$B121,QUALIF!$C$3:$R$38,8,FALSE))","v":""},{"$f":"IF($B121=\"\",\"\",VLOOKUP($B121:$B121,QUALIF!$C$3:$R$38,9,FALSE))","v":""},{"$f":"IF($B121=\"\",\"\",VLOOKUP($B121:$B121,QUALIF!$C$3:$R$38,10,FALSE))","v":""},{"$f":"IF($B121=\"\",\"\",VLOOKUP($B121:$B121,QUALIF!$C$3:$R$38,11,FALSE))","v":""},{"$f":"IF($B121=\"\",\"\",VLOOKUP($B121:$B121,QUALIF!$C$3:$R$38,12,FALSE))","v":""},{"$f":"IF($B121=\"\",\"\",VLOOKUP($B121:$B121,QUALIF!$C$3:$R$38,13,FALSE))","v":""},{"$f":"IF($B121=\"\",\"\",VLOOKUP($B121:$B121,QUALIF!$C$3:$R$38,14,FALSE))","v":""},{"$f":"IF($B121=\"\",\"\",VLOOKUP($B121:$B121,QUALIF!$C$3:$R$38,15,FALSE))","v":""},{"$f":"IF($B121=\"\",\"\",VLOOKUP($B121:$B121,QUALIF!$C$3:$R$38,16,FALSE))","v":""}]
[null,null,null,null,null," ",{"$f":"IF($B122=\"\",\"\",VLOOKUP($B122:$B122,QUALIF!$C$3:$R$38,4,FALSE))","v":""},{"$f":"IF($B122=\"\",\"\",VLOOKUP($B122:$B122,QUALIF!$C$3:$R$38,5,FALSE))","v":""},{"$f":"IF($B122=\"\",\"\",VLOOKUP($B122:$B122,QUALIF!$C$3:$R$38,6,FALSE))","v":""},{"$f":"IF($B122=\"\",\"\",VLOOKUP($B122:$B122,QUALIF!$C$3:$R$38,7,FALSE))","v":""},{"$f":"IF($B122=\"\",\"\",VLOOKUP($B122:$B122,QUALIF!$C$3:$R$38,8,FALSE))","v":""},{"$f":"IF($B122=\"\",\"\",VLOOKUP($B122:$B122,QUALIF!$C$3:$R$38,9,FALSE))","v":""},{"$f":"IF($B122=\"\",\"\",VLOOKUP($B122:$B122,QUALIF!$C$3:$R$38,10,FALSE))","v":""},{"$f":"IF($B122=\"\",\"\",VLOOKUP($B122:$B122,QUALIF!$C$3:$R$38,11,FALSE))","v":""},{"$f":"IF($B122=\"\",\"\",VLOOKUP($B122:$B122,QUALIF!$C$3:$R$38,12,FALSE))","v":""},{"$f":"IF($B122=\"\",\"\",VLOOKUP($B122:$B122,QUALIF!$C$3:$R$38,13,FALSE))","v":""},{"$f":"IF($B122=\"\",\"\",VLOOKUP($B122:$B122,QUALIF!$C$3:$R$38,14,FALSE))","v":""},{"$f":"IF($B122=\"\",\"\",VLOOKUP($B122:$B122,QUALIF!$C$3:$R$38,15,FALSE))","v":""},{"$f":"IF($B122=\"\",\"\",VLOOKUP($B122:$B122,QUALIF!$C$3:$R$38,16,FALSE))","v":""}]
[null,null,null,null,null," ",{"$f":"IF($B123=\"\",\"\",VLOOKUP($B123:$B123,QUALIF!$C$3:$R$38,4,FALSE))","v":""},{"$f":"IF($B123=\"\",\"\",VLOOKUP($B123:$B123,QUALIF!$C$3:$R$38,5,FALSE))","v":""},{"$f":"IF($B123=\"\",\"\",VLOOKUP($B123:$B123,QUALIF!$C$3:$R$38,6,FALSE))","v":""},{"$f":"IF($B123=\"\",\"\",VLOOKUP($B123:$B123,QUALIF!$C$3:$R$38,7,FALSE))","v":""},{"$f":"IF($B123=\"\",\"\",VLOOKUP($B123:$B123,QUALIF!$C$3:$R$38,8,FALSE))","v":""},{"$f":"IF($B123=\"\",\"\",VLOOKUP($B123:$B123,QUALIF!$C$3:$R$38,9,FALSE))","v":""},{"$f":"IF($B123=\"\",\"\",VLOOKUP($B123:$B123,QUALIF!$C$3:$R$38,10,FALSE))","v":""},{"$f":"IF($B123=\"\",\"\",VLOOKUP($B123:$B123,QUALIF!$C$3:$R$38,11,FALSE))","v":""},{"$f":"IF($B123=\"\",\"\",VLOOKUP($B123:$B123,QUALIF!$C$3:$R$38,12,FALSE))","v":""},{"$f":"IF($B123=\"\",\"\",VLOOKUP($B123:$B123,QUALIF!$C$3:$R$38,13,FALSE))","v":""},{"$f":"IF($B123=\"\",\"\",VLOOKUP($B123:$B123,QUALIF!$C$3:$R$38,14,FALSE))","v":""},{"$f":"IF($B123=\"\",\"\",VLOOKUP($B123:$B123,QUALIF!$C$3:$R$38,15,FALSE))","v":""},{"$f":"IF($B123=\"\",\"\",VLOOKUP($B123:$B123,QUALIF!$C$3:$R$38,16,FALSE))","v":""}]
[null,null,null,null,null," ",{"$f":"IF($B124=\"\",\"\",VLOOKUP($B124:$B124,QUALIF!$C$3:$R$38,4,FALSE))","v":""},{"$f":"IF($B124=\"\",\"\",VLOOKUP($B124:$B124,QUALIF!$C$3:$R$38,5,FALSE))","v":""},{"$f":"IF($B124=\"\",\"\",VLOOKUP($B124:$B124,QUALIF!$C$3:$R$38,6,FALSE))","v":""},{"$f":"IF($B124=\"\",\"\",VLOOKUP($B124:$B124,QUALIF!$C$3:$R$38,7,FALSE))","v":""},{"$f":"IF($B124=\"\",\"\",VLOOKUP($B124:$B124,QUALIF!$C$3:$R$38,8,FALSE))","v":""},{"$f":"IF($B124=\"\",\"\",VLOOKUP($B124:$B124,QUALIF!$C$3:$R$38,9,FALSE))","v":""},{"$f":"IF($B124=\"\",\"\",VLOOKUP($B124:$B124,QUALIF!$C$3:$R$38,10,FALSE))","v":""},{"$f":"IF($B124=\"\",\"\",VLOOKUP($B124:$B124,QUALIF!$C$3:$R$38,11,FALSE))","v":""},{"$f":"IF($B124=\"\",\"\",VLOOKUP($B124:$B124,QUALIF!$C$3:$R$38,12,FALSE))","v":""},{"$f":"IF($B124=\"\",\"\",VLOOKUP($B124:$B124,QUALIF!$C$3:$R$38,13,FALSE))","v":""},{"$f":"IF($B124=\"\",\"\",VLOOKUP($B124:$B124,QUALIF!$C$3:$R$38,14,FALSE))","v":""},{"$f":"IF($B124=\"\",\"\",VLOOKUP($B124:$B124,QUALIF!$C$3:$R$38,15,FALSE))","v":""},{"$f":"IF($B124=\"\",\"\",VLOOKUP($B124:$B124,QUALIF!$C$3:$R$38,16,FALSE))","v":""}]
[null,null,null,null,null," ",{"$f":"IF($B125=\"\",\"\",VLOOKUP($B125:$B125,QUALIF!$C$3:$R$38,4,FALSE))","v":""},{"$f":"IF($B125=\"\",\"\",VLOOKUP($B125:$B125,QUALIF!$C$3:$R$38,5,FALSE))","v":""},{"$f":"IF($B125=\"\",\"\",VLOOKUP($B125:$B125,QUALIF!$C$3:$R$38,6,FALSE))","v":""},{"$f":"IF($B125=\"\",\"\",VLOOKUP($B125:$B125,QUALIF!$C$3:$R$38,7,FALSE))","v":""},{"$f":"IF($B125=\"\",\"\",VLOOKUP($B125:$B125,QUALIF!$C$3:$R$38,8,FALSE))","v":""},{"$f":"IF($B125=\"\",\"\",VLOOKUP($B125:$B125,QUALIF!$C$3:$R$38,9,FALSE))","v":""},{"$f":"IF($B125=\"\",\"\",VLOOKUP($B125:$B125,QUALIF!$C$3:$R$38,10,FALSE))","v":""},{"$f":"IF($B125=\"\",\"\",VLOOKUP($B125:$B125,QUALIF!$C$3:$R$38,11,FALSE))","v":""},{"$f":"IF($B125=\"\",\"\",VLOOKUP($B125:$B125,QUALIF!$C$3:$R$38,12,FALSE))","v":""},{"$f":"IF($B125=\"\",\"\",VLOOKUP($B125:$B125,QUALIF!$C$3:$R$38,13,FALSE))","v":""},{"$f":"IF($B125=\"\",\"\",VLOOKUP($B125:$B125,QUALIF!$C$3:$R$38,14,FALSE))","v":""},{"$f":"IF($B125=\"\",\"\",VLOOKUP($B125:$B125,QUALIF!$C$3:$R$38,15,FALSE))","v":""},{"$f":"IF($B125=\"\",\"\",VLOOKUP($B125:$B125,QUALIF!$C$3:$R$38,16,FALSE))","v":""}]
[null,null,null,null,null," ",{"$f":"IF($B126=\"\",\"\",VLOOKUP($B126:$B126,QUALIF!$C$3:$R$38,4,FALSE))","v":""},{"$f":"IF($B126=\"\",\"\",VLOOKUP($B126:$B126,QUALIF!$C$3:$R$38,5,FALSE))","v":""},{"$f":"IF($B126=\"\",\"\",VLOOKUP($B126:$B126,QUALIF!$C$3:$R$38,6,FALSE))","v":""},{"$f":"IF($B126=\"\",\"\",VLOOKUP($B126:$B126,QUALIF!$C$3:$R$38,7,FALSE))","v":""},{"$f":"IF($B126=\"\",\"\",VLOOKUP($B126:$B126,QUALIF!$C$3:$R$38,8,FALSE))","v":""},{"$f":"IF($B126=\"\",\"\",VLOOKUP($B126:$B126,QUALIF!$C$3:$R$38,9,FALSE))","v":""},{"$f":"IF($B126=\"\",\"\",VLOOKUP($B126:$B126,QUALIF!$C$3:$R$38,10,FALSE))","v":""},{"$f":"IF($B126=\"\",\"\",VLOOKUP($B126:$B126,QUALIF!$C$3:$R$38,11,FALSE))","v":""},{"$f":"IF($B126=\"\",\"\",VLOOKUP($B126:$B126,QUALIF!$C$3:$R$38,12,FALSE))","v":""},{"$f":"IF($B126=\"\",\"\",VLOOKUP($B126:$B126,QUALIF!$C$3:$R$38,13,FALSE))","v":""},{"$f":"IF($B126=\"\",\"\",VLOOKUP($B126:$B126,QUALIF!$C$3:$R$38,14,FALSE))","v":""},{"$f":"IF($B126=\"\",\"\",VLOOKUP($B126:$B126,QUALIF!$C$3:$R$38,15,FALSE))","v":""},{"$f":"IF($B126=\"\",\"\",VLOOKUP($B126:$B126,QUALIF!$C$3:$R$38,16,FALSE))","v":""}]
[null,null,null,null,null," ",{"$f":"IF($B127=\"\",\"\",VLOOKUP($B127:$B127,QUALIF!$C$3:$R$38,4,FALSE))","v":""},{"$f":"IF($B127=\"\",\"\",VLOOKUP($B127:$B127,QUALIF!$C$3:$R$38,5,FALSE))","v":""},{"$f":"IF($B127=\"\",\"\",VLOOKUP($B127:$B127,QUALIF!$C$3:$R$38,6,FALSE))","v":""},{"$f":"IF($B127=\"\",\"\",VLOOKUP($B127:$B127,QUALIF!$C$3:$R$38,7,FALSE))","v":""},{"$f":"IF($B127=\"\",\"\",VLOOKUP($B127:$B127,QUALIF!$C$3:$R$38,8,FALSE))","v":""},{"$f":"IF($B127=\"\",\"\",VLOOKUP($B127:$B127,QUALIF!$C$3:$R$38,9,FALSE))","v":""},{"$f":"IF($B127=\"\",\"\",VLOOKUP($B127:$B127,QUALIF!$C$3:$R$38,10,FALSE))","v":""},{"$f":"IF($B127=\"\",\"\",VLOOKUP($B127:$B127,QUALIF!$C$3:$R$38,11,FALSE))","v":""},{"$f":"IF($B127=\"\",\"\",VLOOKUP($B127:$B127,QUALIF!$C$3:$R$38,12,FALSE))","v":""},{"$f":"IF($B127=\"\",\"\",VLOOKUP($B127:$B127,QUALIF!$C$3:$R$38,13,FALSE))","v":""},{"$f":"IF($B127=\"\",\"\",VLOOKUP($B127:$B127,QUALIF!$C$3:$R$38,14,FALSE))","v":""},{"$f":"IF($B127=\"\",\"\",VLOOKUP($B127:$B127,QUALIF!$C$3:$R$38,15,FALSE))","v":""},{"$f":"IF($B127=\"\",\"\",VLOOKUP($B127:$B127,QUALIF!$C$3:$R$38,16,FALSE))","v":""}]
[null,null,null,null,null," ",{"$f":"IF($B128=\"\",\"\",VLOOKUP($B128:$B128,QUALIF!$C$3:$R$38,4,FALSE))","v":""},{"$f":"IF($B128=\"\",\"\",VLOOKUP($B128:$B128,QUALIF!$C$3:$R$38,5,FALSE))","v":""},{"$f":"IF($B128=\"\",\"\",VLOOKUP($B128:$B128,QUALIF!$C$3:$R$38,6,FALSE))","v":""},{"$f":"IF($B128=\"\",\"\",VLOOKUP($B128:$B128,QUALIF!$C$3:$R$38,7,FALSE))","v":""},{"$f":"IF($B128=\"\",\"\",VLOOKUP($B128:$B128,QUALIF!$C$3:$R$38,8,FALSE))","v":""},{"$f":"IF($B128=\"\",\"\",VLOOKUP($B128:$B128,QUALIF!$C$3:$R$38,9,FALSE))","v":""},{"$f":"IF($B128=\"\",\"\",VLOOKUP($B128:$B128,QUALIF!$C$3:$R$38,10,FALSE))","v":""},{"$f":"IF($B128=\"\",\"\",VLOOKUP($B128:$B128,QUALIF!$C$3:$R$38,11,FALSE))","v":""},{"$f":"IF($B128=\"\",\"\",VLOOKUP($B128:$B128,QUALIF!$C$3:$R$38,12,FALSE))","v":""},{"$f":"IF($B128=\"\",\"\",VLOOKUP($B128:$B128,QUALIF!$C$3:$R$38,13,FALSE))","v":""},{"$f":"IF($B128=\"\",\"\",VLOOKUP($B128:$B128,QUALIF!$C$3:$R$38,14,FALSE))","v":""},{"$f":"IF($B128=\"\",\"\",VLOOKUP($B128:$B128,QUALIF!$C$3:$R$38,15,FALSE))","v":""},{"$f":"IF($B128=\"\",\"\",VLOOKUP($B128:$B128,QUALIF!$C$3:$R$38,16,FALSE))","v":""}]
[null,null,null,null,null," ",{"$f":"IF($B129=\"\",\"\",VLOOKUP($B129:$B129,QUALIF!$C$3:$R$38,4,FALSE))","v":""},{"$f":"IF($B129=\"\",\"\",VLOOKUP($B129:$B129,QUALIF!$C$3:$R$38,5,FALSE))","v":""},{"$f":"IF($B129=\"\",\"\",VLOOKUP($B129:$B129,QUALIF!$C$3:$R$38,6,FALSE))","v":""},{"$f":"IF($B129=\"\",\"\",VLOOKUP($B129:$B129,QUALIF!$C$3:$R$38,7,FALSE))","v":""},{"$f":"IF($B129=\"\",\"\",VLOOKUP($B129:$B129,QUALIF!$C$3:$R$38,8,FALSE))","v":""},{"$f":"IF($B129=\"\",\"\",VLOOKUP($B129:$B129,QUALIF!$C$3:$R$38,9,FALSE))","v":""},{"$f":"IF($B129=\"\",\"\",VLOOKUP($B129:$B129,QUALIF!$C$3:$R$38,10,FALSE))","v":""},{"$f":"IF($B129=\"\",\"\",VLOOKUP($B129:$B129,QUALIF!$C$3:$R$38,11,FALSE))","v":""},{"$f":"IF($B129=\"\",\"\",VLOOKUP($B129:$B129,QUALIF!$C$3:$R$38,12,FALSE))","v":""},{"$f":"IF($B129=\"\",\"\",VLOOKUP($B129:$B129,QUALIF!$C$3:$R$38,13,FALSE))","v":""},{"$f":"IF($B129=\"\",\"\",VLOOKUP($B129:$B129,QUALIF!$C$3:$R$38,14,FALSE))","v":""},{"$f":"IF($B129=\"\",\"\",VLOOKUP($B129:$B129,QUALIF!$C$3:$R$38,15,FALSE))","v":""},{"$f":"IF($B129=\"\",\"\",VLOOKUP($B129:$B129,QUALIF!$C$3:$R$38,16,FALSE))","v":""}]
[null,null,null,null,null," ",{"$f":"IF($B130=\"\",\"\",VLOOKUP($B130:$B130,QUALIF!$C$3:$R$38,4,FALSE))","v":""},{"$f":"IF($B130=\"\",\"\",VLOOKUP($B130:$B130,QUALIF!$C$3:$R$38,5,FALSE))","v":""},{"$f":"IF($B130=\"\",\"\",VLOOKUP($B130:$B130,QUALIF!$C$3:$R$38,6,FALSE))","v":""},{"$f":"IF($B130=\"\",\"\",VLOOKUP($B130:$B130,QUALIF!$C$3:$R$38,7,FALSE))","v":""},{"$f":"IF($B130=\"\",\"\",VLOOKUP($B130:$B130,QUALIF!$C$3:$R$38,8,FALSE))","v":""},{"$f":"IF($B130=\"\",\"\",VLOOKUP($B130:$B130,QUALIF!$C$3:$R$38,9,FALSE))","v":""},{"$f":"IF($B130=\"\",\"\",VLOOKUP($B130:$B130,QUALIF!$C$3:$R$38,10,FALSE))","v":""},{"$f":"IF($B130=\"\",\"\",VLOOKUP($B130:$B130,QUALIF!$C$3:$R$38,11,FALSE))","v":""},{"$f":"IF($B130=\"\",\"\",VLOOKUP($B130:$B130,QUALIF!$C$3:$R$38,12,FALSE))","v":""},{"$f":"IF($B130=\"\",\"\",VLOOKUP($B130:$B130,QUALIF!$C$3:$R$38,13,FALSE))","v":""},{"$f":"IF($B130=\"\",\"\",VLOOKUP($B130:$B130,QUALIF!$C$3:$R$38,14,FALSE))","v":""},{"$f":"IF($B130=\"\",\"\",VLOOKUP($B130:$B130,QUALIF!$C$3:$R$38,15,FALSE))","v":""},{"$f":"IF($B130=\"\",\"\",VLOOKUP($B130:$B130,QUALIF!$C$3:$R$38,16,FALSE))","v":""}]
[null,null,null,null,null," ",{"$f":"IF($B131=\"\",\"\",VLOOKUP($B131:$B131,QUALIF!$C$3:$R$38,4,FALSE))","v":""},{"$f":"IF($B131=\"\",\"\",VLOOKUP($B131:$B131,QUALIF!$C$3:$R$38,5,FALSE))","v":""},{"$f":"IF($B131=\"\",\"\",VLOOKUP($B131:$B131,QUALIF!$C$3:$R$38,6,FALSE))","v":""},{"$f":"IF($B131=\"\",\"\",VLOOKUP($B131:$B131,QUALIF!$C$3:$R$38,7,FALSE))","v":""},{"$f":"IF($B131=\"\",\"\",VLOOKUP($B131:$B131,QUALIF!$C$3:$R$38,8,FALSE))","v":""},{"$f":"IF($B131=\"\",\"\",VLOOKUP($B131:$B131,QUALIF!$C$3:$R$38,9,FALSE))","v":""},{"$f":"IF($B131=\"\",\"\",VLOOKUP($B131:$B131,QUALIF!$C$3:$R$38,10,FALSE))","v":""},{"$f":"IF($B131=\"\",\"\",VLOOKUP($B131:$B131,QUALIF!$C$3:$R$38,11,FALSE))","v":""},{"$f":"IF($B131=\"\",\"\",VLOOKUP($B131:$B131,QUALIF!$C$3:$R$38,12,FALSE))","v":""},{"$f":"IF($B131=\"\",\"\",VLOOKUP($B131:$B131,QUALIF!$C$3:$R$38,13,FALSE))","v":""},{"$f":"IF($B131=\"\",\"\",VLOOKUP($B131:$B131,QUALIF!$C$3:$R$38,14,FALSE))","v":""},{"$f":"IF($B131=\"\",\"\",VLOOKUP($B131:$B131,QUALIF!$C$3:$R$38,15,FALSE))","v":""},{"$f":"IF($B131=\"\",\"\",VLOOKUP($B131:$B131,QUALIF!$C$3:$R$38,16,FALSE))","v":""}]
[null,null,null,null,null," ",{"$f":"IF($B132=\"\",\"\",VLOOKUP($B132:$B132,QUALIF!$C$3:$R$38,4,FALSE))","v":""},{"$f":"IF($B132=\"\",\"\",VLOOKUP($B132:$B132,QUALIF!$C$3:$R$38,5,FALSE))","v":""},{"$f":"IF($B132=\"\",\"\",VLOOKUP($B132:$B132,QUALIF!$C$3:$R$38,6,FALSE))","v":""},{"$f":"IF($B132=\"\",\"\",VLOOKUP($B132:$B132,QUALIF!$C$3:$R$38,7,FALSE))","v":""},{"$f":"IF($B132=\"\",\"\",VLOOKUP($B132:$B132,QUALIF!$C$3:$R$38,8,FALSE))","v":""},{"$f":"IF($B132=\"\",\"\",VLOOKUP($B132:$B132,QUALIF!$C$3:$R$38,9,FALSE))","v":""},{"$f":"IF($B132=\"\",\"\",VLOOKUP($B132:$B132,QUALIF!$C$3:$R$38,10,FALSE))","v":""},{"$f":"IF($B132=\"\",\"\",VLOOKUP($B132:$B132,QUALIF!$C$3:$R$38,11,FALSE))","v":""},{"$f":"IF($B132=\"\",\"\",VLOOKUP($B132:$B132,QUALIF!$C$3:$R$38,12,FALSE))","v":""},{"$f":"IF($B132=\"\",\"\",VLOOKUP($B132:$B132,QUALIF!$C$3:$R$38,13,FALSE))","v":""},{"$f":"IF($B132=\"\",\"\",VLOOKUP($B132:$B132,QUALIF!$C$3:$R$38,14,FALSE))","v":""},{"$f":"IF($B132=\"\",\"\",VLOOKUP($B132:$B132,QUALIF!$C$3:$R$38,15,FALSE))","v":""},{"$f":"IF($B132=\"\",\"\",VLOOKUP($B132:$B132,QUALIF!$C$3:$R$38,16,FALSE))","v":""}]
[null,null,null,null,null," ",{"$f":"IF($B133=\"\",\"\",VLOOKUP($B133:$B133,QUALIF!$C$3:$R$38,4,FALSE))","v":""},{"$f":"IF($B133=\"\",\"\",VLOOKUP($B133:$B133,QUALIF!$C$3:$R$38,5,FALSE))","v":""},{"$f":"IF($B133=\"\",\"\",VLOOKUP($B133:$B133,QUALIF!$C$3:$R$38,6,FALSE))","v":""},{"$f":"IF($B133=\"\",\"\",VLOOKUP($B133:$B133,QUALIF!$C$3:$R$38,7,FALSE))","v":""},{"$f":"IF($B133=\"\",\"\",VLOOKUP($B133:$B133,QUALIF!$C$3:$R$38,8,FALSE))","v":""},{"$f":"IF($B133=\"\",\"\",VLOOKUP($B133:$B133,QUALIF!$C$3:$R$38,9,FALSE))","v":""},{"$f":"IF($B133=\"\",\"\",VLOOKUP($B133:$B133,QUALIF!$C$3:$R$38,10,FALSE))","v":""},{"$f":"IF($B133=\"\",\"\",VLOOKUP($B133:$B133,QUALIF!$C$3:$R$38,11,FALSE))","v":""},{"$f":"IF($B133=\"\",\"\",VLOOKUP($B133:$B133,QUALIF!$C$3:$R$38,12,FALSE))","v":""},{"$f":"IF($B133=\"\",\"\",VLOOKUP($B133:$B133,QUALIF!$C$3:$R$38,13,FALSE))","v":""},{"$f":"IF($B133=\"\",\"\",VLOOKUP($B133:$B133,QUALIF!$C$3:$R$38,14,FALSE))","v":""},{"$f":"IF($B133=\"\",\"\",VLOOKUP($B133:$B133,QUALIF!$C$3:$R$38,15,FALSE))","v":""},{"$f":"IF($B133=\"\",\"\",VLOOKUP($B133:$B133,QUALIF!$C$3:$R$38,16,FALSE))","v":""}]
[null,null,null,null,null," ",{"$f":"IF($B134=\"\",\"\",VLOOKUP($B134:$B134,QUALIF!$C$3:$R$38,4,FALSE))","v":""},{"$f":"IF($B134=\"\",\"\",VLOOKUP($B134:$B134,QUALIF!$C$3:$R$38,5,FALSE))","v":""},{"$f":"IF($B134=\"\",\"\",VLOOKUP($B134:$B134,QUALIF!$C$3:$R$38,6,FALSE))","v":""},{"$f":"IF($B134=\"\",\"\",VLOOKUP($B134:$B134,QUALIF!$C$3:$R$38,7,FALSE))","v":""},{"$f":"IF($B134=\"\",\"\",VLOOKUP($B134:$B134,QUALIF!$C$3:$R$38,8,FALSE))","v":""},{"$f":"IF($B134=\"\",\"\",VLOOKUP($B134:$B134,QUALIF!$C$3:$R$38,9,FALSE))","v":""},{"$f":"IF($B134=\"\",\"\",VLOOKUP($B134:$B134,QUALIF!$C$3:$R$38,10,FALSE))","v":""},{"$f":"IF($B134=\"\",\"\",VLOOKUP($B134:$B134,QUALIF!$C$3:$R$38,11,FALSE))","v":""},{"$f":"IF($B134=\"\",\"\",VLOOKUP($B134:$B134,QUALIF!$C$3:$R$38,12,FALSE))","v":""},{"$f":"IF($B134=\"\",\"\",VLOOKUP($B134:$B134,QUALIF!$C$3:$R$38,13,FALSE))","v":""},{"$f":"IF($B134=\"\",\"\",VLOOKUP($B134:$B134,QUALIF!$C$3:$R$38,14,FALSE))","v":""},{"$f":"IF($B134=\"\",\"\",VLOOKUP($B134:$B134,QUALIF!$C$3:$R$38,15,FALSE))","v":""},{"$f":"IF($B134=\"\",\"\",VLOOKUP($B134:$B134,QUALIF!$C$3:$R$38,16,FALSE))","v":""}]
[null,null,null,null,null," ",{"$f":"IF($B135=\"\",\"\",VLOOKUP($B135:$B135,QUALIF!$C$3:$R$38,4,FALSE))","v":""},{"$f":"IF($B135=\"\",\"\",VLOOKUP($B135:$B135,QUALIF!$C$3:$R$38,5,FALSE))","v":""},{"$f":"IF($B135=\"\",\"\",VLOOKUP($B135:$B135,QUALIF!$C$3:$R$38,6,FALSE))","v":""},{"$f":"IF($B135=\"\",\"\",VLOOKUP($B135:$B135,QUALIF!$C$3:$R$38,7,FALSE))","v":""},{"$f":"IF($B135=\"\",\"\",VLOOKUP($B135:$B135,QUALIF!$C$3:$R$38,8,FALSE))","v":""},{"$f":"IF($B135=\"\",\"\",VLOOKUP($B135:$B135,QUALIF!$C$3:$R$38,9,FALSE))","v":""},{"$f":"IF($B135=\"\",\"\",VLOOKUP($B135:$B135,QUALIF!$C$3:$R$38,10,FALSE))","v":""},{"$f":"IF($B135=\"\",\"\",VLOOKUP($B135:$B135,QUALIF!$C$3:$R$38,11,FALSE))","v":""},{"$f":"IF($B135=\"\",\"\",VLOOKUP($B135:$B135,QUALIF!$C$3:$R$38,12,FALSE))","v":""},{"$f":"IF($B135=\"\",\"\",VLOOKUP($B135:$B135,QUALIF!$C$3:$R$38,13,FALSE))","v":""},{"$f":"IF($B135=\"\",\"\",VLOOKUP($B135:$B135,QUALIF!$C$3:$R$38,14,FALSE))","v":""},{"$f":"IF($B135=\"\",\"\",VLOOKUP($B135:$B135,QUALIF!$C$3:$R$38,15,FALSE))","v":""},{"$f":"IF($B135=\"\",\"\",VLOOKUP($B135:$B135,QUALIF!$C$3:$R$38,16,FALSE))","v":""}]
[null,null,null,null,null," ",{"$f":"IF($B136=\"\",\"\",VLOOKUP($B136:$B136,QUALIF!$C$3:$R$38,4,FALSE))","v":""},{"$f":"IF($B136=\"\",\"\",VLOOKUP($B136:$B136,QUALIF!$C$3:$R$38,5,FALSE))","v":""},{"$f":"IF($B136=\"\",\"\",VLOOKUP($B136:$B136,QUALIF!$C$3:$R$38,6,FALSE))","v":""},{"$f":"IF($B136=\"\",\"\",VLOOKUP($B136:$B136,QUALIF!$C$3:$R$38,7,FALSE))","v":""},{"$f":"IF($B136=\"\",\"\",VLOOKUP($B136:$B136,QUALIF!$C$3:$R$38,8,FALSE))","v":""},{"$f":"IF($B136=\"\",\"\",VLOOKUP($B136:$B136,QUALIF!$C$3:$R$38,9,FALSE))","v":""},{"$f":"IF($B136=\"\",\"\",VLOOKUP($B136:$B136,QUALIF!$C$3:$R$38,10,FALSE))","v":""},{"$f":"IF($B136=\"\",\"\",VLOOKUP($B136:$B136,QUALIF!$C$3:$R$38,11,FALSE))","v":""},{"$f":"IF($B136=\"\",\"\",VLOOKUP($B136:$B136,QUALIF!$C$3:$R$38,12,FALSE))","v":""},{"$f":"IF($B136=\"\",\"\",VLOOKUP($B136:$B136,QUALIF!$C$3:$R$38,13,FALSE))","v":""},{"$f":"IF($B136=\"\",\"\",VLOOKUP($B136:$B136,QUALIF!$C$3:$R$38,14,FALSE))","v":""},{"$f":"IF($B136=\"\",\"\",VLOOKUP($B136:$B136,QUALIF!$C$3:$R$38,15,FALSE))","v":""},{"$f":"IF($B136=\"\",\"\",VLOOKUP($B136:$B136,QUALIF!$C$3:$R$38,16,FALSE))","v":""}]
[null,null,null,null,null," ",{"$f":"IF($B137=\"\",\"\",VLOOKUP($B137:$B137,QUALIF!$C$3:$R$38,4,FALSE))","v":""},{"$f":"IF($B137=\"\",\"\",VLOOKUP($B137:$B137,QUALIF!$C$3:$R$38,5,FALSE))","v":""},{"$f":"IF($B137=\"\",\"\",VLOOKUP($B137:$B137,QUALIF!$C$3:$R$38,6,FALSE))","v":""},{"$f":"IF($B137=\"\",\"\",VLOOKUP($B137:$B137,QUALIF!$C$3:$R$38,7,FALSE))","v":""},{"$f":"IF($B137=\"\",\"\",VLOOKUP($B137:$B137,QUALIF!$C$3:$R$38,8,FALSE))","v":""},{"$f":"IF($B137=\"\",\"\",VLOOKUP($B137:$B137,QUALIF!$C$3:$R$38,9,FALSE))","v":""},{"$f":"IF($B137=\"\",\"\",VLOOKUP($B137:$B137,QUALIF!$C$3:$R$38,10,FALSE))","v":""},{"$f":"IF($B137=\"\",\"\",VLOOKUP($B137:$B137,QUALIF!$C$3:$R$38,11,FALSE))","v":""},{"$f":"IF($B137=\"\",\"\",VLOOKUP($B137:$B137,QUALIF!$C$3:$R$38,12,FALSE))","v":""},{"$f":"IF($B137=\"\",\"\",VLOOKUP($B137:$B137,QUALIF!$C$3:$R$38,13,FALSE))","v":""},{"$f":"IF($B137=\"\",\"\",VLOOKUP($B137:$B137,QUALIF!$C$3:$R$38,14,FALSE))","v":""},{"$f":"IF($B137=\"\",\"\",VLOOKUP($B137:$B137,QUALIF!$C$3:$R$38,15,FALSE))","v":""},{"$f":"IF($B137=\"\",\"\",VLOOKUP($B137:$B137,QUALIF!$C$3:$R$38,16,FALSE))","v":""}]
[null,null,null,null,null," ",{"$f":"IF($B138=\"\",\"\",VLOOKUP($B138:$B138,QUALIF!$C$3:$R$38,4,FALSE))","v":""},{"$f":"IF($B138=\"\",\"\",VLOOKUP($B138:$B138,QUALIF!$C$3:$R$38,5,FALSE))","v":""},{"$f":"IF($B138=\"\",\"\",VLOOKUP($B138:$B138,QUALIF!$C$3:$R$38,6,FALSE))","v":""},{"$f":"IF($B138=\"\",\"\",VLOOKUP($B138:$B138,QUALIF!$C$3:$R$38,7,FALSE))","v":""},{"$f":"IF($B138=\"\",\"\",VLOOKUP($B138:$B138,QUALIF!$C$3:$R$38,8,FALSE))","v":""},{"$f":"IF($B138=\"\",\"\",VLOOKUP($B138:$B138,QUALIF!$C$3:$R$38,9,FALSE))","v":""},{"$f":"IF($B138=\"\",\"\",VLOOKUP($B138:$B138,QUALIF!$C$3:$R$38,10,FALSE))","v":""},{"$f":"IF($B138=\"\",\"\",VLOOKUP($B138:$B138,QUALIF!$C$3:$R$38,11,FALSE))","v":""},{"$f":"IF($B138=\"\",\"\",VLOOKUP($B138:$B138,QUALIF!$C$3:$R$38,12,FALSE))","v":""},{"$f":"IF($B138=\"\",\"\",VLOOKUP($B138:$B138,QUALIF!$C$3:$R$38,13,FALSE))","v":""},{"$f":"IF($B138=\"\",\"\",VLOOKUP($B138:$B138,QUALIF!$C$3:$R$38,14,FALSE))","v":""},{"$f":"IF($B138=\"\",\"\",VLOOKUP($B138:$B138,QUALIF!$C$3:$R$38,15,FALSE))","v":""},{"$f":"IF($B138=\"\",\"\",VLOOKUP($B138:$B138,QUALIF!$C$3:$R$38,16,FALSE))","v":""}]
[null,null,null,null,null," ",{"$f":"IF($B139=\"\",\"\",VLOOKUP($B139:$B139,QUALIF!$C$3:$R$38,4,FALSE))","v":""},{"$f":"IF($B139=\"\",\"\",VLOOKUP($B139:$B139,QUALIF!$C$3:$R$38,5,FALSE))","v":""},{"$f":"IF($B139=\"\",\"\",VLOOKUP($B139:$B139,QUALIF!$C$3:$R$38,6,FALSE))","v":""},{"$f":"IF($B139=\"\",\"\",VLOOKUP($B139:$B139,QUALIF!$C$3:$R$38,7,FALSE))","v":""},{"$f":"IF($B139=\"\",\"\",VLOOKUP($B139:$B139,QUALIF!$C$3:$R$38,8,FALSE))","v":""},{"$f":"IF($B139=\"\",\"\",VLOOKUP($B139:$B139,QUALIF!$C$3:$R$38,9,FALSE))","v":""},{"$f":"IF($B139=\"\",\"\",VLOOKUP($B139:$B139,QUALIF!$C$3:$R$38,10,FALSE))","v":""},{"$f":"IF($B139=\"\",\"\",VLOOKUP($B139:$B139,QUALIF!$C$3:$R$38,11,FALSE))","v":""},{"$f":"IF($B139=\"\",\"\",VLOOKUP($B139:$B139,QUALIF!$C$3:$R$38,12,FALSE))","v":""},{"$f":"IF($B139=\"\",\"\",VLOOKUP($B139:$B139,QUALIF!$C$3:$R$38,13,FALSE))","v":""},{"$f":"IF($B139=\"\",\"\",VLOOKUP($B139:$B139,QUALIF!$C$3:$R$38,14,FALSE))","v":""},{"$f":"IF($B139=\"\",\"\",VLOOKUP($B139:$B139,QUALIF!$C$3:$R$38,15,FALSE))","v":""},{"$f":"IF($B139=\"\",\"\",VLOOKUP($B139:$B139,QUALIF!$C$3:$R$38,16,FALSE))","v":""}]
[null,null,null,null,null," ",{"$f":"IF($B140=\"\",\"\",VLOOKUP($B140:$B140,QUALIF!$C$3:$R$38,4,FALSE))","v":""},{"$f":"IF($B140=\"\",\"\",VLOOKUP($B140:$B140,QUALIF!$C$3:$R$38,5,FALSE))","v":""},{"$f":"IF($B140=\"\",\"\",VLOOKUP($B140:$B140,QUALIF!$C$3:$R$38,6,FALSE))","v":""},{"$f":"IF($B140=\"\",\"\",VLOOKUP($B140:$B140,QUALIF!$C$3:$R$38,7,FALSE))","v":""},{"$f":"IF($B140=\"\",\"\",VLOOKUP($B140:$B140,QUALIF!$C$3:$R$38,8,FALSE))","v":""},{"$f":"IF($B140=\"\",\"\",VLOOKUP($B140:$B140,QUALIF!$C$3:$R$38,9,FALSE))","v":""},{"$f":"IF($B140=\"\",\"\",VLOOKUP($B140:$B140,QUALIF!$C$3:$R$38,10,FALSE))","v":""},{"$f":"IF($B140=\"\",\"\",VLOOKUP($B140:$B140,QUALIF!$C$3:$R$38,11,FALSE))","v":""},{"$f":"IF($B140=\"\",\"\",VLOOKUP($B140:$B140,QUALIF!$C$3:$R$38,12,FALSE))","v":""},{"$f":"IF($B140=\"\",\"\",VLOOKUP($B140:$B140,QUALIF!$C$3:$R$38,13,FALSE))","v":""},{"$f":"IF($B140=\"\",\"\",VLOOKUP($B140:$B140,QUALIF!$C$3:$R$38,14,FALSE))","v":""},{"$f":"IF($B140=\"\",\"\",VLOOKUP($B140:$B140,QUALIF!$C$3:$R$38,15,FALSE))","v":""},{"$f":"IF($B140=\"\",\"\",VLOOKUP($B140:$B140,QUALIF!$C$3:$R$38,16,FALSE))","v":""}]
[null,null,null,null,null," ",{"$f":"IF($B141=\"\",\"\",VLOOKUP($B141:$B141,QUALIF!$C$3:$R$38,4,FALSE))","v":""},{"$f":"IF($B141=\"\",\"\",VLOOKUP($B141:$B141,QUALIF!$C$3:$R$38,5,FALSE))","v":""},{"$f":"IF($B141=\"\",\"\",VLOOKUP($B141:$B141,QUALIF!$C$3:$R$38,6,FALSE))","v":""},{"$f":"IF($B141=\"\",\"\",VLOOKUP($B141:$B141,QUALIF!$C$3:$R$38,7,FALSE))","v":""},{"$f":"IF($B141=\"\",\"\",VLOOKUP($B141:$B141,QUALIF!$C$3:$R$38,8,FALSE))","v":""},{"$f":"IF($B141=\"\",\"\",VLOOKUP($B141:$B141,QUALIF!$C$3:$R$38,9,FALSE))","v":""},{"$f":"IF($B141=\"\",\"\",VLOOKUP($B141:$B141,QUALIF!$C$3:$R$38,10,FALSE))","v":""},{"$f":"IF($B141=\"\",\"\",VLOOKUP($B141:$B141,QUALIF!$C$3:$R$38,11,FALSE))","v":""},{"$f":"IF($B141=\"\",\"\",VLOOKUP($B141:$B141,QUALIF!$C$3:$R$38,12,FALSE))","v":""},{"$f":"IF($B141=\"\",\"\",VLOOKUP($B141:$B141,QUALIF!$C$3:$R$38,13,FALSE))","v":""},{"$f":"IF($B141=\"\",\"\",VLOOKUP($B141:$B141,QUALIF!$C$3:$R$38,14,FALSE))","v":""},{"$f":"IF($B141=\"\",\"\",VLOOKUP($B141:$B141,QUALIF!$C$3:$R$38,15,FALSE))","v":""},{"$f":"IF($B141=\"\",\"\",VLOOKUP($B141:$B141,QUALIF!$C$3:$R$38,16,FALSE))","v":""}]
[null,null,null,null,null," ",{"$f":"IF($B142=\"\",\"\",VLOOKUP($B142:$B142,QUALIF!$C$3:$R$38,4,FALSE))","v":""},{"$f":"IF($B142=\"\",\"\",VLOOKUP($B142:$B142,QUALIF!$C$3:$R$38,5,FALSE))","v":""},{"$f":"IF($B142=\"\",\"\",VLOOKUP($B142:$B142,QUALIF!$C$3:$R$38,6,FALSE))","v":""},{"$f":"IF($B142=\"\",\"\",VLOOKUP($B142:$B142,QUALIF!$C$3:$R$38,7,FALSE))","v":""},{"$f":"IF($B142=\"\",\"\",VLOOKUP($B142:$B142,QUALIF!$C$3:$R$38,8,FALSE))","v":""},{"$f":"IF($B142=\"\",\"\",VLOOKUP($B142:$B142,QUALIF!$C$3:$R$38,9,FALSE))","v":""},{"$f":"IF($B142=\"\",\"\",VLOOKUP($B142:$B142,QUALIF!$C$3:$R$38,10,FALSE))","v":""},{"$f":"IF($B142=\"\",\"\",VLOOKUP($B142:$B142,QUALIF!$C$3:$R$38,11,FALSE))","v":""},{"$f":"IF($B142=\"\",\"\",VLOOKUP($B142:$B142,QUALIF!$C$3:$R$38,12,FALSE))","v":""},{"$f":"IF($B142=\"\",\"\",VLOOKUP($B142:$B142,QUALIF!$C$3:$R$38,13,FALSE))","v":""},{"$f":"IF($B142=\"\",\"\",VLOOKUP($B142:$B142,QUALIF!$C$3:$R$38,14,FALSE))","v":""},{"$f":"IF($B142=\"\",\"\",VLOOKUP($B142:$B142,QUALIF!$C$3:$R$38,15,FALSE))","v":""},{"$f":"IF($B142=\"\",\"\",VLOOKUP($B142:$B142,QUALIF!$C$3:$R$38,16,FALSE))","v":""}]
[null,null,null,null,null," ",{"$f":"IF($B143=\"\",\"\",VLOOKUP($B143:$B143,QUALIF!$C$3:$R$38,4,FALSE))","v":""},{"$f":"IF($B143=\"\",\"\",VLOOKUP($B143:$B143,QUALIF!$C$3:$R$38,5,FALSE))","v":""},{"$f":"IF($B143=\"\",\"\",VLOOKUP($B143:$B143,QUALIF!$C$3:$R$38,6,FALSE))","v":""},{"$f":"IF($B143=\"\",\"\",VLOOKUP($B143:$B143,QUALIF!$C$3:$R$38,7,FALSE))","v":""},{"$f":"IF($B143=\"\",\"\",VLOOKUP($B143:$B143,QUALIF!$C$3:$R$38,8,FALSE))","v":""},{"$f":"IF($B143=\"\",\"\",VLOOKUP($B143:$B143,QUALIF!$C$3:$R$38,9,FALSE))","v":""},{"$f":"IF($B143=\"\",\"\",VLOOKUP($B143:$B143,QUALIF!$C$3:$R$38,10,FALSE))","v":""},{"$f":"IF($B143=\"\",\"\",VLOOKUP($B143:$B143,QUALIF!$C$3:$R$38,11,FALSE))","v":""},{"$f":"IF($B143=\"\",\"\",VLOOKUP($B143:$B143,QUALIF!$C$3:$R$38,12,FALSE))","v":""},{"$f":"IF($B143=\"\",\"\",VLOOKUP($B143:$B143,QUALIF!$C$3:$R$38,13,FALSE))","v":""},{"$f":"IF($B143=\"\",\"\",VLOOKUP($B143:$B143,QUALIF!$C$3:$R$38,14,FALSE))","v":""},{"$f":"IF($B143=\"\",\"\",VLOOKUP($B143:$B143,QUALIF!$C$3:$R$38,15,FALSE))","v":""},{"$f":"IF($B143=\"\",\"\",VLOOKUP($B143:$B143,QUALIF!$C$3:$R$38,16,FALSE))","v":""}]
[null,null,null,null,null," ",{"$f":"IF($B144=\"\",\"\",VLOOKUP($B144:$B144,QUALIF!$C$3:$R$38,4,FALSE))","v":""},{"$f":"IF($B144=\"\",\"\",VLOOKUP($B144:$B144,QUALIF!$C$3:$R$38,5,FALSE))","v":""},{"$f":"IF($B144=\"\",\"\",VLOOKUP($B144:$B144,QUALIF!$C$3:$R$38,6,FALSE))","v":""},{"$f":"IF($B144=\"\",\"\",VLOOKUP($B144:$B144,QUALIF!$C$3:$R$38,7,FALSE))","v":""},{"$f":"IF($B144=\"\",\"\",VLOOKUP($B144:$B144,QUALIF!$C$3:$R$38,8,FALSE))","v":""},{"$f":"IF($B144=\"\",\"\",VLOOKUP($B144:$B144,QUALIF!$C$3:$R$38,9,FALSE))","v":""},{"$f":"IF($B144=\"\",\"\",VLOOKUP($B144:$B144,QUALIF!$C$3:$R$38,10,FALSE))","v":""},{"$f":"IF($B144=\"\",\"\",VLOOKUP($B144:$B144,QUALIF!$C$3:$R$38,11,FALSE))","v":""},{"$f":"IF($B144=\"\",\"\",VLOOKUP($B144:$B144,QUALIF!$C$3:$R$38,12,FALSE))","v":""},{"$f":"IF($B144=\"\",\"\",VLOOKUP($B144:$B144,QUALIF!$C$3:$R$38,13,FALSE))","v":""},{"$f":"IF($B144=\"\",\"\",VLOOKUP($B144:$B144,QUALIF!$C$3:$R$38,14,FALSE))","v":""},{"$f":"IF($B144=\"\",\"\",VLOOKUP($B144:$B144,QUALIF!$C$3:$R$38,15,FALSE))","v":""},{"$f":"IF($B144=\"\",\"\",VLOOKUP($B144:$B144,QUALIF!$C$3:$R$38,16,FALSE))","v":""}]
[null,null,null,null,null," ",{"$f":"IF($B145=\"\",\"\",VLOOKUP($B145:$B145,QUALIF!$C$3:$R$38,4,FALSE))","v":""},{"$f":"IF($B145=\"\",\"\",VLOOKUP($B145:$B145,QUALIF!$C$3:$R$38,5,FALSE))","v":""},{"$f":"IF($B145=\"\",\"\",VLOOKUP($B145:$B145,QUALIF!$C$3:$R$38,6,FALSE))","v":""},{"$f":"IF($B145=\"\",\"\",VLOOKUP($B145:$B145,QUALIF!$C$3:$R$38,7,FALSE))","v":""},{"$f":"IF($B145=\"\",\"\",VLOOKUP($B145:$B145,QUALIF!$C$3:$R$38,8,FALSE))","v":""},{"$f":"IF($B145=\"\",\"\",VLOOKUP($B145:$B145,QUALIF!$C$3:$R$38,9,FALSE))","v":""},{"$f":"IF($B145=\"\",\"\",VLOOKUP($B145:$B145,QUALIF!$C$3:$R$38,10,FALSE))","v":""},{"$f":"IF($B145=\"\",\"\",VLOOKUP($B145:$B145,QUALIF!$C$3:$R$38,11,FALSE))","v":""},{"$f":"IF($B145=\"\",\"\",VLOOKUP($B145:$B145,QUALIF!$C$3:$R$38,12,FALSE))","v":""},{"$f":"IF($B145=\"\",\"\",VLOOKUP($B145:$B145,QUALIF!$C$3:$R$38,13,FALSE))","v":""},{"$f":"IF($B145=\"\",\"\",VLOOKUP($B145:$B145,QUALIF!$C$3:$R$38,14,FALSE))","v":""},{"$f":"IF($B145=\"\",\"\",VLOOKUP($B145:$B145,QUALIF!$C$3:$R$38,15,FALSE))","v":""},{"$f":"IF($B145=\"\",\"\",VLOOKUP($B145:$B145,QUALIF!$C$3:$R$38,16,FALSE))","v":""}]
[null,null,null,null,null," ",{"$f":"IF($B146=\"\",\"\",VLOOKUP($B146:$B146,QUALIF!$C$3:$R$38,4,FALSE))","v":""},{"$f":"IF($B146=\"\",\"\",VLOOKUP($B146:$B146,QUALIF!$C$3:$R$38,5,FALSE))","v":""},{"$f":"IF($B146=\"\",\"\",VLOOKUP($B146:$B146,QUALIF!$C$3:$R$38,6,FALSE))","v":""},{"$f":"IF($B146=\"\",\"\",VLOOKUP($B146:$B146,QUALIF!$C$3:$R$38,7,FALSE))","v":""},{"$f":"IF($B146=\"\",\"\",VLOOKUP($B146:$B146,QUALIF!$C$3:$R$38,8,FALSE))","v":""},{"$f":"IF($B146=\"\",\"\",VLOOKUP($B146:$B146,QUALIF!$C$3:$R$38,9,FALSE))","v":""},{"$f":"IF($B146=\"\",\"\",VLOOKUP($B146:$B146,QUALIF!$C$3:$R$38,10,FALSE))","v":""},{"$f":"IF($B146=\"\",\"\",VLOOKUP($B146:$B146,QUALIF!$C$3:$R$38,11,FALSE))","v":""},{"$f":"IF($B146=\"\",\"\",VLOOKUP($B146:$B146,QUALIF!$C$3:$R$38,12,FALSE))","v":""},{"$f":"IF($B146=\"\",\"\",VLOOKUP($B146:$B146,QUALIF!$C$3:$R$38,13,FALSE))","v":""},{"$f":"IF($B146=\"\",\"\",VLOOKUP($B146:$B146,QUALIF!$C$3:$R$38,14,FALSE))","v":""},{"$f":"IF($B146=\"\",\"\",VLOOKUP($B146:$B146,QUALIF!$C$3:$R$38,15,FALSE))","v":""},{"$f":"IF($B146=\"\",\"\",VLOOKUP($B146:$B146,QUALIF!$C$3:$R$38,16,FALSE))","v":""}]
[null,null,null,null,null," ",{"$f":"IF($B147=\"\",\"\",VLOOKUP($B147:$B147,QUALIF!$C$3:$R$38,4,FALSE))","v":""},{"$f":"IF($B147=\"\",\"\",VLOOKUP($B147:$B147,QUALIF!$C$3:$R$38,5,FALSE))","v":""},{"$f":"IF($B147=\"\",\"\",VLOOKUP($B147:$B147,QUALIF!$C$3:$R$38,6,FALSE))","v":""},{"$f":"IF($B147=\"\",\"\",VLOOKUP($B147:$B147,QUALIF!$C$3:$R$38,7,FALSE))","v":""},{"$f":"IF($B147=\"\",\"\",VLOOKUP($B147:$B147,QUALIF!$C$3:$R$38,8,FALSE))","v":""},{"$f":"IF($B147=\"\",\"\",VLOOKUP($B147:$B147,QUALIF!$C$3:$R$38,9,FALSE))","v":""},{"$f":"IF($B147=\"\",\"\",VLOOKUP($B147:$B147,QUALIF!$C$3:$R$38,10,FALSE))","v":""},{"$f":"IF($B147=\"\",\"\",VLOOKUP($B147:$B147,QUALIF!$C$3:$R$38,11,FALSE))","v":""},{"$f":"IF($B147=\"\",\"\",VLOOKUP($B147:$B147,QUALIF!$C$3:$R$38,12,FALSE))","v":""},{"$f":"IF($B147=\"\",\"\",VLOOKUP($B147:$B147,QUALIF!$C$3:$R$38,13,FALSE))","v":""},{"$f":"IF($B147=\"\",\"\",VLOOKUP($B147:$B147,QUALIF!$C$3:$R$38,14,FALSE))","v":""},{"$f":"IF($B147=\"\",\"\",VLOOKUP($B147:$B147,QUALIF!$C$3:$R$38,15,FALSE))","v":""},{"$f":"IF($B147=\"\",\"\",VLOOKUP($B147:$B147,QUALIF!$C$3:$R$38,16,FALSE))","v":""}]
[null,null,null,null,null," ",{"$f":"IF($B148=\"\",\"\",VLOOKUP($B148:$B148,QUALIF!$C$3:$R$38,4,FALSE))","v":""},{"$f":"IF($B148=\"\",\"\",VLOOKUP($B148:$B148,QUALIF!$C$3:$R$38,5,FALSE))","v":""},{"$f":"IF($B148=\"\",\"\",VLOOKUP($B148:$B148,QUALIF!$C$3:$R$38,6,FALSE))","v":""},{"$f":"IF($B148=\"\",\"\",VLOOKUP($B148:$B148,QUALIF!$C$3:$R$38,7,FALSE))","v":""},{"$f":"IF($B148=\"\",\"\",VLOOKUP($B148:$B148,QUALIF!$C$3:$R$38,8,FALSE))","v":""},{"$f":"IF($B148=\"\",\"\",VLOOKUP($B148:$B148,QUALIF!$C$3:$R$38,9,FALSE))","v":""},{"$f":"IF($B148=\"\",\"\",VLOOKUP($B148:$B148,QUALIF!$C$3:$R$38,10,FALSE))","v":""},{"$f":"IF($B148=\"\",\"\",VLOOKUP($B148:$B148,QUALIF!$C$3:$R$38,11,FALSE))","v":""},{"$f":"IF($B148=\"\",\"\",VLOOKUP($B148:$B148,QUALIF!$C$3:$R$38,12,FALSE))","v":""},{"$f":"IF($B148=\"\",\"\",VLOOKUP($B148:$B148,QUALIF!$C$3:$R$38,13,FALSE))","v":""},{"$f":"IF($B148=\"\",\"\",VLOOKUP($B148:$B148,QUALIF!$C$3:$R$38,14,FALSE))","v":""},{"$f":"IF($B148=\"\",\"\",VLOOKUP($B148:$B148,QUALIF!$C$3:$R$38,15,FALSE))","v":""},{"$f":"IF($B148=\"\",\"\",VLOOKUP($B148:$B148,QUALIF!$C$3:$R$38,16,FALSE))","v":""}]
[null,null,null,null,null," ",{"$f":"IF($B149=\"\",\"\",VLOOKUP($B149:$B149,QUALIF!$C$3:$R$38,4,FALSE))","v":""},{"$f":"IF($B149=\"\",\"\",VLOOKUP($B149:$B149,QUALIF!$C$3:$R$38,5,FALSE))","v":""},{"$f":"IF($B149=\"\",\"\",VLOOKUP($B149:$B149,QUALIF!$C$3:$R$38,6,FALSE))","v":""},{"$f":"IF($B149=\"\",\"\",VLOOKUP($B149:$B149,QUALIF!$C$3:$R$38,7,FALSE))","v":""},{"$f":"IF($B149=\"\",\"\",VLOOKUP($B149:$B149,QUALIF!$C$3:$R$38,8,FALSE))","v":""},{"$f":"IF($B149=\"\",\"\",VLOOKUP($B149:$B149,QUALIF!$C$3:$R$38,9,FALSE))","v":""},{"$f":"IF($B149=\"\",\"\",VLOOKUP($B149:$B149,QUALIF!$C$3:$R$38,10,FALSE))","v":""},{"$f":"IF($B149=\"\",\"\",VLOOKUP($B149:$B149,QUALIF!$C$3:$R$38,11,FALSE))","v":""},{"$f":"IF($B149=\"\",\"\",VLOOKUP($B149:$B149,QUALIF!$C$3:$R$38,12,FALSE))","v":""},{"$f":"IF($B149=\"\",\"\",VLOOKUP($B149:$B149,QUALIF!$C$3:$R$38,13,FALSE))","v":""},{"$f":"IF($B149=\"\",\"\",VLOOKUP($B149:$B149,QUALIF!$C$3:$R$38,14,FALSE))","v":""},{"$f":"IF($B149=\"\",\"\",VLOOKUP($B149:$B149,QUALIF!$C$3:$R$38,15,FALSE))","v":""},{"$f":"IF($B149=\"\",\"\",VLOOKUP($B149:$B149,QUALIF!$C$3:$R$38,16,FALSE))","v":""}]
[null,null,null,null,null," ",{"$f":"IF($B150=\"\",\"\",VLOOKUP($B150:$B150,QUALIF!$C$3:$R$38,4,FALSE))","v":""},{"$f":"IF($B150=\"\",\"\",VLOOKUP($B150:$B150,QUALIF!$C$3:$R$38,5,FALSE))","v":""},{"$f":"IF($B150=\"\",\"\",VLOOKUP($B150:$B150,QUALIF!$C$3:$R$38,6,FALSE))","v":""},{"$f":"IF($B150=\"\",\"\",VLOOKUP($B150:$B150,QUALIF!$C$3:$R$38,7,FALSE))","v":""},{"$f":"IF($B150=\"\",\"\",VLOOKUP($B150:$B150,QUALIF!$C$3:$R$38,8,FALSE))","v":""},{"$f":"IF($B150=\"\",\"\",VLOOKUP($B150:$B150,QUALIF!$C$3:$R$38,9,FALSE))","v":""},{"$f":"IF($B150=\"\",\"\",VLOOKUP($B150:$B150,QUALIF!$C$3:$R$38,10,FALSE))","v":""},{"$f":"IF($B150=\"\",\"\",VLOOKUP($B150:$B150,QUALIF!$C$3:$R$38,11,FALSE))","v":""},{"$f":"IF($B150=\"\",\"\",VLOOKUP($B150:$B150,QUALIF!$C$3:$R$38,12,FALSE))","v":""},{"$f":"IF($B150=\"\",\"\",VLOOKUP($B150:$B150,QUALIF!$C$3:$R$38,13,FALSE))","v":""},{"$f":"IF($B150=\"\",\"\",VLOOKUP($B150:$B150,QUALIF!$C$3:$R$38,14,FALSE))","v":""},{"$f":"IF($B150=\"\",\"\",VLOOKUP($B150:$B150,QUALIF!$C$3:$R$38,15,FALSE))","v":""},{"$f":"IF($B150=\"\",\"\",VLOOKUP($B150:$B150,QUALIF!$C$3:$R$38,16,FALSE))","v":""}]
[null,null,null,null,null,{"$f":"A151&\" \"&B151","v":" "},{"$f":"IF($B151=\"\",\"\",VLOOKUP($B151:$B151,QUALIF!$C$3:$R$38,4,FALSE))","v":""},{"$f":"IF($B151=\"\",\"\",VLOOKUP($B151:$B151,QUALIF!$C$3:$R$38,5,FALSE))","v":""},{"$f":"IF($B151=\"\",\"\",VLOOKUP($B151:$B151,QUALIF!$C$3:$R$38,6,FALSE))","v":""},{"$f":"IF($B151=\"\",\"\",VLOOKUP($B151:$B151,QUALIF!$C$3:$R$38,7,FALSE))","v":""},{"$f":"IF($B151=\"\",\"\",VLOOKUP($B151:$B151,QUALIF!$C$3:$R$38,8,FALSE))","v":""},{"$f":"IF($B151=\"\",\"\",VLOOKUP($B151:$B151,QUALIF!$C$3:$R$38,9,FALSE))","v":""},{"$f":"IF($B151=\"\",\"\",VLOOKUP($B151:$B151,QUALIF!$C$3:$R$38,10,FALSE))","v":""},{"$f":"IF($B151=\"\",\"\",VLOOKUP($B151:$B151,QUALIF!$C$3:$R$38,11,FALSE))","v":""},{"$f":"IF($B151=\"\",\"\",VLOOKUP($B151:$B151,QUALIF!$C$3:$R$38,12,FALSE))","v":""},{"$f":"IF($B151=\"\",\"\",VLOOKUP($B151:$B151,QUALIF!$C$3:$R$38,13,FALSE))","v":""},{"$f":"IF($B151=\"\",\"\",VLOOKUP($B151:$B151,QUALIF!$C$3:$R$38,14,FALSE))","v":""},{"$f":"IF($B151=\"\",\"\",VLOOKUP($B151:$B151,QUALIF!$C$3:$R$38,15,FALSE))","v":""},{"$f":"IF($B151=\"\",\"\",VLOOKUP($B151:$B151,QUALIF!$C$3:$R$38,16,FALSE))","v":""}]
[null,null,null,null,null," ",{"$f":"IF($B152=\"\",\"\",VLOOKUP($B152:$B152,QUALIF!$C$3:$R$38,4,FALSE))","v":""},{"$f":"IF($B152=\"\",\"\",VLOOKUP($B152:$B152,QUALIF!$C$3:$R$38,5,FALSE))","v":""},{"$f":"IF($B152=\"\",\"\",VLOOKUP($B152:$B152,QUALIF!$C$3:$R$38,6,FALSE))","v":""},{"$f":"IF($B152=\"\",\"\",VLOOKUP($B152:$B152,QUALIF!$C$3:$R$38,7,FALSE))","v":""},{"$f":"IF($B152=\"\",\"\",VLOOKUP($B152:$B152,QUALIF!$C$3:$R$38,8,FALSE))","v":""},{"$f":"IF($B152=\"\",\"\",VLOOKUP($B152:$B152,QUALIF!$C$3:$R$38,9,FALSE))","v":""},{"$f":"IF($B152=\"\",\"\",VLOOKUP($B152:$B152,QUALIF!$C$3:$R$38,10,FALSE))","v":""},{"$f":"IF($B152=\"\",\"\",VLOOKUP($B152:$B152,QUALIF!$C$3:$R$38,11,FALSE))","v":""},{"$f":"IF($B152=\"\",\"\",VLOOKUP($B152:$B152,QUALIF!$C$3:$R$38,12,FALSE))","v":""},{"$f":"IF($B152=\"\",\"\",VLOOKUP($B152:$B152,QUALIF!$C$3:$R$38,13,FALSE))","v":""},{"$f":"IF($B152=\"\",\"\",VLOOKUP($B152:$B152,QUALIF!$C$3:$R$38,14,FALSE))","v":""},{"$f":"IF($B152=\"\",\"\",VLOOKUP($B152:$B152,QUALIF!$C$3:$R$38,15,FALSE))","v":""},{"$f":"IF($B152=\"\",\"\",VLOOKUP($B152:$B152,QUALIF!$C$3:$R$38,16,FALSE))","v":""}]
[null,null,null,null,null," ",{"$f":"IF($B153=\"\",\"\",VLOOKUP($B153:$B153,QUALIF!$C$3:$R$38,4,FALSE))","v":""},{"$f":"IF($B153=\"\",\"\",VLOOKUP($B153:$B153,QUALIF!$C$3:$R$38,5,FALSE))","v":""},{"$f":"IF($B153=\"\",\"\",VLOOKUP($B153:$B153,QUALIF!$C$3:$R$38,6,FALSE))","v":""},{"$f":"IF($B153=\"\",\"\",VLOOKUP($B153:$B153,QUALIF!$C$3:$R$38,7,FALSE))","v":""},{"$f":"IF($B153=\"\",\"\",VLOOKUP($B153:$B153,QUALIF!$C$3:$R$38,8,FALSE))","v":""},{"$f":"IF($B153=\"\",\"\",VLOOKUP($B153:$B153,QUALIF!$C$3:$R$38,9,FALSE))","v":""},{"$f":"IF($B153=\"\",\"\",VLOOKUP($B153:$B153,QUALIF!$C$3:$R$38,10,FALSE))","v":""},{"$f":"IF($B153=\"\",\"\",VLOOKUP($B153:$B153,QUALIF!$C$3:$R$38,11,FALSE))","v":""},{"$f":"IF($B153=\"\",\"\",VLOOKUP($B153:$B153,QUALIF!$C$3:$R$38,12,FALSE))","v":""},{"$f":"IF($B153=\"\",\"\",VLOOKUP($B153:$B153,QUALIF!$C$3:$R$38,13,FALSE))","v":""},{"$f":"IF($B153=\"\",\"\",VLOOKUP($B153:$B153,QUALIF!$C$3:$R$38,14,FALSE))","v":""},{"$f":"IF($B153=\"\",\"\",VLOOKUP($B153:$B153,QUALIF!$C$3:$R$38,15,FALSE))","v":""},{"$f":"IF($B153=\"\",\"\",VLOOKUP($B153:$B153,QUALIF!$C$3:$R$38,16,FALSE))","v":""}]
[null,null,null,null,null," ",{"$f":"IF($B154=\"\",\"\",VLOOKUP($B154:$B154,QUALIF!$C$3:$R$38,4,FALSE))","v":""},{"$f":"IF($B154=\"\",\"\",VLOOKUP($B154:$B154,QUALIF!$C$3:$R$38,5,FALSE))","v":""},{"$f":"IF($B154=\"\",\"\",VLOOKUP($B154:$B154,QUALIF!$C$3:$R$38,6,FALSE))","v":""},{"$f":"IF($B154=\"\",\"\",VLOOKUP($B154:$B154,QUALIF!$C$3:$R$38,7,FALSE))","v":""},{"$f":"IF($B154=\"\",\"\",VLOOKUP($B154:$B154,QUALIF!$C$3:$R$38,8,FALSE))","v":""},{"$f":"IF($B154=\"\",\"\",VLOOKUP($B154:$B154,QUALIF!$C$3:$R$38,9,FALSE))","v":""},{"$f":"IF($B154=\"\",\"\",VLOOKUP($B154:$B154,QUALIF!$C$3:$R$38,10,FALSE))","v":""},{"$f":"IF($B154=\"\",\"\",VLOOKUP($B154:$B154,QUALIF!$C$3:$R$38,11,FALSE))","v":""},{"$f":"IF($B154=\"\",\"\",VLOOKUP($B154:$B154,QUALIF!$C$3:$R$38,12,FALSE))","v":""},{"$f":"IF($B154=\"\",\"\",VLOOKUP($B154:$B154,QUALIF!$C$3:$R$38,13,FALSE))","v":""},{"$f":"IF($B154=\"\",\"\",VLOOKUP($B154:$B154,QUALIF!$C$3:$R$38,14,FALSE))","v":""},{"$f":"IF($B154=\"\",\"\",VLOOKUP($B154:$B154,QUALIF!$C$3:$R$38,15,FALSE))","v":""},{"$f":"IF($B154=\"\",\"\",VLOOKUP($B154:$B154,QUALIF!$C$3:$R$38,16,FALSE))","v":""}]
[null,null,null,null,null," ",{"$f":"IF($B155=\"\",\"\",VLOOKUP($B155:$B155,QUALIF!$C$3:$R$38,4,FALSE))","v":""},{"$f":"IF($B155=\"\",\"\",VLOOKUP($B155:$B155,QUALIF!$C$3:$R$38,5,FALSE))","v":""},{"$f":"IF($B155=\"\",\"\",VLOOKUP($B155:$B155,QUALIF!$C$3:$R$38,6,FALSE))","v":""},{"$f":"IF($B155=\"\",\"\",VLOOKUP($B155:$B155,QUALIF!$C$3:$R$38,7,FALSE))","v":""},{"$f":"IF($B155=\"\",\"\",VLOOKUP($B155:$B155,QUALIF!$C$3:$R$38,8,FALSE))","v":""},{"$f":"IF($B155=\"\",\"\",VLOOKUP($B155:$B155,QUALIF!$C$3:$R$38,9,FALSE))","v":""},{"$f":"IF($B155=\"\",\"\",VLOOKUP($B155:$B155,QUALIF!$C$3:$R$38,10,FALSE))","v":""},{"$f":"IF($B155=\"\",\"\",VLOOKUP($B155:$B155,QUALIF!$C$3:$R$38,11,FALSE))","v":""},{"$f":"IF($B155=\"\",\"\",VLOOKUP($B155:$B155,QUALIF!$C$3:$R$38,12,FALSE))","v":""},{"$f":"IF($B155=\"\",\"\",VLOOKUP($B155:$B155,QUALIF!$C$3:$R$38,13,FALSE))","v":""},{"$f":"IF($B155=\"\",\"\",VLOOKUP($B155:$B155,QUALIF!$C$3:$R$38,14,FALSE))","v":""},{"$f":"IF($B155=\"\",\"\",VLOOKUP($B155:$B155,QUALIF!$C$3:$R$38,15,FALSE))","v":""},{"$f":"IF($B155=\"\",\"\",VLOOKUP($B155:$B155,QUALIF!$C$3:$R$38,16,FALSE))","v":""}]
[null,null,null,null,null," ",{"$f":"IF($B156=\"\",\"\",VLOOKUP($B156:$B156,QUALIF!$C$3:$R$38,4,FALSE))","v":""},{"$f":"IF($B156=\"\",\"\",VLOOKUP($B156:$B156,QUALIF!$C$3:$R$38,5,FALSE))","v":""},{"$f":"IF($B156=\"\",\"\",VLOOKUP($B156:$B156,QUALIF!$C$3:$R$38,6,FALSE))","v":""},{"$f":"IF($B156=\"\",\"\",VLOOKUP($B156:$B156,QUALIF!$C$3:$R$38,7,FALSE))","v":""},{"$f":"IF($B156=\"\",\"\",VLOOKUP($B156:$B156,QUALIF!$C$3:$R$38,8,FALSE))","v":""},{"$f":"IF($B156=\"\",\"\",VLOOKUP($B156:$B156,QUALIF!$C$3:$R$38,9,FALSE))","v":""},{"$f":"IF($B156=\"\",\"\",VLOOKUP($B156:$B156,QUALIF!$C$3:$R$38,10,FALSE))","v":""},{"$f":"IF($B156=\"\",\"\",VLOOKUP($B156:$B156,QUALIF!$C$3:$R$38,11,FALSE))","v":""},{"$f":"IF($B156=\"\",\"\",VLOOKUP($B156:$B156,QUALIF!$C$3:$R$38,12,FALSE))","v":""},{"$f":"IF($B156=\"\",\"\",VLOOKUP($B156:$B156,QUALIF!$C$3:$R$38,13,FALSE))","v":""},{"$f":"IF($B156=\"\",\"\",VLOOKUP($B156:$B156,QUALIF!$C$3:$R$38,14,FALSE))","v":""},{"$f":"IF($B156=\"\",\"\",VLOOKUP($B156:$B156,QUALIF!$C$3:$R$38,15,FALSE))","v":""},{"$f":"IF($B156=\"\",\"\",VLOOKUP($B156:$B156,QUALIF!$C$3:$R$38,16,FALSE))","v":""}]
[null,null,null,null,null," ",{"$f":"IF($B157=\"\",\"\",VLOOKUP($B157:$B157,QUALIF!$C$3:$R$38,4,FALSE))","v":""},{"$f":"IF($B157=\"\",\"\",VLOOKUP($B157:$B157,QUALIF!$C$3:$R$38,5,FALSE))","v":""},{"$f":"IF($B157=\"\",\"\",VLOOKUP($B157:$B157,QUALIF!$C$3:$R$38,6,FALSE))","v":""},{"$f":"IF($B157=\"\",\"\",VLOOKUP($B157:$B157,QUALIF!$C$3:$R$38,7,FALSE))","v":""},{"$f":"IF($B157=\"\",\"\",VLOOKUP($B157:$B157,QUALIF!$C$3:$R$38,8,FALSE))","v":""},{"$f":"IF($B157=\"\",\"\",VLOOKUP($B157:$B157,QUALIF!$C$3:$R$38,9,FALSE))","v":""},{"$f":"IF($B157=\"\",\"\",VLOOKUP($B157:$B157,QUALIF!$C$3:$R$38,10,FALSE))","v":""},{"$f":"IF($B157=\"\",\"\",VLOOKUP($B157:$B157,QUALIF!$C$3:$R$38,11,FALSE))","v":""},{"$f":"IF($B157=\"\",\"\",VLOOKUP($B157:$B157,QUALIF!$C$3:$R$38,12,FALSE))","v":""},{"$f":"IF($B157=\"\",\"\",VLOOKUP($B157:$B157,QUALIF!$C$3:$R$38,13,FALSE))","v":""},{"$f":"IF($B157=\"\",\"\",VLOOKUP($B157:$B157,QUALIF!$C$3:$R$38,14,FALSE))","v":""},{"$f":"IF($B157=\"\",\"\",VLOOKUP($B157:$B157,QUALIF!$C$3:$R$38,15,FALSE))","v":""},{"$f":"IF($B157=\"\",\"\",VLOOKUP($B157:$B157,QUALIF!$C$3:$R$38,16,FALSE))","v":""}]
[null,null,null,null,null," ",{"$f":"IF($B158=\"\",\"\",VLOOKUP($B158:$B158,QUALIF!$C$3:$R$38,4,FALSE))","v":""},{"$f":"IF($B158=\"\",\"\",VLOOKUP($B158:$B158,QUALIF!$C$3:$R$38,5,FALSE))","v":""},{"$f":"IF($B158=\"\",\"\",VLOOKUP($B158:$B158,QUALIF!$C$3:$R$38,6,FALSE))","v":""},{"$f":"IF($B158=\"\",\"\",VLOOKUP($B158:$B158,QUALIF!$C$3:$R$38,7,FALSE))","v":""},{"$f":"IF($B158=\"\",\"\",VLOOKUP($B158:$B158,QUALIF!$C$3:$R$38,8,FALSE))","v":""},{"$f":"IF($B158=\"\",\"\",VLOOKUP($B158:$B158,QUALIF!$C$3:$R$38,9,FALSE))","v":""},{"$f":"IF($B158=\"\",\"\",VLOOKUP($B158:$B158,QUALIF!$C$3:$R$38,10,FALSE))","v":""},{"$f":"IF($B158=\"\",\"\",VLOOKUP($B158:$B158,QUALIF!$C$3:$R$38,11,FALSE))","v":""},{"$f":"IF($B158=\"\",\"\",VLOOKUP($B158:$B158,QUALIF!$C$3:$R$38,12,FALSE))","v":""},{"$f":"IF($B158=\"\",\"\",VLOOKUP($B158:$B158,QUALIF!$C$3:$R$38,13,FALSE))","v":""},{"$f":"IF($B158=\"\",\"\",VLOOKUP($B158:$B158,QUALIF!$C$3:$R$38,14,FALSE))","v":""},{"$f":"IF($B158=\"\",\"\",VLOOKUP($B158:$B158,QUALIF!$C$3:$R$38,15,FALSE))","v":""},{"$f":"IF($B158=\"\",\"\",VLOOKUP($B158:$B158,QUALIF!$C$3:$R$38,16,FALSE))","v":""}]
[null,null,null,null,null," ",{"$f":"IF($B159=\"\",\"\",VLOOKUP($B159:$B159,QUALIF!$C$3:$R$38,4,FALSE))","v":""},{"$f":"IF($B159=\"\",\"\",VLOOKUP($B159:$B159,QUALIF!$C$3:$R$38,5,FALSE))","v":""},{"$f":"IF($B159=\"\",\"\",VLOOKUP($B159:$B159,QUALIF!$C$3:$R$38,6,FALSE))","v":""},{"$f":"IF($B159=\"\",\"\",VLOOKUP($B159:$B159,QUALIF!$C$3:$R$38,7,FALSE))","v":""},{"$f":"IF($B159=\"\",\"\",VLOOKUP($B159:$B159,QUALIF!$C$3:$R$38,8,FALSE))","v":""},{"$f":"IF($B159=\"\",\"\",VLOOKUP($B159:$B159,QUALIF!$C$3:$R$38,9,FALSE))","v":""},{"$f":"IF($B159=\"\",\"\",VLOOKUP($B159:$B159,QUALIF!$C$3:$R$38,10,FALSE))","v":""},{"$f":"IF($B159=\"\",\"\",VLOOKUP($B159:$B159,QUALIF!$C$3:$R$38,11,FALSE))","v":""},{"$f":"IF($B159=\"\",\"\",VLOOKUP($B159:$B159,QUALIF!$C$3:$R$38,12,FALSE))","v":""},{"$f":"IF($B159=\"\",\"\",VLOOKUP($B159:$B159,QUALIF!$C$3:$R$38,13,FALSE))","v":""},{"$f":"IF($B159=\"\",\"\",VLOOKUP($B159:$B159,QUALIF!$C$3:$R$38,14,FALSE))","v":""},{"$f":"IF($B159=\"\",\"\",VLOOKUP($B159:$B159,QUALIF!$C$3:$R$38,15,FALSE))","v":""},{"$f":"IF($B159=\"\",\"\",VLOOKUP($B159:$B159,QUALIF!$C$3:$R$38,16,FALSE))","v":""}]
[null,null,null,null,null," ",{"$f":"IF($B160=\"\",\"\",VLOOKUP($B160:$B160,QUALIF!$C$3:$R$38,4,FALSE))","v":""},{"$f":"IF($B160=\"\",\"\",VLOOKUP($B160:$B160,QUALIF!$C$3:$R$38,5,FALSE))","v":""},{"$f":"IF($B160=\"\",\"\",VLOOKUP($B160:$B160,QUALIF!$C$3:$R$38,6,FALSE))","v":""},{"$f":"IF($B160=\"\",\"\",VLOOKUP($B160:$B160,QUALIF!$C$3:$R$38,7,FALSE))","v":""},{"$f":"IF($B160=\"\",\"\",VLOOKUP($B160:$B160,QUALIF!$C$3:$R$38,8,FALSE))","v":""},{"$f":"IF($B160=\"\",\"\",VLOOKUP($B160:$B160,QUALIF!$C$3:$R$38,9,FALSE))","v":""},{"$f":"IF($B160=\"\",\"\",VLOOKUP($B160:$B160,QUALIF!$C$3:$R$38,10,FALSE))","v":""},{"$f":"IF($B160=\"\",\"\",VLOOKUP($B160:$B160,QUALIF!$C$3:$R$38,11,FALSE))","v":""},{"$f":"IF($B160=\"\",\"\",VLOOKUP($B160:$B160,QUALIF!$C$3:$R$38,12,FALSE))","v":""},{"$f":"IF($B160=\"\",\"\",VLOOKUP($B160:$B160,QUALIF!$C$3:$R$38,13,FALSE))","v":""},{"$f":"IF($B160=\"\",\"\",VLOOKUP($B160:$B160,QUALIF!$C$3:$R$38,14,FALSE))","v":""},{"$f":"IF($B160=\"\",\"\",VLOOKUP($B160:$B160,QUALIF!$C$3:$R$38,15,FALSE))","v":""},{"$f":"IF($B160=\"\",\"\",VLOOKUP($B160:$B160,QUALIF!$C$3:$R$38,16,FALSE))","v":""}]
[null,null,null,null,null," ",{"$f":"IF($B161=\"\",\"\",VLOOKUP($B161:$B161,QUALIF!$C$3:$R$38,4,FALSE))","v":""},{"$f":"IF($B161=\"\",\"\",VLOOKUP($B161:$B161,QUALIF!$C$3:$R$38,5,FALSE))","v":""},{"$f":"IF($B161=\"\",\"\",VLOOKUP($B161:$B161,QUALIF!$C$3:$R$38,6,FALSE))","v":""},{"$f":"IF($B161=\"\",\"\",VLOOKUP($B161:$B161,QUALIF!$C$3:$R$38,7,FALSE))","v":""},{"$f":"IF($B161=\"\",\"\",VLOOKUP($B161:$B161,QUALIF!$C$3:$R$38,8,FALSE))","v":""},{"$f":"IF($B161=\"\",\"\",VLOOKUP($B161:$B161,QUALIF!$C$3:$R$38,9,FALSE))","v":""},{"$f":"IF($B161=\"\",\"\",VLOOKUP($B161:$B161,QUALIF!$C$3:$R$38,10,FALSE))","v":""},{"$f":"IF($B161=\"\",\"\",VLOOKUP($B161:$B161,QUALIF!$C$3:$R$38,11,FALSE))","v":""},{"$f":"IF($B161=\"\",\"\",VLOOKUP($B161:$B161,QUALIF!$C$3:$R$38,12,FALSE))","v":""},{"$f":"IF($B161=\"\",\"\",VLOOKUP($B161:$B161,QUALIF!$C$3:$R$38,13,FALSE))","v":""},{"$f":"IF($B161=\"\",\"\",VLOOKUP($B161:$B161,QUALIF!$C$3:$R$38,14,FALSE))","v":""},{"$f":"IF($B161=\"\",\"\",VLOOKUP($B161:$B161,QUALIF!$C$3:$R$38,15,FALSE))","v":""},{"$f":"IF($B161=\"\",\"\",VLOOKUP($B161:$B161,QUALIF!$C$3:$R$38,16,FALSE))","v":""}]
[null,null,null,null,null," ",{"$f":"IF($B162=\"\",\"\",VLOOKUP($B162:$B162,QUALIF!$C$3:$R$38,4,FALSE))","v":""},{"$f":"IF($B162=\"\",\"\",VLOOKUP($B162:$B162,QUALIF!$C$3:$R$38,5,FALSE))","v":""},{"$f":"IF($B162=\"\",\"\",VLOOKUP($B162:$B162,QUALIF!$C$3:$R$38,6,FALSE))","v":""},{"$f":"IF($B162=\"\",\"\",VLOOKUP($B162:$B162,QUALIF!$C$3:$R$38,7,FALSE))","v":""},{"$f":"IF($B162=\"\",\"\",VLOOKUP($B162:$B162,QUALIF!$C$3:$R$38,8,FALSE))","v":""},{"$f":"IF($B162=\"\",\"\",VLOOKUP($B162:$B162,QUALIF!$C$3:$R$38,9,FALSE))","v":""},{"$f":"IF($B162=\"\",\"\",VLOOKUP($B162:$B162,QUALIF!$C$3:$R$38,10,FALSE))","v":""},{"$f":"IF($B162=\"\",\"\",VLOOKUP($B162:$B162,QUALIF!$C$3:$R$38,11,FALSE))","v":""},{"$f":"IF($B162=\"\",\"\",VLOOKUP($B162:$B162,QUALIF!$C$3:$R$38,12,FALSE))","v":""},{"$f":"IF($B162=\"\",\"\",VLOOKUP($B162:$B162,QUALIF!$C$3:$R$38,13,FALSE))","v":""},{"$f":"IF($B162=\"\",\"\",VLOOKUP($B162:$B162,QUALIF!$C$3:$R$38,14,FALSE))","v":""},{"$f":"IF($B162=\"\",\"\",VLOOKUP($B162:$B162,QUALIF!$C$3:$R$38,15,FALSE))","v":""},{"$f":"IF($B162=\"\",\"\",VLOOKUP($B162:$B162,QUALIF!$C$3:$R$38,16,FALSE))","v":""}]
[null,null,null,null,null," ",{"$f":"IF($B163=\"\",\"\",VLOOKUP($B163:$B163,QUALIF!$C$3:$R$38,4,FALSE))","v":""},{"$f":"IF($B163=\"\",\"\",VLOOKUP($B163:$B163,QUALIF!$C$3:$R$38,5,FALSE))","v":""},{"$f":"IF($B163=\"\",\"\",VLOOKUP($B163:$B163,QUALIF!$C$3:$R$38,6,FALSE))","v":""},{"$f":"IF($B163=\"\",\"\",VLOOKUP($B163:$B163,QUALIF!$C$3:$R$38,7,FALSE))","v":""},{"$f":"IF($B163=\"\",\"\",VLOOKUP($B163:$B163,QUALIF!$C$3:$R$38,8,FALSE))","v":""},{"$f":"IF($B163=\"\",\"\",VLOOKUP($B163:$B163,QUALIF!$C$3:$R$38,9,FALSE))","v":""},{"$f":"IF($B163=\"\",\"\",VLOOKUP($B163:$B163,QUALIF!$C$3:$R$38,10,FALSE))","v":""},{"$f":"IF($B163=\"\",\"\",VLOOKUP($B163:$B163,QUALIF!$C$3:$R$38,11,FALSE))","v":""},{"$f":"IF($B163=\"\",\"\",VLOOKUP($B163:$B163,QUALIF!$C$3:$R$38,12,FALSE))","v":""},{"$f":"IF($B163=\"\",\"\",VLOOKUP($B163:$B163,QUALIF!$C$3:$R$38,13,FALSE))","v":""},{"$f":"IF($B163=\"\",\"\",VLOOKUP($B163:$B163,QUALIF!$C$3:$R$38,14,FALSE))","v":""},{"$f":"IF($B163=\"\",\"\",VLOOKUP($B163:$B163,QUALIF!$C$3:$R$38,15,FALSE))","v":""},{"$f":"IF($B163=\"\",\"\",VLOOKUP($B163:$B163,QUALIF!$C$3:$R$38,16,FALSE))","v":""}]
[null,null,null,null,null," ",{"$f":"IF($B164=\"\",\"\",VLOOKUP($B164:$B164,QUALIF!$C$3:$R$38,4,FALSE))","v":""},{"$f":"IF($B164=\"\",\"\",VLOOKUP($B164:$B164,QUALIF!$C$3:$R$38,5,FALSE))","v":""},{"$f":"IF($B164=\"\",\"\",VLOOKUP($B164:$B164,QUALIF!$C$3:$R$38,6,FALSE))","v":""},{"$f":"IF($B164=\"\",\"\",VLOOKUP($B164:$B164,QUALIF!$C$3:$R$38,7,FALSE))","v":""},{"$f":"IF($B164=\"\",\"\",VLOOKUP($B164:$B164,QUALIF!$C$3:$R$38,8,FALSE))","v":""},{"$f":"IF($B164=\"\",\"\",VLOOKUP($B164:$B164,QUALIF!$C$3:$R$38,9,FALSE))","v":""},{"$f":"IF($B164=\"\",\"\",VLOOKUP($B164:$B164,QUALIF!$C$3:$R$38,10,FALSE))","v":""},{"$f":"IF($B164=\"\",\"\",VLOOKUP($B164:$B164,QUALIF!$C$3:$R$38,11,FALSE))","v":""},{"$f":"IF($B164=\"\",\"\",VLOOKUP($B164:$B164,QUALIF!$C$3:$R$38,12,FALSE))","v":""},{"$f":"IF($B164=\"\",\"\",VLOOKUP($B164:$B164,QUALIF!$C$3:$R$38,13,FALSE))","v":""},{"$f":"IF($B164=\"\",\"\",VLOOKUP($B164:$B164,QUALIF!$C$3:$R$38,14,FALSE))","v":""},{"$f":"IF($B164=\"\",\"\",VLOOKUP($B164:$B164,QUALIF!$C$3:$R$38,15,FALSE))","v":""},{"$f":"IF($B164=\"\",\"\",VLOOKUP($B164:$B164,QUALIF!$C$3:$R$38,16,FALSE))","v":""}]
[null,null,null,null,null," ",{"$f":"IF($B165=\"\",\"\",VLOOKUP($B165:$B165,QUALIF!$C$3:$R$38,4,FALSE))","v":""},{"$f":"IF($B165=\"\",\"\",VLOOKUP($B165:$B165,QUALIF!$C$3:$R$38,5,FALSE))","v":""},{"$f":"IF($B165=\"\",\"\",VLOOKUP($B165:$B165,QUALIF!$C$3:$R$38,6,FALSE))","v":""},{"$f":"IF($B165=\"\",\"\",VLOOKUP($B165:$B165,QUALIF!$C$3:$R$38,7,FALSE))","v":""},{"$f":"IF($B165=\"\",\"\",VLOOKUP($B165:$B165,QUALIF!$C$3:$R$38,8,FALSE))","v":""},{"$f":"IF($B165=\"\",\"\",VLOOKUP($B165:$B165,QUALIF!$C$3:$R$38,9,FALSE))","v":""},{"$f":"IF($B165=\"\",\"\",VLOOKUP($B165:$B165,QUALIF!$C$3:$R$38,10,FALSE))","v":""},{"$f":"IF($B165=\"\",\"\",VLOOKUP($B165:$B165,QUALIF!$C$3:$R$38,11,FALSE))","v":""},{"$f":"IF($B165=\"\",\"\",VLOOKUP($B165:$B165,QUALIF!$C$3:$R$38,12,FALSE))","v":""},{"$f":"IF($B165=\"\",\"\",VLOOKUP($B165:$B165,QUALIF!$C$3:$R$38,13,FALSE))","v":""},{"$f":"IF($B165=\"\",\"\",VLOOKUP($B165:$B165,QUALIF!$C$3:$R$38,14,FALSE))","v":""},{"$f":"IF($B165=\"\",\"\",VLOOKUP($B165:$B165,QUALIF!$C$3:$R$38,15,FALSE))","v":""},{"$f":"IF($B165=\"\",\"\",VLOOKUP($B165:$B165,QUALIF!$C$3:$R$38,16,FALSE))","v":""}]
[null,null,null,null,null," ",{"$f":"IF($B166=\"\",\"\",VLOOKUP($B166:$B166,QUALIF!$C$3:$R$38,4,FALSE))","v":""},{"$f":"IF($B166=\"\",\"\",VLOOKUP($B166:$B166,QUALIF!$C$3:$R$38,5,FALSE))","v":""},{"$f":"IF($B166=\"\",\"\",VLOOKUP($B166:$B166,QUALIF!$C$3:$R$38,6,FALSE))","v":""},{"$f":"IF($B166=\"\",\"\",VLOOKUP($B166:$B166,QUALIF!$C$3:$R$38,7,FALSE))","v":""},{"$f":"IF($B166=\"\",\"\",VLOOKUP($B166:$B166,QUALIF!$C$3:$R$38,8,FALSE))","v":""},{"$f":"IF($B166=\"\",\"\",VLOOKUP($B166:$B166,QUALIF!$C$3:$R$38,9,FALSE))","v":""},{"$f":"IF($B166=\"\",\"\",VLOOKUP($B166:$B166,QUALIF!$C$3:$R$38,10,FALSE))","v":""},{"$f":"IF($B166=\"\",\"\",VLOOKUP($B166:$B166,QUALIF!$C$3:$R$38,11,FALSE))","v":""},{"$f":"IF($B166=\"\",\"\",VLOOKUP($B166:$B166,QUALIF!$C$3:$R$38,12,FALSE))","v":""},{"$f":"IF($B166=\"\",\"\",VLOOKUP($B166:$B166,QUALIF!$C$3:$R$38,13,FALSE))","v":""},{"$f":"IF($B166=\"\",\"\",VLOOKUP($B166:$B166,QUALIF!$C$3:$R$38,14,FALSE))","v":""},{"$f":"IF($B166=\"\",\"\",VLOOKUP($B166:$B166,QUALIF!$C$3:$R$38,15,FALSE))","v":""},{"$f":"IF($B166=\"\",\"\",VLOOKUP($B166:$B166,QUALIF!$C$3:$R$38,16,FALSE))","v":""}]
[null,null,null,null,null," ",{"$f":"IF($B167=\"\",\"\",VLOOKUP($B167:$B167,QUALIF!$C$3:$R$38,4,FALSE))","v":""},{"$f":"IF($B167=\"\",\"\",VLOOKUP($B167:$B167,QUALIF!$C$3:$R$38,5,FALSE))","v":""},{"$f":"IF($B167=\"\",\"\",VLOOKUP($B167:$B167,QUALIF!$C$3:$R$38,6,FALSE))","v":""},{"$f":"IF($B167=\"\",\"\",VLOOKUP($B167:$B167,QUALIF!$C$3:$R$38,7,FALSE))","v":""},{"$f":"IF($B167=\"\",\"\",VLOOKUP($B167:$B167,QUALIF!$C$3:$R$38,8,FALSE))","v":""},{"$f":"IF($B167=\"\",\"\",VLOOKUP($B167:$B167,QUALIF!$C$3:$R$38,9,FALSE))","v":""},{"$f":"IF($B167=\"\",\"\",VLOOKUP($B167:$B167,QUALIF!$C$3:$R$38,10,FALSE))","v":""},{"$f":"IF($B167=\"\",\"\",VLOOKUP($B167:$B167,QUALIF!$C$3:$R$38,11,FALSE))","v":""},{"$f":"IF($B167=\"\",\"\",VLOOKUP($B167:$B167,QUALIF!$C$3:$R$38,12,FALSE))","v":""},{"$f":"IF($B167=\"\",\"\",VLOOKUP($B167:$B167,QUALIF!$C$3:$R$38,13,FALSE))","v":""},{"$f":"IF($B167=\"\",\"\",VLOOKUP($B167:$B167,QUALIF!$C$3:$R$38,14,FALSE))","v":""},{"$f":"IF($B167=\"\",\"\",VLOOKUP($B167:$B167,QUALIF!$C$3:$R$38,15,FALSE))","v":""},{"$f":"IF($B167=\"\",\"\",VLOOKUP($B167:$B167,QUALIF!$C$3:$R$38,16,FALSE))","v":""}]
[null,null,null,null,null," ",{"$f":"IF($B168=\"\",\"\",VLOOKUP($B168:$B168,QUALIF!$C$3:$R$38,4,FALSE))","v":""},{"$f":"IF($B168=\"\",\"\",VLOOKUP($B168:$B168,QUALIF!$C$3:$R$38,5,FALSE))","v":""},{"$f":"IF($B168=\"\",\"\",VLOOKUP($B168:$B168,QUALIF!$C$3:$R$38,6,FALSE))","v":""},{"$f":"IF($B168=\"\",\"\",VLOOKUP($B168:$B168,QUALIF!$C$3:$R$38,7,FALSE))","v":""},{"$f":"IF($B168=\"\",\"\",VLOOKUP($B168:$B168,QUALIF!$C$3:$R$38,8,FALSE))","v":""},{"$f":"IF($B168=\"\",\"\",VLOOKUP($B168:$B168,QUALIF!$C$3:$R$38,9,FALSE))","v":""},{"$f":"IF($B168=\"\",\"\",VLOOKUP($B168:$B168,QUALIF!$C$3:$R$38,10,FALSE))","v":""},{"$f":"IF($B168=\"\",\"\",VLOOKUP($B168:$B168,QUALIF!$C$3:$R$38,11,FALSE))","v":""},{"$f":"IF($B168=\"\",\"\",VLOOKUP($B168:$B168,QUALIF!$C$3:$R$38,12,FALSE))","v":""},{"$f":"IF($B168=\"\",\"\",VLOOKUP($B168:$B168,QUALIF!$C$3:$R$38,13,FALSE))","v":""},{"$f":"IF($B168=\"\",\"\",VLOOKUP($B168:$B168,QUALIF!$C$3:$R$38,14,FALSE))","v":""},{"$f":"IF($B168=\"\",\"\",VLOOKUP($B168:$B168,QUALIF!$C$3:$R$38,15,FALSE))","v":""},{"$f":"IF($B168=\"\",\"\",VLOOKUP($B168:$B168,QUALIF!$C$3:$R$38,16,FALSE))","v":""}]
[null,null,null,null,null," ",{"$f":"IF($B169=\"\",\"\",VLOOKUP($B169:$B169,QUALIF!$C$3:$R$38,4,FALSE))","v":""},{"$f":"IF($B169=\"\",\"\",VLOOKUP($B169:$B169,QUALIF!$C$3:$R$38,5,FALSE))","v":""},{"$f":"IF($B169=\"\",\"\",VLOOKUP($B169:$B169,QUALIF!$C$3:$R$38,6,FALSE))","v":""},{"$f":"IF($B169=\"\",\"\",VLOOKUP($B169:$B169,QUALIF!$C$3:$R$38,7,FALSE))","v":""},{"$f":"IF($B169=\"\",\"\",VLOOKUP($B169:$B169,QUALIF!$C$3:$R$38,8,FALSE))","v":""},{"$f":"IF($B169=\"\",\"\",VLOOKUP($B169:$B169,QUALIF!$C$3:$R$38,9,FALSE))","v":""},{"$f":"IF($B169=\"\",\"\",VLOOKUP($B169:$B169,QUALIF!$C$3:$R$38,10,FALSE))","v":""},{"$f":"IF($B169=\"\",\"\",VLOOKUP($B169:$B169,QUALIF!$C$3:$R$38,11,FALSE))","v":""},{"$f":"IF($B169=\"\",\"\",VLOOKUP($B169:$B169,QUALIF!$C$3:$R$38,12,FALSE))","v":""},{"$f":"IF($B169=\"\",\"\",VLOOKUP($B169:$B169,QUALIF!$C$3:$R$38,13,FALSE))","v":""},{"$f":"IF($B169=\"\",\"\",VLOOKUP($B169:$B169,QUALIF!$C$3:$R$38,14,FALSE))","v":""},{"$f":"IF($B169=\"\",\"\",VLOOKUP($B169:$B169,QUALIF!$C$3:$R$38,15,FALSE))","v":""},{"$f":"IF($B169=\"\",\"\",VLOOKUP($B169:$B169,QUALIF!$C$3:$R$38,16,FALSE))","v":""}]
[null,null,null,null,null," ",{"$f":"IF($B170=\"\",\"\",VLOOKUP($B170:$B170,QUALIF!$C$3:$R$38,4,FALSE))","v":""},{"$f":"IF($B170=\"\",\"\",VLOOKUP($B170:$B170,QUALIF!$C$3:$R$38,5,FALSE))","v":""},{"$f":"IF($B170=\"\",\"\",VLOOKUP($B170:$B170,QUALIF!$C$3:$R$38,6,FALSE))","v":""},{"$f":"IF($B170=\"\",\"\",VLOOKUP($B170:$B170,QUALIF!$C$3:$R$38,7,FALSE))","v":""},{"$f":"IF($B170=\"\",\"\",VLOOKUP($B170:$B170,QUALIF!$C$3:$R$38,8,FALSE))","v":""},{"$f":"IF($B170=\"\",\"\",VLOOKUP($B170:$B170,QUALIF!$C$3:$R$38,9,FALSE))","v":""},{"$f":"IF($B170=\"\",\"\",VLOOKUP($B170:$B170,QUALIF!$C$3:$R$38,10,FALSE))","v":""},{"$f":"IF($B170=\"\",\"\",VLOOKUP($B170:$B170,QUALIF!$C$3:$R$38,11,FALSE))","v":""},{"$f":"IF($B170=\"\",\"\",VLOOKUP($B170:$B170,QUALIF!$C$3:$R$38,12,FALSE))","v":""},{"$f":"IF($B170=\"\",\"\",VLOOKUP($B170:$B170,QUALIF!$C$3:$R$38,13,FALSE))","v":""},{"$f":"IF($B170=\"\",\"\",VLOOKUP($B170:$B170,QUALIF!$C$3:$R$38,14,FALSE))","v":""},{"$f":"IF($B170=\"\",\"\",VLOOKUP($B170:$B170,QUALIF!$C$3:$R$38,15,FALSE))","v":""},{"$f":"IF($B170=\"\",\"\",VLOOKUP($B170:$B170,QUALIF!$C$3:$R$38,16,FALSE))","v":""}]
[null,null,null,null,null," ",{"$f":"IF($B171=\"\",\"\",VLOOKUP($B171:$B171,QUALIF!$C$3:$R$38,4,FALSE))","v":""},{"$f":"IF($B171=\"\",\"\",VLOOKUP($B171:$B171,QUALIF!$C$3:$R$38,5,FALSE))","v":""},{"$f":"IF($B171=\"\",\"\",VLOOKUP($B171:$B171,QUALIF!$C$3:$R$38,6,FALSE))","v":""},{"$f":"IF($B171=\"\",\"\",VLOOKUP($B171:$B171,QUALIF!$C$3:$R$38,7,FALSE))","v":""},{"$f":"IF($B171=\"\",\"\",VLOOKUP($B171:$B171,QUALIF!$C$3:$R$38,8,FALSE))","v":""},{"$f":"IF($B171=\"\",\"\",VLOOKUP($B171:$B171,QUALIF!$C$3:$R$38,9,FALSE))","v":""},{"$f":"IF($B171=\"\",\"\",VLOOKUP($B171:$B171,QUALIF!$C$3:$R$38,10,FALSE))","v":""},{"$f":"IF($B171=\"\",\"\",VLOOKUP($B171:$B171,QUALIF!$C$3:$R$38,11,FALSE))","v":""},{"$f":"IF($B171=\"\",\"\",VLOOKUP($B171:$B171,QUALIF!$C$3:$R$38,12,FALSE))","v":""},{"$f":"IF($B171=\"\",\"\",VLOOKUP($B171:$B171,QUALIF!$C$3:$R$38,13,FALSE))","v":""},{"$f":"IF($B171=\"\",\"\",VLOOKUP($B171:$B171,QUALIF!$C$3:$R$38,14,FALSE))","v":""},{"$f":"IF($B171=\"\",\"\",VLOOKUP($B171:$B171,QUALIF!$C$3:$R$38,15,FALSE))","v":""},{"$f":"IF($B171=\"\",\"\",VLOOKUP($B171:$B171,QUALIF!$C$3:$R$38,16,FALSE))","v":""}]
[null,null,null,null,null," ",{"$f":"IF($B172=\"\",\"\",VLOOKUP($B172:$B172,QUALIF!$C$3:$R$38,4,FALSE))","v":""},{"$f":"IF($B172=\"\",\"\",VLOOKUP($B172:$B172,QUALIF!$C$3:$R$38,5,FALSE))","v":""},{"$f":"IF($B172=\"\",\"\",VLOOKUP($B172:$B172,QUALIF!$C$3:$R$38,6,FALSE))","v":""},{"$f":"IF($B172=\"\",\"\",VLOOKUP($B172:$B172,QUALIF!$C$3:$R$38,7,FALSE))","v":""},{"$f":"IF($B172=\"\",\"\",VLOOKUP($B172:$B172,QUALIF!$C$3:$R$38,8,FALSE))","v":""},{"$f":"IF($B172=\"\",\"\",VLOOKUP($B172:$B172,QUALIF!$C$3:$R$38,9,FALSE))","v":""},{"$f":"IF($B172=\"\",\"\",VLOOKUP($B172:$B172,QUALIF!$C$3:$R$38,10,FALSE))","v":""},{"$f":"IF($B172=\"\",\"\",VLOOKUP($B172:$B172,QUALIF!$C$3:$R$38,11,FALSE))","v":""},{"$f":"IF($B172=\"\",\"\",VLOOKUP($B172:$B172,QUALIF!$C$3:$R$38,12,FALSE))","v":""},{"$f":"IF($B172=\"\",\"\",VLOOKUP($B172:$B172,QUALIF!$C$3:$R$38,13,FALSE))","v":""},{"$f":"IF($B172=\"\",\"\",VLOOKUP($B172:$B172,QUALIF!$C$3:$R$38,14,FALSE))","v":""},{"$f":"IF($B172=\"\",\"\",VLOOKUP($B172:$B172,QUALIF!$C$3:$R$38,15,FALSE))","v":""},{"$f":"IF($B172=\"\",\"\",VLOOKUP($B172:$B172,QUALIF!$C$3:$R$38,16,FALSE))","v":""}]
[null,null,null,null,null," ",{"$f":"IF($B173=\"\",\"\",VLOOKUP($B173:$B173,QUALIF!$C$3:$R$38,4,FALSE))","v":""},{"$f":"IF($B173=\"\",\"\",VLOOKUP($B173:$B173,QUALIF!$C$3:$R$38,5,FALSE))","v":""},{"$f":"IF($B173=\"\",\"\",VLOOKUP($B173:$B173,QUALIF!$C$3:$R$38,6,FALSE))","v":""},{"$f":"IF($B173=\"\",\"\",VLOOKUP($B173:$B173,QUALIF!$C$3:$R$38,7,FALSE))","v":""},{"$f":"IF($B173=\"\",\"\",VLOOKUP($B173:$B173,QUALIF!$C$3:$R$38,8,FALSE))","v":""},{"$f":"IF($B173=\"\",\"\",VLOOKUP($B173:$B173,QUALIF!$C$3:$R$38,9,FALSE))","v":""},{"$f":"IF($B173=\"\",\"\",VLOOKUP($B173:$B173,QUALIF!$C$3:$R$38,10,FALSE))","v":""},{"$f":"IF($B173=\"\",\"\",VLOOKUP($B173:$B173,QUALIF!$C$3:$R$38,11,FALSE))","v":""},{"$f":"IF($B173=\"\",\"\",VLOOKUP($B173:$B173,QUALIF!$C$3:$R$38,12,FALSE))","v":""},{"$f":"IF($B173=\"\",\"\",VLOOKUP($B173:$B173,QUALIF!$C$3:$R$38,13,FALSE))","v":""},{"$f":"IF($B173=\"\",\"\",VLOOKUP($B173:$B173,QUALIF!$C$3:$R$38,14,FALSE))","v":""},{"$f":"IF($B173=\"\",\"\",VLOOKUP($B173:$B173,QUALIF!$C$3:$R$38,15,FALSE))","v":""},{"$f":"IF($B173=\"\",\"\",VLOOKUP($B173:$B173,QUALIF!$C$3:$R$38,16,FALSE))","v":""}]
[null,null,null,null,null," ",{"$f":"IF($B174=\"\",\"\",VLOOKUP($B174:$B174,QUALIF!$C$3:$R$38,4,FALSE))","v":""},{"$f":"IF($B174=\"\",\"\",VLOOKUP($B174:$B174,QUALIF!$C$3:$R$38,5,FALSE))","v":""},{"$f":"IF($B174=\"\",\"\",VLOOKUP($B174:$B174,QUALIF!$C$3:$R$38,6,FALSE))","v":""},{"$f":"IF($B174=\"\",\"\",VLOOKUP($B174:$B174,QUALIF!$C$3:$R$38,7,FALSE))","v":""},{"$f":"IF($B174=\"\",\"\",VLOOKUP($B174:$B174,QUALIF!$C$3:$R$38,8,FALSE))","v":""},{"$f":"IF($B174=\"\",\"\",VLOOKUP($B174:$B174,QUALIF!$C$3:$R$38,9,FALSE))","v":""},{"$f":"IF($B174=\"\",\"\",VLOOKUP($B174:$B174,QUALIF!$C$3:$R$38,10,FALSE))","v":""},{"$f":"IF($B174=\"\",\"\",VLOOKUP($B174:$B174,QUALIF!$C$3:$R$38,11,FALSE))","v":""},{"$f":"IF($B174=\"\",\"\",VLOOKUP($B174:$B174,QUALIF!$C$3:$R$38,12,FALSE))","v":""},{"$f":"IF($B174=\"\",\"\",VLOOKUP($B174:$B174,QUALIF!$C$3:$R$38,13,FALSE))","v":""},{"$f":"IF($B174=\"\",\"\",VLOOKUP($B174:$B174,QUALIF!$C$3:$R$38,14,FALSE))","v":""},{"$f":"IF($B174=\"\",\"\",VLOOKUP($B174:$B174,QUALIF!$C$3:$R$38,15,FALSE))","v":""},{"$f":"IF($B174=\"\",\"\",VLOOKUP($B174:$B174,QUALIF!$C$3:$R$38,16,FALSE))","v":""}]
[null,null,null,null,null," ",{"$f":"IF($B175=\"\",\"\",VLOOKUP($B175:$B175,QUALIF!$C$3:$R$38,4,FALSE))","v":""},{"$f":"IF($B175=\"\",\"\",VLOOKUP($B175:$B175,QUALIF!$C$3:$R$38,5,FALSE))","v":""},{"$f":"IF($B175=\"\",\"\",VLOOKUP($B175:$B175,QUALIF!$C$3:$R$38,6,FALSE))","v":""},{"$f":"IF($B175=\"\",\"\",VLOOKUP($B175:$B175,QUALIF!$C$3:$R$38,7,FALSE))","v":""},{"$f":"IF($B175=\"\",\"\",VLOOKUP($B175:$B175,QUALIF!$C$3:$R$38,8,FALSE))","v":""},{"$f":"IF($B175=\"\",\"\",VLOOKUP($B175:$B175,QUALIF!$C$3:$R$38,9,FALSE))","v":""},{"$f":"IF($B175=\"\",\"\",VLOOKUP($B175:$B175,QUALIF!$C$3:$R$38,10,FALSE))","v":""},{"$f":"IF($B175=\"\",\"\",VLOOKUP($B175:$B175,QUALIF!$C$3:$R$38,11,FALSE))","v":""},{"$f":"IF($B175=\"\",\"\",VLOOKUP($B175:$B175,QUALIF!$C$3:$R$38,12,FALSE))","v":""},{"$f":"IF($B175=\"\",\"\",VLOOKUP($B175:$B175,QUALIF!$C$3:$R$38,13,FALSE))","v":""},{"$f":"IF($B175=\"\",\"\",VLOOKUP($B175:$B175,QUALIF!$C$3:$R$38,14,FALSE))","v":""},{"$f":"IF($B175=\"\",\"\",VLOOKUP($B175:$B175,QUALIF!$C$3:$R$38,15,FALSE))","v":""},{"$f":"IF($B175=\"\",\"\",VLOOKUP($B175:$B175,QUALIF!$C$3:$R$38,16,FALSE))","v":""}]
[null,null,null,null,null," ",{"$f":"IF($B176=\"\",\"\",VLOOKUP($B176:$B176,QUALIF!$C$3:$R$38,4,FALSE))","v":""},{"$f":"IF($B176=\"\",\"\",VLOOKUP($B176:$B176,QUALIF!$C$3:$R$38,5,FALSE))","v":""},{"$f":"IF($B176=\"\",\"\",VLOOKUP($B176:$B176,QUALIF!$C$3:$R$38,6,FALSE))","v":""},{"$f":"IF($B176=\"\",\"\",VLOOKUP($B176:$B176,QUALIF!$C$3:$R$38,7,FALSE))","v":""},{"$f":"IF($B176=\"\",\"\",VLOOKUP($B176:$B176,QUALIF!$C$3:$R$38,8,FALSE))","v":""},{"$f":"IF($B176=\"\",\"\",VLOOKUP($B176:$B176,QUALIF!$C$3:$R$38,9,FALSE))","v":""},{"$f":"IF($B176=\"\",\"\",VLOOKUP($B176:$B176,QUALIF!$C$3:$R$38,10,FALSE))","v":""},{"$f":"IF($B176=\"\",\"\",VLOOKUP($B176:$B176,QUALIF!$C$3:$R$38,11,FALSE))","v":""},{"$f":"IF($B176=\"\",\"\",VLOOKUP($B176:$B176,QUALIF!$C$3:$R$38,12,FALSE))","v":""},{"$f":"IF($B176=\"\",\"\",VLOOKUP($B176:$B176,QUALIF!$C$3:$R$38,13,FALSE))","v":""},{"$f":"IF($B176=\"\",\"\",VLOOKUP($B176:$B176,QUALIF!$C$3:$R$38,14,FALSE))","v":""},{"$f":"IF($B176=\"\",\"\",VLOOKUP($B176:$B176,QUALIF!$C$3:$R$38,15,FALSE))","v":""},{"$f":"IF($B176=\"\",\"\",VLOOKUP($B176:$B176,QUALIF!$C$3:$R$38,16,FALSE))","v":""}]
[null,null,null,null,null," ",{"$f":"IF($B177=\"\",\"\",VLOOKUP($B177:$B177,QUALIF!$C$3:$R$38,4,FALSE))","v":""},{"$f":"IF($B177=\"\",\"\",VLOOKUP($B177:$B177,QUALIF!$C$3:$R$38,5,FALSE))","v":""},{"$f":"IF($B177=\"\",\"\",VLOOKUP($B177:$B177,QUALIF!$C$3:$R$38,6,FALSE))","v":""},{"$f":"IF($B177=\"\",\"\",VLOOKUP($B177:$B177,QUALIF!$C$3:$R$38,7,FALSE))","v":""},{"$f":"IF($B177=\"\",\"\",VLOOKUP($B177:$B177,QUALIF!$C$3:$R$38,8,FALSE))","v":""},{"$f":"IF($B177=\"\",\"\",VLOOKUP($B177:$B177,QUALIF!$C$3:$R$38,9,FALSE))","v":""},{"$f":"IF($B177=\"\",\"\",VLOOKUP($B177:$B177,QUALIF!$C$3:$R$38,10,FALSE))","v":""},{"$f":"IF($B177=\"\",\"\",VLOOKUP($B177:$B177,QUALIF!$C$3:$R$38,11,FALSE))","v":""},{"$f":"IF($B177=\"\",\"\",VLOOKUP($B177:$B177,QUALIF!$C$3:$R$38,12,FALSE))","v":""},{"$f":"IF($B177=\"\",\"\",VLOOKUP($B177:$B177,QUALIF!$C$3:$R$38,13,FALSE))","v":""},{"$f":"IF($B177=\"\",\"\",VLOOKUP($B177:$B177,QUALIF!$C$3:$R$38,14,FALSE))","v":""},{"$f":"IF($B177=\"\",\"\",VLOOKUP($B177:$B177,QUALIF!$C$3:$R$38,15,FALSE))","v":""},{"$f":"IF($B177=\"\",\"\",VLOOKUP($B177:$B177,QUALIF!$C$3:$R$38,16,FALSE))","v":""}]
[null,null,null,null,null," ",{"$f":"IF($B178=\"\",\"\",VLOOKUP($B178:$B178,QUALIF!$C$3:$R$38,4,FALSE))","v":""},{"$f":"IF($B178=\"\",\"\",VLOOKUP($B178:$B178,QUALIF!$C$3:$R$38,5,FALSE))","v":""},{"$f":"IF($B178=\"\",\"\",VLOOKUP($B178:$B178,QUALIF!$C$3:$R$38,6,FALSE))","v":""},{"$f":"IF($B178=\"\",\"\",VLOOKUP($B178:$B178,QUALIF!$C$3:$R$38,7,FALSE))","v":""},{"$f":"IF($B178=\"\",\"\",VLOOKUP($B178:$B178,QUALIF!$C$3:$R$38,8,FALSE))","v":""},{"$f":"IF($B178=\"\",\"\",VLOOKUP($B178:$B178,QUALIF!$C$3:$R$38,9,FALSE))","v":""},{"$f":"IF($B178=\"\",\"\",VLOOKUP($B178:$B178,QUALIF!$C$3:$R$38,10,FALSE))","v":""},{"$f":"IF($B178=\"\",\"\",VLOOKUP($B178:$B178,QUALIF!$C$3:$R$38,11,FALSE))","v":""},{"$f":"IF($B178=\"\",\"\",VLOOKUP($B178:$B178,QUALIF!$C$3:$R$38,12,FALSE))","v":""},{"$f":"IF($B178=\"\",\"\",VLOOKUP($B178:$B178,QUALIF!$C$3:$R$38,13,FALSE))","v":""},{"$f":"IF($B178=\"\",\"\",VLOOKUP($B178:$B178,QUALIF!$C$3:$R$38,14,FALSE))","v":""},{"$f":"IF($B178=\"\",\"\",VLOOKUP($B178:$B178,QUALIF!$C$3:$R$38,15,FALSE))","v":""},{"$f":"IF($B178=\"\",\"\",VLOOKUP($B178:$B178,QUALIF!$C$3:$R$38,16,FALSE))","v":""}]
[null,null,null,null,null," ",{"$f":"IF($B179=\"\",\"\",VLOOKUP($B179:$B179,QUALIF!$C$3:$R$38,4,FALSE))","v":""},{"$f":"IF($B179=\"\",\"\",VLOOKUP($B179:$B179,QUALIF!$C$3:$R$38,5,FALSE))","v":""},{"$f":"IF($B179=\"\",\"\",VLOOKUP($B179:$B179,QUALIF!$C$3:$R$38,6,FALSE))","v":""},{"$f":"IF($B179=\"\",\"\",VLOOKUP($B179:$B179,QUALIF!$C$3:$R$38,7,FALSE))","v":""},{"$f":"IF($B179=\"\",\"\",VLOOKUP($B179:$B179,QUALIF!$C$3:$R$38,8,FALSE))","v":""},{"$f":"IF($B179=\"\",\"\",VLOOKUP($B179:$B179,QUALIF!$C$3:$R$38,9,FALSE))","v":""},{"$f":"IF($B179=\"\",\"\",VLOOKUP($B179:$B179,QUALIF!$C$3:$R$38,10,FALSE))","v":""},{"$f":"IF($B179=\"\",\"\",VLOOKUP($B179:$B179,QUALIF!$C$3:$R$38,11,FALSE))","v":""},{"$f":"IF($B179=\"\",\"\",VLOOKUP($B179:$B179,QUALIF!$C$3:$R$38,12,FALSE))","v":""},{"$f":"IF($B179=\"\",\"\",VLOOKUP($B179:$B179,QUALIF!$C$3:$R$38,13,FALSE))","v":""},{"$f":"IF($B179=\"\",\"\",VLOOKUP($B179:$B179,QUALIF!$C$3:$R$38,14,FALSE))","v":""},{"$f":"IF($B179=\"\",\"\",VLOOKUP($B179:$B179,QUALIF!$C$3:$R$38,15,FALSE))","v":""},{"$f":"IF($B179=\"\",\"\",VLOOKUP($B179:$B179,QUALIF!$C$3:$R$38,16,FALSE))","v":""}]
[null,null,null,null,null," ",{"$f":"IF($B180=\"\",\"\",VLOOKUP($B180:$B180,QUALIF!$C$3:$R$38,4,FALSE))","v":""},{"$f":"IF($B180=\"\",\"\",VLOOKUP($B180:$B180,QUALIF!$C$3:$R$38,5,FALSE))","v":""},{"$f":"IF($B180=\"\",\"\",VLOOKUP($B180:$B180,QUALIF!$C$3:$R$38,6,FALSE))","v":""},{"$f":"IF($B180=\"\",\"\",VLOOKUP($B180:$B180,QUALIF!$C$3:$R$38,7,FALSE))","v":""},{"$f":"IF($B180=\"\",\"\",VLOOKUP($B180:$B180,QUALIF!$C$3:$R$38,8,FALSE))","v":""},{"$f":"IF($B180=\"\",\"\",VLOOKUP($B180:$B180,QUALIF!$C$3:$R$38,9,FALSE))","v":""},{"$f":"IF($B180=\"\",\"\",VLOOKUP($B180:$B180,QUALIF!$C$3:$R$38,10,FALSE))","v":""},{"$f":"IF($B180=\"\",\"\",VLOOKUP($B180:$B180,QUALIF!$C$3:$R$38,11,FALSE))","v":""},{"$f":"IF($B180=\"\",\"\",VLOOKUP($B180:$B180,QUALIF!$C$3:$R$38,12,FALSE))","v":""},{"$f":"IF($B180=\"\",\"\",VLOOKUP($B180:$B180,QUALIF!$C$3:$R$38,13,FALSE))","v":""},{"$f":"IF($B180=\"\",\"\",VLOOKUP($B180:$B180,QUALIF!$C$3:$R$38,14,FALSE))","v":""},{"$f":"IF($B180=\"\",\"\",VLOOKUP($B180:$B180,QUALIF!$C$3:$R$38,15,FALSE))","v":""},{"$f":"IF($B180=\"\",\"\",VLOOKUP($B180:$B180,QUALIF!$C$3:$R$38,16,FALSE))","v":""}]
[null,null,null,null,null," ",{"$f":"IF($B181=\"\",\"\",VLOOKUP($B181:$B181,QUALIF!$C$3:$R$38,4,FALSE))","v":""},{"$f":"IF($B181=\"\",\"\",VLOOKUP($B181:$B181,QUALIF!$C$3:$R$38,5,FALSE))","v":""},{"$f":"IF($B181=\"\",\"\",VLOOKUP($B181:$B181,QUALIF!$C$3:$R$38,6,FALSE))","v":""},{"$f":"IF($B181=\"\",\"\",VLOOKUP($B181:$B181,QUALIF!$C$3:$R$38,7,FALSE))","v":""},{"$f":"IF($B181=\"\",\"\",VLOOKUP($B181:$B181,QUALIF!$C$3:$R$38,8,FALSE))","v":""},{"$f":"IF($B181=\"\",\"\",VLOOKUP($B181:$B181,QUALIF!$C$3:$R$38,9,FALSE))","v":""},{"$f":"IF($B181=\"\",\"\",VLOOKUP($B181:$B181,QUALIF!$C$3:$R$38,10,FALSE))","v":""},{"$f":"IF($B181=\"\",\"\",VLOOKUP($B181:$B181,QUALIF!$C$3:$R$38,11,FALSE))","v":""},{"$f":"IF($B181=\"\",\"\",VLOOKUP($B181:$B181,QUALIF!$C$3:$R$38,12,FALSE))","v":""},{"$f":"IF($B181=\"\",\"\",VLOOKUP($B181:$B181,QUALIF!$C$3:$R$38,13,FALSE))","v":""},{"$f":"IF($B181=\"\",\"\",VLOOKUP($B181:$B181,QUALIF!$C$3:$R$38,14,FALSE))","v":""},{"$f":"IF($B181=\"\",\"\",VLOOKUP($B181:$B181,QUALIF!$C$3:$R$38,15,FALSE))","v":""},{"$f":"IF($B181=\"\",\"\",VLOOKUP($B181:$B181,QUALIF!$C$3:$R$38,16,FALSE))","v":""}]
[null,null,null,null,null," ",{"$f":"IF($B182=\"\",\"\",VLOOKUP($B182:$B182,QUALIF!$C$3:$R$38,4,FALSE))","v":""},{"$f":"IF($B182=\"\",\"\",VLOOKUP($B182:$B182,QUALIF!$C$3:$R$38,5,FALSE))","v":""},{"$f":"IF($B182=\"\",\"\",VLOOKUP($B182:$B182,QUALIF!$C$3:$R$38,6,FALSE))","v":""},{"$f":"IF($B182=\"\",\"\",VLOOKUP($B182:$B182,QUALIF!$C$3:$R$38,7,FALSE))","v":""},{"$f":"IF($B182=\"\",\"\",VLOOKUP($B182:$B182,QUALIF!$C$3:$R$38,8,FALSE))","v":""},{"$f":"IF($B182=\"\",\"\",VLOOKUP($B182:$B182,QUALIF!$C$3:$R$38,9,FALSE))","v":""},{"$f":"IF($B182=\"\",\"\",VLOOKUP($B182:$B182,QUALIF!$C$3:$R$38,10,FALSE))","v":""},{"$f":"IF($B182=\"\",\"\",VLOOKUP($B182:$B182,QUALIF!$C$3:$R$38,11,FALSE))","v":""},{"$f":"IF($B182=\"\",\"\",VLOOKUP($B182:$B182,QUALIF!$C$3:$R$38,12,FALSE))","v":""},{"$f":"IF($B182=\"\",\"\",VLOOKUP($B182:$B182,QUALIF!$C$3:$R$38,13,FALSE))","v":""},{"$f":"IF($B182=\"\",\"\",VLOOKUP($B182:$B182,QUALIF!$C$3:$R$38,14,FALSE))","v":""},{"$f":"IF($B182=\"\",\"\",VLOOKUP($B182:$B182,QUALIF!$C$3:$R$38,15,FALSE))","v":""},{"$f":"IF($B182=\"\",\"\",VLOOKUP($B182:$B182,QUALIF!$C$3:$R$38,16,FALSE))","v":""}]
[null,null,null,null,null," ",{"$f":"IF($B183=\"\",\"\",VLOOKUP($B183:$B183,QUALIF!$C$3:$R$38,4,FALSE))","v":""},{"$f":"IF($B183=\"\",\"\",VLOOKUP($B183:$B183,QUALIF!$C$3:$R$38,5,FALSE))","v":""},{"$f":"IF($B183=\"\",\"\",VLOOKUP($B183:$B183,QUALIF!$C$3:$R$38,6,FALSE))","v":""},{"$f":"IF($B183=\"\",\"\",VLOOKUP($B183:$B183,QUALIF!$C$3:$R$38,7,FALSE))","v":""},{"$f":"IF($B183=\"\",\"\",VLOOKUP($B183:$B183,QUALIF!$C$3:$R$38,8,FALSE))","v":""},{"$f":"IF($B183=\"\",\"\",VLOOKUP($B183:$B183,QUALIF!$C$3:$R$38,9,FALSE))","v":""},{"$f":"IF($B183=\"\",\"\",VLOOKUP($B183:$B183,QUALIF!$C$3:$R$38,10,FALSE))","v":""},{"$f":"IF($B183=\"\",\"\",VLOOKUP($B183:$B183,QUALIF!$C$3:$R$38,11,FALSE))","v":""},{"$f":"IF($B183=\"\",\"\",VLOOKUP($B183:$B183,QUALIF!$C$3:$R$38,12,FALSE))","v":""},{"$f":"IF($B183=\"\",\"\",VLOOKUP($B183:$B183,QUALIF!$C$3:$R$38,13,FALSE))","v":""},{"$f":"IF($B183=\"\",\"\",VLOOKUP($B183:$B183,QUALIF!$C$3:$R$38,14,FALSE))","v":""},{"$f":"IF($B183=\"\",\"\",VLOOKUP($B183:$B183,QUALIF!$C$3:$R$38,15,FALSE))","v":""},{"$f":"IF($B183=\"\",\"\",VLOOKUP($B183:$B183,QUALIF!$C$3:$R$38,16,FALSE))","v":""}]
[null,null,null,null,null," ",{"$f":"IF($B184=\"\",\"\",VLOOKUP($B184:$B184,QUALIF!$C$3:$R$38,4,FALSE))","v":""},{"$f":"IF($B184=\"\",\"\",VLOOKUP($B184:$B184,QUALIF!$C$3:$R$38,5,FALSE))","v":""},{"$f":"IF($B184=\"\",\"\",VLOOKUP($B184:$B184,QUALIF!$C$3:$R$38,6,FALSE))","v":""},{"$f":"IF($B184=\"\",\"\",VLOOKUP($B184:$B184,QUALIF!$C$3:$R$38,7,FALSE))","v":""},{"$f":"IF($B184=\"\",\"\",VLOOKUP($B184:$B184,QUALIF!$C$3:$R$38,8,FALSE))","v":""},{"$f":"IF($B184=\"\",\"\",VLOOKUP($B184:$B184,QUALIF!$C$3:$R$38,9,FALSE))","v":""},{"$f":"IF($B184=\"\",\"\",VLOOKUP($B184:$B184,QUALIF!$C$3:$R$38,10,FALSE))","v":""},{"$f":"IF($B184=\"\",\"\",VLOOKUP($B184:$B184,QUALIF!$C$3:$R$38,11,FALSE))","v":""},{"$f":"IF($B184=\"\",\"\",VLOOKUP($B184:$B184,QUALIF!$C$3:$R$38,12,FALSE))","v":""},{"$f":"IF($B184=\"\",\"\",VLOOKUP($B184:$B184,QUALIF!$C$3:$R$38,13,FALSE))","v":""},{"$f":"IF($B184=\"\",\"\",VLOOKUP($B184:$B184,QUALIF!$C$3:$R$38,14,FALSE))","v":""},{"$f":"IF($B184=\"\",\"\",VLOOKUP($B184:$B184,QUALIF!$C$3:$R$38,15,FALSE))","v":""},{"$f":"IF($B184=\"\",\"\",VLOOKUP($B184:$B184,QUALIF!$C$3:$R$38,16,FALSE))","v":""}]
[null,null,null,null,null," ",{"$f":"IF($B185=\"\",\"\",VLOOKUP($B185:$B185,QUALIF!$C$3:$R$38,4,FALSE))","v":""},{"$f":"IF($B185=\"\",\"\",VLOOKUP($B185:$B185,QUALIF!$C$3:$R$38,5,FALSE))","v":""},{"$f":"IF($B185=\"\",\"\",VLOOKUP($B185:$B185,QUALIF!$C$3:$R$38,6,FALSE))","v":""},{"$f":"IF($B185=\"\",\"\",VLOOKUP($B185:$B185,QUALIF!$C$3:$R$38,7,FALSE))","v":""},{"$f":"IF($B185=\"\",\"\",VLOOKUP($B185:$B185,QUALIF!$C$3:$R$38,8,FALSE))","v":""},{"$f":"IF($B185=\"\",\"\",VLOOKUP($B185:$B185,QUALIF!$C$3:$R$38,9,FALSE))","v":""},{"$f":"IF($B185=\"\",\"\",VLOOKUP($B185:$B185,QUALIF!$C$3:$R$38,10,FALSE))","v":""},{"$f":"IF($B185=\"\",\"\",VLOOKUP($B185:$B185,QUALIF!$C$3:$R$38,11,FALSE))","v":""},{"$f":"IF($B185=\"\",\"\",VLOOKUP($B185:$B185,QUALIF!$C$3:$R$38,12,FALSE))","v":""},{"$f":"IF($B185=\"\",\"\",VLOOKUP($B185:$B185,QUALIF!$C$3:$R$38,13,FALSE))","v":""},{"$f":"IF($B185=\"\",\"\",VLOOKUP($B185:$B185,QUALIF!$C$3:$R$38,14,FALSE))","v":""},{"$f":"IF($B185=\"\",\"\",VLOOKUP($B185:$B185,QUALIF!$C$3:$R$38,15,FALSE))","v":""},{"$f":"IF($B185=\"\",\"\",VLOOKUP($B185:$B185,QUALIF!$C$3:$R$38,16,FALSE))","v":""}]
[null,null,null,null,null," ",{"$f":"IF($B186=\"\",\"\",VLOOKUP($B186:$B186,QUALIF!$C$3:$R$38,4,FALSE))","v":""},{"$f":"IF($B186=\"\",\"\",VLOOKUP($B186:$B186,QUALIF!$C$3:$R$38,5,FALSE))","v":""},{"$f":"IF($B186=\"\",\"\",VLOOKUP($B186:$B186,QUALIF!$C$3:$R$38,6,FALSE))","v":""},{"$f":"IF($B186=\"\",\"\",VLOOKUP($B186:$B186,QUALIF!$C$3:$R$38,7,FALSE))","v":""},{"$f":"IF($B186=\"\",\"\",VLOOKUP($B186:$B186,QUALIF!$C$3:$R$38,8,FALSE))","v":""},{"$f":"IF($B186=\"\",\"\",VLOOKUP($B186:$B186,QUALIF!$C$3:$R$38,9,FALSE))","v":""},{"$f":"IF($B186=\"\",\"\",VLOOKUP($B186:$B186,QUALIF!$C$3:$R$38,10,FALSE))","v":""},{"$f":"IF($B186=\"\",\"\",VLOOKUP($B186:$B186,QUALIF!$C$3:$R$38,11,FALSE))","v":""},{"$f":"IF($B186=\"\",\"\",VLOOKUP($B186:$B186,QUALIF!$C$3:$R$38,12,FALSE))","v":""},{"$f":"IF($B186=\"\",\"\",VLOOKUP($B186:$B186,QUALIF!$C$3:$R$38,13,FALSE))","v":""},{"$f":"IF($B186=\"\",\"\",VLOOKUP($B186:$B186,QUALIF!$C$3:$R$38,14,FALSE))","v":""},{"$f":"IF($B186=\"\",\"\",VLOOKUP($B186:$B186,QUALIF!$C$3:$R$38,15,FALSE))","v":""},{"$f":"IF($B186=\"\",\"\",VLOOKUP($B186:$B186,QUALIF!$C$3:$R$38,16,FALSE))","v":""}]
[null,null,null,null,null," ",{"$f":"IF($B187=\"\",\"\",VLOOKUP($B187:$B187,QUALIF!$C$3:$R$38,4,FALSE))","v":""},{"$f":"IF($B187=\"\",\"\",VLOOKUP($B187:$B187,QUALIF!$C$3:$R$38,5,FALSE))","v":""},{"$f":"IF($B187=\"\",\"\",VLOOKUP($B187:$B187,QUALIF!$C$3:$R$38,6,FALSE))","v":""},{"$f":"IF($B187=\"\",\"\",VLOOKUP($B187:$B187,QUALIF!$C$3:$R$38,7,FALSE))","v":""},{"$f":"IF($B187=\"\",\"\",VLOOKUP($B187:$B187,QUALIF!$C$3:$R$38,8,FALSE))","v":""},{"$f":"IF($B187=\"\",\"\",VLOOKUP($B187:$B187,QUALIF!$C$3:$R$38,9,FALSE))","v":""},{"$f":"IF($B187=\"\",\"\",VLOOKUP($B187:$B187,QUALIF!$C$3:$R$38,10,FALSE))","v":""},{"$f":"IF($B187=\"\",\"\",VLOOKUP($B187:$B187,QUALIF!$C$3:$R$38,11,FALSE))","v":""},{"$f":"IF($B187=\"\",\"\",VLOOKUP($B187:$B187,QUALIF!$C$3:$R$38,12,FALSE))","v":""},{"$f":"IF($B187=\"\",\"\",VLOOKUP($B187:$B187,QUALIF!$C$3:$R$38,13,FALSE))","v":""},{"$f":"IF($B187=\"\",\"\",VLOOKUP($B187:$B187,QUALIF!$C$3:$R$38,14,FALSE))","v":""},{"$f":"IF($B187=\"\",\"\",VLOOKUP($B187:$B187,QUALIF!$C$3:$R$38,15,FALSE))","v":""},{"$f":"IF($B187=\"\",\"\",VLOOKUP($B187:$B187,QUALIF!$C$3:$R$38,16,FALSE))","v":""}]
[null,null,null,null,null," ",{"$f":"IF($B188=\"\",\"\",VLOOKUP($B188:$B188,QUALIF!$C$3:$R$38,4,FALSE))","v":""},{"$f":"IF($B188=\"\",\"\",VLOOKUP($B188:$B188,QUALIF!$C$3:$R$38,5,FALSE))","v":""},{"$f":"IF($B188=\"\",\"\",VLOOKUP($B188:$B188,QUALIF!$C$3:$R$38,6,FALSE))","v":""},{"$f":"IF($B188=\"\",\"\",VLOOKUP($B188:$B188,QUALIF!$C$3:$R$38,7,FALSE))","v":""},{"$f":"IF($B188=\"\",\"\",VLOOKUP($B188:$B188,QUALIF!$C$3:$R$38,8,FALSE))","v":""},{"$f":"IF($B188=\"\",\"\",VLOOKUP($B188:$B188,QUALIF!$C$3:$R$38,9,FALSE))","v":""},{"$f":"IF($B188=\"\",\"\",VLOOKUP($B188:$B188,QUALIF!$C$3:$R$38,10,FALSE))","v":""},{"$f":"IF($B188=\"\",\"\",VLOOKUP($B188:$B188,QUALIF!$C$3:$R$38,11,FALSE))","v":""},{"$f":"IF($B188=\"\",\"\",VLOOKUP($B188:$B188,QUALIF!$C$3:$R$38,12,FALSE))","v":""},{"$f":"IF($B188=\"\",\"\",VLOOKUP($B188:$B188,QUALIF!$C$3:$R$38,13,FALSE))","v":""},{"$f":"IF($B188=\"\",\"\",VLOOKUP($B188:$B188,QUALIF!$C$3:$R$38,14,FALSE))","v":""},{"$f":"IF($B188=\"\",\"\",VLOOKUP($B188:$B188,QUALIF!$C$3:$R$38,15,FALSE))","v":""},{"$f":"IF($B188=\"\",\"\",VLOOKUP($B188:$B188,QUALIF!$C$3:$R$38,16,FALSE))","v":""}]
[null,null,null,null,null," ",{"$f":"IF($B189=\"\",\"\",VLOOKUP($B189:$B189,QUALIF!$C$3:$R$38,4,FALSE))","v":""},{"$f":"IF($B189=\"\",\"\",VLOOKUP($B189:$B189,QUALIF!$C$3:$R$38,5,FALSE))","v":""},{"$f":"IF($B189=\"\",\"\",VLOOKUP($B189:$B189,QUALIF!$C$3:$R$38,6,FALSE))","v":""},{"$f":"IF($B189=\"\",\"\",VLOOKUP($B189:$B189,QUALIF!$C$3:$R$38,7,FALSE))","v":""},{"$f":"IF($B189=\"\",\"\",VLOOKUP($B189:$B189,QUALIF!$C$3:$R$38,8,FALSE))","v":""},{"$f":"IF($B189=\"\",\"\",VLOOKUP($B189:$B189,QUALIF!$C$3:$R$38,9,FALSE))","v":""},{"$f":"IF($B189=\"\",\"\",VLOOKUP($B189:$B189,QUALIF!$C$3:$R$38,10,FALSE))","v":""},{"$f":"IF($B189=\"\",\"\",VLOOKUP($B189:$B189,QUALIF!$C$3:$R$38,11,FALSE))","v":""},{"$f":"IF($B189=\"\",\"\",VLOOKUP($B189:$B189,QUALIF!$C$3:$R$38,12,FALSE))","v":""},{"$f":"IF($B189=\"\",\"\",VLOOKUP($B189:$B189,QUALIF!$C$3:$R$38,13,FALSE))","v":""},{"$f":"IF($B189=\"\",\"\",VLOOKUP($B189:$B189,QUALIF!$C$3:$R$38,14,FALSE))","v":""},{"$f":"IF($B189=\"\",\"\",VLOOKUP($B189:$B189,QUALIF!$C$3:$R$38,15,FALSE))","v":""},{"$f":"IF($B189=\"\",\"\",VLOOKUP($B189:$B189,QUALIF!$C$3:$R$38,16,FALSE))","v":""}]
[null,null,null,null,null," ",{"$f":"IF($B190=\"\",\"\",VLOOKUP($B190:$B190,QUALIF!$C$3:$R$38,4,FALSE))","v":""},{"$f":"IF($B190=\"\",\"\",VLOOKUP($B190:$B190,QUALIF!$C$3:$R$38,5,FALSE))","v":""},{"$f":"IF($B190=\"\",\"\",VLOOKUP($B190:$B190,QUALIF!$C$3:$R$38,6,FALSE))","v":""},{"$f":"IF($B190=\"\",\"\",VLOOKUP($B190:$B190,QUALIF!$C$3:$R$38,7,FALSE))","v":""},{"$f":"IF($B190=\"\",\"\",VLOOKUP($B190:$B190,QUALIF!$C$3:$R$38,8,FALSE))","v":""},{"$f":"IF($B190=\"\",\"\",VLOOKUP($B190:$B190,QUALIF!$C$3:$R$38,9,FALSE))","v":""},{"$f":"IF($B190=\"\",\"\",VLOOKUP($B190:$B190,QUALIF!$C$3:$R$38,10,FALSE))","v":""},{"$f":"IF($B190=\"\",\"\",VLOOKUP($B190:$B190,QUALIF!$C$3:$R$38,11,FALSE))","v":""},{"$f":"IF($B190=\"\",\"\",VLOOKUP($B190:$B190,QUALIF!$C$3:$R$38,12,FALSE))","v":""},{"$f":"IF($B190=\"\",\"\",VLOOKUP($B190:$B190,QUALIF!$C$3:$R$38,13,FALSE))","v":""},{"$f":"IF($B190=\"\",\"\",VLOOKUP($B190:$B190,QUALIF!$C$3:$R$38,14,FALSE))","v":""},{"$f":"IF($B190=\"\",\"\",VLOOKUP($B190:$B190,QUALIF!$C$3:$R$38,15,FALSE))","v":""},{"$f":"IF($B190=\"\",\"\",VLOOKUP($B190:$B190,QUALIF!$C$3:$R$38,16,FALSE))","v":""}]
[null,null,null,null,null," ",{"$f":"IF($B191=\"\",\"\",VLOOKUP($B191:$B191,QUALIF!$C$3:$R$38,4,FALSE))","v":""},{"$f":"IF($B191=\"\",\"\",VLOOKUP($B191:$B191,QUALIF!$C$3:$R$38,5,FALSE))","v":""},{"$f":"IF($B191=\"\",\"\",VLOOKUP($B191:$B191,QUALIF!$C$3:$R$38,6,FALSE))","v":""},{"$f":"IF($B191=\"\",\"\",VLOOKUP($B191:$B191,QUALIF!$C$3:$R$38,7,FALSE))","v":""},{"$f":"IF($B191=\"\",\"\",VLOOKUP($B191:$B191,QUALIF!$C$3:$R$38,8,FALSE))","v":""},{"$f":"IF($B191=\"\",\"\",VLOOKUP($B191:$B191,QUALIF!$C$3:$R$38,9,FALSE))","v":""},{"$f":"IF($B191=\"\",\"\",VLOOKUP($B191:$B191,QUALIF!$C$3:$R$38,10,FALSE))","v":""},{"$f":"IF($B191=\"\",\"\",VLOOKUP($B191:$B191,QUALIF!$C$3:$R$38,11,FALSE))","v":""},{"$f":"IF($B191=\"\",\"\",VLOOKUP($B191:$B191,QUALIF!$C$3:$R$38,12,FALSE))","v":""},{"$f":"IF($B191=\"\",\"\",VLOOKUP($B191:$B191,QUALIF!$C$3:$R$38,13,FALSE))","v":""},{"$f":"IF($B191=\"\",\"\",VLOOKUP($B191:$B191,QUALIF!$C$3:$R$38,14,FALSE))","v":""},{"$f":"IF($B191=\"\",\"\",VLOOKUP($B191:$B191,QUALIF!$C$3:$R$38,15,FALSE))","v":""},{"$f":"IF($B191=\"\",\"\",VLOOKUP($B191:$B191,QUALIF!$C$3:$R$38,16,FALSE))","v":""}]
[null,null,null,null,null," ",{"$f":"IF($B192=\"\",\"\",VLOOKUP($B192:$B192,QUALIF!$C$3:$R$38,4,FALSE))","v":""},{"$f":"IF($B192=\"\",\"\",VLOOKUP($B192:$B192,QUALIF!$C$3:$R$38,5,FALSE))","v":""},{"$f":"IF($B192=\"\",\"\",VLOOKUP($B192:$B192,QUALIF!$C$3:$R$38,6,FALSE))","v":""},{"$f":"IF($B192=\"\",\"\",VLOOKUP($B192:$B192,QUALIF!$C$3:$R$38,7,FALSE))","v":""},{"$f":"IF($B192=\"\",\"\",VLOOKUP($B192:$B192,QUALIF!$C$3:$R$38,8,FALSE))","v":""},{"$f":"IF($B192=\"\",\"\",VLOOKUP($B192:$B192,QUALIF!$C$3:$R$38,9,FALSE))","v":""},{"$f":"IF($B192=\"\",\"\",VLOOKUP($B192:$B192,QUALIF!$C$3:$R$38,10,FALSE))","v":""},{"$f":"IF($B192=\"\",\"\",VLOOKUP($B192:$B192,QUALIF!$C$3:$R$38,11,FALSE))","v":""},{"$f":"IF($B192=\"\",\"\",VLOOKUP($B192:$B192,QUALIF!$C$3:$R$38,12,FALSE))","v":""},{"$f":"IF($B192=\"\",\"\",VLOOKUP($B192:$B192,QUALIF!$C$3:$R$38,13,FALSE))","v":""},{"$f":"IF($B192=\"\",\"\",VLOOKUP($B192:$B192,QUALIF!$C$3:$R$38,14,FALSE))","v":""},{"$f":"IF($B192=\"\",\"\",VLOOKUP($B192:$B192,QUALIF!$C$3:$R$38,15,FALSE))","v":""},{"$f":"IF($B192=\"\",\"\",VLOOKUP($B192:$B192,QUALIF!$C$3:$R$38,16,FALSE))","v":""}]
[null,null,null,null,null," ",{"$f":"IF($B193=\"\",\"\",VLOOKUP($B193:$B193,QUALIF!$C$3:$R$38,4,FALSE))","v":""},{"$f":"IF($B193=\"\",\"\",VLOOKUP($B193:$B193,QUALIF!$C$3:$R$38,5,FALSE))","v":""},{"$f":"IF($B193=\"\",\"\",VLOOKUP($B193:$B193,QUALIF!$C$3:$R$38,6,FALSE))","v":""},{"$f":"IF($B193=\"\",\"\",VLOOKUP($B193:$B193,QUALIF!$C$3:$R$38,7,FALSE))","v":""},{"$f":"IF($B193=\"\",\"\",VLOOKUP($B193:$B193,QUALIF!$C$3:$R$38,8,FALSE))","v":""},{"$f":"IF($B193=\"\",\"\",VLOOKUP($B193:$B193,QUALIF!$C$3:$R$38,9,FALSE))","v":""},{"$f":"IF($B193=\"\",\"\",VLOOKUP($B193:$B193,QUALIF!$C$3:$R$38,10,FALSE))","v":""},{"$f":"IF($B193=\"\",\"\",VLOOKUP($B193:$B193,QUALIF!$C$3:$R$38,11,FALSE))","v":""},{"$f":"IF($B193=\"\",\"\",VLOOKUP($B193:$B193,QUALIF!$C$3:$R$38,12,FALSE))","v":""},{"$f":"IF($B193=\"\",\"\",VLOOKUP($B193:$B193,QUALIF!$C$3:$R$38,13,FALSE))","v":""},{"$f":"IF($B193=\"\",\"\",VLOOKUP($B193:$B193,QUALIF!$C$3:$R$38,14,FALSE))","v":""},{"$f":"IF($B193=\"\",\"\",VLOOKUP($B193:$B193,QUALIF!$C$3:$R$38,15,FALSE))","v":""},{"$f":"IF($B193=\"\",\"\",VLOOKUP($B193:$B193,QUALIF!$C$3:$R$38,16,FALSE))","v":""}]
[null,null,null,null,null," ",{"$f":"IF($B194=\"\",\"\",VLOOKUP($B194:$B194,QUALIF!$C$3:$R$38,4,FALSE))","v":""},{"$f":"IF($B194=\"\",\"\",VLOOKUP($B194:$B194,QUALIF!$C$3:$R$38,5,FALSE))","v":""},{"$f":"IF($B194=\"\",\"\",VLOOKUP($B194:$B194,QUALIF!$C$3:$R$38,6,FALSE))","v":""},{"$f":"IF($B194=\"\",\"\",VLOOKUP($B194:$B194,QUALIF!$C$3:$R$38,7,FALSE))","v":""},{"$f":"IF($B194=\"\",\"\",VLOOKUP($B194:$B194,QUALIF!$C$3:$R$38,8,FALSE))","v":""},{"$f":"IF($B194=\"\",\"\",VLOOKUP($B194:$B194,QUALIF!$C$3:$R$38,9,FALSE))","v":""},{"$f":"IF($B194=\"\",\"\",VLOOKUP($B194:$B194,QUALIF!$C$3:$R$38,10,FALSE))","v":""},{"$f":"IF($B194=\"\",\"\",VLOOKUP($B194:$B194,QUALIF!$C$3:$R$38,11,FALSE))","v":""},{"$f":"IF($B194=\"\",\"\",VLOOKUP($B194:$B194,QUALIF!$C$3:$R$38,12,FALSE))","v":""},{"$f":"IF($B194=\"\",\"\",VLOOKUP($B194:$B194,QUALIF!$C$3:$R$38,13,FALSE))","v":""},{"$f":"IF($B194=\"\",\"\",VLOOKUP($B194:$B194,QUALIF!$C$3:$R$38,14,FALSE))","v":""},{"$f":"IF($B194=\"\",\"\",VLOOKUP($B194:$B194,QUALIF!$C$3:$R$38,15,FALSE))","v":""},{"$f":"IF($B194=\"\",\"\",VLOOKUP($B194:$B194,QUALIF!$C$3:$R$38,16,FALSE))","v":""}]
[null,null,null,null,null," ",{"$f":"IF($B195=\"\",\"\",VLOOKUP($B195:$B195,QUALIF!$C$3:$R$38,4,FALSE))","v":""},{"$f":"IF($B195=\"\",\"\",VLOOKUP($B195:$B195,QUALIF!$C$3:$R$38,5,FALSE))","v":""},{"$f":"IF($B195=\"\",\"\",VLOOKUP($B195:$B195,QUALIF!$C$3:$R$38,6,FALSE))","v":""},{"$f":"IF($B195=\"\",\"\",VLOOKUP($B195:$B195,QUALIF!$C$3:$R$38,7,FALSE))","v":""},{"$f":"IF($B195=\"\",\"\",VLOOKUP($B195:$B195,QUALIF!$C$3:$R$38,8,FALSE))","v":""},{"$f":"IF($B195=\"\",\"\",VLOOKUP($B195:$B195,QUALIF!$C$3:$R$38,9,FALSE))","v":""},{"$f":"IF($B195=\"\",\"\",VLOOKUP($B195:$B195,QUALIF!$C$3:$R$38,10,FALSE))","v":""},{"$f":"IF($B195=\"\",\"\",VLOOKUP($B195:$B195,QUALIF!$C$3:$R$38,11,FALSE))","v":""},{"$f":"IF($B195=\"\",\"\",VLOOKUP($B195:$B195,QUALIF!$C$3:$R$38,12,FALSE))","v":""},{"$f":"IF($B195=\"\",\"\",VLOOKUP($B195:$B195,QUALIF!$C$3:$R$38,13,FALSE))","v":""},{"$f":"IF($B195=\"\",\"\",VLOOKUP($B195:$B195,QUALIF!$C$3:$R$38,14,FALSE))","v":""},{"$f":"IF($B195=\"\",\"\",VLOOKUP($B195:$B195,QUALIF!$C$3:$R$38,15,FALSE))","v":""},{"$f":"IF($B195=\"\",\"\",VLOOKUP($B195:$B195,QUALIF!$C$3:$R$38,16,FALSE))","v":""}]
[null,null,null,null,null," ",{"$f":"IF($B196=\"\",\"\",VLOOKUP($B196:$B196,QUALIF!$C$3:$R$38,4,FALSE))","v":""},{"$f":"IF($B196=\"\",\"\",VLOOKUP($B196:$B196,QUALIF!$C$3:$R$38,5,FALSE))","v":""},{"$f":"IF($B196=\"\",\"\",VLOOKUP($B196:$B196,QUALIF!$C$3:$R$38,6,FALSE))","v":""},{"$f":"IF($B196=\"\",\"\",VLOOKUP($B196:$B196,QUALIF!$C$3:$R$38,7,FALSE))","v":""},{"$f":"IF($B196=\"\",\"\",VLOOKUP($B196:$B196,QUALIF!$C$3:$R$38,8,FALSE))","v":""},{"$f":"IF($B196=\"\",\"\",VLOOKUP($B196:$B196,QUALIF!$C$3:$R$38,9,FALSE))","v":""},{"$f":"IF($B196=\"\",\"\",VLOOKUP($B196:$B196,QUALIF!$C$3:$R$38,10,FALSE))","v":""},{"$f":"IF($B196=\"\",\"\",VLOOKUP($B196:$B196,QUALIF!$C$3:$R$38,11,FALSE))","v":""},{"$f":"IF($B196=\"\",\"\",VLOOKUP($B196:$B196,QUALIF!$C$3:$R$38,12,FALSE))","v":""},{"$f":"IF($B196=\"\",\"\",VLOOKUP($B196:$B196,QUALIF!$C$3:$R$38,13,FALSE))","v":""},{"$f":"IF($B196=\"\",\"\",VLOOKUP($B196:$B196,QUALIF!$C$3:$R$38,14,FALSE))","v":""},{"$f":"IF($B196=\"\",\"\",VLOOKUP($B196:$B196,QUALIF!$C$3:$R$38,15,FALSE))","v":""},{"$f":"IF($B196=\"\",\"\",VLOOKUP($B196:$B196,QUALIF!$C$3:$R$38,16,FALSE))","v":""}]
[null,null,null,null,null," ",{"$f":"IF($B197=\"\",\"\",VLOOKUP($B197:$B197,QUALIF!$C$3:$R$38,4,FALSE))","v":""},{"$f":"IF($B197=\"\",\"\",VLOOKUP($B197:$B197,QUALIF!$C$3:$R$38,5,FALSE))","v":""},{"$f":"IF($B197=\"\",\"\",VLOOKUP($B197:$B197,QUALIF!$C$3:$R$38,6,FALSE))","v":""},{"$f":"IF($B197=\"\",\"\",VLOOKUP($B197:$B197,QUALIF!$C$3:$R$38,7,FALSE))","v":""},{"$f":"IF($B197=\"\",\"\",VLOOKUP($B197:$B197,QUALIF!$C$3:$R$38,8,FALSE))","v":""},{"$f":"IF($B197=\"\",\"\",VLOOKUP($B197:$B197,QUALIF!$C$3:$R$38,9,FALSE))","v":""},{"$f":"IF($B197=\"\",\"\",VLOOKUP($B197:$B197,QUALIF!$C$3:$R$38,10,FALSE))","v":""},{"$f":"IF($B197=\"\",\"\",VLOOKUP($B197:$B197,QUALIF!$C$3:$R$38,11,FALSE))","v":""},{"$f":"IF($B197=\"\",\"\",VLOOKUP($B197:$B197,QUALIF!$C$3:$R$38,12,FALSE))","v":""},{"$f":"IF($B197=\"\",\"\",VLOOKUP($B197:$B197,QUALIF!$C$3:$R$38,13,FALSE))","v":""},{"$f":"IF($B197=\"\",\"\",VLOOKUP($B197:$B197,QUALIF!$C$3:$R$38,14,FALSE))","v":""},{"$f":"IF($B197=\"\",\"\",VLOOKUP($B197:$B197,QUALIF!$C$3:$R$38,15,FALSE))","v":""},{"$f":"IF($B197=\"\",\"\",VLOOKUP($B197:$B197,QUALIF!$C$3:$R$38,16,FALSE))","v":""}]
[null,null,null,null,null," ",{"$f":"IF($B198=\"\",\"\",VLOOKUP($B198:$B198,QUALIF!$C$3:$R$38,4,FALSE))","v":""},{"$f":"IF($B198=\"\",\"\",VLOOKUP($B198:$B198,QUALIF!$C$3:$R$38,5,FALSE))","v":""},{"$f":"IF($B198=\"\",\"\",VLOOKUP($B198:$B198,QUALIF!$C$3:$R$38,6,FALSE))","v":""},{"$f":"IF($B198=\"\",\"\",VLOOKUP($B198:$B198,QUALIF!$C$3:$R$38,7,FALSE))","v":""},{"$f":"IF($B198=\"\",\"\",VLOOKUP($B198:$B198,QUALIF!$C$3:$R$38,8,FALSE))","v":""},{"$f":"IF($B198=\"\",\"\",VLOOKUP($B198:$B198,QUALIF!$C$3:$R$38,9,FALSE))","v":""},{"$f":"IF($B198=\"\",\"\",VLOOKUP($B198:$B198,QUALIF!$C$3:$R$38,10,FALSE))","v":""},{"$f":"IF($B198=\"\",\"\",VLOOKUP($B198:$B198,QUALIF!$C$3:$R$38,11,FALSE))","v":""},{"$f":"IF($B198=\"\",\"\",VLOOKUP($B198:$B198,QUALIF!$C$3:$R$38,12,FALSE))","v":""},{"$f":"IF($B198=\"\",\"\",VLOOKUP($B198:$B198,QUALIF!$C$3:$R$38,13,FALSE))","v":""},{"$f":"IF($B198=\"\",\"\",VLOOKUP($B198:$B198,QUALIF!$C$3:$R$38,14,FALSE))","v":""},{"$f":"IF($B198=\"\",\"\",VLOOKUP($B198:$B198,QUALIF!$C$3:$R$38,15,FALSE))","v":""},{"$f":"IF($B198=\"\",\"\",VLOOKUP($B198:$B198,QUALIF!$C$3:$R$38,16,FALSE))","v":""}]
[null,null,null,null,null," ",{"$f":"IF($B199=\"\",\"\",VLOOKUP($B199:$B199,QUALIF!$C$3:$R$38,4,FALSE))","v":""},{"$f":"IF($B199=\"\",\"\",VLOOKUP($B199:$B199,QUALIF!$C$3:$R$38,5,FALSE))","v":""},{"$f":"IF($B199=\"\",\"\",VLOOKUP($B199:$B199,QUALIF!$C$3:$R$38,6,FALSE))","v":""},{"$f":"IF($B199=\"\",\"\",VLOOKUP($B199:$B199,QUALIF!$C$3:$R$38,7,FALSE))","v":""},{"$f":"IF($B199=\"\",\"\",VLOOKUP($B199:$B199,QUALIF!$C$3:$R$38,8,FALSE))","v":""},{"$f":"IF($B199=\"\",\"\",VLOOKUP($B199:$B199,QUALIF!$C$3:$R$38,9,FALSE))","v":""},{"$f":"IF($B199=\"\",\"\",VLOOKUP($B199:$B199,QUALIF!$C$3:$R$38,10,FALSE))","v":""},{"$f":"IF($B199=\"\",\"\",VLOOKUP($B199:$B199,QUALIF!$C$3:$R$38,11,FALSE))","v":""},{"$f":"IF($B199=\"\",\"\",VLOOKUP($B199:$B199,QUALIF!$C$3:$R$38,12,FALSE))","v":""},{"$f":"IF($B199=\"\",\"\",VLOOKUP($B199:$B199,QUALIF!$C$3:$R$38,13,FALSE))","v":""},{"$f":"IF($B199=\"\",\"\",VLOOKUP($B199:$B199,QUALIF!$C$3:$R$38,14,FALSE))","v":""},{"$f":"IF($B199=\"\",\"\",VLOOKUP($B199:$B199,QUALIF!$C$3:$R$38,15,FALSE))","v":""},{"$f":"IF($B199=\"\",\"\",VLOOKUP($B199:$B199,QUALIF!$C$3:$R$38,16,FALSE))","v":""}]
[null,null,null,null,null," ",{"$f":"IF($B200=\"\",\"\",VLOOKUP($B200:$B200,QUALIF!$C$3:$R$38,4,FALSE))","v":""},{"$f":"IF($B200=\"\",\"\",VLOOKUP($B200:$B200,QUALIF!$C$3:$R$38,5,FALSE))","v":""},{"$f":"IF($B200=\"\",\"\",VLOOKUP($B200:$B200,QUALIF!$C$3:$R$38,6,FALSE))","v":""},{"$f":"IF($B200=\"\",\"\",VLOOKUP($B200:$B200,QUALIF!$C$3:$R$38,7,FALSE))","v":""},{"$f":"IF($B200=\"\",\"\",VLOOKUP($B200:$B200,QUALIF!$C$3:$R$38,8,FALSE))","v":""},{"$f":"IF($B200=\"\",\"\",VLOOKUP($B200:$B200,QUALIF!$C$3:$R$38,9,FALSE))","v":""},{"$f":"IF($B200=\"\",\"\",VLOOKUP($B200:$B200,QUALIF!$C$3:$R$38,10,FALSE))","v":""},{"$f":"IF($B200=\"\",\"\",VLOOKUP($B200:$B200,QUALIF!$C$3:$R$38,11,FALSE))","v":""},{"$f":"IF($B200=\"\",\"\",VLOOKUP($B200:$B200,QUALIF!$C$3:$R$38,12,FALSE))","v":""},{"$f":"IF($B200=\"\",\"\",VLOOKUP($B200:$B200,QUALIF!$C$3:$R$38,13,FALSE))","v":""},{"$f":"IF($B200=\"\",\"\",VLOOKUP($B200:$B200,QUALIF!$C$3:$R$38,14,FALSE))","v":""},{"$f":"IF($B200=\"\",\"\",VLOOKUP($B200:$B200,QUALIF!$C$3:$R$38,15,FALSE))","v":""},{"$f":"IF($B200=\"\",\"\",VLOOKUP($B200:$B200,QUALIF!$C$3:$R$38,16,FALSE))","v":""}]
[null,null,null,null,null," ",{"$f":"IF($B201=\"\",\"\",VLOOKUP($B201:$B201,QUALIF!$C$3:$R$38,4,FALSE))","v":""},{"$f":"IF($B201=\"\",\"\",VLOOKUP($B201:$B201,QUALIF!$C$3:$R$38,5,FALSE))","v":""},{"$f":"IF($B201=\"\",\"\",VLOOKUP($B201:$B201,QUALIF!$C$3:$R$38,6,FALSE))","v":""},{"$f":"IF($B201=\"\",\"\",VLOOKUP($B201:$B201,QUALIF!$C$3:$R$38,7,FALSE))","v":""},{"$f":"IF($B201=\"\",\"\",VLOOKUP($B201:$B201,QUALIF!$C$3:$R$38,8,FALSE))","v":""},{"$f":"IF($B201=\"\",\"\",VLOOKUP($B201:$B201,QUALIF!$C$3:$R$38,9,FALSE))","v":""},{"$f":"IF($B201=\"\",\"\",VLOOKUP($B201:$B201,QUALIF!$C$3:$R$38,10,FALSE))","v":""},{"$f":"IF($B201=\"\",\"\",VLOOKUP($B201:$B201,QUALIF!$C$3:$R$38,11,FALSE))","v":""},{"$f":"IF($B201=\"\",\"\",VLOOKUP($B201:$B201,QUALIF!$C$3:$R$38,12,FALSE))","v":""},{"$f":"IF($B201=\"\",\"\",VLOOKUP($B201:$B201,QUALIF!$C$3:$R$38,13,FALSE))","v":""},{"$f":"IF($B201=\"\",\"\",VLOOKUP($B201:$B201,QUALIF!$C$3:$R$38,14,FALSE))","v":""},{"$f":"IF($B201=\"\",\"\",VLOOKUP($B201:$B201,QUALIF!$C$3:$R$38,15,FALSE))","v":""},{"$f":"IF($B201=\"\",\"\",VLOOKUP($B201:$B201,QUALIF!$C$3:$R$38,16,FALSE))","v":""}]
[null,null,null,null,null," ",{"$f":"IF($B202=\"\",\"\",VLOOKUP($B202:$B202,QUALIF!$C$3:$R$38,4,FALSE))","v":""},{"$f":"IF($B202=\"\",\"\",VLOOKUP($B202:$B202,QUALIF!$C$3:$R$38,5,FALSE))","v":""},{"$f":"IF($B202=\"\",\"\",VLOOKUP($B202:$B202,QUALIF!$C$3:$R$38,6,FALSE))","v":""},{"$f":"IF($B202=\"\",\"\",VLOOKUP($B202:$B202,QUALIF!$C$3:$R$38,7,FALSE))","v":""},{"$f":"IF($B202=\"\",\"\",VLOOKUP($B202:$B202,QUALIF!$C$3:$R$38,8,FALSE))","v":""},{"$f":"IF($B202=\"\",\"\",VLOOKUP($B202:$B202,QUALIF!$C$3:$R$38,9,FALSE))","v":""},{"$f":"IF($B202=\"\",\"\",VLOOKUP($B202:$B202,QUALIF!$C$3:$R$38,10,FALSE))","v":""},{"$f":"IF($B202=\"\",\"\",VLOOKUP($B202:$B202,QUALIF!$C$3:$R$38,11,FALSE))","v":""},{"$f":"IF($B202=\"\",\"\",VLOOKUP($B202:$B202,QUALIF!$C$3:$R$38,12,FALSE))","v":""},{"$f":"IF($B202=\"\",\"\",VLOOKUP($B202:$B202,QUALIF!$C$3:$R$38,13,FALSE))","v":""},{"$f":"IF($B202=\"\",\"\",VLOOKUP($B202:$B202,QUALIF!$C$3:$R$38,14,FALSE))","v":""},{"$f":"IF($B202=\"\",\"\",VLOOKUP($B202:$B202,QUALIF!$C$3:$R$38,15,FALSE))","v":""},{"$f":"IF($B202=\"\",\"\",VLOOKUP($B202:$B202,QUALIF!$C$3:$R$38,16,FALSE))","v":""}]

{"sheet":"QUALIF","index":3,"n_rows":52,"n_cols":18,"rows_kept":52,"cut":false,"hidden":false,"merged":[[0,0,0,17]]}
["QUALIFICATIONS DE LA 5CMC"]
["section","grade","nom","prenom","N° SAP","VL","PL","VAB","SC2","TIOR","SC1","PSC1","PSE1","PSE2","GRIMEUR","FACQAA","FA UMDA","FS UMDA"]
["S2","LTN","SAMELOR",null,null,"X","X",null,null,"X","X","X",null,null,null,null,null," "]
["S2","SCH","RAMEL",null,null,"X","X",null,null,"X","X","X"]
["S2","SGT","MOHIMONT",null,null,"X","X",null,null,"X","X","X"]
["S2","SGT","DOVERGNE",null,null,"X","X","X","X","X","X","X","X","X",null,null,"X","X"]
["S2","CC1","FALSARELLA",null,null,"X","X",null,null,"X","X","X"]
["S2","CC1","GOMEZ-GRANA",null,null,"X","X","X","X","X","X","X","X","X","X"]
["S2","CC1","HUYGHE",null,null,"X","X","X","X","X","X","X","X","X"]
["S2","CC1","LEBOURG",null,null,"X","X","X","X","X","X","X","X"]
["S2","CCH","AHMED",null,null,"X","X","X",null,"X","X","X",null,null,"X"]
["S2","CCH","ANLLI",null,null,"X","X","X",null,"X","X","X"]
["S2","CCH","BACO",null,null,"X","X","X","X","X","X","X",null,null,null,"X"]
["S2","CCH","BERNOUD",null,null,"X","X","X","X","X","X","X","X","X"]
["S2","CCH","CREBASSA",null,null,"X","X","X",null,"X","X","X",null,null,"X"]
["S2","CCH","GERMAIN",null,null,"X","X","X","X","X","X","X"]
["S2","CCH","HEDDAD",null,null,"X","X","X","X","X","X","X",null,null,"X"]
["S2","CCH","PHILLIPS",null,null,"X","X","X",null,"X","X","X"]
["S2","CCH","VERET",null,null,"X","X","X",null,"X","X","X","X","X"]
["S2","CPL","ANNAERT",null,null,"X","X","X",null,"X","X","X","X"]
["S2","CPL","BANGELINA",null,null,"X","X","X","X","X","X","X",null,null,"X"]
["S2","CPL","DENIS",null,null,"X","X",null,"X","X","X","X","X"]
["S2","CPL","FELIP",null,null,"X","X","X","X","X","X","X",null,null,"X"]
["S2","CPL","FIMIEZ",null,null,"X","X","X",null,"X","X","X"]
["S2","CPL","GOURVENEC",null,null,"X","X","X",null,"X","X","X"]
["S2","CPL","GRANATO",null,null,"X","X","X",null,"X","X","X","X","X"]
["S2","CPL","GRANDCHAMP",null,null,"X","X","X","X","X","X","X"]
["S2","1CL","HAMZA",null,null,"X",null,null,null,"X","X","X","X","X"]
["S2","CPL","HIROUF",null,null,"X",null,null,null,"X","X","X","X","X"]
["S2","CPL","JAWORSKI",null,null,"X",null,null,null,"X","X","X","X","X"]
["S2","CPL","KAWASÉ",null,null,"X","X",null,"X","X","X","X","X","X",null,"X"]
["S2","CPL","KONATÉ",null,null,"X",null,null,null,"X","X","X","X","X"]
["S2","CPL","PATHA",null,null,"X","X",null,null,"X","X","X","X","X"]
["S2","CPL","MAHAGNE",null,null,"X",null,null,null,"X","X","X","X","X"]
["S2","CPL","RICHARDSON",null,null,"X",null,null,null,"X","X","X","X","X"]
["S2","CPL","STRAZEL",null,null,"X",null,null,null,"X","X","X","X","X"]
["S2","1CL","BOURLON",null,null,"X",null,null,null,"X","X","X","X","X"]
["S2","1CL","BRISSET",null,null,"X","X",null,null,"X","X","X","X","X"]
["S2","1CL","BRONDEAU",null,null,"X",null,null,null,"X","X","X","X","X"]
["S2","1CL","CHOLLAT",null,null,"X",null,null,null,null,"X","X","X","X"]
["S2","1CL","CLAVEAU",null,null,"X","X",null,null,null,"X","X","X","X"]
["S2","1CL","CZERBAKOFF",null,null,"X","X",null,null,"X","X","X","X","X"]
["S2","1CL","DESCHAMPS",null,null,"X",null,null,null,"X","X","X","X","X"]
[null,"1CL","GAY"]
[null,"1CL","HOKAUPOKO"]
[null,"1CL","HUBERT"]
[null,"1CL","LE BRETON"]
[null,"1CL","LE STRAT"]
[null,"CPL","MARTIN"]
[null,"1CL","PASCALIN"]
[null,"1CL","PIETRZYK"]
[null,"1CL","THIERY"]

{"sheet":"SPA S1","index":4,"n_rows":66,"n_cols":26,"rows_kept":66,"cut":false,"hidden":false,"merged":[[54,11,54,24],[56,11,56,24],[57,11,57,24],[58,11,58,24],[64,11,64,24],[55,11,55,24],[65,11,65,24],[59,11,59,24],[60,11,60,24],[61,11,61,24],[62,11,62,24],[63,11,63,24],[53,11,53,24],[46,11,46,24],[47,11,47,24],[48,11,48,24],[49,11,49,24],[50,11,50,24],[51,11,51,24],[52,11,52,24],[34,11,34,24],[42,11,42,24],[43,11,43,24],[29,11,29,24],[44,11,44,24],[30,11,30,24],[31,11,31,24],[32,11,32,24],[33,11,33,24],[35,11,35,24],[45,11,45,24],[36,11,36,24],[37,11,37,24],[38,11,38,24],[39,11,39,24],[40,11,40,24],[41,11,41,24],[24,11,24,24],[25,11,25,24],[26,11,26,24],[27,11,27,24],[28,11,28,24],[19,11,19,24],[20,11,20,24],[21,11,21,24],[22,11,22,24],[23,11,23,24],[14,11,14,24],[15,11,15,24],[16,11,16,24],[17,11,17,24],[18,11,18,24],[0,4,0,6],[2,2,2,3],[2,10,3,10],[2,11,3,20],[3,2,3,3],[0,1,0,2],[13,8,13,10],[4,2,4,3],[4,11,4,20],[13,11,13,24],[7,9,11,24],[7,7,11,8],[6,7,6,24]]}
[null,"Régiment : RMED",null,null,"Cie : ",null,null,"5° CMC",null,null,"Section 1"]
[]
[null,null,"Effectif théorique :",null,{"$f":"COUNTIF($Z$15:$Z66,\"X\")","v":1},{"$f":"COUNTIF($Z$15:$Z66,\"Y\")","v":3},{"$f":"COUNTIF($Z$15:$Z66,\"Z\")","v":48},null,null,null,"Date du jour :","2019-05-06"]
[null,null,"Effectif présent :",null,{"$f":"COUNTIFS($Z$15:$Z66,\"X\",$E$15:$E$66,\"X\")","v":1},{"$f":"COUNTIFS($Z$15:$Z66,\"Y\",$E$15:$E$66,\"X\")","v":1},{"$f":"COUNTIFS($Z$15:$Z66,\"Z\",$E$15:$E$66,\"X\")","v":16}]
[null,null,"Effectif Absent :",null,{"$f":"E3-E4","v":0},{"$f":"F3-F4","v":2},{"$f":"G3-G4","v":32}]
[]
[null,null,null,null,null,null,null,"SIGNATURES"]
[null,null,null,null,null,null,null,"Signature Chef de Section :",null,"Signature commandant d'unité"]
[]
[]
[]
[]
[]
["N° SAP","GRADE","NOM","Prénom","P",null,"A","MOTIF","PERIODE",null,null,"OBSERVATIONS"]
[88238778,"LTN","SAMELOR","Emmanuel","X",null,null,"FORMATION INTERNE",null,"au",null,null,null,null,null,null,null,null,null,null,null,null,null,null,null,"X"]
[90039569,"SCH","RAMEL","Matthieu","X",null,null,"PERMISSION",null,"au",null,null,null,null,null,null,null,null,null,null,null,null,null,null,null,"Y"]
[88952444,"SGT","MOHIMONT","Tiffany",null,null,"X","PERMISSION","2019-02-14","au","2019-03-03",null,null,null,null,null,null,null,null,null,null,null,null,null,null,"Y"]
[88953616,"SGT","DOVERGNE","Ben",null,null,"X","PERMISSION","2019-02-16","au","2019-02-27",null,null,null,null,null,null,null,null,null,null,null,null,null,null,"Y"]
[90259946,"CC1","FALSARELLA","Ludovic",null,null,"X","PERMISSION","26/02/20149","au","2019-03-14",null,null,null,null,null,null,null,null,null,null,null,null,null,null,"Z"]
[90077384,"CC1","GOMEZ-GRANA","Alexandra",null,null,"X","PERMISSION","2019-02-14","au","2019-03-04",null,null,null,null,null,null,null,null,null,null,null,null,null,null,"Z"]
[90020522,"CC1","HUYGHE","Henri",null,null,"X","PERMISSION","2018-11-03","au","2019-03-05","LIBAN",null,null,null,null,null,null,null,null,null,null,null,null,null,"Z"]
[90098328,"CC1","LEBOURG","Guillaume",null,null,"X","PERMISSION","2018-10-21","au","2019-02-28","MALI",null,null,null,null,null,null,null,null,null,null,null,null,null,"Z"]
[88231138,"CCH","AHMED","Oumar","X",null,null,"PERMISSION",null,"au",null,null,null,null,null,null,null,null,null,null,null,null,null,null,null,"Z"]
[88252413,"CCH","ANLLI","Ben","X",null,null,null,null,"au",null,null,null,null,null,null,null,null,null,null,null,null,null,null,null,"Z"]
[88206159,"CCH","BACO","Rifain",null,null,"X","PERMISSION","2019-02-23","au","2019-03-03",null,null,null,null,null,null,null,null,null,null,null,null,null,null,"Z"]
[88206159,"CCH","BERNOUD","Vincent",null,null,"X","PERMISSION","2019-01-21","au","2019-03-31",null,null,null,null,null,null,null,null,null,null,null,null,null,null,"Z"]
[90102235,"CCH","CREBASSA","Pascal",null,null,"X","SERVICE","2019-02-08","au","2019-03-04",null,null,null,null,null,null,null,null,null,null,null,null,null,null,"Z"]
[88255985,"CCH","GERMAIN","Selvam",null,null,"X","OPEX / MCD","2019-02-01","au","2019-06-01","NIGER",null,null,null,null,null,null,null,null,null,null,null,null,null,"Z"]
[88246933,"CCH","HEDDAD","Jessica",null,null,"X","PERMISSION","2018-10-29","au","2019-02-26","DJIBOUTI",null,null,null,null,null,null,null,null,null,null,null,null,null,"Z"]
[88273985,"CPL","JAWORSKI","François",null,null,"X","PERMISSION","2019-02-09","au","2019-03-03",null,null,null,null,null,null,null,null,null,null,null,null,null,null,"Z"]
[88216134,"CCH","PHILLIPS","Ken",null,null,"X","PERMISSION","2018-10-11","au","2019-03-14","SENEGAL",null,null,null,null,null,null,null,null,null,null,null,null,null,"Z"]
[88226099,"CCH","VERET","Mélinda",null,null,"X","PERMISSION","2018-10-11","au","2019-03-14","SENEGAL",null,null,null,null,null,null,null,null,null,null,null,null,null,"Z"]
[88955790,"CPL","ANNAERT","Kévin","X",null,null,"FORMATION INTERNE",null,"au",null,null,null,null,null,null,null,null,null,null,null,null,null,null,null,"Z"]
[88934427,"CPL","BANGELINA","Endrik","X",null,null,"PERMISSION",null,"au",null,null,null,null,null,null,null,null,null,null,null,null,null,null,null,"Z"]
[88956886,"CPL","CHOLLAT","Christopher","X",null,null,"FORMATION INTERNE",null,"au",null,null,null,null,null,null,null,null,null,null,null,null,null,null,null,"Z"]
[88279388,"CPL","COSPOLITE","Ulrich","X",null,null,null,"2019-02-21",null,"2019-03-01","RENFORT SC2 AU GISS",null,null,null,null,null,null,null,null,null,null,null,null,null,"Z"]
[88932354,"CPL","DENIS","William",null,null,"X","PERMISSION","2019-02-14","au","2019-03-03",null,null,null,null,null,null,null,null,null,null,null,null,null,null,"Z"]
[88992354,"CPL","FELIP","Alexandre",null,null,"X","OPEX / MCD","2019-01-14","au","2019-05-14","GUYANE",null,null,null,null,null,null,null,null,null,null,null,null,null,"Z"]
[88921227,"CPL","FIMIEZ","Mario",null,null,"X","PERMISSION","2019-01-21","au","2019-03-10",null,null,null,null,null,null,null,null,null,null,null,null,null,null,"Z"]
[88945100,"CPL","GOURVENEC","Florian","X",null,null,"PERMISSION","2019-02-25","au","2019-03-08","CDB FA VAB",null,null,null,null,null,null,null,null,null,null,null,null,null,"Z"]
[88932217,"CPL","GRANATO","Céline",null,null,"X","PERMISSION","2018-12-06","au","2019-04-05","NOUVELLE CALEDONIE",null,null,null,null,null,null,null,null,null,null,null,null,null,"Z"]
[88926770,"CPL","GRANDCHAMP","Gabriel",null,null,"X","PERMISSION","2019-02-20","au","2019-03-20",null,null,null,null,null,null,null,null,null,null,null,null,null,null,"Z"]
[88945187,"1CL","HAMZA","Ben Yamin",null,null,"X","OPEX / MCD","2019-02-04","au","2019-04-05","STL T31",null,null,null,null,null,null,null,null,null,null,null,null,null,"Z"]
[88276095,"CPL","HIROUF","Adil",null,null,"X","PERMISSION","2018-10-18","au","2019-03-03","MALI",null,null,null,null,null,null,null,null,null,null,null,null,null,"Z"]
[88957831,"CPL","KAWASÉ","Kalani",null,null,"X","PERMISSION","2018-12-06","au","2019-04-05","NOUVELLE CALEDONIE",null,null,null,null,null,null,null,null,null,null,null,null,null,"Z"]
[88921163,"CPL","KONATÉ","Dramane","X",null,null,"PERMISSION",null,"au",null,null,null,null,null,null,null,null,null,null,null,null,null,null,null,"Z"]
[88932314,"CPL","PATHA","Gyane",null,null,"X","PERMISSION","2018-10-21","au","2019-02-28","MALI",null,null,null,null,null,null,null,null,null,null,null,null,null,"Z"]
[88958767,"CPL","MAHAGNE","Megan",null,null,"X","PERMISSION","2018-11-09","au","2019-03-11","LIBAN",null,null,null,null,null,null,null,null,null,null,null,null,null,"Z"]
[88255387,"CPL","RICHARDSON","Nathanaelle",null,null,"X","PERMISSION","2018-11-30","au","2019-03-30","RCA",null,null,null,null,null,null,null,null,null,null,null,null,null,"Z"]
[88934074,"1CL","STRAZEL","Francemiline",null,null,"X","PERMISSION","2018-11-27","au","2019-03-27","LA REUNION",null,null,null,null,null,null,null,null,null,null,null,null,null,"Z"]
[88957930,"1CL","BOURLON","Elisa",null,null,"X","PERMISSION","2019-02-21","au","2019-03-02",null,null,null,null,null,null,null,null,null,null,null,null,null,null,"Z"]
[88963880,"1CL","BRISSET","Adrien",null,null,"X","PERMISSION","2018-11-30","au","2019-03-22","RCA",null,null,null,null,null,null,null,null,null,null,null,null,null,"Z"]
[88980914,"1CL","BRONDEAU","Julien",null,null,"X","PERMISSION","2019-02-16","au","2019-03-03",null,null,null,null,null,null,null,null,null,null,null,null,null,null,"Z"]
[88981141,"1CL","CLAVEAU","Marvin","X",null,null,"PERMISSION",null,"au",null,null,null,null,null,null,null,null,null,null,null,null,null,null,null,"Z"]
[88960686,"1CL","CZERBAKOFF","Mélissandre","X",null,null,"PERMISSION",null,"au",null,null,null,null,null,null,null,null,null,null,null,null,null,null,null,"Z"]
[88968309,"1CL","D'AGOSTINO","Johanna","X",null,null,"HOSPITALISATION",null,null,null,null,null,null,null,null,null,null,null,null,null,null,null,null,null,"Z"]
[88958305,"1CL","DESCHAMPS","Louis","X",null,null,"PERMISSION",null,"au",null,null,null,null,null,null,null,null,null,null,null,null,null,null,null,"Z"]
[88979005,"1CL","GAY","Marion","X",null,null,"PERMISSION",null,"au",null,null,null,null,null,null,null,null,null,null,null,null,null,null,null,"Z"]
[88980915,"1CL","HOKAUPOKO","Alisée",null,null,"X","PERMISSION","2019-02-16","au","2019-03-03",null,null,null,null,null,null,null,null,null,null,null,null,null,null,"Z"]
[88980755,"1CL","HUBERT","Emmanuelle","X",null,null,"MALADE DANS SES FOYERS","2019-01-07","au","2019-03-01","FTS ADJ BONAVENTURE",null,null,null,null,null,null,null,null,null,null,null,null,null,"Z"]
[88960923,"1CL","LE BRETON","Mélina","X",null,null,"PERMISSION",null,"au",null,null,null,null,null,null,null,null,null,null,null,null,null,null,null,"Z"]
[47328,"1CL","LE STRAT","Iman",null,null,"X","PERMISSION","2019-02-11","au","2019-03-04",null,null,null,null,null,null,null,null,null,null,null,null,null,null,"Z"]
[88963741,"1CL","MARTIN","Joan","X",null,null,"PERMISSION",null,"au",null,null,null,null,null,null,null,null,null,null,null,null,null,null,null,"Z"]
[88958559,"1CL","PASCALIN","Brice",null,null,"X","PERMISSION","2019-02-09","au","2019-03-03",null,null,null,null,null,null,null,null,null,null,null,null,null,null,"Z"]
[88980634,"1CL","PIETRZYK","Nicolas",null,null,"X","PERMISSION","2019-02-16","au","2019-03-03",null,null,null,null,null,null,null,null,null,null,null,null,null,null,"Z"]
[88981428,"1CL","THIERY","Alison",null,null,"X","PERMISSION","2019-02-16","au","2019-03-03",null,null,null,null,null,null,null,null,null,null,null,null,null,null,"Z"]

{"sheet":"Feuil1","index":5,"n_rows":0,"n_cols":0,"rows_kept":0,"cut":false,"hidden":false,"merged":[]}