{"text_format":"1","workbook":"xlsx","n_sheets":2,"sheets":["Frontal","Liste"],"not_rendered":{"charts":0,"images":34,"macros":1,"external_links":1,"defined_names":9,"comments":1,"pivot_tables":0},"unopened":[],"bounds":{"document_bytes":16777216,"sheet_cells":100000,"rows_first":2000,"rows_last":500,"rows_between":2000,"halvings":0,"cell_chars":16384,"cell_head_chars":4096},"cells_cut":0,"cells_raw":0,"read":"whole","date_system":"1900"}

{"sheet":"Frontal","index":0,"n_rows":167,"n_cols":19,"rows_kept":167,"cut":false,"hidden":false,"merged":[[0,11,0,12]]}
[]
["N°","Date Commande","Semaine","Mois","Année","Responsable","CF","Atelier","Demandeur","Catégorie","Reference","Désignation","Catégorie2","Colonne3","prix unité","Nb","prix total","Date  livraison","OK/NOK"]
[1,"2019-02-27",{"$f":"WEEKNUM($B3,2)-(WEEKDAY(DATE(YEAR(B3),1,4),2)<4)*1","v":9},{"$f":"TEXT([1]Frontal!$B$3:$B$165,\"MMMM\")","v":"février"},{"$f":"TEXT([1]Frontal!$B$3:$B$165,\"AAAA\")","v":"2019"},"Saida. Benahmina",{"$f":"VLOOKUP([1]Frontal!$F3,[1]Liste!A:C,3,0)","v":9968},"Francois. Hanne","AQM","Francois Hanne","X951506724",{"$f":"VLOOKUP([1]Frontal!$K3,[1]REF!B:C,2,0)","v":"Bouchon D'oreille"},"Consommable",{"$f":"LEN(K3)","v":10},{"$f":"VLOOKUP([1]Frontal!$K3,[1]REF!B:D,3,0)","v":1.01},50,{"$f":"[1]Frontal!$P$3:$P$165*[1]Frontal!$O$3:$O$165","v":50.5},"2019-01-17",{"$f":"IF(R3,\"OK\",\"NOK\")","v":"OK"}]
[2,"2019-03-09",10,{"$f":"TEXT([1]Frontal!$B$3:$B$165,\"MMMM\")","v":"mars"},{"$f":"TEXT([1]Frontal!$B$3:$B$165,\"AAAA\")","v":"2019"},"Matthieu. Pimont",9964,"Daniel. Szekula ","Métrologie","2019-03-09","R100601459",{"$f":"VLOOKUP([1]Frontal!$K4,[1]REF!B:C,2,0)","v":"Chaussures H BASSES CUIR FLEUR NOIR HYDROFUGE Taille 43"},"EPI",10,{"$f":"VLOOKUP([1]Frontal!$K4,[1]REF!B:D,3,0)","v":20.8},1,{"$f":"[1]Frontal!$P$3:$P$165*[1]Frontal!$O$3:$O$165","v":20.8},"2019-01-18",{"$f":"IF(R4,\"OK\",\"NOK\")","v":"OK"}]
[3,"2019-01-18",3,{"$f":"TEXT([1]Frontal!$B$3:$B$165,\"MMMM\")","v":"janvier"},{"$f":"TEXT([1]Frontal!$B$3:$B$165,\"AAAA\")","v":"2019"},"Saida. Benahmina",{"$f":"VLOOKUP([1]Frontal!$F5,[1]Liste!A:C,3,0)","v":9968},"Daniel. Jouy","Bloqueur","Daniel. Jouy","R100518626",{"$f":"VLOOKUP([1]Frontal!$K5,[1]REF!B:C,2,0)","v":"Chaussures H VILLE TYPE MOCASSIN CUIR PLEINE FLEUR Taille 40"},"EPI",10,{"$f":"VLOOKUP([1]Frontal!$K5,[1]REF!B:D,3,0)","v":33.729999999999997},1,{"$f":"[1]Frontal!$P$3:$P$165*[1]Frontal!$O$3:$O$165","v":33.729999999999997},"2019-01-18","OK"]
[4,"2019-01-18",3,{"$f":"TEXT([1]Frontal!$B$3:$B$165,\"MMMM\")","v":"janvier"},{"$f":"TEXT([1]Frontal!$B$3:$B$165,\"AAAA\")","v":"2019"},"Saida. Benahmina",{"$f":"VLOOKUP([1]Frontal!$F6,[1]Liste!A:C,3,0)","v":9968},"Fabrice. Richard ","CSC","Peggy. Guenez","R100364315",{"$f":"VLOOKUP([1]Frontal!$K6,[1]REF!B:C,2,0)","v":"Chaussures F  TENNIS EN CROUPON VELOURS ROUGE Taille 37"},"EPI",10,{"$f":"VLOOKUP([1]Frontal!$K6,[1]REF!B:D,3,0)","v":33.4},1,{"$f":"[1]Frontal!$P$3:$P$165*[1]Frontal!$O$3:$O$165","v":33.4},"2019-01-18","OK"]
[5,"2019-01-18",3,{"$f":"TEXT([1]Frontal!$B$3:$B$165,\"MMMM\")","v":"janvier"},{"$f":"TEXT([1]Frontal!$B$3:$B$165,\"AAAA\")","v":"2019"},"Saida. Benahmina",{"$f":"VLOOKUP([1]Frontal!$F7,[1]Liste!A:C,3,0)","v":9968},"Cindy. Thorez ","CSC","Cindy. Thorez",4939031057,{"$f":"VLOOKUP([1]Frontal!$K7,[1]REF!B:C,2,0)","v":"Pastilles adhésives ovales VERT"},"Consommable",10,{"$f":"VLOOKUP([1]Frontal!$K7,[1]REF!B:D,3,0)","v":7.61},50,{"$f":"[1]Frontal!$P$3:$P$165*[1]Frontal!$O$3:$O$165","v":380.5},"2019-01-18","OK"]
[6,"2019-01-21",4,{"$f":"TEXT([1]Frontal!$B$3:$B$165,\"MMMM\")","v":"janvier"},{"$f":"TEXT([1]Frontal!$B$3:$B$165,\"AAAA\")","v":"2019"},"Saida. Benahmina",{"$f":"VLOOKUP([1]Frontal!$F8,[1]Liste!A:C,3,0)","v":9968},"Cindy. Thorez ","CSC","Fanny. Drapier","R100364314",{"$f":"VLOOKUP([1]Frontal!$K8,[1]REF!B:C,2,0)","v":"Chaussures F  TENNIS EN CROUPON VELOURS ROUGE Taille 36"},"EPI",10,{"$f":"VLOOKUP([1]Frontal!$K8,[1]REF!B:D,3,0)","v":33.4},1,{"$f":"[1]Frontal!$P$3:$P$165*[1]Frontal!$O$3:$O$165","v":33.4},"2019-01-21","OK"]
[7,"2019-01-21",4,{"$f":"TEXT([1]Frontal!$B$3:$B$165,\"MMMM\")","v":"janvier"},{"$f":"TEXT([1]Frontal!$B$3:$B$165,\"AAAA\")","v":"2019"},"Vincent. Loquet",{"$f":"VLOOKUP([1]Frontal!$F9,[1]Liste!A:C,3,0)","v":9978},"Vincent. Loquet","QPN","John Duez","R100503610",{"$f":"VLOOKUP([1]Frontal!$K9,[1]REF!B:C,2,0)","v":"Blouson Matelassé  Taille XL 48/50-3"},"EPI",10,{"$f":"VLOOKUP([1]Frontal!$K9,[1]REF!B:D,3,0)","v":20.95},1,{"$f":"[1]Frontal!$P$3:$P$165*[1]Frontal!$O$3:$O$165","v":20.95},"2019-01-21","OK"]
[8,"2019-01-21",4,{"$f":"TEXT([1]Frontal!$B$3:$B$165,\"MMMM\")","v":"janvier"},{"$f":"TEXT([1]Frontal!$B$3:$B$165,\"AAAA\")","v":"2019"},"Vincent. Loquet",{"$f":"VLOOKUP([1]Frontal!$F10,[1]Liste!A:C,3,0)","v":9978},"Vincent. Loquet","QPN","Jeremy Pierzchala","R100503610",{"$f":"VLOOKUP([1]Frontal!$K10,[1]REF!B:C,2,0)","v":"Blouson Matelassé  Taille XL 48/50-3"},"EPI",10,{"$f":"VLOOKUP([1]Frontal!$K10,[1]REF!B:D,3,0)","v":20.95},1,{"$f":"[1]Frontal!$P$3:$P$165*[1]Frontal!$O$3:$O$165","v":20.95},"2019-01-21","OK"]
[9,"2019-01-21",4,{"$f":"TEXT([1]Frontal!$B$3:$B$165,\"MMMM\")","v":"janvier"},{"$f":"TEXT([1]Frontal!$B$3:$B$165,\"AAAA\")","v":"2019"},"Vincent. Loquet",{"$f":"VLOOKUP([1]Frontal!$F11,[1]Liste!A:C,3,0)","v":9978},"Vincent. Loquet","QPN","Ludovic Thomas","R100503610",{"$f":"VLOOKUP([1]Frontal!$K11,[1]REF!B:C,2,0)","v":"Blouson Matelassé  Taille XL 48/50-3"},"EPI",10,{"$f":"VLOOKUP([1]Frontal!$K11,[1]REF!B:D,3,0)","v":20.95},1,{"$f":"[1]Frontal!$P$3:$P$165*[1]Frontal!$O$3:$O$165","v":20.95},"2019-01-21","OK"]
[10,"2019-01-21",4,{"$f":"TEXT([1]Frontal!$B$3:$B$165,\"MMMM\")","v":"janvier"},{"$f":"TEXT([1]Frontal!$B$3:$B$165,\"AAAA\")","v":"2019"},"Vincent. Loquet",{"$f":"VLOOKUP([1]Frontal!$F12,[1]Liste!A:C,3,0)","v":9978},"Vincent. Loquet","QPN","Loic  Warlouzet","R100503610",{"$f":"VLOOKUP([1]Frontal!$K12,[1]REF!B:C,2,0)","v":"Blouson Matelassé  Taille XL 48/50-3"},"EPI",10,{"$f":"VLOOKUP([1]Frontal!$K12,[1]REF!B:D,3,0)","v":20.95},1,{"$f":"[1]Frontal!$P$3:$P$165*[1]Frontal!$O$3:$O$165","v":20.95},"2019-01-21","OK"]
[11,"2019-01-21",4,{"$f":"TEXT([1]Frontal!$B$3:$B$165,\"MMMM\")","v":"janvier"},{"$f":"TEXT([1]Frontal!$B$3:$B$165,\"AAAA\")","v":"2019"},"Vincent. Loquet",{"$f":"VLOOKUP([1]Frontal!$F13,[1]Liste!A:C,3,0)","v":9978},"Vincent. Loquet","QPN","Nadine Cauchy","R100503610",{"$f":"VLOOKUP([1]Frontal!$K13,[1]REF!B:C,2,0)","v":"Blouson Matelassé  Taille XL 48/50-3"},"EPI",10,{"$f":"VLOOKUP([1]Frontal!$K13,[1]REF!B:D,3,0)","v":20.95},1,{"$f":"[1]Frontal!$P$3:$P$165*[1]Frontal!$O$3:$O$165","v":20.95},"2019-01-21","OK"]
[12,"2019-01-21",4,{"$f":"TEXT([1]Frontal!$B$3:$B$165,\"MMMM\")","v":"janvier"},{"$f":"TEXT([1]Frontal!$B$3:$B$165,\"AAAA\")","v":"2019"},"Vincent. Loquet",{"$f":"VLOOKUP([1]Frontal!$F14,[1]Liste!A:C,3,0)","v":9978},"Vincent. Loquet","QPN","Fabrice  Houssin","R100503612",{"$f":"VLOOKUP([1]Frontal!$K14,[1]REF!B:C,2,0)","v":"Blouson Matelassé Taille XXXL 56/58-5"},"EPI",10,{"$f":"VLOOKUP([1]Frontal!$K14,[1]REF!B:D,3,0)","v":18.48},1,{"$f":"[1]Frontal!$P$3:$P$165*[1]Frontal!$O$3:$O$165","v":18.48},"2019-01-21","OK"]
[13,"2019-01-24",4,{"$f":"TEXT([1]Frontal!$B$3:$B$165,\"MMMM\")","v":"janvier"},{"$f":"TEXT([1]Frontal!$B$3:$B$165,\"AAAA\")","v":"2019"},"Vincent. Loquet",{"$f":"VLOOKUP([1]Frontal!$F15,[1]Liste!A:C,3,0)","v":9978},"Vincent. Loquet","QPN","Rudy  Faucherant","R100503613",{"$f":"VLOOKUP([1]Frontal!$K15,[1]REF!B:C,2,0)","v":"Blouson Matelassé Taille XXXXL-T6"},"EPI",10,{"$f":"VLOOKUP([1]Frontal!$K15,[1]REF!B:D,3,0)","v":18.48},1,{"$f":"[1]Frontal!$P$3:$P$165*[1]Frontal!$O$3:$O$165","v":18.48},"2019-01-21","OK"]
[14,"2019-01-21",4,{"$f":"TEXT([1]Frontal!$B$3:$B$165,\"MMMM\")","v":"janvier"},{"$f":"TEXT([1]Frontal!$B$3:$B$165,\"AAAA\")","v":"2019"},"Vincent. Loquet",{"$f":"VLOOKUP([1]Frontal!$F16,[1]Liste!A:C,3,0)","v":9978},"Vincent. Loquet","QPN","Jeremy Pierzchala","R100583445",{"$f":"VLOOKUP([1]Frontal!$K16,[1]REF!B:C,2,0)","v":"Parka HV Jaune Taille L"},"EPI",10,{"$f":"VLOOKUP([1]Frontal!$K16,[1]REF!B:D,3,0)","v":33.69},1,{"$f":"[1]Frontal!$P$3:$P$165*[1]Frontal!$O$3:$O$165","v":33.69},"2019-01-21","OK"]
[15,"2019-01-21",4,{"$f":"TEXT([1]Frontal!$B$3:$B$165,\"MMMM\")","v":"janvier"},{"$f":"TEXT([1]Frontal!$B$3:$B$165,\"AAAA\")","v":"2019"},"Vincent. Loquet",{"$f":"VLOOKUP([1]Frontal!$F17,[1]Liste!A:C,3,0)","v":9978},"Vincent. Loquet","QPN","John Duez","R100583445",{"$f":"VLOOKUP([1]Frontal!$K17,[1]REF!B:C,2,0)","v":"Parka HV Jaune Taille L"},"EPI",10,{"$f":"VLOOKUP([1]Frontal!$K17,[1]REF!B:D,3,0)","v":33.69},1,{"$f":"[1]Frontal!$P$3:$P$165*[1]Frontal!$O$3:$O$165","v":33.69},"2019-01-21","OK"]
[16,"2019-01-21",4,{"$f":"TEXT([1]Frontal!$B$3:$B$165,\"MMMM\")","v":"janvier"},{"$f":"TEXT([1]Frontal!$B$3:$B$165,\"AAAA\")","v":"2019"},"Vincent. Loquet",{"$f":"VLOOKUP([1]Frontal!$F18,[1]Liste!A:C,3,0)","v":9978},"Vincent. Loquet","QPN","Ludovic Thomas","R100583445",{"$f":"VLOOKUP([1]Frontal!$K18,[1]REF!B:C,2,0)","v":"Parka HV Jaune Taille L"},"EPI",10,{"$f":"VLOOKUP([1]Frontal!$K18,[1]REF!B:D,3,0)","v":33.69},1,{"$f":"[1]Frontal!$P$3:$P$165*[1]Frontal!$O$3:$O$165","v":33.69},"2019-01-21","OK"]
[17,"2019-01-21",4,{"$f":"TEXT([1]Frontal!$B$3:$B$165,\"MMMM\")","v":"janvier"},{"$f":"TEXT([1]Frontal!$B$3:$B$165,\"AAAA\")","v":"2019"},"Vincent. Loquet",{"$f":"VLOOKUP([1]Frontal!$F19,[1]Liste!A:C,3,0)","v":9978},"Vincent. Loquet","QPN","Loic  Warlouzet","R100583445",{"$f":"VLOOKUP([1]Frontal!$K19,[1]REF!B:C,2,0)","v":"Parka HV Jaune Taille L"},"EPI",10,{"$f":"VLOOKUP([1]Frontal!$K19,[1]REF!B:D,3,0)","v":33.69},1,{"$f":"[1]Frontal!$P$3:$P$165*[1]Frontal!$O$3:$O$165","v":33.69},"2019-01-21","OK"]
[18,"2019-01-21",4,{"$f":"TEXT([1]Frontal!$B$3:$B$165,\"MMMM\")","v":"janvier"},{"$f":"TEXT([1]Frontal!$B$3:$B$165,\"AAAA\")","v":"2019"},"Vincent. Loquet",{"$f":"VLOOKUP([1]Frontal!$F20,[1]Liste!A:C,3,0)","v":9978},"Vincent. Loquet","QPN","Frederic Selingue","R100583445",{"$f":"VLOOKUP([1]Frontal!$K20,[1]REF!B:C,2,0)","v":"Parka HV Jaune Taille L"},"EPI",10,{"$f":"VLOOKUP([1]Frontal!$K20,[1]REF!B:D,3,0)","v":33.69},1,{"$f":"[1]Frontal!$P$3:$P$165*[1]Frontal!$O$3:$O$165","v":33.69},"2019-01-21","OK"]
[19,"2019-01-21",4,{"$f":"TEXT([1]Frontal!$B$3:$B$165,\"MMMM\")","v":"janvier"},{"$f":"TEXT([1]Frontal!$B$3:$B$165,\"AAAA\")","v":"2019"},"Vincent. Loquet",{"$f":"VLOOKUP([1]Frontal!$F21,[1]Liste!A:C,3,0)","v":9978},"Vincent. Loquet","QPN","Pascal Leclercq","R100583445",{"$f":"VLOOKUP([1]Frontal!$K21,[1]REF!B:C,2,0)","v":"Parka HV Jaune Taille L"},"EPI",10,{"$f":"VLOOKUP([1]Frontal!$K21,[1]REF!B:D,3,0)","v":33.69},1,{"$f":"[1]Frontal!$P$3:$P$165*[1]Frontal!$O$3:$O$165","v":33.69},"2019-01-21","OK"]
[20,"2019-01-21",4,{"$f":"TEXT([1]Frontal!$B$3:$B$165,\"MMMM\")","v":"janvier"},{"$f":"TEXT([1]Frontal!$B$3:$B$165,\"AAAA\")","v":"2019"},"Vincent. Loquet",{"$f":"VLOOKUP([1]Frontal!$F22,[1]Liste!A:C,3,0)","v":9978},"Vincent. Loquet","QPN","Christian Carette","R100583448",{"$f":"VLOOKUP([1]Frontal!$K22,[1]REF!B:C,2,0)","v":"Parka HV Jaune Taille XXXL"},"EPI",10,{"$f":"VLOOKUP([1]Frontal!$K22,[1]REF!B:D,3,0)","v":32},1,{"$f":"[1]Frontal!$P$3:$P$165*[1]Frontal!$O$3:$O$165","v":32},"2019-01-21","OK"]
[21,"2019-01-21",4,{"$f":"TEXT([1]Frontal!$B$3:$B$165,\"MMMM\")","v":"janvier"},{"$f":"TEXT([1]Frontal!$B$3:$B$165,\"AAAA\")","v":"2019"},"Matthieu. Pimont",9964,"Daniel. Szekula ","Métrologie","Max  Ducatez","R100601464",{"$f":"VLOOKUP([1]Frontal!$K23,[1]REF!B:C,2,0)","v":"Chaussures H BASSES CUIR FLEUR NOIR HYDROFUGE Taille 45"},"EPI",10,{"$f":"VLOOKUP([1]Frontal!$K23,[1]REF!B:D,3,0)","v":20.8},1,{"$f":"[1]Frontal!$P$3:$P$165*[1]Frontal!$O$3:$O$165","v":20.8},"2019-01-21","OK"]
[22,"2019-01-21",4,{"$f":"TEXT([1]Frontal!$B$3:$B$165,\"MMMM\")","v":"janvier"},{"$f":"TEXT([1]Frontal!$B$3:$B$165,\"AAAA\")","v":"2019"},"Matthieu. Pimont",9964,"Pascal. Steu","G. Bruit","Pascal Steu","R100611739",{"$f":"VLOOKUP([1]Frontal!$K24,[1]REF!B:C,2,0)","v":"Lampe de poche GISS"},"Outillage",10,{"$f":"VLOOKUP([1]Frontal!$K24,[1]REF!B:D,3,0)","v":14.31},4,{"$f":"[1]Frontal!$P$3:$P$165*[1]Frontal!$O$3:$O$165","v":57.24},"2019-01-21","OK"]
[23,"2019-01-22",4,{"$f":"TEXT([1]Frontal!$B$3:$B$165,\"MMMM\")","v":"janvier"},{"$f":"TEXT([1]Frontal!$B$3:$B$165,\"AAAA\")","v":"2019"},"Vincent. Loquet",{"$f":"VLOOKUP([1]Frontal!$F25,[1]Liste!A:C,3,0)","v":9978},"Vincent. Loquet","QPN","Vincent. Loquet","R100625298",{"$f":"VLOOKUP([1]Frontal!$K25,[1]REF!B:C,2,0)","v":"Gilet réfléchissant  XL"},"EPI",10,{"$f":"VLOOKUP([1]Frontal!$K25,[1]REF!B:D,3,0)","v":5.77},10,{"$f":"[1]Frontal!$P$3:$P$165*[1]Frontal!$O$3:$O$165","v":57.699999999999996},"2019-01-22","OK"]
[24,"2019-01-22",4,{"$f":"TEXT([1]Frontal!$B$3:$B$165,\"MMMM\")","v":"janvier"},{"$f":"TEXT([1]Frontal!$B$3:$B$165,\"AAAA\")","v":"2019"},"Vincent. Loquet",{"$f":"VLOOKUP([1]Frontal!$F26,[1]Liste!A:C,3,0)","v":9978},"Vincent. Loquet","QPN","Vincent. Loquet","R100625297",{"$f":"VLOOKUP([1]Frontal!$K26,[1]REF!B:C,2,0)","v":"Gilet réfléchissant  L"},"EPI",10,{"$f":"VLOOKUP([1]Frontal!$K26,[1]REF!B:D,3,0)","v":5.77},10,{"$f":"[1]Frontal!$P$3:$P$165*[1]Frontal!$O$3:$O$165","v":57.699999999999996},"2019-01-22","OK"]
[25,"2019-01-22",4,{"$f":"TEXT([1]Frontal!$B$3:$B$165,\"MMMM\")","v":"janvier"},{"$f":"TEXT([1]Frontal!$B$3:$B$165,\"AAAA\")","v":"2019"},"Vincent. Loquet",{"$f":"VLOOKUP([1]Frontal!$F27,[1]Liste!A:C,3,0)","v":9978},"Vincent. Loquet","QPN","Vincent. Loquet","R100625296",{"$f":"VLOOKUP([1]Frontal!$K27,[1]REF!B:C,2,0)","v":"Gilet réfléchissant  M"},"EPI",10,{"$f":"VLOOKUP([1]Frontal!$K27,[1]REF!B:D,3,0)","v":5.77},10,{"$f":"[1]Frontal!$P$3:$P$165*[1]Frontal!$O$3:$O$165","v":57.699999999999996},"2019-01-22","OK"]
[26,"2019-01-22",4,{"$f":"TEXT([1]Frontal!$B$3:$B$165,\"MMMM\")","v":"janvier"},{"$f":"TEXT([1]Frontal!$B$3:$B$165,\"AAAA\")","v":"2019"},"Cédric. Longatte ",{"$f":"VLOOKUP([1]Frontal!$F28,[1]Liste!A:C,3,0)","v":9967},"David. Lequeux ","CAP","Michael. Defontaine ","R100625730",{"$f":"VLOOKUP([1]Frontal!$K28,[1]REF!B:C,2,0)","v":"Chargeur téléphone"},"Bureautique",10,{"$f":"VLOOKUP([1]Frontal!$K28,[1]REF!B:D,3,0)","v":19.510000000000002},1,{"$f":"[1]Frontal!$P$3:$P$165*[1]Frontal!$O$3:$O$165","v":19.510000000000002},"2019-01-22","OK"]
[27,"2019-01-23",4,{"$f":"TEXT([1]Frontal!$B$3:$B$165,\"MMMM\")","v":"janvier"},{"$f":"TEXT([1]Frontal!$B$3:$B$165,\"AAAA\")","v":"2019"},"Saida. Benahmina",{"$f":"VLOOKUP([1]Frontal!$F29,[1]Liste!A:C,3,0)","v":9968},"Saida. Benahmina","Reprographie","Sebastien. Taisne","R100201616",{"$f":"VLOOKUP([1]Frontal!$K29,[1]REF!B:C,2,0)","v":"Chaussures H TOILEES TYPE MOCASSIN Taille 42"},"EPI",10,{"$f":"VLOOKUP([1]Frontal!$K29,[1]REF!B:D,3,0)","v":27.2},1,{"$f":"[1]Frontal!$P$3:$P$165*[1]Frontal!$O$3:$O$165","v":27.2},"2019-01-23","OK"]
[28,"2019-01-24",4,{"$f":"TEXT([1]Frontal!$B$3:$B$165,\"MMMM\")","v":"janvier"},{"$f":"TEXT([1]Frontal!$B$3:$B$165,\"AAAA\")","v":"2019"},"Saida. Benahmina",{"$f":"VLOOKUP([1]Frontal!$F30,[1]Liste!A:C,3,0)","v":9968},"Christine. Tamburri ","AQM","Christine. Tamburri ","R100155495",{"$f":"VLOOKUP([1]Frontal!$K30,[1]REF!B:C,2,0)","v":"Lampe de poche "},"Outillage",10,{"$f":"VLOOKUP([1]Frontal!$K30,[1]REF!B:D,3,0)","v":21.7},1,{"$f":"[1]Frontal!$P$3:$P$165*[1]Frontal!$O$3:$O$165","v":21.7},"2019-01-24","OK"]
[29,"2019-01-24",4,{"$f":"TEXT([1]Frontal!$B$3:$B$165,\"MMMM\")","v":"janvier"},{"$f":"TEXT([1]Frontal!$B$3:$B$165,\"AAAA\")","v":"2019"},"Saida. Benahmina",{"$f":"VLOOKUP([1]Frontal!$F31,[1]Liste!A:C,3,0)","v":9968},"Christine. Tamburri ","AQM","Christine. Tamburri ","R100582895",{"$f":"VLOOKUP([1]Frontal!$K31,[1]REF!B:C,2,0)","v":"casquette de sécurité "},"EPI",10,{"$f":"VLOOKUP([1]Frontal!$K31,[1]REF!B:D,3,0)","v":16.82},2,{"$f":"[1]Frontal!$P$3:$P$165*[1]Frontal!$O$3:$O$165","v":33.64},"2019-01-24","OK"]
[30,"2019-01-24",4,{"$f":"TEXT([1]Frontal!$B$3:$B$165,\"MMMM\")","v":"janvier"},{"$f":"TEXT([1]Frontal!$B$3:$B$165,\"AAAA\")","v":"2019"},"Saida. Benahmina",{"$f":"VLOOKUP([1]Frontal!$F32,[1]Liste!A:C,3,0)","v":9968},"Christian. Kaliszewski ","Bloqueur","Christian. Kaliszewski ","R100601464",{"$f":"VLOOKUP([1]Frontal!$K32,[1]REF!B:C,2,0)","v":"Chaussures H BASSES CUIR FLEUR NOIR HYDROFUGE Taille 45"},"EPI",10,{"$f":"VLOOKUP([1]Frontal!$K32,[1]REF!B:D,3,0)","v":20.8},1,{"$f":"[1]Frontal!$P$3:$P$165*[1]Frontal!$O$3:$O$165","v":20.8},"2019-01-24","OK"]
[31,"2019-01-25",4,{"$f":"TEXT([1]Frontal!$B$3:$B$165,\"MMMM\")","v":"janvier"},{"$f":"TEXT([1]Frontal!$B$3:$B$165,\"AAAA\")","v":"2019"},"Saida. Benahmina",{"$f":"VLOOKUP([1]Frontal!$F33,[1]Liste!A:C,3,0)","v":9968},"Cindy. Thorez ","CSC","Cindy. Thorez","X951506719",{"$f":"VLOOKUP([1]Frontal!$K33,[1]REF!B:C,2,0)","v":"Bouchon D'oreille Arceaux"},"EPI",10,{"$f":"VLOOKUP([1]Frontal!$K33,[1]REF!B:D,3,0)","v":2.4},10,{"$f":"[1]Frontal!$P$3:$P$165*[1]Frontal!$O$3:$O$165","v":24},"2019-01-25","OK"]
[32,"2019-01-25",4,{"$f":"TEXT([1]Frontal!$B$3:$B$165,\"MMMM\")","v":"janvier"},{"$f":"TEXT([1]Frontal!$B$3:$B$165,\"AAAA\")","v":"2019"},"Saida. Benahmina",{"$f":"VLOOKUP([1]Frontal!$F34,[1]Liste!A:C,3,0)","v":9968},"Christian. Kaliszewski ","Bloqueur","Christian. Kaliszewski ","T533011200",{"$f":"VLOOKUP([1]Frontal!$K34,[1]REF!B:C,2,0)","v":"Ruban Adhésif"},"Consommable",10,{"$f":"VLOOKUP([1]Frontal!$K34,[1]REF!B:D,3,0)","v":0.59},100,{"$f":"[1]Frontal!$P$3:$P$165*[1]Frontal!$O$3:$O$165","v":59},"2019-01-25","OK"]
[33,"2019-01-25",4,{"$f":"TEXT([1]Frontal!$B$3:$B$165,\"MMMM\")","v":"janvier"},{"$f":"TEXT([1]Frontal!$B$3:$B$165,\"AAAA\")","v":"2019"},"Saida. Benahmina",{"$f":"VLOOKUP([1]Frontal!$F35,[1]Liste!A:C,3,0)","v":9968},"Christian. Kaliszewski ","Bloqueur","Christian. Kaliszewski ",4939031056,{"$f":"VLOOKUP([1]Frontal!$K35,[1]REF!B:C,2,0)","v":"Pastilles adhésives ovales JAUNE"},"Consommable",10,{"$f":"VLOOKUP([1]Frontal!$K35,[1]REF!B:D,3,0)","v":8.09},5,{"$f":"[1]Frontal!$P$3:$P$165*[1]Frontal!$O$3:$O$165","v":40.450000000000003},"2019-01-25","OK"]
[34,"2019-01-28",5,{"$f":"TEXT([1]Frontal!$B$3:$B$165,\"MMMM\")","v":"janvier"},{"$f":"TEXT([1]Frontal!$B$3:$B$165,\"AAAA\")","v":"2019"},"Saida. Benahmina",{"$f":"VLOOKUP([1]Frontal!$F36,[1]Liste!A:C,3,0)","v":9968},"Christine. Tamburri ","AQM","Laurence.Marquette","R100518519",{"$f":"VLOOKUP([1]Frontal!$K36,[1]REF!B:C,2,0)","v":"Chaussures F MONTANTES CUIR FLEUR NOIR Taille 40"},"EPI",10,{"$f":"VLOOKUP([1]Frontal!$K36,[1]REF!B:D,3,0)","v":42.13},1,{"$f":"[1]Frontal!$P$3:$P$165*[1]Frontal!$O$3:$O$165","v":42.13},"2019-01-29","OK"]
[35,"2019-01-28",5,{"$f":"TEXT([1]Frontal!$B$3:$B$165,\"MMMM\")","v":"janvier"},{"$f":"TEXT([1]Frontal!$B$3:$B$165,\"AAAA\")","v":"2019"},"Cédric. Longatte ",{"$f":"VLOOKUP([1]Frontal!$F37,[1]Liste!A:C,3,0)","v":9967},"David. Lequeux ","CAP","Michael. Defontaine ","R100666592",{"$f":"VLOOKUP([1]Frontal!$K37,[1]REF!B:C,2,0)","v":"Lunette Sécurité"},"EPI",10,{"$f":"VLOOKUP([1]Frontal!$K37,[1]REF!B:D,3,0)","v":3},1,{"$f":"[1]Frontal!$P$3:$P$165*[1]Frontal!$O$3:$O$165","v":3},"2019-01-28","OK"]
[36,"2019-01-28",5,{"$f":"TEXT([1]Frontal!$B$3:$B$165,\"MMMM\")","v":"janvier"},{"$f":"TEXT([1]Frontal!$B$3:$B$165,\"AAAA\")","v":"2019"},"Saida. Benahmina",{"$f":"VLOOKUP([1]Frontal!$F38,[1]Liste!A:C,3,0)","v":9968},"Cindy. Thorez ","CSC"," Cindy.Thorez","R100646629",{"$f":"VLOOKUP([1]Frontal!$K38,[1]REF!B:C,2,0)","v":"PAIRE GANTS T7 MASTIC laine blanc liseré Jaune"},"EPI",10,{"$f":"VLOOKUP([1]Frontal!$K38,[1]REF!B:D,3,0)","v":0.6},300,{"$f":"[1]Frontal!$P$3:$P$165*[1]Frontal!$O$3:$O$165","v":180},"2019-01-28","OK"]
[37,"2019-01-29",5,{"$f":"TEXT([1]Frontal!$B$3:$B$165,\"MMMM\")","v":"janvier"},{"$f":"TEXT([1]Frontal!$B$3:$B$165,\"AAAA\")","v":"2019"},"Saida. Benahmina",{"$f":"VLOOKUP([1]Frontal!$F39,[1]Liste!A:C,3,0)","v":9968},"Cindy. Thorez ","CSC","Fabrice. Bielanwski","R100601454",{"$f":"VLOOKUP([1]Frontal!$K39,[1]REF!B:C,2,0)","v":"Chaussures H BASSES CUIR FLEUR NOIR HYDROFUGE Taille 42"},"EPI",10,{"$f":"VLOOKUP([1]Frontal!$K39,[1]REF!B:D,3,0)","v":20.8},1,{"$f":"[1]Frontal!$P$3:$P$165*[1]Frontal!$O$3:$O$165","v":20.8},"2019-01-29","OK"]
[38,"2019-01-29",5,{"$f":"TEXT([1]Frontal!$B$3:$B$165,\"MMMM\")","v":"janvier"},{"$f":"TEXT([1]Frontal!$B$3:$B$165,\"AAAA\")","v":"2019"},"Saida. Benahmina",{"$f":"VLOOKUP([1]Frontal!$F40,[1]Liste!A:C,3,0)","v":9968},"Cindy. Thorez ","CSC","Angélique. Ego","R100549970",{"$f":"VLOOKUP([1]Frontal!$K40,[1]REF!B:C,2,0)","v":"Chaussures FEMME OPERATEUR ET VILLE CUIR NUBUCK Taille 38"},"EPI",10,{"$f":"VLOOKUP([1]Frontal!$K40,[1]REF!B:D,3,0)","v":40.89},1,{"$f":"[1]Frontal!$P$3:$P$165*[1]Frontal!$O$3:$O$165","v":40.89},"2019-01-29","OK"]
{"$rows_left_out":128}
{"sheet":"Liste","index":1,"n_rows":172,"n_cols":15,"rows_kept":172,"cut":false,"hidden":false,"merged":[]}
["Responsable",null,"CF",null,"Demandeur",null,"Atelier",null,"Reference",null,"Désignation",null,"Prix",null,"Catégorie "]
["Saida. Benahmina",null,9968,null," Patrice. Aka.Amany",null,"AQM",null,"P955157073",null," Gobelet ",null,1,null,"EPI"]
["Cédric. Longatte ",null,9967,null,"Abdelkadder Tayebi",null,"Bloqueur",null,"R100279065",null,"Aérosol Dégraissant 650ml",null,5.42,null,"Bureautique"]
["Anne Sophie. Pater ",null,9961,null,"Abdelkrim  BERDEG ",null,"CA Analyse",null,"R100329826",null,"Aérosol  AIRBUL 650ml",null,1.84,null,"Consommable"]
["Aka.Amany. Patrice",null,9962,null,"Cathy.Dhainaut",null,"CAP",null,"P976730900",null,"Agitateur ou cuillère ",null,10,null,"DO"]
["Dpt Qualité",null,9961,null,"Cédric. Longatte ",null,"CSC",null,"R100625728",null,"Telephone",null,90.57,null,"Electroménager"]
["Loic. L-B",null,9961,null,"Christian. Kaliszewski ",null,"Dpt Qualité",null,"R100625731",null,"Alimentation téléphone",null,8.31,null,"Habillement"]
["Vincent. Loquet",null,9978,null,"Christine. Tamburri ",null,"EPF",null,"R100503609",null,"Blouson Matelassé  Taille L 44/46-2",null,21.11,null,"Informatique"]
["Valerie. Masson",null,9961,null,"Christophe. Mikolaczak",null,"G. Bruit",null,"R100503608",null,"Blouson Matelassé  Taille M 40/42-1",null,18.5,null,"Ménager"]
["Sandra. Folmer",null,9964,null,"Cindy. Thorez",null,"GEO",null,"R100503610",null,"Blouson Matelassé  Taille XL 48/50-3",null,20.95,null,"Mobilier"]
["Guillaume. Jeffard",null,9900,null,"Daniel. Jouy",null,"Métrologie",null,"R100437384",null,"Blouson Matelassé Taille ",null,33.32,null,"Outillage"]
[null,null,null,null,"Daniel. Szekula",null,"PLS",null,"R100503611",null,"Blouson Matelassé Taille XXL 52/54-4",null,22.11,null,"Pile"]
[null,null,null,null,"D-HELFT.Peggy",null,"QPN",null,"R100503612",null,"Blouson Matelassé Taille XXXL 56/58-5",null,18.48,null,"Quincaillerie"]
[null,null,null,null,"Eric. Francois",null,"Reprographie",null,"R100503613",null,"Blouson Matelassé Taille XXXXL-T6",null,18.48]
[null,null,null,null,"Fabrice. Richard ",null,"SEBR",null,"X951506724",null,"Bouchon D'oreille",null,1.01]
[null,null,null,null,"Fanny. Drapier",null,"Traçage",null,"X951506719",null,"Bouchon D'oreille Arceaux",null,2.4]
[null,null,null,null,"Francois. Hanne",null,null,null,"X951506725",null,"Bouchon D'oreille Ficelle",null,1.01]
[null,null,null,null,"Jean-Luc Pawlak",null,null,null,"R100305424",null,"Carte SD",null,22.5]
[null,null,null,null,"Laurent. Peru",null,null,null,"R100582895",null,"casquette de sécurité ",null,16.82]
[null,null,null,null,"Michael. Defontaine ",null,null,null,"X955973021",null,"Ceinture de combinaison",null,2.46]
[null,null,null,null,"Nadine. Cauchy",null,null,null,"R100625730",null,"Chargeur téléphone",null,19.510000000000002]
[null,null,null,null,"Olivier. Foulon ",null,null,null,"R100201611",null,"Chaussures H TOILEES TYPE MOCASSIN Taille 39",null,27.2]
[null,null,null,null,"Pascal. Steu",null,null,null,"R100201614",null,"Chaussures H TOILEES TYPE MOCASSIN Taille 41",null,27.2]
[null,null,null,null,"Peggy. D-Helft",null,null,null,"R100201616",null,"Chaussures H TOILEES TYPE MOCASSIN Taille 42",null,27.2]
[null,null,null,null,"Régis. Dincq",null,null,null,"R100364314",null,"Chaussures F  TENNIS EN CROUPON VELOURS ROUGE Taille 36",null,33.4]
[null,null,null,null,"Sandra. Folmer",null,null,null,"R100364315",null,"Chaussures F  TENNIS EN CROUPON VELOURS ROUGE Taille 37",null,33.4]
[null,null,null,null,"Sebastien. Taisne",null,null,null,"R100364320",null,"Chaussures F  TENNIS EN CROUPON VELOURS ROUGE Taille 40",null,33.200000000000003]
[null,null,null,null,"Séverine. Leborgne ",null,null,null,"R100518514",null,"Chaussures F MONTANTES CUIR FLEUR NOIR Taille 35",null,44.74]
[null,null,null,null,"Stephane. Dumont",null,null,null,"R100518515",null,"Chaussures F MONTANTES CUIR FLEUR NOIR Taille 36",null,42.13]
[null,null,null,null,"Stock",null,null,null,"R100518517",null,"Chaussures F MONTANTES CUIR FLEUR NOIR Taille 38",null,42.13]
[null,null,null,null,"Valerie. Masson",null,null,null,"R100518520",null,"Chaussures F MONTANTES CUIR FLEUR NOIR Taille 41",null,42.13]
[null,null,null,null,"Vincent. Loquet",null,null,null,"R100518521",null,"Chaussures F MONTANTES CUIR FLEUR NOIR Taille 42",null,42.13]
[null,null,null,null,null,null,null,null,"R100518605",null,"Chaussures H BASSES CUIR PLEINE FLEUR DE VACHETTE Taille 42",null,41.49]
[null,null,null,null,null,null,null,null,"R100518606",null,"Chaussures H BASSES CUIR PLEINE FLEUR DE VACHETTE Taille 43",null,43.45]
[null,null,null,null,null,null,null,null,"R100518608",null,"Chaussures H BASSES CUIR PLEINE FLEUR DE VACHETTE Taille 45",null,42.83]
[null,null,null,null,null,null,null,null,"R100518607",null,"Chaussures H BASSES CUIR PLEINE FLEUR DE VACHETTE Taille 44",null,42.09]
[null,null,null,null,null,null,null,null,"R100518616",null,"Chaussures H VILLE AMAGNETIQUES CUIR PLEINE FLEUR Taille 40",null,35.51]
[null,null,null,null,null,null,null,null,"R100518618",null,"Chaussures H VILLE AMAGNETIQUES CUIR PLEINE FLEUR Taille 42",null,41.04]
[null,null,null,null,null,null,null,null,"R100518619",null,"Chaussures H VILLE AMAGNETIQUES CUIR PLEINE FLEUR Taille 43",null,36.270000000000003]
[null,null,null,null,null,null,null,null,"R100518620",null,"Chaussures H VILLE AMAGNETIQUES CUIR PLEINE FLEUR Taille 44",null,41.04]
{"$rows_left_out":132}