{"text_format":"1","workbook":"xlsx","n_sheets":5,"sheets":["commande"," reception camion","reception luc","expedition","Feuil2"],"not_rendered":{"charts":0,"images":3,"macros":1,"external_links":0,"defined_names":2,"comments":1,"pivot_tables":0},"unopened":[],"bounds":{"document_bytes":16777216,"sheet_cells":100000,"rows_first":2000,"rows_last":500,"rows_between":2000,"halvings":0,"cell_chars":16384,"cell_head_chars":4096},"cells_cut":0,"cells_raw":0,"read":"whole","date_system":"1900"}

{"sheet":"commande","index":0,"n_rows":12,"n_cols":27,"rows_kept":12,"cut":false,"hidden":false,"merged":[]}
["Date","entrer plaque","NOM","PRENOM","SOCIETE","TELEPHONE","TYPE VOITURE","remarque","REMARQUE","certifié","Marque","Véhicule","Taille","Type","LI","SI","Runflat","Code EAN","Saison","hhh","cc","hhh","Votre prix HT EUR","CODE  BARRE","DIMENSION POUCE","TAXE","CALCUL"]
["Date","entrer plaque","NOM","PRENOM","SOCIETE","TELEPHONE","TYPE VOITURE","remarque","REMARQUE","certifié","Marque","Véhicule","Taille","Type","LI","SI","Runflat","Code EAN","Saison",null,null,null,"Votre prix HT EUR","CODE  BARRE","DIMENSION POUCE","TAXE","CALCUL"]
["2019-02-04",22222,{"$f":"VLOOKUP(B3,Feuil2!$A$1:$L$7,2,FALSE)","v":"AAA2"},{"$f":"VLOOKUP(B3,Feuil2!$A$1:$L$7,3,FALSE)","v":"FULD"},{"$f":"VLOOKUP(B3,Feuil2!$A$1:$L$7,4,FALSE)","v":"FVFV"},{"$f":"VLOOKUP(B3,Feuil2!$A$1:$L$7,7,FALSE)","v":71858585},{"$f":"VLOOKUP(B3,Feuil2!$A$1:$L$7,8,FALSE)","v":"Camionnette/petit poids lourds"},{"$f":"VLOOKUP(B3,Feuil2!$A$1:$L$7,5,FALSE)","v":"HIVER"},{"$f":"VLOOKUP(B3,Feuil2!$A$1:$L$7,9,FALSE)","v":43194},"suspendu","MICHELIN","Voiture particulière",2055525,"ALPIN 15",100,"H","Non",3528706802746,"Hiver","C","B",null,87,{"$f":"MID(R3,1,1)&CHAR(MID(R3,2,1)+65)&CHAR(MID(R3,3,1)+IF(ISNA(MATCH(VALUE(MID(R3,1,1)),{0;1;2;3},0)),75,65))&CHAR(MID(R3,4,1)+IF(ISNA(MATCH(VALUE(MID(R3,1,1)),{0;4;7;8},0)),75,65))&CHAR(MID(R3,5,1)+IF(ISNA(MATCH(VALUE(MID(R3,1,1)),{0;1;4;5;9},0)),75,65))&CHAR(MID(R3,6,1)+IF(ISNA(MATCH(VALUE(MID(R3,1,1)),{0;2;5;6;7},0)),75,65))&CHAR(MID(R3,7,1)+IF(ISNA(MATCH(VALUE(MID(R3,1,1)),{1;4;6;8;9},0)),75,65))&\"*\"&CHAR(MID(R3,8,1)+97)&CHAR(MID(R3,9,1)+97)&CHAR(MID(R3,10,1)+97)&CHAR(MID(R3,11,1)+97)&CHAR(MID(R3,12,1)+97)&CHAR(MID(R3,13,1)+97)&\"+\"","v":"3FCSRKQ*iacheg+"},{"$f":"RIGHT(M3,2)","v":"25"},{"$f":"IF(G3=\"Camionnette/petit poids lourds\",\"4,73\",\"2.86\")","v":"4,73"},{"$f":"(((W3+Y3)*0.21)+(W3+Y3))+Z3","v":140.25}]
["2019-02-04",5555,{"$f":"VLOOKUP(B4,Feuil2!$A$1:$L$7,2,FALSE)","v":"AAA5"},{"$f":"VLOOKUP(B4,Feuil2!$A$1:$L$7,3,FALSE)","v":"GOOD"},{"$f":"VLOOKUP(B4,Feuil2!$A$1:$L$7,4,FALSE)","v":"FGFG"},{"$f":"VLOOKUP(B4,Feuil2!$A$1:$L$7,7,FALSE)","v":71858585},{"$f":"VLOOKUP(B4,Feuil2!$A$1:$L$7,8,FALSE)","v":"Camionnette/petit poids lourds"},{"$f":"VLOOKUP(B4,Feuil2!$A$1:$L$7,5,FALSE)","v":"HIVER"},{"$f":"VLOOKUP(B4,Feuil2!$A$1:$L$7,9,FALSE)","v":42787},"suspendu","MICHELIN","Voiture particulière",2055528,"ALPIN 18",103,"H","Non",3528706802749,"Hiver","C","B",null,90,{"$f":"MID(R4,1,1)&CHAR(MID(R4,2,1)+65)&CHAR(MID(R4,3,1)+IF(ISNA(MATCH(VALUE(MID(R4,1,1)),{0;1;2;3},0)),75,65))&CHAR(MID(R4,4,1)+IF(ISNA(MATCH(VALUE(MID(R4,1,1)),{0;4;7;8},0)),75,65))&CHAR(MID(R4,5,1)+IF(ISNA(MATCH(VALUE(MID(R4,1,1)),{0;1;4;5;9},0)),75,65))&CHAR(MID(R4,6,1)+IF(ISNA(MATCH(VALUE(MID(R4,1,1)),{0;2;5;6;7},0)),75,65))&CHAR(MID(R4,7,1)+IF(ISNA(MATCH(VALUE(MID(R4,1,1)),{1;4;6;8;9},0)),75,65))&\"*\"&CHAR(MID(R4,8,1)+97)&CHAR(MID(R4,9,1)+97)&CHAR(MID(R4,10,1)+97)&CHAR(MID(R4,11,1)+97)&CHAR(MID(R4,12,1)+97)&CHAR(MID(R4,13,1)+97)&\"+\"","v":"3FCSRKQ*iachej+"},"28","4,73",147.51]
["2019-02-04",5555,{"$f":"VLOOKUP(B5,Feuil2!$A$1:$L$7,2,FALSE)","v":"AAA5"},{"$f":"VLOOKUP(B5,Feuil2!$A$1:$L$7,3,FALSE)","v":"GOOD"},{"$f":"VLOOKUP(B5,Feuil2!$A$1:$L$7,4,FALSE)","v":"FGFG"},{"$f":"VLOOKUP(B5,Feuil2!$A$1:$L$7,7,FALSE)","v":71858585},{"$f":"VLOOKUP(B5,Feuil2!$A$1:$L$7,8,FALSE)","v":"Camionnette/petit poids lourds"},{"$f":"VLOOKUP(B5,Feuil2!$A$1:$L$7,5,FALSE)","v":"HIVER"},{"$f":"VLOOKUP(B5,Feuil2!$A$1:$L$7,9,FALSE)","v":42787},"suspendu","MICHELIN","Voiture particulière",2055530,"ALPIN 20",105,"H","Non",3528706802751,"Hiver","C","B",null,92,{"$f":"MID(R5,1,1)&CHAR(MID(R5,2,1)+65)&CHAR(MID(R5,3,1)+IF(ISNA(MATCH(VALUE(MID(R5,1,1)),{0;1;2;3},0)),75,65))&CHAR(MID(R5,4,1)+IF(ISNA(MATCH(VALUE(MID(R5,1,1)),{0;4;7;8},0)),75,65))&CHAR(MID(R5,5,1)+IF(ISNA(MATCH(VALUE(MID(R5,1,1)),{0;1;4;5;9},0)),75,65))&CHAR(MID(R5,6,1)+IF(ISNA(MATCH(VALUE(MID(R5,1,1)),{0;2;5;6;7},0)),75,65))&CHAR(MID(R5,7,1)+IF(ISNA(MATCH(VALUE(MID(R5,1,1)),{1;4;6;8;9},0)),75,65))&\"*\"&CHAR(MID(R5,8,1)+97)&CHAR(MID(R5,9,1)+97)&CHAR(MID(R5,10,1)+97)&CHAR(MID(R5,11,1)+97)&CHAR(MID(R5,12,1)+97)&CHAR(MID(R5,13,1)+97)&\"+\"","v":"3FCSRKQ*iachfb+"},"30","4,73",152.35]
["2019-02-04",5555,{"$f":"VLOOKUP(B6,Feuil2!$A$1:$L$7,2,FALSE)","v":"AAA5"},{"$f":"VLOOKUP(B6,Feuil2!$A$1:$L$7,3,FALSE)","v":"GOOD"},{"$f":"VLOOKUP(B6,Feuil2!$A$1:$L$7,4,FALSE)","v":"FGFG"},{"$f":"VLOOKUP(B6,Feuil2!$A$1:$L$7,7,FALSE)","v":71858585},{"$f":"VLOOKUP(B6,Feuil2!$A$1:$L$7,8,FALSE)","v":"Camionnette/petit poids lourds"},{"$f":"VLOOKUP(B6,Feuil2!$A$1:$L$7,5,FALSE)","v":"HIVER"},{"$f":"VLOOKUP(B6,Feuil2!$A$1:$L$7,9,FALSE)","v":42787},"suspendu","MICHELIN","Voiture particulière",2055531,"ALPIN 21",106,"H","Non",3528706802752,"Hiver","C","B",null,93,{"$f":"MID(R6,1,1)&CHAR(MID(R6,2,1)+65)&CHAR(MID(R6,3,1)+IF(ISNA(MATCH(VALUE(MID(R6,1,1)),{0;1;2;3},0)),75,65))&CHAR(MID(R6,4,1)+IF(ISNA(MATCH(VALUE(MID(R6,1,1)),{0;4;7;8},0)),75,65))&CHAR(MID(R6,5,1)+IF(ISNA(MATCH(VALUE(MID(R6,1,1)),{0;1;4;5;9},0)),75,65))&CHAR(MID(R6,6,1)+IF(ISNA(MATCH(VALUE(MID(R6,1,1)),{0;2;5;6;7},0)),75,65))&CHAR(MID(R6,7,1)+IF(ISNA(MATCH(VALUE(MID(R6,1,1)),{1;4;6;8;9},0)),75,65))&\"*\"&CHAR(MID(R6,8,1)+97)&CHAR(MID(R6,9,1)+97)&CHAR(MID(R6,10,1)+97)&CHAR(MID(R6,11,1)+97)&CHAR(MID(R6,12,1)+97)&CHAR(MID(R6,13,1)+97)&\"+\"","v":"3FCSRKQ*iachfc+"},"31","4,73",154.76999999999998]
["2019-02-04",22222,{"$f":"VLOOKUP(B7,Feuil2!$A$1:$L$7,2,FALSE)","v":"AAA2"},{"$f":"VLOOKUP(B7,Feuil2!$A$1:$L$7,3,FALSE)","v":"FULD"},{"$f":"VLOOKUP(B7,Feuil2!$A$1:$L$7,4,FALSE)","v":"FVFV"},{"$f":"VLOOKUP(B7,Feuil2!$A$1:$L$7,7,FALSE)","v":71858585},{"$f":"VLOOKUP(B7,Feuil2!$A$1:$L$7,8,FALSE)","v":"Camionnette/petit poids lourds"},{"$f":"VLOOKUP(B7,Feuil2!$A$1:$L$7,5,FALSE)","v":"HIVER"},{"$f":"VLOOKUP(B7,Feuil2!$A$1:$L$7,9,FALSE)","v":43194},"suspendu","MICHELIN","Voiture particulière",2055532,"ALPIN 22",107,"H","Non",3528706802753,"Hiver","C","B",null,94,{"$f":"MID(R7,1,1)&CHAR(MID(R7,2,1)+65)&CHAR(MID(R7,3,1)+IF(ISNA(MATCH(VALUE(MID(R7,1,1)),{0;1;2;3},0)),75,65))&CHAR(MID(R7,4,1)+IF(ISNA(MATCH(VALUE(MID(R7,1,1)),{0;4;7;8},0)),75,65))&CHAR(MID(R7,5,1)+IF(ISNA(MATCH(VALUE(MID(R7,1,1)),{0;1;4;5;9},0)),75,65))&CHAR(MID(R7,6,1)+IF(ISNA(MATCH(VALUE(MID(R7,1,1)),{0;2;5;6;7},0)),75,65))&CHAR(MID(R7,7,1)+IF(ISNA(MATCH(VALUE(MID(R7,1,1)),{1;4;6;8;9},0)),75,65))&\"*\"&CHAR(MID(R7,8,1)+97)&CHAR(MID(R7,9,1)+97)&CHAR(MID(R7,10,1)+97)&CHAR(MID(R7,11,1)+97)&CHAR(MID(R7,12,1)+97)&CHAR(MID(R7,13,1)+97)&\"+\"","v":"3FCSRKQ*iachfd+"},"32","4,73",157.19]
["2019-02-04",4444,{"$f":"VLOOKUP(B8,Feuil2!$A$1:$L$7,2,FALSE)","v":"AAA4"},{"$f":"VLOOKUP(B8,Feuil2!$A$1:$L$7,3,FALSE)","v":"BL"},{"$f":"VLOOKUP(B8,Feuil2!$A$1:$L$7,4,FALSE)","v":"FGFG"},{"$f":"VLOOKUP(B8,Feuil2!$A$1:$L$7,7,FALSE)","v":71858585},{"$f":"VLOOKUP(B8,Feuil2!$A$1:$L$7,8,FALSE)","v":"Camionnette/petit poids lourds"},{"$f":"VLOOKUP(B8,Feuil2!$A$1:$L$7,5,FALSE)","v":"HIVR"},{"$f":"VLOOKUP(B8,Feuil2!$A$1:$L$7,9,FALSE)","v":42852},"suspendu","MICHELIN","Voiture particulière",2055533,"ALPIN 23",108,"H","Non",3528706802754,"Hiver","C","B",null,95,{"$f":"MID(R8,1,1)&CHAR(MID(R8,2,1)+65)&CHAR(MID(R8,3,1)+IF(ISNA(MATCH(VALUE(MID(R8,1,1)),{0;1;2;3},0)),75,65))&CHAR(MID(R8,4,1)+IF(ISNA(MATCH(VALUE(MID(R8,1,1)),{0;4;7;8},0)),75,65))&CHAR(MID(R8,5,1)+IF(ISNA(MATCH(VALUE(MID(R8,1,1)),{0;1;4;5;9},0)),75,65))&CHAR(MID(R8,6,1)+IF(ISNA(MATCH(VALUE(MID(R8,1,1)),{0;2;5;6;7},0)),75,65))&CHAR(MID(R8,7,1)+IF(ISNA(MATCH(VALUE(MID(R8,1,1)),{1;4;6;8;9},0)),75,65))&\"*\"&CHAR(MID(R8,8,1)+97)&CHAR(MID(R8,9,1)+97)&CHAR(MID(R8,10,1)+97)&CHAR(MID(R8,11,1)+97)&CHAR(MID(R8,12,1)+97)&CHAR(MID(R8,13,1)+97)&\"+\"","v":"3FCSRKQ*iachfe+"},"33","4,73",159.60999999999999]
["2019-02-04",666,{"$f":"VLOOKUP(B9,Feuil2!$A$1:$L$7,2,FALSE)","v":"bouillon"},{"$f":"VLOOKUP(B9,Feuil2!$A$1:$L$7,3,FALSE)","v":"ariane"},{"$f":"VLOOKUP(B9,Feuil2!$A$1:$L$7,4,FALSE)","v":"FGFG"},{"$f":"VLOOKUP(B9,Feuil2!$A$1:$L$7,7,FALSE)","v":71858585},{"$f":"VLOOKUP(B9,Feuil2!$A$1:$L$7,8,FALSE)","v":"Camionnette/petit poids lourds"},{"$f":"VLOOKUP(B9,Feuil2!$A$1:$L$7,5,FALSE)","v":"HIVER"},{"$f":"VLOOKUP(B9,Feuil2!$A$1:$L$7,9,FALSE)","v":42811},"suspendu","MICHELIN","Voiture particulière",2055534,"ALPIN 24",109,"H","Non",3528706802755,"Hiver","C","B",null,96,{"$f":"MID(R9,1,1)&CHAR(MID(R9,2,1)+65)&CHAR(MID(R9,3,1)+IF(ISNA(MATCH(VALUE(MID(R9,1,1)),{0;1;2;3},0)),75,65))&CHAR(MID(R9,4,1)+IF(ISNA(MATCH(VALUE(MID(R9,1,1)),{0;4;7;8},0)),75,65))&CHAR(MID(R9,5,1)+IF(ISNA(MATCH(VALUE(MID(R9,1,1)),{0;1;4;5;9},0)),75,65))&CHAR(MID(R9,6,1)+IF(ISNA(MATCH(VALUE(MID(R9,1,1)),{0;2;5;6;7},0)),75,65))&CHAR(MID(R9,7,1)+IF(ISNA(MATCH(VALUE(MID(R9,1,1)),{1;4;6;8;9},0)),75,65))&\"*\"&CHAR(MID(R9,8,1)+97)&CHAR(MID(R9,9,1)+97)&CHAR(MID(R9,10,1)+97)&CHAR(MID(R9,11,1)+97)&CHAR(MID(R9,12,1)+97)&CHAR(MID(R9,13,1)+97)&\"+\"","v":"3FCSRKQ*iachff+"},"34","4,73",162.03]
["2019-02-04",5555,{"$f":"VLOOKUP(B10,Feuil2!$A$1:$L$7,2,FALSE)","v":"AAA5"},{"$f":"VLOOKUP(B10,Feuil2!$A$1:$L$7,3,FALSE)","v":"GOOD"},{"$f":"VLOOKUP(B10,Feuil2!$A$1:$L$7,4,FALSE)","v":"FGFG"},{"$f":"VLOOKUP(B10,Feuil2!$A$1:$L$7,7,FALSE)","v":71858585},{"$f":"VLOOKUP(B10,Feuil2!$A$1:$L$7,8,FALSE)","v":"Camionnette/petit poids lourds"},{"$f":"VLOOKUP(B10,Feuil2!$A$1:$L$7,5,FALSE)","v":"HIVER"},{"$f":"VLOOKUP(B10,Feuil2!$A$1:$L$7,9,FALSE)","v":42787},"suspendu","MICHELIN","Voiture particulière",2055535,"ALPIN 25",110,"H","Non",3528706802756,"Hiver","C","B",null,97,{"$f":"MID(R10,1,1)&CHAR(MID(R10,2,1)+65)&CHAR(MID(R10,3,1)+IF(ISNA(MATCH(VALUE(MID(R10,1,1)),{0;1;2;3},0)),75,65))&CHAR(MID(R10,4,1)+IF(ISNA(MATCH(VALUE(MID(R10,1,1)),{0;4;7;8},0)),75,65))&CHAR(MID(R10,5,1)+IF(ISNA(MATCH(VALUE(MID(R10,1,1)),{0;1;4;5;9},0)),75,65))&CHAR(MID(R10,6,1)+IF(ISNA(MATCH(VALUE(MID(R10,1,1)),{0;2;5;6;7},0)),75,65))&CHAR(MID(R10,7,1)+IF(ISNA(MATCH(VALUE(MID(R10,1,1)),{1;4;6;8;9},0)),75,65))&\"*\"&CHAR(MID(R10,8,1)+97)&CHAR(MID(R10,9,1)+97)&CHAR(MID(R10,10,1)+97)&CHAR(MID(R10,11,1)+97)&CHAR(MID(R10,12,1)+97)&CHAR(MID(R10,13,1)+97)&\"+\"","v":"3FCSRKQ*iachfg+"},"35","4,73",164.45]
["2019-02-04",666,{"$f":"VLOOKUP(B11,Feuil2!$A$1:$L$7,2,FALSE)","v":"bouillon"},{"$f":"VLOOKUP(B11,Feuil2!$A$1:$L$7,3,FALSE)","v":"ariane"},{"$f":"VLOOKUP(B11,Feuil2!$A$1:$L$7,4,FALSE)","v":"FGFG"},{"$f":"VLOOKUP(B11,Feuil2!$A$1:$L$7,7,FALSE)","v":71858585},{"$f":"VLOOKUP(B11,Feuil2!$A$1:$L$7,8,FALSE)","v":"Camionnette/petit poids lourds"},{"$f":"VLOOKUP(B11,Feuil2!$A$1:$L$7,5,FALSE)","v":"HIVER"},{"$f":"VLOOKUP(B11,Feuil2!$A$1:$L$7,9,FALSE)","v":42811},"suspendu","MICHELIN","Voiture particulière",2055536,"ALPIN 26",111,"H","Non",3528706802757,"Hiver","C","B",null,98,{"$f":"MID(R11,1,1)&CHAR(MID(R11,2,1)+65)&CHAR(MID(R11,3,1)+IF(ISNA(MATCH(VALUE(MID(R11,1,1)),{0;1;2;3},0)),75,65))&CHAR(MID(R11,4,1)+IF(ISNA(MATCH(VALUE(MID(R11,1,1)),{0;4;7;8},0)),75,65))&CHAR(MID(R11,5,1)+IF(ISNA(MATCH(VALUE(MID(R11,1,1)),{0;1;4;5;9},0)),75,65))&CHAR(MID(R11,6,1)+IF(ISNA(MATCH(VALUE(MID(R11,1,1)),{0;2;5;6;7},0)),75,65))&CHAR(MID(R11,7,1)+IF(ISNA(MATCH(VALUE(MID(R11,1,1)),{1;4;6;8;9},0)),75,65))&\"*\"&CHAR(MID(R11,8,1)+97)&CHAR(MID(R11,9,1)+97)&CHAR(MID(R11,10,1)+97)&CHAR(MID(R11,11,1)+97)&CHAR(MID(R11,12,1)+97)&CHAR(MID(R11,13,1)+97)&\"+\"","v":"3FCSRKQ*iachfh+"},"36","4,73",166.86999999999998]
["2019-02-04",22222,{"$f":"VLOOKUP(B12,Feuil2!$A$1:$L$7,2,FALSE)","v":"AAA2"},{"$f":"VLOOKUP(B12,Feuil2!$A$1:$L$7,3,FALSE)","v":"FULD"},{"$f":"VLOOKUP(B12,Feuil2!$A$1:$L$7,4,FALSE)","v":"FVFV"},{"$f":"VLOOKUP(B12,Feuil2!$A$1:$L$7,7,FALSE)","v":71858585},{"$f":"VLOOKUP(B12,Feuil2!$A$1:$L$7,8,FALSE)","v":"Camionnette/petit poids lourds"},{"$f":"VLOOKUP(B12,Feuil2!$A$1:$L$7,5,FALSE)","v":"HIVER"},{"$f":"VLOOKUP(B12,Feuil2!$A$1:$L$7,9,FALSE)","v":43194},"suspendu","MICHELIN","Voiture particulière",2055537,"ALPIN 27",112,"H","Non",3528706802758,"Hiver","C","B",null,99,{"$f":"MID(R12,1,1)&CHAR(MID(R12,2,1)+65)&CHAR(MID(R12,3,1)+IF(ISNA(MATCH(VALUE(MID(R12,1,1)),{0;1;2;3},0)),75,65))&CHAR(MID(R12,4,1)+IF(ISNA(MATCH(VALUE(MID(R12,1,1)),{0;4;7;8},0)),75,65))&CHAR(MID(R12,5,1)+IF(ISNA(MATCH(VALUE(MID(R12,1,1)),{0;1;4;5;9},0)),75,65))&CHAR(MID(R12,6,1)+IF(ISNA(MATCH(VALUE(MID(R12,1,1)),{0;2;5;6;7},0)),75,65))&CHAR(MID(R12,7,1)+IF(ISNA(MATCH(VALUE(MID(R12,1,1)),{1;4;6;8;9},0)),75,65))&\"*\"&CHAR(MID(R12,8,1)+97)&CHAR(MID(R12,9,1)+97)&CHAR(MID(R12,10,1)+97)&CHAR(MID(R12,11,1)+97)&CHAR(MID(R12,12,1)+97)&CHAR(MID(R12,13,1)+97)&\"+\"","v":"3FCSRKQ*iachfi+"},"37","4,73",169.29]

{"sheet":" reception camion","index":1,"n_rows":3,"n_cols":28,"rows_kept":3,"cut":false,"hidden":false,"merged":[]}
["Date","entrer plaque","NOM","PRENOM","SOCIETE","TELEPHONE","TYPE VOITURE","remarque","REMARQUE","certifié","Marque","Véhicule","Taille","Type","LI","SI","Runflat","Code EAN","Saison","hhh","cc","hhh","Votre prix HT EUR","CODE  BARRE","DIMENSION POUCE","TAXE","CALCUL","REMIS  AU CLIENT "]
["2019-02-04",22222,"AAA2","FULD","FVFV",71858585,"Camionnette/petit poids lourds","HIVER",43194,"suspendu","MICHELIN","Voiture particulière",2055526,"ALPIN 16",101,"H","Non",3528706802747,"Hiver","C","B",null,88,"3FCSRKQ*iacheh+","26","4,73",142.66999999999999]
["2019-02-04",666,"bouillon","ariane","FGFG",71858585,"Camionnette/petit poids lourds","HIVER",42811,"suspendu","MICHELIN","Voiture particulière",2055529,"ALPIN 19",104,"H","Non",3528706802750,"Hiver","C","B",null,91,"3FCSRKQ*iachfa+","29","4,73",{"$error":"#VALUE!"}]

{"sheet":"reception luc","index":2,"n_rows":3,"n_cols":28,"rows_kept":3,"cut":false,"hidden":false,"merged":[]}
["Date","entrer plaque","NOM","PRENOM","SOCIETE","TELEPHONE","TYPE VOITURE","remarque","REMARQUE","certifié","Marque","Véhicule","Taille","Type","LI","SI","Runflat","Code EAN","Saison","hhh","cc","hhh","Votre prix HT EUR","CODE  BARRE","DIMENSION POUCE","TAXE","CALCUL","REMIS  AU CLIENT "]
["2019-02-04",22222,"AAA2","FULD","FVFV",71858585,"Camionnette/petit poids lourds","HIVER",43194,"oui","MICHELIN","Voiture particulière",2055524,"ALPIN 14",99,"H","Non",3528706802745,"Hiver","C","B",null,86,"3FCSRKQ*iachef+","24","4,73",137.82999999999998,"OUI"]
["2019-02-04",4444,"AAA4","BL","FGFG",71858585,"Camionnette/petit poids lourds","HIVR",42852,"oui","MICHELIN","Voiture particulière",2055527,"ALPIN 17",102,"H","Non",3528706802748,"Hiver","C","B",null,89,"3FCSRKQ*iachei+","27","4,73",{"$error":"#VALUE!"}]

{"sheet":"expedition","index":3,"n_rows":2,"n_cols":28,"rows_kept":2,"cut":false,"hidden":false,"merged":[]}
["Date","entrer plaque","NOM","PRENOM","SOCIETE","TELEPHONE","TYPE VOITURE","remarque","REMARQUE","certifié","Marque","Véhicule","Taille","Type","LI","SI","Runflat","Code EAN","Saison","hhh","cc","hhh","Votre prix HT EUR","CODE  BARRE","DIMENSION POUCE","TAXE","CALCUL","REMIS  AU CLIENT "]
["2019-02-04",5555,"AAA5","GOOD","FGFG",71858585,"Camionnette/petit poids lourds","HIVER",42787,"oui","MICHELIN","Voiture particulière",2055538,"ALPIN 28",113,"H","Non",3528706802759,"Hiver","C","B",null,100,"3FCSRKQ*iachfj+","38","4,73",171.70999999999998]

{"sheet":"Feuil2","index":4,"n_rows":8,"n_cols":12,"rows_kept":8,"cut":false,"hidden":false,"merged":[]}
["plaque","non","prenom","SOCIETE",null,"dimesnion","telephone","TYPE VOITURE"]
[1111111,"AAA1","ROAD","FFF","HIVER","215/55 R16 97V",71858585,"Voiture particulière","2016-04-22","P7E",null,0]
[22222,"AAA2","FULD","FVFV","HIVER","195/65 R15 91T",71858585,"Camionnette/petit poids lourds","2018-04-04","13B",75,0]
[3333,"AAA3","DUN","GFGF","HIVER","195/65 R15 91T",71858585,"Camionnette/petit poids lourds","2017-03-20","4A",55,0]
[4444,"AAA4","BL","FGFG","HIVR","195/65 R15 91T",71858585,"Camionnette/petit poids lourds","2017-04-27","19B",null,0]
[5555,"AAA5","GOOD","FGFG","HIVER","245/40 R18 97V",71858585,"Camionnette/petit poids lourds","2017-02-21","5E",null,0]
[666,"bouillon","ariane","FGFG","HIVER","185/65 R15 88T",71858585,"Camionnette/petit poids lourds","2017-03-17","CO2B",null,0]
[7777,"AAA7","FI","VGG","HIVER","165/70 R14 81T",71858585,"Camionnette/petit poids lourds","2015-04-04","P12D",null,0]