{"text_format":"1","workbook":"xlsx","n_sheets":5,"sheets":["commande"," reception camion","reception luc","Feuil2","Feuil4"],"not_rendered":{"charts":0,"images":3,"macros":1,"external_links":0,"defined_names":2,"comments":1,"pivot_tables":0},"unopened":[],"bounds":{"document_bytes":16777216,"sheet_cells":100000,"rows_first":2000,"rows_last":500,"rows_between":2000,"halvings":0,"cell_chars":16384,"cell_head_chars":4096},"cells_cut":0,"cells_raw":0,"read":"whole","date_system":"1900"}

{"sheet":"commande","index":0,"n_rows":12,"n_cols":26,"rows_kept":12,"cut":false,"hidden":false,"merged":[]}
["Date","entrer plaque","NOM","PRENOM","TELEPHONE","TYPE VOITURE","remarque","REMARQUE","certifié","Marque","Véhicule","Taille","Type","LI","SI","Runflat","Code EAN","Saison","hhh","cc","hhh","Votre prix HT EUR","CODE  BARRE","DIMENSION POUCE","TAXE","CALCUL"]
[null,"entrer plaque","NOM","PRENOM","TELEPHONE","TYPE VOITURE","remarque","REMARQUE","certifié","Marque","Véhicule","Taille","Type","LI","SI","Runflat","Code EAN","Saison",null,null,null,"Votre prix HT EUR","CODE  BARRE","DIMENSION POUCE","TAXE","CALCUL"]
[null,4444,{"$f":"VLOOKUP(B3,Feuil2!$A$1:$K$7,2,FALSE)","v":"AAA4"},{"$f":"VLOOKUP(B3,Feuil2!$A$1:$K$7,3,FALSE)","v":"BL"},{"$f":"VLOOKUP(B3,Feuil2!$A$1:$K$7,6,FALSE)","v":71858585},{"$f":"VLOOKUP(B3,Feuil2!$A$1:$K$7,7,FALSE)","v":"Camionnette/petit poids lourds"},{"$f":"VLOOKUP(B3,Feuil2!$A$1:$K$7,8,FALSE)","v":42852},{"$f":"VLOOKUP(B3,Feuil2!$A$1:$K$7,9,FALSE)","v":"19B"},"suspendu","MICHELIN","Voiture particulière",2055516,"ALPIN 6",91,"H","Non",3528706802737,"Hiver","C","B",null,78,{"$f":"MID(Q3,1,1)&CHAR(MID(Q3,2,1)+65)&CHAR(MID(Q3,3,1)+IF(ISNA(MATCH(VALUE(MID(Q3,1,1)),{0;1;2;3},0)),75,65))&CHAR(MID(Q3,4,1)+IF(ISNA(MATCH(VALUE(MID(Q3,1,1)),{0;4;7;8},0)),75,65))&CHAR(MID(Q3,5,1)+IF(ISNA(MATCH(VALUE(MID(Q3,1,1)),{0;1;4;5;9},0)),75,65))&CHAR(MID(Q3,6,1)+IF(ISNA(MATCH(VALUE(MID(Q3,1,1)),{0;2;5;6;7},0)),75,65))&CHAR(MID(Q3,7,1)+IF(ISNA(MATCH(VALUE(MID(Q3,1,1)),{1;4;6;8;9},0)),75,65))&\"*\"&CHAR(MID(Q3,8,1)+97)&CHAR(MID(Q3,9,1)+97)&CHAR(MID(Q3,10,1)+97)&CHAR(MID(Q3,11,1)+97)&CHAR(MID(Q3,12,1)+97)&CHAR(MID(Q3,13,1)+97)&\"+\"","v":"3FCSRKQ*iachdh+"},{"$f":"RIGHT(L3,2)","v":"16"},{"$f":"IF(F3=\"Camionnette/petit poids lourds\",\"4,73\",\"2.86\")","v":"4,73"},{"$f":"(((V3+X3)*0.21)+(V3+X3))+Y3","v":118.47}]
[null,5555,{"$f":"VLOOKUP(B4,Feuil2!$A$1:$K$7,2,FALSE)","v":"AAA5"},{"$f":"VLOOKUP(B4,Feuil2!$A$1:$K$7,3,FALSE)","v":"GOOD"},{"$f":"VLOOKUP(B4,Feuil2!$A$1:$K$7,6,FALSE)","v":71858585},{"$f":"VLOOKUP(B4,Feuil2!$A$1:$K$7,7,FALSE)","v":"Camionnette/petit poids lourds"},{"$f":"VLOOKUP(B4,Feuil2!$A$1:$K$7,8,FALSE)","v":42787},{"$f":"VLOOKUP(B4,Feuil2!$A$1:$K$7,9,FALSE)","v":"5E"},"suspendu",null,null,null,null,null,null,null,8711197756329,null,null,null,null,null,{"$f":"MID(Q4,1,1)&CHAR(MID(Q4,2,1)+65)&CHAR(MID(Q4,3,1)+IF(ISNA(MATCH(VALUE(MID(Q4,1,1)),{0;1;2;3},0)),75,65))&CHAR(MID(Q4,4,1)+IF(ISNA(MATCH(VALUE(MID(Q4,1,1)),{0;4;7;8},0)),75,65))&CHAR(MID(Q4,5,1)+IF(ISNA(MATCH(VALUE(MID(Q4,1,1)),{0;1;4;5;9},0)),75,65))&CHAR(MID(Q4,6,1)+IF(ISNA(MATCH(VALUE(MID(Q4,1,1)),{0;2;5;6;7},0)),75,65))&CHAR(MID(Q4,7,1)+IF(ISNA(MATCH(VALUE(MID(Q4,1,1)),{1;4;6;8;9},0)),75,65))&\"*\"&CHAR(MID(Q4,8,1)+97)&CHAR(MID(Q4,9,1)+97)&CHAR(MID(Q4,10,1)+97)&CHAR(MID(Q4,11,1)+97)&CHAR(MID(Q4,12,1)+97)&CHAR(MID(Q4,13,1)+97)&\"+\"","v":"8HLBLTH*hfgdcj+"},null,null,{"$f":"(((V4+X4)*0.21)+(V4+X4))+Y4","v":0}]
[null,666,{"$f":"VLOOKUP(B5,Feuil2!$A$1:$K$7,2,FALSE)","v":"bouillon"},{"$f":"VLOOKUP(B5,Feuil2!$A$1:$K$7,3,FALSE)","v":"ariane"},{"$f":"VLOOKUP(B5,Feuil2!$A$1:$K$7,6,FALSE)","v":71858585},{"$f":"VLOOKUP(B5,Feuil2!$A$1:$K$7,7,FALSE)","v":"Camionnette/petit poids lourds"},{"$f":"VLOOKUP(B5,Feuil2!$A$1:$K$7,8,FALSE)","v":42811},{"$f":"VLOOKUP(B5,Feuil2!$A$1:$K$7,9,FALSE)","v":"CO2B"},"suspendu",null,null,null,null,null,null,null,8711197756329,null,null,null,null,null,{"$f":"MID(Q5,1,1)&CHAR(MID(Q5,2,1)+65)&CHAR(MID(Q5,3,1)+IF(ISNA(MATCH(VALUE(MID(Q5,1,1)),{0;1;2;3},0)),75,65))&CHAR(MID(Q5,4,1)+IF(ISNA(MATCH(VALUE(MID(Q5,1,1)),{0;4;7;8},0)),75,65))&CHAR(MID(Q5,5,1)+IF(ISNA(MATCH(VALUE(MID(Q5,1,1)),{0;1;4;5;9},0)),75,65))&CHAR(MID(Q5,6,1)+IF(ISNA(MATCH(VALUE(MID(Q5,1,1)),{0;2;5;6;7},0)),75,65))&CHAR(MID(Q5,7,1)+IF(ISNA(MATCH(VALUE(MID(Q5,1,1)),{1;4;6;8;9},0)),75,65))&\"*\"&CHAR(MID(Q5,8,1)+97)&CHAR(MID(Q5,9,1)+97)&CHAR(MID(Q5,10,1)+97)&CHAR(MID(Q5,11,1)+97)&CHAR(MID(Q5,12,1)+97)&CHAR(MID(Q5,13,1)+97)&\"+\"","v":"8HLBLTH*hfgdcj+"},null,null,0]
[null,666,{"$f":"VLOOKUP(B6,Feuil2!$A$1:$K$7,2,FALSE)","v":"bouillon"},{"$f":"VLOOKUP(B6,Feuil2!$A$1:$K$7,3,FALSE)","v":"ariane"},{"$f":"VLOOKUP(B6,Feuil2!$A$1:$K$7,6,FALSE)","v":71858585},{"$f":"VLOOKUP(B6,Feuil2!$A$1:$K$7,7,FALSE)","v":"Camionnette/petit poids lourds"},{"$f":"VLOOKUP(B6,Feuil2!$A$1:$K$7,8,FALSE)","v":42811},{"$f":"VLOOKUP(B6,Feuil2!$A$1:$K$7,9,FALSE)","v":"CO2B"},"suspendu",null,null,null,null,null,null,null,8711197756329,null,null,null,null,null,{"$f":"MID(Q6,1,1)&CHAR(MID(Q6,2,1)+65)&CHAR(MID(Q6,3,1)+IF(ISNA(MATCH(VALUE(MID(Q6,1,1)),{0;1;2;3},0)),75,65))&CHAR(MID(Q6,4,1)+IF(ISNA(MATCH(VALUE(MID(Q6,1,1)),{0;4;7;8},0)),75,65))&CHAR(MID(Q6,5,1)+IF(ISNA(MATCH(VALUE(MID(Q6,1,1)),{0;1;4;5;9},0)),75,65))&CHAR(MID(Q6,6,1)+IF(ISNA(MATCH(VALUE(MID(Q6,1,1)),{0;2;5;6;7},0)),75,65))&CHAR(MID(Q6,7,1)+IF(ISNA(MATCH(VALUE(MID(Q6,1,1)),{1;4;6;8;9},0)),75,65))&\"*\"&CHAR(MID(Q6,8,1)+97)&CHAR(MID(Q6,9,1)+97)&CHAR(MID(Q6,10,1)+97)&CHAR(MID(Q6,11,1)+97)&CHAR(MID(Q6,12,1)+97)&CHAR(MID(Q6,13,1)+97)&\"+\"","v":"8HLBLTH*hfgdcj+"},null,null,0]
[null,666,{"$f":"VLOOKUP(B7,Feuil2!$A$1:$K$7,2,FALSE)","v":"bouillon"},{"$f":"VLOOKUP(B7,Feuil2!$A$1:$K$7,3,FALSE)","v":"ariane"},{"$f":"VLOOKUP(B7,Feuil2!$A$1:$K$7,6,FALSE)","v":71858585},{"$f":"VLOOKUP(B7,Feuil2!$A$1:$K$7,7,FALSE)","v":"Camionnette/petit poids lourds"},{"$f":"VLOOKUP(B7,Feuil2!$A$1:$K$7,8,FALSE)","v":42811},{"$f":"VLOOKUP(B7,Feuil2!$A$1:$K$7,9,FALSE)","v":"CO2B"},"suspendu",null,null,null,null,null,null,null,8711197756329,null,null,null,null,null,{"$f":"MID(Q7,1,1)&CHAR(MID(Q7,2,1)+65)&CHAR(MID(Q7,3,1)+IF(ISNA(MATCH(VALUE(MID(Q7,1,1)),{0;1;2;3},0)),75,65))&CHAR(MID(Q7,4,1)+IF(ISNA(MATCH(VALUE(MID(Q7,1,1)),{0;4;7;8},0)),75,65))&CHAR(MID(Q7,5,1)+IF(ISNA(MATCH(VALUE(MID(Q7,1,1)),{0;1;4;5;9},0)),75,65))&CHAR(MID(Q7,6,1)+IF(ISNA(MATCH(VALUE(MID(Q7,1,1)),{0;2;5;6;7},0)),75,65))&CHAR(MID(Q7,7,1)+IF(ISNA(MATCH(VALUE(MID(Q7,1,1)),{1;4;6;8;9},0)),75,65))&\"*\"&CHAR(MID(Q7,8,1)+97)&CHAR(MID(Q7,9,1)+97)&CHAR(MID(Q7,10,1)+97)&CHAR(MID(Q7,11,1)+97)&CHAR(MID(Q7,12,1)+97)&CHAR(MID(Q7,13,1)+97)&\"+\"","v":"8HLBLTH*hfgdcj+"},null,null,{"$f":"(((V7+X7)*0.21)+(V7+X7))+Y7","v":0}]
[null,666,{"$f":"VLOOKUP(B8,Feuil2!$A$1:$K$7,2,FALSE)","v":"bouillon"},{"$f":"VLOOKUP(B8,Feuil2!$A$1:$K$7,3,FALSE)","v":"ariane"},{"$f":"VLOOKUP(B8,Feuil2!$A$1:$K$7,6,FALSE)","v":71858585},{"$f":"VLOOKUP(B8,Feuil2!$A$1:$K$7,7,FALSE)","v":"Camionnette/petit poids lourds"},{"$f":"VLOOKUP(B8,Feuil2!$A$1:$K$7,8,FALSE)","v":42811},{"$f":"VLOOKUP(B8,Feuil2!$A$1:$K$7,9,FALSE)","v":"CO2B"},"suspendu",null,null,null,null,null,null,null,5600380892773,null,null,null,null,null,{"$f":"MID(Q8,1,1)&CHAR(MID(Q8,2,1)+65)&CHAR(MID(Q8,3,1)+IF(ISNA(MATCH(VALUE(MID(Q8,1,1)),{0;1;2;3},0)),75,65))&CHAR(MID(Q8,4,1)+IF(ISNA(MATCH(VALUE(MID(Q8,1,1)),{0;4;7;8},0)),75,65))&CHAR(MID(Q8,5,1)+IF(ISNA(MATCH(VALUE(MID(Q8,1,1)),{0;1;4;5;9},0)),75,65))&CHAR(MID(Q8,6,1)+IF(ISNA(MATCH(VALUE(MID(Q8,1,1)),{0;2;5;6;7},0)),75,65))&CHAR(MID(Q8,7,1)+IF(ISNA(MATCH(VALUE(MID(Q8,1,1)),{1;4;6;8;9},0)),75,65))&\"*\"&CHAR(MID(Q8,8,1)+97)&CHAR(MID(Q8,9,1)+97)&CHAR(MID(Q8,10,1)+97)&CHAR(MID(Q8,11,1)+97)&CHAR(MID(Q8,12,1)+97)&CHAR(MID(Q8,13,1)+97)&\"+\"","v":"5GKKDIK*ijchhd+"},null,null,0]
[null,666,{"$f":"VLOOKUP(B9,Feuil2!$A$1:$K$7,2,FALSE)","v":"bouillon"},{"$f":"VLOOKUP(B9,Feuil2!$A$1:$K$7,3,FALSE)","v":"ariane"},{"$f":"VLOOKUP(B9,Feuil2!$A$1:$K$7,6,FALSE)","v":71858585},{"$f":"VLOOKUP(B9,Feuil2!$A$1:$K$7,7,FALSE)","v":"Camionnette/petit poids lourds"},{"$f":"VLOOKUP(B9,Feuil2!$A$1:$K$7,8,FALSE)","v":42811},{"$f":"VLOOKUP(B9,Feuil2!$A$1:$K$7,9,FALSE)","v":"CO2B"},"suspendu",null,null,null,null,null,null,null,8711197756329,null,null,null,null,null,{"$f":"MID(Q9,1,1)&CHAR(MID(Q9,2,1)+65)&CHAR(MID(Q9,3,1)+IF(ISNA(MATCH(VALUE(MID(Q9,1,1)),{0;1;2;3},0)),75,65))&CHAR(MID(Q9,4,1)+IF(ISNA(MATCH(VALUE(MID(Q9,1,1)),{0;4;7;8},0)),75,65))&CHAR(MID(Q9,5,1)+IF(ISNA(MATCH(VALUE(MID(Q9,1,1)),{0;1;4;5;9},0)),75,65))&CHAR(MID(Q9,6,1)+IF(ISNA(MATCH(VALUE(MID(Q9,1,1)),{0;2;5;6;7},0)),75,65))&CHAR(MID(Q9,7,1)+IF(ISNA(MATCH(VALUE(MID(Q9,1,1)),{1;4;6;8;9},0)),75,65))&\"*\"&CHAR(MID(Q9,8,1)+97)&CHAR(MID(Q9,9,1)+97)&CHAR(MID(Q9,10,1)+97)&CHAR(MID(Q9,11,1)+97)&CHAR(MID(Q9,12,1)+97)&CHAR(MID(Q9,13,1)+97)&\"+\"","v":"8HLBLTH*hfgdcj+"},null,null,0]
[null,666,{"$f":"VLOOKUP(B10,Feuil2!$A$1:$K$7,2,FALSE)","v":"bouillon"},{"$f":"VLOOKUP(B10,Feuil2!$A$1:$K$7,3,FALSE)","v":"ariane"},{"$f":"VLOOKUP(B10,Feuil2!$A$1:$K$7,6,FALSE)","v":71858585},{"$f":"VLOOKUP(B10,Feuil2!$A$1:$K$7,7,FALSE)","v":"Camionnette/petit poids lourds"},{"$f":"VLOOKUP(B10,Feuil2!$A$1:$K$7,8,FALSE)","v":42811},{"$f":"VLOOKUP(B10,Feuil2!$A$1:$K$7,9,FALSE)","v":"CO2B"},"suspendu",null,null,null,null,null,null,null,5600380892773,null,null,null,null,null,{"$f":"MID(Q10,1,1)&CHAR(MID(Q10,2,1)+65)&CHAR(MID(Q10,3,1)+IF(ISNA(MATCH(VALUE(MID(Q10,1,1)),{0;1;2;3},0)),75,65))&CHAR(MID(Q10,4,1)+IF(ISNA(MATCH(VALUE(MID(Q10,1,1)),{0;4;7;8},0)),75,65))&CHAR(MID(Q10,5,1)+IF(ISNA(MATCH(VALUE(MID(Q10,1,1)),{0;1;4;5;9},0)),75,65))&CHAR(MID(Q10,6,1)+IF(ISNA(MATCH(VALUE(MID(Q10,1,1)),{0;2;5;6;7},0)),75,65))&CHAR(MID(Q10,7,1)+IF(ISNA(MATCH(VALUE(MID(Q10,1,1)),{1;4;6;8;9},0)),75,65))&\"*\"&CHAR(MID(Q10,8,1)+97)&CHAR(MID(Q10,9,1)+97)&CHAR(MID(Q10,10,1)+97)&CHAR(MID(Q10,11,1)+97)&CHAR(MID(Q10,12,1)+97)&CHAR(MID(Q10,13,1)+97)&\"+\"","v":"5GKKDIK*ijchhd+"},null,null,0]
[null,666,{"$f":"VLOOKUP(B11,Feuil2!$A$1:$K$7,2,FALSE)","v":"bouillon"},{"$f":"VLOOKUP(B11,Feuil2!$A$1:$K$7,3,FALSE)","v":"ariane"},{"$f":"VLOOKUP(B11,Feuil2!$A$1:$K$7,6,FALSE)","v":71858585},{"$f":"VLOOKUP(B11,Feuil2!$A$1:$K$7,7,FALSE)","v":"Camionnette/petit poids lourds"},{"$f":"VLOOKUP(B11,Feuil2!$A$1:$K$7,8,FALSE)","v":42811},{"$f":"VLOOKUP(B11,Feuil2!$A$1:$K$7,9,FALSE)","v":"CO2B"},"suspendu",null,null,null,null,null,null,null,8711197756329,null,null,null,null,null,{"$f":"MID(Q11,1,1)&CHAR(MID(Q11,2,1)+65)&CHAR(MID(Q11,3,1)+IF(ISNA(MATCH(VALUE(MID(Q11,1,1)),{0;1;2;3},0)),75,65))&CHAR(MID(Q11,4,1)+IF(ISNA(MATCH(VALUE(MID(Q11,1,1)),{0;4;7;8},0)),75,65))&CHAR(MID(Q11,5,1)+IF(ISNA(MATCH(VALUE(MID(Q11,1,1)),{0;1;4;5;9},0)),75,65))&CHAR(MID(Q11,6,1)+IF(ISNA(MATCH(VALUE(MID(Q11,1,1)),{0;2;5;6;7},0)),75,65))&CHAR(MID(Q11,7,1)+IF(ISNA(MATCH(VALUE(MID(Q11,1,1)),{1;4;6;8;9},0)),75,65))&\"*\"&CHAR(MID(Q11,8,1)+97)&CHAR(MID(Q11,9,1)+97)&CHAR(MID(Q11,10,1)+97)&CHAR(MID(Q11,11,1)+97)&CHAR(MID(Q11,12,1)+97)&CHAR(MID(Q11,13,1)+97)&\"+\"","v":"8HLBLTH*hfgdcj+"},null,null,0]
[null,666,{"$f":"VLOOKUP(B12,Feuil2!$A$1:$K$7,2,FALSE)","v":"bouillon"},{"$f":"VLOOKUP(B12,Feuil2!$A$1:$K$7,3,FALSE)","v":"ariane"},{"$f":"VLOOKUP(B12,Feuil2!$A$1:$K$7,6,FALSE)","v":71858585},{"$f":"VLOOKUP(B12,Feuil2!$A$1:$K$7,7,FALSE)","v":"Camionnette/petit poids lourds"},{"$f":"VLOOKUP(B12,Feuil2!$A$1:$K$7,8,FALSE)","v":42811},{"$f":"VLOOKUP(B12,Feuil2!$A$1:$K$7,9,FALSE)","v":"CO2B"},"suspendu",null,null,null,null,null,null,null,5600380892773,null,null,null,null,null,{"$f":"MID(Q12,1,1)&CHAR(MID(Q12,2,1)+65)&CHAR(MID(Q12,3,1)+IF(ISNA(MATCH(VALUE(MID(Q12,1,1)),{0;1;2;3},0)),75,65))&CHAR(MID(Q12,4,1)+IF(ISNA(MATCH(VALUE(MID(Q12,1,1)),{0;4;7;8},0)),75,65))&CHAR(MID(Q12,5,1)+IF(ISNA(MATCH(VALUE(MID(Q12,1,1)),{0;1;4;5;9},0)),75,65))&CHAR(MID(Q12,6,1)+IF(ISNA(MATCH(VALUE(MID(Q12,1,1)),{0;2;5;6;7},0)),75,65))&CHAR(MID(Q12,7,1)+IF(ISNA(MATCH(VALUE(MID(Q12,1,1)),{1;4;6;8;9},0)),75,65))&\"*\"&CHAR(MID(Q12,8,1)+97)&CHAR(MID(Q12,9,1)+97)&CHAR(MID(Q12,10,1)+97)&CHAR(MID(Q12,11,1)+97)&CHAR(MID(Q12,12,1)+97)&CHAR(MID(Q12,13,1)+97)&\"+\"","v":"5GKKDIK*ijchhd+"},null,null,0]

{"sheet":" reception camion","index":1,"n_rows":4,"n_cols":26,"rows_kept":4,"cut":false,"hidden":false,"merged":[]}
["Date","entrer plaque","NOM","PRENOM","TELEPHONE","TYPE VOITURE","remarque","REMARQUE","certifié","Marque","Véhicule","Taille","Type","LI","SI","Runflat","Code EAN","Saison","hhh","cc","hhh","Votre prix HT EUR","CODE  BARRE","DIMENSION POUCE","TAXE","CALCUL"]
[null,666,"bouillon","ariane",71858585,"Camionnette/petit poids lourds",42811,"CO2B","suspendu",null,null,null,null,null,null,null,5600380892773,null,null,null,null,null,"5GKKDIK*ijchhd+",null,null,0]
[null,666,"bouillon","ariane",71858585,"Camionnette/petit poids lourds",42811,"CO2B","suspendu",null,null,null,null,null,null,null,5600380892773,null,null,null,null,null,"5GKKDIK*ijchhd+",null,null,0]
[null,666,"bouillon","ariane",71858585,"Camionnette/petit poids lourds",42811,"CO2B","suspendu",null,null,null,null,null,null,null,5600380892773,null,null,null,null,null,"5GKKDIK*ijchhd+",null,null,0]

{"sheet":"reception luc","index":2,"n_rows":1,"n_cols":26,"rows_kept":1,"cut":false,"hidden":false,"merged":[]}
["Date","entrer plaque","NOM","PRENOM","TELEPHONE","TYPE VOITURE","remarque","REMARQUE","certifié","Marque","Véhicule","Taille","Type","LI","SI","Runflat","Code EAN","Saison","hhh","cc","hhh","Votre prix HT EUR","CODE  BARRE","DIMENSION POUCE","TAXE","CALCUL"]

{"sheet":"Feuil2","index":3,"n_rows":8,"n_cols":11,"rows_kept":8,"cut":false,"hidden":false,"merged":[]}
["plaque","non","prenom",null,"dimesnion","telephone","TYPE VOITURE"]
[1111111,"AAA1","ROAD","HIVER","215/55 R16 97V",71858585,"Voiture particulière","2016-04-22","P7E",null,0]
[22222,"AAA2","FULD","HIVER","195/65 R15 91T",71858585,"Camionnette/petit poids lourds","2018-04-04","13B",75,0]
[3333,"AAA3","DUN","HIVER","195/65 R15 91T",71858585,"Camionnette/petit poids lourds","2017-03-20","4A",55,0]
[4444,"AAA4","BL","HIVR","195/65 R15 91T",71858585,"Camionnette/petit poids lourds","2017-04-27","19B",null,0]
[5555,"AAA5","GOOD","HIVER","245/40 R18 97V",71858585,"Camionnette/petit poids lourds","2017-02-21","5E",null,0]
[666,"bouillon","ariane","HIVER","185/65 R15 88T",71858585,"Camionnette/petit poids lourds","2017-03-17","CO2B",null,0]
[7777,"AAA7","FI","HIVER","165/70 R14 81T",71858585,"Camionnette/petit poids lourds","2015-04-04","P12D",null,0]

{"sheet":"Feuil4","index":4,"n_rows":9,"n_cols":14,"rows_kept":9,"cut":false,"hidden":false,"merged":[]}
["code barre","code ean","dimension","plaque","nom ","telephone","reprise dimension","choix taxe","prix ttc","entrer code ean","entrer plaque"]
["3FCSRKM*dgfejg+",{"$f":"J2","v":3528702365496},"155/80TR13","1-EHB-965","ADJUST","02/655,63,00",16,4.7699999999999996,{"$f":"(G2+(G2*0.21))+H2","v":24.13},3528702365496,"1-EHB-965"]
[null,null,null,null,null,null,null,null,null,null,null,null,15,2.86]
[null,null,null,null,null,null,null,null,null,null,null,null,16,4.7699999999999996]
[null,null,null,null,null,null,null,null,null,null,null,null,17]
[null,null,null,null,null,null,null,null,null,null,null,null,18]
[null,null,null,null,null,null,null,null,null,null,null,null,19]
[null,null,null,null,null,null,null,null,null,null,null,null,20]
[null,null,null,null,null,null,null,null,null,null,null,null,21]