{"text_format":"1","workbook":"xlsx","n_sheets":7,"sheets":["Feuil1","Feuil2","Accueil","Liste","Présence","Vote","Emploi"],"not_rendered":{"charts":0,"images":10,"macros":1,"external_links":0,"defined_names":5,"comments":0,"pivot_tables":0},"unopened":[],"bounds":{"document_bytes":16777216,"sheet_cells":100000,"rows_first":2000,"rows_last":500,"rows_between":2000,"halvings":0,"cell_chars":16384,"cell_head_chars":4096},"cells_cut":0,"cells_raw":0,"read":"whole","date_system":"1900"}

{"sheet":"Feuil1","index":0,"n_rows":50,"n_cols":23,"rows_kept":50,"cut":false,"hidden":true,"merged":[[16,13,16,14],[44,5,47,7]]}
[]
[]
[]
[null,null,null,null,null,null,null,null,null,null,null,null,null,null,null,null,null,"Répartioitn des representés entre les présents"]
["rang",null,"Tantièmes",2018,null,2017,null,2016,null,null,{"$f":"C5","v":"Tantièmes"},"Présents",null,"Porteur max","%","Acquis",null,"Autrre calcul répartition representés ",null,null,"Dugied 2"]
[{"$f":"RANK(C6,C$6:C$44)","v":22},null,250,"Azemard",null,{"$f":"D6","v":"Azemard"},null,{"$f":"D6","v":"Azemard"},null,null,{"$f":"C6","v":250},{"$f":"SUM(K6:K16)","v":3641},null,{"$f":"C6+ROUND(L$19,0)","v":484},{"$f":"N6/N$18","v":7.5050395410141107E-2},null,null,{"$f":"C6+M$19","v":509},{"$f":"R6/(L$6+L$18)","v":7.8428351309707239E-2},null,{"$f":"ROUND(C6+M$20,0)","v":487},{"$f":"U6/(L$6+L$18)","v":7.5038520801232661E-2}]
[3,null,434,"Barthes",null,"Barthes",null,"Barthes",3,null,{"$f":"C7","v":434},null,null,{"$f":"C7+ROUND(L$19,0)","v":668},{"$f":"N7/N$18","v":0.10358195069002946},null,null,{"$f":"C7+M$19","v":693},{"$f":"R7/(L$6+L$18)","v":0.10677966101694915},null,{"$f":"ROUND(C7+M$20,0)","v":671},{"$f":"U7/(L$6+L$18)","v":0.10338983050847457}]
[4,null,406,"Boituzat",null,{"$f":"D8","v":"Boituzat"},null,"Boituzat",3,null,406,null,null,640,9.9240192277872535E-2,null,null,665,0.1024653312788906,null,643,9.907550077041602E-2]
[9,null,323,"Carayol",null,"Carayol",null,"Carayol",3,null,323,null,null,557,8.6369979841835948E-2,null,null,582,8.9676425269645615E-2,null,560,8.6286594761171037E-2]
[16,null,281,"Diconne",null,"Diconne",null,"Diconne",3,null,281,null,null,515,7.9857342223600553E-2,null,null,540,8.3204930662557783E-2,null,518,7.9815100154083204E-2]
[13,null,306,"Hamelin",null,"Hamelin",null,"Hamelin",3,null,306,null,null,540,8.3733912234454949E-2,{"$f":"O11","v":8.3733912234454949E-2},null,565,8.705701078582434E-2,{"$f":"S11","v":8.705701078582434E-2},543,8.3667180277349776E-2,{"$f":"V11","v":8.3667180277349776E-2}]
[5,null,379,"Ortega",null,"Ortega",null,"Ortega",2,null,379,null,null,613,9.5053496666149789E-2,null,null,638,9.8305084745762716E-2,null,616,9.4915254237288138E-2]
[14,null,301,"Cvautravers",null,"Cvautravers",null,"Cvautravers",3,null,301,null,null,535,8.2958598232284075E-2,null,null,560,8.6286594761171037E-2,null,538,8.2896764252696459E-2]
[30,null,209,"Villard Toddi",null,"Villard Toddi",null,"Villard Toddi",2,null,209,null,null,443,6.8692820592339901E-2,null,null,468,7.2110939907550076E-2,null,446,6.8721109399075497E-2]
[12,null,308,"Vivona",null,"Vivona",null,"Vivona",3,null,308,null,null,542,8.4044037835323313E-2,{"$f":"O15","v":8.4044037835323313E-2},null,567,8.7365177195685664E-2,{"$f":"S15","v":8.7365177195685664E-2},545,8.39753466872111E-2,{"$f":"V15","v":8.39753466872111E-2}]
[2,null,444,"Dugied",null,null,null,null,null,null,444,null,null,{"$f":"C16+2*ROUND(L$19,0)","v":912},0.14141727399596837,{"$f":"O16","v":0.14141727399596837},null,703,0.10832049306625578,{"$f":"S16","v":0.10832049306625578},681,0.1049306625577812,{"$f":"V16","v":0.1049306625577812}]
[35,null,43,"Catteau",null,{"$f":"D17","v":"Catteau"},null,{"$f":"D17","v":"Catteau"},1,null,null,"Representés","Max 10%","Total Porteur max",null,null,null,{"$f":"SUM(R6:S16)","v":6490.9999999999991},{"$f":"SUM(S6:S16)","v":1},null,280]
[10,null,321,"CA",null,"CA",null,{"$f":"D18","v":"CA"},null,3,321,{"$f":"SUM(K17:K31)","v":2849},{"$f":"10%*C45","v":992.2},{"$f":"SUM(N6:N16)","v":6449},{"$f":"SUM(O6:O16)","v":1},{"$f":"SUM(P6:P16)","v":0.30919522406574662},null,{"$f":"R17-(L6+L18)","v":0.99999999999909051},null,{"$f":"SUM(T6:T16)","v":0.28274268104776579},null,null,{"$f":"SUM(W6:W16)","v":0.27257318952234211}]
[15,null,285,"Decarne",null,"Decarne",null,{"$f":"D19","v":"Decarne"},null,3,285,{"$f":"AVERAGE(C17:C31)","v":234.06666666666666},{"$f":"L18/COUNT(C6:C16)","v":259}]
[23,null,249,"Desbordes",null,"Desbordes",null,{"$f":"D20","v":"Desbordes"},null,3,249,"Moyenne",{"$f":"L18/((COUNT(C6:C16)+1))","v":237.41666666666666}]
[6,null,353,"Fraval",null,"Fraval",null,{"$f":"D21","v":"Fraval"}]
[36,null,36,"Gallard Justeau",null,"Gallard Justeau"]
[27,null,218,"Gerbaud",null,"Gerbaud",null,{"$f":"D23","v":"Gerbaud"},null,2,218]
[24,null,245,"Hugo",null,"Hugo",null,"Hugo",null,3,245]
[26,null,230,"Mandrile",null,"Mandrile",null,"Mandrile"]
[33,null,187,"Martinez",null,"Martinez",null,"Martinez",null,3,187]
[8,null,337,"Morana",null,"Morana",null,"Morana",null,3,337]
[21,null,264,"Morana P",null,"Morana P",null,"Morana P",null,3,264]
[18,null,265,"Ortega",null,"Ortega",null,"Ortega",null,2,265]
[17,null,268,"Segura Mari",null,"Segura Mari",null,"Segura Mari",null,3,268]
[29,null,210,"Simoncini",null,"Simoncini",null,"Simoncini",null,2,210]
[38,null,7,"Berthezene",null,"Berthezene",null,"Berthezene"]
[1,null,633,"DKS",null,"DKS",null,"DKS"]
[38,null,7,"Fadda",null,"Fadda",null,"Fadda"]
[31,null,202,"Leveau",null,"Leveau"]
[28,null,214,"Megie",null,"Megie",null,{"$f":"D36","v":"Megie"}]
[7,null,340,"Morana AM",null,"Morana AM",null,{"$f":"D37","v":"Morana AM"}]
[18,null,265,"Morana L",null,"Morana L",null,{"$f":"D38","v":"Morana L"}]
[32,null,201,"Optimo",null,"Optimo",null,{"$f":"D39","v":"Optimo"}]
[34,null,51,"Piochot",null,"Piochot"]
[11,null,317,"Pouillot",null,"Pouillot",null,{"$f":"D41","v":"Pouillot"}]
[18,null,265,"Ramirez",null,"Ramirez",null,{"$f":"D42","v":"Ramirez"}]
[24,null,245,"Ventajou",null,"Ventajou",null,{"$f":"D43","v":"Ventajou"}]
[37,null,23,"Vernet",null,"Vernet",null,{"$f":"D44","v":"Vernet"}]
[null,null,{"$f":"SUM(C6:C44)","v":9922},null,null,"Présences durant les AG"]
[null,null,"Rouge","Abs sans pouvoir"]
[null,null,"Vert","Pouvoir"]
[null,null,"Noir","Présent"]
[]
[null,"Nombre lots ou copropriétaires : ",null,null,{"$f":"COUNT(A6:A44)","v":39}]

{"sheet":"Feuil2","index":1,"n_rows":47,"n_cols":12,"rows_kept":47,"cut":false,"hidden":true,"merged":[[13,11,27,11],[2,11,12,11],[43,2,43,3],[13,9,27,9],[13,10,27,10],[2,9,12,9],[2,10,12,10],[28,10,40,10],[28,9,40,9]]}
[]
[null,"Tantièmes","Nom",null,"Tantièmes","Nom",null,"Tantièmes","Nom"]
[null,250,"Azemard",null,7,"Berthezene",null,250,"Azemard",{"$f":"SUM(H3:H13)","v":3641},{"$f":"J3/B42","v":0.36696230598669621},{"$f":"COUNT(H3:H13)","v":11}]
[null,434,"Barthes",null,7,"Fadda",null,434,"Barthes"]
[null,7,"Berthezene",null,23,"Vernet",null,406,"Boituzat"]
[null,406,"Boituzat",null,36,"Gallard Justeau",null,323,"Carayol"]
[null,321,"CA",null,43,"Catteau",null,301,"Cvautravers"]
[null,323,"Carayol",null,51,"Piochot",null,281,"Diconne"]
[null,43,"Catteau",null,187,"Martinez",null,444,"Dugied"]
[null,301,"Cvautravers",null,201,"Optimo",null,306,"Hamelin"]
[null,285,"Decarne",null,202,"Leveau",null,379,"Ortega"]
[null,249,"Desbordes",null,209,"Villard Toddi",null,209,"Villard Toddi"]
[null,281,"Diconne",null,210,"Simoncini",null,308,"Vivona"]
[null,633,"DKS",null,214,"Megie",null,321,"CA",{"$f":"SUM(H14:H28)","v":3511},{"$f":"J14/B42","v":0.35386010884902236},{"$f":"COUNT(H14:H28)","v":15}]
[null,444,"Dugied",null,218,"Gerbaud",null,43,"Catteau"]
[null,7,"Fadda",null,230,"Mandrile",null,285,"Decarne"]
[null,353,"Fraval",null,245,"Hugo",null,249,"Desbordes"]
[null,36,"Gallard Justeau",null,245,"Ventajou",null,353,"Fraval"]
[null,218,"Gerbaud",null,249,"Desbordes",null,36,"Gallard Justeau"]
[null,306,"Hamelin",null,250,"Azemard",null,218,"Gerbaud"]
[null,245,"Hugo",null,264,"Morana P",null,245,"Hugo"]
[null,202,"Leveau",null,265,"Morana L",null,230,"Mandrile"]
[null,230,"Mandrile",null,265,"Ortega",null,187,"Martinez"]
[null,187,"Martinez",null,265,"Ramirez",null,337,"Morana"]
[null,214,"Megie",null,268,"Segura Mari",null,264,"Morana P"]
[null,337,"Morana",null,281,"Diconne",null,265,"Ortega"]
[null,340,"Morana AM",null,285,"Decarne",null,268,"Segura Mari"]
[null,265,"Morana L",null,301,"Cvautravers",null,210,"Simoncini"]
[null,264,"Morana P",null,306,"Hamelin",null,7,"Berthezene",{"$f":"SUM(H29:H41)","v":2770},{"$f":"J29/B42","v":0.27917758516428137}]
[null,201,"Optimo",null,308,"Vivona",null,633,"DKS"]
[null,379,"Ortega",null,317,"Pouillot",null,7,"Fadda"]
[null,265,"Ortega",null,321,"CA",null,202,"Leveau"]
[null,51,"Piochot",null,323,"Carayol",null,214,"Megie"]
[null,317,"Pouillot",null,337,"Morana",null,340,"Morana AM"]
[null,265,"Ramirez",null,340,"Morana AM",null,265,"Morana L"]
[null,268,"Segura Mari",null,353,"Fraval",null,201,"Optimo"]
[null,210,"Simoncini",null,379,"Ortega",null,51,"Piochot"]
[null,245,"Ventajou",null,406,"Boituzat",null,317,"Pouillot"]
[null,23,"Vernet",null,434,"Barthes",null,265,"Ramirez"]
[null,209,"Villard Toddi",null,444,"Dugied",null,245,"Ventajou"]
[null,308,"Vivona",null,633,"DKS",null,23,"Vernet"]
[null,{"$f":"SUM(B3:B41)","v":9922}]
[]
[null,{"$f":"B41+B20+B17+B15","v":1411},"Acquis",null,"hors abs",null,null,{"$f":"SUM(H29:H41)","v":2770},"abs"]
[null,null,{"$f":"B44/B42","v":0.14220923200967547},null,{"$f":"B44/(B42-H44)","v":0.19728747203579419}]
[]
[null,null,{"$f":"C11","v":"Decarne"},"Voisin cloture"]

{"sheet":"Accueil","index":2,"n_rows":19,"n_cols":9,"rows_kept":19,"cut":false,"hidden":false,"merged":[[18,7,21,7],[1,8,4,8],[7,8,10,8],[13,8,16,8],[18,8,21,8],[0,0,0,3],[0,7,0,10],[1,7,4,7],[7,7,10,7],[13,7,16,7]]}
["CLIQUER SUR L'ICONE",null,null,null,null,null,null,"CLIQUER SUR L'ICONE"]
[null,null,null,null,null,null,null,"Accueil","ð"]
[]
[]
[]
[]
[]
[null,null,null,null,null,null,null,"Liste des copropriétaires","ð"]
[]
[]
[]
[]
[]
[null,null,null,null,null,null,null,"Feuille de présence en AG","ð"]
[]
[]
[]
[]
[null,null,null,null,null,null,null,"Vote ordre du jour","ð"]

{"sheet":"Liste","index":3,"n_rows":41,"n_cols":13,"rows_kept":41,"cut":false,"hidden":false,"merged":[[0,9,0,12]]}
[null,null,null,null,null,null,null,null,null,"Pour vote"]
[null,null,null,"Nom","Détient","Statut","Pouvoir",null,null,"Nom","Détient","Statut","Pouvoir"]
[null,null,null,"Azemard",250,{"$f":"Présence!E4","v":"A"},{"$f":"Présence!G$47","v":0},null,null,"Boituzat",406,"P",0]
[null,null,null,"Barthes",434,{"$f":"Présence!E5","v":"A"},{"$f":"Présence!I$47","v":0},null,null,"Dugied",444,"P",0]
[null,null,null,"Berthezene",7,{"$f":"Présence!E6","v":"A"},{"$f":"Présence!K$47","v":0},null,null,"Fraval",353,"P",0]
[null,null,null,"Boituzat",406,{"$f":"Présence!E7","v":"P"},{"$f":"Présence!M$47","v":0},null,null,"Martinez",187,"P",306]
[null,null,null,"Crédit Agric.",321,{"$f":"Présence!E8","v":"A"},{"$f":"Présence!O$47","v":0},null,null,"Ortega J.",379,"P",0]
[null,null,null,"Carayol",323,{"$f":"Présence!E9","v":"A"},{"$f":"Présence!Q$47","v":0},null,null,"Vivona",308,"P",0]
[null,null,null,"Catteau",43,{"$f":"Présence!E10","v":"A"},{"$f":"Présence!S$47","v":0},null,null,"Hamelin",306,"M",0]
[null,null,null,"Decarne",285,{"$f":"Présence!E11","v":"A"},{"$f":"Présence!U$47","v":0},null,null,"Azemard",250,"A",0]
[null,null,null,"Desbordes",249,{"$f":"Présence!E12","v":"A"},{"$f":"Présence!W$47","v":0},null,null,"Barthes",434,"A",0]
[null,null,null,"Diconne",281,{"$f":"Présence!E13","v":"A"},{"$f":"Présence!Y$47","v":0},null,null,"Berthezene",7,"A",0]
[null,null,null,"DKS",633,{"$f":"Présence!E14","v":"A"},{"$f":"Présence!AA$47","v":0},null,null,"Crédit Agric.",321,"A",0]
[null,null,null,"Dugied",444,{"$f":"Présence!E15","v":"P"},{"$f":"Présence!AC$47","v":0},null,null,"Carayol",323,"A",0]
[null,null,null,"Fadda",7,{"$f":"Présence!E16","v":"A"},{"$f":"Présence!AE$47","v":0},null,null,"Catteau",43,"A",0]
[null,null,null,"Fraval",353,{"$f":"Présence!E17","v":"P"},{"$f":"Présence!AG$47","v":0},null,null,"Decarne",285,"A",0]
[null,null,null,"Gallard Justeau",36,{"$f":"Présence!E18","v":"A"},{"$f":"Présence!AI$47","v":0},null,null,"Desbordes",249,"A",0]
[null,null,null,"Gerbaud",218,{"$f":"Présence!E19","v":"A"},{"$f":"Présence!AK$47","v":0},null,null,"Diconne",281,"A",0]
[null,null,null,"Hamelin",306,{"$f":"Présence!E20","v":"M"},{"$f":"Présence!AM$47","v":0},null,null,"DKS",633,"A",0]
[null,null,null,"Hugo",245,{"$f":"Présence!E21","v":"A"},{"$f":"Présence!AO$47","v":0},null,null,"Fadda",7,"A",0]
[null,null,null,"Leveau",202,{"$f":"Présence!E22","v":"A"},{"$f":"Présence!AQ$47","v":0},null,null,"Gallard Justeau",36,"A",0]
[null,null,null,"Mandrile",230,{"$f":"Présence!E23","v":"A"},{"$f":"Présence!AS$47","v":0},null,null,"Gerbaud",218,"A",0]
[null,null,null,"Martinez",187,{"$f":"Présence!E24","v":"P"},{"$f":"Présence!AU$47","v":306},null,null,"Hugo",245,"A",0]
[null,null,null,"Megie",214,{"$f":"Présence!E25","v":"A"},{"$f":"Présence!AW$47","v":0},null,null,"Leveau",202,"A",0]
[null,null,null,"Morana F.",337,{"$f":"Présence!E26","v":"A"},{"$f":"Présence!AY$47","v":0},null,null,"Mandrile",230,"A",0]
[null,null,null,"Morana AM",340,{"$f":"Présence!E27","v":"A"},{"$f":"Présence!BA$47","v":0},null,null,"Megie",214,"A",0]
[null,null,null,"Morana L",265,{"$f":"Présence!E28","v":"A"},{"$f":"Présence!BC$47","v":0},null,null,"Morana F.",337,"A",0]
[null,null,null,"Morana P",264,{"$f":"Présence!E29","v":"A"},{"$f":"Présence!BE$47","v":0},null,null,"Morana AM",340,"A",0]
[null,null,null,"Optimo SCI",201,{"$f":"Présence!E30","v":"A"},{"$f":"Présence!BG$47","v":0},null,null,"Morana L",265,"A",0]
[null,null,null,"Ortega J.",379,{"$f":"Présence!E31","v":"P"},{"$f":"Présence!BI$47","v":0},null,null,"Morana P",264,"A",0]
[null,null,null,"Ortega S.",265,{"$f":"Présence!E32","v":"A"},{"$f":"Présence!BK$47","v":0},null,null,"Optimo SCI",201,"A",0]
[null,null,null,"Piochot",51,{"$f":"Présence!E33","v":"A"},{"$f":"Présence!BM$47","v":0},null,null,"Ortega S.",265,"A",0]
[null,null,null,"Pouillot",317,{"$f":"Présence!E34","v":"A"},{"$f":"Présence!BO$47","v":0},null,null,"Piochot",51,"A",0]
[null,null,null,"Ramirez",265,{"$f":"Présence!E35","v":"A"},{"$f":"Présence!BQ$47","v":0},null,null,"Pouillot",317,"A",0]
[null,null,null,"Segura Mari",268,{"$f":"Présence!E36","v":"A"},{"$f":"Présence!BS$47","v":0},null,null,"Ramirez",265,"A",0]
[null,null,null,"Simoncini",210,{"$f":"Présence!E37","v":"A"},{"$f":"Présence!BU$47","v":0},null,null,"Segura Mari",268,"A",0]
[null,null,null,"Vautravers",301,{"$f":"Présence!E38","v":"A"},{"$f":"Présence!BW$47","v":0},null,null,"Simoncini",210,"A",0]
[null,null,null,"Ventajou",245,{"$f":"Présence!E39","v":"A"},{"$f":"Présence!BY$47","v":0},null,null,"Vautravers",301,"A",0]
[null,null,null,"Vernet",23,{"$f":"Présence!E40","v":"A"},{"$f":"Présence!CA$47","v":0},null,null,"Ventajou",245,"A",0]
[null,null,null,"Villard Toddi",209,{"$f":"Présence!E41","v":"A"},{"$f":"Présence!CC$47","v":0},null,null,"Vernet",23,"A",0]
[null,null,null,"Vivona",308,{"$f":"Présence!E42","v":"P"},{"$f":"Présence!CE$47","v":0},null,null,"Villard Toddi",209,"A",0]

{"sheet":"Présence","index":4,"n_rows":52,"n_cols":84,"rows_kept":52,"cut":false,"hidden":false,"merged":[[50,2,50,14],[43,14,43,18],[44,14,44,18],[45,14,45,18],[45,26,45,28],[47,2,47,3],[48,2,48,3],[49,2,49,3],[43,30,43,40],[44,30,44,40],[45,30,45,40],[43,8,45,12],[1,3,1,4],[44,2,44,5],[42,2,42,5],[43,2,43,5],[1,5,2,5],[42,26,42,28],[42,20,42,22],[43,26,43,28]]}
[null,null,null,null,null,null,{"$f":"E4","v":"A"},null,{"$f":"E5","v":"A"},null,{"$f":"E6","v":"A"},null,{"$f":"E7","v":"P"},null,{"$f":"E8","v":"A"},null,{"$f":"E9","v":"A"},null,{"$f":"E10","v":"A"},null,{"$f":"E11","v":"A"},null,{"$f":"E12","v":"A"},null,{"$f":"E13","v":"A"},null,{"$f":"E14","v":"A"},null,{"$f":"E15","v":"P"},null,{"$f":"E16","v":"A"},null,{"$f":"E17","v":"P"},null,{"$f":"E18","v":"A"},null,{"$f":"E19","v":"A"},null,{"$f":"E20","v":"M"},null,{"$f":"E21","v":"A"},null,{"$f":"E22","v":"A"},null,{"$f":"E23","v":"A"},null,{"$f":"E24","v":"P"},null,{"$f":"E25","v":"A"},null,{"$f":"E26","v":"A"},null,{"$f":"E27","v":"A"},null,{"$f":"E28","v":"A"},null,{"$f":"E29","v":"A"},null,{"$f":"E30","v":"A"},null,{"$f":"E31","v":"P"},null,{"$f":"E32","v":"A"},null,{"$f":"E33","v":"A"},null,{"$f":"E34","v":"A"},null,{"$f":"E35","v":"A"},null,{"$f":"E36","v":"A"},null,{"$f":"E37","v":"A"},null,{"$f":"E38","v":"A"},null,{"$f":"E39","v":"A"},null,{"$f":"E40","v":"A"},null,{"$f":"E41","v":"A"},null,{"$f":"E42","v":"P"}]
[null,null,null,"Tantièmes",null,"Pouvoir à",{"$f":"C4","v":250},null,{"$f":"C5","v":434},null,{"$f":"C6","v":7},null,{"$f":"C7","v":406},null,{"$f":"C8","v":321},null,{"$f":"C9","v":323},null,{"$f":"C10","v":43},null,{"$f":"C11","v":285},null,{"$f":"C12","v":249},null,{"$f":"C13","v":281},null,{"$f":"C14","v":633},null,{"$f":"C15","v":444},null,{"$f":"C16","v":7},null,{"$f":"C17","v":353},null,{"$f":"C18","v":36},null,{"$f":"C19","v":218},null,{"$f":"C20","v":306},null,{"$f":"C21","v":245},null,{"$f":"C22","v":202},null,{"$f":"C23","v":230},null,{"$f":"C24","v":187},null,{"$f":"C25","v":214},null,{"$f":"C26","v":337},null,{"$f":"C27","v":340},null,{"$f":"C28","v":265},null,{"$f":"C29","v":264},null,{"$f":"C30","v":201},null,{"$f":"C31","v":379},null,{"$f":"C32","v":265},null,{"$f":"C33","v":51},null,{"$f":"C34","v":317},null,{"$f":"C35","v":265},null,{"$f":"C36","v":268},null,{"$f":"C37","v":210},null,{"$f":"C38","v":301},null,{"$f":"C39","v":245},null,{"$f":"C40","v":23},null,{"$f":"C41","v":209},null,{"$f":"C42","v":308}]
[null,null,null,{"$f":"COUNT(C4:C42)&\" Noms\"","v":"39 Noms"},"Statut",null,{"$f":"D4","v":"Azemard"},null,{"$f":"D5","v":"Barthes"},null,{"$f":"D6","v":"Berthezene"},null,{"$f":"D7","v":"Boituzat"},null,{"$f":"D8","v":"Crédit Agric."},null,{"$f":"D9","v":"Carayol"},null,{"$f":"D10","v":"Catteau"},null,{"$f":"D11","v":"Decarne"},null,{"$f":"D12","v":"Desbordes"},null,{"$f":"D13","v":"Diconne"},null,{"$f":"D14","v":"DKS"},null,{"$f":"D15","v":"Dugied"},null,{"$f":"D16","v":"Fadda"},null,{"$f":"D17","v":"Fraval"},null,{"$f":"D18","v":"Gallard Justeau"},null,{"$f":"D19","v":"Gerbaud"},null,{"$f":"D20","v":"Hamelin"},null,{"$f":"D21","v":"Hugo"},null,{"$f":"D22","v":"Leveau"},null,{"$f":"D23","v":"Mandrile"},null,{"$f":"D24","v":"Martinez"},null,{"$f":"D25","v":"Megie"},null,{"$f":"D26","v":"Morana F."},null,{"$f":"D27","v":"Morana AM"},null,{"$f":"D28","v":"Morana L"},null,{"$f":"D29","v":"Morana P"},null,{"$f":"D30","v":"Optimo SCI"},null,{"$f":"D31","v":"Ortega J."},null,{"$f":"D32","v":"Ortega S."},null,{"$f":"D33","v":"Piochot"},null,{"$f":"D34","v":"Pouillot"},null,{"$f":"D35","v":"Ramirez"},null,{"$f":"D36","v":"Segura Mari"},null,{"$f":"D37","v":"Simoncini"},null,{"$f":"D38","v":"Vautravers"},null,{"$f":"D39","v":"Ventajou"},null,{"$f":"D40","v":"Vernet"},null,{"$f":"D41","v":"Villard Toddi"},null,{"$f":"D42","v":"Vivona"}]
[{"$f":"IF(G4<>C4,\"QQQ\",\"\")","v":"QQQ"},null,{"$f":"Liste!E3","v":250},{"$f":"Liste!D3","v":"Azemard"},"A",null,{"$f":"IF($E4=\"P\",$C4,\"\")","v":""},null,{"$f":"IF(AND(E4=\"M\",EXACT(F4,I$52)=TRUE),\"X\",\"\")","v":""},{"$f":"IF(I4=\"X\",$C4,\"\")","v":""},{"$f":"IF(AND($E4=\"M\",EXACT($F4,K$52)=TRUE),\"X\",\"\")","v":""},{"$f":"IF(K4=\"X\",$C4,\"\")","v":""},{"$f":"IF(AND($E4=\"M\",EXACT($F4,M$52)=TRUE),\"X\",\"\")","v":""},{"$f":"IF(M4=\"X\",$C4,\"\")","v":""},{"$f":"IF(AND($E4=\"M\",EXACT($F4,O$52)=TRUE),\"X\",\"\")","v":""},{"$f":"IF(O4=\"X\",$C4,\"\")","v":""},{"$f":"IF(AND($E4=\"M\",EXACT($F4,Q$52)=TRUE),\"X\",\"\")","v":""},"","","","","","","","","","","","","","","","","","","","","","","","","","","","","","","","","","","","","","","","","","","","","","","","","","","","","","","","","","","","","","","",{"$f":"IF(AND($E4=\"M\",EXACT($F4,CC$52)=TRUE),\"X\",\"\")","v":""},"","",{"$f":"IF(CE4=\"X\",$C4,\"\")","v":""}]
[null,null,{"$f":"Liste!E4","v":434},{"$f":"Liste!D4","v":"Barthes"},"A",null,{"$f":"IF(AND(E5=\"M\",EXACT(F5,G$52)=TRUE),\"X\",\"\")","v":""},"",{"$f":"IF($E5=\"P\",$C5,\"\")","v":""},null,{"$f":"IF(AND($E5=\"M\",EXACT($F5,K$52)=TRUE),\"X\",\"\")","v":""},{"$f":"IF(K5=\"X\",$C5,\"\")","v":""},{"$f":"IF(AND($E5=\"M\",EXACT($F5,M$52)=TRUE),\"X\",\"\")","v":""},{"$f":"IF(M5=\"X\",$C5,\"\")","v":""},{"$f":"IF(AND($E5=\"M\",EXACT($F5,O$52)=TRUE),\"X\",\"\")","v":""},{"$f":"IF(O5=\"X\",$C5,\"\")","v":""},"","","",{"$f":"IF(S5=\"X\",$C5,\"\")","v":""},"",{"$f":"IF(U5=\"X\",$C5,\"\")","v":""},"",{"$f":"IF(W5=\"X\",$C5,\"\")","v":""},"","","",{"$f":"IF(AA5=\"X\",$C5,\"\")","v":""},"",{"$f":"IF(AC5=\"X\",$C5,\"\")","v":""},"",{"$f":"IF(AE5=\"X\",$C5,\"\")","v":""},"",{"$f":"IF(AG5=\"X\",$C5,\"\")","v":""},"",{"$f":"IF(AI5=\"X\",$C5,\"\")","v":""},"",{"$f":"IF(AK5=\"X\",$C5,\"\")","v":""},"",{"$f":"IF(AM5=\"X\",$C5,\"\")","v":""},"",{"$f":"IF(AO5=\"X\",$C5,\"\")","v":""},"",{"$f":"IF(AQ5=\"X\",$C5,\"\")","v":""},{"$f":"IF(AND($E5=\"M\",EXACT($F5,AS$52)=TRUE),\"X\",\"\")","v":""},{"$f":"IF(AS5=\"X\",$C5,\"\")","v":""},{"$f":"IF(AND($E5=\"M\",EXACT($F5,AU$52)=TRUE),\"X\",\"\")","v":""},{"$f":"IF(AU5=\"X\",$C5,\"\")","v":""},{"$f":"IF(AND($E5=\"M\",EXACT($F5,AW$52)=TRUE),\"X\",\"\")","v":""},{"$f":"IF(AW5=\"X\",$C5,\"\")","v":""},{"$f":"IF(AND($E5=\"M\",EXACT($F5,AY$52)=TRUE),\"X\",\"\")","v":""},{"$f":"IF(AY5=\"X\",$C5,\"\")","v":""},{"$f":"IF(AND($E5=\"M\",EXACT($F5,BA$52)=TRUE),\"X\",\"\")","v":""},{"$f":"IF(BA5=\"X\",$C5,\"\")","v":""},{"$f":"IF(AND($E5=\"M\",EXACT($F5,BC$52)=TRUE),\"X\",\"\")","v":""},{"$f":"IF(BC5=\"X\",$C5,\"\")","v":""},{"$f":"IF(AND($E5=\"M\",EXACT($F5,BE$52)=TRUE),\"X\",\"\")","v":""},{"$f":"IF(BE5=\"X\",$C5,\"\")","v":""},{"$f":"IF(AND($E5=\"M\",EXACT($F5,BG$52)=TRUE),\"X\",\"\")","v":""},{"$f":"IF(BG5=\"X\",$C5,\"\")","v":""},{"$f":"IF(AND($E5=\"M\",EXACT($F5,BI$52)=TRUE),\"X\",\"\")","v":""},{"$f":"IF(BI5=\"X\",$C5,\"\")","v":""},{"$f":"IF(AND($E5=\"M\",EXACT($F5,BK$52)=TRUE),\"X\",\"\")","v":""},{"$f":"IF(BK5=\"X\",$C5,\"\")","v":""},{"$f":"IF(AND($E5=\"M\",EXACT($F5,BM$52)=TRUE),\"X\",\"\")","v":""},{"$f":"IF(BM5=\"X\",$C5,\"\")","v":""},{"$f":"IF(AND($E5=\"M\",EXACT($F5,BO$52)=TRUE),\"X\",\"\")","v":""},{"$f":"IF(BO5=\"X\",$C5,\"\")","v":""},{"$f":"IF(AND($E5=\"M\",EXACT($F5,BQ$52)=TRUE),\"X\",\"\")","v":""},{"$f":"IF(BQ5=\"X\",$C5,\"\")","v":""},{"$f":"IF(AND($E5=\"M\",EXACT($F5,BS$52)=TRUE),\"X\",\"\")","v":""},{"$f":"IF(BS5=\"X\",$C5,\"\")","v":""},{"$f":"IF(AND($E5=\"M\",EXACT($F5,BU$52)=TRUE),\"X\",\"\")","v":""},{"$f":"IF(BU5=\"X\",$C5,\"\")","v":""},{"$f":"IF(AND($E5=\"M\",EXACT($F5,BW$52)=TRUE),\"X\",\"\")","v":""},{"$f":"IF(BW5=\"X\",$C5,\"\")","v":""},{"$f":"IF(AND($E5=\"M\",EXACT($F5,BY$52)=TRUE),\"X\",\"\")","v":""},{"$f":"IF(BY5=\"X\",$C5,\"\")","v":""},{"$f":"IF(AND($E5=\"M\",EXACT($F5,CA$52)=TRUE),\"X\",\"\")","v":""},{"$f":"IF(CA5=\"X\",$C5,\"\")","v":""},"",{"$f":"IF(CC5=\"X\",$C5,\"\")","v":""},"",{"$f":"IF(CE5=\"X\",$C5,\"\")","v":""}]
[null,null,{"$f":"Liste!E5","v":7},{"$f":"Liste!D5","v":"Berthezene"},"A",null,{"$f":"IF(AND(E6=\"M\",EXACT(F6,G$52)=TRUE),\"X\",\"\")","v":""},"",{"$f":"IF(AND(E6=\"M\",EXACT(F6,I$52)=TRUE),\"X\",\"\")","v":""},"",{"$f":"IF($E6=\"P\",$C6,\"\")","v":""},null,"",{"$f":"IF(M6=\"X\",$C6,\"\")","v":""},"",{"$f":"IF(O6=\"X\",$C6,\"\")","v":""},"","","",{"$f":"IF(S6=\"X\",$C6,\"\")","v":""},"",{"$f":"IF(U6=\"X\",$C6,\"\")","v":""},"",{"$f":"IF(W6=\"X\",$C6,\"\")","v":""},"","","",{"$f":"IF(AA6=\"X\",$C6,\"\")","v":""},"",{"$f":"IF(AC6=\"X\",$C6,\"\")","v":""},"",{"$f":"IF(AE6=\"X\",$C6,\"\")","v":""},"",{"$f":"IF(AG6=\"X\",$C6,\"\")","v":""},"",{"$f":"IF(AI6=\"X\",$C6,\"\")","v":""},"",{"$f":"IF(AK6=\"X\",$C6,\"\")","v":""},"",{"$f":"IF(AM6=\"X\",$C6,\"\")","v":""},"",{"$f":"IF(AO6=\"X\",$C6,\"\")","v":""},"",{"$f":"IF(AQ6=\"X\",$C6,\"\")","v":""},"",{"$f":"IF(AS6=\"X\",$C6,\"\")","v":""},"",{"$f":"IF(AU6=\"X\",$C6,\"\")","v":""},"",{"$f":"IF(AW6=\"X\",$C6,\"\")","v":""},"",{"$f":"IF(AY6=\"X\",$C6,\"\")","v":""},"",{"$f":"IF(BA6=\"X\",$C6,\"\")","v":""},"",{"$f":"IF(BC6=\"X\",$C6,\"\")","v":""},"",{"$f":"IF(BE6=\"X\",$C6,\"\")","v":""},"",{"$f":"IF(BG6=\"X\",$C6,\"\")","v":""},"",{"$f":"IF(BI6=\"X\",$C6,\"\")","v":""},"",{"$f":"IF(BK6=\"X\",$C6,\"\")","v":""},"",{"$f":"IF(BM6=\"X\",$C6,\"\")","v":""},"",{"$f":"IF(BO6=\"X\",$C6,\"\")","v":""},"",{"$f":"IF(BQ6=\"X\",$C6,\"\")","v":""},"",{"$f":"IF(BS6=\"X\",$C6,\"\")","v":""},"",{"$f":"IF(BU6=\"X\",$C6,\"\")","v":""},"",{"$f":"IF(BW6=\"X\",$C6,\"\")","v":""},"",{"$f":"IF(BY6=\"X\",$C6,\"\")","v":""},"",{"$f":"IF(CA6=\"X\",$C6,\"\")","v":""},"",{"$f":"IF(CC6=\"X\",$C6,\"\")","v":""},"",{"$f":"IF(CE6=\"X\",$C6,\"\")","v":""}]
[null,null,{"$f":"Liste!E6","v":406},{"$f":"Liste!D6","v":"Boituzat"},"P",null,"","","","",{"$f":"IF(AND($E7=\"M\",EXACT($F7,K$52)=TRUE),\"X\",\"\")","v":""},{"$f":"IF(K7=\"X\",$C7,\"\")","v":""},{"$f":"IF($E7=\"P\",$C7,\"\")","v":406},null,"",{"$f":"IF(O7=\"X\",$C7,\"\")","v":""},"","","",{"$f":"IF(S7=\"X\",$C7,\"\")","v":""},"",{"$f":"IF(U7=\"X\",$C7,\"\")","v":""},"",{"$f":"IF(W7=\"X\",$C7,\"\")","v":""},"","","",{"$f":"IF(AA7=\"X\",$C7,\"\")","v":""},"",{"$f":"IF(AC7=\"X\",$C7,\"\")","v":""},"",{"$f":"IF(AE7=\"X\",$C7,\"\")","v":""},"",{"$f":"IF(AG7=\"X\",$C7,\"\")","v":""},"",{"$f":"IF(AI7=\"X\",$C7,\"\")","v":""},"",{"$f":"IF(AK7=\"X\",$C7,\"\")","v":""},"",{"$f":"IF(AM7=\"X\",$C7,\"\")","v":""},"",{"$f":"IF(AO7=\"X\",$C7,\"\")","v":""},"",{"$f":"IF(AQ7=\"X\",$C7,\"\")","v":""},"",{"$f":"IF(AS7=\"X\",$C7,\"\")","v":""},"",{"$f":"IF(AU7=\"X\",$C7,\"\")","v":""},"",{"$f":"IF(AW7=\"X\",$C7,\"\")","v":""},"",{"$f":"IF(AY7=\"X\",$C7,\"\")","v":""},"",{"$f":"IF(BA7=\"X\",$C7,\"\")","v":""},"",{"$f":"IF(BC7=\"X\",$C7,\"\")","v":""},"",{"$f":"IF(BE7=\"X\",$C7,\"\")","v":""},"",{"$f":"IF(BG7=\"X\",$C7,\"\")","v":""},"",{"$f":"IF(BI7=\"X\",$C7,\"\")","v":""},"",{"$f":"IF(BK7=\"X\",$C7,\"\")","v":""},"",{"$f":"IF(BM7=\"X\",$C7,\"\")","v":""},"",{"$f":"IF(BO7=\"X\",$C7,\"\")","v":""},"",{"$f":"IF(BQ7=\"X\",$C7,\"\")","v":""},"",{"$f":"IF(BS7=\"X\",$C7,\"\")","v":""},"",{"$f":"IF(BU7=\"X\",$C7,\"\")","v":""},"",{"$f":"IF(BW7=\"X\",$C7,\"\")","v":""},"",{"$f":"IF(BY7=\"X\",$C7,\"\")","v":""},"",{"$f":"IF(CA7=\"X\",$C7,\"\")","v":""},"",{"$f":"IF(CC7=\"X\",$C7,\"\")","v":""},"",{"$f":"IF(CE7=\"X\",$C7,\"\")","v":""}]
[null,null,{"$f":"Liste!E7","v":321},{"$f":"Liste!D7","v":"Crédit Agric."},"A",null,"","","","","","","",{"$f":"IF(M8=\"X\",$C8,\"\")","v":""},{"$f":"IF($E8=\"P\",$C8,\"\")","v":""},null,"",{"$f":"IF(Q8=\"X\",$C8,\"\")","v":""},"",{"$f":"IF(S8=\"X\",$C8,\"\")","v":""},"",{"$f":"IF(U8=\"X\",$C8,\"\")","v":""},"",{"$f":"IF(W8=\"X\",$C8,\"\")","v":""},"","","",{"$f":"IF(AA8=\"X\",$C8,\"\")","v":""},"",{"$f":"IF(AC8=\"X\",$C8,\"\")","v":""},"",{"$f":"IF(AE8=\"X\",$C8,\"\")","v":""},"",{"$f":"IF(AG8=\"X\",$C8,\"\")","v":""},"",{"$f":"IF(AI8=\"X\",$C8,\"\")","v":""},"",{"$f":"IF(AK8=\"X\",$C8,\"\")","v":""},"",{"$f":"IF(AM8=\"X\",$C8,\"\")","v":""},"",{"$f":"IF(AO8=\"X\",$C8,\"\")","v":""},{"$f":"IF(AND($E8=\"M\",EXACT($F8,AQ$52)=TRUE),\"X\",\"\")","v":""},{"$f":"IF(AQ8=\"X\",$C8,\"\")","v":""},"",{"$f":"IF(AS8=\"X\",$C8,\"\")","v":""},"",{"$f":"IF(AU8=\"X\",$C8,\"\")","v":""},"",{"$f":"IF(AW8=\"X\",$C8,\"\")","v":""},"",{"$f":"IF(AY8=\"X\",$C8,\"\")","v":""},"",{"$f":"IF(BA8=\"X\",$C8,\"\")","v":""},"",{"$f":"IF(BC8=\"X\",$C8,\"\")","v":""},"",{"$f":"IF(BE8=\"X\",$C8,\"\")","v":""},"",{"$f":"IF(BG8=\"X\",$C8,\"\")","v":""},"",{"$f":"IF(BI8=\"X\",$C8,\"\")","v":""},"",{"$f":"IF(BK8=\"X\",$C8,\"\")","v":""},"",{"$f":"IF(BM8=\"X\",$C8,\"\")","v":""},"",{"$f":"IF(BO8=\"X\",$C8,\"\")","v":""},"",{"$f":"IF(BQ8=\"X\",$C8,\"\")","v":""},"",{"$f":"IF(BS8=\"X\",$C8,\"\")","v":""},"",{"$f":"IF(BU8=\"X\",$C8,\"\")","v":""},"",{"$f":"IF(BW8=\"X\",$C8,\"\")","v":""},"",{"$f":"IF(BY8=\"X\",$C8,\"\")","v":""},"",{"$f":"IF(CA8=\"X\",$C8,\"\")","v":""},"",{"$f":"IF(CC8=\"X\",$C8,\"\")","v":""},"",{"$f":"IF(CE8=\"X\",$C8,\"\")","v":""}]
[null,null,{"$f":"Liste!E8","v":323},{"$f":"Liste!D8","v":"Carayol"},"A",null,"","","","","",{"$f":"IF(K9=\"X\",$C9,\"\")","v":""},"",{"$f":"IF(M9=\"X\",$C9,\"\")","v":""},"",{"$f":"IF(O9=\"X\",$C9,\"\")","v":""},{"$f":"IF($E9=\"P\",$C9,\"\")","v":""},null,"",{"$f":"IF(S9=\"X\",$C9,\"\")","v":""},"",{"$f":"IF(U9=\"X\",$C9,\"\")","v":""},"",{"$f":"IF(W9=\"X\",$C9,\"\")","v":""},"","","",{"$f":"IF(AA9=\"X\",$C9,\"\")","v":""},"",{"$f":"IF(AC9=\"X\",$C9,\"\")","v":""},"",{"$f":"IF(AE9=\"X\",$C9,\"\")","v":""},"",{"$f":"IF(AG9=\"X\",$C9,\"\")","v":""},"",{"$f":"IF(AI9=\"X\",$C9,\"\")","v":""},"",{"$f":"IF(AK9=\"X\",$C9,\"\")","v":""},"",{"$f":"IF(AM9=\"X\",$C9,\"\")","v":""},"",{"$f":"IF(AO9=\"X\",$C9,\"\")","v":""},"",{"$f":"IF(AQ9=\"X\",$C9,\"\")","v":""},"",{"$f":"IF(AS9=\"X\",$C9,\"\")","v":""},"",{"$f":"IF(AU9=\"X\",$C9,\"\")","v":""},"",{"$f":"IF(AW9=\"X\",$C9,\"\")","v":""},"",{"$f":"IF(AY9=\"X\",$C9,\"\")","v":""},"",{"$f":"IF(BA9=\"X\",$C9,\"\")","v":""},"",{"$f":"IF(BC9=\"X\",$C9,\"\")","v":""},"",{"$f":"IF(BE9=\"X\",$C9,\"\")","v":""},"",{"$f":"IF(BG9=\"X\",$C9,\"\")","v":""},"",{"$f":"IF(BI9=\"X\",$C9,\"\")","v":""},"",{"$f":"IF(BK9=\"X\",$C9,\"\")","v":""},"",{"$f":"IF(BM9=\"X\",$C9,\"\")","v":""},"",{"$f":"IF(BO9=\"X\",$C9,\"\")","v":""},"",{"$f":"IF(BQ9=\"X\",$C9,\"\")","v":""},"",{"$f":"IF(BS9=\"X\",$C9,\"\")","v":""},"",{"$f":"IF(BU9=\"X\",$C9,\"\")","v":""},"",{"$f":"IF(BW9=\"X\",$C9,\"\")","v":""},"",{"$f":"IF(BY9=\"X\",$C9,\"\")","v":""},"",{"$f":"IF(CA9=\"X\",$C9,\"\")","v":""},"",{"$f":"IF(CC9=\"X\",$C9,\"\")","v":""},"",{"$f":"IF(CE9=\"X\",$C9,\"\")","v":""}]
[null,null,{"$f":"Liste!E9","v":43},{"$f":"Liste!D9","v":"Catteau"},"A",null,"","","","","",{"$f":"IF(K10=\"X\",$C10,\"\")","v":""},"",{"$f":"IF(M10=\"X\",$C10,\"\")","v":""},"",{"$f":"IF(O10=\"X\",$C10,\"\")","v":""},"","",{"$f":"IF($E10=\"P\",$C10,\"\")","v":""},null,"",{"$f":"IF(U10=\"X\",$C10,\"\")","v":""},"",{"$f":"IF(W10=\"X\",$C10,\"\")","v":""},"","","",{"$f":"IF(AA10=\"X\",$C10,\"\")","v":""},"",{"$f":"IF(AC10=\"X\",$C10,\"\")","v":""},"",{"$f":"IF(AE10=\"X\",$C10,\"\")","v":""},"",{"$f":"IF(AG10=\"X\",$C10,\"\")","v":""},"",{"$f":"IF(AI10=\"X\",$C10,\"\")","v":""},"",{"$f":"IF(AK10=\"X\",$C10,\"\")","v":""},"",{"$f":"IF(AM10=\"X\",$C10,\"\")","v":""},"",{"$f":"IF(AO10=\"X\",$C10,\"\")","v":""},"",{"$f":"IF(AQ10=\"X\",$C10,\"\")","v":""},"",{"$f":"IF(AS10=\"X\",$C10,\"\")","v":""},"",{"$f":"IF(AU10=\"X\",$C10,\"\")","v":""},"",{"$f":"IF(AW10=\"X\",$C10,\"\")","v":""},"",{"$f":"IF(AY10=\"X\",$C10,\"\")","v":""},"",{"$f":"IF(BA10=\"X\",$C10,\"\")","v":""},"",{"$f":"IF(BC10=\"X\",$C10,\"\")","v":""},"",{"$f":"IF(BE10=\"X\",$C10,\"\")","v":""},"",{"$f":"IF(BG10=\"X\",$C10,\"\")","v":""},"",{"$f":"IF(BI10=\"X\",$C10,\"\")","v":""},"",{"$f":"IF(BK10=\"X\",$C10,\"\")","v":""},"",{"$f":"IF(BM10=\"X\",$C10,\"\")","v":""},"",{"$f":"IF(BO10=\"X\",$C10,\"\")","v":""},"",{"$f":"IF(BQ10=\"X\",$C10,\"\")","v":""},"",{"$f":"IF(BS10=\"X\",$C10,\"\")","v":""},"",{"$f":"IF(BU10=\"X\",$C10,\"\")","v":""},"",{"$f":"IF(BW10=\"X\",$C10,\"\")","v":""},"",{"$f":"IF(BY10=\"X\",$C10,\"\")","v":""},"",{"$f":"IF(CA10=\"X\",$C10,\"\")","v":""},"",{"$f":"IF(CC10=\"X\",$C10,\"\")","v":""},"",{"$f":"IF(CE10=\"X\",$C10,\"\")","v":""}]
[null,null,{"$f":"Liste!E10","v":285},{"$f":"Liste!D10","v":"Decarne"},"A",null,"","","","","",{"$f":"IF(K11=\"X\",$C11,\"\")","v":""},"",{"$f":"IF(M11=\"X\",$C11,\"\")","v":""},"",{"$f":"IF(O11=\"X\",$C11,\"\")","v":""},"","","",{"$f":"IF(S11=\"X\",$C11,\"\")","v":""},{"$f":"IF($E11=\"P\",$C11,\"\")","v":""},null,"",{"$f":"IF(W11=\"X\",$C11,\"\")","v":""},"","","",{"$f":"IF(AA11=\"X\",$C11,\"\")","v":""},"",{"$f":"IF(AC11=\"X\",$C11,\"\")","v":""},"",{"$f":"IF(AE11=\"X\",$C11,\"\")","v":""},"",{"$f":"IF(AG11=\"X\",$C11,\"\")","v":""},"",{"$f":"IF(AI11=\"X\",$C11,\"\")","v":""},"",{"$f":"IF(AK11=\"X\",$C11,\"\")","v":""},"",{"$f":"IF(AM11=\"X\",$C11,\"\")","v":""},"",{"$f":"IF(AO11=\"X\",$C11,\"\")","v":""},"",{"$f":"IF(AQ11=\"X\",$C11,\"\")","v":""},"",{"$f":"IF(AS11=\"X\",$C11,\"\")","v":""},"",{"$f":"IF(AU11=\"X\",$C11,\"\")","v":""},"",{"$f":"IF(AW11=\"X\",$C11,\"\")","v":""},"",{"$f":"IF(AY11=\"X\",$C11,\"\")","v":""},"",{"$f":"IF(BA11=\"X\",$C11,\"\")","v":""},"",{"$f":"IF(BC11=\"X\",$C11,\"\")","v":""},"",{"$f":"IF(BE11=\"X\",$C11,\"\")","v":""},"",{"$f":"IF(BG11=\"X\",$C11,\"\")","v":""},"",{"$f":"IF(BI11=\"X\",$C11,\"\")","v":""},"",{"$f":"IF(BK11=\"X\",$C11,\"\")","v":""},"",{"$f":"IF(BM11=\"X\",$C11,\"\")","v":""},"",{"$f":"IF(BO11=\"X\",$C11,\"\")","v":""},"",{"$f":"IF(BQ11=\"X\",$C11,\"\")","v":""},"",{"$f":"IF(BS11=\"X\",$C11,\"\")","v":""},"",{"$f":"IF(BU11=\"X\",$C11,\"\")","v":""},"",{"$f":"IF(BW11=\"X\",$C11,\"\")","v":""},"",{"$f":"IF(BY11=\"X\",$C11,\"\")","v":""},"",{"$f":"IF(CA11=\"X\",$C11,\"\")","v":""},"",{"$f":"IF(CC11=\"X\",$C11,\"\")","v":""},"",{"$f":"IF(CE11=\"X\",$C11,\"\")","v":""}]
[null,null,{"$f":"Liste!E11","v":249},{"$f":"Liste!D11","v":"Desbordes"},"A",null,"","","","","",{"$f":"IF(K12=\"X\",$C12,\"\")","v":""},"",{"$f":"IF(M12=\"X\",$C12,\"\")","v":""},"",{"$f":"IF(O12=\"X\",$C12,\"\")","v":""},"","","",{"$f":"IF(S12=\"X\",$C12,\"\")","v":""},"",{"$f":"IF(U12=\"X\",$C12,\"\")","v":""},{"$f":"IF($E12=\"P\",$C12,\"\")","v":""},null,"","","","","","","","","","","","","","","","","","","","","","","","","","","","","","","","","","","","","","","","","","","","","","","","","","","","","","","","","","","",""]
[null,null,{"$f":"Liste!E12","v":281},{"$f":"Liste!D12","v":"Diconne"},"A",null,"","","","","",{"$f":"IF(K13=\"X\",$C13,\"\")","v":""},"",{"$f":"IF(M13=\"X\",$C13,\"\")","v":""},"",{"$f":"IF(O13=\"X\",$C13,\"\")","v":""},"","","",{"$f":"IF(S13=\"X\",$C13,\"\")","v":""},"",{"$f":"IF(U13=\"X\",$C13,\"\")","v":""},"",{"$f":"IF(W13=\"X\",$C13,\"\")","v":""},{"$f":"IF($E13=\"P\",$C13,\"\")","v":""},null,"",{"$f":"IF(AA13=\"X\",$C13,\"\")","v":""},"",{"$f":"IF(AC13=\"X\",$C13,\"\")","v":""},"",{"$f":"IF(AE13=\"X\",$C13,\"\")","v":""},"",{"$f":"IF(AG13=\"X\",$C13,\"\")","v":""},"",{"$f":"IF(AI13=\"X\",$C13,\"\")","v":""},"",{"$f":"IF(AK13=\"X\",$C13,\"\")","v":""},"",{"$f":"IF(AM13=\"X\",$C13,\"\")","v":""},"",{"$f":"IF(AO13=\"X\",$C13,\"\")","v":""},"",{"$f":"IF(AQ13=\"X\",$C13,\"\")","v":""},"",{"$f":"IF(AS13=\"X\",$C13,\"\")","v":""},"",{"$f":"IF(AU13=\"X\",$C13,\"\")","v":""},"",{"$f":"IF(AW13=\"X\",$C13,\"\")","v":""},"",{"$f":"IF(AY13=\"X\",$C13,\"\")","v":""},"",{"$f":"IF(BA13=\"X\",$C13,\"\")","v":""},"",{"$f":"IF(BC13=\"X\",$C13,\"\")","v":""},"",{"$f":"IF(BE13=\"X\",$C13,\"\")","v":""},"",{"$f":"IF(BG13=\"X\",$C13,\"\")","v":""},"",{"$f":"IF(BI13=\"X\",$C13,\"\")","v":""},"",{"$f":"IF(BK13=\"X\",$C13,\"\")","v":""},"",{"$f":"IF(BM13=\"X\",$C13,\"\")","v":""},"",{"$f":"IF(BO13=\"X\",$C13,\"\")","v":""},"",{"$f":"IF(BQ13=\"X\",$C13,\"\")","v":""},"",{"$f":"IF(BS13=\"X\",$C13,\"\")","v":""},"",{"$f":"IF(BU13=\"X\",$C13,\"\")","v":""},"",{"$f":"IF(BW13=\"X\",$C13,\"\")","v":""},"",{"$f":"IF(BY13=\"X\",$C13,\"\")","v":""},"",{"$f":"IF(CA13=\"X\",$C13,\"\")","v":""},"",{"$f":"IF(CC13=\"X\",$C13,\"\")","v":""},"",{"$f":"IF(CE13=\"X\",$C13,\"\")","v":""}]
[null,null,{"$f":"Liste!E13","v":633},{"$f":"Liste!D13","v":"DKS"},"A",null,"","","","","",{"$f":"IF(K14=\"X\",$C14,\"\")","v":""},"",{"$f":"IF(M14=\"X\",$C14,\"\")","v":""},"",{"$f":"IF(O14=\"X\",$C14,\"\")","v":""},"","","",{"$f":"IF(S14=\"X\",$C14,\"\")","v":""},"",{"$f":"IF(U14=\"X\",$C14,\"\")","v":""},"",{"$f":"IF(W14=\"X\",$C14,\"\")","v":""},"","",{"$f":"IF($E14=\"P\",$C14,\"\")","v":""},null,"",{"$f":"IF(AC14=\"X\",$C14,\"\")","v":""},"",{"$f":"IF(AE14=\"X\",$C14,\"\")","v":""},"",{"$f":"IF(AG14=\"X\",$C14,\"\")","v":""},"",{"$f":"IF(AI14=\"X\",$C14,\"\")","v":""},"",{"$f":"IF(AK14=\"X\",$C14,\"\")","v":""},"",{"$f":"IF(AM14=\"X\",$C14,\"\")","v":""},"",{"$f":"IF(AO14=\"X\",$C14,\"\")","v":""},"",{"$f":"IF(AQ14=\"X\",$C14,\"\")","v":""},"",{"$f":"IF(AS14=\"X\",$C14,\"\")","v":""},"",{"$f":"IF(AU14=\"X\",$C14,\"\")","v":""},"",{"$f":"IF(AW14=\"X\",$C14,\"\")","v":""},"",{"$f":"IF(AY14=\"X\",$C14,\"\")","v":""},"",{"$f":"IF(BA14=\"X\",$C14,\"\")","v":""},"",{"$f":"IF(BC14=\"X\",$C14,\"\")","v":""},"",{"$f":"IF(BE14=\"X\",$C14,\"\")","v":""},"",{"$f":"IF(BG14=\"X\",$C14,\"\")","v":""},"",{"$f":"IF(BI14=\"X\",$C14,\"\")","v":""},"",{"$f":"IF(BK14=\"X\",$C14,\"\")","v":""},"",{"$f":"IF(BM14=\"X\",$C14,\"\")","v":""},"",{"$f":"IF(BO14=\"X\",$C14,\"\")","v":""},"",{"$f":"IF(BQ14=\"X\",$C14,\"\")","v":""},"",{"$f":"IF(BS14=\"X\",$C14,\"\")","v":""},"",{"$f":"IF(BU14=\"X\",$C14,\"\")","v":""},"",{"$f":"IF(BW14=\"X\",$C14,\"\")","v":""},"",{"$f":"IF(BY14=\"X\",$C14,\"\")","v":""},"",{"$f":"IF(CA14=\"X\",$C14,\"\")","v":""},"",{"$f":"IF(CC14=\"X\",$C14,\"\")","v":""},"",{"$f":"IF(CE14=\"X\",$C14,\"\")","v":""}]
[null,null,{"$f":"Liste!E14","v":444},{"$f":"Liste!D14","v":"Dugied"},"P",null,"","","","","",{"$f":"IF(K15=\"X\",$C15,\"\")","v":""},"",{"$f":"IF(M15=\"X\",$C15,\"\")","v":""},"",{"$f":"IF(O15=\"X\",$C15,\"\")","v":""},"","","",{"$f":"IF(S15=\"X\",$C15,\"\")","v":""},"",{"$f":"IF(U15=\"X\",$C15,\"\")","v":""},"",{"$f":"IF(W15=\"X\",$C15,\"\")","v":""},"","","",{"$f":"IF(AA15=\"X\",$C15,\"\")","v":""},{"$f":"IF($E15=\"P\",$C15,\"\")","v":444},null,"",{"$f":"IF(AE15=\"X\",$C15,\"\")","v":""},"",{"$f":"IF(AG15=\"X\",$C15,\"\")","v":""},"",{"$f":"IF(AI15=\"X\",$C15,\"\")","v":""},"",{"$f":"IF(AK15=\"X\",$C15,\"\")","v":""},"",{"$f":"IF(AM15=\"X\",$C15,\"\")","v":""},"",{"$f":"IF(AO15=\"X\",$C15,\"\")","v":""},"",{"$f":"IF(AQ15=\"X\",$C15,\"\")","v":""},"",{"$f":"IF(AS15=\"X\",$C15,\"\")","v":""},"",{"$f":"IF(AU15=\"X\",$C15,\"\")","v":""},"",{"$f":"IF(AW15=\"X\",$C15,\"\")","v":""},"",{"$f":"IF(AY15=\"X\",$C15,\"\")","v":""},"",{"$f":"IF(BA15=\"X\",$C15,\"\")","v":""},"",{"$f":"IF(BC15=\"X\",$C15,\"\")","v":""},"",{"$f":"IF(BE15=\"X\",$C15,\"\")","v":""},"",{"$f":"IF(BG15=\"X\",$C15,\"\")","v":""},"",{"$f":"IF(BI15=\"X\",$C15,\"\")","v":""},"",{"$f":"IF(BK15=\"X\",$C15,\"\")","v":""},"",{"$f":"IF(BM15=\"X\",$C15,\"\")","v":""},"",{"$f":"IF(BO15=\"X\",$C15,\"\")","v":""},"",{"$f":"IF(BQ15=\"X\",$C15,\"\")","v":""},"",{"$f":"IF(BS15=\"X\",$C15,\"\")","v":""},"",{"$f":"IF(BU15=\"X\",$C15,\"\")","v":""},"",{"$f":"IF(BW15=\"X\",$C15,\"\")","v":""},"",{"$f":"IF(BY15=\"X\",$C15,\"\")","v":""},"",{"$f":"IF(CA15=\"X\",$C15,\"\")","v":""},"",{"$f":"IF(CC15=\"X\",$C15,\"\")","v":""},"",{"$f":"IF(CE15=\"X\",$C15,\"\")","v":""}]
[null,null,{"$f":"Liste!E15","v":7},{"$f":"Liste!D15","v":"Fadda"},"A",null,"","","","","",{"$f":"IF(K16=\"X\",$C16,\"\")","v":""},"",{"$f":"IF(M16=\"X\",$C16,\"\")","v":""},"",{"$f":"IF(O16=\"X\",$C16,\"\")","v":""},"","","",{"$f":"IF(S16=\"X\",$C16,\"\")","v":""},"",{"$f":"IF(U16=\"X\",$C16,\"\")","v":""},"",{"$f":"IF(W16=\"X\",$C16,\"\")","v":""},"","","",{"$f":"IF(AA16=\"X\",$C16,\"\")","v":""},"",{"$f":"IF(AC16=\"X\",$C16,\"\")","v":""},{"$f":"IF($E16=\"P\",$C16,\"\")","v":""},null,"",{"$f":"IF(AG16=\"X\",$C16,\"\")","v":""},"",{"$f":"IF(AI16=\"X\",$C16,\"\")","v":""},"",{"$f":"IF(AK16=\"X\",$C16,\"\")","v":""},"",{"$f":"IF(AM16=\"X\",$C16,\"\")","v":""},"",{"$f":"IF(AO16=\"X\",$C16,\"\")","v":""},"",{"$f":"IF(AQ16=\"X\",$C16,\"\")","v":""},"",{"$f":"IF(AS16=\"X\",$C16,\"\")","v":""},"",{"$f":"IF(AU16=\"X\",$C16,\"\")","v":""},"",{"$f":"IF(AW16=\"X\",$C16,\"\")","v":""},"",{"$f":"IF(AY16=\"X\",$C16,\"\")","v":""},"",{"$f":"IF(BA16=\"X\",$C16,\"\")","v":""},"",{"$f":"IF(BC16=\"X\",$C16,\"\")","v":""},"",{"$f":"IF(BE16=\"X\",$C16,\"\")","v":""},"",{"$f":"IF(BG16=\"X\",$C16,\"\")","v":""},"",{"$f":"IF(BI16=\"X\",$C16,\"\")","v":""},"",{"$f":"IF(BK16=\"X\",$C16,\"\")","v":""},"",{"$f":"IF(BM16=\"X\",$C16,\"\")","v":""},"",{"$f":"IF(BO16=\"X\",$C16,\"\")","v":""},"",{"$f":"IF(BQ16=\"X\",$C16,\"\")","v":""},"",{"$f":"IF(BS16=\"X\",$C16,\"\")","v":""},"",{"$f":"IF(BU16=\"X\",$C16,\"\")","v":""},"",{"$f":"IF(BW16=\"X\",$C16,\"\")","v":""},"",{"$f":"IF(BY16=\"X\",$C16,\"\")","v":""},"",{"$f":"IF(CA16=\"X\",$C16,\"\")","v":""},"",{"$f":"IF(CC16=\"X\",$C16,\"\")","v":""},"",{"$f":"IF(CE16=\"X\",$C16,\"\")","v":""}]
[null,null,{"$f":"Liste!E16","v":353},{"$f":"Liste!D16","v":"Fraval"},"P",null,"","","","","",{"$f":"IF(K17=\"X\",$C17,\"\")","v":""},"",{"$f":"IF(M17=\"X\",$C17,\"\")","v":""},"",{"$f":"IF(O17=\"X\",$C17,\"\")","v":""},"","","",{"$f":"IF(S17=\"X\",$C17,\"\")","v":""},"",{"$f":"IF(U17=\"X\",$C17,\"\")","v":""},"",{"$f":"IF(W17=\"X\",$C17,\"\")","v":""},"","","",{"$f":"IF(AA17=\"X\",$C17,\"\")","v":""},"",{"$f":"IF(AC17=\"X\",$C17,\"\")","v":""},"",{"$f":"IF(AE17=\"X\",$C17,\"\")","v":""},{"$f":"IF($E17=\"P\",$C17,\"\")","v":353},null,"",{"$f":"IF(AI17=\"X\",$C17,\"\")","v":""},"",{"$f":"IF(AK17=\"X\",$C17,\"\")","v":""},"",{"$f":"IF(AM17=\"X\",$C17,\"\")","v":""},"",{"$f":"IF(AO17=\"X\",$C17,\"\")","v":""},"",{"$f":"IF(AQ17=\"X\",$C17,\"\")","v":""},"",{"$f":"IF(AS17=\"X\",$C17,\"\")","v":""},"",{"$f":"IF(AU17=\"X\",$C17,\"\")","v":""},"",{"$f":"IF(AW17=\"X\",$C17,\"\")","v":""},"",{"$f":"IF(AY17=\"X\",$C17,\"\")","v":""},"",{"$f":"IF(BA17=\"X\",$C17,\"\")","v":""},"",{"$f":"IF(BC17=\"X\",$C17,\"\")","v":""},"",{"$f":"IF(BE17=\"X\",$C17,\"\")","v":""},"",{"$f":"IF(BG17=\"X\",$C17,\"\")","v":""},"",{"$f":"IF(BI17=\"X\",$C17,\"\")","v":""},"",{"$f":"IF(BK17=\"X\",$C17,\"\")","v":""},"",{"$f":"IF(BM17=\"X\",$C17,\"\")","v":""},"",{"$f":"IF(BO17=\"X\",$C17,\"\")","v":""},"",{"$f":"IF(BQ17=\"X\",$C17,\"\")","v":""},"",{"$f":"IF(BS17=\"X\",$C17,\"\")","v":""},"",{"$f":"IF(BU17=\"X\",$C17,\"\")","v":""},"",{"$f":"IF(BW17=\"X\",$C17,\"\")","v":""},"",{"$f":"IF(BY17=\"X\",$C17,\"\")","v":""},"",{"$f":"IF(CA17=\"X\",$C17,\"\")","v":""},"",{"$f":"IF(CC17=\"X\",$C17,\"\")","v":""},"",{"$f":"IF(CE17=\"X\",$C17,\"\")","v":""}]
[null,null,{"$f":"Liste!E17","v":36},{"$f":"Liste!D17","v":"Gallard Justeau"},"A",null,"","","","","",{"$f":"IF(K18=\"X\",$C18,\"\")","v":""},"",{"$f":"IF(M18=\"X\",$C18,\"\")","v":""},"",{"$f":"IF(O18=\"X\",$C18,\"\")","v":""},"","","",{"$f":"IF(S18=\"X\",$C18,\"\")","v":""},"",{"$f":"IF(U18=\"X\",$C18,\"\")","v":""},"",{"$f":"IF(W18=\"X\",$C18,\"\")","v":""},"","","",{"$f":"IF(AA18=\"X\",$C18,\"\")","v":""},"",{"$f":"IF(AC18=\"X\",$C18,\"\")","v":""},"",{"$f":"IF(AE18=\"X\",$C18,\"\")","v":""},"",{"$f":"IF(AG18=\"X\",$C18,\"\")","v":""},{"$f":"IF($E18=\"P\",$C18,\"\")","v":""},null,"",{"$f":"IF(AK18=\"X\",$C18,\"\")","v":""},"",{"$f":"IF(AM18=\"X\",$C18,\"\")","v":""},"",{"$f":"IF(AO18=\"X\",$C18,\"\")","v":""},"",{"$f":"IF(AQ18=\"X\",$C18,\"\")","v":""},"",{"$f":"IF(AS18=\"X\",$C18,\"\")","v":""},"",{"$f":"IF(AU18=\"X\",$C18,\"\")","v":""},"",{"$f":"IF(AW18=\"X\",$C18,\"\")","v":""},"",{"$f":"IF(AY18=\"X\",$C18,\"\")","v":""},"",{"$f":"IF(BA18=\"X\",$C18,\"\")","v":""},"",{"$f":"IF(BC18=\"X\",$C18,\"\")","v":""},"",{"$f":"IF(BE18=\"X\",$C18,\"\")","v":""},"",{"$f":"IF(BG18=\"X\",$C18,\"\")","v":""},"",{"$f":"IF(BI18=\"X\",$C18,\"\")","v":""},"",{"$f":"IF(BK18=\"X\",$C18,\"\")","v":""},"",{"$f":"IF(BM18=\"X\",$C18,\"\")","v":""},"",{"$f":"IF(BO18=\"X\",$C18,\"\")","v":""},"",{"$f":"IF(BQ18=\"X\",$C18,\"\")","v":""},"",{"$f":"IF(BS18=\"X\",$C18,\"\")","v":""},"",{"$f":"IF(BU18=\"X\",$C18,\"\")","v":""},"",{"$f":"IF(BW18=\"X\",$C18,\"\")","v":""},"",{"$f":"IF(BY18=\"X\",$C18,\"\")","v":""},"",{"$f":"IF(CA18=\"X\",$C18,\"\")","v":""},"",{"$f":"IF(CC18=\"X\",$C18,\"\")","v":""},"",{"$f":"IF(CE18=\"X\",$C18,\"\")","v":""}]
[null,null,{"$f":"Liste!E18","v":218},{"$f":"Liste!D18","v":"Gerbaud"},"A",null,"","","","","",{"$f":"IF(K19=\"X\",$C19,\"\")","v":""},"",{"$f":"IF(M19=\"X\",$C19,\"\")","v":""},"",{"$f":"IF(O19=\"X\",$C19,\"\")","v":""},"","","",{"$f":"IF(S19=\"X\",$C19,\"\")","v":""},"",{"$f":"IF(U19=\"X\",$C19,\"\")","v":""},"",{"$f":"IF(W19=\"X\",$C19,\"\")","v":""},"","","",{"$f":"IF(AA19=\"X\",$C19,\"\")","v":""},"",{"$f":"IF(AC19=\"X\",$C19,\"\")","v":""},"",{"$f":"IF(AE19=\"X\",$C19,\"\")","v":""},"",{"$f":"IF(AG19=\"X\",$C19,\"\")","v":""},"",{"$f":"IF(AI19=\"X\",$C19,\"\")","v":""},{"$f":"IF($E19=\"P\",$C19,\"\")","v":""},null,"",{"$f":"IF(AM19=\"X\",$C19,\"\")","v":""},"",{"$f":"IF(AO19=\"X\",$C19,\"\")","v":""},"",{"$f":"IF(AQ19=\"X\",$C19,\"\")","v":""},"",{"$f":"IF(AS19=\"X\",$C19,\"\")","v":""},"",{"$f":"IF(AU19=\"X\",$C19,\"\")","v":""},"",{"$f":"IF(AW19=\"X\",$C19,\"\")","v":""},"",{"$f":"IF(AY19=\"X\",$C19,\"\")","v":""},"",{"$f":"IF(BA19=\"X\",$C19,\"\")","v":""},"",{"$f":"IF(BC19=\"X\",$C19,\"\")","v":""},"",{"$f":"IF(BE19=\"X\",$C19,\"\")","v":""},"",{"$f":"IF(BG19=\"X\",$C19,\"\")","v":""},"",{"$f":"IF(BI19=\"X\",$C19,\"\")","v":""},"",{"$f":"IF(BK19=\"X\",$C19,\"\")","v":""},"",{"$f":"IF(BM19=\"X\",$C19,\"\")","v":""},"",{"$f":"IF(BO19=\"X\",$C19,\"\")","v":""},"",{"$f":"IF(BQ19=\"X\",$C19,\"\")","v":""},"",{"$f":"IF(BS19=\"X\",$C19,\"\")","v":""},"",{"$f":"IF(BU19=\"X\",$C19,\"\")","v":""},"",{"$f":"IF(BW19=\"X\",$C19,\"\")","v":""},"",{"$f":"IF(BY19=\"X\",$C19,\"\")","v":""},"",{"$f":"IF(CA19=\"X\",$C19,\"\")","v":""},"",{"$f":"IF(CC19=\"X\",$C19,\"\")","v":""},"",{"$f":"IF(CE19=\"X\",$C19,\"\")","v":""}]
[null,null,{"$f":"Liste!E19","v":306},{"$f":"Liste!D19","v":"Hamelin"},"M","Martinez","","","","","",{"$f":"IF(K20=\"X\",$C20,\"\")","v":""},"",{"$f":"IF(M20=\"X\",$C20,\"\")","v":""},"",{"$f":"IF(O20=\"X\",$C20,\"\")","v":""},{"$f":"IF(AND($E20=\"M\",EXACT($F20,Q$52)=TRUE),\"X\",\"\")","v":""},"",{"$f":"IF(AND($E20=\"M\",EXACT($F20,S$52)=TRUE),\"X\",\"\")","v":""},{"$f":"IF(S20=\"X\",$C20,\"\")","v":""},{"$f":"IF(AND($E20=\"M\",EXACT($F20,U$52)=TRUE),\"X\",\"\")","v":""},{"$f":"IF(U20=\"X\",$C20,\"\")","v":""},{"$f":"IF(AND($E20=\"M\",EXACT($F20,W$52)=TRUE),\"X\",\"\")","v":""},{"$f":"IF(W20=\"X\",$C20,\"\")","v":""},{"$f":"IF(AND($E20=\"M\",EXACT($F20,Y$52)=TRUE),\"X\",\"\")","v":""},"",{"$f":"IF(AND($E20=\"M\",EXACT($F20,AA$52)=TRUE),\"X\",\"\")","v":""},{"$f":"IF(AA20=\"X\",$C20,\"\")","v":""},{"$f":"IF(AND($E20=\"M\",EXACT($F20,AC$52)=TRUE),\"X\",\"\")","v":""},{"$f":"IF(AC20=\"X\",$C20,\"\")","v":""},{"$f":"IF(AND($E20=\"M\",EXACT($F20,AE$52)=TRUE),\"X\",\"\")","v":""},{"$f":"IF(AE20=\"X\",$C20,\"\")","v":""},{"$f":"IF(AND($E20=\"M\",EXACT($F20,AG$52)=TRUE),\"X\",\"\")","v":""},{"$f":"IF(AG20=\"X\",$C20,\"\")","v":""},{"$f":"IF(AND($E20=\"M\",EXACT($F20,AI$52)=TRUE),\"X\",\"\")","v":""},{"$f":"IF(AI20=\"X\",$C20,\"\")","v":""},"",{"$f":"IF(AK20=\"X\",$C20,\"\")","v":""},{"$f":"IF($E20=\"P\",$C20,\"\")","v":""},null,"",{"$f":"IF(AO20=\"X\",$C20,\"\")","v":""},"",{"$f":"IF(AQ20=\"X\",$C20,\"\")","v":""},"",{"$f":"IF(AS20=\"X\",$C20,\"\")","v":""},"X",{"$f":"IF(AU20=\"X\",$C20,\"\")","v":306},"",{"$f":"IF(AW20=\"X\",$C20,\"\")","v":""},"",{"$f":"IF(AY20=\"X\",$C20,\"\")","v":""},"",{"$f":"IF(BA20=\"X\",$C20,\"\")","v":""},"",{"$f":"IF(BC20=\"X\",$C20,\"\")","v":""},"",{"$f":"IF(BE20=\"X\",$C20,\"\")","v":""},"",{"$f":"IF(BG20=\"X\",$C20,\"\")","v":""},"",{"$f":"IF(BI20=\"X\",$C20,\"\")","v":""},"",{"$f":"IF(BK20=\"X\",$C20,\"\")","v":""},"",{"$f":"IF(BM20=\"X\",$C20,\"\")","v":""},"",{"$f":"IF(BO20=\"X\",$C20,\"\")","v":""},"",{"$f":"IF(BQ20=\"X\",$C20,\"\")","v":""},"",{"$f":"IF(BS20=\"X\",$C20,\"\")","v":""},"",{"$f":"IF(BU20=\"X\",$C20,\"\")","v":""},"",{"$f":"IF(BW20=\"X\",$C20,\"\")","v":""},"",{"$f":"IF(BY20=\"X\",$C20,\"\")","v":""},"",{"$f":"IF(CA20=\"X\",$C20,\"\")","v":""},{"$f":"IF(AND($E20=\"M\",EXACT($F20,CC$52)=TRUE),\"X\",\"\")","v":""},{"$f":"IF(CC20=\"X\",$C20,\"\")","v":""},{"$f":"IF(AND($E20=\"M\",EXACT($F20,CE$52)=TRUE),\"X\",\"\")","v":""},{"$f":"IF(CE20=\"X\",$C20,\"\")","v":""}]
[null,null,{"$f":"Liste!E20","v":245},{"$f":"Liste!D20","v":"Hugo"},"A",null,"","","","","",{"$f":"IF(K21=\"X\",$C21,\"\")","v":""},"",{"$f":"IF(M21=\"X\",$C21,\"\")","v":""},"",{"$f":"IF(O21=\"X\",$C21,\"\")","v":""},"","","",{"$f":"IF(S21=\"X\",$C21,\"\")","v":""},"",{"$f":"IF(U21=\"X\",$C21,\"\")","v":""},"",{"$f":"IF(W21=\"X\",$C21,\"\")","v":""},"","","",{"$f":"IF(AA21=\"X\",$C21,\"\")","v":""},"",{"$f":"IF(AC21=\"X\",$C21,\"\")","v":""},"",{"$f":"IF(AE21=\"X\",$C21,\"\")","v":""},"",{"$f":"IF(AG21=\"X\",$C21,\"\")","v":""},"",{"$f":"IF(AI21=\"X\",$C21,\"\")","v":""},{"$f":"IF(AND($E21=\"M\",EXACT($F21,AK$52)=TRUE),\"X\",\"\")","v":""},{"$f":"IF(AK21=\"X\",$C21,\"\")","v":""},"",{"$f":"IF(AM21=\"X\",$C21,\"\")","v":""},{"$f":"IF($E21=\"P\",$C21,\"\")","v":""},null,"",{"$f":"IF(AQ21=\"X\",$C21,\"\")","v":""},"",{"$f":"IF(AS21=\"X\",$C21,\"\")","v":""},"",{"$f":"IF(AU21=\"X\",$C21,\"\")","v":""},"",{"$f":"IF(AW21=\"X\",$C21,\"\")","v":""},"",{"$f":"IF(AY21=\"X\",$C21,\"\")","v":""},"",{"$f":"IF(BA21=\"X\",$C21,\"\")","v":""},"",{"$f":"IF(BC21=\"X\",$C21,\"\")","v":""},"",{"$f":"IF(BE21=\"X\",$C21,\"\")","v":""},"",{"$f":"IF(BG21=\"X\",$C21,\"\")","v":""},"",{"$f":"IF(BI21=\"X\",$C21,\"\")","v":""},"",{"$f":"IF(BK21=\"X\",$C21,\"\")","v":""},"",{"$f":"IF(BM21=\"X\",$C21,\"\")","v":""},"",{"$f":"IF(BO21=\"X\",$C21,\"\")","v":""},"",{"$f":"IF(BQ21=\"X\",$C21,\"\")","v":""},"",{"$f":"IF(BS21=\"X\",$C21,\"\")","v":""},"",{"$f":"IF(BU21=\"X\",$C21,\"\")","v":""},"",{"$f":"IF(BW21=\"X\",$C21,\"\")","v":""},"",{"$f":"IF(BY21=\"X\",$C21,\"\")","v":""},"",{"$f":"IF(CA21=\"X\",$C21,\"\")","v":""},"",{"$f":"IF(CC21=\"X\",$C21,\"\")","v":""},"",{"$f":"IF(CE21=\"X\",$C21,\"\")","v":""}]
[null,null,{"$f":"Liste!E21","v":202},{"$f":"Liste!D21","v":"Leveau"},"A",null,"","","","","",{"$f":"IF(K22=\"X\",$C22,\"\")","v":""},"",{"$f":"IF(M22=\"X\",$C22,\"\")","v":""},"",{"$f":"IF(O22=\"X\",$C22,\"\")","v":""},"","","",{"$f":"IF(S22=\"X\",$C22,\"\")","v":""},"",{"$f":"IF(U22=\"X\",$C22,\"\")","v":""},"",{"$f":"IF(W22=\"X\",$C22,\"\")","v":""},"","","",{"$f":"IF(AA22=\"X\",$C22,\"\")","v":""},"",{"$f":"IF(AC22=\"X\",$C22,\"\")","v":""},"",{"$f":"IF(AE22=\"X\",$C22,\"\")","v":""},"",{"$f":"IF(AG22=\"X\",$C22,\"\")","v":""},"",{"$f":"IF(AI22=\"X\",$C22,\"\")","v":""},"",{"$f":"IF(AK22=\"X\",$C22,\"\")","v":""},{"$f":"IF(AND($E22=\"M\",EXACT($F22,AM$52)=TRUE),\"X\",\"\")","v":""},{"$f":"IF(AM22=\"X\",$C22,\"\")","v":""},"",{"$f":"IF(AO22=\"X\",$C22,\"\")","v":""},{"$f":"IF($E22=\"P\",$C22,\"\")","v":""},null,"",{"$f":"IF(AS22=\"X\",$C22,\"\")","v":""},"",{"$f":"IF(AU22=\"X\",$C22,\"\")","v":""},"",{"$f":"IF(AW22=\"X\",$C22,\"\")","v":""},"",{"$f":"IF(AY22=\"X\",$C22,\"\")","v":""},"",{"$f":"IF(BA22=\"X\",$C22,\"\")","v":""},"",{"$f":"IF(BC22=\"X\",$C22,\"\")","v":""},"",{"$f":"IF(BE22=\"X\",$C22,\"\")","v":""},"",{"$f":"IF(BG22=\"X\",$C22,\"\")","v":""},"",{"$f":"IF(BI22=\"X\",$C22,\"\")","v":""},"",{"$f":"IF(BK22=\"X\",$C22,\"\")","v":""},"",{"$f":"IF(BM22=\"X\",$C22,\"\")","v":""},"",{"$f":"IF(BO22=\"X\",$C22,\"\")","v":""},"",{"$f":"IF(BQ22=\"X\",$C22,\"\")","v":""},"",{"$f":"IF(BS22=\"X\",$C22,\"\")","v":""},"",{"$f":"IF(BU22=\"X\",$C22,\"\")","v":""},"",{"$f":"IF(BW22=\"X\",$C22,\"\")","v":""},"",{"$f":"IF(BY22=\"X\",$C22,\"\")","v":""},"",{"$f":"IF(CA22=\"X\",$C22,\"\")","v":""},"",{"$f":"IF(CC22=\"X\",$C22,\"\")","v":""},"",{"$f":"IF(CE22=\"X\",$C22,\"\")","v":""}]
[null,null,{"$f":"Liste!E22","v":230},{"$f":"Liste!D22","v":"Mandrile"},"A",null,"","","","","",{"$f":"IF(K23=\"X\",$C23,\"\")","v":""},"",{"$f":"IF(M23=\"X\",$C23,\"\")","v":""},"",{"$f":"IF(O23=\"X\",$C23,\"\")","v":""},"","","",{"$f":"IF(S23=\"X\",$C23,\"\")","v":""},"",{"$f":"IF(U23=\"X\",$C23,\"\")","v":""},"",{"$f":"IF(W23=\"X\",$C23,\"\")","v":""},"","","",{"$f":"IF(AA23=\"X\",$C23,\"\")","v":""},"",{"$f":"IF(AC23=\"X\",$C23,\"\")","v":""},"",{"$f":"IF(AE23=\"X\",$C23,\"\")","v":""},"",{"$f":"IF(AG23=\"X\",$C23,\"\")","v":""},"",{"$f":"IF(AI23=\"X\",$C23,\"\")","v":""},"",{"$f":"IF(AK23=\"X\",$C23,\"\")","v":""},"",{"$f":"IF(AM23=\"X\",$C23,\"\")","v":""},{"$f":"IF(AND($E23=\"M\",EXACT($F23,AO$52)=TRUE),\"X\",\"\")","v":""},{"$f":"IF(AO23=\"X\",$C23,\"\")","v":""},{"$f":"IF(AND($E23=\"M\",EXACT($F23,AQ$52)=TRUE),\"X\",\"\")","v":""},{"$f":"IF(AQ23=\"X\",$C23,\"\")","v":""},{"$f":"IF($E23=\"P\",$C23,\"\")","v":""},null,"",{"$f":"IF(AU23=\"X\",$C23,\"\")","v":""},"",{"$f":"IF(AW23=\"X\",$C23,\"\")","v":""},"",{"$f":"IF(AY23=\"X\",$C23,\"\")","v":""},"",{"$f":"IF(BA23=\"X\",$C23,\"\")","v":""},"",{"$f":"IF(BC23=\"X\",$C23,\"\")","v":""},"",{"$f":"IF(BE23=\"X\",$C23,\"\")","v":""},"",{"$f":"IF(BG23=\"X\",$C23,\"\")","v":""},"",{"$f":"IF(BI23=\"X\",$C23,\"\")","v":""},"",{"$f":"IF(BK23=\"X\",$C23,\"\")","v":""},"",{"$f":"IF(BM23=\"X\",$C23,\"\")","v":""},"",{"$f":"IF(BO23=\"X\",$C23,\"\")","v":""},"",{"$f":"IF(BQ23=\"X\",$C23,\"\")","v":""},"",{"$f":"IF(BS23=\"X\",$C23,\"\")","v":""},"",{"$f":"IF(BU23=\"X\",$C23,\"\")","v":""},"",{"$f":"IF(BW23=\"X\",$C23,\"\")","v":""},"",{"$f":"IF(BY23=\"X\",$C23,\"\")","v":""},"",{"$f":"IF(CA23=\"X\",$C23,\"\")","v":""},"",{"$f":"IF(CC23=\"X\",$C23,\"\")","v":""},"",{"$f":"IF(CE23=\"X\",$C23,\"\")","v":""}]
[null,null,{"$f":"Liste!E23","v":187},{"$f":"Liste!D23","v":"Martinez"},"P",null,"","","","","",{"$f":"IF(K24=\"X\",$C24,\"\")","v":""},"",{"$f":"IF(M24=\"X\",$C24,\"\")","v":""},"",{"$f":"IF(O24=\"X\",$C24,\"\")","v":""},"","","",{"$f":"IF(S24=\"X\",$C24,\"\")","v":""},"",{"$f":"IF(U24=\"X\",$C24,\"\")","v":""},"",{"$f":"IF(W24=\"X\",$C24,\"\")","v":""},"","","",{"$f":"IF(AA24=\"X\",$C24,\"\")","v":""},"",{"$f":"IF(AC24=\"X\",$C24,\"\")","v":""},"",{"$f":"IF(AE24=\"X\",$C24,\"\")","v":""},"",{"$f":"IF(AG24=\"X\",$C24,\"\")","v":""},"",{"$f":"IF(AI24=\"X\",$C24,\"\")","v":""},"",{"$f":"IF(AK24=\"X\",$C24,\"\")","v":""},"",{"$f":"IF(AM24=\"X\",$C24,\"\")","v":""},"",{"$f":"IF(AO24=\"X\",$C24,\"\")","v":""},"",{"$f":"IF(AQ24=\"X\",$C24,\"\")","v":""},{"$f":"IF(AND($E24=\"M\",EXACT($F24,AS$52)=TRUE),\"X\",\"\")","v":""},{"$f":"IF(AS24=\"X\",$C24,\"\")","v":""},{"$f":"IF($E24=\"P\",$C24,\"\")","v":187},null,"",{"$f":"IF(AW24=\"X\",$C24,\"\")","v":""},"",{"$f":"IF(AY24=\"X\",$C24,\"\")","v":""},"",{"$f":"IF(BA24=\"X\",$C24,\"\")","v":""},"",{"$f":"IF(BC24=\"X\",$C24,\"\")","v":""},"",{"$f":"IF(BE24=\"X\",$C24,\"\")","v":""},"",{"$f":"IF(BG24=\"X\",$C24,\"\")","v":""},"",{"$f":"IF(BI24=\"X\",$C24,\"\")","v":""},"",{"$f":"IF(BK24=\"X\",$C24,\"\")","v":""},"",{"$f":"IF(BM24=\"X\",$C24,\"\")","v":""},"",{"$f":"IF(BO24=\"X\",$C24,\"\")","v":""},"",{"$f":"IF(BQ24=\"X\",$C24,\"\")","v":""},"",{"$f":"IF(BS24=\"X\",$C24,\"\")","v":""},"",{"$f":"IF(BU24=\"X\",$C24,\"\")","v":""},"",{"$f":"IF(BW24=\"X\",$C24,\"\")","v":""},"",{"$f":"IF(BY24=\"X\",$C24,\"\")","v":""},"",{"$f":"IF(CA24=\"X\",$C24,\"\")","v":""},"",{"$f":"IF(CC24=\"X\",$C24,\"\")","v":""},"",{"$f":"IF(CE24=\"X\",$C24,\"\")","v":""}]
[null,null,{"$f":"Liste!E24","v":214},{"$f":"Liste!D24","v":"Megie"},"A",null,"","","","","",{"$f":"IF(K25=\"X\",$C25,\"\")","v":""},"",{"$f":"IF(M25=\"X\",$C25,\"\")","v":""},"",{"$f":"IF(O25=\"X\",$C25,\"\")","v":""},"","","",{"$f":"IF(S25=\"X\",$C25,\"\")","v":""},"",{"$f":"IF(U25=\"X\",$C25,\"\")","v":""},"",{"$f":"IF(W25=\"X\",$C25,\"\")","v":""},"","","",{"$f":"IF(AA25=\"X\",$C25,\"\")","v":""},"",{"$f":"IF(AC25=\"X\",$C25,\"\")","v":""},"",{"$f":"IF(AE25=\"X\",$C25,\"\")","v":""},"",{"$f":"IF(AG25=\"X\",$C25,\"\")","v":""},"",{"$f":"IF(AI25=\"X\",$C25,\"\")","v":""},"",{"$f":"IF(AK25=\"X\",$C25,\"\")","v":""},"",{"$f":"IF(AM25=\"X\",$C25,\"\")","v":""},"",{"$f":"IF(AO25=\"X\",$C25,\"\")","v":""},"",{"$f":"IF(AQ25=\"X\",$C25,\"\")","v":""},"",{"$f":"IF(AS25=\"X\",$C25,\"\")","v":""},{"$f":"IF(AND($E25=\"M\",EXACT($F25,AU$52)=TRUE),\"X\",\"\")","v":""},{"$f":"IF(AU25=\"X\",$C25,\"\")","v":""},{"$f":"IF($E25=\"P\",$C25,\"\")","v":""},null,"",{"$f":"IF(AY25=\"X\",$C25,\"\")","v":""},"",{"$f":"IF(BA25=\"X\",$C25,\"\")","v":""},"",{"$f":"IF(BC25=\"X\",$C25,\"\")","v":""},"",{"$f":"IF(BE25=\"X\",$C25,\"\")","v":""},"",{"$f":"IF(BG25=\"X\",$C25,\"\")","v":""},"",{"$f":"IF(BI25=\"X\",$C25,\"\")","v":""},"",{"$f":"IF(BK25=\"X\",$C25,\"\")","v":""},"",{"$f":"IF(BM25=\"X\",$C25,\"\")","v":""},"",{"$f":"IF(BO25=\"X\",$C25,\"\")","v":""},"",{"$f":"IF(BQ25=\"X\",$C25,\"\")","v":""},"",{"$f":"IF(BS25=\"X\",$C25,\"\")","v":""},"",{"$f":"IF(BU25=\"X\",$C25,\"\")","v":""},"",{"$f":"IF(BW25=\"X\",$C25,\"\")","v":""},"",{"$f":"IF(BY25=\"X\",$C25,\"\")","v":""},"",{"$f":"IF(CA25=\"X\",$C25,\"\")","v":""},"",{"$f":"IF(CC25=\"X\",$C25,\"\")","v":""},"",{"$f":"IF(CE25=\"X\",$C25,\"\")","v":""}]
[null,null,{"$f":"Liste!E25","v":337},{"$f":"Liste!D25","v":"Morana F."},"A",null,"","","","","",{"$f":"IF(K26=\"X\",$C26,\"\")","v":""},"",{"$f":"IF(M26=\"X\",$C26,\"\")","v":""},"",{"$f":"IF(O26=\"X\",$C26,\"\")","v":""},"","","",{"$f":"IF(S26=\"X\",$C26,\"\")","v":""},"",{"$f":"IF(U26=\"X\",$C26,\"\")","v":""},"",{"$f":"IF(W26=\"X\",$C26,\"\")","v":""},"","","",{"$f":"IF(AA26=\"X\",$C26,\"\")","v":""},"",{"$f":"IF(AC26=\"X\",$C26,\"\")","v":""},"",{"$f":"IF(AE26=\"X\",$C26,\"\")","v":""},"",{"$f":"IF(AG26=\"X\",$C26,\"\")","v":""},"",{"$f":"IF(AI26=\"X\",$C26,\"\")","v":""},"",{"$f":"IF(AK26=\"X\",$C26,\"\")","v":""},"",{"$f":"IF(AM26=\"X\",$C26,\"\")","v":""},"",{"$f":"IF(AO26=\"X\",$C26,\"\")","v":""},"",{"$f":"IF(AQ26=\"X\",$C26,\"\")","v":""},"",{"$f":"IF(AS26=\"X\",$C26,\"\")","v":""},"",{"$f":"IF(AU26=\"X\",$C26,\"\")","v":""},{"$f":"IF(AND($E26=\"M\",EXACT($F26,AW$52)=TRUE),\"X\",\"\")","v":""},{"$f":"IF(AW26=\"X\",$C26,\"\")","v":""},{"$f":"IF($E26=\"P\",$C26,\"\")","v":""},null,"",{"$f":"IF(BA26=\"X\",$C26,\"\")","v":""},"",{"$f":"IF(BC26=\"X\",$C26,\"\")","v":""},"",{"$f":"IF(BE26=\"X\",$C26,\"\")","v":""},"",{"$f":"IF(BG26=\"X\",$C26,\"\")","v":""},"",{"$f":"IF(BI26=\"X\",$C26,\"\")","v":""},"",{"$f":"IF(BK26=\"X\",$C26,\"\")","v":""},"",{"$f":"IF(BM26=\"X\",$C26,\"\")","v":""},"",{"$f":"IF(BO26=\"X\",$C26,\"\")","v":""},"",{"$f":"IF(BQ26=\"X\",$C26,\"\")","v":""},"",{"$f":"IF(BS26=\"X\",$C26,\"\")","v":""},"",{"$f":"IF(BU26=\"X\",$C26,\"\")","v":""},"",{"$f":"IF(BW26=\"X\",$C26,\"\")","v":""},"",{"$f":"IF(BY26=\"X\",$C26,\"\")","v":""},"",{"$f":"IF(CA26=\"X\",$C26,\"\")","v":""},"",{"$f":"IF(CC26=\"X\",$C26,\"\")","v":""},"",{"$f":"IF(CE26=\"X\",$C26,\"\")","v":""}]
[null,null,{"$f":"Liste!E26","v":340},{"$f":"Liste!D26","v":"Morana AM"},"A",null,"","","","","",{"$f":"IF(K27=\"X\",$C27,\"\")","v":""},"",{"$f":"IF(M27=\"X\",$C27,\"\")","v":""},"",{"$f":"IF(O27=\"X\",$C27,\"\")","v":""},"","","",{"$f":"IF(S27=\"X\",$C27,\"\")","v":""},"",{"$f":"IF(U27=\"X\",$C27,\"\")","v":""},"",{"$f":"IF(W27=\"X\",$C27,\"\")","v":""},"","","",{"$f":"IF(AA27=\"X\",$C27,\"\")","v":""},"",{"$f":"IF(AC27=\"X\",$C27,\"\")","v":""},"",{"$f":"IF(AE27=\"X\",$C27,\"\")","v":""},"",{"$f":"IF(AG27=\"X\",$C27,\"\")","v":""},"",{"$f":"IF(AI27=\"X\",$C27,\"\")","v":""},"",{"$f":"IF(AK27=\"X\",$C27,\"\")","v":""},"",{"$f":"IF(AM27=\"X\",$C27,\"\")","v":""},"",{"$f":"IF(AO27=\"X\",$C27,\"\")","v":""},"",{"$f":"IF(AQ27=\"X\",$C27,\"\")","v":""},"",{"$f":"IF(AS27=\"X\",$C27,\"\")","v":""},"",{"$f":"IF(AU27=\"X\",$C27,\"\")","v":""},"",{"$f":"IF(AW27=\"X\",$C27,\"\")","v":""},{"$f":"IF(AND($E27=\"M\",EXACT($F27,AY$52)=TRUE),\"X\",\"\")","v":""},{"$f":"IF(AY27=\"X\",$C27,\"\")","v":""},{"$f":"IF($E27=\"P\",$C27,\"\")","v":""},null,"",{"$f":"IF(BC27=\"X\",$C27,\"\")","v":""},"",{"$f":"IF(BE27=\"X\",$C27,\"\")","v":""},"",{"$f":"IF(BG27=\"X\",$C27,\"\")","v":""},"",{"$f":"IF(BI27=\"X\",$C27,\"\")","v":""},"",{"$f":"IF(BK27=\"X\",$C27,\"\")","v":""},"",{"$f":"IF(BM27=\"X\",$C27,\"\")","v":""},"",{"$f":"IF(BO27=\"X\",$C27,\"\")","v":""},"",{"$f":"IF(BQ27=\"X\",$C27,\"\")","v":""},"",{"$f":"IF(BS27=\"X\",$C27,\"\")","v":""},"",{"$f":"IF(BU27=\"X\",$C27,\"\")","v":""},"",{"$f":"IF(BW27=\"X\",$C27,\"\")","v":""},"",{"$f":"IF(BY27=\"X\",$C27,\"\")","v":""},"",{"$f":"IF(CA27=\"X\",$C27,\"\")","v":""},"",{"$f":"IF(CC27=\"X\",$C27,\"\")","v":""},"",{"$f":"IF(CE27=\"X\",$C27,\"\")","v":""}]
[null,null,{"$f":"Liste!E27","v":265},{"$f":"Liste!D27","v":"Morana L"},"A",null,"","","","","",{"$f":"IF(K28=\"X\",$C28,\"\")","v":""},"",{"$f":"IF(M28=\"X\",$C28,\"\")","v":""},"",{"$f":"IF(O28=\"X\",$C28,\"\")","v":""},"","","",{"$f":"IF(S28=\"X\",$C28,\"\")","v":""},"",{"$f":"IF(U28=\"X\",$C28,\"\")","v":""},"",{"$f":"IF(W28=\"X\",$C28,\"\")","v":""},"","","",{"$f":"IF(AA28=\"X\",$C28,\"\")","v":""},"",{"$f":"IF(AC28=\"X\",$C28,\"\")","v":""},"",{"$f":"IF(AE28=\"X\",$C28,\"\")","v":""},"",{"$f":"IF(AG28=\"X\",$C28,\"\")","v":""},"",{"$f":"IF(AI28=\"X\",$C28,\"\")","v":""},"",{"$f":"IF(AK28=\"X\",$C28,\"\")","v":""},"",{"$f":"IF(AM28=\"X\",$C28,\"\")","v":""},"",{"$f":"IF(AO28=\"X\",$C28,\"\")","v":""},"",{"$f":"IF(AQ28=\"X\",$C28,\"\")","v":""},"",{"$f":"IF(AS28=\"X\",$C28,\"\")","v":""},"",{"$f":"IF(AU28=\"X\",$C28,\"\")","v":""},"",{"$f":"IF(AW28=\"X\",$C28,\"\")","v":""},"",{"$f":"IF(AY28=\"X\",$C28,\"\")","v":""},{"$f":"IF(AND($E28=\"M\",EXACT($F28,BA$52)=TRUE),\"X\",\"\")","v":""},{"$f":"IF(BA28=\"X\",$C28,\"\")","v":""},{"$f":"IF($E28=\"P\",$C28,\"\")","v":""},null,"",{"$f":"IF(BE28=\"X\",$C28,\"\")","v":""},"",{"$f":"IF(BG28=\"X\",$C28,\"\")","v":""},"",{"$f":"IF(BI28=\"X\",$C28,\"\")","v":""},"",{"$f":"IF(BK28=\"X\",$C28,\"\")","v":""},"",{"$f":"IF(BM28=\"X\",$C28,\"\")","v":""},"",{"$f":"IF(BO28=\"X\",$C28,\"\")","v":""},"",{"$f":"IF(BQ28=\"X\",$C28,\"\")","v":""},"",{"$f":"IF(BS28=\"X\",$C28,\"\")","v":""},"",{"$f":"IF(BU28=\"X\",$C28,\"\")","v":""},"",{"$f":"IF(BW28=\"X\",$C28,\"\")","v":""},"",{"$f":"IF(BY28=\"X\",$C28,\"\")","v":""},"",{"$f":"IF(CA28=\"X\",$C28,\"\")","v":""},"",{"$f":"IF(CC28=\"X\",$C28,\"\")","v":""},"",{"$f":"IF(CE28=\"X\",$C28,\"\")","v":""}]
[null,null,{"$f":"Liste!E28","v":264},{"$f":"Liste!D28","v":"Morana P"},"A",null,"","","","","",{"$f":"IF(K29=\"X\",$C29,\"\")","v":""},"",{"$f":"IF(M29=\"X\",$C29,\"\")","v":""},"",{"$f":"IF(O29=\"X\",$C29,\"\")","v":""},"","","",{"$f":"IF(S29=\"X\",$C29,\"\")","v":""},"",{"$f":"IF(U29=\"X\",$C29,\"\")","v":""},"",{"$f":"IF(W29=\"X\",$C29,\"\")","v":""},"","","",{"$f":"IF(AA29=\"X\",$C29,\"\")","v":""},"",{"$f":"IF(AC29=\"X\",$C29,\"\")","v":""},"",{"$f":"IF(AE29=\"X\",$C29,\"\")","v":""},"",{"$f":"IF(AG29=\"X\",$C29,\"\")","v":""},"",{"$f":"IF(AI29=\"X\",$C29,\"\")","v":""},"",{"$f":"IF(AK29=\"X\",$C29,\"\")","v":""},"",{"$f":"IF(AM29=\"X\",$C29,\"\")","v":""},"",{"$f":"IF(AO29=\"X\",$C29,\"\")","v":""},"",{"$f":"IF(AQ29=\"X\",$C29,\"\")","v":""},"",{"$f":"IF(AS29=\"X\",$C29,\"\")","v":""},"",{"$f":"IF(AU29=\"X\",$C29,\"\")","v":""},"",{"$f":"IF(AW29=\"X\",$C29,\"\")","v":""},"",{"$f":"IF(AY29=\"X\",$C29,\"\")","v":""},"",{"$f":"IF(BA29=\"X\",$C29,\"\")","v":""},{"$f":"IF(AND($E29=\"M\",EXACT($F29,BC$52)=TRUE),\"X\",\"\")","v":""},{"$f":"IF(BC29=\"X\",$C29,\"\")","v":""},{"$f":"IF($E29=\"P\",$C29,\"\")","v":""},null,"",{"$f":"IF(BG29=\"X\",$C29,\"\")","v":""},"",{"$f":"IF(BI29=\"X\",$C29,\"\")","v":""},"",{"$f":"IF(BK29=\"X\",$C29,\"\")","v":""},"",{"$f":"IF(BM29=\"X\",$C29,\"\")","v":""},"",{"$f":"IF(BO29=\"X\",$C29,\"\")","v":""},"",{"$f":"IF(BQ29=\"X\",$C29,\"\")","v":""},"",{"$f":"IF(BS29=\"X\",$C29,\"\")","v":""},"",{"$f":"IF(BU29=\"X\",$C29,\"\")","v":""},"",{"$f":"IF(BW29=\"X\",$C29,\"\")","v":""},"",{"$f":"IF(BY29=\"X\",$C29,\"\")","v":""},"",{"$f":"IF(CA29=\"X\",$C29,\"\")","v":""},"",{"$f":"IF(CC29=\"X\",$C29,\"\")","v":""},"",{"$f":"IF(CE29=\"X\",$C29,\"\")","v":""}]
[null,null,{"$f":"Liste!E29","v":201},{"$f":"Liste!D29","v":"Optimo SCI"},"A",null,"","","","","",{"$f":"IF(K30=\"X\",$C30,\"\")","v":""},"",{"$f":"IF(M30=\"X\",$C30,\"\")","v":""},"",{"$f":"IF(O30=\"X\",$C30,\"\")","v":""},"","","",{"$f":"IF(S30=\"X\",$C30,\"\")","v":""},"",{"$f":"IF(U30=\"X\",$C30,\"\")","v":""},"",{"$f":"IF(W30=\"X\",$C30,\"\")","v":""},"","","",{"$f":"IF(AA30=\"X\",$C30,\"\")","v":""},"",{"$f":"IF(AC30=\"X\",$C30,\"\")","v":""},"",{"$f":"IF(AE30=\"X\",$C30,\"\")","v":""},"",{"$f":"IF(AG30=\"X\",$C30,\"\")","v":""},"",{"$f":"IF(AI30=\"X\",$C30,\"\")","v":""},"",{"$f":"IF(AK30=\"X\",$C30,\"\")","v":""},"",{"$f":"IF(AM30=\"X\",$C30,\"\")","v":""},"",{"$f":"IF(AO30=\"X\",$C30,\"\")","v":""},"",{"$f":"IF(AQ30=\"X\",$C30,\"\")","v":""},"",{"$f":"IF(AS30=\"X\",$C30,\"\")","v":""},"",{"$f":"IF(AU30=\"X\",$C30,\"\")","v":""},"",{"$f":"IF(AW30=\"X\",$C30,\"\")","v":""},"",{"$f":"IF(AY30=\"X\",$C30,\"\")","v":""},"",{"$f":"IF(BA30=\"X\",$C30,\"\")","v":""},"",{"$f":"IF(BC30=\"X\",$C30,\"\")","v":""},{"$f":"IF(AND($E30=\"M\",EXACT($F30,BE$52)=TRUE),\"X\",\"\")","v":""},{"$f":"IF(BE30=\"X\",$C30,\"\")","v":""},{"$f":"IF($E30=\"P\",$C30,\"\")","v":""},null,"",{"$f":"IF(BI30=\"X\",$C30,\"\")","v":""},"",{"$f":"IF(BK30=\"X\",$C30,\"\")","v":""},"",{"$f":"IF(BM30=\"X\",$C30,\"\")","v":""},"",{"$f":"IF(BO30=\"X\",$C30,\"\")","v":""},"",{"$f":"IF(BQ30=\"X\",$C30,\"\")","v":""},"",{"$f":"IF(BS30=\"X\",$C30,\"\")","v":""},"",{"$f":"IF(BU30=\"X\",$C30,\"\")","v":""},"",{"$f":"IF(BW30=\"X\",$C30,\"\")","v":""},"",{"$f":"IF(BY30=\"X\",$C30,\"\")","v":""},"",{"$f":"IF(CA30=\"X\",$C30,\"\")","v":""},"",{"$f":"IF(CC30=\"X\",$C30,\"\")","v":""},"",{"$f":"IF(CE30=\"X\",$C30,\"\")","v":""}]
[null,null,{"$f":"Liste!E30","v":379},{"$f":"Liste!D30","v":"Ortega J."},"P",null,"","","","","",{"$f":"IF(K31=\"X\",$C31,\"\")","v":""},"",{"$f":"IF(M31=\"X\",$C31,\"\")","v":""},"",{"$f":"IF(O31=\"X\",$C31,\"\")","v":""},"","","",{"$f":"IF(S31=\"X\",$C31,\"\")","v":""},"",{"$f":"IF(U31=\"X\",$C31,\"\")","v":""},"",{"$f":"IF(W31=\"X\",$C31,\"\")","v":""},"","","",{"$f":"IF(AA31=\"X\",$C31,\"\")","v":""},"",{"$f":"IF(AC31=\"X\",$C31,\"\")","v":""},"",{"$f":"IF(AE31=\"X\",$C31,\"\")","v":""},"",{"$f":"IF(AG31=\"X\",$C31,\"\")","v":""},"",{"$f":"IF(AI31=\"X\",$C31,\"\")","v":""},"",{"$f":"IF(AK31=\"X\",$C31,\"\")","v":""},"",{"$f":"IF(AM31=\"X\",$C31,\"\")","v":""},"",{"$f":"IF(AO31=\"X\",$C31,\"\")","v":""},"",{"$f":"IF(AQ31=\"X\",$C31,\"\")","v":""},"",{"$f":"IF(AS31=\"X\",$C31,\"\")","v":""},"",{"$f":"IF(AU31=\"X\",$C31,\"\")","v":""},"",{"$f":"IF(AW31=\"X\",$C31,\"\")","v":""},"",{"$f":"IF(AY31=\"X\",$C31,\"\")","v":""},"",{"$f":"IF(BA31=\"X\",$C31,\"\")","v":""},"",{"$f":"IF(BC31=\"X\",$C31,\"\")","v":""},"",{"$f":"IF(BE31=\"X\",$C31,\"\")","v":""},{"$f":"IF(AND($E31=\"M\",EXACT($F31,BG$52)=TRUE),\"X\",\"\")","v":""},{"$f":"IF(BG31=\"X\",$C31,\"\")","v":""},{"$f":"IF($E31=\"P\",$C31,\"\")","v":379},null,"",{"$f":"IF(BK31=\"X\",$C31,\"\")","v":""},"",{"$f":"IF(BM31=\"X\",$C31,\"\")","v":""},"",{"$f":"IF(BO31=\"X\",$C31,\"\")","v":""},"",{"$f":"IF(BQ31=\"X\",$C31,\"\")","v":""},"",{"$f":"IF(BS31=\"X\",$C31,\"\")","v":""},"",{"$f":"IF(BU31=\"X\",$C31,\"\")","v":""},"",{"$f":"IF(BW31=\"X\",$C31,\"\")","v":""},"",{"$f":"IF(BY31=\"X\",$C31,\"\")","v":""},"",{"$f":"IF(CA31=\"X\",$C31,\"\")","v":""},"",{"$f":"IF(CC31=\"X\",$C31,\"\")","v":""},"",{"$f":"IF(CE31=\"X\",$C31,\"\")","v":""}]
[null,null,{"$f":"Liste!E31","v":265},{"$f":"Liste!D31","v":"Ortega S."},"A",null,"","","","","",{"$f":"IF(K32=\"X\",$C32,\"\")","v":""},"",{"$f":"IF(M32=\"X\",$C32,\"\")","v":""},"",{"$f":"IF(O32=\"X\",$C32,\"\")","v":""},"","","",{"$f":"IF(S32=\"X\",$C32,\"\")","v":""},"",{"$f":"IF(U32=\"X\",$C32,\"\")","v":""},"",{"$f":"IF(W32=\"X\",$C32,\"\")","v":""},"","","",{"$f":"IF(AA32=\"X\",$C32,\"\")","v":""},"",{"$f":"IF(AC32=\"X\",$C32,\"\")","v":""},"",{"$f":"IF(AE32=\"X\",$C32,\"\")","v":""},"",{"$f":"IF(AG32=\"X\",$C32,\"\")","v":""},"",{"$f":"IF(AI32=\"X\",$C32,\"\")","v":""},"",{"$f":"IF(AK32=\"X\",$C32,\"\")","v":""},"",{"$f":"IF(AM32=\"X\",$C32,\"\")","v":""},"",{"$f":"IF(AO32=\"X\",$C32,\"\")","v":""},"",{"$f":"IF(AQ32=\"X\",$C32,\"\")","v":""},"",{"$f":"IF(AS32=\"X\",$C32,\"\")","v":""},"",{"$f":"IF(AU32=\"X\",$C32,\"\")","v":""},"",{"$f":"IF(AW32=\"X\",$C32,\"\")","v":""},"",{"$f":"IF(AY32=\"X\",$C32,\"\")","v":""},"",{"$f":"IF(BA32=\"X\",$C32,\"\")","v":""},"",{"$f":"IF(BC32=\"X\",$C32,\"\")","v":""},"",{"$f":"IF(BE32=\"X\",$C32,\"\")","v":""},"",{"$f":"IF(BG32=\"X\",$C32,\"\")","v":""},{"$f":"IF(AND($E32=\"M\",EXACT($F32,BI$52)=TRUE),\"X\",\"\")","v":""},{"$f":"IF(BI32=\"X\",$C32,\"\")","v":""},{"$f":"IF($E32=\"P\",$C32,\"\")","v":""},null,"",{"$f":"IF(BM32=\"X\",$C32,\"\")","v":""},"",{"$f":"IF(BO32=\"X\",$C32,\"\")","v":""},"",{"$f":"IF(BQ32=\"X\",$C32,\"\")","v":""},"",{"$f":"IF(BS32=\"X\",$C32,\"\")","v":""},"",{"$f":"IF(BU32=\"X\",$C32,\"\")","v":""},"",{"$f":"IF(BW32=\"X\",$C32,\"\")","v":""},"",{"$f":"IF(BY32=\"X\",$C32,\"\")","v":""},"",{"$f":"IF(CA32=\"X\",$C32,\"\")","v":""},"",{"$f":"IF(CC32=\"X\",$C32,\"\")","v":""},"",{"$f":"IF(CE32=\"X\",$C32,\"\")","v":""}]
[null,null,{"$f":"Liste!E32","v":51},{"$f":"Liste!D32","v":"Piochot"},"A",null,"","","","","",{"$f":"IF(K33=\"X\",$C33,\"\")","v":""},"",{"$f":"IF(M33=\"X\",$C33,\"\")","v":""},"",{"$f":"IF(O33=\"X\",$C33,\"\")","v":""},"","","",{"$f":"IF(S33=\"X\",$C33,\"\")","v":""},"",{"$f":"IF(U33=\"X\",$C33,\"\")","v":""},"",{"$f":"IF(W33=\"X\",$C33,\"\")","v":""},"","","",{"$f":"IF(AA33=\"X\",$C33,\"\")","v":""},"",{"$f":"IF(AC33=\"X\",$C33,\"\")","v":""},"",{"$f":"IF(AE33=\"X\",$C33,\"\")","v":""},"",{"$f":"IF(AG33=\"X\",$C33,\"\")","v":""},"",{"$f":"IF(AI33=\"X\",$C33,\"\")","v":""},"",{"$f":"IF(AK33=\"X\",$C33,\"\")","v":""},"",{"$f":"IF(AM33=\"X\",$C33,\"\")","v":""},"",{"$f":"IF(AO33=\"X\",$C33,\"\")","v":""},"",{"$f":"IF(AQ33=\"X\",$C33,\"\")","v":""},"",{"$f":"IF(AS33=\"X\",$C33,\"\")","v":""},"",{"$f":"IF(AU33=\"X\",$C33,\"\")","v":""},"",{"$f":"IF(AW33=\"X\",$C33,\"\")","v":""},"",{"$f":"IF(AY33=\"X\",$C33,\"\")","v":""},"",{"$f":"IF(BA33=\"X\",$C33,\"\")","v":""},"",{"$f":"IF(BC33=\"X\",$C33,\"\")","v":""},"",{"$f":"IF(BE33=\"X\",$C33,\"\")","v":""},"",{"$f":"IF(BG33=\"X\",$C33,\"\")","v":""},"",{"$f":"IF(BI33=\"X\",$C33,\"\")","v":""},{"$f":"IF(AND($E33=\"M\",EXACT($F33,BK$52)=TRUE),\"X\",\"\")","v":""},{"$f":"IF(BK33=\"X\",$C33,\"\")","v":""},{"$f":"IF($E33=\"P\",$C33,\"\")","v":""},null,"",{"$f":"IF(BO33=\"X\",$C33,\"\")","v":""},"",{"$f":"IF(BQ33=\"X\",$C33,\"\")","v":""},"",{"$f":"IF(BS33=\"X\",$C33,\"\")","v":""},"",{"$f":"IF(BU33=\"X\",$C33,\"\")","v":""},"",{"$f":"IF(BW33=\"X\",$C33,\"\")","v":""},"",{"$f":"IF(BY33=\"X\",$C33,\"\")","v":""},"",{"$f":"IF(CA33=\"X\",$C33,\"\")","v":""},"",{"$f":"IF(CC33=\"X\",$C33,\"\")","v":""},"",{"$f":"IF(CE33=\"X\",$C33,\"\")","v":""}]
[null,null,{"$f":"Liste!E33","v":317},{"$f":"Liste!D33","v":"Pouillot"},"A",null,"","","","","",{"$f":"IF(K34=\"X\",$C34,\"\")","v":""},"",{"$f":"IF(M34=\"X\",$C34,\"\")","v":""},"",{"$f":"IF(O34=\"X\",$C34,\"\")","v":""},"","","",{"$f":"IF(S34=\"X\",$C34,\"\")","v":""},"",{"$f":"IF(U34=\"X\",$C34,\"\")","v":""},"",{"$f":"IF(W34=\"X\",$C34,\"\")","v":""},"","","",{"$f":"IF(AA34=\"X\",$C34,\"\")","v":""},"",{"$f":"IF(AC34=\"X\",$C34,\"\")","v":""},"",{"$f":"IF(AE34=\"X\",$C34,\"\")","v":""},"",{"$f":"IF(AG34=\"X\",$C34,\"\")","v":""},"",{"$f":"IF(AI34=\"X\",$C34,\"\")","v":""},"",{"$f":"IF(AK34=\"X\",$C34,\"\")","v":""},"",{"$f":"IF(AM34=\"X\",$C34,\"\")","v":""},"",{"$f":"IF(AO34=\"X\",$C34,\"\")","v":""},"",{"$f":"IF(AQ34=\"X\",$C34,\"\")","v":""},"",{"$f":"IF(AS34=\"X\",$C34,\"\")","v":""},"",{"$f":"IF(AU34=\"X\",$C34,\"\")","v":""},"",{"$f":"IF(AW34=\"X\",$C34,\"\")","v":""},"",{"$f":"IF(AY34=\"X\",$C34,\"\")","v":""},"",{"$f":"IF(BA34=\"X\",$C34,\"\")","v":""},"",{"$f":"IF(BC34=\"X\",$C34,\"\")","v":""},"",{"$f":"IF(BE34=\"X\",$C34,\"\")","v":""},"",{"$f":"IF(BG34=\"X\",$C34,\"\")","v":""},"",{"$f":"IF(BI34=\"X\",$C34,\"\")","v":""},"",{"$f":"IF(BK34=\"X\",$C34,\"\")","v":""},{"$f":"IF(AND($E34=\"M\",EXACT($F34,BM$52)=TRUE),\"X\",\"\")","v":""},{"$f":"IF(BM34=\"X\",$C34,\"\")","v":""},{"$f":"IF($E34=\"P\",$C34,\"\")","v":""},null,"",{"$f":"IF(BQ34=\"X\",$C34,\"\")","v":""},"",{"$f":"IF(BS34=\"X\",$C34,\"\")","v":""},"",{"$f":"IF(BU34=\"X\",$C34,\"\")","v":""},"",{"$f":"IF(BW34=\"X\",$C34,\"\")","v":""},"",{"$f":"IF(BY34=\"X\",$C34,\"\")","v":""},"",{"$f":"IF(CA34=\"X\",$C34,\"\")","v":""},"",{"$f":"IF(CC34=\"X\",$C34,\"\")","v":""},"",{"$f":"IF(CE34=\"X\",$C34,\"\")","v":""}]
[null,null,{"$f":"Liste!E34","v":265},{"$f":"Liste!D34","v":"Ramirez"},"A",null,"","","","","",{"$f":"IF(K35=\"X\",$C35,\"\")","v":""},"",{"$f":"IF(M35=\"X\",$C35,\"\")","v":""},"",{"$f":"IF(O35=\"X\",$C35,\"\")","v":""},"","","",{"$f":"IF(S35=\"X\",$C35,\"\")","v":""},"",{"$f":"IF(U35=\"X\",$C35,\"\")","v":""},"",{"$f":"IF(W35=\"X\",$C35,\"\")","v":""},"","","",{"$f":"IF(AA35=\"X\",$C35,\"\")","v":""},"",{"$f":"IF(AC35=\"X\",$C35,\"\")","v":""},"",{"$f":"IF(AE35=\"X\",$C35,\"\")","v":""},"",{"$f":"IF(AG35=\"X\",$C35,\"\")","v":""},"",{"$f":"IF(AI35=\"X\",$C35,\"\")","v":""},"",{"$f":"IF(AK35=\"X\",$C35,\"\")","v":""},"",{"$f":"IF(AM35=\"X\",$C35,\"\")","v":""},"",{"$f":"IF(AO35=\"X\",$C35,\"\")","v":""},"",{"$f":"IF(AQ35=\"X\",$C35,\"\")","v":""},"",{"$f":"IF(AS35=\"X\",$C35,\"\")","v":""},"",{"$f":"IF(AU35=\"X\",$C35,\"\")","v":""},"",{"$f":"IF(AW35=\"X\",$C35,\"\")","v":""},"",{"$f":"IF(AY35=\"X\",$C35,\"\")","v":""},"",{"$f":"IF(BA35=\"X\",$C35,\"\")","v":""},"",{"$f":"IF(BC35=\"X\",$C35,\"\")","v":""},"",{"$f":"IF(BE35=\"X\",$C35,\"\")","v":""},"",{"$f":"IF(BG35=\"X\",$C35,\"\")","v":""},"",{"$f":"IF(BI35=\"X\",$C35,\"\")","v":""},"",{"$f":"IF(BK35=\"X\",$C35,\"\")","v":""},"",{"$f":"IF(BM35=\"X\",$C35,\"\")","v":""},{"$f":"IF(AND($E35=\"M\",EXACT($F35,BO$52)=TRUE),\"X\",\"\")","v":""},{"$f":"IF(BO35=\"X\",$C35,\"\")","v":""},{"$f":"IF($E35=\"P\",$C35,\"\")","v":""},null,"",{"$f":"IF(BS35=\"X\",$C35,\"\")","v":""},"",{"$f":"IF(BU35=\"X\",$C35,\"\")","v":""},"",{"$f":"IF(BW35=\"X\",$C35,\"\")","v":""},"",{"$f":"IF(BY35=\"X\",$C35,\"\")","v":""},"",{"$f":"IF(CA35=\"X\",$C35,\"\")","v":""},"",{"$f":"IF(CC35=\"X\",$C35,\"\")","v":""},"",{"$f":"IF(CE35=\"X\",$C35,\"\")","v":""}]
[null,null,{"$f":"Liste!E35","v":268},{"$f":"Liste!D35","v":"Segura Mari"},"A",null,"","","","","",{"$f":"IF(K36=\"X\",$C36,\"\")","v":""},"",{"$f":"IF(M36=\"X\",$C36,\"\")","v":""},"",{"$f":"IF(O36=\"X\",$C36,\"\")","v":""},"","","",{"$f":"IF(S36=\"X\",$C36,\"\")","v":""},"",{"$f":"IF(U36=\"X\",$C36,\"\")","v":""},"",{"$f":"IF(W36=\"X\",$C36,\"\")","v":""},"","","",{"$f":"IF(AA36=\"X\",$C36,\"\")","v":""},"",{"$f":"IF(AC36=\"X\",$C36,\"\")","v":""},"",{"$f":"IF(AE36=\"X\",$C36,\"\")","v":""},"",{"$f":"IF(AG36=\"X\",$C36,\"\")","v":""},"",{"$f":"IF(AI36=\"X\",$C36,\"\")","v":""},"",{"$f":"IF(AK36=\"X\",$C36,\"\")","v":""},"",{"$f":"IF(AM36=\"X\",$C36,\"\")","v":""},"",{"$f":"IF(AO36=\"X\",$C36,\"\")","v":""},"",{"$f":"IF(AQ36=\"X\",$C36,\"\")","v":""},"",{"$f":"IF(AS36=\"X\",$C36,\"\")","v":""},"",{"$f":"IF(AU36=\"X\",$C36,\"\")","v":""},"",{"$f":"IF(AW36=\"X\",$C36,\"\")","v":""},"",{"$f":"IF(AY36=\"X\",$C36,\"\")","v":""},"",{"$f":"IF(BA36=\"X\",$C36,\"\")","v":""},"",{"$f":"IF(BC36=\"X\",$C36,\"\")","v":""},"",{"$f":"IF(BE36=\"X\",$C36,\"\")","v":""},"",{"$f":"IF(BG36=\"X\",$C36,\"\")","v":""},"",{"$f":"IF(BI36=\"X\",$C36,\"\")","v":""},"",{"$f":"IF(BK36=\"X\",$C36,\"\")","v":""},"",{"$f":"IF(BM36=\"X\",$C36,\"\")","v":""},"",{"$f":"IF(BO36=\"X\",$C36,\"\")","v":""},{"$f":"IF(AND($E36=\"M\",EXACT($F36,BQ$52)=TRUE),\"X\",\"\")","v":""},{"$f":"IF(BQ36=\"X\",$C36,\"\")","v":""},{"$f":"IF($E36=\"P\",$C36,\"\")","v":""},null,"",{"$f":"IF(BU36=\"X\",$C36,\"\")","v":""},"",{"$f":"IF(BW36=\"X\",$C36,\"\")","v":""},"",{"$f":"IF(BY36=\"X\",$C36,\"\")","v":""},"",{"$f":"IF(CA36=\"X\",$C36,\"\")","v":""},"",{"$f":"IF(CC36=\"X\",$C36,\"\")","v":""},"",{"$f":"IF(CE36=\"X\",$C36,\"\")","v":""}]
[null,null,{"$f":"Liste!E36","v":210},{"$f":"Liste!D36","v":"Simoncini"},"A",null,"","","","","",{"$f":"IF(K37=\"X\",$C37,\"\")","v":""},"",{"$f":"IF(M37=\"X\",$C37,\"\")","v":""},"",{"$f":"IF(O37=\"X\",$C37,\"\")","v":""},"","","",{"$f":"IF(S37=\"X\",$C37,\"\")","v":""},"",{"$f":"IF(U37=\"X\",$C37,\"\")","v":""},"",{"$f":"IF(W37=\"X\",$C37,\"\")","v":""},"","","",{"$f":"IF(AA37=\"X\",$C37,\"\")","v":""},"",{"$f":"IF(AC37=\"X\",$C37,\"\")","v":""},"",{"$f":"IF(AE37=\"X\",$C37,\"\")","v":""},"",{"$f":"IF(AG37=\"X\",$C37,\"\")","v":""},"",{"$f":"IF(AI37=\"X\",$C37,\"\")","v":""},"",{"$f":"IF(AK37=\"X\",$C37,\"\")","v":""},"",{"$f":"IF(AM37=\"X\",$C37,\"\")","v":""},"",{"$f":"IF(AO37=\"X\",$C37,\"\")","v":""},"",{"$f":"IF(AQ37=\"X\",$C37,\"\")","v":""},"",{"$f":"IF(AS37=\"X\",$C37,\"\")","v":""},"",{"$f":"IF(AU37=\"X\",$C37,\"\")","v":""},"",{"$f":"IF(AW37=\"X\",$C37,\"\")","v":""},"",{"$f":"IF(AY37=\"X\",$C37,\"\")","v":""},"",{"$f":"IF(BA37=\"X\",$C37,\"\")","v":""},"",{"$f":"IF(BC37=\"X\",$C37,\"\")","v":""},"",{"$f":"IF(BE37=\"X\",$C37,\"\")","v":""},"",{"$f":"IF(BG37=\"X\",$C37,\"\")","v":""},"",{"$f":"IF(BI37=\"X\",$C37,\"\")","v":""},"",{"$f":"IF(BK37=\"X\",$C37,\"\")","v":""},"",{"$f":"IF(BM37=\"X\",$C37,\"\")","v":""},"",{"$f":"IF(BO37=\"X\",$C37,\"\")","v":""},"",{"$f":"IF(BQ37=\"X\",$C37,\"\")","v":""},{"$f":"IF(AND($E37=\"M\",EXACT($F37,BS$52)=TRUE),\"X\",\"\")","v":""},{"$f":"IF(BS37=\"X\",$C37,\"\")","v":""},{"$f":"IF($E37=\"P\",$C37,\"\")","v":""},null,"",{"$f":"IF(BW37=\"X\",$C37,\"\")","v":""},"",{"$f":"IF(BY37=\"X\",$C37,\"\")","v":""},"",{"$f":"IF(CA37=\"X\",$C37,\"\")","v":""},"",{"$f":"IF(CC37=\"X\",$C37,\"\")","v":""},"",{"$f":"IF(CE37=\"X\",$C37,\"\")","v":""}]
[null,null,{"$f":"Liste!E37","v":301},{"$f":"Liste!D37","v":"Vautravers"},"A",null,"",{"$f":"IF(G38=\"X\",$C38,\"\")","v":""},"",{"$f":"IF(I38=\"X\",$C38,\"\")","v":""},"",{"$f":"IF(K38=\"X\",$C38,\"\")","v":""},"",{"$f":"IF(M38=\"X\",$C38,\"\")","v":""},"",{"$f":"IF(O38=\"X\",$C38,\"\")","v":""},"","","",{"$f":"IF(S38=\"X\",$C38,\"\")","v":""},"",{"$f":"IF(U38=\"X\",$C38,\"\")","v":""},"",{"$f":"IF(W38=\"X\",$C38,\"\")","v":""},"","","",{"$f":"IF(AA38=\"X\",$C38,\"\")","v":""},"",{"$f":"IF(AC38=\"X\",$C38,\"\")","v":""},"",{"$f":"IF(AE38=\"X\",$C38,\"\")","v":""},"",{"$f":"IF(AG38=\"X\",$C38,\"\")","v":""},"",{"$f":"IF(AI38=\"X\",$C38,\"\")","v":""},"",{"$f":"IF(AK38=\"X\",$C38,\"\")","v":""},"",{"$f":"IF(AM38=\"X\",$C38,\"\")","v":""},"",{"$f":"IF(AO38=\"X\",$C38,\"\")","v":""},"",{"$f":"IF(AQ38=\"X\",$C38,\"\")","v":""},"",{"$f":"IF(AS38=\"X\",$C38,\"\")","v":""},"",{"$f":"IF(AU38=\"X\",$C38,\"\")","v":""},"",{"$f":"IF(AW38=\"X\",$C38,\"\")","v":""},"",{"$f":"IF(AY38=\"X\",$C38,\"\")","v":""},"",{"$f":"IF(BA38=\"X\",$C38,\"\")","v":""},"",{"$f":"IF(BC38=\"X\",$C38,\"\")","v":""},"",{"$f":"IF(BE38=\"X\",$C38,\"\")","v":""},"",{"$f":"IF(BG38=\"X\",$C38,\"\")","v":""},"",{"$f":"IF(BI38=\"X\",$C38,\"\")","v":""},"",{"$f":"IF(BK38=\"X\",$C38,\"\")","v":""},"",{"$f":"IF(BM38=\"X\",$C38,\"\")","v":""},"",{"$f":"IF(BO38=\"X\",$C38,\"\")","v":""},"",{"$f":"IF(BQ38=\"X\",$C38,\"\")","v":""},"",{"$f":"IF(BS38=\"X\",$C38,\"\")","v":""},{"$f":"IF(AND($E38=\"M\",EXACT($F38,BU$52)=TRUE),\"X\",\"\")","v":""},{"$f":"IF(BU38=\"X\",$C38,\"\")","v":""},{"$f":"IF($E38=\"P\",$C38,\"\")","v":""},null,"",{"$f":"IF(BY38=\"X\",$C38,\"\")","v":""},"",{"$f":"IF(CA38=\"X\",$C38,\"\")","v":""},"",{"$f":"IF(CC38=\"X\",$C38,\"\")","v":""},"",{"$f":"IF(CE38=\"X\",$C38,\"\")","v":""}]
[null,null,{"$f":"Liste!E38","v":245},{"$f":"Liste!D38","v":"Ventajou"},"A",null,"","","","","",{"$f":"IF(K39=\"X\",$C39,\"\")","v":""},"",{"$f":"IF(M39=\"X\",$C39,\"\")","v":""},"",{"$f":"IF(O39=\"X\",$C39,\"\")","v":""},"","","",{"$f":"IF(S39=\"X\",$C39,\"\")","v":""},"",{"$f":"IF(U39=\"X\",$C39,\"\")","v":""},"",{"$f":"IF(W39=\"X\",$C39,\"\")","v":""},"","","",{"$f":"IF(AA39=\"X\",$C39,\"\")","v":""},"",{"$f":"IF(AC39=\"X\",$C39,\"\")","v":""},"",{"$f":"IF(AE39=\"X\",$C39,\"\")","v":""},"",{"$f":"IF(AG39=\"X\",$C39,\"\")","v":""},"",{"$f":"IF(AI39=\"X\",$C39,\"\")","v":""},"",{"$f":"IF(AK39=\"X\",$C39,\"\")","v":""},"",{"$f":"IF(AM39=\"X\",$C39,\"\")","v":""},"",{"$f":"IF(AO39=\"X\",$C39,\"\")","v":""},"",{"$f":"IF(AQ39=\"X\",$C39,\"\")","v":""},"",{"$f":"IF(AS39=\"X\",$C39,\"\")","v":""},"",{"$f":"IF(AU39=\"X\",$C39,\"\")","v":""},"",{"$f":"IF(AW39=\"X\",$C39,\"\")","v":""},"",{"$f":"IF(AY39=\"X\",$C39,\"\")","v":""},"",{"$f":"IF(BA39=\"X\",$C39,\"\")","v":""},"",{"$f":"IF(BC39=\"X\",$C39,\"\")","v":""},"",{"$f":"IF(BE39=\"X\",$C39,\"\")","v":""},"",{"$f":"IF(BG39=\"X\",$C39,\"\")","v":""},"",{"$f":"IF(BI39=\"X\",$C39,\"\")","v":""},"",{"$f":"IF(BK39=\"X\",$C39,\"\")","v":""},"",{"$f":"IF(BM39=\"X\",$C39,\"\")","v":""},"",{"$f":"IF(BO39=\"X\",$C39,\"\")","v":""},"",{"$f":"IF(BQ39=\"X\",$C39,\"\")","v":""},"",{"$f":"IF(BS39=\"X\",$C39,\"\")","v":""},"",{"$f":"IF(BU39=\"X\",$C39,\"\")","v":""},{"$f":"IF(AND($E39=\"M\",EXACT($F39,BW$52)=TRUE),\"X\",\"\")","v":""},{"$f":"IF(BW39=\"X\",$C39,\"\")","v":""},{"$f":"IF($E39=\"P\",$C39,\"\")","v":""},null,"",{"$f":"IF(CA39=\"X\",$C39,\"\")","v":""},"",{"$f":"IF(CC39=\"X\",$C39,\"\")","v":""},"",{"$f":"IF(CE39=\"X\",$C39,\"\")","v":""}]
[null,null,{"$f":"Liste!E39","v":23},{"$f":"Liste!D39","v":"Vernet"},"A",null,"","","","","",{"$f":"IF(K40=\"X\",$C40,\"\")","v":""},"",{"$f":"IF(M40=\"X\",$C40,\"\")","v":""},"",{"$f":"IF(O40=\"X\",$C40,\"\")","v":""},"","","",{"$f":"IF(S40=\"X\",$C40,\"\")","v":""},"",{"$f":"IF(U40=\"X\",$C40,\"\")","v":""},"",{"$f":"IF(W40=\"X\",$C40,\"\")","v":""},"","","",{"$f":"IF(AA40=\"X\",$C40,\"\")","v":""},"",{"$f":"IF(AC40=\"X\",$C40,\"\")","v":""},"",{"$f":"IF(AE40=\"X\",$C40,\"\")","v":""},"",{"$f":"IF(AG40=\"X\",$C40,\"\")","v":""},"",{"$f":"IF(AI40=\"X\",$C40,\"\")","v":""},"",{"$f":"IF(AK40=\"X\",$C40,\"\")","v":""},"",{"$f":"IF(AM40=\"X\",$C40,\"\")","v":""},"",{"$f":"IF(AO40=\"X\",$C40,\"\")","v":""},"",{"$f":"IF(AQ40=\"X\",$C40,\"\")","v":""},"",{"$f":"IF(AS40=\"X\",$C40,\"\")","v":""},"",{"$f":"IF(AU40=\"X\",$C40,\"\")","v":""},"",{"$f":"IF(AW40=\"X\",$C40,\"\")","v":""},"",{"$f":"IF(AY40=\"X\",$C40,\"\")","v":""},"",{"$f":"IF(BA40=\"X\",$C40,\"\")","v":""},"",{"$f":"IF(BC40=\"X\",$C40,\"\")","v":""},"",{"$f":"IF(BE40=\"X\",$C40,\"\")","v":""},"",{"$f":"IF(BG40=\"X\",$C40,\"\")","v":""},"",{"$f":"IF(BI40=\"X\",$C40,\"\")","v":""},"",{"$f":"IF(BK40=\"X\",$C40,\"\")","v":""},"",{"$f":"IF(BM40=\"X\",$C40,\"\")","v":""},"",{"$f":"IF(BO40=\"X\",$C40,\"\")","v":""},"",{"$f":"IF(BQ40=\"X\",$C40,\"\")","v":""},"",{"$f":"IF(BS40=\"X\",$C40,\"\")","v":""},"",{"$f":"IF(BU40=\"X\",$C40,\"\")","v":""},"",{"$f":"IF(BW40=\"X\",$C40,\"\")","v":""},{"$f":"IF(AND($E40=\"M\",EXACT($F40,BY$52)=TRUE),\"X\",\"\")","v":""},{"$f":"IF(BY40=\"X\",$C40,\"\")","v":""},{"$f":"IF($E40=\"P\",$C40,\"\")","v":""},null,"",{"$f":"IF(CC40=\"X\",$C40,\"\")","v":""},"",{"$f":"IF(CE40=\"X\",$C40,\"\")","v":""}]
[null,null,{"$f":"Liste!E40","v":209},{"$f":"Liste!D40","v":"Villard Toddi"},"A",null,"",{"$f":"IF(G41=\"X\",$C41,\"\")","v":""},"","","",{"$f":"IF(K41=\"X\",$C41,\"\")","v":""},"",{"$f":"IF(M41=\"X\",$C41,\"\")","v":""},"",{"$f":"IF(O41=\"X\",$C41,\"\")","v":""},"","","",{"$f":"IF(S41=\"X\",$C41,\"\")","v":""},"",{"$f":"IF(U41=\"X\",$C41,\"\")","v":""},"",{"$f":"IF(W41=\"X\",$C41,\"\")","v":""},"","","",{"$f":"IF(AA41=\"X\",$C41,\"\")","v":""},"",{"$f":"IF(AC41=\"X\",$C41,\"\")","v":""},"",{"$f":"IF(AE41=\"X\",$C41,\"\")","v":""},"",{"$f":"IF(AG41=\"X\",$C41,\"\")","v":""},"",{"$f":"IF(AI41=\"X\",$C41,\"\")","v":""},"",{"$f":"IF(AK41=\"X\",$C41,\"\")","v":""},"",{"$f":"IF(AM41=\"X\",$C41,\"\")","v":""},"",{"$f":"IF(AO41=\"X\",$C41,\"\")","v":""},"",{"$f":"IF(AQ41=\"X\",$C41,\"\")","v":""},"",{"$f":"IF(AS41=\"X\",$C41,\"\")","v":""},"",{"$f":"IF(AU41=\"X\",$C41,\"\")","v":""},"",{"$f":"IF(AW41=\"X\",$C41,\"\")","v":""},"",{"$f":"IF(AY41=\"X\",$C41,\"\")","v":""},"",{"$f":"IF(BA41=\"X\",$C41,\"\")","v":""},"",{"$f":"IF(BC41=\"X\",$C41,\"\")","v":""},"",{"$f":"IF(BE41=\"X\",$C41,\"\")","v":""},"",{"$f":"IF(BG41=\"X\",$C41,\"\")","v":""},"",{"$f":"IF(BI41=\"X\",$C41,\"\")","v":""},"",{"$f":"IF(BK41=\"X\",$C41,\"\")","v":""},"",{"$f":"IF(BM41=\"X\",$C41,\"\")","v":""},"",{"$f":"IF(BO41=\"X\",$C41,\"\")","v":""},"",{"$f":"IF(BQ41=\"X\",$C41,\"\")","v":""},"",{"$f":"IF(BS41=\"X\",$C41,\"\")","v":""},"",{"$f":"IF(BU41=\"X\",$C41,\"\")","v":""},"",{"$f":"IF(BW41=\"X\",$C41,\"\")","v":""},"",{"$f":"IF(BY41=\"X\",$C41,\"\")","v":""},{"$f":"IF(AND($E41=\"M\",EXACT($F41,CA$52)=TRUE),\"X\",\"\")","v":""},{"$f":"IF(CA41=\"X\",$C41,\"\")","v":""},{"$f":"IF($E41=\"P\",$C41,\"\")","v":""},null,"",{"$f":"IF(CE41=\"X\",$C41,\"\")","v":""}]
[null,null,{"$f":"Liste!E41","v":308},{"$f":"Liste!D41","v":"Vivona"},"P",null,"",{"$f":"IF(G42=\"X\",$C42,\"\")","v":""},"","","",{"$f":"IF(K42=\"X\",$C42,\"\")","v":""},"",{"$f":"IF(M42=\"X\",$C42,\"\")","v":""},"",{"$f":"IF(O42=\"X\",$C42,\"\")","v":""},"","","",{"$f":"IF(S42=\"X\",$C42,\"\")","v":""},"",{"$f":"IF(U42=\"X\",$C42,\"\")","v":""},"",{"$f":"IF(W42=\"X\",$C42,\"\")","v":""},"","","",{"$f":"IF(AA42=\"X\",$C42,\"\")","v":""},"",{"$f":"IF(AC42=\"X\",$C42,\"\")","v":""},"",{"$f":"IF(AE42=\"X\",$C42,\"\")","v":""},"",{"$f":"IF(AG42=\"X\",$C42,\"\")","v":""},"",{"$f":"IF(AI42=\"X\",$C42,\"\")","v":""},"",{"$f":"IF(AK42=\"X\",$C42,\"\")","v":""},"",{"$f":"IF(AM42=\"X\",$C42,\"\")","v":""},"",{"$f":"IF(AO42=\"X\",$C42,\"\")","v":""},"",{"$f":"IF(AQ42=\"X\",$C42,\"\")","v":""},"",{"$f":"IF(AS42=\"X\",$C42,\"\")","v":""},"",{"$f":"IF(AU42=\"X\",$C42,\"\")","v":""},"",{"$f":"IF(AW42=\"X\",$C42,\"\")","v":""},"",{"$f":"IF(AY42=\"X\",$C42,\"\")","v":""},"",{"$f":"IF(BA42=\"X\",$C42,\"\")","v":""},"",{"$f":"IF(BC42=\"X\",$C42,\"\")","v":""},"",{"$f":"IF(BE42=\"X\",$C42,\"\")","v":""},"",{"$f":"IF(BG42=\"X\",$C42,\"\")","v":""},"",{"$f":"IF(BI42=\"X\",$C42,\"\")","v":""},"",{"$f":"IF(BK42=\"X\",$C42,\"\")","v":""},"",{"$f":"IF(BM42=\"X\",$C42,\"\")","v":""},"",{"$f":"IF(BO42=\"X\",$C42,\"\")","v":""},"",{"$f":"IF(BQ42=\"X\",$C42,\"\")","v":""},"",{"$f":"IF(BS42=\"X\",$C42,\"\")","v":""},"",{"$f":"IF(BU42=\"X\",$C42,\"\")","v":""},"",{"$f":"IF(BW42=\"X\",$C42,\"\")","v":""},"",{"$f":"IF(BY42=\"X\",$C42,\"\")","v":""},"",{"$f":"IF(CA42=\"X\",$C42,\"\")","v":""},{"$f":"IF(AND($E42=\"M\",EXACT($F42,CC$52)=TRUE),\"X\",\"\")","v":""},{"$f":"IF(CC42=\"X\",$C42,\"\")","v":""},{"$f":"IF($E42=\"P\",$C42,\"\")","v":308}]
[null,null,{"$f":"COUNTIF(E4:E42,\"A\")&\" Abs soit \"&SUMIF(E4:E42,\"A\",C4:C42)&\" tantièmes\"","v":"32 Abs soit 7539 tantièmes"},null,null,null,null,null,null,null,null,null,null,null,null,null,null,null,null,null,"1er tour",null,null,null,null,null,"2ème tour"]
[null,null,{"$f":"COUNTIF(E4:E42,\"P\")&\" Présents soit \"&SUMIF(E4:E42,\"P\",C4:C42)&\" tantièmes\"","v":"6 Présents soit 2077 tantièmes"},null,null,null,null,null,"Majorité",null,null,null,null,null,"Simple Art. 24",null,null,null,null,null,{"$f":"ROUNDUP(((E47+E49)/2),0)+1","v":1346},null,null,null,null,null," //",null,null,null,"Présents+representés",null,null,null,null,null,null,null,null,null,null,null,null,null,null,null,null,null,null,null,null,null,null,null,null,null,null,null,null,null,null,null,null,null,null,null,null,null,null,null,null,null,null,null,null,null,null,null,null,null,null,null,null,{"$f":"IF(#REF!=\"P\",#REF!,\"\")","v":{"$error":"#REF!"}}]
[null,null,{"$f":"COUNTIF(E4:E42,\"M\")&\" Pouvoirs soit \"&SUMIF(E4:E42,\"M\",C4:C42)&\" tantièmes\"","v":"1 Pouvoirs soit 306 tantièmes"},null,null,null,null,null,null,null,null,null,null,null,"Absolue Art 25",null,null,null,null,null,{"$f":"(E50/2)+1","v":4962},null,null,null,"ð",null,{"$f":"U44","v":1346},null,null,null,"Présents+représentés+absents"]
[null,null,{"$f":"\"Présents+pouvoirs : \"&(SUMIF(E4:E42,\"P\",C4:C42))+(SUMIF(E4:E42,\"M\",C4:C42))","v":"Présents+pouvoirs : 2383"},null,null,null,null,null,null,null,null,null,null,null,"Double Art. 26",null,null,null,null,null,{"$f":"ROUNDUP((((E50)*2)/3),0)+1","v":6616},null,null,null,null,null," //",null,null,null,"Présents+représentés+absents"]
[null,null,{"$f":"\"Tantièmes pouvoirs : \"&G47+I47+K47+M47+O47+Q47+S47+U47+W47+Y47+AA47+AC47+AE47+AG47+AI47+AK47+AM47+AO47+AQ47+AS47+AU47+AW47+AY47+BA47+BC47+BE47+BG47+BI47+BK47+BM47+BO47+BQ47+BS47+BU47+BW47+BY47+CA47+CC47+CE47","v":"Tantièmes pouvoirs : 306"},null,{"$f":"G47+I47+K47+M47+O47+Q47+S47+U47+W47+Y47+AA47+AC47+AE47+AG47+AI47+AK47+AM47+AO47+AQ47+AS47+AU47+AW47+AY47+BA47+BC47+BE47+BG47+BI47+BK47+BM47+BO47+BQ47+BS47+BU47+BW47+BY47+CA47+CC47+CE47","v":306},null,{"$f":"IF(G49=0,0,G49-G50)","v":0},{"$f":"H49-H50","v":0},{"$f":"IF(I49=0,0,I49-I50)","v":0},0,0,406,0,0,0,0,0,0,0,0,0,0,0,0,0,0,0,444,0,0,0,353,0,0,0,0,0,0,0,0,0,0,0,0,0,187,306,306,0,0,0,0,0,0,0,0,0,0,0,379,0,0,0,0,0,0,0,0,0,0,0,0,{"$f":"IF(BU49=0,0,BU49-BU50)","v":0},0,0,0,0,0,0,0,0,308,0]
["Seuils",null,{"$f":"\"Pouvoirs pris : \"&G48+I48+K48+M48+O48+Q48+S48+U48+W48+Y48+AA48+AC48+AE48+AG48+AI48+AK48+AM48+AO48+AQ48+AS48+AU48+AW48+AY48+BA48+BC48+BE48+BG48+BI48+BK48+BM48+BO48+BQ48+BS48+BU48+BW48+BY48+CA48+CC48+CE48","v":"Pouvoirs pris : 1"},null,{"$f":"G48+I48+K48+M48+O48+Q48+S48+U48+W48+Y48+AA48+AC48+AE48+AG48+AI48+AK48+AM48+AO48+AQ48+AS48+AU48+AW48+AY48+BA48+BC48+BE48+BG48+BI48+BK48+BM48+BO48+BQ48+BS48+BU48+BW48+BY48+CA48+CC48+CE48","v":1},null,{"$f":"IF(COUNT(H4:H42)=0,0,COUNT(H4:H42))","v":0},null,{"$f":"IF(COUNT(J4:J42)=0,0,COUNT(J4:J42))","v":0},0,0,1,0,0,0,0,0,0,0,0,0,0,0,0,0,0,0,1,0,0,0,1,0,0,0,0,0,0,0,0,0,0,0,0,0,1,1,0,0,0,0,0,0,0,0,0,0,0,0,1,0,0,0,0,0,0,0,0,0,0,0,0,{"$f":"IF(COUNT(BV4:BV42)=0,0,COUNT(BV4:BV42))","v":0},0,0,0,0,0,0,0,0,1,0]
[3,null,{"$f":"\"Porteur de (\"&G49+I49+K49+M49+O49+Q49+S49+U49+W49+Y49+AA49+AC49+AE49+AG49+AI49+AK49+AM49+AO49+AQ49+AS49+AU49+AW49+AY49+BA49+BC49+BE49+BG49+BI49+BK49+BM49+BO49+BQ49+BS49+BU49+BW49+BY49+CA49+CC49+CE49&\")\"","v":"Porteur de (2383)"},null,{"$f":"G49+I49+K49+M49+O49+Q49+S49+U49+W49+Y49+AA49+AC49+AE49+AG49+AI49+AK49+AM49+AO49+AQ49+AS49+AU49+AW49+AY49+BA49+BC49+BE49+BG49+BI49+BK49+BM49+BO49+BQ49+BS49+BU49+BW49+BY49+CA49+CC49+CE49","v":2383},null,{"$f":"IF(SUM(G4:H42)=0,0,SUM(G4:H42))","v":0},null,{"$f":"IF(SUM(I4:J42)=0,0,SUM(I4:J42))","v":0},0,0,406,406,0,0,0,0,0,0,0,0,0,0,0,0,0,0,444,444,0,0,353,353,0,0,0,0,0,0,0,0,0,0,0,0,187,493,306,0,0,0,0,0,0,0,0,0,0,0,379,379,0,0,0,0,0,0,0,0,0,0,0,{"$f":"IF(SUM(BU4:BV42)=0,0,SUM(BU4:BV42))","v":0},0,0,0,0,0,0,0,0,308,308]
[{"$f":"10%*(E44+E45)","v":0},null,{"$f":"\"Proprio de  (\"&SUM(G50:CE50)&\")\"","v":"Proprio de  (9922)"},null,{"$f":"SUM(G50:CE50)","v":9922},null,{"$f":"G2","v":250},0,434,0,7,0,406,0,321,0,323,0,43,0,285,0,249,0,281,0,633,0,444,0,7,0,353,0,36,0,218,0,{"$f":"AM2","v":306},0,245,0,202,0,230,0,187,0,214,0,337,0,340,0,265,0,264,0,201,0,379,0,265,0,51,0,317,0,265,0,268,{"$f":"BT2","v":0},210,0,301,0,245,0,23,0,209,0,308]
[null,null,{"$f":"\"Max : (3 mandats et 10%) \"&\"3 mandats \"&\" et  \"&(10%*(SUMIF(E4:E42,\"P\",C4:C42)+E45))&\" tantièmes maxi.\"","v":"Max : (3 mandats et 10%) 3 mandats  et  207,7 tantièmes maxi."}]
[null,null,null,null,null,null,{"$f":"G3","v":"Azemard"},{"$f":"LEFT(H3,5)","v":""},{"$f":"I3","v":"Barthes"},0,"Berthezene",0,"Boituzat",0,"Crédit Agric.",0,"Carayol",0,"Catteau",0,"Decarne",0,"Desbordes",0,"Diconne",0,"DKS",0,"Dugied",0,"Fadda",0,"Fraval",0,"Gallard Justeau",0,"Gerbaud",0,"Hamelin",0,"Hugo",0,"Leveau",0,"Mandrile",0,"Martinez",0,"Megie",0,"Morana F.",0,"Morana AM",0,"Morana L",0,"Morana P",0,"Optimo SCI",0,"Ortega J.",0,"Ortega S.",0,"Piochot",0,"Pouillot",0,"Ramirez",0,"Segura Mari",0,{"$f":"BU3","v":"Simoncini"},0,"Vautravers",0,"Ventajou",0,"Vernet",0,"Villard Toddi",0,"Vivona"]

{"sheet":"Vote","index":5,"n_rows":32,"n_cols":15,"rows_kept":32,"cut":false,"hidden":false,"merged":[[4,13,13,13],[16,13,22,13],[1,2,1,11],[27,4,27,11],[29,3,31,3],[28,9,31,9],[28,6,31,6],[2,7,2,9],[25,4,26,4]]}
[]
[null,null,"Suivi vote"]
[null,null,null,null,null,null,null,"ò Saisir ò"]
[null,null,null,"Nom","Proprio","Porteur","Total","Pour",null,"Contre",null,"Abstention"]
[null,null,{"$f":"IF(D5=\"\",\"\",1)","v":1},{"$f":"IF(Liste!L3=\"P\",Liste!J3,\"\")","v":"Boituzat"},{"$f":"IF(D5=\"\",\"\",VLOOKUP(D5,liste2,2))","v":406},{"$f":"IF(Liste!L3=\"P\",Liste!M3,\"\")","v":0},{"$f":"IF(D5=\"\",\"\",E5+F5)","v":406},null,{"$f":"IF(D5=\"\",0,IF(H5=\"X\",G5,0))","v":0},null,{"$f":"IF(D5=\"\",0,IF(J5=\"X\",G5,0))","v":0},{"$f":"IF(AND(H5=\"X\",J5=\"X\"),\"ERREUR\",IF(D5=\"\",\"\",IF(OR(H5=\"X\",J5=\"X\"),\"\",\"X\")))","v":"X"},{"$f":"IF(D5=\"\",0,IF(L5=\"X\",G5,0))","v":406},"ð Effacer pour nouveau vote ð"]
[null,null,{"$f":"IF(D6=\"\",\"\",C5+1)","v":2},{"$f":"IF(Liste!L4=\"P\",Liste!J4,\"\")","v":"Dugied"},444,{"$f":"IF(Liste!L4=\"P\",Liste!M4,\"\")","v":0},{"$f":"IF(D6=\"\",\"\",E6+F6)","v":444},null,{"$f":"IF(D6=\"\",0,IF(H6=\"X\",G6,0))","v":0},null,{"$f":"IF(D6=\"\",0,IF(J6=\"X\",G6,0))","v":0},{"$f":"IF(AND(H6=\"X\",J6=\"X\"),\"ERREUR\",IF(D6=\"\",\"\",IF(OR(H6=\"X\",J6=\"X\"),\"\",\"X\")))","v":"X"},{"$f":"IF(D6=\"\",0,IF(L6=\"X\",G6,0))","v":444}]
[null,null,{"$f":"IF(D7=\"\",\"\",C6+1)","v":3},{"$f":"IF(Liste!L5=\"P\",Liste!J5,\"\")","v":"Fraval"},353,{"$f":"IF(Liste!L5=\"P\",Liste!M5,\"\")","v":0},353,null,0,null,0,"X",353]
[null,null,4,{"$f":"IF(Liste!L6=\"P\",Liste!J6,\"\")","v":"Martinez"},187,{"$f":"IF(Liste!L6=\"P\",Liste!M6,\"\")","v":306},493,null,0,null,0,"X",493]
[null,null,5,{"$f":"IF(Liste!L7=\"P\",Liste!J7,\"\")","v":"Ortega J."},379,{"$f":"IF(Liste!L7=\"P\",Liste!M7,\"\")","v":0},379,null,0,null,0,"X",379]
[null,null,{"$f":"IF(D10=\"\",\"\",C9+1)","v":6},{"$f":"IF(Liste!L8=\"P\",Liste!J8,\"\")","v":"Vivona"},{"$f":"IF(D10=\"\",\"\",VLOOKUP(D10,liste2,2))","v":308},{"$f":"IF(Liste!L8=\"P\",Liste!M8,\"\")","v":0},{"$f":"IF(D10=\"\",\"\",E10+F10)","v":308},null,0,null,0,"X",308]
[null,null,"",{"$f":"IF(Liste!L9=\"P\",Liste!J9,\"\")","v":""},"",{"$f":"IF(Liste!L9=\"P\",Liste!M9,\"\")","v":""},"",null,0,null,0,"",0]
[null,null,"",{"$f":"IF(Liste!L10=\"P\",Liste!J10,\"\")","v":""},"",{"$f":"IF(Liste!L10=\"P\",Liste!M10,\"\")","v":""},"",null,0,null,0,"",0]
[null,null,"",{"$f":"IF(Liste!L11=\"P\",Liste!J11,\"\")","v":""},"",{"$f":"IF(Liste!L11=\"P\",Liste!M11,\"\")","v":""},"",null,0,null,0,"",0]
[null,null,"",{"$f":"IF(Liste!L12=\"P\",Liste!J12,\"\")","v":""},"",{"$f":"IF(Liste!L12=\"P\",Liste!M12,\"\")","v":""},"",null,0,null,0,"",0]
[null,null,"",{"$f":"IF(Liste!L13=\"P\",Liste!J13,\"\")","v":""},"",{"$f":"IF(Liste!L13=\"P\",Liste!M13,\"\")","v":""},"",null,0,null,0,"",0]
[null,null,"",{"$f":"IF(Liste!L14=\"P\",Liste!J14,\"\")","v":""},"",{"$f":"IF(Liste!L14=\"P\",Liste!M14,\"\")","v":""},"",null,0,null,0,"",0]
[null,null,"",{"$f":"IF(Liste!L15=\"P\",Liste!J15,\"\")","v":""},"",{"$f":"IF(Liste!L15=\"P\",Liste!M15,\"\")","v":""},"",null,0,null,0,"",0,"ð Mettre à jour liste ð"]
[null,null,"",{"$f":"IF(Liste!L16=\"P\",Liste!J16,\"\")","v":""},"",{"$f":"IF(Liste!L16=\"P\",Liste!M16,\"\")","v":""},"",null,0,null,0,"",0]
[null,null,"",{"$f":"IF(Liste!L17=\"P\",Liste!J17,\"\")","v":""},"",{"$f":"IF(Liste!L17=\"P\",Liste!M17,\"\")","v":""},"",null,0,null,0,"",0]
[null,null,"",{"$f":"IF(Liste!L18=\"P\",Liste!J18,\"\")","v":""},"",{"$f":"IF(Liste!L18=\"P\",Liste!M18,\"\")","v":""},"",null,0,null,0,"",0]
[null,null,"",{"$f":"IF(Liste!L19=\"P\",Liste!J19,\"\")","v":""},"",{"$f":"IF(Liste!L19=\"P\",Liste!M19,\"\")","v":""},"",null,0,null,0,"",0]
[null,null,"",{"$f":"IF(Liste!L20=\"P\",Liste!J20,\"\")","v":""},"",{"$f":"IF(Liste!L20=\"P\",Liste!M20,\"\")","v":""},"",null,0,null,0,"",0]
[null,null,"",{"$f":"IF(Liste!L21=\"P\",Liste!J21,\"\")","v":""},"",{"$f":"IF(Liste!L21=\"P\",Liste!M21,\"\")","v":""},"",null,0,null,0,"",0]
[null,null,"",{"$f":"IF(Liste!L22=\"P\",Liste!J22,\"\")","v":""},"",{"$f":"IF(Liste!L22=\"P\",Liste!M22,\"\")","v":""},"",null,0,null,0,"",0]
[null,null,null,null,null,"Total",{"$f":"IF(COUNT(G5:G24)>0,SUM(G5:G24),0)","v":2383},"Pour",{"$f":"IF(COUNT(I5:I24)=0,0,SUM(I5:I24))","v":0},"Contre",{"$f":"IF(COUNT(K5:K24)=0,0,SUM(K5:K24))","v":0},"Abstention",{"$f":"IF(COUNT(M5:M24)=0,0,SUM(M5:M24))","v":2383}]
[null,null,null,null,"Exprimés (Hors abstentions) : ","Tantièmes",{"$f":"H26+J26","v":0},{"$f":"I26","v":0},{"$f":"SUM(I5:I25)","v":0},{"$f":"K26","v":0},{"$f":"SUM(K5:K24)","v":0},{"$f":"M26","v":2383},{"$f":"SUM(M5:M24)","v":2383}]
[null,null,null,null,null,"Nombre",{"$f":"SUM(H27:L27)","v":6},{"$f":"COUNTA(H5:H24)","v":0},null,{"$f":"COUNTA(J5:J24)","v":0},null,{"$f":"COUNTIF(L5:L24,\"X\")","v":6}]
[null,null,null,null,{"$f":"\"Présents + pouvoirs : \"&COUNTIF(Présence!E4:E42,\"P\")&\" personnes présentes, \"&COUNT(F5:F24)&\"pouvoirs, soit \"&SUM(G5:G24)&\" tantièmes\"","v":"Présents + pouvoirs : 6 personnes présentes, 6pouvoirs, soit 2383 tantièmes"}]
[null,null,null,null,null,"1er tour","Si besoin ð","2ème tour",null,"Décision : ",null,{"$f":"F29","v":"1er tour"},null,{"$f":"H29","v":"2ème tour"},"Majorité"]
[null,null,null,"Majorité","Simple Art24",{"$f":"Présence!U44","v":1346},null," //",null,null,null,{"$f":"IF(H26>=F30,\"Adopté\",\"Refusé\")","v":"Refusé"},null," //",{"$f":"E30","v":"Simple Art24"}]
[null,null,null,null,"Absolue Art25",{"$f":"Présence!U45","v":4962},null,{"$f":"Présence!AA45","v":1346},null,null,null,{"$f":"IF(H26>=F31,\"Adpoté\",\"Refusé\")","v":"Refusé"},null,{"$f":"IF(H26>=H31,\"Adopté\",\"Refusé\")","v":"Refusé"},{"$f":"E31","v":"Absolue Art25"}]
[null,null,null,null,"Double Art26",{"$f":"Présence!U46","v":6616},null," //",null,null,null,{"$f":"IF(H26>=F32,\"Adpoté\",\"Refusé\")","v":"Refusé"},null," //","Double Art26"]

{"sheet":"Emploi","index":6,"n_rows":25,"n_cols":12,"rows_kept":25,"cut":false,"hidden":false,"merged":[[2,1,3,3],[2,5,3,7],[2,9,3,11]]}
[]
[]
[null,"Mode d'emploi du classeur ",null,null,null,"Signification des icones",null,null,null,"Signification des icones"]
[]
[null,"Etape 1",null,null,null,"Icone",null,"Utilisation",null,"Icone",null,"Utilisation"]
[null,null,"Clic icone "]
[null,null,null,null,null,null,null,"Accès à l'accueil du classeur",null,null,null,"Mettre à jour les modifications pour la feuille de Vote"]
[null,null,"Vérifier la liste des copropriétaires"]
[null,null,"Vérifier les tantièmes possédés"]
[]
[null,"Etape 2"]
[null,null,"Clic icone "]
[null,null,null,null,null,null,null,"Accès liste copropriétaires+tantièmes possédés",null,null,null,"Enregistrer les modifications"]
[null,null,"Saisir le statut lors de l'AG"]
[null,null,null,"P : Présent"]
[null,null,null,"A : Absent"]
[null,null,null,"M : Mandat donné"]
[null,null,"Affecter les mandats au présents"]
[null,null,"Mettre à jour avec icone"]
[null,null,null,null,null,null,null,"Accés état de présence lors de l'AG et portage pouvoirs",null,null,null,"Accès à cette feuille "]
[]
[null,"Etape 3"]
[null,null,"Clic icone "]
[null,null,null,null,null,null,null,"Accès saisie des votes et décision selon type de majorité",null,null,null,"Quitter Excel. A bientôt…"]
[null,null,"Saisir les votes"]