{"text_format":"1","workbook":"xlsx","n_sheets":14,"sheets":["utilisateur Vierge","choix utilisateur","articles","Commandes","Utilisateur_1","Utilisateur_2","Utilisateur_3","Utilisateur_4","Utilisateur_5","Utilisateur_6","Utilisateur_7","Utilisateur_8","Utilisateur_9","Utilisateur_10"],"not_rendered":{"charts":0,"images":0,"macros":1,"external_links":0,"defined_names":12,"comments":0,"pivot_tables":0},"unopened":[],"bounds":{"document_bytes":16777216,"sheet_cells":100000,"rows_first":2000,"rows_last":500,"rows_between":2000,"halvings":0,"cell_chars":16384,"cell_head_chars":4096},"cells_cut":0,"cells_raw":0,"read":"whole","date_system":"1900"}

{"sheet":"utilisateur Vierge","index":0,"n_rows":2,"n_cols":13,"rows_kept":2,"cut":false,"hidden":false,"merged":[]}
["DATE","PRENOM","PIECE ","DESIGNATION","LOT","HEURE debut","heure fin","Nbre de pièces finies","temps de travail en secondes ","+ 25% temps","temps de travail en minutes","Nbre de boites/pces pour 15 minutes","Nbre de boites/pces à l'heure"]
[null,null,null,{"$f":"IF(C2=\"\",\"\",VLOOKUP(C2,TabArticles[],2,FALSE))","v":""},null,null,null,null,{"$f":"IF(C2=\"\",\"\",VLOOKUP(C2,TabArticles[],3,FALSE))","v":""},{"$f":"IF(C2=\"\",\"\",VLOOKUP(C2,TabArticles[],4,FALSE))","v":""},{"$f":"IF(C2=\"\",\"\",VLOOKUP(C2,TabArticles[],5,FALSE))","v":""},{"$f":"IF(C2=\"\",\"\",VLOOKUP(C2,TabArticles[],6,FALSE))","v":""},{"$f":"IF(C2=\"\",\"\",VLOOKUP(C2,TabArticles[],7,FALSE))","v":""}]

{"sheet":"choix utilisateur","index":1,"n_rows":7,"n_cols":5,"rows_kept":7,"cut":false,"hidden":false,"merged":[]}
[]
[]
[]
[]
[]
[]
[null,null,null,null,"Utilisateur_5"]

{"sheet":"articles","index":2,"n_rows":45,"n_cols":13,"rows_kept":45,"cut":false,"hidden":false,"merged":[]}
[]
[]
[]
[]
[null,null,null,null,null,null,null,null,null,null,null,null,"Liste Utilisateurs"]
[null,null,"Code article","Désignation","temps de travail en secondes ","+ 25% temps","temps de travail en minutes","Nbre de boites/pces pour 15 minutes","Nbre de boites/pces à l'heure","minutes",null,null,"Utilisateur_1"]
[null,null,"Maintenance autres sections","Maintenance autres sections",0,{"$f":"+E7+E7*25/100","v":0},{"$f":"+F7/60","v":0},{"$f":"IFERROR($J$7/G7,0)","v":0},{"$f":"ROUNDUP(+H7*4,0)","v":0},15,null,null,"Utilisateur_2"]
[null,null,"Mise en ordre locaux","Mise en ordre locaux",0,0,0,{"$f":"IFERROR($J$7/G8,0)","v":0},0,null,null,null,"Utilisateur_3"]
[null,null,"Filmage palettes","Filmage palettes",0,0,0,0,0,null,null,null,"Utilisateur_4"]
[null,null,"Déchargement","déchargement",0,0,0,0,0,null,null,null,"Utilisateur_5"]
[null,null,"nettoyage","nettoyage",0,0,0,0,0,null,null,null,"Utilisateur_6"]
[null,null,"repas","repas",0,0,0,0,0,null,null,null,"Utilisateur_7"]
[null,null,1,"Alteximex Recharges potagers (1 boite)",240,300,5,3,12,null,null,null,"Utilisateur_8"]
[null,null,2,"Grando Grillages noirs (1 pièce)",44.8,56,0.93333333333333335,16.071428571428569,65,null,null,null,"Utilisateur_9"]
[null,null,3,"Voltis : Fiches Voltis 2 montages  ( 1 pièce )",568,710,11.833333333333334,1.2676056338028168,6,null,null,null,"Utilisateur_10"]
[null,null,4,"Voltis : Fiches voltis avec ajout interrupteur",96,120,2,7.5,30]
[null,null,5,"Euroclovis : Pliage tee-shirt",75,93.75,1.5625,9.6,39]
[null,null,6,"Alteximex : Potagers (pots)",115,143.75,2.3958333333333335,6.2608695652173907,26]
[null,null,7,"provera roayl propolis chgt etui 2 pces",24.3,30.375,0.50624999999999998,29.62962962962963,119]
[null,null,8,"provera flexosil fort (etq s/ pots)",23.8,29.75,0.49583333333333335,30.252100840336134,122]
[null,null,9,"provera creme chauffante (petits pots)",21.5,26.875,0.44791666666666669,33.488372093023251,134]
[null,null,10,"provera biaes de fruits",42,52.5,0.875,17.142857142857142,69]
[null,null,11,"Display DP Cystite (rose / - décorticage)",30.6,38.25,0.63749999999999996,23.529411764705884,95]
[null,null,"11-01","Display DP Cystite (rose / - montage socle)",51.1,63.875,1.0645833333333334,14.090019569471623,57]
[null,null,"11-02","Display DP Cystite (rose / - collage fronton)",10.8,13.5,0.22500000000000001,66.666666666666671,267]
[null,null,"11-03","Display DP Cystite (rose / - décorticage intérieur)",8.52,10.649999999999999,0.17749999999999996,84.507042253521149,339]
[null,null,"11-04","Display DP Cystite (rose / - mise en boite)",39.869999999999997,49.837499999999999,0.83062499999999995,18.058690744920995,73]
[null,null,12,"Grando languettes blanches mousse BT6060,089",165,206.25,3.4375,4.3636363636363633,18]
[null,null,13,"Grando AP-AC-R326-A-1 adhésivage 2 dble face",22.25,27.8125,0.46354166666666669,32.359550561797754,130]
[null,null,14,"Grando AP-AC-R327-A-1 adhésivage 1 dble face",17.05,21.3125,0.35520833333333335,42.228739002932549,169]
[null,null,15,"Grando AP-ST-DISQUE filmage chaud 8 pces",45,56.25,0.9375,16,64]
[null,null,16,"Grando AP-COLCRCK289X75 collage 3 pces",110.5,138.125,2.3020833333333335,6.5158371040723981,27]
[null,null,17,"Meno 211241 - ferrures lit 10x2 pces + soudure+sac fourni apn",62.4,78,1.3,11.538461538461538,47]
[null,null,18,"Meno 393576 - trolley électricien 86 éléments",null,0,0,0,0]
[null,null,19,"Alteximex etiquette simple",18.23,22.787500000000001,0.37979166666666669,39.49533735600658,158]
[null,null,20,"DP Sediplus sleep (Décorticage)",15.93,19.912500000000001,0.33187500000000003,45.197740112994346,181]
[null,null,"20-01","DP Sediplus sleep (Montage petit socle)",79.25,99.0625,1.6510416666666667,9.0851735015772874,37]
[null,null,"20-02","DP Sediplus sleep (Montage grand socle)",134,167.5,2.7916666666666665,5.3731343283582094,22]
[null,null,"20-03","DP Sediplus sleep (collage pancarte)",30,37.5,0.625,24,96]
[null,null,"20-04","DP Sediplus sleep (montage)",81.25,101.5625,1.6927083333333333,8.861538461538462,36]
[null,null,"20-05","DP Sediplus sleep (Mise en boite)",43.75,54.6875,0.91145833333333337,16.457142857142856,66]
[null,null,"20-06","DP Sediplus sleep (collage corps display)",60,75,1.25,12,48]
[null,null,22,"Grando : AP-ADHESIV-2550-A-1 adhésivage 1 dble face précis",32.5,40.625,0.67708333333333337,22.153846153846153,89]
[null,null,23,"Baillieul : cystiphane mise 1 plaquette ds etui",21.62,27.025000000000002,0.45041666666666669,33.30249768732655,134]
[null,null,24,"Grando : Décorticage mousses blancs 6 intérieurs",22.5,28.125,0.46875,32,128]

{"sheet":"Commandes","index":3,"n_rows":8,"n_cols":7,"rows_kept":8,"cut":false,"hidden":false,"merged":[]}
["PIECES","DESIGNATION","N° CDE","Quantite","2019-01-24","2019-01-25","2019-01-25"]
[1,{"$f":"IF(A2=\"\",\"\",VLOOKUP(A2,TabArticles[],2,FALSE))","v":"Alteximex Recharges potagers (1 boite)"},1234,1000,100,100,50]
["11-03",{"$f":"IF(A3=\"\",\"\",VLOOKUP(A3,TabArticles[],2,FALSE))","v":"Display DP Cystite (rose / - décorticage intérieur)"},5678,3000]
[5,{"$f":"IF(A4=\"\",\"\",VLOOKUP(A4,TabArticles[],2,FALSE))","v":"Euroclovis : Pliage tee-shirt"},91011,1000]
[16,{"$f":"IF(A5=\"\",\"\",VLOOKUP(A5,TabArticles[],2,FALSE))","v":"Grando AP-COLCRCK289X75 collage 3 pces"},121314,5800,null,"utilisteur 1","utilisateur 2"]
[18,{"$f":"IF(A6=\"\",\"\",VLOOKUP(A6,TabArticles[],2,FALSE))","v":"Meno 393576 - trolley électricien 86 éléments"},151617,20]
[6,{"$f":"IF(A7=\"\",\"\",VLOOKUP(A7,TabArticles[],2,FALSE))","v":"Alteximex : Potagers (pots)"},181920,542]
[10,{"$f":"IF(A8=\"\",\"\",VLOOKUP(A8,TabArticles[],2,FALSE))","v":"provera biaes de fruits"},212223,10500]

{"sheet":"Utilisateur_1","index":4,"n_rows":23,"n_cols":13,"rows_kept":23,"cut":false,"hidden":false,"merged":[]}
["DATE","PRENOM","PIECE ","DESIGNATION","LOT","HEURE debut","heure fin","Nbre de pièces finies","temps de travail en secondes ","+ 25% temps","temps de travail en minutes","Nbre de boites/pces pour 15 minutes","Nbre de boites/pces à l'heure"]
["2019-01-24","utilisateur 1",1,{"$f":"IF(C2=\"\",\"\",VLOOKUP(C2,TabArticles[],2,FALSE))","v":"Alteximex Recharges potagers (1 boite)"},1234,"12:18:04","12:20:28",100,{"$f":"IF(C2=\"\",\"\",VLOOKUP(C2,TabArticles[],3,FALSE))","v":240},{"$f":"IF(C2=\"\",\"\",VLOOKUP(C2,TabArticles[],4,FALSE))","v":300},{"$f":"IF(C2=\"\",\"\",VLOOKUP(C2,TabArticles[],5,FALSE))","v":5},{"$f":"IF(C2=\"\",\"\",VLOOKUP(C2,TabArticles[],6,FALSE))","v":3},{"$f":"IF(C2=\"\",\"\",VLOOKUP(C2,TabArticles[],7,FALSE))","v":12}]
["2019-01-24","utilisateur 1","11-03",{"$f":"IF(C3=\"\",\"\",VLOOKUP(C3,TabArticles[],2,FALSE))","v":"Display DP Cystite (rose / - décorticage intérieur)"},5678,"12:20:28","12:22:11",23,{"$f":"IF(C3=\"\",\"\",VLOOKUP(C3,TabArticles[],3,FALSE))","v":8.52},{"$f":"IF(C3=\"\",\"\",VLOOKUP(C3,TabArticles[],4,FALSE))","v":10.649999999999999},{"$f":"IF(C3=\"\",\"\",VLOOKUP(C3,TabArticles[],5,FALSE))","v":0.17749999999999996},{"$f":"IF(C3=\"\",\"\",VLOOKUP(C3,TabArticles[],6,FALSE))","v":84.507042253521149},{"$f":"IF(C3=\"\",\"\",VLOOKUP(C3,TabArticles[],7,FALSE))","v":339}]
["2019-01-24","utilisateur 1",5,{"$f":"IF(C4=\"\",\"\",VLOOKUP(C4,TabArticles[],2,FALSE))","v":"Euroclovis : Pliage tee-shirt"},91011,"12:22:11","12:22:33",250,{"$f":"IF(C4=\"\",\"\",VLOOKUP(C4,TabArticles[],3,FALSE))","v":75},{"$f":"IF(C4=\"\",\"\",VLOOKUP(C4,TabArticles[],4,FALSE))","v":93.75},{"$f":"IF(C4=\"\",\"\",VLOOKUP(C4,TabArticles[],5,FALSE))","v":1.5625},{"$f":"IF(C4=\"\",\"\",VLOOKUP(C4,TabArticles[],6,FALSE))","v":9.6},{"$f":"IF(C4=\"\",\"\",VLOOKUP(C4,TabArticles[],7,FALSE))","v":39}]
["2019-01-24","utilisateur 1",16,{"$f":"IF(C5=\"\",\"\",VLOOKUP(C5,TabArticles[],2,FALSE))","v":"Grando AP-COLCRCK289X75 collage 3 pces"},121314,"12:22:33","12:22:58",520,{"$f":"IF(C5=\"\",\"\",VLOOKUP(C5,TabArticles[],3,FALSE))","v":110.5},{"$f":"IF(C5=\"\",\"\",VLOOKUP(C5,TabArticles[],4,FALSE))","v":138.125},{"$f":"IF(C5=\"\",\"\",VLOOKUP(C5,TabArticles[],5,FALSE))","v":2.3020833333333335},{"$f":"IF(C5=\"\",\"\",VLOOKUP(C5,TabArticles[],6,FALSE))","v":6.5158371040723981},{"$f":"IF(C5=\"\",\"\",VLOOKUP(C5,TabArticles[],7,FALSE))","v":27}]
["2019-01-24","utilisateur 1",18,{"$f":"IF(C6=\"\",\"\",VLOOKUP(C6,TabArticles[],2,FALSE))","v":"Meno 393576 - trolley électricien 86 éléments"},151617,"12:22:58","12:23:27",2,{"$f":"IF(C6=\"\",\"\",VLOOKUP(C6,TabArticles[],3,FALSE))","v":0},{"$f":"IF(C6=\"\",\"\",VLOOKUP(C6,TabArticles[],4,FALSE))","v":0},{"$f":"IF(C6=\"\",\"\",VLOOKUP(C6,TabArticles[],5,FALSE))","v":0},{"$f":"IF(C6=\"\",\"\",VLOOKUP(C6,TabArticles[],6,FALSE))","v":0},{"$f":"IF(C6=\"\",\"\",VLOOKUP(C6,TabArticles[],7,FALSE))","v":0}]
["2019-01-24","utilisateur 1",6,{"$f":"IF(C7=\"\",\"\",VLOOKUP(C7,TabArticles[],2,FALSE))","v":"Alteximex : Potagers (pots)"},181920,"12:23:27","12:23:51",125,{"$f":"IF(C7=\"\",\"\",VLOOKUP(C7,TabArticles[],3,FALSE))","v":115},{"$f":"IF(C7=\"\",\"\",VLOOKUP(C7,TabArticles[],4,FALSE))","v":143.75},{"$f":"IF(C7=\"\",\"\",VLOOKUP(C7,TabArticles[],5,FALSE))","v":2.3958333333333335},{"$f":"IF(C7=\"\",\"\",VLOOKUP(C7,TabArticles[],6,FALSE))","v":6.2608695652173907},{"$f":"IF(C7=\"\",\"\",VLOOKUP(C7,TabArticles[],7,FALSE))","v":26}]
["2019-01-24","utilisateur 1",10,{"$f":"IF(C8=\"\",\"\",VLOOKUP(C8,TabArticles[],2,FALSE))","v":"provera biaes de fruits"},212223,null,"12:24:17",210,{"$f":"IF(C8=\"\",\"\",VLOOKUP(C8,TabArticles[],3,FALSE))","v":42},{"$f":"IF(C8=\"\",\"\",VLOOKUP(C8,TabArticles[],4,FALSE))","v":52.5},{"$f":"IF(C8=\"\",\"\",VLOOKUP(C8,TabArticles[],5,FALSE))","v":0.875},{"$f":"IF(C8=\"\",\"\",VLOOKUP(C8,TabArticles[],6,FALSE))","v":17.142857142857142},{"$f":"IF(C8=\"\",\"\",VLOOKUP(C8,TabArticles[],7,FALSE))","v":69}]
["2019-01-25","utilisateur 1",1,{"$f":"IF(C9=\"\",\"\",VLOOKUP(C9,TabArticles[],2,FALSE))","v":"Alteximex Recharges potagers (1 boite)"},1234,null,"13:55:22",100,{"$f":"IF(C9=\"\",\"\",VLOOKUP(C9,TabArticles[],3,FALSE))","v":240},{"$f":"IF(C9=\"\",\"\",VLOOKUP(C9,TabArticles[],4,FALSE))","v":300},{"$f":"IF(C9=\"\",\"\",VLOOKUP(C9,TabArticles[],5,FALSE))","v":5},{"$f":"IF(C9=\"\",\"\",VLOOKUP(C9,TabArticles[],6,FALSE))","v":3},{"$f":"IF(C9=\"\",\"\",VLOOKUP(C9,TabArticles[],7,FALSE))","v":12}]
["2019-01-25","utilisateur 1",null,{"$f":"IF(C10=\"\",\"\",VLOOKUP(C10,TabArticles[],2,FALSE))","v":""},null,"13:55:22","22:36:55",10,{"$f":"IF(C10=\"\",\"\",VLOOKUP(C10,TabArticles[],3,FALSE))","v":""},{"$f":"IF(C10=\"\",\"\",VLOOKUP(C10,TabArticles[],4,FALSE))","v":""},{"$f":"IF(C10=\"\",\"\",VLOOKUP(C10,TabArticles[],5,FALSE))","v":""},{"$f":"IF(C10=\"\",\"\",VLOOKUP(C10,TabArticles[],6,FALSE))","v":""},{"$f":"IF(C10=\"\",\"\",VLOOKUP(C10,TabArticles[],7,FALSE))","v":""}]
["2019-01-24","Utilisateur_1","Maintenance autres sections",{"$f":"IF(C11=\"\",\"\",VLOOKUP(C11,TabArticles[],2,FALSE))","v":"Maintenance autres sections"},321,"22:36:43","22:45:16",10,{"$f":"IF(C11=\"\",\"\",VLOOKUP(C11,TabArticles[],3,FALSE))","v":0},{"$f":"IF(C11=\"\",\"\",VLOOKUP(C11,TabArticles[],4,FALSE))","v":0},{"$f":"IF(C11=\"\",\"\",VLOOKUP(C11,TabArticles[],5,FALSE))","v":0},{"$f":"IF(C11=\"\",\"\",VLOOKUP(C11,TabArticles[],6,FALSE))","v":0},{"$f":"IF(C11=\"\",\"\",VLOOKUP(C11,TabArticles[],7,FALSE))","v":0}]
["2019-01-24",null,null,{"$f":"IF(C12=\"\",\"\",VLOOKUP(C12,TabArticles[],2,FALSE))","v":""},null,"22:45:07","22:46:35",null,{"$f":"IF(C12=\"\",\"\",VLOOKUP(C12,TabArticles[],3,FALSE))","v":""},{"$f":"IF(C12=\"\",\"\",VLOOKUP(C12,TabArticles[],4,FALSE))","v":""},{"$f":"IF(C12=\"\",\"\",VLOOKUP(C12,TabArticles[],5,FALSE))","v":""},{"$f":"IF(C12=\"\",\"\",VLOOKUP(C12,TabArticles[],6,FALSE))","v":""},{"$f":"IF(C12=\"\",\"\",VLOOKUP(C12,TabArticles[],7,FALSE))","v":""}]
["2019-01-24","Utilisateur_1","Mise en ordre locaux",{"$f":"IF(C13=\"\",\"\",VLOOKUP(C13,TabArticles[],2,FALSE))","v":"Mise en ordre locaux"},123,"22:46:35","22:47:56",10,{"$f":"IF(C13=\"\",\"\",VLOOKUP(C13,TabArticles[],3,FALSE))","v":0},{"$f":"IF(C13=\"\",\"\",VLOOKUP(C13,TabArticles[],4,FALSE))","v":0},{"$f":"IF(C13=\"\",\"\",VLOOKUP(C13,TabArticles[],5,FALSE))","v":0},{"$f":"IF(C13=\"\",\"\",VLOOKUP(C13,TabArticles[],6,FALSE))","v":0},{"$f":"IF(C13=\"\",\"\",VLOOKUP(C13,TabArticles[],7,FALSE))","v":0}]
["2019-01-24","Utilisateur_1","Maintenance autres sections",{"$f":"IF(C14=\"\",\"\",VLOOKUP(C14,TabArticles[],2,FALSE))","v":"Maintenance autres sections"},155,"22:47:56","22:59:20",20,{"$f":"IF(C14=\"\",\"\",VLOOKUP(C14,TabArticles[],3,FALSE))","v":0},{"$f":"IF(C14=\"\",\"\",VLOOKUP(C14,TabArticles[],4,FALSE))","v":0},{"$f":"IF(C14=\"\",\"\",VLOOKUP(C14,TabArticles[],5,FALSE))","v":0},{"$f":"IF(C14=\"\",\"\",VLOOKUP(C14,TabArticles[],6,FALSE))","v":0},{"$f":"IF(C14=\"\",\"\",VLOOKUP(C14,TabArticles[],7,FALSE))","v":0}]
["2019-01-24","Utilisateur_1","Maintenance autres sections",{"$f":"IF(C15=\"\",\"\",VLOOKUP(C15,TabArticles[],2,FALSE))","v":"Maintenance autres sections"},321,"22:59:20","23:03:50",50,{"$f":"IF(C15=\"\",\"\",VLOOKUP(C15,TabArticles[],3,FALSE))","v":0},{"$f":"IF(C15=\"\",\"\",VLOOKUP(C15,TabArticles[],4,FALSE))","v":0},{"$f":"IF(C15=\"\",\"\",VLOOKUP(C15,TabArticles[],5,FALSE))","v":0},{"$f":"IF(C15=\"\",\"\",VLOOKUP(C15,TabArticles[],6,FALSE))","v":0},{"$f":"IF(C15=\"\",\"\",VLOOKUP(C15,TabArticles[],7,FALSE))","v":0}]
["2019-01-24","Utilisateur_1",1,{"$f":"IF(C16=\"\",\"\",VLOOKUP(C16,TabArticles[],2,FALSE))","v":"Alteximex Recharges potagers (1 boite)"},2,"23:03:50","23:05:06",20,{"$f":"IF(C16=\"\",\"\",VLOOKUP(C16,TabArticles[],3,FALSE))","v":240},{"$f":"IF(C16=\"\",\"\",VLOOKUP(C16,TabArticles[],4,FALSE))","v":300},{"$f":"IF(C16=\"\",\"\",VLOOKUP(C16,TabArticles[],5,FALSE))","v":5},{"$f":"IF(C16=\"\",\"\",VLOOKUP(C16,TabArticles[],6,FALSE))","v":3},{"$f":"IF(C16=\"\",\"\",VLOOKUP(C16,TabArticles[],7,FALSE))","v":12}]
["2019-01-24","Utilisateur_1",2,{"$f":"IF(C17=\"\",\"\",VLOOKUP(C17,TabArticles[],2,FALSE))","v":"Grando Grillages noirs (1 pièce)"},2,"23:05:06","08:58:29",2,{"$f":"IF(C17=\"\",\"\",VLOOKUP(C17,TabArticles[],3,FALSE))","v":44.8},{"$f":"IF(C17=\"\",\"\",VLOOKUP(C17,TabArticles[],4,FALSE))","v":56},{"$f":"IF(C17=\"\",\"\",VLOOKUP(C17,TabArticles[],5,FALSE))","v":0.93333333333333335},{"$f":"IF(C17=\"\",\"\",VLOOKUP(C17,TabArticles[],6,FALSE))","v":16.071428571428569},{"$f":"IF(C17=\"\",\"\",VLOOKUP(C17,TabArticles[],7,FALSE))","v":65}]
["2019-01-25","Utilisateur_1",1,{"$f":"IF(C18=\"\",\"\",VLOOKUP(C18,TabArticles[],2,FALSE))","v":"Alteximex Recharges potagers (1 boite)"},1234,"08:58:29","08:58:52",12,{"$f":"IF(C18=\"\",\"\",VLOOKUP(C18,TabArticles[],3,FALSE))","v":240},{"$f":"IF(C18=\"\",\"\",VLOOKUP(C18,TabArticles[],4,FALSE))","v":300},{"$f":"IF(C18=\"\",\"\",VLOOKUP(C18,TabArticles[],5,FALSE))","v":5},{"$f":"IF(C18=\"\",\"\",VLOOKUP(C18,TabArticles[],6,FALSE))","v":3},{"$f":"IF(C18=\"\",\"\",VLOOKUP(C18,TabArticles[],7,FALSE))","v":12}]
["2019-01-25","Utilisateur_1",null,{"$f":"IF(C19=\"\",\"\",VLOOKUP(C19,TabArticles[],2,FALSE))","v":""},null,"08:58:52","08:59:19",null,{"$f":"IF(C19=\"\",\"\",VLOOKUP(C19,TabArticles[],3,FALSE))","v":""},{"$f":"IF(C19=\"\",\"\",VLOOKUP(C19,TabArticles[],4,FALSE))","v":""},{"$f":"IF(C19=\"\",\"\",VLOOKUP(C19,TabArticles[],5,FALSE))","v":""},{"$f":"IF(C19=\"\",\"\",VLOOKUP(C19,TabArticles[],6,FALSE))","v":""},{"$f":"IF(C19=\"\",\"\",VLOOKUP(C19,TabArticles[],7,FALSE))","v":""}]
["2019-01-25","Utilisateur_1",1,{"$f":"IF(C20=\"\",\"\",VLOOKUP(C20,TabArticles[],2,FALSE))","v":"Alteximex Recharges potagers (1 boite)"},1234,"08:59:19","09:01:22",14,{"$f":"IF(C20=\"\",\"\",VLOOKUP(C20,TabArticles[],3,FALSE))","v":240},{"$f":"IF(C20=\"\",\"\",VLOOKUP(C20,TabArticles[],4,FALSE))","v":300},{"$f":"IF(C20=\"\",\"\",VLOOKUP(C20,TabArticles[],5,FALSE))","v":5},{"$f":"IF(C20=\"\",\"\",VLOOKUP(C20,TabArticles[],6,FALSE))","v":3},{"$f":"IF(C20=\"\",\"\",VLOOKUP(C20,TabArticles[],7,FALSE))","v":12}]
["2019-01-25","Utilisateur_1",1,{"$f":"IF(C21=\"\",\"\",VLOOKUP(C21,TabArticles[],2,FALSE))","v":"Alteximex Recharges potagers (1 boite)"},1234,"09:01:22","09:09:34",14,{"$f":"IF(C21=\"\",\"\",VLOOKUP(C21,TabArticles[],3,FALSE))","v":240},{"$f":"IF(C21=\"\",\"\",VLOOKUP(C21,TabArticles[],4,FALSE))","v":300},{"$f":"IF(C21=\"\",\"\",VLOOKUP(C21,TabArticles[],5,FALSE))","v":5},{"$f":"IF(C21=\"\",\"\",VLOOKUP(C21,TabArticles[],6,FALSE))","v":3},{"$f":"IF(C21=\"\",\"\",VLOOKUP(C21,TabArticles[],7,FALSE))","v":12}]
["2019-01-25","Utilisateur_1",1,{"$f":"IF(C22=\"\",\"\",VLOOKUP(C22,TabArticles[],2,FALSE))","v":"Alteximex Recharges potagers (1 boite)"},1234,"09:09:34","09:10:49",12,{"$f":"IF(C22=\"\",\"\",VLOOKUP(C22,TabArticles[],3,FALSE))","v":240},{"$f":"IF(C22=\"\",\"\",VLOOKUP(C22,TabArticles[],4,FALSE))","v":300},{"$f":"IF(C22=\"\",\"\",VLOOKUP(C22,TabArticles[],5,FALSE))","v":5},{"$f":"IF(C22=\"\",\"\",VLOOKUP(C22,TabArticles[],6,FALSE))","v":3},{"$f":"IF(C22=\"\",\"\",VLOOKUP(C22,TabArticles[],7,FALSE))","v":12}]
["2019-01-25","Utilisateur_2",null,{"$f":"IF(C23=\"\",\"\",VLOOKUP(C23,TabArticles[],2,FALSE))","v":""},null,"09:10:49",null,null,{"$f":"IF(C23=\"\",\"\",VLOOKUP(C23,TabArticles[],3,FALSE))","v":""},{"$f":"IF(C23=\"\",\"\",VLOOKUP(C23,TabArticles[],4,FALSE))","v":""},{"$f":"IF(C23=\"\",\"\",VLOOKUP(C23,TabArticles[],5,FALSE))","v":""},{"$f":"IF(C23=\"\",\"\",VLOOKUP(C23,TabArticles[],6,FALSE))","v":""},{"$f":"IF(C23=\"\",\"\",VLOOKUP(C23,TabArticles[],7,FALSE))","v":""}]

{"sheet":"Utilisateur_2","index":5,"n_rows":10,"n_cols":13,"rows_kept":10,"cut":false,"hidden":false,"merged":[]}
["DATE","PRENOM","PIECE ","DESIGNATION","LOT","HEURE debut","heure fin","Nbre de pièces finies","temps de travail en secondes ","+ 25% temps","temps de travail en minutes","Nbre de boites/pces pour 15 minutes","Nbre de boites/pces à l'heure"]
["2019-01-25","utilisateur 1",1,{"$f":"IF(C2=\"\",\"\",VLOOKUP(C2,TabArticles[],2,FALSE))","v":"Alteximex Recharges potagers (1 boite)"},1234,"12:24:17","14:32:59",50,{"$f":"IF(C2=\"\",\"\",VLOOKUP(C2,TabArticles[],3,FALSE))","v":240},{"$f":"IF(C2=\"\",\"\",VLOOKUP(C2,TabArticles[],4,FALSE))","v":300},{"$f":"IF(C2=\"\",\"\",VLOOKUP(C2,TabArticles[],5,FALSE))","v":5},{"$f":"IF(C2=\"\",\"\",VLOOKUP(C2,TabArticles[],6,FALSE))","v":3},{"$f":"IF(C2=\"\",\"\",VLOOKUP(C2,TabArticles[],7,FALSE))","v":12}]
["2019-01-24","utilisateur 2",null,{"$f":"IF(C3=\"\",\"\",VLOOKUP(C3,TabArticles[],2,FALSE))","v":""},null,"14:32:59","14:33:48",null,{"$f":"IF(C3=\"\",\"\",VLOOKUP(C3,TabArticles[],3,FALSE))","v":""},{"$f":"IF(C3=\"\",\"\",VLOOKUP(C3,TabArticles[],4,FALSE))","v":""},{"$f":"IF(C3=\"\",\"\",VLOOKUP(C3,TabArticles[],5,FALSE))","v":""},{"$f":"IF(C3=\"\",\"\",VLOOKUP(C3,TabArticles[],6,FALSE))","v":""},{"$f":"IF(C3=\"\",\"\",VLOOKUP(C3,TabArticles[],7,FALSE))","v":""}]
["2019-01-24","utilisateur 2",null,{"$f":"IF(C4=\"\",\"\",VLOOKUP(C4,TabArticles[],2,FALSE))","v":""},null,"14:33:48","14:33:59",null,{"$f":"IF(C4=\"\",\"\",VLOOKUP(C4,TabArticles[],3,FALSE))","v":""},{"$f":"IF(C4=\"\",\"\",VLOOKUP(C4,TabArticles[],4,FALSE))","v":""},{"$f":"IF(C4=\"\",\"\",VLOOKUP(C4,TabArticles[],5,FALSE))","v":""},{"$f":"IF(C4=\"\",\"\",VLOOKUP(C4,TabArticles[],6,FALSE))","v":""},{"$f":"IF(C4=\"\",\"\",VLOOKUP(C4,TabArticles[],7,FALSE))","v":""}]
["2019-01-24","utilisateur 2",null,{"$f":"IF(C5=\"\",\"\",VLOOKUP(C5,TabArticles[],2,FALSE))","v":""},null,"14:33:59","18:47:41",null,{"$f":"IF(C5=\"\",\"\",VLOOKUP(C5,TabArticles[],3,FALSE))","v":""},{"$f":"IF(C5=\"\",\"\",VLOOKUP(C5,TabArticles[],4,FALSE))","v":""},{"$f":"IF(C5=\"\",\"\",VLOOKUP(C5,TabArticles[],5,FALSE))","v":""},{"$f":"IF(C5=\"\",\"\",VLOOKUP(C5,TabArticles[],6,FALSE))","v":""},{"$f":"IF(C5=\"\",\"\",VLOOKUP(C5,TabArticles[],7,FALSE))","v":""}]
["2019-01-24","utilisateur 2",null,{"$f":"IF(C6=\"\",\"\",VLOOKUP(C6,TabArticles[],2,FALSE))","v":""},null,"18:47:41","23:01:00",null,{"$f":"IF(C6=\"\",\"\",VLOOKUP(C6,TabArticles[],3,FALSE))","v":""},{"$f":"IF(C6=\"\",\"\",VLOOKUP(C6,TabArticles[],4,FALSE))","v":""},{"$f":"IF(C6=\"\",\"\",VLOOKUP(C6,TabArticles[],5,FALSE))","v":""},{"$f":"IF(C6=\"\",\"\",VLOOKUP(C6,TabArticles[],6,FALSE))","v":""},{"$f":"IF(C6=\"\",\"\",VLOOKUP(C6,TabArticles[],7,FALSE))","v":""}]
["2019-01-24","Utilisateur_2",1,{"$f":"IF(C7=\"\",\"\",VLOOKUP(C7,TabArticles[],2,FALSE))","v":"Alteximex Recharges potagers (1 boite)"},10,"23:01:00","09:00:55",20,{"$f":"IF(C7=\"\",\"\",VLOOKUP(C7,TabArticles[],3,FALSE))","v":240},{"$f":"IF(C7=\"\",\"\",VLOOKUP(C7,TabArticles[],4,FALSE))","v":300},{"$f":"IF(C7=\"\",\"\",VLOOKUP(C7,TabArticles[],5,FALSE))","v":5},{"$f":"IF(C7=\"\",\"\",VLOOKUP(C7,TabArticles[],6,FALSE))","v":3},{"$f":"IF(C7=\"\",\"\",VLOOKUP(C7,TabArticles[],7,FALSE))","v":12}]
["2019-01-25","Utilisateur_2",1,{"$f":"IF(C8=\"\",\"\",VLOOKUP(C8,TabArticles[],2,FALSE))","v":"Alteximex Recharges potagers (1 boite)"},1234,"09:00:55","09:09:56",12,{"$f":"IF(C8=\"\",\"\",VLOOKUP(C8,TabArticles[],3,FALSE))","v":240},{"$f":"IF(C8=\"\",\"\",VLOOKUP(C8,TabArticles[],4,FALSE))","v":300},{"$f":"IF(C8=\"\",\"\",VLOOKUP(C8,TabArticles[],5,FALSE))","v":5},{"$f":"IF(C8=\"\",\"\",VLOOKUP(C8,TabArticles[],6,FALSE))","v":3},{"$f":"IF(C8=\"\",\"\",VLOOKUP(C8,TabArticles[],7,FALSE))","v":12}]
["2019-01-25","Utilisateur_2",1,{"$f":"IF(C9=\"\",\"\",VLOOKUP(C9,TabArticles[],2,FALSE))","v":"Alteximex Recharges potagers (1 boite)"},1234,"09:09:56","09:10:31",12,{"$f":"IF(C9=\"\",\"\",VLOOKUP(C9,TabArticles[],3,FALSE))","v":240},{"$f":"IF(C9=\"\",\"\",VLOOKUP(C9,TabArticles[],4,FALSE))","v":300},{"$f":"IF(C9=\"\",\"\",VLOOKUP(C9,TabArticles[],5,FALSE))","v":5},{"$f":"IF(C9=\"\",\"\",VLOOKUP(C9,TabArticles[],6,FALSE))","v":3},{"$f":"IF(C9=\"\",\"\",VLOOKUP(C9,TabArticles[],7,FALSE))","v":12}]
["2019-01-25","Utilisateur_2",null,{"$f":"IF(C10=\"\",\"\",VLOOKUP(C10,TabArticles[],2,FALSE))","v":""},null,"09:10:31",null,null,{"$f":"IF(C10=\"\",\"\",VLOOKUP(C10,TabArticles[],3,FALSE))","v":""},{"$f":"IF(C10=\"\",\"\",VLOOKUP(C10,TabArticles[],4,FALSE))","v":""},{"$f":"IF(C10=\"\",\"\",VLOOKUP(C10,TabArticles[],5,FALSE))","v":""},{"$f":"IF(C10=\"\",\"\",VLOOKUP(C10,TabArticles[],6,FALSE))","v":""},{"$f":"IF(C10=\"\",\"\",VLOOKUP(C10,TabArticles[],7,FALSE))","v":""}]

{"sheet":"Utilisateur_3","index":6,"n_rows":5,"n_cols":13,"rows_kept":5,"cut":false,"hidden":false,"merged":[]}
["DATE","PRENOM","PIECE ","DESIGNATION","LOT","HEURE debut","heure fin","Nbre de pièces finies","temps de travail en secondes ","+ 25% temps","temps de travail en minutes","Nbre de boites/pces pour 15 minutes","Nbre de boites/pces à l'heure"]
["2019-01-23","utilisateur 3",null,{"$f":"IF(C2=\"\",\"\",VLOOKUP(C2,TabArticles[],2,FALSE))","v":""},null,"21:39:38","18:42:07",null,{"$f":"IF(C2=\"\",\"\",VLOOKUP(C2,TabArticles[],3,FALSE))","v":""},{"$f":"IF(C2=\"\",\"\",VLOOKUP(C2,TabArticles[],4,FALSE))","v":""},{"$f":"IF(C2=\"\",\"\",VLOOKUP(C2,TabArticles[],5,FALSE))","v":""},{"$f":"IF(C2=\"\",\"\",VLOOKUP(C2,TabArticles[],6,FALSE))","v":""},{"$f":"IF(C2=\"\",\"\",VLOOKUP(C2,TabArticles[],7,FALSE))","v":""}]
["2019-01-24","utilisateur 3",2,{"$f":"IF(C3=\"\",\"\",VLOOKUP(C3,TabArticles[],2,FALSE))","v":"Grando Grillages noirs (1 pièce)"},2,"18:42:07","22:31:05",10,{"$f":"IF(C3=\"\",\"\",VLOOKUP(C3,TabArticles[],3,FALSE))","v":44.8},{"$f":"IF(C3=\"\",\"\",VLOOKUP(C3,TabArticles[],4,FALSE))","v":56},{"$f":"IF(C3=\"\",\"\",VLOOKUP(C3,TabArticles[],5,FALSE))","v":0.93333333333333335},{"$f":"IF(C3=\"\",\"\",VLOOKUP(C3,TabArticles[],6,FALSE))","v":16.071428571428569},{"$f":"IF(C3=\"\",\"\",VLOOKUP(C3,TabArticles[],7,FALSE))","v":65}]
["2019-01-24","Utilisateur_3",null,{"$f":"IF(C4=\"\",\"\",VLOOKUP(C4,TabArticles[],2,FALSE))","v":""},null,"22:30:50","09:01:09",null,{"$f":"IF(C4=\"\",\"\",VLOOKUP(C4,TabArticles[],3,FALSE))","v":""},{"$f":"IF(C4=\"\",\"\",VLOOKUP(C4,TabArticles[],4,FALSE))","v":""},{"$f":"IF(C4=\"\",\"\",VLOOKUP(C4,TabArticles[],5,FALSE))","v":""},{"$f":"IF(C4=\"\",\"\",VLOOKUP(C4,TabArticles[],6,FALSE))","v":""},{"$f":"IF(C4=\"\",\"\",VLOOKUP(C4,TabArticles[],7,FALSE))","v":""}]
["2019-01-25","Utilisateur_3",1,{"$f":"IF(C5=\"\",\"\",VLOOKUP(C5,TabArticles[],2,FALSE))","v":"Alteximex Recharges potagers (1 boite)"},1234,"09:01:09",null,12,{"$f":"IF(C5=\"\",\"\",VLOOKUP(C5,TabArticles[],3,FALSE))","v":240},{"$f":"IF(C5=\"\",\"\",VLOOKUP(C5,TabArticles[],4,FALSE))","v":300},{"$f":"IF(C5=\"\",\"\",VLOOKUP(C5,TabArticles[],5,FALSE))","v":5},{"$f":"IF(C5=\"\",\"\",VLOOKUP(C5,TabArticles[],6,FALSE))","v":3},{"$f":"IF(C5=\"\",\"\",VLOOKUP(C5,TabArticles[],7,FALSE))","v":12}]

{"sheet":"Utilisateur_4","index":7,"n_rows":2,"n_cols":13,"rows_kept":2,"cut":false,"hidden":false,"merged":[]}
["DATE","PRENOM","PIECE ","DESIGNATION","LOT","HEURE debut","heure fin","Nbre de pièces finies","temps de travail en secondes ","+ 25% temps","temps de travail en minutes","Nbre de boites/pces pour 15 minutes","Nbre de boites/pces à l'heure"]
["2019-01-24","utilisateur 4",null,{"$f":"IF(C2=\"\",\"\",VLOOKUP(C2,TabArticles[],2,FALSE))","v":""},null,"10:16:53",null,null,{"$f":"IF(C2=\"\",\"\",VLOOKUP(C2,TabArticles[],3,FALSE))","v":""},{"$f":"IF(C2=\"\",\"\",VLOOKUP(C2,TabArticles[],4,FALSE))","v":""},{"$f":"IF(C2=\"\",\"\",VLOOKUP(C2,TabArticles[],5,FALSE))","v":""},{"$f":"IF(C2=\"\",\"\",VLOOKUP(C2,TabArticles[],6,FALSE))","v":""},{"$f":"IF(C2=\"\",\"\",VLOOKUP(C2,TabArticles[],7,FALSE))","v":""}]

{"sheet":"Utilisateur_5","index":8,"n_rows":3,"n_cols":13,"rows_kept":3,"cut":false,"hidden":false,"merged":[]}
["DATE","PRENOM","PIECE ","DESIGNATION","LOT","HEURE debut","heure fin","Nbre de pièces finies","temps de travail en secondes ","+ 25% temps","temps de travail en minutes","Nbre de boites/pces pour 15 minutes","Nbre de boites/pces à l'heure"]
["2019-01-23","utilisateur 5",null,{"$f":"IF(C2=\"\",\"\",VLOOKUP(C2,TabArticles[],2,FALSE))","v":""},null,"21:40:28","10:17:53",null,{"$f":"IF(C2=\"\",\"\",VLOOKUP(C2,TabArticles[],3,FALSE))","v":""},{"$f":"IF(C2=\"\",\"\",VLOOKUP(C2,TabArticles[],4,FALSE))","v":""},{"$f":"IF(C2=\"\",\"\",VLOOKUP(C2,TabArticles[],5,FALSE))","v":""},{"$f":"IF(C2=\"\",\"\",VLOOKUP(C2,TabArticles[],6,FALSE))","v":""},{"$f":"IF(C2=\"\",\"\",VLOOKUP(C2,TabArticles[],7,FALSE))","v":""}]
["2019-01-24","utilisateur 5",null,{"$f":"IF(C3=\"\",\"\",VLOOKUP(C3,TabArticles[],2,FALSE))","v":""},null,"10:17:53",null,null,{"$f":"IF(C3=\"\",\"\",VLOOKUP(C3,TabArticles[],3,FALSE))","v":""},{"$f":"IF(C3=\"\",\"\",VLOOKUP(C3,TabArticles[],4,FALSE))","v":""},{"$f":"IF(C3=\"\",\"\",VLOOKUP(C3,TabArticles[],5,FALSE))","v":""},{"$f":"IF(C3=\"\",\"\",VLOOKUP(C3,TabArticles[],6,FALSE))","v":""},{"$f":"IF(C3=\"\",\"\",VLOOKUP(C3,TabArticles[],7,FALSE))","v":""}]

{"sheet":"Utilisateur_6","index":9,"n_rows":3,"n_cols":13,"rows_kept":3,"cut":false,"hidden":false,"merged":[]}
["DATE","PRENOM","PIECE ","DESIGNATION","LOT","HEURE debut","heure fin","Nbre de pièces finies","temps de travail en secondes ","+ 25% temps","temps de travail en minutes","Nbre de boites/pces pour 15 minutes","Nbre de boites/pces à l'heure"]
["2019-01-23","utilisateur 6",null,{"$f":"IF(C2=\"\",\"\",VLOOKUP(C2,TabArticles[],2,FALSE))","v":""},null,"21:37:38","08:25:56",null,{"$f":"IF(C2=\"\",\"\",VLOOKUP(C2,TabArticles[],3,FALSE))","v":""},{"$f":"IF(C2=\"\",\"\",VLOOKUP(C2,TabArticles[],4,FALSE))","v":""},{"$f":"IF(C2=\"\",\"\",VLOOKUP(C2,TabArticles[],5,FALSE))","v":""},{"$f":"IF(C2=\"\",\"\",VLOOKUP(C2,TabArticles[],6,FALSE))","v":""},{"$f":"IF(C2=\"\",\"\",VLOOKUP(C2,TabArticles[],7,FALSE))","v":""}]
["2019-01-24","utilisateur 6",5,{"$f":"IF(C3=\"\",\"\",VLOOKUP(C3,TabArticles[],2,FALSE))","v":"Euroclovis : Pliage tee-shirt"},"fxcg","08:25:56",null,20,{"$f":"IF(C3=\"\",\"\",VLOOKUP(C3,TabArticles[],3,FALSE))","v":75},{"$f":"IF(C3=\"\",\"\",VLOOKUP(C3,TabArticles[],4,FALSE))","v":93.75},{"$f":"IF(C3=\"\",\"\",VLOOKUP(C3,TabArticles[],5,FALSE))","v":1.5625},{"$f":"IF(C3=\"\",\"\",VLOOKUP(C3,TabArticles[],6,FALSE))","v":9.6},{"$f":"IF(C3=\"\",\"\",VLOOKUP(C3,TabArticles[],7,FALSE))","v":39}]

{"sheet":"Utilisateur_7","index":10,"n_rows":2,"n_cols":13,"rows_kept":2,"cut":false,"hidden":false,"merged":[]}
["DATE","PRENOM","PIECE ","DESIGNATION","LOT","HEURE debut","heure fin","Nbre de pièces finies","temps de travail en secondes ","+ 25% temps","temps de travail en minutes","Nbre de boites/pces pour 15 minutes","Nbre de boites/pces à l'heure"]
["2019-01-23","utilisateur 7",null,{"$f":"IF(C2=\"\",\"\",VLOOKUP(C2,TabArticles[],2,FALSE))","v":""},null,"21:40:57",null,null,{"$f":"IF(C2=\"\",\"\",VLOOKUP(C2,TabArticles[],3,FALSE))","v":""},{"$f":"IF(C2=\"\",\"\",VLOOKUP(C2,TabArticles[],4,FALSE))","v":""},{"$f":"IF(C2=\"\",\"\",VLOOKUP(C2,TabArticles[],5,FALSE))","v":""},{"$f":"IF(C2=\"\",\"\",VLOOKUP(C2,TabArticles[],6,FALSE))","v":""},{"$f":"IF(C2=\"\",\"\",VLOOKUP(C2,TabArticles[],7,FALSE))","v":""}]

{"sheet":"Utilisateur_8","index":11,"n_rows":2,"n_cols":13,"rows_kept":2,"cut":false,"hidden":false,"merged":[]}
["DATE","PRENOM","PIECE ","DESIGNATION","LOT","HEURE debut","heure fin","Nbre de pièces finies","temps de travail en secondes ","+ 25% temps","temps de travail en minutes","Nbre de boites/pces pour 15 minutes","Nbre de boites/pces à l'heure"]
[null,null,null,{"$f":"IF(C2=\"\",\"\",VLOOKUP(C2,TabArticles[],2,FALSE))","v":""},null,null,null,null,{"$f":"IF(C2=\"\",\"\",VLOOKUP(C2,TabArticles[],3,FALSE))","v":""},{"$f":"IF(C2=\"\",\"\",VLOOKUP(C2,TabArticles[],4,FALSE))","v":""},{"$f":"IF(C2=\"\",\"\",VLOOKUP(C2,TabArticles[],5,FALSE))","v":""},{"$f":"IF(C2=\"\",\"\",VLOOKUP(C2,TabArticles[],6,FALSE))","v":""},{"$f":"IF(C2=\"\",\"\",VLOOKUP(C2,TabArticles[],7,FALSE))","v":""}]

{"sheet":"Utilisateur_9","index":12,"n_rows":2,"n_cols":13,"rows_kept":2,"cut":false,"hidden":false,"merged":[]}
["DATE","PRENOM","PIECE ","DESIGNATION","LOT","HEURE debut","heure fin","Nbre de pièces finies","temps de travail en secondes ","+ 25% temps","temps de travail en minutes","Nbre de boites/pces pour 15 minutes","Nbre de boites/pces à l'heure"]
[null,null,null,{"$f":"IF(C2=\"\",\"\",VLOOKUP(C2,TabArticles[],2,FALSE))","v":""},null,null,null,null,{"$f":"IF(C2=\"\",\"\",VLOOKUP(C2,TabArticles[],3,FALSE))","v":""},{"$f":"IF(C2=\"\",\"\",VLOOKUP(C2,TabArticles[],4,FALSE))","v":""},{"$f":"IF(C2=\"\",\"\",VLOOKUP(C2,TabArticles[],5,FALSE))","v":""},{"$f":"IF(C2=\"\",\"\",VLOOKUP(C2,TabArticles[],6,FALSE))","v":""},{"$f":"IF(C2=\"\",\"\",VLOOKUP(C2,TabArticles[],7,FALSE))","v":""}]

{"sheet":"Utilisateur_10","index":13,"n_rows":2,"n_cols":13,"rows_kept":2,"cut":false,"hidden":false,"merged":[]}
["DATE","PRENOM","PIECE ","DESIGNATION","LOT","HEURE debut","heure fin","Nbre de pièces finies","temps de travail en secondes ","+ 25% temps","temps de travail en minutes","Nbre de boites/pces pour 15 minutes","Nbre de boites/pces à l'heure"]
["2019-01-23","utilisateur 10",null,{"$f":"IF(C2=\"\",\"\",VLOOKUP(C2,TabArticles[],2,FALSE))","v":""},null,null,"21:58:52",null,{"$f":"IF(C2=\"\",\"\",VLOOKUP(C2,TabArticles[],3,FALSE))","v":""},{"$f":"IF(C2=\"\",\"\",VLOOKUP(C2,TabArticles[],4,FALSE))","v":""},{"$f":"IF(C2=\"\",\"\",VLOOKUP(C2,TabArticles[],5,FALSE))","v":""},{"$f":"IF(C2=\"\",\"\",VLOOKUP(C2,TabArticles[],6,FALSE))","v":""},{"$f":"IF(C2=\"\",\"\",VLOOKUP(C2,TabArticles[],7,FALSE))","v":""}]