{"text_format":"1","workbook":"xlsx","n_sheets":3,"sheets":["Calendrier","Paramètres","Feuil3"],"not_rendered":{"charts":0,"images":0,"macros":1,"external_links":0,"defined_names":1,"comments":0,"pivot_tables":0},"unopened":[],"bounds":{"document_bytes":16777216,"sheet_cells":100000,"rows_first":2000,"rows_last":500,"rows_between":2000,"halvings":0,"cell_chars":16384,"cell_head_chars":4096},"cells_cut":0,"cells_raw":0,"read":"whole","date_system":"1900"}

{"sheet":"Calendrier","index":0,"n_rows":34,"n_cols":79,"rows_kept":34,"cut":false,"hidden":false,"merged":[[0,0,0,77],[1,12,1,17],[1,18,1,23],[1,24,1,29],[1,30,1,35],[1,36,1,41],[1,42,1,47],[1,54,1,59],[1,4,1,5],[1,0,1,3],[1,6,1,11],[21,79,21,83],[23,79,23,82],[23,83,23,86],[16,78,16,79],[1,60,1,65],[1,66,1,71],[1,72,1,77],[20,79,20,83],[17,78,17,79],[19,79,19,84],[12,78,12,79],[13,78,13,79],[14,78,14,79],[15,78,15,79]]}
[{"$f":"Paramètres!A1","v":2019}]
["Decembre",null,null,null,{"$f":"SUM(A1-1)","v":2018},null,"Janvier",null,null,null,null,null,"Février",null,null,null,null,null,"Mars",null,null,null,null,null,"Avril",null,null,null,null,null,"Mai",null,null,null,null,null,"Juin",null,null,null,null,null,"Juillet",null,null,null,null,null,null,"Aout",null,null,null,null,"Septembre",null,null,null,null,null,"Octobre",null,null,null,null,null,"Novembre",null,null,null,null,null,"Decembre"]
[]
[{"$f":"INDEX(Calendrier!$CA$5:$CA$11,WEEKDAY(B4,2))","v":"Sam"},{"$f":"DATE(Calendrier!$E$2,12,1)","v":"2018-12-01"},null,null,null,null,{"$f":"INDEX(Calendrier!$CA$5:$CA$11,WEEKDAY(H4,2))","v":"Mar"},{"$f":"DATE(Calendrier!$A$1,1,1)","v":"2019-01-01"},null,null,null,null,{"$f":"INDEX(Calendrier!$CA$5:$CA$11,WEEKDAY(N4,2))","v":"Ven"},{"$f":"DATE(Calendrier!$A$1,MONTH(H4)+1,1)","v":"2019-02-01"},null,null,null,null,{"$f":"INDEX(Calendrier!$CA$5:$CA$11,WEEKDAY(T4,2))","v":"Ven"},{"$f":"DATE(Calendrier!$A$1,MONTH(N4)+1,1)","v":"2019-03-01"},null,null,null,null,{"$f":"INDEX(Calendrier!$CA$5:$CA$11,WEEKDAY(Z4,2))","v":"Lun"},{"$f":"DATE(Calendrier!$A$1,MONTH(T4)+1,1)","v":"2019-04-01"},null,null,null,null,{"$f":"INDEX(Calendrier!$CA$5:$CA$11,WEEKDAY(AF4,2))","v":"Mer"},{"$f":"DATE(Calendrier!$A$1,MONTH(Z4)+1,1)","v":"2019-05-01"},null,null,null,null,{"$f":"INDEX(Calendrier!$CA$5:$CA$11,WEEKDAY(AL4,2))","v":"Sam"},{"$f":"DATE(Calendrier!$A$1,MONTH(AF4)+1,1)","v":"2019-06-01"},null,null,null,null,{"$f":"INDEX(Calendrier!$CA$5:$CA$11,WEEKDAY(AR4,2))","v":"Lun"},{"$f":"DATE(Calendrier!$A$1,MONTH(AL4)+1,1)","v":"2019-07-01"},null,null,null,null,{"$f":"INDEX(Calendrier!$CA$5:$CA$11,WEEKDAY(AX4,2))","v":"Jeu"},{"$f":"DATE(Calendrier!$A$1,MONTH(AR4)+1,1)","v":"2019-08-01"},null,null,null,null,{"$f":"INDEX(Calendrier!$CA$5:$CA$11,WEEKDAY(BD4,2))","v":"Dim"},{"$f":"DATE(Calendrier!$A$1,MONTH(AX4)+1,1)","v":"2019-09-01"},null,null,null,null,{"$f":"INDEX(Calendrier!$CA$5:$CA$11,WEEKDAY(BJ4,2))","v":"Mar"},{"$f":"DATE(Calendrier!$A$1,MONTH(BD4)+1,1)","v":"2019-10-01"},null,null,null,null,{"$f":"INDEX(Calendrier!$CA$5:$CA$11,WEEKDAY(BP4,2))","v":"Ven"},{"$f":"DATE(Calendrier!$A$1,MONTH(BJ4)+1,1)","v":"2019-11-01"},null,null,null,null,{"$f":"INDEX(Calendrier!$CA$5:$CA$11,WEEKDAY(BV4,2))","v":"Dim"},{"$f":"DATE(Calendrier!$A$1,MONTH(BP4)+1,1)","v":"2019-12-01"}]
[{"$f":"INDEX(Calendrier!$CA$5:$CA$11,WEEKDAY(B5,2))","v":"Dim"},{"$f":"+B4+1","v":"2018-12-02"},null,null,null,null,{"$f":"INDEX(Calendrier!$CA$5:$CA$11,WEEKDAY(H5,2))","v":"Mer"},{"$f":"+H4+1","v":"2019-01-02"},null,null,null,null,{"$f":"INDEX(Calendrier!$CA$5:$CA$11,WEEKDAY(N5,2))","v":"Sam"},{"$f":"+N4+1","v":"2019-02-02"},null,null,null,null,{"$f":"INDEX(Calendrier!$CA$5:$CA$11,WEEKDAY(T5,2))","v":"Sam"},{"$f":"+T4+1","v":"2019-03-02"},null,null,null,null,{"$f":"INDEX(Calendrier!$CA$5:$CA$11,WEEKDAY(Z5,2))","v":"Mar"},{"$f":"+Z4+1","v":"2019-04-02"},null,null,null,null,{"$f":"INDEX(Calendrier!$CA$5:$CA$11,WEEKDAY(AF5,2))","v":"Jeu"},{"$f":"+AF4+1","v":"2019-05-02"},null,null,null,null,{"$f":"INDEX(Calendrier!$CA$5:$CA$11,WEEKDAY(AL5,2))","v":"Dim"},{"$f":"+AL4+1","v":"2019-06-02"},null,null,null,null,{"$f":"INDEX(Calendrier!$CA$5:$CA$11,WEEKDAY(AR5,2))","v":"Mar"},{"$f":"+AR4+1","v":"2019-07-02"},null,null,null,null,{"$f":"INDEX(Calendrier!$CA$5:$CA$11,WEEKDAY(AX5,2))","v":"Ven"},{"$f":"+AX4+1","v":"2019-08-02"},null,null,null,null,{"$f":"INDEX(Calendrier!$CA$5:$CA$11,WEEKDAY(BD5,2))","v":"Lun"},{"$f":"+BD4+1","v":"2019-09-02"},null,null,null,null,{"$f":"INDEX(Calendrier!$CA$5:$CA$11,WEEKDAY(BJ5,2))","v":"Mer"},{"$f":"+BJ4+1","v":"2019-10-02"},null,null,null,null,{"$f":"INDEX(Calendrier!$CA$5:$CA$11,WEEKDAY(BP5,2))","v":"Sam"},{"$f":"+BP4+1","v":"2019-11-02"},null,null,null,null,{"$f":"INDEX(Calendrier!$CA$5:$CA$11,WEEKDAY(BV5,2))","v":"Lun"},{"$f":"+BV4+1","v":"2019-12-02"},null,null,null,null,"Lun"]
[{"$f":"INDEX(Calendrier!$CA$5:$CA$11,WEEKDAY(B6,2))","v":"Lun"},"2018-12-03",null,null,null,null,{"$f":"INDEX(Calendrier!$CA$5:$CA$11,WEEKDAY(H6,2))","v":"Jeu"},"2019-01-03",null,null,null,null,{"$f":"INDEX(Calendrier!$CA$5:$CA$11,WEEKDAY(N6,2))","v":"Dim"},"2019-02-03",null,null,null,null,{"$f":"INDEX(Calendrier!$CA$5:$CA$11,WEEKDAY(T6,2))","v":"Dim"},"2019-03-03",null,null,null,null,{"$f":"INDEX(Calendrier!$CA$5:$CA$11,WEEKDAY(Z6,2))","v":"Mer"},"2019-04-03",null,null,null,null,{"$f":"INDEX(Calendrier!$CA$5:$CA$11,WEEKDAY(AF6,2))","v":"Ven"},"2019-05-03",null,null,null,null,{"$f":"INDEX(Calendrier!$CA$5:$CA$11,WEEKDAY(AL6,2))","v":"Lun"},"2019-06-03",null,null,null,null,{"$f":"INDEX(Calendrier!$CA$5:$CA$11,WEEKDAY(AR6,2))","v":"Mer"},"2019-07-03",null,null,null,null,{"$f":"INDEX(Calendrier!$CA$5:$CA$11,WEEKDAY(AX6,2))","v":"Sam"},"2019-08-03",null,null,null,null,{"$f":"INDEX(Calendrier!$CA$5:$CA$11,WEEKDAY(BD6,2))","v":"Mar"},"2019-09-03",null,null,null,null,{"$f":"INDEX(Calendrier!$CA$5:$CA$11,WEEKDAY(BJ6,2))","v":"Jeu"},"2019-10-03",null,null,null,null,{"$f":"INDEX(Calendrier!$CA$5:$CA$11,WEEKDAY(BP6,2))","v":"Dim"},"2019-11-03",null,null,null,null,{"$f":"INDEX(Calendrier!$CA$5:$CA$11,WEEKDAY(BV6,2))","v":"Mar"},"2019-12-03",null,null,null,null,"Mar"]
[{"$f":"INDEX(Calendrier!$CA$5:$CA$11,WEEKDAY(B7,2))","v":"Mar"},"2018-12-04",null,null,null,null,{"$f":"INDEX(Calendrier!$CA$5:$CA$11,WEEKDAY(H7,2))","v":"Ven"},"2019-01-04",null,null,null,null,{"$f":"INDEX(Calendrier!$CA$5:$CA$11,WEEKDAY(N7,2))","v":"Lun"},"2019-02-04",null,null,null,null,{"$f":"INDEX(Calendrier!$CA$5:$CA$11,WEEKDAY(T7,2))","v":"Lun"},"2019-03-04",null,null,null,null,{"$f":"INDEX(Calendrier!$CA$5:$CA$11,WEEKDAY(Z7,2))","v":"Jeu"},"2019-04-04",null,null,null,null,{"$f":"INDEX(Calendrier!$CA$5:$CA$11,WEEKDAY(AF7,2))","v":"Sam"},"2019-05-04",null,null,null,null,{"$f":"INDEX(Calendrier!$CA$5:$CA$11,WEEKDAY(AL7,2))","v":"Mar"},"2019-06-04",null,null,null,null,{"$f":"INDEX(Calendrier!$CA$5:$CA$11,WEEKDAY(AR7,2))","v":"Jeu"},"2019-07-04",null,null,null,null,{"$f":"INDEX(Calendrier!$CA$5:$CA$11,WEEKDAY(AX7,2))","v":"Dim"},"2019-08-04",null,null,null,null,{"$f":"INDEX(Calendrier!$CA$5:$CA$11,WEEKDAY(BD7,2))","v":"Mer"},"2019-09-04",null,null,null,null,{"$f":"INDEX(Calendrier!$CA$5:$CA$11,WEEKDAY(BJ7,2))","v":"Ven"},"2019-10-04",null,null,null,null,{"$f":"INDEX(Calendrier!$CA$5:$CA$11,WEEKDAY(BP7,2))","v":"Lun"},"2019-11-04",null,null,null,null,{"$f":"INDEX(Calendrier!$CA$5:$CA$11,WEEKDAY(BV7,2))","v":"Mer"},"2019-12-04",null,null,null,null,"Mer"]
[{"$f":"INDEX(Calendrier!$CA$5:$CA$11,WEEKDAY(B8,2))","v":"Mer"},"2018-12-05",null,null,null,null,{"$f":"INDEX(Calendrier!$CA$5:$CA$11,WEEKDAY(H8,2))","v":"Sam"},"2019-01-05",null,null,null,null,{"$f":"INDEX(Calendrier!$CA$5:$CA$11,WEEKDAY(N8,2))","v":"Mar"},"2019-02-05",null,null,null,null,{"$f":"INDEX(Calendrier!$CA$5:$CA$11,WEEKDAY(T8,2))","v":"Mar"},"2019-03-05",null,null,null,null,{"$f":"INDEX(Calendrier!$CA$5:$CA$11,WEEKDAY(Z8,2))","v":"Ven"},"2019-04-05",null,null,null,null,{"$f":"INDEX(Calendrier!$CA$5:$CA$11,WEEKDAY(AF8,2))","v":"Dim"},"2019-05-05",null,null,null,null,{"$f":"INDEX(Calendrier!$CA$5:$CA$11,WEEKDAY(AL8,2))","v":"Mer"},"2019-06-05",null,null,null,null,{"$f":"INDEX(Calendrier!$CA$5:$CA$11,WEEKDAY(AR8,2))","v":"Ven"},"2019-07-05",null,null,null,null,{"$f":"INDEX(Calendrier!$CA$5:$CA$11,WEEKDAY(AX8,2))","v":"Lun"},"2019-08-05",null,null,null,null,{"$f":"INDEX(Calendrier!$CA$5:$CA$11,WEEKDAY(BD8,2))","v":"Jeu"},"2019-09-05",null,null,null,null,{"$f":"INDEX(Calendrier!$CA$5:$CA$11,WEEKDAY(BJ8,2))","v":"Sam"},"2019-10-05",null,null,null,null,{"$f":"INDEX(Calendrier!$CA$5:$CA$11,WEEKDAY(BP8,2))","v":"Mar"},"2019-11-05",null,null,null,null,{"$f":"INDEX(Calendrier!$CA$5:$CA$11,WEEKDAY(BV8,2))","v":"Jeu"},"2019-12-05",null,null,null,null,"Jeu"]
[{"$f":"INDEX(Calendrier!$CA$5:$CA$11,WEEKDAY(B9,2))","v":"Jeu"},"2018-12-06",null,null,null,null,{"$f":"INDEX(Calendrier!$CA$5:$CA$11,WEEKDAY(H9,2))","v":"Dim"},"2019-01-06",null,null,null,null,{"$f":"INDEX(Calendrier!$CA$5:$CA$11,WEEKDAY(N9,2))","v":"Mer"},"2019-02-06",null,null,null,null,{"$f":"INDEX(Calendrier!$CA$5:$CA$11,WEEKDAY(T9,2))","v":"Mer"},"2019-03-06",null,null,null,null,{"$f":"INDEX(Calendrier!$CA$5:$CA$11,WEEKDAY(Z9,2))","v":"Sam"},"2019-04-06",null,null,null,null,{"$f":"INDEX(Calendrier!$CA$5:$CA$11,WEEKDAY(AF9,2))","v":"Lun"},"2019-05-06",null,null,null,null,{"$f":"INDEX(Calendrier!$CA$5:$CA$11,WEEKDAY(AL9,2))","v":"Jeu"},"2019-06-06",null,null,null,null,{"$f":"INDEX(Calendrier!$CA$5:$CA$11,WEEKDAY(AR9,2))","v":"Sam"},"2019-07-06",null,null,null,null,{"$f":"INDEX(Calendrier!$CA$5:$CA$11,WEEKDAY(AX9,2))","v":"Mar"},"2019-08-06",null,null,null,null,{"$f":"INDEX(Calendrier!$CA$5:$CA$11,WEEKDAY(BD9,2))","v":"Ven"},"2019-09-06",null,null,null,null,{"$f":"INDEX(Calendrier!$CA$5:$CA$11,WEEKDAY(BJ9,2))","v":"Dim"},"2019-10-06",null,null,null,null,{"$f":"INDEX(Calendrier!$CA$5:$CA$11,WEEKDAY(BP9,2))","v":"Mer"},"2019-11-06",null,null,null,null,{"$f":"INDEX(Calendrier!$CA$5:$CA$11,WEEKDAY(BV9,2))","v":"Ven"},"2019-12-06",null,null,null,null,"Ven"]
[{"$f":"INDEX(Calendrier!$CA$5:$CA$11,WEEKDAY(B10,2))","v":"Ven"},"2018-12-07",null,null,null,null,{"$f":"INDEX(Calendrier!$CA$5:$CA$11,WEEKDAY(H10,2))","v":"Lun"},"2019-01-07",null,null,null,null,{"$f":"INDEX(Calendrier!$CA$5:$CA$11,WEEKDAY(N10,2))","v":"Jeu"},"2019-02-07",null,null,null,null,{"$f":"INDEX(Calendrier!$CA$5:$CA$11,WEEKDAY(T10,2))","v":"Jeu"},"2019-03-07",null,null,null,null,{"$f":"INDEX(Calendrier!$CA$5:$CA$11,WEEKDAY(Z10,2))","v":"Dim"},"2019-04-07",null,null,null,null,{"$f":"INDEX(Calendrier!$CA$5:$CA$11,WEEKDAY(AF10,2))","v":"Mar"},"2019-05-07",null,null,null,null,{"$f":"INDEX(Calendrier!$CA$5:$CA$11,WEEKDAY(AL10,2))","v":"Ven"},"2019-06-07",null,null,null,null,{"$f":"INDEX(Calendrier!$CA$5:$CA$11,WEEKDAY(AR10,2))","v":"Dim"},"2019-07-07",null,null,null,null,{"$f":"INDEX(Calendrier!$CA$5:$CA$11,WEEKDAY(AX10,2))","v":"Mer"},"2019-08-07",null,null,null,null,{"$f":"INDEX(Calendrier!$CA$5:$CA$11,WEEKDAY(BD10,2))","v":"Sam"},"2019-09-07",null,null,null,null,{"$f":"INDEX(Calendrier!$CA$5:$CA$11,WEEKDAY(BJ10,2))","v":"Lun"},"2019-10-07",null,null,null,null,{"$f":"INDEX(Calendrier!$CA$5:$CA$11,WEEKDAY(BP10,2))","v":"Jeu"},"2019-11-07",null,null,null,null,{"$f":"INDEX(Calendrier!$CA$5:$CA$11,WEEKDAY(BV10,2))","v":"Sam"},"2019-12-07",null,null,null,null,"Sam"]
[{"$f":"INDEX(Calendrier!$CA$5:$CA$11,WEEKDAY(B11,2))","v":"Sam"},"2018-12-08",null,null,null,null,{"$f":"INDEX(Calendrier!$CA$5:$CA$11,WEEKDAY(H11,2))","v":"Mar"},"2019-01-08",null,null,null,null,{"$f":"INDEX(Calendrier!$CA$5:$CA$11,WEEKDAY(N11,2))","v":"Ven"},"2019-02-08",null,null,null,null,{"$f":"INDEX(Calendrier!$CA$5:$CA$11,WEEKDAY(T11,2))","v":"Ven"},"2019-03-08",null,null,null,null,{"$f":"INDEX(Calendrier!$CA$5:$CA$11,WEEKDAY(Z11,2))","v":"Lun"},"2019-04-08",null,null,null,null,{"$f":"INDEX(Calendrier!$CA$5:$CA$11,WEEKDAY(AF11,2))","v":"Mer"},"2019-05-08",null,null,null,null,{"$f":"INDEX(Calendrier!$CA$5:$CA$11,WEEKDAY(AL11,2))","v":"Sam"},"2019-06-08",null,null,null,null,{"$f":"INDEX(Calendrier!$CA$5:$CA$11,WEEKDAY(AR11,2))","v":"Lun"},"2019-07-08",null,null,null,null,{"$f":"INDEX(Calendrier!$CA$5:$CA$11,WEEKDAY(AX11,2))","v":"Jeu"},"2019-08-08",null,null,null,null,{"$f":"INDEX(Calendrier!$CA$5:$CA$11,WEEKDAY(BD11,2))","v":"Dim"},"2019-09-08",null,null,null,null,{"$f":"INDEX(Calendrier!$CA$5:$CA$11,WEEKDAY(BJ11,2))","v":"Mar"},"2019-10-08",null,null,null,null,{"$f":"INDEX(Calendrier!$CA$5:$CA$11,WEEKDAY(BP11,2))","v":"Ven"},"2019-11-08",null,null,null,null,{"$f":"INDEX(Calendrier!$CA$5:$CA$11,WEEKDAY(BV11,2))","v":"Dim"},"2019-12-08",null,null,null,null,"Dim"]
[{"$f":"INDEX(Calendrier!$CA$5:$CA$11,WEEKDAY(B12,2))","v":"Dim"},"2018-12-09",null,null,null,null,{"$f":"INDEX(Calendrier!$CA$5:$CA$11,WEEKDAY(H12,2))","v":"Mer"},"2019-01-09",null,null,null,null,{"$f":"INDEX(Calendrier!$CA$5:$CA$11,WEEKDAY(N12,2))","v":"Sam"},"2019-02-09",null,null,null,null,{"$f":"INDEX(Calendrier!$CA$5:$CA$11,WEEKDAY(T12,2))","v":"Sam"},"2019-03-09",null,null,null,null,{"$f":"INDEX(Calendrier!$CA$5:$CA$11,WEEKDAY(Z12,2))","v":"Mar"},"2019-04-09",null,null,null,null,{"$f":"INDEX(Calendrier!$CA$5:$CA$11,WEEKDAY(AF12,2))","v":"Jeu"},"2019-05-09",null,null,null,null,{"$f":"INDEX(Calendrier!$CA$5:$CA$11,WEEKDAY(AL12,2))","v":"Dim"},"2019-06-09",null,null,null,null,{"$f":"INDEX(Calendrier!$CA$5:$CA$11,WEEKDAY(AR12,2))","v":"Mar"},"2019-07-09",null,null,null,null,{"$f":"INDEX(Calendrier!$CA$5:$CA$11,WEEKDAY(AX12,2))","v":"Ven"},"2019-08-09",null,null,null,null,{"$f":"INDEX(Calendrier!$CA$5:$CA$11,WEEKDAY(BD12,2))","v":"Lun"},"2019-09-09",null,null,null,null,{"$f":"INDEX(Calendrier!$CA$5:$CA$11,WEEKDAY(BJ12,2))","v":"Mer"},"2019-10-09",null,null,null,null,{"$f":"INDEX(Calendrier!$CA$5:$CA$11,WEEKDAY(BP12,2))","v":"Sam"},"2019-11-09",null,null,null,null,{"$f":"INDEX(Calendrier!$CA$5:$CA$11,WEEKDAY(BV12,2))","v":"Lun"},"2019-12-09"]
[{"$f":"INDEX(Calendrier!$CA$5:$CA$11,WEEKDAY(B13,2))","v":"Lun"},"2018-12-10",null,null,null,null,{"$f":"INDEX(Calendrier!$CA$5:$CA$11,WEEKDAY(H13,2))","v":"Jeu"},"2019-01-10",null,null,null,null,{"$f":"INDEX(Calendrier!$CA$5:$CA$11,WEEKDAY(N13,2))","v":"Dim"},"2019-02-10",null,null,null,null,{"$f":"INDEX(Calendrier!$CA$5:$CA$11,WEEKDAY(T13,2))","v":"Dim"},"2019-03-10",null,null,null,null,{"$f":"INDEX(Calendrier!$CA$5:$CA$11,WEEKDAY(Z13,2))","v":"Mer"},"2019-04-10",null,null,null,null,{"$f":"INDEX(Calendrier!$CA$5:$CA$11,WEEKDAY(AF13,2))","v":"Ven"},"2019-05-10",null,null,null,null,{"$f":"INDEX(Calendrier!$CA$5:$CA$11,WEEKDAY(AL13,2))","v":"Lun"},"2019-06-10",null,null,null,null,{"$f":"INDEX(Calendrier!$CA$5:$CA$11,WEEKDAY(AR13,2))","v":"Mer"},"2019-07-10",null,null,null,null,{"$f":"INDEX(Calendrier!$CA$5:$CA$11,WEEKDAY(AX13,2))","v":"Sam"},"2019-08-10",null,null,null,null,{"$f":"INDEX(Calendrier!$CA$5:$CA$11,WEEKDAY(BD13,2))","v":"Mar"},"2019-09-10",null,null,null,null,{"$f":"INDEX(Calendrier!$CA$5:$CA$11,WEEKDAY(BJ13,2))","v":"Jeu"},"2019-10-10",null,null,null,null,{"$f":"INDEX(Calendrier!$CA$5:$CA$11,WEEKDAY(BP13,2))","v":"Dim"},"2019-11-10",null,null,null,null,{"$f":"INDEX(Calendrier!$CA$5:$CA$11,WEEKDAY(BV13,2))","v":"Mar"},"2019-12-10"]
[{"$f":"INDEX(Calendrier!$CA$5:$CA$11,WEEKDAY(B14,2))","v":"Mar"},"2018-12-11",null,null,null,null,{"$f":"INDEX(Calendrier!$CA$5:$CA$11,WEEKDAY(H14,2))","v":"Ven"},"2019-01-11",null,null,null,null,{"$f":"INDEX(Calendrier!$CA$5:$CA$11,WEEKDAY(N14,2))","v":"Lun"},"2019-02-11",null,null,null,null,{"$f":"INDEX(Calendrier!$CA$5:$CA$11,WEEKDAY(T14,2))","v":"Lun"},"2019-03-11",null,null,null,null,{"$f":"INDEX(Calendrier!$CA$5:$CA$11,WEEKDAY(Z14,2))","v":"Jeu"},"2019-04-11",null,null,null,null,{"$f":"INDEX(Calendrier!$CA$5:$CA$11,WEEKDAY(AF14,2))","v":"Sam"},"2019-05-11",null,null,null,null,{"$f":"INDEX(Calendrier!$CA$5:$CA$11,WEEKDAY(AL14,2))","v":"Mar"},"2019-06-11",null,null,null,null,{"$f":"INDEX(Calendrier!$CA$5:$CA$11,WEEKDAY(AR14,2))","v":"Jeu"},"2019-07-11",null,null,null,null,{"$f":"INDEX(Calendrier!$CA$5:$CA$11,WEEKDAY(AX14,2))","v":"Dim"},"2019-08-11",null,null,null,null,{"$f":"INDEX(Calendrier!$CA$5:$CA$11,WEEKDAY(BD14,2))","v":"Mer"},"2019-09-11",null,null,null,null,{"$f":"INDEX(Calendrier!$CA$5:$CA$11,WEEKDAY(BJ14,2))","v":"Ven"},"2019-10-11",null,null,null,null,{"$f":"INDEX(Calendrier!$CA$5:$CA$11,WEEKDAY(BP14,2))","v":"Lun"},"2019-11-11",null,null,null,null,{"$f":"INDEX(Calendrier!$CA$5:$CA$11,WEEKDAY(BV14,2))","v":"Mer"},"2019-12-11",null,null,null,null,"Roulement"]
[{"$f":"INDEX(Calendrier!$CA$5:$CA$11,WEEKDAY(B15,2))","v":"Mer"},"2018-12-12",null,null,null,null,{"$f":"INDEX(Calendrier!$CA$5:$CA$11,WEEKDAY(H15,2))","v":"Sam"},"2019-01-12",null,null,null,null,{"$f":"INDEX(Calendrier!$CA$5:$CA$11,WEEKDAY(N15,2))","v":"Mar"},"2019-02-12",null,null,null,null,{"$f":"INDEX(Calendrier!$CA$5:$CA$11,WEEKDAY(T15,2))","v":"Mar"},"2019-03-12",null,null,null,null,{"$f":"INDEX(Calendrier!$CA$5:$CA$11,WEEKDAY(Z15,2))","v":"Ven"},"2019-04-12",null,null,null,null,{"$f":"INDEX(Calendrier!$CA$5:$CA$11,WEEKDAY(AF15,2))","v":"Dim"},"2019-05-12",null,null,null,null,{"$f":"INDEX(Calendrier!$CA$5:$CA$11,WEEKDAY(AL15,2))","v":"Mer"},"2019-06-12",null,null,null,null,{"$f":"INDEX(Calendrier!$CA$5:$CA$11,WEEKDAY(AR15,2))","v":"Ven"},"2019-07-12",null,null,null,null,{"$f":"INDEX(Calendrier!$CA$5:$CA$11,WEEKDAY(AX15,2))","v":"Lun"},"2019-08-12",null,null,null,null,{"$f":"INDEX(Calendrier!$CA$5:$CA$11,WEEKDAY(BD15,2))","v":"Jeu"},"2019-09-12",null,null,null,null,{"$f":"INDEX(Calendrier!$CA$5:$CA$11,WEEKDAY(BJ15,2))","v":"Sam"},"2019-10-12",null,null,null,null,{"$f":"INDEX(Calendrier!$CA$5:$CA$11,WEEKDAY(BP15,2))","v":"Mar"},"2019-11-12",null,null,null,null,{"$f":"INDEX(Calendrier!$CA$5:$CA$11,WEEKDAY(BV15,2))","v":"Jeu"},"2019-12-12",null,null,null,null,"2matin4apresmidi"]
[{"$f":"INDEX(Calendrier!$CA$5:$CA$11,WEEKDAY(B16,2))","v":"Jeu"},"2018-12-13",null,null,null,null,{"$f":"INDEX(Calendrier!$CA$5:$CA$11,WEEKDAY(H16,2))","v":"Dim"},"2019-01-13",null,null,null,null,{"$f":"INDEX(Calendrier!$CA$5:$CA$11,WEEKDAY(N16,2))","v":"Mer"},"2019-02-13",null,null,null,null,{"$f":"INDEX(Calendrier!$CA$5:$CA$11,WEEKDAY(T16,2))","v":"Mer"},"2019-03-13",null,null,null,null,{"$f":"INDEX(Calendrier!$CA$5:$CA$11,WEEKDAY(Z16,2))","v":"Sam"},"2019-04-13",null,null,null,null,{"$f":"INDEX(Calendrier!$CA$5:$CA$11,WEEKDAY(AF16,2))","v":"Lun"},"2019-05-13",null,null,null,null,{"$f":"INDEX(Calendrier!$CA$5:$CA$11,WEEKDAY(AL16,2))","v":"Jeu"},"2019-06-13",null,null,null,null,{"$f":"INDEX(Calendrier!$CA$5:$CA$11,WEEKDAY(AR16,2))","v":"Sam"},"2019-07-13",null,null,null,null,{"$f":"INDEX(Calendrier!$CA$5:$CA$11,WEEKDAY(AX16,2))","v":"Mar"},"2019-08-13",null,null,null,null,{"$f":"INDEX(Calendrier!$CA$5:$CA$11,WEEKDAY(BD16,2))","v":"Ven"},"2019-09-13",null,null,null,null,{"$f":"INDEX(Calendrier!$CA$5:$CA$11,WEEKDAY(BJ16,2))","v":"Dim"},"2019-10-13",null,null,null,null,{"$f":"INDEX(Calendrier!$CA$5:$CA$11,WEEKDAY(BP16,2))","v":"Mer"},"2019-11-13",null,null,null,null,{"$f":"INDEX(Calendrier!$CA$5:$CA$11,WEEKDAY(BV16,2))","v":"Ven"},"2019-12-13"]
[{"$f":"INDEX(Calendrier!$CA$5:$CA$11,WEEKDAY(B17,2))","v":"Ven"},"2018-12-14",null,null,null,null,{"$f":"INDEX(Calendrier!$CA$5:$CA$11,WEEKDAY(H17,2))","v":"Lun"},"2019-01-14",null,null,null,null,{"$f":"INDEX(Calendrier!$CA$5:$CA$11,WEEKDAY(N17,2))","v":"Jeu"},"2019-02-14",null,null,null,null,{"$f":"INDEX(Calendrier!$CA$5:$CA$11,WEEKDAY(T17,2))","v":"Jeu"},"2019-03-14",null,null,null,null,{"$f":"INDEX(Calendrier!$CA$5:$CA$11,WEEKDAY(Z17,2))","v":"Dim"},"2019-04-14",null,null,null,null,{"$f":"INDEX(Calendrier!$CA$5:$CA$11,WEEKDAY(AF17,2))","v":"Mar"},"2019-05-14",null,null,null,null,{"$f":"INDEX(Calendrier!$CA$5:$CA$11,WEEKDAY(AL17,2))","v":"Ven"},"2019-06-14",null,null,null,null,{"$f":"INDEX(Calendrier!$CA$5:$CA$11,WEEKDAY(AR17,2))","v":"Dim"},"2019-07-14",null,null,null,null,{"$f":"INDEX(Calendrier!$CA$5:$CA$11,WEEKDAY(AX17,2))","v":"Mer"},"2019-08-14",null,null,null,null,{"$f":"INDEX(Calendrier!$CA$5:$CA$11,WEEKDAY(BD17,2))","v":"Sam"},"2019-09-14",null,null,null,null,{"$f":"INDEX(Calendrier!$CA$5:$CA$11,WEEKDAY(BJ17,2))","v":"Lun"},"2019-10-14",null,null,null,null,{"$f":"INDEX(Calendrier!$CA$5:$CA$11,WEEKDAY(BP17,2))","v":"Jeu"},"2019-11-14",null,null,null,null,{"$f":"INDEX(Calendrier!$CA$5:$CA$11,WEEKDAY(BV17,2))","v":"Sam"},"2019-12-14"]
[{"$f":"INDEX(Calendrier!$CA$5:$CA$11,WEEKDAY(B18,2))","v":"Sam"},"2018-12-15",null,null,null,null,{"$f":"INDEX(Calendrier!$CA$5:$CA$11,WEEKDAY(H18,2))","v":"Mar"},"2019-01-15",null,null,null,null,{"$f":"INDEX(Calendrier!$CA$5:$CA$11,WEEKDAY(N18,2))","v":"Ven"},"2019-02-15",null,null,null,null,{"$f":"INDEX(Calendrier!$CA$5:$CA$11,WEEKDAY(T18,2))","v":"Ven"},"2019-03-15",null,null,null,null,{"$f":"INDEX(Calendrier!$CA$5:$CA$11,WEEKDAY(Z18,2))","v":"Lun"},"2019-04-15",null,null,null,null,{"$f":"INDEX(Calendrier!$CA$5:$CA$11,WEEKDAY(AF18,2))","v":"Mer"},"2019-05-15",null,null,null,null,{"$f":"INDEX(Calendrier!$CA$5:$CA$11,WEEKDAY(AL18,2))","v":"Sam"},"2019-06-15",null,null,null,null,{"$f":"INDEX(Calendrier!$CA$5:$CA$11,WEEKDAY(AR18,2))","v":"Lun"},"2019-07-15",null,null,null,null,{"$f":"INDEX(Calendrier!$CA$5:$CA$11,WEEKDAY(AX18,2))","v":"Jeu"},"2019-08-15",null,null,null,null,{"$f":"INDEX(Calendrier!$CA$5:$CA$11,WEEKDAY(BD18,2))","v":"Dim"},"2019-09-15",null,null,null,null,{"$f":"INDEX(Calendrier!$CA$5:$CA$11,WEEKDAY(BJ18,2))","v":"Mar"},"2019-10-15",null,null,null,null,{"$f":"INDEX(Calendrier!$CA$5:$CA$11,WEEKDAY(BP18,2))","v":"Ven"},"2019-11-15",null,null,null,null,{"$f":"INDEX(Calendrier!$CA$5:$CA$11,WEEKDAY(BV18,2))","v":"Dim"},"2019-12-15"]
[{"$f":"INDEX(Calendrier!$CA$5:$CA$11,WEEKDAY(B19,2))","v":"Dim"},"2018-12-16",null,null,null,null,{"$f":"INDEX(Calendrier!$CA$5:$CA$11,WEEKDAY(H19,2))","v":"Mer"},"2019-01-16",null,null,null,null,{"$f":"INDEX(Calendrier!$CA$5:$CA$11,WEEKDAY(N19,2))","v":"Sam"},"2019-02-16",null,null,null,null,{"$f":"INDEX(Calendrier!$CA$5:$CA$11,WEEKDAY(T19,2))","v":"Sam"},"2019-03-16",null,null,null,null,{"$f":"INDEX(Calendrier!$CA$5:$CA$11,WEEKDAY(Z19,2))","v":"Mar"},"2019-04-16",null,null,null,null,{"$f":"INDEX(Calendrier!$CA$5:$CA$11,WEEKDAY(AF19,2))","v":"Jeu"},"2019-05-16",null,null,null,null,{"$f":"INDEX(Calendrier!$CA$5:$CA$11,WEEKDAY(AL19,2))","v":"Dim"},"2019-06-16",null,null,null,null,{"$f":"INDEX(Calendrier!$CA$5:$CA$11,WEEKDAY(AR19,2))","v":"Mar"},"2019-07-16",null,null,null,null,{"$f":"INDEX(Calendrier!$CA$5:$CA$11,WEEKDAY(AX19,2))","v":"Ven"},"2019-08-16",null,null,null,null,{"$f":"INDEX(Calendrier!$CA$5:$CA$11,WEEKDAY(BD19,2))","v":"Lun"},"2019-09-16",null,null,null,null,{"$f":"INDEX(Calendrier!$CA$5:$CA$11,WEEKDAY(BJ19,2))","v":"Mer"},"2019-10-16",null,null,null,null,{"$f":"INDEX(Calendrier!$CA$5:$CA$11,WEEKDAY(BP19,2))","v":"Sam"},"2019-11-16",null,null,null,null,{"$f":"INDEX(Calendrier!$CA$5:$CA$11,WEEKDAY(BV19,2))","v":"Lun"},"2019-12-16"]
[{"$f":"INDEX(Calendrier!$CA$5:$CA$11,WEEKDAY(B20,2))","v":"Lun"},"2018-12-17",null,null,null,null,{"$f":"INDEX(Calendrier!$CA$5:$CA$11,WEEKDAY(H20,2))","v":"Jeu"},"2019-01-17",null,null,null,null,{"$f":"INDEX(Calendrier!$CA$5:$CA$11,WEEKDAY(N20,2))","v":"Dim"},"2019-02-17",null,null,null,null,{"$f":"INDEX(Calendrier!$CA$5:$CA$11,WEEKDAY(T20,2))","v":"Dim"},"2019-03-17",null,null,null,null,{"$f":"INDEX(Calendrier!$CA$5:$CA$11,WEEKDAY(Z20,2))","v":"Mer"},"2019-04-17",null,null,null,null,{"$f":"INDEX(Calendrier!$CA$5:$CA$11,WEEKDAY(AF20,2))","v":"Ven"},"2019-05-17",null,null,null,null,{"$f":"INDEX(Calendrier!$CA$5:$CA$11,WEEKDAY(AL20,2))","v":"Lun"},"2019-06-17",null,null,null,null,{"$f":"INDEX(Calendrier!$CA$5:$CA$11,WEEKDAY(AR20,2))","v":"Mer"},"2019-07-17",null,null,null,null,{"$f":"INDEX(Calendrier!$CA$5:$CA$11,WEEKDAY(AX20,2))","v":"Sam"},"2019-08-17",null,null,null,null,{"$f":"INDEX(Calendrier!$CA$5:$CA$11,WEEKDAY(BD20,2))","v":"Mar"},"2019-09-17",null,null,null,null,{"$f":"INDEX(Calendrier!$CA$5:$CA$11,WEEKDAY(BJ20,2))","v":"Jeu"},"2019-10-17",null,null,null,null,{"$f":"INDEX(Calendrier!$CA$5:$CA$11,WEEKDAY(BP20,2))","v":"Dim"},"2019-11-17",null,null,null,null,{"$f":"INDEX(Calendrier!$CA$5:$CA$11,WEEKDAY(BV20,2))","v":"Mar"},"2019-12-17"]
[{"$f":"INDEX(Calendrier!$CA$5:$CA$11,WEEKDAY(B21,2))","v":"Mar"},"2018-12-18",null,null,null,null,{"$f":"INDEX(Calendrier!$CA$5:$CA$11,WEEKDAY(H21,2))","v":"Ven"},"2019-01-18",null,null,null,null,{"$f":"INDEX(Calendrier!$CA$5:$CA$11,WEEKDAY(N21,2))","v":"Lun"},"2019-02-18",null,null,null,null,{"$f":"INDEX(Calendrier!$CA$5:$CA$11,WEEKDAY(T21,2))","v":"Lun"},"2019-03-18",null,null,null,null,{"$f":"INDEX(Calendrier!$CA$5:$CA$11,WEEKDAY(Z21,2))","v":"Jeu"},"2019-04-18",null,null,null,null,{"$f":"INDEX(Calendrier!$CA$5:$CA$11,WEEKDAY(AF21,2))","v":"Sam"},"2019-05-18",null,null,null,null,{"$f":"INDEX(Calendrier!$CA$5:$CA$11,WEEKDAY(AL21,2))","v":"Mar"},"2019-06-18",null,null,null,null,{"$f":"INDEX(Calendrier!$CA$5:$CA$11,WEEKDAY(AR21,2))","v":"Jeu"},"2019-07-18",null,null,null,null,{"$f":"INDEX(Calendrier!$CA$5:$CA$11,WEEKDAY(AX21,2))","v":"Dim"},"2019-08-18",null,null,null,null,{"$f":"INDEX(Calendrier!$CA$5:$CA$11,WEEKDAY(BD21,2))","v":"Mer"},"2019-09-18",null,null,null,null,{"$f":"INDEX(Calendrier!$CA$5:$CA$11,WEEKDAY(BJ21,2))","v":"Ven"},"2019-10-18",null,null,null,null,{"$f":"INDEX(Calendrier!$CA$5:$CA$11,WEEKDAY(BP21,2))","v":"Lun"},"2019-11-18",null,null,null,null,{"$f":"INDEX(Calendrier!$CA$5:$CA$11,WEEKDAY(BV21,2))","v":"Mer"},"2019-12-18"]
[{"$f":"INDEX(Calendrier!$CA$5:$CA$11,WEEKDAY(B22,2))","v":"Mer"},"2018-12-19",null,null,null,null,{"$f":"INDEX(Calendrier!$CA$5:$CA$11,WEEKDAY(H22,2))","v":"Sam"},"2019-01-19",null,null,null,null,{"$f":"INDEX(Calendrier!$CA$5:$CA$11,WEEKDAY(N22,2))","v":"Mar"},"2019-02-19",null,null,null,null,{"$f":"INDEX(Calendrier!$CA$5:$CA$11,WEEKDAY(T22,2))","v":"Mar"},"2019-03-19",null,null,null,null,{"$f":"INDEX(Calendrier!$CA$5:$CA$11,WEEKDAY(Z22,2))","v":"Ven"},"2019-04-19",null,null,null,null,{"$f":"INDEX(Calendrier!$CA$5:$CA$11,WEEKDAY(AF22,2))","v":"Dim"},"2019-05-19",null,null,null,null,{"$f":"INDEX(Calendrier!$CA$5:$CA$11,WEEKDAY(AL22,2))","v":"Mer"},"2019-06-19",null,null,null,null,{"$f":"INDEX(Calendrier!$CA$5:$CA$11,WEEKDAY(AR22,2))","v":"Ven"},"2019-07-19",null,null,null,null,{"$f":"INDEX(Calendrier!$CA$5:$CA$11,WEEKDAY(AX22,2))","v":"Lun"},"2019-08-19",null,null,null,null,{"$f":"INDEX(Calendrier!$CA$5:$CA$11,WEEKDAY(BD22,2))","v":"Jeu"},"2019-09-19",null,null,null,null,{"$f":"INDEX(Calendrier!$CA$5:$CA$11,WEEKDAY(BJ22,2))","v":"Sam"},"2019-10-19",null,null,null,null,{"$f":"INDEX(Calendrier!$CA$5:$CA$11,WEEKDAY(BP22,2))","v":"Mar"},"2019-11-19",null,null,null,null,{"$f":"INDEX(Calendrier!$CA$5:$CA$11,WEEKDAY(BV22,2))","v":"Jeu"},"2019-12-19"]
[{"$f":"INDEX(Calendrier!$CA$5:$CA$11,WEEKDAY(B23,2))","v":"Jeu"},"2018-12-20",null,null,null,null,{"$f":"INDEX(Calendrier!$CA$5:$CA$11,WEEKDAY(H23,2))","v":"Dim"},"2019-01-20",null,null,null,null,{"$f":"INDEX(Calendrier!$CA$5:$CA$11,WEEKDAY(N23,2))","v":"Mer"},"2019-02-20",null,null,null,null,{"$f":"INDEX(Calendrier!$CA$5:$CA$11,WEEKDAY(T23,2))","v":"Mer"},"2019-03-20",null,null,null,null,{"$f":"INDEX(Calendrier!$CA$5:$CA$11,WEEKDAY(Z23,2))","v":"Sam"},"2019-04-20",null,null,null,null,{"$f":"INDEX(Calendrier!$CA$5:$CA$11,WEEKDAY(AF23,2))","v":"Lun"},"2019-05-20",null,null,null,null,{"$f":"INDEX(Calendrier!$CA$5:$CA$11,WEEKDAY(AL23,2))","v":"Jeu"},"2019-06-20",null,null,null,null,{"$f":"INDEX(Calendrier!$CA$5:$CA$11,WEEKDAY(AR23,2))","v":"Sam"},"2019-07-20",null,null,null,null,{"$f":"INDEX(Calendrier!$CA$5:$CA$11,WEEKDAY(AX23,2))","v":"Mar"},"2019-08-20",null,null,null,null,{"$f":"INDEX(Calendrier!$CA$5:$CA$11,WEEKDAY(BD23,2))","v":"Ven"},"2019-09-20",null,null,null,null,{"$f":"INDEX(Calendrier!$CA$5:$CA$11,WEEKDAY(BJ23,2))","v":"Dim"},"2019-10-20",null,null,null,null,{"$f":"INDEX(Calendrier!$CA$5:$CA$11,WEEKDAY(BP23,2))","v":"Mer"},"2019-11-20",null,null,null,null,{"$f":"INDEX(Calendrier!$CA$5:$CA$11,WEEKDAY(BV23,2))","v":"Ven"},"2019-12-20"]
[{"$f":"INDEX(Calendrier!$CA$5:$CA$11,WEEKDAY(B24,2))","v":"Ven"},"2018-12-21",null,null,null,null,{"$f":"INDEX(Calendrier!$CA$5:$CA$11,WEEKDAY(H24,2))","v":"Lun"},"2019-01-21",null,null,null,null,{"$f":"INDEX(Calendrier!$CA$5:$CA$11,WEEKDAY(N24,2))","v":"Jeu"},"2019-02-21",null,null,null,null,{"$f":"INDEX(Calendrier!$CA$5:$CA$11,WEEKDAY(T24,2))","v":"Jeu"},"2019-03-21",null,null,null,null,{"$f":"INDEX(Calendrier!$CA$5:$CA$11,WEEKDAY(Z24,2))","v":"Dim"},"2019-04-21",null,null,null,null,{"$f":"INDEX(Calendrier!$CA$5:$CA$11,WEEKDAY(AF24,2))","v":"Mar"},"2019-05-21",null,null,null,null,{"$f":"INDEX(Calendrier!$CA$5:$CA$11,WEEKDAY(AL24,2))","v":"Ven"},"2019-06-21",null,null,null,null,{"$f":"INDEX(Calendrier!$CA$5:$CA$11,WEEKDAY(AR24,2))","v":"Dim"},"2019-07-21",null,null,null,null,{"$f":"INDEX(Calendrier!$CA$5:$CA$11,WEEKDAY(AX24,2))","v":"Mer"},"2019-08-21",null,null,null,null,{"$f":"INDEX(Calendrier!$CA$5:$CA$11,WEEKDAY(BD24,2))","v":"Sam"},"2019-09-21",null,null,null,null,{"$f":"INDEX(Calendrier!$CA$5:$CA$11,WEEKDAY(BJ24,2))","v":"Lun"},"2019-10-21",null,null,null,null,{"$f":"INDEX(Calendrier!$CA$5:$CA$11,WEEKDAY(BP24,2))","v":"Jeu"},"2019-11-21",null,null,null,null,{"$f":"INDEX(Calendrier!$CA$5:$CA$11,WEEKDAY(BV24,2))","v":"Sam"},"2019-12-21"]
[{"$f":"INDEX(Calendrier!$CA$5:$CA$11,WEEKDAY(B25,2))","v":"Sam"},"2018-12-22",null,null,null,null,{"$f":"INDEX(Calendrier!$CA$5:$CA$11,WEEKDAY(H25,2))","v":"Mar"},"2019-01-22",null,null,null,null,{"$f":"INDEX(Calendrier!$CA$5:$CA$11,WEEKDAY(N25,2))","v":"Ven"},"2019-02-22",null,null,null,null,{"$f":"INDEX(Calendrier!$CA$5:$CA$11,WEEKDAY(T25,2))","v":"Ven"},"2019-03-22",null,null,null,null,{"$f":"INDEX(Calendrier!$CA$5:$CA$11,WEEKDAY(Z25,2))","v":"Lun"},"2019-04-22",null,null,null,null,{"$f":"INDEX(Calendrier!$CA$5:$CA$11,WEEKDAY(AF25,2))","v":"Mer"},"2019-05-22",null,null,null,null,{"$f":"INDEX(Calendrier!$CA$5:$CA$11,WEEKDAY(AL25,2))","v":"Sam"},"2019-06-22",null,null,null,null,{"$f":"INDEX(Calendrier!$CA$5:$CA$11,WEEKDAY(AR25,2))","v":"Lun"},"2019-07-22",null,null,null,null,{"$f":"INDEX(Calendrier!$CA$5:$CA$11,WEEKDAY(AX25,2))","v":"Jeu"},"2019-08-22",null,null,null,null,{"$f":"INDEX(Calendrier!$CA$5:$CA$11,WEEKDAY(BD25,2))","v":"Dim"},"2019-09-22",null,null,null,null,{"$f":"INDEX(Calendrier!$CA$5:$CA$11,WEEKDAY(BJ25,2))","v":"Mar"},"2019-10-22",null,null,null,null,{"$f":"INDEX(Calendrier!$CA$5:$CA$11,WEEKDAY(BP25,2))","v":"Ven"},"2019-11-22",null,null,null,null,{"$f":"INDEX(Calendrier!$CA$5:$CA$11,WEEKDAY(BV25,2))","v":"Dim"},"2019-12-22"]
[{"$f":"INDEX(Calendrier!$CA$5:$CA$11,WEEKDAY(B26,2))","v":"Dim"},"2018-12-23",null,null,null,null,{"$f":"INDEX(Calendrier!$CA$5:$CA$11,WEEKDAY(H26,2))","v":"Mer"},"2019-01-23",null,null,null,null,{"$f":"INDEX(Calendrier!$CA$5:$CA$11,WEEKDAY(N26,2))","v":"Sam"},"2019-02-23",null,null,null,null,{"$f":"INDEX(Calendrier!$CA$5:$CA$11,WEEKDAY(T26,2))","v":"Sam"},"2019-03-23",null,null,null,null,{"$f":"INDEX(Calendrier!$CA$5:$CA$11,WEEKDAY(Z26,2))","v":"Mar"},"2019-04-23",null,null,null,null,{"$f":"INDEX(Calendrier!$CA$5:$CA$11,WEEKDAY(AF26,2))","v":"Jeu"},"2019-05-23",null,null,null,null,{"$f":"INDEX(Calendrier!$CA$5:$CA$11,WEEKDAY(AL26,2))","v":"Dim"},"2019-06-23",null,null,null,null,{"$f":"INDEX(Calendrier!$CA$5:$CA$11,WEEKDAY(AR26,2))","v":"Mar"},"2019-07-23",null,null,null,null,{"$f":"INDEX(Calendrier!$CA$5:$CA$11,WEEKDAY(AX26,2))","v":"Ven"},"2019-08-23",null,null,null,null,{"$f":"INDEX(Calendrier!$CA$5:$CA$11,WEEKDAY(BD26,2))","v":"Lun"},"2019-09-23",null,null,null,null,{"$f":"INDEX(Calendrier!$CA$5:$CA$11,WEEKDAY(BJ26,2))","v":"Mer"},"2019-10-23",null,null,null,null,{"$f":"INDEX(Calendrier!$CA$5:$CA$11,WEEKDAY(BP26,2))","v":"Sam"},"2019-11-23",null,null,null,null,{"$f":"INDEX(Calendrier!$CA$5:$CA$11,WEEKDAY(BV26,2))","v":"Lun"},"2019-12-23"]
[{"$f":"INDEX(Calendrier!$CA$5:$CA$11,WEEKDAY(B27,2))","v":"Lun"},"2018-12-24",null,null,null,null,{"$f":"INDEX(Calendrier!$CA$5:$CA$11,WEEKDAY(H27,2))","v":"Jeu"},"2019-01-24",null,null,null,null,{"$f":"INDEX(Calendrier!$CA$5:$CA$11,WEEKDAY(N27,2))","v":"Dim"},"2019-02-24",null,null,null,null,{"$f":"INDEX(Calendrier!$CA$5:$CA$11,WEEKDAY(T27,2))","v":"Dim"},"2019-03-24",null,null,null,null,{"$f":"INDEX(Calendrier!$CA$5:$CA$11,WEEKDAY(Z27,2))","v":"Mer"},"2019-04-24",null,null,null,null,{"$f":"INDEX(Calendrier!$CA$5:$CA$11,WEEKDAY(AF27,2))","v":"Ven"},"2019-05-24",null,null,null,null,{"$f":"INDEX(Calendrier!$CA$5:$CA$11,WEEKDAY(AL27,2))","v":"Lun"},"2019-06-24",null,null,null,null,{"$f":"INDEX(Calendrier!$CA$5:$CA$11,WEEKDAY(AR27,2))","v":"Mer"},"2019-07-24",null,null,null,null,{"$f":"INDEX(Calendrier!$CA$5:$CA$11,WEEKDAY(AX27,2))","v":"Sam"},"2019-08-24",null,null,null,null,{"$f":"INDEX(Calendrier!$CA$5:$CA$11,WEEKDAY(BD27,2))","v":"Mar"},"2019-09-24",null,null,null,null,{"$f":"INDEX(Calendrier!$CA$5:$CA$11,WEEKDAY(BJ27,2))","v":"Jeu"},"2019-10-24",null,null,null,null,{"$f":"INDEX(Calendrier!$CA$5:$CA$11,WEEKDAY(BP27,2))","v":"Dim"},"2019-11-24",null,null,null,null,{"$f":"INDEX(Calendrier!$CA$5:$CA$11,WEEKDAY(BV27,2))","v":"Mar"},"2019-12-24"]
[{"$f":"INDEX(Calendrier!$CA$5:$CA$11,WEEKDAY(B28,2))","v":"Mar"},"2018-12-25",null,null,null,null,{"$f":"INDEX(Calendrier!$CA$5:$CA$11,WEEKDAY(H28,2))","v":"Ven"},"2019-01-25",null,null,null,null,{"$f":"INDEX(Calendrier!$CA$5:$CA$11,WEEKDAY(N28,2))","v":"Lun"},"2019-02-25",null,null,null,null,{"$f":"INDEX(Calendrier!$CA$5:$CA$11,WEEKDAY(T28,2))","v":"Lun"},"2019-03-25",null,null,null,null,{"$f":"INDEX(Calendrier!$CA$5:$CA$11,WEEKDAY(Z28,2))","v":"Jeu"},"2019-04-25",null,null,null,null,{"$f":"INDEX(Calendrier!$CA$5:$CA$11,WEEKDAY(AF28,2))","v":"Sam"},"2019-05-25",null,null,null,null,{"$f":"INDEX(Calendrier!$CA$5:$CA$11,WEEKDAY(AL28,2))","v":"Mar"},"2019-06-25",null,null,null,null,{"$f":"INDEX(Calendrier!$CA$5:$CA$11,WEEKDAY(AR28,2))","v":"Jeu"},"2019-07-25",null,null,null,null,{"$f":"INDEX(Calendrier!$CA$5:$CA$11,WEEKDAY(AX28,2))","v":"Dim"},"2019-08-25",null,null,null,null,{"$f":"INDEX(Calendrier!$CA$5:$CA$11,WEEKDAY(BD28,2))","v":"Mer"},"2019-09-25",null,null,null,null,{"$f":"INDEX(Calendrier!$CA$5:$CA$11,WEEKDAY(BJ28,2))","v":"Ven"},"2019-10-25",null,null,null,null,{"$f":"INDEX(Calendrier!$CA$5:$CA$11,WEEKDAY(BP28,2))","v":"Lun"},"2019-11-25",null,null,null,null,{"$f":"INDEX(Calendrier!$CA$5:$CA$11,WEEKDAY(BV28,2))","v":"Mer"},"2019-12-25"]
[{"$f":"INDEX(Calendrier!$CA$5:$CA$11,WEEKDAY(B29,2))","v":"Mer"},"2018-12-26",null,null,null,null,{"$f":"INDEX(Calendrier!$CA$5:$CA$11,WEEKDAY(H29,2))","v":"Sam"},"2019-01-26",null,null,null,null,{"$f":"INDEX(Calendrier!$CA$5:$CA$11,WEEKDAY(N29,2))","v":"Mar"},"2019-02-26",null,null,null,null,{"$f":"INDEX(Calendrier!$CA$5:$CA$11,WEEKDAY(T29,2))","v":"Mar"},"2019-03-26",null,null,null,null,{"$f":"INDEX(Calendrier!$CA$5:$CA$11,WEEKDAY(Z29,2))","v":"Ven"},"2019-04-26",null,null,null,null,{"$f":"INDEX(Calendrier!$CA$5:$CA$11,WEEKDAY(AF29,2))","v":"Dim"},"2019-05-26",null,null,null,null,{"$f":"INDEX(Calendrier!$CA$5:$CA$11,WEEKDAY(AL29,2))","v":"Mer"},"2019-06-26",null,null,null,null,{"$f":"INDEX(Calendrier!$CA$5:$CA$11,WEEKDAY(AR29,2))","v":"Ven"},"2019-07-26",null,null,null,null,{"$f":"INDEX(Calendrier!$CA$5:$CA$11,WEEKDAY(AX29,2))","v":"Lun"},"2019-08-26",null,null,null,null,{"$f":"INDEX(Calendrier!$CA$5:$CA$11,WEEKDAY(BD29,2))","v":"Jeu"},"2019-09-26",null,null,null,null,{"$f":"INDEX(Calendrier!$CA$5:$CA$11,WEEKDAY(BJ29,2))","v":"Sam"},"2019-10-26",null,null,null,null,{"$f":"INDEX(Calendrier!$CA$5:$CA$11,WEEKDAY(BP29,2))","v":"Mar"},"2019-11-26",null,null,null,null,{"$f":"INDEX(Calendrier!$CA$5:$CA$11,WEEKDAY(BV29,2))","v":"Jeu"},"2019-12-26"]
[{"$f":"INDEX(Calendrier!$CA$5:$CA$11,WEEKDAY(B30,2))","v":"Jeu"},"2018-12-27",null,null,null,null,{"$f":"INDEX(Calendrier!$CA$5:$CA$11,WEEKDAY(H30,2))","v":"Dim"},"2019-01-27",null,null,null,null,{"$f":"INDEX(Calendrier!$CA$5:$CA$11,WEEKDAY(N30,2))","v":"Mer"},"2019-02-27",null,null,null,null,{"$f":"INDEX(Calendrier!$CA$5:$CA$11,WEEKDAY(T30,2))","v":"Mer"},"2019-03-27",null,null,null,null,{"$f":"INDEX(Calendrier!$CA$5:$CA$11,WEEKDAY(Z30,2))","v":"Sam"},"2019-04-27",null,null,null,null,{"$f":"INDEX(Calendrier!$CA$5:$CA$11,WEEKDAY(AF30,2))","v":"Lun"},"2019-05-27",null,null,null,null,{"$f":"INDEX(Calendrier!$CA$5:$CA$11,WEEKDAY(AL30,2))","v":"Jeu"},"2019-06-27",null,null,null,null,{"$f":"INDEX(Calendrier!$CA$5:$CA$11,WEEKDAY(AR30,2))","v":"Sam"},"2019-07-27",null,null,null,null,{"$f":"INDEX(Calendrier!$CA$5:$CA$11,WEEKDAY(AX30,2))","v":"Mar"},"2019-08-27",null,null,null,null,{"$f":"INDEX(Calendrier!$CA$5:$CA$11,WEEKDAY(BD30,2))","v":"Ven"},"2019-09-27",null,null,null,null,{"$f":"INDEX(Calendrier!$CA$5:$CA$11,WEEKDAY(BJ30,2))","v":"Dim"},"2019-10-27",null,null,null,null,{"$f":"INDEX(Calendrier!$CA$5:$CA$11,WEEKDAY(BP30,2))","v":"Mer"},"2019-11-27",null,null,null,null,{"$f":"INDEX(Calendrier!$CA$5:$CA$11,WEEKDAY(BV30,2))","v":"Ven"},"2019-12-27"]
[{"$f":"INDEX(Calendrier!$CA$5:$CA$11,WEEKDAY(B31,2))","v":"Ven"},"2018-12-28",null,null,null,null,{"$f":"INDEX(Calendrier!$CA$5:$CA$11,WEEKDAY(H31,2))","v":"Lun"},"2019-01-28",null,null,null,null,{"$f":"INDEX(Calendrier!$CA$5:$CA$11,WEEKDAY(N31,2))","v":"Jeu"},"2019-02-28",null,null,null,null,{"$f":"INDEX(Calendrier!$CA$5:$CA$11,WEEKDAY(T31,2))","v":"Jeu"},"2019-03-28",null,null,null,null,{"$f":"INDEX(Calendrier!$CA$5:$CA$11,WEEKDAY(Z31,2))","v":"Dim"},"2019-04-28",null,null,null,null,{"$f":"INDEX(Calendrier!$CA$5:$CA$11,WEEKDAY(AF31,2))","v":"Mar"},"2019-05-28",null,null,null,null,{"$f":"INDEX(Calendrier!$CA$5:$CA$11,WEEKDAY(AL31,2))","v":"Ven"},"2019-06-28",null,null,null,null,{"$f":"INDEX(Calendrier!$CA$5:$CA$11,WEEKDAY(AR31,2))","v":"Dim"},"2019-07-28",null,null,null,null,{"$f":"INDEX(Calendrier!$CA$5:$CA$11,WEEKDAY(AX31,2))","v":"Mer"},"2019-08-28",null,null,null,null,{"$f":"INDEX(Calendrier!$CA$5:$CA$11,WEEKDAY(BD31,2))","v":"Sam"},"2019-09-28",null,null,null,null,{"$f":"INDEX(Calendrier!$CA$5:$CA$11,WEEKDAY(BJ31,2))","v":"Lun"},"2019-10-28",null,null,null,null,{"$f":"INDEX(Calendrier!$CA$5:$CA$11,WEEKDAY(BP31,2))","v":"Jeu"},"2019-11-28",null,null,null,null,{"$f":"INDEX(Calendrier!$CA$5:$CA$11,WEEKDAY(BV31,2))","v":"Sam"},"2019-12-28"]
[{"$f":"INDEX(Calendrier!$CA$5:$CA$11,WEEKDAY(B32,2))","v":"Sam"},"2018-12-29",null,null,null,null,{"$f":"INDEX(Calendrier!$CA$5:$CA$11,WEEKDAY(H32,2))","v":"Mar"},"2019-01-29",null,null,null,null,{"$f":"IF(MOD(A1,100)<>0,IF(MOD(A1,4)=0,DATEVALUE(\"29/02/\" &A1),\"\"),\"\")","v":""},null,null,null,null,null,{"$f":"INDEX(Calendrier!$CA$5:$CA$11,WEEKDAY(T32,2))","v":"Ven"},"2019-03-29",null,null,null,null,{"$f":"INDEX(Calendrier!$CA$5:$CA$11,WEEKDAY(Z32,2))","v":"Lun"},"2019-04-29",null,null,null,null,{"$f":"INDEX(Calendrier!$CA$5:$CA$11,WEEKDAY(AF32,2))","v":"Mer"},"2019-05-29",null,null,null,null,{"$f":"INDEX(Calendrier!$CA$5:$CA$11,WEEKDAY(AL32,2))","v":"Sam"},"2019-06-29",null,null,null,null,{"$f":"INDEX(Calendrier!$CA$5:$CA$11,WEEKDAY(AR32,2))","v":"Lun"},"2019-07-29",null,null,null,null,{"$f":"INDEX(Calendrier!$CA$5:$CA$11,WEEKDAY(AX32,2))","v":"Jeu"},"2019-08-29",null,null,null,null,{"$f":"INDEX(Calendrier!$CA$5:$CA$11,WEEKDAY(BD32,2))","v":"Dim"},"2019-09-29",null,null,null,null,{"$f":"INDEX(Calendrier!$CA$5:$CA$11,WEEKDAY(BJ32,2))","v":"Mar"},"2019-10-29",null,null,null,null,{"$f":"INDEX(Calendrier!$CA$5:$CA$11,WEEKDAY(BP32,2))","v":"Ven"},"2019-11-29",null,null,null,null,{"$f":"INDEX(Calendrier!$CA$5:$CA$11,WEEKDAY(BV32,2))","v":"Dim"},"2019-12-29"]
[{"$f":"INDEX(Calendrier!$CA$5:$CA$11,WEEKDAY(B33,2))","v":"Dim"},"2018-12-30",null,null,null,null,{"$f":"INDEX(Calendrier!$CA$5:$CA$11,WEEKDAY(H33,2))","v":"Mer"},"2019-01-30",null,null,null,null,null,null,null,null,null,null,{"$f":"INDEX(Calendrier!$CA$5:$CA$11,WEEKDAY(T33,2))","v":"Sam"},"2019-03-30",null,null,null,null,{"$f":"INDEX(Calendrier!$CA$5:$CA$11,WEEKDAY(Z33,2))","v":"Mar"},"2019-04-30",null,null,null,null,{"$f":"INDEX(Calendrier!$CA$5:$CA$11,WEEKDAY(AF33,2))","v":"Jeu"},"2019-05-30",null,null,null,null,{"$f":"INDEX(Calendrier!$CA$5:$CA$11,WEEKDAY(AL33,2))","v":"Dim"},"2019-06-30",null,null,null,null,{"$f":"INDEX(Calendrier!$CA$5:$CA$11,WEEKDAY(AR33,2))","v":"Mar"},"2019-07-30",null,null,null,null,{"$f":"INDEX(Calendrier!$CA$5:$CA$11,WEEKDAY(AX33,2))","v":"Ven"},"2019-08-30",null,null,null,null,{"$f":"INDEX(Calendrier!$CA$5:$CA$11,WEEKDAY(BD33,2))","v":"Lun"},"2019-09-30",null,null,null,null,{"$f":"INDEX(Calendrier!$CA$5:$CA$11,WEEKDAY(BJ33,2))","v":"Mer"},"2019-10-30",null,null,null,null,{"$f":"INDEX(Calendrier!$CA$5:$CA$11,WEEKDAY(BP33,2))","v":"Sam"},"2019-11-30",null,null,null,null,{"$f":"INDEX(Calendrier!$CA$5:$CA$11,WEEKDAY(BV33,2))","v":"Lun"},"2019-12-30"]
[{"$f":"INDEX(Calendrier!$CA$5:$CA$11,WEEKDAY(B34,2))","v":"Lun"},"2018-12-31",null,null,null,null,{"$f":"INDEX(Calendrier!$CA$5:$CA$11,WEEKDAY(H34,2))","v":"Jeu"},"2019-01-31",null,null,null,null,null,null,null,null,null,null,{"$f":"INDEX(Calendrier!$CA$5:$CA$11,WEEKDAY(T34,2))","v":"Dim"},"2019-03-31",null,null,null,null,null,null,null,null,null,null,{"$f":"INDEX(Calendrier!$CA$5:$CA$11,WEEKDAY(AF34,2))","v":"Ven"},"2019-05-31",null,null,null,null,null,null,null,null,null,null,{"$f":"INDEX(Calendrier!$CA$5:$CA$11,WEEKDAY(AR34,2))","v":"Mer"},"2019-07-31",null,null,null,null,{"$f":"INDEX(Calendrier!$CA$5:$CA$11,WEEKDAY(AX34,2))","v":"Sam"},"2019-08-31",null,null,null,null,null,null,null,null,null,null,{"$f":"INDEX(Calendrier!$CA$5:$CA$11,WEEKDAY(BJ34,2))","v":"Jeu"},"2019-10-31",null,null,null,null,null,null,null,null,null,null,{"$f":"INDEX(Calendrier!$CA$5:$CA$11,WEEKDAY(BV34,2))","v":"Mar"},"2019-12-31"]

{"sheet":"Paramètres","index":1,"n_rows":24,"n_cols":7,"rows_kept":24,"cut":false,"hidden":false,"merged":[[1,0,1,1],[1,4,1,6],[15,0,15,2],[15,4,15,5],[16,0,17,0],[16,4,17,4],[16,5,17,5],[18,5,19,5],[20,0,21,0],[21,4,22,4],[21,5,22,5],[22,0,23,0],[18,0,19,0],[18,4,19,4],[36,0,37,0],[38,0,39,0],[24,0,25,0],[26,0,27,0],[28,0,29,0],[30,0,31,0],[32,0,33,0],[34,0,35,0]]}
[2019]
["Fériés"]
[{"$f":"DATE(A1,1,1)","v":"2019-01-01"},"Nouvel An"]
[{"$f":"ROUND(DATE(A1,4,MOD(234-11*MOD(A1,19),30))/7,)*7-6","v":"2019-04-21"},"Dimanche de Pâques"]
[{"$f":"A4+1","v":"2019-04-22"},"Lundi de Pâques"]
[{"$f":"DATE(A1,5,1)","v":"2019-05-01"},"Fête du travail"]
[{"$f":"DATE(A1,5,8)","v":"2019-05-08"},"Victoire 1945"]
[{"$f":"A4+39","v":"2019-05-30"},"Ascension"]
[{"$f":"A4+50","v":"2019-06-10"},"Lundi de Pentecôte"]
[{"$f":"DATE(A1,7,14)","v":"2019-07-14"},"Fête nationale"]
[{"$f":"DATE(A1,8,15)","v":"2019-08-15"},"Assomption"]
[{"$f":"DATE(A1,11,1)","v":"2019-11-01"},"Toussaint"]
[{"$f":"DATE(A1,11,11)","v":"2019-11-11"},"Victoire 1918"]
[{"$f":"DATE(A1,12,25)","v":"2019-12-25"},"Noël"]
[]
[]
[]
[]
[]
[]
[]
[]
[]
[null,null,null,null,null,null,","]

{"sheet":"Feuil3","index":2,"n_rows":0,"n_cols":0,"rows_kept":0,"cut":false,"hidden":false,"merged":[]}