{"text_format":"1","workbook":"xlsx","n_sheets":5,"sheets":["Compétances","Tri ","Tri 2","ABS Chronos","Feuil1"],"not_rendered":{"charts":0,"images":0,"macros":1,"external_links":1,"defined_names":3,"comments":0,"pivot_tables":0},"unopened":[],"bounds":{"document_bytes":16777216,"sheet_cells":100000,"rows_first":2000,"rows_last":500,"rows_between":2000,"halvings":0,"cell_chars":16384,"cell_head_chars":4096},"cells_cut":0,"cells_raw":0,"read":"whole","date_system":"1900"}

{"sheet":"Compétances","index":0,"n_rows":251,"n_cols":6,"rows_kept":251,"cut":false,"hidden":false,"merged":[]}
[null,"Compétance",null,"A","Acquis "]
[]
[]
[]
[null,null,"Fraise","Chocolat","Pomme ","Poire "]
[null,"Eric","A",null,"A"]
[null,"Paul ",null,null,"A"]
["Supprimer","Michel","A","A","A","A"]
[null,"Jacques ",null,"A"]
[null,"Julien ","A","A"]
["Supprimer","Jean Mi","A","A","A","A"]
[null,"Eric","A",null,"A"]
[null,"Paul ",null,null,"A"]
[null,"Michel","A","A","A","A"]
["Supprimer","Jean Mi","A","A","A","A"]
[null,"Eric","A",null,"A"]
[null,"Paul ",null,null,"A"]
[null,"Michel","A","A","A","A"]
["Supprimer","Jacques ",null,"A"]
[null,"Jean Mi","A","A","A","A"]
[null,"Eric","A",null,"A"]
[null,"Paul ",null,null,"A"]
["Supprimer","Michel","A","A","A","A"]
[null,"Jacques ",null,"A"]
[null,"Jean Mi","A","A","A","A"]
[null,"Eric","A",null,"A"]
["Supprimer","Paul ",null,null,"A"]
[null,"Michel","A","A","A","A"]
[null,"Jacques ",null,"A"]
[null,"Jean Mi","A","A","A","A"]
["Supprimer","Eric","A",null,"A"]
[null,"Paul ",null,null,"A"]
[null,"Michel","A","A","A","A"]
[null,"Jacques ",null,"A"]
["Supprimer","Jean Mi","A","A","A","A"]
[null,"Eric","A",null,"A"]
[null,"Paul ",null,null,"A"]
[null,"Michel","A","A","A","A"]
["Supprimer","Jacques ",null,"A"]
[null,"Jean Mi","A","A","A","A"]
[null,"Eric","A",null,"A"]
[null,"Paul ",null,null,"A"]
["Supprimer","Michel","A","A","A","A"]
[null,"Jacques ",null,"A"]
[null,"Jean Mi","A","A","A","A"]
[null,"Eric","A",null,"A"]
["Supprimer","Paul ",null,null,"A"]
[null,"Michel","A","A","A","A"]
[null,"Jacques ",null,"A"]
[null,"Jean Mi","A","A","A","A"]
["Supprimer","Eric","A",null,"A"]
[null,"Paul ",null,null,"A"]
[null,"Michel","A","A","A","A"]
[null,"Jacques ",null,"A"]
["Supprimer","Jean Mi","A","A","A","A"]
[null,"Eric","A",null,"A"]
[null,"Paul ",null,null,"A"]
[null,"Michel","A","A","A","A"]
["Supprimer","Jacques ",null,"A"]
[null,"Jean Mi","A","A","A","A"]
[null,"Eric","A",null,"A"]
[null,"Paul ",null,null,"A"]
["Supprimer","Michel","A","A","A","A"]
[null,"Jacques ",null,"A"]
[null,"Jean Mi","A","A","A","A"]
[null,"Eric","A",null,"A"]
["Supprimer","Paul ",null,null,"A"]
[null,"Michel","A","A","A","A"]
[null,"Jacques ",null,"A"]
[null,"Jean Mi","A","A","A","A"]
["Supprimer","Eric","A",null,"A"]
[null,"Paul ",null,null,"A"]
[null,"Michel","A","A","A","A"]
[null,"Jacques ",null,"A"]
["Supprimer","Jean Mi","A","A","A","A"]
[null,"Eric","A",null,"A"]
[null,"Paul ",null,null,"A"]
[null,"Michel","A","A","A","A"]
["Supprimer","Jacques ",null,"A"]
[null,"Jean Mi","A","A","A","A"]
[null,"Eric","A",null,"A"]
[null,"Paul ",null,null,"A"]
["Supprimer","Michel","A","A","A","A"]
[null,"Jacques ",null,"A"]
[null,"Jean Mi","A","A","A","A"]
[null,"Eric","A",null,"A"]
["Supprimer","Paul ",null,null,"A"]
[null,"Michel","A","A","A","A"]
[null,"Jacques ",null,"A"]
[null,"Jean Mi","A","A","A","A"]
["Supprimer","Eric","A",null,"A"]
[null,"Paul ",null,null,"A"]
[null,"Michel","A","A","A","A"]
[null,"Jacques ",null,"A"]
["Supprimer","Jean Mi","A","A","A","A"]
[null,"Eric","A",null,"A"]
[null,"Paul ",null,null,"A"]
[null,"Michel","A","A","A","A"]
[null,"Jacques ",null,"A"]
[null,"Jean Mi","A","A","A","A"]
[null,"Eric","A",null,"A"]
[null,"Paul ",null,null,"A"]
[null,"Michel","A","A","A","A"]
[null,"Jacques ",null,"A"]
[null,"Jean Mi","A","A","A","A"]
[null,"Eric","A",null,"A"]
[null,"Paul ",null,null,"A"]
[null,"Michel","A","A","A","A"]
[null,"Jacques ",null,"A"]
[null,"Jean Mi","A","A","A","A"]
[null,"Eric","A",null,"A"]
[null,"Paul ",null,null,"A"]
[null,"Michel","A","A","A","A"]
[null,"Jacques ",null,"A"]
[null,"Jean Mi","A","A","A","A"]
[null,"Eric","A",null,"A"]
[null,"Paul ",null,null,"A"]
[null,"Michel","A","A","A","A"]
[null,"Jacques ",null,"A"]
[null,"Jean Mi","A","A","A","A"]
[null,"Eric","A",null,"A"]
[null,"Paul ",null,null,"A"]
[null,"Michel","A","A","A","A"]
[null,"Jacques ",null,"A"]
[null,"Jean Mi","A","A","A","A"]
[null,"Eric","A",null,"A"]
[null,"Paul ",null,null,"A"]
[null,"Michel","A","A","A","A"]
[null,"Jacques ",null,"A"]
[null,"Jean Mi","A","A","A","A"]
[null,"Eric","A",null,"A"]
[null,"Paul ",null,null,"A"]
[null,"Michel","A","A","A","A"]
[null,"Jacques ",null,"A"]
[null,"Jean Mi","A","A","A","A"]
[null,"Eric","A",null,"A"]
[null,"Paul ",null,null,"A"]
[null,"Michel","A","A","A","A"]
[null,"Jacques ",null,"A"]
[null,"Jean Mi","A","A","A","A"]
[null,"Eric","A",null,"A"]
[null,"Paul ",null,null,"A"]
[null,"Michel","A","A","A","A"]
[null,"Jacques ",null,"A"]
[null,"Jean Mi","A","A","A","A"]
[null,"Eric","A",null,"A"]
[null,"Paul ",null,null,"A"]
[null,"Michel","A","A","A","A"]
[null,"Jacques ",null,"A"]
[null,"Jean Mi","A","A","A","A"]
[null,"Eric","A",null,"A"]
[null,"Paul ",null,null,"A"]
[null,"Michel","A","A","A","A"]
[null,"Jacques ",null,"A"]
[null,"Jean Mi","A","A","A","A"]
[null,"Eric","A",null,"A"]
[null,"Paul ",null,null,"A"]
[null,"Michel","A","A","A","A"]
[null,"Jacques ",null,"A"]
[null,"Jean Mi","A","A","A","A"]
[null,"Eric","A",null,"A"]
[null,"Paul ",null,null,"A"]
[null,"Michel","A","A","A","A"]
[null,"Jacques ",null,"A"]
[null,"Jean Mi","A","A","A","A"]
[null,"Eric","A",null,"A"]
[null,"Paul ",null,null,"A"]
[null,"Michel","A","A","A","A"]
[null,"Jacques ",null,"A"]
[null,"Jean Mi","A","A","A","A"]
[null,"Eric","A",null,"A"]
[null,"Paul ",null,null,"A"]
[null,"Michel","A","A","A","A"]
[null,"Jacques ",null,"A"]
[null,"Jean Mi","A","A","A","A"]
[null,"Eric","A",null,"A"]
[null,"Paul ",null,null,"A"]
[null,"Michel","A","A","A","A"]
[null,"Jacques ",null,"A"]
[null,"Jean Mi","A","A","A","A"]
[null,"Eric","A",null,"A"]
[null,"Paul ",null,null,"A"]
[null,"Michel","A","A","A","A"]
[null,"Jacques ",null,"A"]
[null,"Jean Mi","A","A","A","A"]
[null,"Eric","A",null,"A"]
[null,"Paul ",null,null,"A"]
[null,"Michel","A","A","A","A"]
[null,"Jacques ",null,"A"]
[null,"Jean Mi","A","A","A","A"]
[null,"Eric","A",null,"A"]
[null,"Paul ",null,null,"A"]
[null,"Michel","A","A","A","A"]
[null,"Jacques ",null,"A"]
[null,"Jean Mi","A","A","A","A"]
[null,"Eric","A",null,"A"]
[null,"Paul ",null,null,"A"]
[null,"Michel","A","A","A","A"]
[null,"Jacques ",null,"A"]
[null,"Jean Mi","A","A","A","A"]
[null,"Eric","A",null,"A"]
[null,"Paul ",null,null,"A"]
[null,"Michel","A","A","A","A"]
[null,"Jacques ",null,"A"]
[null,"Jean Mi","A","A","A","A"]
[null,"Eric","A",null,"A"]
[null,"Paul ",null,null,"A"]
[null,"Michel","A","A","A","A"]
[null,"Jacques ",null,"A"]
[null,"Jean Mi","A","A","A","A"]
[null,"Eric","A",null,"A"]
[null,"Paul ",null,null,"A"]
[null,"Michel","A","A","A","A"]
[null,"Jacques ",null,"A"]
[null,"Jean Mi","A","A","A","A"]
[null,"Eric","A",null,"A"]
[null,"Paul ",null,null,"A"]
[null,"Michel","A","A","A","A"]
[null,"Jacques ",null,"A"]
[null,"Jean Mi","A","A","A","A"]
[null,"Eric","A",null,"A"]
[null,"Paul ",null,null,"A"]
[null,"Michel","A","A","A","A"]
[null,"Jacques ",null,"A"]
[null,"Jean Mi","A","A","A","A"]
[null,"Eric","A",null,"A"]
[null,"Paul ",null,null,"A"]
[null,"Michel","A","A","A","A"]
[null,"Jacques ",null,"A"]
[null,"Jean Mi","A","A","A","A"]
[null,"Eric","A",null,"A"]
[null,"Paul ",null,null,"A"]
[null,"Michel","A","A","A","A"]
[null,"Jacques ",null,"A"]
[null,"Jean Mi","A","A","A","A"]
[null,"Eric","A",null,"A"]
[null,"Paul ",null,null,"A"]
[null,"Michel","A","A","A","A"]
[null,"Jacques ",null,"A"]
[null,"Jean Mi","A","A","A","A"]
[null,"Eric","A",null,"A"]
[null,"Paul ",null,null,"A"]
[null,"Michel","A","A","A","A"]
[null,"Jacques ",null,"A"]
[null,"Jean Mi","A","A","A","A"]
[null,"Eric","A",null,"A"]
[null,"Paul ",null,null,"A"]
[null,"Michel","A","A","A","A"]
[null,"Jacques ",null,"A"]
[null,"Jean Mi","A","A","A","A"]
[null,"Eric","A",null,"A"]

{"sheet":"Tri ","index":1,"n_rows":300,"n_cols":9,"rows_kept":300,"cut":false,"hidden":false,"merged":[[2,8,2,9],[3,8,3,9]]}
[]
[null,null,null,null,null,null,null,{"$f":"IF(Compétances!$D$1=Compétances!G6,Compétances!$B6,0)","v":0}]
[null,null,null,null,null,null,null,"POSTE","Chocolat"]
[null,null,null,null,null,null,null,"NOM","Michel"]
["Fraise","Chocolat","Pomme ","Poire ","Possibles","LISTE possibles"]
[{"$f":"IF(Compétances!$D$1=Compétances!C6,Compétances!$B6,\"zz\")","v":"Eric"},{"$f":"IF(Compétances!$D$1=Compétances!D6,Compétances!$B6,\"zz\")","v":"zz"},{"$f":"IF(Compétances!$D$1=Compétances!E6,Compétances!$B6,\"zz\")","v":"Eric"},{"$f":"IF(Compétances!$D$1=Compétances!F6,Compétances!$B6,\"zz\")","v":"zz"},{"$f":"IFERROR(IF(INDEX(A6:D6,MATCH($I$3,$A$5:$D$5,0))<>\"zz\",MAX($E$5:E5)+1,\"\"),\"\")","v":""},{"$f":"IF(ROWS(F$6:F6)<=MAX(E:E),INDEX(A:D,MATCH(ROWS(F$6:F6),E:E,0),MATCH($I$3,$A$5:$D$5,0)),\"\")","v":"Michel"}]
[{"$f":"IF(Compétances!$D$1=Compétances!C7,Compétances!$B7,\"zz\")","v":"zz"},{"$f":"IF(Compétances!$D$1=Compétances!D7,Compétances!$B7,\"zz\")","v":"zz"},{"$f":"IF(Compétances!$D$1=Compétances!E7,Compétances!$B7,\"zz\")","v":"Paul "},{"$f":"IF(Compétances!$D$1=Compétances!F7,Compétances!$B7,\"zz\")","v":"zz"},{"$f":"IFERROR(IF(INDEX(A7:D7,MATCH($I$3,$A$5:$D$5,0))<>\"zz\",MAX($E$5:E6)+1,\"\"),\"\")","v":""},{"$f":"IF(ROWS(F$6:F7)<=MAX(E:E),INDEX(A:D,MATCH(ROWS(F$6:F7),E:E,0),MATCH($I$3,$A$5:$D$5,0)),\"\")","v":"Jacques "}]
[{"$f":"IF(Compétances!$D$1=Compétances!C8,Compétances!$B8,\"zz\")","v":"Michel"},{"$f":"IF(Compétances!$D$1=Compétances!D8,Compétances!$B8,\"zz\")","v":"Michel"},{"$f":"IF(Compétances!$D$1=Compétances!E8,Compétances!$B8,\"zz\")","v":"Michel"},{"$f":"IF(Compétances!$D$1=Compétances!F8,Compétances!$B8,\"zz\")","v":"Michel"},{"$f":"IFERROR(IF(INDEX(A8:D8,MATCH($I$3,$A$5:$D$5,0))<>\"zz\",MAX($E$5:E7)+1,\"\"),\"\")","v":1},{"$f":"IF(ROWS(F$6:F8)<=MAX(E:E),INDEX(A:D,MATCH(ROWS(F$6:F8),E:E,0),MATCH($I$3,$A$5:$D$5,0)),\"\")","v":"Julien "}]
[{"$f":"IF(Compétances!$D$1=Compétances!C9,Compétances!$B9,\"zz\")","v":"zz"},{"$f":"IF(Compétances!$D$1=Compétances!D9,Compétances!$B9,\"zz\")","v":"Jacques "},{"$f":"IF(Compétances!$D$1=Compétances!E9,Compétances!$B9,\"zz\")","v":"zz"},{"$f":"IF(Compétances!$D$1=Compétances!F9,Compétances!$B9,\"zz\")","v":"zz"},{"$f":"IFERROR(IF(INDEX(A9:D9,MATCH($I$3,$A$5:$D$5,0))<>\"zz\",MAX($E$5:E8)+1,\"\"),\"\")","v":2},{"$f":"IF(ROWS(F$6:F9)<=MAX(E:E),INDEX(A:D,MATCH(ROWS(F$6:F9),E:E,0),MATCH($I$3,$A$5:$D$5,0)),\"\")","v":"Jean Mi"}]
[{"$f":"IF(Compétances!$D$1=Compétances!C10,Compétances!$B10,\"zz\")","v":"Julien "},{"$f":"IF(Compétances!$D$1=Compétances!D10,Compétances!$B10,\"zz\")","v":"Julien "},{"$f":"IF(Compétances!$D$1=Compétances!E10,Compétances!$B10,\"zz\")","v":"zz"},{"$f":"IF(Compétances!$D$1=Compétances!F10,Compétances!$B10,\"zz\")","v":"zz"},{"$f":"IFERROR(IF(INDEX(A10:D10,MATCH($I$3,$A$5:$D$5,0))<>\"zz\",MAX($E$5:E9)+1,\"\"),\"\")","v":3},{"$f":"IF(ROWS(F$6:F10)<=MAX(E:E),INDEX(A:D,MATCH(ROWS(F$6:F10),E:E,0),MATCH($I$3,$A$5:$D$5,0)),\"\")","v":"Michel"}]
[{"$f":"IF(Compétances!$D$1=Compétances!C11,Compétances!$B11,\"zz\")","v":"Jean Mi"},{"$f":"IF(Compétances!$D$1=Compétances!D11,Compétances!$B11,\"zz\")","v":"Jean Mi"},{"$f":"IF(Compétances!$D$1=Compétances!E11,Compétances!$B11,\"zz\")","v":"Jean Mi"},{"$f":"IF(Compétances!$D$1=Compétances!F11,Compétances!$B11,\"zz\")","v":"Jean Mi"},{"$f":"IFERROR(IF(INDEX(A11:D11,MATCH($I$3,$A$5:$D$5,0))<>\"zz\",MAX($E$5:E10)+1,\"\"),\"\")","v":4},{"$f":"IF(ROWS(F$6:F11)<=MAX(E:E),INDEX(A:D,MATCH(ROWS(F$6:F11),E:E,0),MATCH($I$3,$A$5:$D$5,0)),\"\")","v":"Jean Mi"}]
[{"$f":"IF(Compétances!$D$1=Compétances!C12,Compétances!$B12,\"zz\")","v":"Eric"},{"$f":"IF(Compétances!$D$1=Compétances!D12,Compétances!$B12,\"zz\")","v":"zz"},{"$f":"IF(Compétances!$D$1=Compétances!E12,Compétances!$B12,\"zz\")","v":"Eric"},{"$f":"IF(Compétances!$D$1=Compétances!F12,Compétances!$B12,\"zz\")","v":"zz"},{"$f":"IFERROR(IF(INDEX(A12:D12,MATCH($I$3,$A$5:$D$5,0))<>\"zz\",MAX($E$5:E11)+1,\"\"),\"\")","v":""},{"$f":"IF(ROWS(F$6:F12)<=MAX(E:E),INDEX(A:D,MATCH(ROWS(F$6:F12),E:E,0),MATCH($I$3,$A$5:$D$5,0)),\"\")","v":"Michel"}]
[{"$f":"IF(Compétances!$D$1=Compétances!C13,Compétances!$B13,\"zz\")","v":"zz"},{"$f":"IF(Compétances!$D$1=Compétances!D13,Compétances!$B13,\"zz\")","v":"zz"},{"$f":"IF(Compétances!$D$1=Compétances!E13,Compétances!$B13,\"zz\")","v":"Paul "},{"$f":"IF(Compétances!$D$1=Compétances!F13,Compétances!$B13,\"zz\")","v":"zz"},{"$f":"IFERROR(IF(INDEX(A13:D13,MATCH($I$3,$A$5:$D$5,0))<>\"zz\",MAX($E$5:E12)+1,\"\"),\"\")","v":""},{"$f":"IF(ROWS(F$6:F13)<=MAX(E:E),INDEX(A:D,MATCH(ROWS(F$6:F13),E:E,0),MATCH($I$3,$A$5:$D$5,0)),\"\")","v":"Jacques "}]
[{"$f":"IF(Compétances!$D$1=Compétances!C14,Compétances!$B14,\"zz\")","v":"Michel"},{"$f":"IF(Compétances!$D$1=Compétances!D14,Compétances!$B14,\"zz\")","v":"Michel"},{"$f":"IF(Compétances!$D$1=Compétances!E14,Compétances!$B14,\"zz\")","v":"Michel"},{"$f":"IF(Compétances!$D$1=Compétances!F14,Compétances!$B14,\"zz\")","v":"Michel"},{"$f":"IFERROR(IF(INDEX(A14:D14,MATCH($I$3,$A$5:$D$5,0))<>\"zz\",MAX($E$5:E13)+1,\"\"),\"\")","v":5},{"$f":"IF(ROWS(F$6:F14)<=MAX(E:E),INDEX(A:D,MATCH(ROWS(F$6:F14),E:E,0),MATCH($I$3,$A$5:$D$5,0)),\"\")","v":"Jean Mi"}]
[{"$f":"IF(Compétances!$D$1=Compétances!#REF!,Compétances!#REF!,\"zz\")","v":{"$error":"#REF!"}},{"$f":"IF(Compétances!$D$1=Compétances!#REF!,Compétances!#REF!,\"zz\")","v":{"$error":"#REF!"}},{"$f":"IF(Compétances!$D$1=Compétances!#REF!,Compétances!#REF!,\"zz\")","v":{"$error":"#REF!"}},{"$f":"IF(Compétances!$D$1=Compétances!#REF!,Compétances!#REF!,\"zz\")","v":{"$error":"#REF!"}},{"$f":"IFERROR(IF(INDEX(A15:D15,MATCH($I$3,$A$5:$D$5,0))<>\"zz\",MAX($E$5:E14)+1,\"\"),\"\")","v":""},{"$f":"IF(ROWS(F$6:F15)<=MAX(E:E),INDEX(A:D,MATCH(ROWS(F$6:F15),E:E,0),MATCH($I$3,$A$5:$D$5,0)),\"\")","v":"Michel"}]
[{"$f":"IF(Compétances!$D$1=Compétances!#REF!,Compétances!#REF!,\"zz\")","v":{"$error":"#REF!"}},{"$f":"IF(Compétances!$D$1=Compétances!#REF!,Compétances!#REF!,\"zz\")","v":{"$error":"#REF!"}},{"$f":"IF(Compétances!$D$1=Compétances!#REF!,Compétances!#REF!,\"zz\")","v":{"$error":"#REF!"}},{"$f":"IF(Compétances!$D$1=Compétances!#REF!,Compétances!#REF!,\"zz\")","v":{"$error":"#REF!"}},{"$f":"IFERROR(IF(INDEX(A16:D16,MATCH($I$3,$A$5:$D$5,0))<>\"zz\",MAX($E$5:E15)+1,\"\"),\"\")","v":""},{"$f":"IF(ROWS(F$6:F16)<=MAX(E:E),INDEX(A:D,MATCH(ROWS(F$6:F16),E:E,0),MATCH($I$3,$A$5:$D$5,0)),\"\")","v":"Jacques "}]
[{"$f":"IF(Compétances!$D$1=Compétances!C15,Compétances!$B15,\"zz\")","v":"Jean Mi"},{"$f":"IF(Compétances!$D$1=Compétances!D15,Compétances!$B15,\"zz\")","v":"Jean Mi"},{"$f":"IF(Compétances!$D$1=Compétances!E15,Compétances!$B15,\"zz\")","v":"Jean Mi"},{"$f":"IF(Compétances!$D$1=Compétances!F15,Compétances!$B15,\"zz\")","v":"Jean Mi"},{"$f":"IFERROR(IF(INDEX(A17:D17,MATCH($I$3,$A$5:$D$5,0))<>\"zz\",MAX($E$5:E16)+1,\"\"),\"\")","v":6},{"$f":"IF(ROWS(F$6:F17)<=MAX(E:E),INDEX(A:D,MATCH(ROWS(F$6:F17),E:E,0),MATCH($I$3,$A$5:$D$5,0)),\"\")","v":"Jean Mi"}]
[{"$f":"IF(Compétances!$D$1=Compétances!C16,Compétances!$B16,\"zz\")","v":"Eric"},{"$f":"IF(Compétances!$D$1=Compétances!D16,Compétances!$B16,\"zz\")","v":"zz"},{"$f":"IF(Compétances!$D$1=Compétances!E16,Compétances!$B16,\"zz\")","v":"Eric"},{"$f":"IF(Compétances!$D$1=Compétances!F16,Compétances!$B16,\"zz\")","v":"zz"},{"$f":"IFERROR(IF(INDEX(A18:D18,MATCH($I$3,$A$5:$D$5,0))<>\"zz\",MAX($E$5:E17)+1,\"\"),\"\")","v":""},{"$f":"IF(ROWS(F$6:F18)<=MAX(E:E),INDEX(A:D,MATCH(ROWS(F$6:F18),E:E,0),MATCH($I$3,$A$5:$D$5,0)),\"\")","v":"Michel"}]
[{"$f":"IF(Compétances!$D$1=Compétances!C17,Compétances!$B17,\"zz\")","v":"zz"},{"$f":"IF(Compétances!$D$1=Compétances!D17,Compétances!$B17,\"zz\")","v":"zz"},{"$f":"IF(Compétances!$D$1=Compétances!E17,Compétances!$B17,\"zz\")","v":"Paul "},{"$f":"IF(Compétances!$D$1=Compétances!F17,Compétances!$B17,\"zz\")","v":"zz"},{"$f":"IFERROR(IF(INDEX(A19:D19,MATCH($I$3,$A$5:$D$5,0))<>\"zz\",MAX($E$5:E18)+1,\"\"),\"\")","v":""},{"$f":"IF(ROWS(F$6:F19)<=MAX(E:E),INDEX(A:D,MATCH(ROWS(F$6:F19),E:E,0),MATCH($I$3,$A$5:$D$5,0)),\"\")","v":"Jacques "}]
[{"$f":"IF(Compétances!$D$1=Compétances!C18,Compétances!$B18,\"zz\")","v":"Michel"},{"$f":"IF(Compétances!$D$1=Compétances!D18,Compétances!$B18,\"zz\")","v":"Michel"},{"$f":"IF(Compétances!$D$1=Compétances!E18,Compétances!$B18,\"zz\")","v":"Michel"},{"$f":"IF(Compétances!$D$1=Compétances!F18,Compétances!$B18,\"zz\")","v":"Michel"},{"$f":"IFERROR(IF(INDEX(A20:D20,MATCH($I$3,$A$5:$D$5,0))<>\"zz\",MAX($E$5:E19)+1,\"\"),\"\")","v":7},{"$f":"IF(ROWS(F$6:F20)<=MAX(E:E),INDEX(A:D,MATCH(ROWS(F$6:F20),E:E,0),MATCH($I$3,$A$5:$D$5,0)),\"\")","v":"Jean Mi"}]
[{"$f":"IF(Compétances!$D$1=Compétances!C19,Compétances!$B19,\"zz\")","v":"zz"},{"$f":"IF(Compétances!$D$1=Compétances!D19,Compétances!$B19,\"zz\")","v":"Jacques "},{"$f":"IF(Compétances!$D$1=Compétances!E19,Compétances!$B19,\"zz\")","v":"zz"},{"$f":"IF(Compétances!$D$1=Compétances!F19,Compétances!$B19,\"zz\")","v":"zz"},{"$f":"IFERROR(IF(INDEX(A21:D21,MATCH($I$3,$A$5:$D$5,0))<>\"zz\",MAX($E$5:E20)+1,\"\"),\"\")","v":8},{"$f":"IF(ROWS(F$6:F21)<=MAX(E:E),INDEX(A:D,MATCH(ROWS(F$6:F21),E:E,0),MATCH($I$3,$A$5:$D$5,0)),\"\")","v":"Michel"}]
[{"$f":"IF(Compétances!$D$1=Compétances!#REF!,Compétances!#REF!,\"zz\")","v":{"$error":"#REF!"}},{"$f":"IF(Compétances!$D$1=Compétances!#REF!,Compétances!#REF!,\"zz\")","v":{"$error":"#REF!"}},{"$f":"IF(Compétances!$D$1=Compétances!#REF!,Compétances!#REF!,\"zz\")","v":{"$error":"#REF!"}},{"$f":"IF(Compétances!$D$1=Compétances!#REF!,Compétances!#REF!,\"zz\")","v":{"$error":"#REF!"}},{"$f":"IFERROR(IF(INDEX(A22:D22,MATCH($I$3,$A$5:$D$5,0))<>\"zz\",MAX($E$5:E21)+1,\"\"),\"\")","v":""},{"$f":"IF(ROWS(F$6:F22)<=MAX(E:E),INDEX(A:D,MATCH(ROWS(F$6:F22),E:E,0),MATCH($I$3,$A$5:$D$5,0)),\"\")","v":"Jacques "}]
[{"$f":"IF(Compétances!$D$1=Compétances!C20,Compétances!$B20,\"zz\")","v":"Jean Mi"},{"$f":"IF(Compétances!$D$1=Compétances!D20,Compétances!$B20,\"zz\")","v":"Jean Mi"},{"$f":"IF(Compétances!$D$1=Compétances!E20,Compétances!$B20,\"zz\")","v":"Jean Mi"},{"$f":"IF(Compétances!$D$1=Compétances!F20,Compétances!$B20,\"zz\")","v":"Jean Mi"},{"$f":"IFERROR(IF(INDEX(A23:D23,MATCH($I$3,$A$5:$D$5,0))<>\"zz\",MAX($E$5:E22)+1,\"\"),\"\")","v":9},{"$f":"IF(ROWS(F$6:F23)<=MAX(E:E),INDEX(A:D,MATCH(ROWS(F$6:F23),E:E,0),MATCH($I$3,$A$5:$D$5,0)),\"\")","v":"Jean Mi"}]
[{"$f":"IF(Compétances!$D$1=Compétances!C21,Compétances!$B21,\"zz\")","v":"Eric"},{"$f":"IF(Compétances!$D$1=Compétances!D21,Compétances!$B21,\"zz\")","v":"zz"},{"$f":"IF(Compétances!$D$1=Compétances!E21,Compétances!$B21,\"zz\")","v":"Eric"},{"$f":"IF(Compétances!$D$1=Compétances!F21,Compétances!$B21,\"zz\")","v":"zz"},{"$f":"IFERROR(IF(INDEX(A24:D24,MATCH($I$3,$A$5:$D$5,0))<>\"zz\",MAX($E$5:E23)+1,\"\"),\"\")","v":""},{"$f":"IF(ROWS(F$6:F24)<=MAX(E:E),INDEX(A:D,MATCH(ROWS(F$6:F24),E:E,0),MATCH($I$3,$A$5:$D$5,0)),\"\")","v":"Michel"}]
[{"$f":"IF(Compétances!$D$1=Compétances!C22,Compétances!$B22,\"zz\")","v":"zz"},{"$f":"IF(Compétances!$D$1=Compétances!D22,Compétances!$B22,\"zz\")","v":"zz"},{"$f":"IF(Compétances!$D$1=Compétances!E22,Compétances!$B22,\"zz\")","v":"Paul "},{"$f":"IF(Compétances!$D$1=Compétances!F22,Compétances!$B22,\"zz\")","v":"zz"},{"$f":"IFERROR(IF(INDEX(A25:D25,MATCH($I$3,$A$5:$D$5,0))<>\"zz\",MAX($E$5:E24)+1,\"\"),\"\")","v":""},{"$f":"IF(ROWS(F$6:F25)<=MAX(E:E),INDEX(A:D,MATCH(ROWS(F$6:F25),E:E,0),MATCH($I$3,$A$5:$D$5,0)),\"\")","v":"Jacques "}]
[{"$f":"IF(Compétances!$D$1=Compétances!C23,Compétances!$B23,\"zz\")","v":"Michel"},{"$f":"IF(Compétances!$D$1=Compétances!D23,Compétances!$B23,\"zz\")","v":"Michel"},{"$f":"IF(Compétances!$D$1=Compétances!E23,Compétances!$B23,\"zz\")","v":"Michel"},{"$f":"IF(Compétances!$D$1=Compétances!F23,Compétances!$B23,\"zz\")","v":"Michel"},{"$f":"IFERROR(IF(INDEX(A26:D26,MATCH($I$3,$A$5:$D$5,0))<>\"zz\",MAX($E$5:E25)+1,\"\"),\"\")","v":10},{"$f":"IF(ROWS(F$6:F26)<=MAX(E:E),INDEX(A:D,MATCH(ROWS(F$6:F26),E:E,0),MATCH($I$3,$A$5:$D$5,0)),\"\")","v":"Jean Mi"}]
[{"$f":"IF(Compétances!$D$1=Compétances!C24,Compétances!$B24,\"zz\")","v":"zz"},{"$f":"IF(Compétances!$D$1=Compétances!D24,Compétances!$B24,\"zz\")","v":"Jacques "},{"$f":"IF(Compétances!$D$1=Compétances!E24,Compétances!$B24,\"zz\")","v":"zz"},{"$f":"IF(Compétances!$D$1=Compétances!F24,Compétances!$B24,\"zz\")","v":"zz"},{"$f":"IFERROR(IF(INDEX(A27:D27,MATCH($I$3,$A$5:$D$5,0))<>\"zz\",MAX($E$5:E26)+1,\"\"),\"\")","v":11},{"$f":"IF(ROWS(F$6:F27)<=MAX(E:E),INDEX(A:D,MATCH(ROWS(F$6:F27),E:E,0),MATCH($I$3,$A$5:$D$5,0)),\"\")","v":"Michel"}]
[{"$f":"IF(Compétances!$D$1=Compétances!#REF!,Compétances!#REF!,\"zz\")","v":{"$error":"#REF!"}},{"$f":"IF(Compétances!$D$1=Compétances!#REF!,Compétances!#REF!,\"zz\")","v":{"$error":"#REF!"}},{"$f":"IF(Compétances!$D$1=Compétances!#REF!,Compétances!#REF!,\"zz\")","v":{"$error":"#REF!"}},{"$f":"IF(Compétances!$D$1=Compétances!#REF!,Compétances!#REF!,\"zz\")","v":{"$error":"#REF!"}},{"$f":"IFERROR(IF(INDEX(A28:D28,MATCH($I$3,$A$5:$D$5,0))<>\"zz\",MAX($E$5:E27)+1,\"\"),\"\")","v":""},{"$f":"IF(ROWS(F$6:F28)<=MAX(E:E),INDEX(A:D,MATCH(ROWS(F$6:F28),E:E,0),MATCH($I$3,$A$5:$D$5,0)),\"\")","v":"Jacques "}]
[{"$f":"IF(Compétances!$D$1=Compétances!C25,Compétances!$B25,\"zz\")","v":"Jean Mi"},{"$f":"IF(Compétances!$D$1=Compétances!D25,Compétances!$B25,\"zz\")","v":"Jean Mi"},{"$f":"IF(Compétances!$D$1=Compétances!E25,Compétances!$B25,\"zz\")","v":"Jean Mi"},{"$f":"IF(Compétances!$D$1=Compétances!F25,Compétances!$B25,\"zz\")","v":"Jean Mi"},{"$f":"IFERROR(IF(INDEX(A29:D29,MATCH($I$3,$A$5:$D$5,0))<>\"zz\",MAX($E$5:E28)+1,\"\"),\"\")","v":12},{"$f":"IF(ROWS(F$6:F29)<=MAX(E:E),INDEX(A:D,MATCH(ROWS(F$6:F29),E:E,0),MATCH($I$3,$A$5:$D$5,0)),\"\")","v":"Jean Mi"}]
[{"$f":"IF(Compétances!$D$1=Compétances!C26,Compétances!$B26,\"zz\")","v":"Eric"},{"$f":"IF(Compétances!$D$1=Compétances!D26,Compétances!$B26,\"zz\")","v":"zz"},{"$f":"IF(Compétances!$D$1=Compétances!E26,Compétances!$B26,\"zz\")","v":"Eric"},{"$f":"IF(Compétances!$D$1=Compétances!F26,Compétances!$B26,\"zz\")","v":"zz"},{"$f":"IFERROR(IF(INDEX(A30:D30,MATCH($I$3,$A$5:$D$5,0))<>\"zz\",MAX($E$5:E29)+1,\"\"),\"\")","v":""},{"$f":"IF(ROWS(F$6:F30)<=MAX(E:E),INDEX(A:D,MATCH(ROWS(F$6:F30),E:E,0),MATCH($I$3,$A$5:$D$5,0)),\"\")","v":"Michel"}]
[{"$f":"IF(Compétances!$D$1=Compétances!C27,Compétances!$B27,\"zz\")","v":"zz"},{"$f":"IF(Compétances!$D$1=Compétances!D27,Compétances!$B27,\"zz\")","v":"zz"},{"$f":"IF(Compétances!$D$1=Compétances!E27,Compétances!$B27,\"zz\")","v":"Paul "},{"$f":"IF(Compétances!$D$1=Compétances!F27,Compétances!$B27,\"zz\")","v":"zz"},{"$f":"IFERROR(IF(INDEX(A31:D31,MATCH($I$3,$A$5:$D$5,0))<>\"zz\",MAX($E$5:E30)+1,\"\"),\"\")","v":""},{"$f":"IF(ROWS(F$6:F31)<=MAX(E:E),INDEX(A:D,MATCH(ROWS(F$6:F31),E:E,0),MATCH($I$3,$A$5:$D$5,0)),\"\")","v":"Jacques "}]
[{"$f":"IF(Compétances!$D$1=Compétances!C28,Compétances!$B28,\"zz\")","v":"Michel"},{"$f":"IF(Compétances!$D$1=Compétances!D28,Compétances!$B28,\"zz\")","v":"Michel"},{"$f":"IF(Compétances!$D$1=Compétances!E28,Compétances!$B28,\"zz\")","v":"Michel"},{"$f":"IF(Compétances!$D$1=Compétances!F28,Compétances!$B28,\"zz\")","v":"Michel"},{"$f":"IFERROR(IF(INDEX(A32:D32,MATCH($I$3,$A$5:$D$5,0))<>\"zz\",MAX($E$5:E31)+1,\"\"),\"\")","v":13},{"$f":"IF(ROWS(F$6:F32)<=MAX(E:E),INDEX(A:D,MATCH(ROWS(F$6:F32),E:E,0),MATCH($I$3,$A$5:$D$5,0)),\"\")","v":"Jean Mi"}]
[{"$f":"IF(Compétances!$D$1=Compétances!C29,Compétances!$B29,\"zz\")","v":"zz"},{"$f":"IF(Compétances!$D$1=Compétances!D29,Compétances!$B29,\"zz\")","v":"Jacques "},{"$f":"IF(Compétances!$D$1=Compétances!E29,Compétances!$B29,\"zz\")","v":"zz"},{"$f":"IF(Compétances!$D$1=Compétances!F29,Compétances!$B29,\"zz\")","v":"zz"},{"$f":"IFERROR(IF(INDEX(A33:D33,MATCH($I$3,$A$5:$D$5,0))<>\"zz\",MAX($E$5:E32)+1,\"\"),\"\")","v":14},{"$f":"IF(ROWS(F$6:F33)<=MAX(E:E),INDEX(A:D,MATCH(ROWS(F$6:F33),E:E,0),MATCH($I$3,$A$5:$D$5,0)),\"\")","v":"Michel"}]
[{"$f":"IF(Compétances!$D$1=Compétances!#REF!,Compétances!#REF!,\"zz\")","v":{"$error":"#REF!"}},{"$f":"IF(Compétances!$D$1=Compétances!#REF!,Compétances!#REF!,\"zz\")","v":{"$error":"#REF!"}},{"$f":"IF(Compétances!$D$1=Compétances!#REF!,Compétances!#REF!,\"zz\")","v":{"$error":"#REF!"}},{"$f":"IF(Compétances!$D$1=Compétances!#REF!,Compétances!#REF!,\"zz\")","v":{"$error":"#REF!"}},{"$f":"IFERROR(IF(INDEX(A34:D34,MATCH($I$3,$A$5:$D$5,0))<>\"zz\",MAX($E$5:E33)+1,\"\"),\"\")","v":""},{"$f":"IF(ROWS(F$6:F34)<=MAX(E:E),INDEX(A:D,MATCH(ROWS(F$6:F34),E:E,0),MATCH($I$3,$A$5:$D$5,0)),\"\")","v":"Jacques "}]
[{"$f":"IF(Compétances!$D$1=Compétances!C30,Compétances!$B30,\"zz\")","v":"Jean Mi"},{"$f":"IF(Compétances!$D$1=Compétances!D30,Compétances!$B30,\"zz\")","v":"Jean Mi"},{"$f":"IF(Compétances!$D$1=Compétances!E30,Compétances!$B30,\"zz\")","v":"Jean Mi"},{"$f":"IF(Compétances!$D$1=Compétances!F30,Compétances!$B30,\"zz\")","v":"Jean Mi"},{"$f":"IFERROR(IF(INDEX(A35:D35,MATCH($I$3,$A$5:$D$5,0))<>\"zz\",MAX($E$5:E34)+1,\"\"),\"\")","v":15},{"$f":"IF(ROWS(F$6:F35)<=MAX(E:E),INDEX(A:D,MATCH(ROWS(F$6:F35),E:E,0),MATCH($I$3,$A$5:$D$5,0)),\"\")","v":"Jean Mi"}]
[{"$f":"IF(Compétances!$D$1=Compétances!C31,Compétances!$B31,\"zz\")","v":"Eric"},{"$f":"IF(Compétances!$D$1=Compétances!D31,Compétances!$B31,\"zz\")","v":"zz"},{"$f":"IF(Compétances!$D$1=Compétances!E31,Compétances!$B31,\"zz\")","v":"Eric"},{"$f":"IF(Compétances!$D$1=Compétances!F31,Compétances!$B31,\"zz\")","v":"zz"},{"$f":"IFERROR(IF(INDEX(A36:D36,MATCH($I$3,$A$5:$D$5,0))<>\"zz\",MAX($E$5:E35)+1,\"\"),\"\")","v":""},{"$f":"IF(ROWS(F$6:F36)<=MAX(E:E),INDEX(A:D,MATCH(ROWS(F$6:F36),E:E,0),MATCH($I$3,$A$5:$D$5,0)),\"\")","v":"Michel"}]
[{"$f":"IF(Compétances!$D$1=Compétances!C32,Compétances!$B32,\"zz\")","v":"zz"},{"$f":"IF(Compétances!$D$1=Compétances!D32,Compétances!$B32,\"zz\")","v":"zz"},{"$f":"IF(Compétances!$D$1=Compétances!E32,Compétances!$B32,\"zz\")","v":"Paul "},{"$f":"IF(Compétances!$D$1=Compétances!F32,Compétances!$B32,\"zz\")","v":"zz"},{"$f":"IFERROR(IF(INDEX(A37:D37,MATCH($I$3,$A$5:$D$5,0))<>\"zz\",MAX($E$5:E36)+1,\"\"),\"\")","v":""},{"$f":"IF(ROWS(F$6:F37)<=MAX(E:E),INDEX(A:D,MATCH(ROWS(F$6:F37),E:E,0),MATCH($I$3,$A$5:$D$5,0)),\"\")","v":"Jacques "}]
[{"$f":"IF(Compétances!$D$1=Compétances!C33,Compétances!$B33,\"zz\")","v":"Michel"},{"$f":"IF(Compétances!$D$1=Compétances!D33,Compétances!$B33,\"zz\")","v":"Michel"},{"$f":"IF(Compétances!$D$1=Compétances!E33,Compétances!$B33,\"zz\")","v":"Michel"},{"$f":"IF(Compétances!$D$1=Compétances!F33,Compétances!$B33,\"zz\")","v":"Michel"},{"$f":"IFERROR(IF(INDEX(A38:D38,MATCH($I$3,$A$5:$D$5,0))<>\"zz\",MAX($E$5:E37)+1,\"\"),\"\")","v":16},{"$f":"IF(ROWS(F$6:F38)<=MAX(E:E),INDEX(A:D,MATCH(ROWS(F$6:F38),E:E,0),MATCH($I$3,$A$5:$D$5,0)),\"\")","v":"Jean Mi"}]
[{"$f":"IF(Compétances!$D$1=Compétances!C34,Compétances!$B34,\"zz\")","v":"zz"},{"$f":"IF(Compétances!$D$1=Compétances!D34,Compétances!$B34,\"zz\")","v":"Jacques "},{"$f":"IF(Compétances!$D$1=Compétances!E34,Compétances!$B34,\"zz\")","v":"zz"},{"$f":"IF(Compétances!$D$1=Compétances!F34,Compétances!$B34,\"zz\")","v":"zz"},{"$f":"IFERROR(IF(INDEX(A39:D39,MATCH($I$3,$A$5:$D$5,0))<>\"zz\",MAX($E$5:E38)+1,\"\"),\"\")","v":17},{"$f":"IF(ROWS(F$6:F39)<=MAX(E:E),INDEX(A:D,MATCH(ROWS(F$6:F39),E:E,0),MATCH($I$3,$A$5:$D$5,0)),\"\")","v":"Michel"}]
[{"$f":"IF(Compétances!$D$1=Compétances!#REF!,Compétances!#REF!,\"zz\")","v":{"$error":"#REF!"}},{"$f":"IF(Compétances!$D$1=Compétances!#REF!,Compétances!#REF!,\"zz\")","v":{"$error":"#REF!"}},{"$f":"IF(Compétances!$D$1=Compétances!#REF!,Compétances!#REF!,\"zz\")","v":{"$error":"#REF!"}},{"$f":"IF(Compétances!$D$1=Compétances!#REF!,Compétances!#REF!,\"zz\")","v":{"$error":"#REF!"}},{"$f":"IFERROR(IF(INDEX(A40:D40,MATCH($I$3,$A$5:$D$5,0))<>\"zz\",MAX($E$5:E39)+1,\"\"),\"\")","v":""},{"$f":"IF(ROWS(F$6:F40)<=MAX(E:E),INDEX(A:D,MATCH(ROWS(F$6:F40),E:E,0),MATCH($I$3,$A$5:$D$5,0)),\"\")","v":"Jacques "}]
[{"$f":"IF(Compétances!$D$1=Compétances!C35,Compétances!$B35,\"zz\")","v":"Jean Mi"},{"$f":"IF(Compétances!$D$1=Compétances!D35,Compétances!$B35,\"zz\")","v":"Jean Mi"},{"$f":"IF(Compétances!$D$1=Compétances!E35,Compétances!$B35,\"zz\")","v":"Jean Mi"},{"$f":"IF(Compétances!$D$1=Compétances!F35,Compétances!$B35,\"zz\")","v":"Jean Mi"},{"$f":"IFERROR(IF(INDEX(A41:D41,MATCH($I$3,$A$5:$D$5,0))<>\"zz\",MAX($E$5:E40)+1,\"\"),\"\")","v":18},{"$f":"IF(ROWS(F$6:F41)<=MAX(E:E),INDEX(A:D,MATCH(ROWS(F$6:F41),E:E,0),MATCH($I$3,$A$5:$D$5,0)),\"\")","v":"Jean Mi"}]
[{"$f":"IF(Compétances!$D$1=Compétances!C36,Compétances!$B36,\"zz\")","v":"Eric"},{"$f":"IF(Compétances!$D$1=Compétances!D36,Compétances!$B36,\"zz\")","v":"zz"},{"$f":"IF(Compétances!$D$1=Compétances!E36,Compétances!$B36,\"zz\")","v":"Eric"},{"$f":"IF(Compétances!$D$1=Compétances!F36,Compétances!$B36,\"zz\")","v":"zz"},{"$f":"IFERROR(IF(INDEX(A42:D42,MATCH($I$3,$A$5:$D$5,0))<>\"zz\",MAX($E$5:E41)+1,\"\"),\"\")","v":""},{"$f":"IF(ROWS(F$6:F42)<=MAX(E:E),INDEX(A:D,MATCH(ROWS(F$6:F42),E:E,0),MATCH($I$3,$A$5:$D$5,0)),\"\")","v":"Michel"}]
[{"$f":"IF(Compétances!$D$1=Compétances!C37,Compétances!$B37,\"zz\")","v":"zz"},{"$f":"IF(Compétances!$D$1=Compétances!D37,Compétances!$B37,\"zz\")","v":"zz"},{"$f":"IF(Compétances!$D$1=Compétances!E37,Compétances!$B37,\"zz\")","v":"Paul "},{"$f":"IF(Compétances!$D$1=Compétances!F37,Compétances!$B37,\"zz\")","v":"zz"},{"$f":"IFERROR(IF(INDEX(A43:D43,MATCH($I$3,$A$5:$D$5,0))<>\"zz\",MAX($E$5:E42)+1,\"\"),\"\")","v":""},{"$f":"IF(ROWS(F$6:F43)<=MAX(E:E),INDEX(A:D,MATCH(ROWS(F$6:F43),E:E,0),MATCH($I$3,$A$5:$D$5,0)),\"\")","v":"Jacques "}]
[{"$f":"IF(Compétances!$D$1=Compétances!C38,Compétances!$B38,\"zz\")","v":"Michel"},{"$f":"IF(Compétances!$D$1=Compétances!D38,Compétances!$B38,\"zz\")","v":"Michel"},{"$f":"IF(Compétances!$D$1=Compétances!E38,Compétances!$B38,\"zz\")","v":"Michel"},{"$f":"IF(Compétances!$D$1=Compétances!F38,Compétances!$B38,\"zz\")","v":"Michel"},{"$f":"IFERROR(IF(INDEX(A44:D44,MATCH($I$3,$A$5:$D$5,0))<>\"zz\",MAX($E$5:E43)+1,\"\"),\"\")","v":19},{"$f":"IF(ROWS(F$6:F44)<=MAX(E:E),INDEX(A:D,MATCH(ROWS(F$6:F44),E:E,0),MATCH($I$3,$A$5:$D$5,0)),\"\")","v":"Jean Mi"}]
[{"$f":"IF(Compétances!$D$1=Compétances!C39,Compétances!$B39,\"zz\")","v":"zz"},{"$f":"IF(Compétances!$D$1=Compétances!D39,Compétances!$B39,\"zz\")","v":"Jacques "},{"$f":"IF(Compétances!$D$1=Compétances!E39,Compétances!$B39,\"zz\")","v":"zz"},{"$f":"IF(Compétances!$D$1=Compétances!F39,Compétances!$B39,\"zz\")","v":"zz"},{"$f":"IFERROR(IF(INDEX(A45:D45,MATCH($I$3,$A$5:$D$5,0))<>\"zz\",MAX($E$5:E44)+1,\"\"),\"\")","v":20},{"$f":"IF(ROWS(F$6:F45)<=MAX(E:E),INDEX(A:D,MATCH(ROWS(F$6:F45),E:E,0),MATCH($I$3,$A$5:$D$5,0)),\"\")","v":"Michel"}]
[{"$f":"IF(Compétances!$D$1=Compétances!#REF!,Compétances!#REF!,\"zz\")","v":{"$error":"#REF!"}},{"$f":"IF(Compétances!$D$1=Compétances!#REF!,Compétances!#REF!,\"zz\")","v":{"$error":"#REF!"}},{"$f":"IF(Compétances!$D$1=Compétances!#REF!,Compétances!#REF!,\"zz\")","v":{"$error":"#REF!"}},{"$f":"IF(Compétances!$D$1=Compétances!#REF!,Compétances!#REF!,\"zz\")","v":{"$error":"#REF!"}},{"$f":"IFERROR(IF(INDEX(A46:D46,MATCH($I$3,$A$5:$D$5,0))<>\"zz\",MAX($E$5:E45)+1,\"\"),\"\")","v":""},{"$f":"IF(ROWS(F$6:F46)<=MAX(E:E),INDEX(A:D,MATCH(ROWS(F$6:F46),E:E,0),MATCH($I$3,$A$5:$D$5,0)),\"\")","v":"Jacques "}]
[{"$f":"IF(Compétances!$D$1=Compétances!C40,Compétances!$B40,\"zz\")","v":"Jean Mi"},{"$f":"IF(Compétances!$D$1=Compétances!D40,Compétances!$B40,\"zz\")","v":"Jean Mi"},{"$f":"IF(Compétances!$D$1=Compétances!E40,Compétances!$B40,\"zz\")","v":"Jean Mi"},{"$f":"IF(Compétances!$D$1=Compétances!F40,Compétances!$B40,\"zz\")","v":"Jean Mi"},{"$f":"IFERROR(IF(INDEX(A47:D47,MATCH($I$3,$A$5:$D$5,0))<>\"zz\",MAX($E$5:E46)+1,\"\"),\"\")","v":21},{"$f":"IF(ROWS(F$6:F47)<=MAX(E:E),INDEX(A:D,MATCH(ROWS(F$6:F47),E:E,0),MATCH($I$3,$A$5:$D$5,0)),\"\")","v":"Jean Mi"}]
[{"$f":"IF(Compétances!$D$1=Compétances!C41,Compétances!$B41,\"zz\")","v":"Eric"},{"$f":"IF(Compétances!$D$1=Compétances!D41,Compétances!$B41,\"zz\")","v":"zz"},{"$f":"IF(Compétances!$D$1=Compétances!E41,Compétances!$B41,\"zz\")","v":"Eric"},{"$f":"IF(Compétances!$D$1=Compétances!F41,Compétances!$B41,\"zz\")","v":"zz"},{"$f":"IFERROR(IF(INDEX(A48:D48,MATCH($I$3,$A$5:$D$5,0))<>\"zz\",MAX($E$5:E47)+1,\"\"),\"\")","v":""},{"$f":"IF(ROWS(F$6:F48)<=MAX(E:E),INDEX(A:D,MATCH(ROWS(F$6:F48),E:E,0),MATCH($I$3,$A$5:$D$5,0)),\"\")","v":"Michel"}]
[{"$f":"IF(Compétances!$D$1=Compétances!C42,Compétances!$B42,\"zz\")","v":"zz"},{"$f":"IF(Compétances!$D$1=Compétances!D42,Compétances!$B42,\"zz\")","v":"zz"},{"$f":"IF(Compétances!$D$1=Compétances!E42,Compétances!$B42,\"zz\")","v":"Paul "},{"$f":"IF(Compétances!$D$1=Compétances!F42,Compétances!$B42,\"zz\")","v":"zz"},{"$f":"IFERROR(IF(INDEX(A49:D49,MATCH($I$3,$A$5:$D$5,0))<>\"zz\",MAX($E$5:E48)+1,\"\"),\"\")","v":""},{"$f":"IF(ROWS(F$6:F49)<=MAX(E:E),INDEX(A:D,MATCH(ROWS(F$6:F49),E:E,0),MATCH($I$3,$A$5:$D$5,0)),\"\")","v":"Jacques "}]
[{"$f":"IF(Compétances!$D$1=Compétances!C43,Compétances!$B43,\"zz\")","v":"Michel"},{"$f":"IF(Compétances!$D$1=Compétances!D43,Compétances!$B43,\"zz\")","v":"Michel"},{"$f":"IF(Compétances!$D$1=Compétances!E43,Compétances!$B43,\"zz\")","v":"Michel"},{"$f":"IF(Compétances!$D$1=Compétances!F43,Compétances!$B43,\"zz\")","v":"Michel"},{"$f":"IFERROR(IF(INDEX(A50:D50,MATCH($I$3,$A$5:$D$5,0))<>\"zz\",MAX($E$5:E49)+1,\"\"),\"\")","v":22},{"$f":"IF(ROWS(F$6:F50)<=MAX(E:E),INDEX(A:D,MATCH(ROWS(F$6:F50),E:E,0),MATCH($I$3,$A$5:$D$5,0)),\"\")","v":"Jean Mi"}]
[{"$f":"IF(Compétances!$D$1=Compétances!C44,Compétances!$B44,\"zz\")","v":"zz"},{"$f":"IF(Compétances!$D$1=Compétances!D44,Compétances!$B44,\"zz\")","v":"Jacques "},{"$f":"IF(Compétances!$D$1=Compétances!E44,Compétances!$B44,\"zz\")","v":"zz"},{"$f":"IF(Compétances!$D$1=Compétances!F44,Compétances!$B44,\"zz\")","v":"zz"},{"$f":"IFERROR(IF(INDEX(A51:D51,MATCH($I$3,$A$5:$D$5,0))<>\"zz\",MAX($E$5:E50)+1,\"\"),\"\")","v":23},{"$f":"IF(ROWS(F$6:F51)<=MAX(E:E),INDEX(A:D,MATCH(ROWS(F$6:F51),E:E,0),MATCH($I$3,$A$5:$D$5,0)),\"\")","v":"Michel"}]
[{"$f":"IF(Compétances!$D$1=Compétances!#REF!,Compétances!#REF!,\"zz\")","v":{"$error":"#REF!"}},{"$f":"IF(Compétances!$D$1=Compétances!#REF!,Compétances!#REF!,\"zz\")","v":{"$error":"#REF!"}},{"$f":"IF(Compétances!$D$1=Compétances!#REF!,Compétances!#REF!,\"zz\")","v":{"$error":"#REF!"}},{"$f":"IF(Compétances!$D$1=Compétances!#REF!,Compétances!#REF!,\"zz\")","v":{"$error":"#REF!"}},{"$f":"IFERROR(IF(INDEX(A52:D52,MATCH($I$3,$A$5:$D$5,0))<>\"zz\",MAX($E$5:E51)+1,\"\"),\"\")","v":""},{"$f":"IF(ROWS(F$6:F52)<=MAX(E:E),INDEX(A:D,MATCH(ROWS(F$6:F52),E:E,0),MATCH($I$3,$A$5:$D$5,0)),\"\")","v":"Jacques "}]
[{"$f":"IF(Compétances!$D$1=Compétances!C45,Compétances!$B45,\"zz\")","v":"Jean Mi"},{"$f":"IF(Compétances!$D$1=Compétances!D45,Compétances!$B45,\"zz\")","v":"Jean Mi"},{"$f":"IF(Compétances!$D$1=Compétances!E45,Compétances!$B45,\"zz\")","v":"Jean Mi"},{"$f":"IF(Compétances!$D$1=Compétances!F45,Compétances!$B45,\"zz\")","v":"Jean Mi"},{"$f":"IFERROR(IF(INDEX(A53:D53,MATCH($I$3,$A$5:$D$5,0))<>\"zz\",MAX($E$5:E52)+1,\"\"),\"\")","v":24},{"$f":"IF(ROWS(F$6:F53)<=MAX(E:E),INDEX(A:D,MATCH(ROWS(F$6:F53),E:E,0),MATCH($I$3,$A$5:$D$5,0)),\"\")","v":"Jean Mi"}]
[{"$f":"IF(Compétances!$D$1=Compétances!C46,Compétances!$B46,\"zz\")","v":"Eric"},{"$f":"IF(Compétances!$D$1=Compétances!D46,Compétances!$B46,\"zz\")","v":"zz"},{"$f":"IF(Compétances!$D$1=Compétances!E46,Compétances!$B46,\"zz\")","v":"Eric"},{"$f":"IF(Compétances!$D$1=Compétances!F46,Compétances!$B46,\"zz\")","v":"zz"},{"$f":"IFERROR(IF(INDEX(A54:D54,MATCH($I$3,$A$5:$D$5,0))<>\"zz\",MAX($E$5:E53)+1,\"\"),\"\")","v":""},{"$f":"IF(ROWS(F$6:F54)<=MAX(E:E),INDEX(A:D,MATCH(ROWS(F$6:F54),E:E,0),MATCH($I$3,$A$5:$D$5,0)),\"\")","v":"Michel"}]
[{"$f":"IF(Compétances!$D$1=Compétances!C47,Compétances!$B47,\"zz\")","v":"zz"},{"$f":"IF(Compétances!$D$1=Compétances!D47,Compétances!$B47,\"zz\")","v":"zz"},{"$f":"IF(Compétances!$D$1=Compétances!E47,Compétances!$B47,\"zz\")","v":"Paul "},{"$f":"IF(Compétances!$D$1=Compétances!F47,Compétances!$B47,\"zz\")","v":"zz"},{"$f":"IFERROR(IF(INDEX(A55:D55,MATCH($I$3,$A$5:$D$5,0))<>\"zz\",MAX($E$5:E54)+1,\"\"),\"\")","v":""},{"$f":"IF(ROWS(F$6:F55)<=MAX(E:E),INDEX(A:D,MATCH(ROWS(F$6:F55),E:E,0),MATCH($I$3,$A$5:$D$5,0)),\"\")","v":"Jacques "}]
[{"$f":"IF(Compétances!$D$1=Compétances!C48,Compétances!$B48,\"zz\")","v":"Michel"},{"$f":"IF(Compétances!$D$1=Compétances!D48,Compétances!$B48,\"zz\")","v":"Michel"},{"$f":"IF(Compétances!$D$1=Compétances!E48,Compétances!$B48,\"zz\")","v":"Michel"},{"$f":"IF(Compétances!$D$1=Compétances!F48,Compétances!$B48,\"zz\")","v":"Michel"},{"$f":"IFERROR(IF(INDEX(A56:D56,MATCH($I$3,$A$5:$D$5,0))<>\"zz\",MAX($E$5:E55)+1,\"\"),\"\")","v":25},{"$f":"IF(ROWS(F$6:F56)<=MAX(E:E),INDEX(A:D,MATCH(ROWS(F$6:F56),E:E,0),MATCH($I$3,$A$5:$D$5,0)),\"\")","v":"Jean Mi"}]
[{"$f":"IF(Compétances!$D$1=Compétances!C49,Compétances!$B49,\"zz\")","v":"zz"},{"$f":"IF(Compétances!$D$1=Compétances!D49,Compétances!$B49,\"zz\")","v":"Jacques "},{"$f":"IF(Compétances!$D$1=Compétances!E49,Compétances!$B49,\"zz\")","v":"zz"},{"$f":"IF(Compétances!$D$1=Compétances!F49,Compétances!$B49,\"zz\")","v":"zz"},{"$f":"IFERROR(IF(INDEX(A57:D57,MATCH($I$3,$A$5:$D$5,0))<>\"zz\",MAX($E$5:E56)+1,\"\"),\"\")","v":26},{"$f":"IF(ROWS(F$6:F57)<=MAX(E:E),INDEX(A:D,MATCH(ROWS(F$6:F57),E:E,0),MATCH($I$3,$A$5:$D$5,0)),\"\")","v":"Michel"}]
[{"$f":"IF(Compétances!$D$1=Compétances!#REF!,Compétances!#REF!,\"zz\")","v":{"$error":"#REF!"}},{"$f":"IF(Compétances!$D$1=Compétances!#REF!,Compétances!#REF!,\"zz\")","v":{"$error":"#REF!"}},{"$f":"IF(Compétances!$D$1=Compétances!#REF!,Compétances!#REF!,\"zz\")","v":{"$error":"#REF!"}},{"$f":"IF(Compétances!$D$1=Compétances!#REF!,Compétances!#REF!,\"zz\")","v":{"$error":"#REF!"}},{"$f":"IFERROR(IF(INDEX(A58:D58,MATCH($I$3,$A$5:$D$5,0))<>\"zz\",MAX($E$5:E57)+1,\"\"),\"\")","v":""},{"$f":"IF(ROWS(F$6:F58)<=MAX(E:E),INDEX(A:D,MATCH(ROWS(F$6:F58),E:E,0),MATCH($I$3,$A$5:$D$5,0)),\"\")","v":"Jacques "}]
[{"$f":"IF(Compétances!$D$1=Compétances!C50,Compétances!$B50,\"zz\")","v":"Jean Mi"},{"$f":"IF(Compétances!$D$1=Compétances!D50,Compétances!$B50,\"zz\")","v":"Jean Mi"},{"$f":"IF(Compétances!$D$1=Compétances!E50,Compétances!$B50,\"zz\")","v":"Jean Mi"},{"$f":"IF(Compétances!$D$1=Compétances!F50,Compétances!$B50,\"zz\")","v":"Jean Mi"},{"$f":"IFERROR(IF(INDEX(A59:D59,MATCH($I$3,$A$5:$D$5,0))<>\"zz\",MAX($E$5:E58)+1,\"\"),\"\")","v":27},{"$f":"IF(ROWS(F$6:F59)<=MAX(E:E),INDEX(A:D,MATCH(ROWS(F$6:F59),E:E,0),MATCH($I$3,$A$5:$D$5,0)),\"\")","v":"Jean Mi"}]
[{"$f":"IF(Compétances!$D$1=Compétances!C51,Compétances!$B51,\"zz\")","v":"Eric"},{"$f":"IF(Compétances!$D$1=Compétances!D51,Compétances!$B51,\"zz\")","v":"zz"},{"$f":"IF(Compétances!$D$1=Compétances!E51,Compétances!$B51,\"zz\")","v":"Eric"},{"$f":"IF(Compétances!$D$1=Compétances!F51,Compétances!$B51,\"zz\")","v":"zz"},{"$f":"IFERROR(IF(INDEX(A60:D60,MATCH($I$3,$A$5:$D$5,0))<>\"zz\",MAX($E$5:E59)+1,\"\"),\"\")","v":""},{"$f":"IF(ROWS(F$6:F60)<=MAX(E:E),INDEX(A:D,MATCH(ROWS(F$6:F60),E:E,0),MATCH($I$3,$A$5:$D$5,0)),\"\")","v":"Michel"}]
[{"$f":"IF(Compétances!$D$1=Compétances!C52,Compétances!$B52,\"zz\")","v":"zz"},{"$f":"IF(Compétances!$D$1=Compétances!D52,Compétances!$B52,\"zz\")","v":"zz"},{"$f":"IF(Compétances!$D$1=Compétances!E52,Compétances!$B52,\"zz\")","v":"Paul "},{"$f":"IF(Compétances!$D$1=Compétances!F52,Compétances!$B52,\"zz\")","v":"zz"},{"$f":"IFERROR(IF(INDEX(A61:D61,MATCH($I$3,$A$5:$D$5,0))<>\"zz\",MAX($E$5:E60)+1,\"\"),\"\")","v":""},{"$f":"IF(ROWS(F$6:F61)<=MAX(E:E),INDEX(A:D,MATCH(ROWS(F$6:F61),E:E,0),MATCH($I$3,$A$5:$D$5,0)),\"\")","v":"Jacques "}]
[{"$f":"IF(Compétances!$D$1=Compétances!C53,Compétances!$B53,\"zz\")","v":"Michel"},{"$f":"IF(Compétances!$D$1=Compétances!D53,Compétances!$B53,\"zz\")","v":"Michel"},{"$f":"IF(Compétances!$D$1=Compétances!E53,Compétances!$B53,\"zz\")","v":"Michel"},{"$f":"IF(Compétances!$D$1=Compétances!F53,Compétances!$B53,\"zz\")","v":"Michel"},{"$f":"IFERROR(IF(INDEX(A62:D62,MATCH($I$3,$A$5:$D$5,0))<>\"zz\",MAX($E$5:E61)+1,\"\"),\"\")","v":28},{"$f":"IF(ROWS(F$6:F62)<=MAX(E:E),INDEX(A:D,MATCH(ROWS(F$6:F62),E:E,0),MATCH($I$3,$A$5:$D$5,0)),\"\")","v":"Jean Mi"}]
[{"$f":"IF(Compétances!$D$1=Compétances!C54,Compétances!$B54,\"zz\")","v":"zz"},{"$f":"IF(Compétances!$D$1=Compétances!D54,Compétances!$B54,\"zz\")","v":"Jacques "},{"$f":"IF(Compétances!$D$1=Compétances!E54,Compétances!$B54,\"zz\")","v":"zz"},{"$f":"IF(Compétances!$D$1=Compétances!F54,Compétances!$B54,\"zz\")","v":"zz"},{"$f":"IFERROR(IF(INDEX(A63:D63,MATCH($I$3,$A$5:$D$5,0))<>\"zz\",MAX($E$5:E62)+1,\"\"),\"\")","v":29},{"$f":"IF(ROWS(F$6:F63)<=MAX(E:E),INDEX(A:D,MATCH(ROWS(F$6:F63),E:E,0),MATCH($I$3,$A$5:$D$5,0)),\"\")","v":"Michel"}]
[{"$f":"IF(Compétances!$D$1=Compétances!#REF!,Compétances!#REF!,\"zz\")","v":{"$error":"#REF!"}},{"$f":"IF(Compétances!$D$1=Compétances!#REF!,Compétances!#REF!,\"zz\")","v":{"$error":"#REF!"}},{"$f":"IF(Compétances!$D$1=Compétances!#REF!,Compétances!#REF!,\"zz\")","v":{"$error":"#REF!"}},{"$f":"IF(Compétances!$D$1=Compétances!#REF!,Compétances!#REF!,\"zz\")","v":{"$error":"#REF!"}},{"$f":"IFERROR(IF(INDEX(A64:D64,MATCH($I$3,$A$5:$D$5,0))<>\"zz\",MAX($E$5:E63)+1,\"\"),\"\")","v":""},{"$f":"IF(ROWS(F$6:F64)<=MAX(E:E),INDEX(A:D,MATCH(ROWS(F$6:F64),E:E,0),MATCH($I$3,$A$5:$D$5,0)),\"\")","v":"Jacques "}]
[{"$f":"IF(Compétances!$D$1=Compétances!C55,Compétances!$B55,\"zz\")","v":"Jean Mi"},{"$f":"IF(Compétances!$D$1=Compétances!D55,Compétances!$B55,\"zz\")","v":"Jean Mi"},{"$f":"IF(Compétances!$D$1=Compétances!E55,Compétances!$B55,\"zz\")","v":"Jean Mi"},{"$f":"IF(Compétances!$D$1=Compétances!F55,Compétances!$B55,\"zz\")","v":"Jean Mi"},{"$f":"IFERROR(IF(INDEX(A65:D65,MATCH($I$3,$A$5:$D$5,0))<>\"zz\",MAX($E$5:E64)+1,\"\"),\"\")","v":30},{"$f":"IF(ROWS(F$6:F65)<=MAX(E:E),INDEX(A:D,MATCH(ROWS(F$6:F65),E:E,0),MATCH($I$3,$A$5:$D$5,0)),\"\")","v":"Jean Mi"}]
[{"$f":"IF(Compétances!$D$1=Compétances!C56,Compétances!$B56,\"zz\")","v":"Eric"},{"$f":"IF(Compétances!$D$1=Compétances!D56,Compétances!$B56,\"zz\")","v":"zz"},{"$f":"IF(Compétances!$D$1=Compétances!E56,Compétances!$B56,\"zz\")","v":"Eric"},{"$f":"IF(Compétances!$D$1=Compétances!F56,Compétances!$B56,\"zz\")","v":"zz"},{"$f":"IFERROR(IF(INDEX(A66:D66,MATCH($I$3,$A$5:$D$5,0))<>\"zz\",MAX($E$5:E65)+1,\"\"),\"\")","v":""},{"$f":"IF(ROWS(F$6:F66)<=MAX(E:E),INDEX(A:D,MATCH(ROWS(F$6:F66),E:E,0),MATCH($I$3,$A$5:$D$5,0)),\"\")","v":"Michel"}]
[{"$f":"IF(Compétances!$D$1=Compétances!C57,Compétances!$B57,\"zz\")","v":"zz"},{"$f":"IF(Compétances!$D$1=Compétances!D57,Compétances!$B57,\"zz\")","v":"zz"},{"$f":"IF(Compétances!$D$1=Compétances!E57,Compétances!$B57,\"zz\")","v":"Paul "},{"$f":"IF(Compétances!$D$1=Compétances!F57,Compétances!$B57,\"zz\")","v":"zz"},{"$f":"IFERROR(IF(INDEX(A67:D67,MATCH($I$3,$A$5:$D$5,0))<>\"zz\",MAX($E$5:E66)+1,\"\"),\"\")","v":""},{"$f":"IF(ROWS(F$6:F67)<=MAX(E:E),INDEX(A:D,MATCH(ROWS(F$6:F67),E:E,0),MATCH($I$3,$A$5:$D$5,0)),\"\")","v":"Jacques "}]
[{"$f":"IF(Compétances!$D$1=Compétances!C58,Compétances!$B58,\"zz\")","v":"Michel"},{"$f":"IF(Compétances!$D$1=Compétances!D58,Compétances!$B58,\"zz\")","v":"Michel"},{"$f":"IF(Compétances!$D$1=Compétances!E58,Compétances!$B58,\"zz\")","v":"Michel"},{"$f":"IF(Compétances!$D$1=Compétances!F58,Compétances!$B58,\"zz\")","v":"Michel"},{"$f":"IFERROR(IF(INDEX(A68:D68,MATCH($I$3,$A$5:$D$5,0))<>\"zz\",MAX($E$5:E67)+1,\"\"),\"\")","v":31},{"$f":"IF(ROWS(F$6:F68)<=MAX(E:E),INDEX(A:D,MATCH(ROWS(F$6:F68),E:E,0),MATCH($I$3,$A$5:$D$5,0)),\"\")","v":"Jean Mi"}]
[{"$f":"IF(Compétances!$D$1=Compétances!C59,Compétances!$B59,\"zz\")","v":"zz"},{"$f":"IF(Compétances!$D$1=Compétances!D59,Compétances!$B59,\"zz\")","v":"Jacques "},{"$f":"IF(Compétances!$D$1=Compétances!E59,Compétances!$B59,\"zz\")","v":"zz"},{"$f":"IF(Compétances!$D$1=Compétances!F59,Compétances!$B59,\"zz\")","v":"zz"},{"$f":"IFERROR(IF(INDEX(A69:D69,MATCH($I$3,$A$5:$D$5,0))<>\"zz\",MAX($E$5:E68)+1,\"\"),\"\")","v":32},{"$f":"IF(ROWS(F$6:F69)<=MAX(E:E),INDEX(A:D,MATCH(ROWS(F$6:F69),E:E,0),MATCH($I$3,$A$5:$D$5,0)),\"\")","v":"Michel"}]
[{"$f":"IF(Compétances!$D$1=Compétances!#REF!,Compétances!#REF!,\"zz\")","v":{"$error":"#REF!"}},{"$f":"IF(Compétances!$D$1=Compétances!#REF!,Compétances!#REF!,\"zz\")","v":{"$error":"#REF!"}},{"$f":"IF(Compétances!$D$1=Compétances!#REF!,Compétances!#REF!,\"zz\")","v":{"$error":"#REF!"}},{"$f":"IF(Compétances!$D$1=Compétances!#REF!,Compétances!#REF!,\"zz\")","v":{"$error":"#REF!"}},{"$f":"IFERROR(IF(INDEX(A70:D70,MATCH($I$3,$A$5:$D$5,0))<>\"zz\",MAX($E$5:E69)+1,\"\"),\"\")","v":""},{"$f":"IF(ROWS(F$6:F70)<=MAX(E:E),INDEX(A:D,MATCH(ROWS(F$6:F70),E:E,0),MATCH($I$3,$A$5:$D$5,0)),\"\")","v":"Jacques "}]
[{"$f":"IF(Compétances!$D$1=Compétances!C60,Compétances!$B60,\"zz\")","v":"Jean Mi"},{"$f":"IF(Compétances!$D$1=Compétances!D60,Compétances!$B60,\"zz\")","v":"Jean Mi"},{"$f":"IF(Compétances!$D$1=Compétances!E60,Compétances!$B60,\"zz\")","v":"Jean Mi"},{"$f":"IF(Compétances!$D$1=Compétances!F60,Compétances!$B60,\"zz\")","v":"Jean Mi"},{"$f":"IFERROR(IF(INDEX(A71:D71,MATCH($I$3,$A$5:$D$5,0))<>\"zz\",MAX($E$5:E70)+1,\"\"),\"\")","v":33},{"$f":"IF(ROWS(F$6:F71)<=MAX(E:E),INDEX(A:D,MATCH(ROWS(F$6:F71),E:E,0),MATCH($I$3,$A$5:$D$5,0)),\"\")","v":"Jean Mi"}]
[{"$f":"IF(Compétances!$D$1=Compétances!C61,Compétances!$B61,\"zz\")","v":"Eric"},{"$f":"IF(Compétances!$D$1=Compétances!D61,Compétances!$B61,\"zz\")","v":"zz"},{"$f":"IF(Compétances!$D$1=Compétances!E61,Compétances!$B61,\"zz\")","v":"Eric"},{"$f":"IF(Compétances!$D$1=Compétances!F61,Compétances!$B61,\"zz\")","v":"zz"},{"$f":"IFERROR(IF(INDEX(A72:D72,MATCH($I$3,$A$5:$D$5,0))<>\"zz\",MAX($E$5:E71)+1,\"\"),\"\")","v":""},{"$f":"IF(ROWS(F$6:F72)<=MAX(E:E),INDEX(A:D,MATCH(ROWS(F$6:F72),E:E,0),MATCH($I$3,$A$5:$D$5,0)),\"\")","v":"Michel"}]
[{"$f":"IF(Compétances!$D$1=Compétances!C62,Compétances!$B62,\"zz\")","v":"zz"},{"$f":"IF(Compétances!$D$1=Compétances!D62,Compétances!$B62,\"zz\")","v":"zz"},{"$f":"IF(Compétances!$D$1=Compétances!E62,Compétances!$B62,\"zz\")","v":"Paul "},{"$f":"IF(Compétances!$D$1=Compétances!F62,Compétances!$B62,\"zz\")","v":"zz"},{"$f":"IFERROR(IF(INDEX(A73:D73,MATCH($I$3,$A$5:$D$5,0))<>\"zz\",MAX($E$5:E72)+1,\"\"),\"\")","v":""},{"$f":"IF(ROWS(F$6:F73)<=MAX(E:E),INDEX(A:D,MATCH(ROWS(F$6:F73),E:E,0),MATCH($I$3,$A$5:$D$5,0)),\"\")","v":"Jacques "}]
[{"$f":"IF(Compétances!$D$1=Compétances!C63,Compétances!$B63,\"zz\")","v":"Michel"},{"$f":"IF(Compétances!$D$1=Compétances!D63,Compétances!$B63,\"zz\")","v":"Michel"},{"$f":"IF(Compétances!$D$1=Compétances!E63,Compétances!$B63,\"zz\")","v":"Michel"},{"$f":"IF(Compétances!$D$1=Compétances!F63,Compétances!$B63,\"zz\")","v":"Michel"},{"$f":"IFERROR(IF(INDEX(A74:D74,MATCH($I$3,$A$5:$D$5,0))<>\"zz\",MAX($E$5:E73)+1,\"\"),\"\")","v":34},{"$f":"IF(ROWS(F$6:F74)<=MAX(E:E),INDEX(A:D,MATCH(ROWS(F$6:F74),E:E,0),MATCH($I$3,$A$5:$D$5,0)),\"\")","v":"Jean Mi"}]
[{"$f":"IF(Compétances!$D$1=Compétances!C64,Compétances!$B64,\"zz\")","v":"zz"},{"$f":"IF(Compétances!$D$1=Compétances!D64,Compétances!$B64,\"zz\")","v":"Jacques "},{"$f":"IF(Compétances!$D$1=Compétances!E64,Compétances!$B64,\"zz\")","v":"zz"},{"$f":"IF(Compétances!$D$1=Compétances!F64,Compétances!$B64,\"zz\")","v":"zz"},{"$f":"IFERROR(IF(INDEX(A75:D75,MATCH($I$3,$A$5:$D$5,0))<>\"zz\",MAX($E$5:E74)+1,\"\"),\"\")","v":35},{"$f":"IF(ROWS(F$6:F75)<=MAX(E:E),INDEX(A:D,MATCH(ROWS(F$6:F75),E:E,0),MATCH($I$3,$A$5:$D$5,0)),\"\")","v":"Michel"}]
[{"$f":"IF(Compétances!$D$1=Compétances!#REF!,Compétances!#REF!,\"zz\")","v":{"$error":"#REF!"}},{"$f":"IF(Compétances!$D$1=Compétances!#REF!,Compétances!#REF!,\"zz\")","v":{"$error":"#REF!"}},{"$f":"IF(Compétances!$D$1=Compétances!#REF!,Compétances!#REF!,\"zz\")","v":{"$error":"#REF!"}},{"$f":"IF(Compétances!$D$1=Compétances!#REF!,Compétances!#REF!,\"zz\")","v":{"$error":"#REF!"}},{"$f":"IFERROR(IF(INDEX(A76:D76,MATCH($I$3,$A$5:$D$5,0))<>\"zz\",MAX($E$5:E75)+1,\"\"),\"\")","v":""},{"$f":"IF(ROWS(F$6:F76)<=MAX(E:E),INDEX(A:D,MATCH(ROWS(F$6:F76),E:E,0),MATCH($I$3,$A$5:$D$5,0)),\"\")","v":"Jacques "}]
[{"$f":"IF(Compétances!$D$1=Compétances!C65,Compétances!$B65,\"zz\")","v":"Jean Mi"},{"$f":"IF(Compétances!$D$1=Compétances!D65,Compétances!$B65,\"zz\")","v":"Jean Mi"},{"$f":"IF(Compétances!$D$1=Compétances!E65,Compétances!$B65,\"zz\")","v":"Jean Mi"},{"$f":"IF(Compétances!$D$1=Compétances!F65,Compétances!$B65,\"zz\")","v":"Jean Mi"},{"$f":"IFERROR(IF(INDEX(A77:D77,MATCH($I$3,$A$5:$D$5,0))<>\"zz\",MAX($E$5:E76)+1,\"\"),\"\")","v":36},{"$f":"IF(ROWS(F$6:F77)<=MAX(E:E),INDEX(A:D,MATCH(ROWS(F$6:F77),E:E,0),MATCH($I$3,$A$5:$D$5,0)),\"\")","v":"Jean Mi"}]
[{"$f":"IF(Compétances!$D$1=Compétances!C66,Compétances!$B66,\"zz\")","v":"Eric"},{"$f":"IF(Compétances!$D$1=Compétances!D66,Compétances!$B66,\"zz\")","v":"zz"},{"$f":"IF(Compétances!$D$1=Compétances!E66,Compétances!$B66,\"zz\")","v":"Eric"},{"$f":"IF(Compétances!$D$1=Compétances!F66,Compétances!$B66,\"zz\")","v":"zz"},{"$f":"IFERROR(IF(INDEX(A78:D78,MATCH($I$3,$A$5:$D$5,0))<>\"zz\",MAX($E$5:E77)+1,\"\"),\"\")","v":""},{"$f":"IF(ROWS(F$6:F78)<=MAX(E:E),INDEX(A:D,MATCH(ROWS(F$6:F78),E:E,0),MATCH($I$3,$A$5:$D$5,0)),\"\")","v":"Michel"}]
[{"$f":"IF(Compétances!$D$1=Compétances!C67,Compétances!$B67,\"zz\")","v":"zz"},{"$f":"IF(Compétances!$D$1=Compétances!D67,Compétances!$B67,\"zz\")","v":"zz"},{"$f":"IF(Compétances!$D$1=Compétances!E67,Compétances!$B67,\"zz\")","v":"Paul "},{"$f":"IF(Compétances!$D$1=Compétances!F67,Compétances!$B67,\"zz\")","v":"zz"},{"$f":"IFERROR(IF(INDEX(A79:D79,MATCH($I$3,$A$5:$D$5,0))<>\"zz\",MAX($E$5:E78)+1,\"\"),\"\")","v":""},{"$f":"IF(ROWS(F$6:F79)<=MAX(E:E),INDEX(A:D,MATCH(ROWS(F$6:F79),E:E,0),MATCH($I$3,$A$5:$D$5,0)),\"\")","v":"Jacques "}]
[{"$f":"IF(Compétances!$D$1=Compétances!C68,Compétances!$B68,\"zz\")","v":"Michel"},{"$f":"IF(Compétances!$D$1=Compétances!D68,Compétances!$B68,\"zz\")","v":"Michel"},{"$f":"IF(Compétances!$D$1=Compétances!E68,Compétances!$B68,\"zz\")","v":"Michel"},{"$f":"IF(Compétances!$D$1=Compétances!F68,Compétances!$B68,\"zz\")","v":"Michel"},{"$f":"IFERROR(IF(INDEX(A80:D80,MATCH($I$3,$A$5:$D$5,0))<>\"zz\",MAX($E$5:E79)+1,\"\"),\"\")","v":37},{"$f":"IF(ROWS(F$6:F80)<=MAX(E:E),INDEX(A:D,MATCH(ROWS(F$6:F80),E:E,0),MATCH($I$3,$A$5:$D$5,0)),\"\")","v":"Jean Mi"}]
[{"$f":"IF(Compétances!$D$1=Compétances!C69,Compétances!$B69,\"zz\")","v":"zz"},{"$f":"IF(Compétances!$D$1=Compétances!D69,Compétances!$B69,\"zz\")","v":"Jacques "},{"$f":"IF(Compétances!$D$1=Compétances!E69,Compétances!$B69,\"zz\")","v":"zz"},{"$f":"IF(Compétances!$D$1=Compétances!F69,Compétances!$B69,\"zz\")","v":"zz"},{"$f":"IFERROR(IF(INDEX(A81:D81,MATCH($I$3,$A$5:$D$5,0))<>\"zz\",MAX($E$5:E80)+1,\"\"),\"\")","v":38},{"$f":"IF(ROWS(F$6:F81)<=MAX(E:E),INDEX(A:D,MATCH(ROWS(F$6:F81),E:E,0),MATCH($I$3,$A$5:$D$5,0)),\"\")","v":"Michel"}]
[{"$f":"IF(Compétances!$D$1=Compétances!#REF!,Compétances!#REF!,\"zz\")","v":{"$error":"#REF!"}},{"$f":"IF(Compétances!$D$1=Compétances!#REF!,Compétances!#REF!,\"zz\")","v":{"$error":"#REF!"}},{"$f":"IF(Compétances!$D$1=Compétances!#REF!,Compétances!#REF!,\"zz\")","v":{"$error":"#REF!"}},{"$f":"IF(Compétances!$D$1=Compétances!#REF!,Compétances!#REF!,\"zz\")","v":{"$error":"#REF!"}},{"$f":"IFERROR(IF(INDEX(A82:D82,MATCH($I$3,$A$5:$D$5,0))<>\"zz\",MAX($E$5:E81)+1,\"\"),\"\")","v":""},{"$f":"IF(ROWS(F$6:F82)<=MAX(E:E),INDEX(A:D,MATCH(ROWS(F$6:F82),E:E,0),MATCH($I$3,$A$5:$D$5,0)),\"\")","v":"Jacques "}]
[{"$f":"IF(Compétances!$D$1=Compétances!C70,Compétances!$B70,\"zz\")","v":"Jean Mi"},{"$f":"IF(Compétances!$D$1=Compétances!D70,Compétances!$B70,\"zz\")","v":"Jean Mi"},{"$f":"IF(Compétances!$D$1=Compétances!E70,Compétances!$B70,\"zz\")","v":"Jean Mi"},{"$f":"IF(Compétances!$D$1=Compétances!F70,Compétances!$B70,\"zz\")","v":"Jean Mi"},{"$f":"IFERROR(IF(INDEX(A83:D83,MATCH($I$3,$A$5:$D$5,0))<>\"zz\",MAX($E$5:E82)+1,\"\"),\"\")","v":39},{"$f":"IF(ROWS(F$6:F83)<=MAX(E:E),INDEX(A:D,MATCH(ROWS(F$6:F83),E:E,0),MATCH($I$3,$A$5:$D$5,0)),\"\")","v":"Jean Mi"}]
[{"$f":"IF(Compétances!$D$1=Compétances!C71,Compétances!$B71,\"zz\")","v":"Eric"},{"$f":"IF(Compétances!$D$1=Compétances!D71,Compétances!$B71,\"zz\")","v":"zz"},{"$f":"IF(Compétances!$D$1=Compétances!E71,Compétances!$B71,\"zz\")","v":"Eric"},{"$f":"IF(Compétances!$D$1=Compétances!F71,Compétances!$B71,\"zz\")","v":"zz"},{"$f":"IFERROR(IF(INDEX(A84:D84,MATCH($I$3,$A$5:$D$5,0))<>\"zz\",MAX($E$5:E83)+1,\"\"),\"\")","v":""},{"$f":"IF(ROWS(F$6:F84)<=MAX(E:E),INDEX(A:D,MATCH(ROWS(F$6:F84),E:E,0),MATCH($I$3,$A$5:$D$5,0)),\"\")","v":"Michel"}]
[{"$f":"IF(Compétances!$D$1=Compétances!C72,Compétances!$B72,\"zz\")","v":"zz"},{"$f":"IF(Compétances!$D$1=Compétances!D72,Compétances!$B72,\"zz\")","v":"zz"},{"$f":"IF(Compétances!$D$1=Compétances!E72,Compétances!$B72,\"zz\")","v":"Paul "},{"$f":"IF(Compétances!$D$1=Compétances!F72,Compétances!$B72,\"zz\")","v":"zz"},{"$f":"IFERROR(IF(INDEX(A85:D85,MATCH($I$3,$A$5:$D$5,0))<>\"zz\",MAX($E$5:E84)+1,\"\"),\"\")","v":""},{"$f":"IF(ROWS(F$6:F85)<=MAX(E:E),INDEX(A:D,MATCH(ROWS(F$6:F85),E:E,0),MATCH($I$3,$A$5:$D$5,0)),\"\")","v":"Jacques "}]
[{"$f":"IF(Compétances!$D$1=Compétances!C73,Compétances!$B73,\"zz\")","v":"Michel"},{"$f":"IF(Compétances!$D$1=Compétances!D73,Compétances!$B73,\"zz\")","v":"Michel"},{"$f":"IF(Compétances!$D$1=Compétances!E73,Compétances!$B73,\"zz\")","v":"Michel"},{"$f":"IF(Compétances!$D$1=Compétances!F73,Compétances!$B73,\"zz\")","v":"Michel"},{"$f":"IFERROR(IF(INDEX(A86:D86,MATCH($I$3,$A$5:$D$5,0))<>\"zz\",MAX($E$5:E85)+1,\"\"),\"\")","v":40},{"$f":"IF(ROWS(F$6:F86)<=MAX(E:E),INDEX(A:D,MATCH(ROWS(F$6:F86),E:E,0),MATCH($I$3,$A$5:$D$5,0)),\"\")","v":"Jean Mi"}]
[{"$f":"IF(Compétances!$D$1=Compétances!C74,Compétances!$B74,\"zz\")","v":"zz"},{"$f":"IF(Compétances!$D$1=Compétances!D74,Compétances!$B74,\"zz\")","v":"Jacques "},{"$f":"IF(Compétances!$D$1=Compétances!E74,Compétances!$B74,\"zz\")","v":"zz"},{"$f":"IF(Compétances!$D$1=Compétances!F74,Compétances!$B74,\"zz\")","v":"zz"},{"$f":"IFERROR(IF(INDEX(A87:D87,MATCH($I$3,$A$5:$D$5,0))<>\"zz\",MAX($E$5:E86)+1,\"\"),\"\")","v":41},{"$f":"IF(ROWS(F$6:F87)<=MAX(E:E),INDEX(A:D,MATCH(ROWS(F$6:F87),E:E,0),MATCH($I$3,$A$5:$D$5,0)),\"\")","v":"Michel"}]
[{"$f":"IF(Compétances!$D$1=Compétances!#REF!,Compétances!#REF!,\"zz\")","v":{"$error":"#REF!"}},{"$f":"IF(Compétances!$D$1=Compétances!#REF!,Compétances!#REF!,\"zz\")","v":{"$error":"#REF!"}},{"$f":"IF(Compétances!$D$1=Compétances!#REF!,Compétances!#REF!,\"zz\")","v":{"$error":"#REF!"}},{"$f":"IF(Compétances!$D$1=Compétances!#REF!,Compétances!#REF!,\"zz\")","v":{"$error":"#REF!"}},{"$f":"IFERROR(IF(INDEX(A88:D88,MATCH($I$3,$A$5:$D$5,0))<>\"zz\",MAX($E$5:E87)+1,\"\"),\"\")","v":""},{"$f":"IF(ROWS(F$6:F88)<=MAX(E:E),INDEX(A:D,MATCH(ROWS(F$6:F88),E:E,0),MATCH($I$3,$A$5:$D$5,0)),\"\")","v":"Jacques "}]
[{"$f":"IF(Compétances!$D$1=Compétances!C75,Compétances!$B75,\"zz\")","v":"Jean Mi"},{"$f":"IF(Compétances!$D$1=Compétances!D75,Compétances!$B75,\"zz\")","v":"Jean Mi"},{"$f":"IF(Compétances!$D$1=Compétances!E75,Compétances!$B75,\"zz\")","v":"Jean Mi"},{"$f":"IF(Compétances!$D$1=Compétances!F75,Compétances!$B75,\"zz\")","v":"Jean Mi"},{"$f":"IFERROR(IF(INDEX(A89:D89,MATCH($I$3,$A$5:$D$5,0))<>\"zz\",MAX($E$5:E88)+1,\"\"),\"\")","v":42},{"$f":"IF(ROWS(F$6:F89)<=MAX(E:E),INDEX(A:D,MATCH(ROWS(F$6:F89),E:E,0),MATCH($I$3,$A$5:$D$5,0)),\"\")","v":"Jean Mi"}]
[{"$f":"IF(Compétances!$D$1=Compétances!C76,Compétances!$B76,\"zz\")","v":"Eric"},{"$f":"IF(Compétances!$D$1=Compétances!D76,Compétances!$B76,\"zz\")","v":"zz"},{"$f":"IF(Compétances!$D$1=Compétances!E76,Compétances!$B76,\"zz\")","v":"Eric"},{"$f":"IF(Compétances!$D$1=Compétances!F76,Compétances!$B76,\"zz\")","v":"zz"},{"$f":"IFERROR(IF(INDEX(A90:D90,MATCH($I$3,$A$5:$D$5,0))<>\"zz\",MAX($E$5:E89)+1,\"\"),\"\")","v":""},{"$f":"IF(ROWS(F$6:F90)<=MAX(E:E),INDEX(A:D,MATCH(ROWS(F$6:F90),E:E,0),MATCH($I$3,$A$5:$D$5,0)),\"\")","v":"Michel"}]
[{"$f":"IF(Compétances!$D$1=Compétances!C77,Compétances!$B77,\"zz\")","v":"zz"},{"$f":"IF(Compétances!$D$1=Compétances!D77,Compétances!$B77,\"zz\")","v":"zz"},{"$f":"IF(Compétances!$D$1=Compétances!E77,Compétances!$B77,\"zz\")","v":"Paul "},{"$f":"IF(Compétances!$D$1=Compétances!F77,Compétances!$B77,\"zz\")","v":"zz"},{"$f":"IFERROR(IF(INDEX(A91:D91,MATCH($I$3,$A$5:$D$5,0))<>\"zz\",MAX($E$5:E90)+1,\"\"),\"\")","v":""},{"$f":"IF(ROWS(F$6:F91)<=MAX(E:E),INDEX(A:D,MATCH(ROWS(F$6:F91),E:E,0),MATCH($I$3,$A$5:$D$5,0)),\"\")","v":"Jacques "}]
[{"$f":"IF(Compétances!$D$1=Compétances!C78,Compétances!$B78,\"zz\")","v":"Michel"},{"$f":"IF(Compétances!$D$1=Compétances!D78,Compétances!$B78,\"zz\")","v":"Michel"},{"$f":"IF(Compétances!$D$1=Compétances!E78,Compétances!$B78,\"zz\")","v":"Michel"},{"$f":"IF(Compétances!$D$1=Compétances!F78,Compétances!$B78,\"zz\")","v":"Michel"},{"$f":"IFERROR(IF(INDEX(A92:D92,MATCH($I$3,$A$5:$D$5,0))<>\"zz\",MAX($E$5:E91)+1,\"\"),\"\")","v":43},{"$f":"IF(ROWS(F$6:F92)<=MAX(E:E),INDEX(A:D,MATCH(ROWS(F$6:F92),E:E,0),MATCH($I$3,$A$5:$D$5,0)),\"\")","v":"Jean Mi"}]
[{"$f":"IF(Compétances!$D$1=Compétances!C79,Compétances!$B79,\"zz\")","v":"zz"},{"$f":"IF(Compétances!$D$1=Compétances!D79,Compétances!$B79,\"zz\")","v":"Jacques "},{"$f":"IF(Compétances!$D$1=Compétances!E79,Compétances!$B79,\"zz\")","v":"zz"},{"$f":"IF(Compétances!$D$1=Compétances!F79,Compétances!$B79,\"zz\")","v":"zz"},{"$f":"IFERROR(IF(INDEX(A93:D93,MATCH($I$3,$A$5:$D$5,0))<>\"zz\",MAX($E$5:E92)+1,\"\"),\"\")","v":44},{"$f":"IF(ROWS(F$6:F93)<=MAX(E:E),INDEX(A:D,MATCH(ROWS(F$6:F93),E:E,0),MATCH($I$3,$A$5:$D$5,0)),\"\")","v":"Michel"}]
[{"$f":"IF(Compétances!$D$1=Compétances!#REF!,Compétances!#REF!,\"zz\")","v":{"$error":"#REF!"}},{"$f":"IF(Compétances!$D$1=Compétances!#REF!,Compétances!#REF!,\"zz\")","v":{"$error":"#REF!"}},{"$f":"IF(Compétances!$D$1=Compétances!#REF!,Compétances!#REF!,\"zz\")","v":{"$error":"#REF!"}},{"$f":"IF(Compétances!$D$1=Compétances!#REF!,Compétances!#REF!,\"zz\")","v":{"$error":"#REF!"}},{"$f":"IFERROR(IF(INDEX(A94:D94,MATCH($I$3,$A$5:$D$5,0))<>\"zz\",MAX($E$5:E93)+1,\"\"),\"\")","v":""},{"$f":"IF(ROWS(F$6:F94)<=MAX(E:E),INDEX(A:D,MATCH(ROWS(F$6:F94),E:E,0),MATCH($I$3,$A$5:$D$5,0)),\"\")","v":"Jacques "}]
[{"$f":"IF(Compétances!$D$1=Compétances!C80,Compétances!$B80,\"zz\")","v":"Jean Mi"},{"$f":"IF(Compétances!$D$1=Compétances!D80,Compétances!$B80,\"zz\")","v":"Jean Mi"},{"$f":"IF(Compétances!$D$1=Compétances!E80,Compétances!$B80,\"zz\")","v":"Jean Mi"},{"$f":"IF(Compétances!$D$1=Compétances!F80,Compétances!$B80,\"zz\")","v":"Jean Mi"},{"$f":"IFERROR(IF(INDEX(A95:D95,MATCH($I$3,$A$5:$D$5,0))<>\"zz\",MAX($E$5:E94)+1,\"\"),\"\")","v":45},{"$f":"IF(ROWS(F$6:F95)<=MAX(E:E),INDEX(A:D,MATCH(ROWS(F$6:F95),E:E,0),MATCH($I$3,$A$5:$D$5,0)),\"\")","v":"Jean Mi"}]
[{"$f":"IF(Compétances!$D$1=Compétances!C81,Compétances!$B81,\"zz\")","v":"Eric"},{"$f":"IF(Compétances!$D$1=Compétances!D81,Compétances!$B81,\"zz\")","v":"zz"},{"$f":"IF(Compétances!$D$1=Compétances!E81,Compétances!$B81,\"zz\")","v":"Eric"},{"$f":"IF(Compétances!$D$1=Compétances!F81,Compétances!$B81,\"zz\")","v":"zz"},{"$f":"IFERROR(IF(INDEX(A96:D96,MATCH($I$3,$A$5:$D$5,0))<>\"zz\",MAX($E$5:E95)+1,\"\"),\"\")","v":""},{"$f":"IF(ROWS(F$6:F96)<=MAX(E:E),INDEX(A:D,MATCH(ROWS(F$6:F96),E:E,0),MATCH($I$3,$A$5:$D$5,0)),\"\")","v":"Michel"}]
[{"$f":"IF(Compétances!$D$1=Compétances!C82,Compétances!$B82,\"zz\")","v":"zz"},{"$f":"IF(Compétances!$D$1=Compétances!D82,Compétances!$B82,\"zz\")","v":"zz"},{"$f":"IF(Compétances!$D$1=Compétances!E82,Compétances!$B82,\"zz\")","v":"Paul "},{"$f":"IF(Compétances!$D$1=Compétances!F82,Compétances!$B82,\"zz\")","v":"zz"},{"$f":"IFERROR(IF(INDEX(A97:D97,MATCH($I$3,$A$5:$D$5,0))<>\"zz\",MAX($E$5:E96)+1,\"\"),\"\")","v":""},{"$f":"IF(ROWS(F$6:F97)<=MAX(E:E),INDEX(A:D,MATCH(ROWS(F$6:F97),E:E,0),MATCH($I$3,$A$5:$D$5,0)),\"\")","v":"Jacques "}]
[{"$f":"IF(Compétances!$D$1=Compétances!C83,Compétances!$B83,\"zz\")","v":"Michel"},{"$f":"IF(Compétances!$D$1=Compétances!D83,Compétances!$B83,\"zz\")","v":"Michel"},{"$f":"IF(Compétances!$D$1=Compétances!E83,Compétances!$B83,\"zz\")","v":"Michel"},{"$f":"IF(Compétances!$D$1=Compétances!F83,Compétances!$B83,\"zz\")","v":"Michel"},{"$f":"IFERROR(IF(INDEX(A98:D98,MATCH($I$3,$A$5:$D$5,0))<>\"zz\",MAX($E$5:E97)+1,\"\"),\"\")","v":46},{"$f":"IF(ROWS(F$6:F98)<=MAX(E:E),INDEX(A:D,MATCH(ROWS(F$6:F98),E:E,0),MATCH($I$3,$A$5:$D$5,0)),\"\")","v":"Jean Mi"}]
[{"$f":"IF(Compétances!$D$1=Compétances!C84,Compétances!$B84,\"zz\")","v":"zz"},{"$f":"IF(Compétances!$D$1=Compétances!D84,Compétances!$B84,\"zz\")","v":"Jacques "},{"$f":"IF(Compétances!$D$1=Compétances!E84,Compétances!$B84,\"zz\")","v":"zz"},{"$f":"IF(Compétances!$D$1=Compétances!F84,Compétances!$B84,\"zz\")","v":"zz"},{"$f":"IFERROR(IF(INDEX(A99:D99,MATCH($I$3,$A$5:$D$5,0))<>\"zz\",MAX($E$5:E98)+1,\"\"),\"\")","v":47},{"$f":"IF(ROWS(F$6:F99)<=MAX(E:E),INDEX(A:D,MATCH(ROWS(F$6:F99),E:E,0),MATCH($I$3,$A$5:$D$5,0)),\"\")","v":"Michel"}]
[{"$f":"IF(Compétances!$D$1=Compétances!#REF!,Compétances!#REF!,\"zz\")","v":{"$error":"#REF!"}},{"$f":"IF(Compétances!$D$1=Compétances!#REF!,Compétances!#REF!,\"zz\")","v":{"$error":"#REF!"}},{"$f":"IF(Compétances!$D$1=Compétances!#REF!,Compétances!#REF!,\"zz\")","v":{"$error":"#REF!"}},{"$f":"IF(Compétances!$D$1=Compétances!#REF!,Compétances!#REF!,\"zz\")","v":{"$error":"#REF!"}},{"$f":"IFERROR(IF(INDEX(A100:D100,MATCH($I$3,$A$5:$D$5,0))<>\"zz\",MAX($E$5:E99)+1,\"\"),\"\")","v":""},{"$f":"IF(ROWS(F$6:F100)<=MAX(E:E),INDEX(A:D,MATCH(ROWS(F$6:F100),E:E,0),MATCH($I$3,$A$5:$D$5,0)),\"\")","v":"Jacques "}]
[{"$f":"IF(Compétances!$D$1=Compétances!C85,Compétances!$B85,\"zz\")","v":"Jean Mi"},{"$f":"IF(Compétances!$D$1=Compétances!D85,Compétances!$B85,\"zz\")","v":"Jean Mi"},{"$f":"IF(Compétances!$D$1=Compétances!E85,Compétances!$B85,\"zz\")","v":"Jean Mi"},{"$f":"IF(Compétances!$D$1=Compétances!F85,Compétances!$B85,\"zz\")","v":"Jean Mi"},{"$f":"IFERROR(IF(INDEX(A101:D101,MATCH($I$3,$A$5:$D$5,0))<>\"zz\",MAX($E$5:E100)+1,\"\"),\"\")","v":48},{"$f":"IF(ROWS(F$6:F101)<=MAX(E:E),INDEX(A:D,MATCH(ROWS(F$6:F101),E:E,0),MATCH($I$3,$A$5:$D$5,0)),\"\")","v":"Jean Mi"}]
[{"$f":"IF(Compétances!$D$1=Compétances!C86,Compétances!$B86,\"zz\")","v":"Eric"},{"$f":"IF(Compétances!$D$1=Compétances!D86,Compétances!$B86,\"zz\")","v":"zz"},{"$f":"IF(Compétances!$D$1=Compétances!E86,Compétances!$B86,\"zz\")","v":"Eric"},{"$f":"IF(Compétances!$D$1=Compétances!F86,Compétances!$B86,\"zz\")","v":"zz"},{"$f":"IFERROR(IF(INDEX(A102:D102,MATCH($I$3,$A$5:$D$5,0))<>\"zz\",MAX($E$5:E101)+1,\"\"),\"\")","v":""},{"$f":"IF(ROWS(F$6:F102)<=MAX(E:E),INDEX(A:D,MATCH(ROWS(F$6:F102),E:E,0),MATCH($I$3,$A$5:$D$5,0)),\"\")","v":"Michel"}]
[{"$f":"IF(Compétances!$D$1=Compétances!C87,Compétances!$B87,\"zz\")","v":"zz"},{"$f":"IF(Compétances!$D$1=Compétances!D87,Compétances!$B87,\"zz\")","v":"zz"},{"$f":"IF(Compétances!$D$1=Compétances!E87,Compétances!$B87,\"zz\")","v":"Paul "},{"$f":"IF(Compétances!$D$1=Compétances!F87,Compétances!$B87,\"zz\")","v":"zz"},{"$f":"IFERROR(IF(INDEX(A103:D103,MATCH($I$3,$A$5:$D$5,0))<>\"zz\",MAX($E$5:E102)+1,\"\"),\"\")","v":""},{"$f":"IF(ROWS(F$6:F103)<=MAX(E:E),INDEX(A:D,MATCH(ROWS(F$6:F103),E:E,0),MATCH($I$3,$A$5:$D$5,0)),\"\")","v":"Jacques "}]
[{"$f":"IF(Compétances!$D$1=Compétances!C88,Compétances!$B88,\"zz\")","v":"Michel"},{"$f":"IF(Compétances!$D$1=Compétances!D88,Compétances!$B88,\"zz\")","v":"Michel"},{"$f":"IF(Compétances!$D$1=Compétances!E88,Compétances!$B88,\"zz\")","v":"Michel"},{"$f":"IF(Compétances!$D$1=Compétances!F88,Compétances!$B88,\"zz\")","v":"Michel"},{"$f":"IFERROR(IF(INDEX(A104:D104,MATCH($I$3,$A$5:$D$5,0))<>\"zz\",MAX($E$5:E103)+1,\"\"),\"\")","v":49},{"$f":"IF(ROWS(F$6:F104)<=MAX(E:E),INDEX(A:D,MATCH(ROWS(F$6:F104),E:E,0),MATCH($I$3,$A$5:$D$5,0)),\"\")","v":"Jean Mi"}]
[{"$f":"IF(Compétances!$D$1=Compétances!C89,Compétances!$B89,\"zz\")","v":"zz"},{"$f":"IF(Compétances!$D$1=Compétances!D89,Compétances!$B89,\"zz\")","v":"Jacques "},{"$f":"IF(Compétances!$D$1=Compétances!E89,Compétances!$B89,\"zz\")","v":"zz"},{"$f":"IF(Compétances!$D$1=Compétances!F89,Compétances!$B89,\"zz\")","v":"zz"},{"$f":"IFERROR(IF(INDEX(A105:D105,MATCH($I$3,$A$5:$D$5,0))<>\"zz\",MAX($E$5:E104)+1,\"\"),\"\")","v":50},{"$f":"IF(ROWS(F$6:F105)<=MAX(E:E),INDEX(A:D,MATCH(ROWS(F$6:F105),E:E,0),MATCH($I$3,$A$5:$D$5,0)),\"\")","v":"Michel"}]
[{"$f":"IF(Compétances!$D$1=Compétances!#REF!,Compétances!#REF!,\"zz\")","v":{"$error":"#REF!"}},{"$f":"IF(Compétances!$D$1=Compétances!#REF!,Compétances!#REF!,\"zz\")","v":{"$error":"#REF!"}},{"$f":"IF(Compétances!$D$1=Compétances!#REF!,Compétances!#REF!,\"zz\")","v":{"$error":"#REF!"}},{"$f":"IF(Compétances!$D$1=Compétances!#REF!,Compétances!#REF!,\"zz\")","v":{"$error":"#REF!"}},{"$f":"IFERROR(IF(INDEX(A106:D106,MATCH($I$3,$A$5:$D$5,0))<>\"zz\",MAX($E$5:E105)+1,\"\"),\"\")","v":""},{"$f":"IF(ROWS(F$6:F106)<=MAX(E:E),INDEX(A:D,MATCH(ROWS(F$6:F106),E:E,0),MATCH($I$3,$A$5:$D$5,0)),\"\")","v":"Jacques "}]
[{"$f":"IF(Compétances!$D$1=Compétances!C90,Compétances!$B90,\"zz\")","v":"Jean Mi"},{"$f":"IF(Compétances!$D$1=Compétances!D90,Compétances!$B90,\"zz\")","v":"Jean Mi"},{"$f":"IF(Compétances!$D$1=Compétances!E90,Compétances!$B90,\"zz\")","v":"Jean Mi"},{"$f":"IF(Compétances!$D$1=Compétances!F90,Compétances!$B90,\"zz\")","v":"Jean Mi"},{"$f":"IFERROR(IF(INDEX(A107:D107,MATCH($I$3,$A$5:$D$5,0))<>\"zz\",MAX($E$5:E106)+1,\"\"),\"\")","v":51},{"$f":"IF(ROWS(F$6:F107)<=MAX(E:E),INDEX(A:D,MATCH(ROWS(F$6:F107),E:E,0),MATCH($I$3,$A$5:$D$5,0)),\"\")","v":"Jean Mi"}]
[{"$f":"IF(Compétances!$D$1=Compétances!C91,Compétances!$B91,\"zz\")","v":"Eric"},{"$f":"IF(Compétances!$D$1=Compétances!D91,Compétances!$B91,\"zz\")","v":"zz"},{"$f":"IF(Compétances!$D$1=Compétances!E91,Compétances!$B91,\"zz\")","v":"Eric"},{"$f":"IF(Compétances!$D$1=Compétances!F91,Compétances!$B91,\"zz\")","v":"zz"},{"$f":"IFERROR(IF(INDEX(A108:D108,MATCH($I$3,$A$5:$D$5,0))<>\"zz\",MAX($E$5:E107)+1,\"\"),\"\")","v":""},{"$f":"IF(ROWS(F$6:F108)<=MAX(E:E),INDEX(A:D,MATCH(ROWS(F$6:F108),E:E,0),MATCH($I$3,$A$5:$D$5,0)),\"\")","v":"Michel"}]
[{"$f":"IF(Compétances!$D$1=Compétances!C92,Compétances!$B92,\"zz\")","v":"zz"},{"$f":"IF(Compétances!$D$1=Compétances!D92,Compétances!$B92,\"zz\")","v":"zz"},{"$f":"IF(Compétances!$D$1=Compétances!E92,Compétances!$B92,\"zz\")","v":"Paul "},{"$f":"IF(Compétances!$D$1=Compétances!F92,Compétances!$B92,\"zz\")","v":"zz"},{"$f":"IFERROR(IF(INDEX(A109:D109,MATCH($I$3,$A$5:$D$5,0))<>\"zz\",MAX($E$5:E108)+1,\"\"),\"\")","v":""},{"$f":"IF(ROWS(F$6:F109)<=MAX(E:E),INDEX(A:D,MATCH(ROWS(F$6:F109),E:E,0),MATCH($I$3,$A$5:$D$5,0)),\"\")","v":"Jacques "}]
[{"$f":"IF(Compétances!$D$1=Compétances!C93,Compétances!$B93,\"zz\")","v":"Michel"},{"$f":"IF(Compétances!$D$1=Compétances!D93,Compétances!$B93,\"zz\")","v":"Michel"},{"$f":"IF(Compétances!$D$1=Compétances!E93,Compétances!$B93,\"zz\")","v":"Michel"},{"$f":"IF(Compétances!$D$1=Compétances!F93,Compétances!$B93,\"zz\")","v":"Michel"},{"$f":"IFERROR(IF(INDEX(A110:D110,MATCH($I$3,$A$5:$D$5,0))<>\"zz\",MAX($E$5:E109)+1,\"\"),\"\")","v":52},{"$f":"IF(ROWS(F$6:F110)<=MAX(E:E),INDEX(A:D,MATCH(ROWS(F$6:F110),E:E,0),MATCH($I$3,$A$5:$D$5,0)),\"\")","v":"Jean Mi"}]
[{"$f":"IF(Compétances!$D$1=Compétances!C94,Compétances!$B94,\"zz\")","v":"zz"},{"$f":"IF(Compétances!$D$1=Compétances!D94,Compétances!$B94,\"zz\")","v":"Jacques "},{"$f":"IF(Compétances!$D$1=Compétances!E94,Compétances!$B94,\"zz\")","v":"zz"},{"$f":"IF(Compétances!$D$1=Compétances!F94,Compétances!$B94,\"zz\")","v":"zz"},{"$f":"IFERROR(IF(INDEX(A111:D111,MATCH($I$3,$A$5:$D$5,0))<>\"zz\",MAX($E$5:E110)+1,\"\"),\"\")","v":53},{"$f":"IF(ROWS(F$6:F111)<=MAX(E:E),INDEX(A:D,MATCH(ROWS(F$6:F111),E:E,0),MATCH($I$3,$A$5:$D$5,0)),\"\")","v":"Michel"}]
[{"$f":"IF(Compétances!$D$1=Compétances!#REF!,Compétances!#REF!,\"zz\")","v":{"$error":"#REF!"}},{"$f":"IF(Compétances!$D$1=Compétances!#REF!,Compétances!#REF!,\"zz\")","v":{"$error":"#REF!"}},{"$f":"IF(Compétances!$D$1=Compétances!#REF!,Compétances!#REF!,\"zz\")","v":{"$error":"#REF!"}},{"$f":"IF(Compétances!$D$1=Compétances!#REF!,Compétances!#REF!,\"zz\")","v":{"$error":"#REF!"}},{"$f":"IFERROR(IF(INDEX(A112:D112,MATCH($I$3,$A$5:$D$5,0))<>\"zz\",MAX($E$5:E111)+1,\"\"),\"\")","v":""},{"$f":"IF(ROWS(F$6:F112)<=MAX(E:E),INDEX(A:D,MATCH(ROWS(F$6:F112),E:E,0),MATCH($I$3,$A$5:$D$5,0)),\"\")","v":"Jacques "}]
[{"$f":"IF(Compétances!$D$1=Compétances!C95,Compétances!$B95,\"zz\")","v":"Jean Mi"},{"$f":"IF(Compétances!$D$1=Compétances!D95,Compétances!$B95,\"zz\")","v":"Jean Mi"},{"$f":"IF(Compétances!$D$1=Compétances!E95,Compétances!$B95,\"zz\")","v":"Jean Mi"},{"$f":"IF(Compétances!$D$1=Compétances!F95,Compétances!$B95,\"zz\")","v":"Jean Mi"},{"$f":"IFERROR(IF(INDEX(A113:D113,MATCH($I$3,$A$5:$D$5,0))<>\"zz\",MAX($E$5:E112)+1,\"\"),\"\")","v":54},{"$f":"IF(ROWS(F$6:F113)<=MAX(E:E),INDEX(A:D,MATCH(ROWS(F$6:F113),E:E,0),MATCH($I$3,$A$5:$D$5,0)),\"\")","v":"Jean Mi"}]
[{"$f":"IF(Compétances!$D$1=Compétances!C96,Compétances!$B96,\"zz\")","v":"Eric"},{"$f":"IF(Compétances!$D$1=Compétances!D96,Compétances!$B96,\"zz\")","v":"zz"},{"$f":"IF(Compétances!$D$1=Compétances!E96,Compétances!$B96,\"zz\")","v":"Eric"},{"$f":"IF(Compétances!$D$1=Compétances!F96,Compétances!$B96,\"zz\")","v":"zz"},{"$f":"IFERROR(IF(INDEX(A114:D114,MATCH($I$3,$A$5:$D$5,0))<>\"zz\",MAX($E$5:E113)+1,\"\"),\"\")","v":""},{"$f":"IF(ROWS(F$6:F114)<=MAX(E:E),INDEX(A:D,MATCH(ROWS(F$6:F114),E:E,0),MATCH($I$3,$A$5:$D$5,0)),\"\")","v":"Michel"}]
[{"$f":"IF(Compétances!$D$1=Compétances!C97,Compétances!$B97,\"zz\")","v":"zz"},{"$f":"IF(Compétances!$D$1=Compétances!D97,Compétances!$B97,\"zz\")","v":"zz"},{"$f":"IF(Compétances!$D$1=Compétances!E97,Compétances!$B97,\"zz\")","v":"Paul "},{"$f":"IF(Compétances!$D$1=Compétances!F97,Compétances!$B97,\"zz\")","v":"zz"},{"$f":"IFERROR(IF(INDEX(A115:D115,MATCH($I$3,$A$5:$D$5,0))<>\"zz\",MAX($E$5:E114)+1,\"\"),\"\")","v":""},{"$f":"IF(ROWS(F$6:F115)<=MAX(E:E),INDEX(A:D,MATCH(ROWS(F$6:F115),E:E,0),MATCH($I$3,$A$5:$D$5,0)),\"\")","v":"Jacques "}]
[{"$f":"IF(Compétances!$D$1=Compétances!C98,Compétances!$B98,\"zz\")","v":"Michel"},{"$f":"IF(Compétances!$D$1=Compétances!D98,Compétances!$B98,\"zz\")","v":"Michel"},{"$f":"IF(Compétances!$D$1=Compétances!E98,Compétances!$B98,\"zz\")","v":"Michel"},{"$f":"IF(Compétances!$D$1=Compétances!F98,Compétances!$B98,\"zz\")","v":"Michel"},{"$f":"IFERROR(IF(INDEX(A116:D116,MATCH($I$3,$A$5:$D$5,0))<>\"zz\",MAX($E$5:E115)+1,\"\"),\"\")","v":55},{"$f":"IF(ROWS(F$6:F116)<=MAX(E:E),INDEX(A:D,MATCH(ROWS(F$6:F116),E:E,0),MATCH($I$3,$A$5:$D$5,0)),\"\")","v":"Jean Mi"}]
[{"$f":"IF(Compétances!$D$1=Compétances!C99,Compétances!$B99,\"zz\")","v":"zz"},{"$f":"IF(Compétances!$D$1=Compétances!D99,Compétances!$B99,\"zz\")","v":"Jacques "},{"$f":"IF(Compétances!$D$1=Compétances!E99,Compétances!$B99,\"zz\")","v":"zz"},{"$f":"IF(Compétances!$D$1=Compétances!F99,Compétances!$B99,\"zz\")","v":"zz"},{"$f":"IFERROR(IF(INDEX(A117:D117,MATCH($I$3,$A$5:$D$5,0))<>\"zz\",MAX($E$5:E116)+1,\"\"),\"\")","v":56},{"$f":"IF(ROWS(F$6:F117)<=MAX(E:E),INDEX(A:D,MATCH(ROWS(F$6:F117),E:E,0),MATCH($I$3,$A$5:$D$5,0)),\"\")","v":"Michel"}]
[{"$f":"IF(Compétances!$D$1=Compétances!#REF!,Compétances!#REF!,\"zz\")","v":{"$error":"#REF!"}},{"$f":"IF(Compétances!$D$1=Compétances!#REF!,Compétances!#REF!,\"zz\")","v":{"$error":"#REF!"}},{"$f":"IF(Compétances!$D$1=Compétances!#REF!,Compétances!#REF!,\"zz\")","v":{"$error":"#REF!"}},{"$f":"IF(Compétances!$D$1=Compétances!#REF!,Compétances!#REF!,\"zz\")","v":{"$error":"#REF!"}},{"$f":"IFERROR(IF(INDEX(A118:D118,MATCH($I$3,$A$5:$D$5,0))<>\"zz\",MAX($E$5:E117)+1,\"\"),\"\")","v":""},{"$f":"IF(ROWS(F$6:F118)<=MAX(E:E),INDEX(A:D,MATCH(ROWS(F$6:F118),E:E,0),MATCH($I$3,$A$5:$D$5,0)),\"\")","v":"Jacques "}]
[{"$f":"IF(Compétances!$D$1=Compétances!C100,Compétances!$B100,\"zz\")","v":"Jean Mi"},{"$f":"IF(Compétances!$D$1=Compétances!D100,Compétances!$B100,\"zz\")","v":"Jean Mi"},{"$f":"IF(Compétances!$D$1=Compétances!E100,Compétances!$B100,\"zz\")","v":"Jean Mi"},{"$f":"IF(Compétances!$D$1=Compétances!F100,Compétances!$B100,\"zz\")","v":"Jean Mi"},{"$f":"IFERROR(IF(INDEX(A119:D119,MATCH($I$3,$A$5:$D$5,0))<>\"zz\",MAX($E$5:E118)+1,\"\"),\"\")","v":57},{"$f":"IF(ROWS(F$6:F119)<=MAX(E:E),INDEX(A:D,MATCH(ROWS(F$6:F119),E:E,0),MATCH($I$3,$A$5:$D$5,0)),\"\")","v":"Jean Mi"}]
[{"$f":"IF(Compétances!$D$1=Compétances!C101,Compétances!$B101,\"zz\")","v":"Eric"},{"$f":"IF(Compétances!$D$1=Compétances!D101,Compétances!$B101,\"zz\")","v":"zz"},{"$f":"IF(Compétances!$D$1=Compétances!E101,Compétances!$B101,\"zz\")","v":"Eric"},{"$f":"IF(Compétances!$D$1=Compétances!F101,Compétances!$B101,\"zz\")","v":"zz"},{"$f":"IFERROR(IF(INDEX(A120:D120,MATCH($I$3,$A$5:$D$5,0))<>\"zz\",MAX($E$5:E119)+1,\"\"),\"\")","v":""},{"$f":"IF(ROWS(F$6:F120)<=MAX(E:E),INDEX(A:D,MATCH(ROWS(F$6:F120),E:E,0),MATCH($I$3,$A$5:$D$5,0)),\"\")","v":"Michel"}]
[{"$f":"IF(Compétances!$D$1=Compétances!C102,Compétances!$B102,\"zz\")","v":"zz"},{"$f":"IF(Compétances!$D$1=Compétances!D102,Compétances!$B102,\"zz\")","v":"zz"},{"$f":"IF(Compétances!$D$1=Compétances!E102,Compétances!$B102,\"zz\")","v":"Paul "},{"$f":"IF(Compétances!$D$1=Compétances!F102,Compétances!$B102,\"zz\")","v":"zz"},{"$f":"IFERROR(IF(INDEX(A121:D121,MATCH($I$3,$A$5:$D$5,0))<>\"zz\",MAX($E$5:E120)+1,\"\"),\"\")","v":""},{"$f":"IF(ROWS(F$6:F121)<=MAX(E:E),INDEX(A:D,MATCH(ROWS(F$6:F121),E:E,0),MATCH($I$3,$A$5:$D$5,0)),\"\")","v":"Jacques "}]
[{"$f":"IF(Compétances!$D$1=Compétances!C103,Compétances!$B103,\"zz\")","v":"Michel"},{"$f":"IF(Compétances!$D$1=Compétances!D103,Compétances!$B103,\"zz\")","v":"Michel"},{"$f":"IF(Compétances!$D$1=Compétances!E103,Compétances!$B103,\"zz\")","v":"Michel"},{"$f":"IF(Compétances!$D$1=Compétances!F103,Compétances!$B103,\"zz\")","v":"Michel"},{"$f":"IFERROR(IF(INDEX(A122:D122,MATCH($I$3,$A$5:$D$5,0))<>\"zz\",MAX($E$5:E121)+1,\"\"),\"\")","v":58},{"$f":"IF(ROWS(F$6:F122)<=MAX(E:E),INDEX(A:D,MATCH(ROWS(F$6:F122),E:E,0),MATCH($I$3,$A$5:$D$5,0)),\"\")","v":"Jean Mi"}]
[{"$f":"IF(Compétances!$D$1=Compétances!C104,Compétances!$B104,\"zz\")","v":"zz"},{"$f":"IF(Compétances!$D$1=Compétances!D104,Compétances!$B104,\"zz\")","v":"Jacques "},{"$f":"IF(Compétances!$D$1=Compétances!E104,Compétances!$B104,\"zz\")","v":"zz"},{"$f":"IF(Compétances!$D$1=Compétances!F104,Compétances!$B104,\"zz\")","v":"zz"},{"$f":"IFERROR(IF(INDEX(A123:D123,MATCH($I$3,$A$5:$D$5,0))<>\"zz\",MAX($E$5:E122)+1,\"\"),\"\")","v":59},{"$f":"IF(ROWS(F$6:F123)<=MAX(E:E),INDEX(A:D,MATCH(ROWS(F$6:F123),E:E,0),MATCH($I$3,$A$5:$D$5,0)),\"\")","v":"Michel"}]
[{"$f":"IF(Compétances!$D$1=Compétances!#REF!,Compétances!#REF!,\"zz\")","v":{"$error":"#REF!"}},{"$f":"IF(Compétances!$D$1=Compétances!#REF!,Compétances!#REF!,\"zz\")","v":{"$error":"#REF!"}},{"$f":"IF(Compétances!$D$1=Compétances!#REF!,Compétances!#REF!,\"zz\")","v":{"$error":"#REF!"}},{"$f":"IF(Compétances!$D$1=Compétances!#REF!,Compétances!#REF!,\"zz\")","v":{"$error":"#REF!"}},{"$f":"IFERROR(IF(INDEX(A124:D124,MATCH($I$3,$A$5:$D$5,0))<>\"zz\",MAX($E$5:E123)+1,\"\"),\"\")","v":""},{"$f":"IF(ROWS(F$6:F124)<=MAX(E:E),INDEX(A:D,MATCH(ROWS(F$6:F124),E:E,0),MATCH($I$3,$A$5:$D$5,0)),\"\")","v":"Jacques "}]
[{"$f":"IF(Compétances!$D$1=Compétances!C105,Compétances!$B105,\"zz\")","v":"Jean Mi"},{"$f":"IF(Compétances!$D$1=Compétances!D105,Compétances!$B105,\"zz\")","v":"Jean Mi"},{"$f":"IF(Compétances!$D$1=Compétances!E105,Compétances!$B105,\"zz\")","v":"Jean Mi"},{"$f":"IF(Compétances!$D$1=Compétances!F105,Compétances!$B105,\"zz\")","v":"Jean Mi"},{"$f":"IFERROR(IF(INDEX(A125:D125,MATCH($I$3,$A$5:$D$5,0))<>\"zz\",MAX($E$5:E124)+1,\"\"),\"\")","v":60},{"$f":"IF(ROWS(F$6:F125)<=MAX(E:E),INDEX(A:D,MATCH(ROWS(F$6:F125),E:E,0),MATCH($I$3,$A$5:$D$5,0)),\"\")","v":"Jean Mi"}]
[{"$f":"IF(Compétances!$D$1=Compétances!C106,Compétances!$B106,\"zz\")","v":"Eric"},{"$f":"IF(Compétances!$D$1=Compétances!D106,Compétances!$B106,\"zz\")","v":"zz"},{"$f":"IF(Compétances!$D$1=Compétances!E106,Compétances!$B106,\"zz\")","v":"Eric"},{"$f":"IF(Compétances!$D$1=Compétances!F106,Compétances!$B106,\"zz\")","v":"zz"},{"$f":"IFERROR(IF(INDEX(A126:D126,MATCH($I$3,$A$5:$D$5,0))<>\"zz\",MAX($E$5:E125)+1,\"\"),\"\")","v":""},{"$f":"IF(ROWS(F$6:F126)<=MAX(E:E),INDEX(A:D,MATCH(ROWS(F$6:F126),E:E,0),MATCH($I$3,$A$5:$D$5,0)),\"\")","v":"Michel"}]
[{"$f":"IF(Compétances!$D$1=Compétances!C107,Compétances!$B107,\"zz\")","v":"zz"},{"$f":"IF(Compétances!$D$1=Compétances!D107,Compétances!$B107,\"zz\")","v":"zz"},{"$f":"IF(Compétances!$D$1=Compétances!E107,Compétances!$B107,\"zz\")","v":"Paul "},{"$f":"IF(Compétances!$D$1=Compétances!F107,Compétances!$B107,\"zz\")","v":"zz"},{"$f":"IFERROR(IF(INDEX(A127:D127,MATCH($I$3,$A$5:$D$5,0))<>\"zz\",MAX($E$5:E126)+1,\"\"),\"\")","v":""},{"$f":"IF(ROWS(F$6:F127)<=MAX(E:E),INDEX(A:D,MATCH(ROWS(F$6:F127),E:E,0),MATCH($I$3,$A$5:$D$5,0)),\"\")","v":"Jacques "}]
[{"$f":"IF(Compétances!$D$1=Compétances!C108,Compétances!$B108,\"zz\")","v":"Michel"},{"$f":"IF(Compétances!$D$1=Compétances!D108,Compétances!$B108,\"zz\")","v":"Michel"},{"$f":"IF(Compétances!$D$1=Compétances!E108,Compétances!$B108,\"zz\")","v":"Michel"},{"$f":"IF(Compétances!$D$1=Compétances!F108,Compétances!$B108,\"zz\")","v":"Michel"},{"$f":"IFERROR(IF(INDEX(A128:D128,MATCH($I$3,$A$5:$D$5,0))<>\"zz\",MAX($E$5:E127)+1,\"\"),\"\")","v":61},{"$f":"IF(ROWS(F$6:F128)<=MAX(E:E),INDEX(A:D,MATCH(ROWS(F$6:F128),E:E,0),MATCH($I$3,$A$5:$D$5,0)),\"\")","v":"Jean Mi"}]
[{"$f":"IF(Compétances!$D$1=Compétances!C109,Compétances!$B109,\"zz\")","v":"zz"},{"$f":"IF(Compétances!$D$1=Compétances!D109,Compétances!$B109,\"zz\")","v":"Jacques "},{"$f":"IF(Compétances!$D$1=Compétances!E109,Compétances!$B109,\"zz\")","v":"zz"},{"$f":"IF(Compétances!$D$1=Compétances!F109,Compétances!$B109,\"zz\")","v":"zz"},{"$f":"IFERROR(IF(INDEX(A129:D129,MATCH($I$3,$A$5:$D$5,0))<>\"zz\",MAX($E$5:E128)+1,\"\"),\"\")","v":62},{"$f":"IF(ROWS(F$6:F129)<=MAX(E:E),INDEX(A:D,MATCH(ROWS(F$6:F129),E:E,0),MATCH($I$3,$A$5:$D$5,0)),\"\")","v":"Michel"}]
[{"$f":"IF(Compétances!$D$1=Compétances!#REF!,Compétances!#REF!,\"zz\")","v":{"$error":"#REF!"}},{"$f":"IF(Compétances!$D$1=Compétances!#REF!,Compétances!#REF!,\"zz\")","v":{"$error":"#REF!"}},{"$f":"IF(Compétances!$D$1=Compétances!#REF!,Compétances!#REF!,\"zz\")","v":{"$error":"#REF!"}},{"$f":"IF(Compétances!$D$1=Compétances!#REF!,Compétances!#REF!,\"zz\")","v":{"$error":"#REF!"}},{"$f":"IFERROR(IF(INDEX(A130:D130,MATCH($I$3,$A$5:$D$5,0))<>\"zz\",MAX($E$5:E129)+1,\"\"),\"\")","v":""},{"$f":"IF(ROWS(F$6:F130)<=MAX(E:E),INDEX(A:D,MATCH(ROWS(F$6:F130),E:E,0),MATCH($I$3,$A$5:$D$5,0)),\"\")","v":"Jacques "}]
[{"$f":"IF(Compétances!$D$1=Compétances!C110,Compétances!$B110,\"zz\")","v":"Jean Mi"},{"$f":"IF(Compétances!$D$1=Compétances!D110,Compétances!$B110,\"zz\")","v":"Jean Mi"},{"$f":"IF(Compétances!$D$1=Compétances!E110,Compétances!$B110,\"zz\")","v":"Jean Mi"},{"$f":"IF(Compétances!$D$1=Compétances!F110,Compétances!$B110,\"zz\")","v":"Jean Mi"},{"$f":"IFERROR(IF(INDEX(A131:D131,MATCH($I$3,$A$5:$D$5,0))<>\"zz\",MAX($E$5:E130)+1,\"\"),\"\")","v":63},{"$f":"IF(ROWS(F$6:F131)<=MAX(E:E),INDEX(A:D,MATCH(ROWS(F$6:F131),E:E,0),MATCH($I$3,$A$5:$D$5,0)),\"\")","v":"Jean Mi"}]
[{"$f":"IF(Compétances!$D$1=Compétances!C111,Compétances!$B111,\"zz\")","v":"Eric"},{"$f":"IF(Compétances!$D$1=Compétances!D111,Compétances!$B111,\"zz\")","v":"zz"},{"$f":"IF(Compétances!$D$1=Compétances!E111,Compétances!$B111,\"zz\")","v":"Eric"},{"$f":"IF(Compétances!$D$1=Compétances!F111,Compétances!$B111,\"zz\")","v":"zz"},{"$f":"IFERROR(IF(INDEX(A132:D132,MATCH($I$3,$A$5:$D$5,0))<>\"zz\",MAX($E$5:E131)+1,\"\"),\"\")","v":""},{"$f":"IF(ROWS(F$6:F132)<=MAX(E:E),INDEX(A:D,MATCH(ROWS(F$6:F132),E:E,0),MATCH($I$3,$A$5:$D$5,0)),\"\")","v":"Michel"}]
[{"$f":"IF(Compétances!$D$1=Compétances!C112,Compétances!$B112,\"zz\")","v":"zz"},{"$f":"IF(Compétances!$D$1=Compétances!D112,Compétances!$B112,\"zz\")","v":"zz"},{"$f":"IF(Compétances!$D$1=Compétances!E112,Compétances!$B112,\"zz\")","v":"Paul "},{"$f":"IF(Compétances!$D$1=Compétances!F112,Compétances!$B112,\"zz\")","v":"zz"},{"$f":"IFERROR(IF(INDEX(A133:D133,MATCH($I$3,$A$5:$D$5,0))<>\"zz\",MAX($E$5:E132)+1,\"\"),\"\")","v":""},{"$f":"IF(ROWS(F$6:F133)<=MAX(E:E),INDEX(A:D,MATCH(ROWS(F$6:F133),E:E,0),MATCH($I$3,$A$5:$D$5,0)),\"\")","v":"Jacques "}]
[{"$f":"IF(Compétances!$D$1=Compétances!C113,Compétances!$B113,\"zz\")","v":"Michel"},{"$f":"IF(Compétances!$D$1=Compétances!D113,Compétances!$B113,\"zz\")","v":"Michel"},{"$f":"IF(Compétances!$D$1=Compétances!E113,Compétances!$B113,\"zz\")","v":"Michel"},{"$f":"IF(Compétances!$D$1=Compétances!F113,Compétances!$B113,\"zz\")","v":"Michel"},{"$f":"IFERROR(IF(INDEX(A134:D134,MATCH($I$3,$A$5:$D$5,0))<>\"zz\",MAX($E$5:E133)+1,\"\"),\"\")","v":64},{"$f":"IF(ROWS(F$6:F134)<=MAX(E:E),INDEX(A:D,MATCH(ROWS(F$6:F134),E:E,0),MATCH($I$3,$A$5:$D$5,0)),\"\")","v":"Jean Mi"}]
[{"$f":"IF(Compétances!$D$1=Compétances!C114,Compétances!$B114,\"zz\")","v":"zz"},{"$f":"IF(Compétances!$D$1=Compétances!D114,Compétances!$B114,\"zz\")","v":"Jacques "},{"$f":"IF(Compétances!$D$1=Compétances!E114,Compétances!$B114,\"zz\")","v":"zz"},{"$f":"IF(Compétances!$D$1=Compétances!F114,Compétances!$B114,\"zz\")","v":"zz"},{"$f":"IFERROR(IF(INDEX(A135:D135,MATCH($I$3,$A$5:$D$5,0))<>\"zz\",MAX($E$5:E134)+1,\"\"),\"\")","v":65},{"$f":"IF(ROWS(F$6:F135)<=MAX(E:E),INDEX(A:D,MATCH(ROWS(F$6:F135),E:E,0),MATCH($I$3,$A$5:$D$5,0)),\"\")","v":"Michel"}]
[{"$f":"IF(Compétances!$D$1=Compétances!#REF!,Compétances!#REF!,\"zz\")","v":{"$error":"#REF!"}},{"$f":"IF(Compétances!$D$1=Compétances!#REF!,Compétances!#REF!,\"zz\")","v":{"$error":"#REF!"}},{"$f":"IF(Compétances!$D$1=Compétances!#REF!,Compétances!#REF!,\"zz\")","v":{"$error":"#REF!"}},{"$f":"IF(Compétances!$D$1=Compétances!#REF!,Compétances!#REF!,\"zz\")","v":{"$error":"#REF!"}},{"$f":"IFERROR(IF(INDEX(A136:D136,MATCH($I$3,$A$5:$D$5,0))<>\"zz\",MAX($E$5:E135)+1,\"\"),\"\")","v":""},{"$f":"IF(ROWS(F$6:F136)<=MAX(E:E),INDEX(A:D,MATCH(ROWS(F$6:F136),E:E,0),MATCH($I$3,$A$5:$D$5,0)),\"\")","v":"Jacques "}]
[{"$f":"IF(Compétances!$D$1=Compétances!C115,Compétances!$B115,\"zz\")","v":"Jean Mi"},{"$f":"IF(Compétances!$D$1=Compétances!D115,Compétances!$B115,\"zz\")","v":"Jean Mi"},{"$f":"IF(Compétances!$D$1=Compétances!E115,Compétances!$B115,\"zz\")","v":"Jean Mi"},{"$f":"IF(Compétances!$D$1=Compétances!F115,Compétances!$B115,\"zz\")","v":"Jean Mi"},{"$f":"IFERROR(IF(INDEX(A137:D137,MATCH($I$3,$A$5:$D$5,0))<>\"zz\",MAX($E$5:E136)+1,\"\"),\"\")","v":66},{"$f":"IF(ROWS(F$6:F137)<=MAX(E:E),INDEX(A:D,MATCH(ROWS(F$6:F137),E:E,0),MATCH($I$3,$A$5:$D$5,0)),\"\")","v":"Jean Mi"}]
[{"$f":"IF(Compétances!$D$1=Compétances!C116,Compétances!$B116,\"zz\")","v":"Eric"},{"$f":"IF(Compétances!$D$1=Compétances!D116,Compétances!$B116,\"zz\")","v":"zz"},{"$f":"IF(Compétances!$D$1=Compétances!E116,Compétances!$B116,\"zz\")","v":"Eric"},{"$f":"IF(Compétances!$D$1=Compétances!F116,Compétances!$B116,\"zz\")","v":"zz"},{"$f":"IFERROR(IF(INDEX(A138:D138,MATCH($I$3,$A$5:$D$5,0))<>\"zz\",MAX($E$5:E137)+1,\"\"),\"\")","v":""},{"$f":"IF(ROWS(F$6:F138)<=MAX(E:E),INDEX(A:D,MATCH(ROWS(F$6:F138),E:E,0),MATCH($I$3,$A$5:$D$5,0)),\"\")","v":"Michel"}]
[{"$f":"IF(Compétances!$D$1=Compétances!C117,Compétances!$B117,\"zz\")","v":"zz"},{"$f":"IF(Compétances!$D$1=Compétances!D117,Compétances!$B117,\"zz\")","v":"zz"},{"$f":"IF(Compétances!$D$1=Compétances!E117,Compétances!$B117,\"zz\")","v":"Paul "},{"$f":"IF(Compétances!$D$1=Compétances!F117,Compétances!$B117,\"zz\")","v":"zz"},{"$f":"IFERROR(IF(INDEX(A139:D139,MATCH($I$3,$A$5:$D$5,0))<>\"zz\",MAX($E$5:E138)+1,\"\"),\"\")","v":""},{"$f":"IF(ROWS(F$6:F139)<=MAX(E:E),INDEX(A:D,MATCH(ROWS(F$6:F139),E:E,0),MATCH($I$3,$A$5:$D$5,0)),\"\")","v":"Jacques "}]
[{"$f":"IF(Compétances!$D$1=Compétances!C118,Compétances!$B118,\"zz\")","v":"Michel"},{"$f":"IF(Compétances!$D$1=Compétances!D118,Compétances!$B118,\"zz\")","v":"Michel"},{"$f":"IF(Compétances!$D$1=Compétances!E118,Compétances!$B118,\"zz\")","v":"Michel"},{"$f":"IF(Compétances!$D$1=Compétances!F118,Compétances!$B118,\"zz\")","v":"Michel"},{"$f":"IFERROR(IF(INDEX(A140:D140,MATCH($I$3,$A$5:$D$5,0))<>\"zz\",MAX($E$5:E139)+1,\"\"),\"\")","v":67},{"$f":"IF(ROWS(F$6:F140)<=MAX(E:E),INDEX(A:D,MATCH(ROWS(F$6:F140),E:E,0),MATCH($I$3,$A$5:$D$5,0)),\"\")","v":"Jean Mi"}]
[{"$f":"IF(Compétances!$D$1=Compétances!C119,Compétances!$B119,\"zz\")","v":"zz"},{"$f":"IF(Compétances!$D$1=Compétances!D119,Compétances!$B119,\"zz\")","v":"Jacques "},{"$f":"IF(Compétances!$D$1=Compétances!E119,Compétances!$B119,\"zz\")","v":"zz"},{"$f":"IF(Compétances!$D$1=Compétances!F119,Compétances!$B119,\"zz\")","v":"zz"},{"$f":"IFERROR(IF(INDEX(A141:D141,MATCH($I$3,$A$5:$D$5,0))<>\"zz\",MAX($E$5:E140)+1,\"\"),\"\")","v":68},{"$f":"IF(ROWS(F$6:F141)<=MAX(E:E),INDEX(A:D,MATCH(ROWS(F$6:F141),E:E,0),MATCH($I$3,$A$5:$D$5,0)),\"\")","v":"Michel"}]
[{"$f":"IF(Compétances!$D$1=Compétances!#REF!,Compétances!#REF!,\"zz\")","v":{"$error":"#REF!"}},{"$f":"IF(Compétances!$D$1=Compétances!#REF!,Compétances!#REF!,\"zz\")","v":{"$error":"#REF!"}},{"$f":"IF(Compétances!$D$1=Compétances!#REF!,Compétances!#REF!,\"zz\")","v":{"$error":"#REF!"}},{"$f":"IF(Compétances!$D$1=Compétances!#REF!,Compétances!#REF!,\"zz\")","v":{"$error":"#REF!"}},{"$f":"IFERROR(IF(INDEX(A142:D142,MATCH($I$3,$A$5:$D$5,0))<>\"zz\",MAX($E$5:E141)+1,\"\"),\"\")","v":""},{"$f":"IF(ROWS(F$6:F142)<=MAX(E:E),INDEX(A:D,MATCH(ROWS(F$6:F142),E:E,0),MATCH($I$3,$A$5:$D$5,0)),\"\")","v":"Jacques "}]
[{"$f":"IF(Compétances!$D$1=Compétances!C120,Compétances!$B120,\"zz\")","v":"Jean Mi"},{"$f":"IF(Compétances!$D$1=Compétances!D120,Compétances!$B120,\"zz\")","v":"Jean Mi"},{"$f":"IF(Compétances!$D$1=Compétances!E120,Compétances!$B120,\"zz\")","v":"Jean Mi"},{"$f":"IF(Compétances!$D$1=Compétances!F120,Compétances!$B120,\"zz\")","v":"Jean Mi"},{"$f":"IFERROR(IF(INDEX(A143:D143,MATCH($I$3,$A$5:$D$5,0))<>\"zz\",MAX($E$5:E142)+1,\"\"),\"\")","v":69},{"$f":"IF(ROWS(F$6:F143)<=MAX(E:E),INDEX(A:D,MATCH(ROWS(F$6:F143),E:E,0),MATCH($I$3,$A$5:$D$5,0)),\"\")","v":"Jean Mi"}]
[{"$f":"IF(Compétances!$D$1=Compétances!C121,Compétances!$B121,\"zz\")","v":"Eric"},{"$f":"IF(Compétances!$D$1=Compétances!D121,Compétances!$B121,\"zz\")","v":"zz"},{"$f":"IF(Compétances!$D$1=Compétances!E121,Compétances!$B121,\"zz\")","v":"Eric"},{"$f":"IF(Compétances!$D$1=Compétances!F121,Compétances!$B121,\"zz\")","v":"zz"},{"$f":"IFERROR(IF(INDEX(A144:D144,MATCH($I$3,$A$5:$D$5,0))<>\"zz\",MAX($E$5:E143)+1,\"\"),\"\")","v":""},{"$f":"IF(ROWS(F$6:F144)<=MAX(E:E),INDEX(A:D,MATCH(ROWS(F$6:F144),E:E,0),MATCH($I$3,$A$5:$D$5,0)),\"\")","v":"Michel"}]
[{"$f":"IF(Compétances!$D$1=Compétances!C122,Compétances!$B122,\"zz\")","v":"zz"},{"$f":"IF(Compétances!$D$1=Compétances!D122,Compétances!$B122,\"zz\")","v":"zz"},{"$f":"IF(Compétances!$D$1=Compétances!E122,Compétances!$B122,\"zz\")","v":"Paul "},{"$f":"IF(Compétances!$D$1=Compétances!F122,Compétances!$B122,\"zz\")","v":"zz"},{"$f":"IFERROR(IF(INDEX(A145:D145,MATCH($I$3,$A$5:$D$5,0))<>\"zz\",MAX($E$5:E144)+1,\"\"),\"\")","v":""},{"$f":"IF(ROWS(F$6:F145)<=MAX(E:E),INDEX(A:D,MATCH(ROWS(F$6:F145),E:E,0),MATCH($I$3,$A$5:$D$5,0)),\"\")","v":"Jacques "}]
[{"$f":"IF(Compétances!$D$1=Compétances!C123,Compétances!$B123,\"zz\")","v":"Michel"},{"$f":"IF(Compétances!$D$1=Compétances!D123,Compétances!$B123,\"zz\")","v":"Michel"},{"$f":"IF(Compétances!$D$1=Compétances!E123,Compétances!$B123,\"zz\")","v":"Michel"},{"$f":"IF(Compétances!$D$1=Compétances!F123,Compétances!$B123,\"zz\")","v":"Michel"},{"$f":"IFERROR(IF(INDEX(A146:D146,MATCH($I$3,$A$5:$D$5,0))<>\"zz\",MAX($E$5:E145)+1,\"\"),\"\")","v":70},{"$f":"IF(ROWS(F$6:F146)<=MAX(E:E),INDEX(A:D,MATCH(ROWS(F$6:F146),E:E,0),MATCH($I$3,$A$5:$D$5,0)),\"\")","v":"Jean Mi"}]
[{"$f":"IF(Compétances!$D$1=Compétances!C124,Compétances!$B124,\"zz\")","v":"zz"},{"$f":"IF(Compétances!$D$1=Compétances!D124,Compétances!$B124,\"zz\")","v":"Jacques "},{"$f":"IF(Compétances!$D$1=Compétances!E124,Compétances!$B124,\"zz\")","v":"zz"},{"$f":"IF(Compétances!$D$1=Compétances!F124,Compétances!$B124,\"zz\")","v":"zz"},{"$f":"IFERROR(IF(INDEX(A147:D147,MATCH($I$3,$A$5:$D$5,0))<>\"zz\",MAX($E$5:E146)+1,\"\"),\"\")","v":71},{"$f":"IF(ROWS(F$6:F147)<=MAX(E:E),INDEX(A:D,MATCH(ROWS(F$6:F147),E:E,0),MATCH($I$3,$A$5:$D$5,0)),\"\")","v":"Michel"}]
[{"$f":"IF(Compétances!$D$1=Compétances!#REF!,Compétances!#REF!,\"zz\")","v":{"$error":"#REF!"}},{"$f":"IF(Compétances!$D$1=Compétances!#REF!,Compétances!#REF!,\"zz\")","v":{"$error":"#REF!"}},{"$f":"IF(Compétances!$D$1=Compétances!#REF!,Compétances!#REF!,\"zz\")","v":{"$error":"#REF!"}},{"$f":"IF(Compétances!$D$1=Compétances!#REF!,Compétances!#REF!,\"zz\")","v":{"$error":"#REF!"}},{"$f":"IFERROR(IF(INDEX(A148:D148,MATCH($I$3,$A$5:$D$5,0))<>\"zz\",MAX($E$5:E147)+1,\"\"),\"\")","v":""},{"$f":"IF(ROWS(F$6:F148)<=MAX(E:E),INDEX(A:D,MATCH(ROWS(F$6:F148),E:E,0),MATCH($I$3,$A$5:$D$5,0)),\"\")","v":"Jacques "}]
[{"$f":"IF(Compétances!$D$1=Compétances!C125,Compétances!$B125,\"zz\")","v":"Jean Mi"},{"$f":"IF(Compétances!$D$1=Compétances!D125,Compétances!$B125,\"zz\")","v":"Jean Mi"},{"$f":"IF(Compétances!$D$1=Compétances!E125,Compétances!$B125,\"zz\")","v":"Jean Mi"},{"$f":"IF(Compétances!$D$1=Compétances!F125,Compétances!$B125,\"zz\")","v":"Jean Mi"},{"$f":"IFERROR(IF(INDEX(A149:D149,MATCH($I$3,$A$5:$D$5,0))<>\"zz\",MAX($E$5:E148)+1,\"\"),\"\")","v":72},{"$f":"IF(ROWS(F$6:F149)<=MAX(E:E),INDEX(A:D,MATCH(ROWS(F$6:F149),E:E,0),MATCH($I$3,$A$5:$D$5,0)),\"\")","v":"Jean Mi"}]
[{"$f":"IF(Compétances!$D$1=Compétances!C126,Compétances!$B126,\"zz\")","v":"Eric"},{"$f":"IF(Compétances!$D$1=Compétances!D126,Compétances!$B126,\"zz\")","v":"zz"},{"$f":"IF(Compétances!$D$1=Compétances!E126,Compétances!$B126,\"zz\")","v":"Eric"},{"$f":"IF(Compétances!$D$1=Compétances!F126,Compétances!$B126,\"zz\")","v":"zz"},{"$f":"IFERROR(IF(INDEX(A150:D150,MATCH($I$3,$A$5:$D$5,0))<>\"zz\",MAX($E$5:E149)+1,\"\"),\"\")","v":""},{"$f":"IF(ROWS(F$6:F150)<=MAX(E:E),INDEX(A:D,MATCH(ROWS(F$6:F150),E:E,0),MATCH($I$3,$A$5:$D$5,0)),\"\")","v":"Michel"}]
[{"$f":"IF(Compétances!$D$1=Compétances!C127,Compétances!$B127,\"zz\")","v":"zz"},{"$f":"IF(Compétances!$D$1=Compétances!D127,Compétances!$B127,\"zz\")","v":"zz"},{"$f":"IF(Compétances!$D$1=Compétances!E127,Compétances!$B127,\"zz\")","v":"Paul "},{"$f":"IF(Compétances!$D$1=Compétances!F127,Compétances!$B127,\"zz\")","v":"zz"},{"$f":"IFERROR(IF(INDEX(A151:D151,MATCH($I$3,$A$5:$D$5,0))<>\"zz\",MAX($E$5:E150)+1,\"\"),\"\")","v":""},{"$f":"IF(ROWS(F$6:F151)<=MAX(E:E),INDEX(A:D,MATCH(ROWS(F$6:F151),E:E,0),MATCH($I$3,$A$5:$D$5,0)),\"\")","v":"Jacques "}]
[{"$f":"IF(Compétances!$D$1=Compétances!C128,Compétances!$B128,\"zz\")","v":"Michel"},{"$f":"IF(Compétances!$D$1=Compétances!D128,Compétances!$B128,\"zz\")","v":"Michel"},{"$f":"IF(Compétances!$D$1=Compétances!E128,Compétances!$B128,\"zz\")","v":"Michel"},{"$f":"IF(Compétances!$D$1=Compétances!F128,Compétances!$B128,\"zz\")","v":"Michel"},{"$f":"IFERROR(IF(INDEX(A152:D152,MATCH($I$3,$A$5:$D$5,0))<>\"zz\",MAX($E$5:E151)+1,\"\"),\"\")","v":73},{"$f":"IF(ROWS(F$6:F152)<=MAX(E:E),INDEX(A:D,MATCH(ROWS(F$6:F152),E:E,0),MATCH($I$3,$A$5:$D$5,0)),\"\")","v":"Jean Mi"}]
[{"$f":"IF(Compétances!$D$1=Compétances!C129,Compétances!$B129,\"zz\")","v":"zz"},{"$f":"IF(Compétances!$D$1=Compétances!D129,Compétances!$B129,\"zz\")","v":"Jacques "},{"$f":"IF(Compétances!$D$1=Compétances!E129,Compétances!$B129,\"zz\")","v":"zz"},{"$f":"IF(Compétances!$D$1=Compétances!F129,Compétances!$B129,\"zz\")","v":"zz"},{"$f":"IFERROR(IF(INDEX(A153:D153,MATCH($I$3,$A$5:$D$5,0))<>\"zz\",MAX($E$5:E152)+1,\"\"),\"\")","v":74},{"$f":"IF(ROWS(F$6:F153)<=MAX(E:E),INDEX(A:D,MATCH(ROWS(F$6:F153),E:E,0),MATCH($I$3,$A$5:$D$5,0)),\"\")","v":""}]
[{"$f":"IF(Compétances!$D$1=Compétances!#REF!,Compétances!#REF!,\"zz\")","v":{"$error":"#REF!"}},{"$f":"IF(Compétances!$D$1=Compétances!#REF!,Compétances!#REF!,\"zz\")","v":{"$error":"#REF!"}},{"$f":"IF(Compétances!$D$1=Compétances!#REF!,Compétances!#REF!,\"zz\")","v":{"$error":"#REF!"}},{"$f":"IF(Compétances!$D$1=Compétances!#REF!,Compétances!#REF!,\"zz\")","v":{"$error":"#REF!"}},{"$f":"IFERROR(IF(INDEX(A154:D154,MATCH($I$3,$A$5:$D$5,0))<>\"zz\",MAX($E$5:E153)+1,\"\"),\"\")","v":""},{"$f":"IF(ROWS(F$6:F154)<=MAX(E:E),INDEX(A:D,MATCH(ROWS(F$6:F154),E:E,0),MATCH($I$3,$A$5:$D$5,0)),\"\")","v":""}]
[{"$f":"IF(Compétances!$D$1=Compétances!C130,Compétances!$B130,\"zz\")","v":"Jean Mi"},{"$f":"IF(Compétances!$D$1=Compétances!D130,Compétances!$B130,\"zz\")","v":"Jean Mi"},{"$f":"IF(Compétances!$D$1=Compétances!E130,Compétances!$B130,\"zz\")","v":"Jean Mi"},{"$f":"IF(Compétances!$D$1=Compétances!F130,Compétances!$B130,\"zz\")","v":"Jean Mi"},{"$f":"IFERROR(IF(INDEX(A155:D155,MATCH($I$3,$A$5:$D$5,0))<>\"zz\",MAX($E$5:E154)+1,\"\"),\"\")","v":75},{"$f":"IF(ROWS(F$6:F155)<=MAX(E:E),INDEX(A:D,MATCH(ROWS(F$6:F155),E:E,0),MATCH($I$3,$A$5:$D$5,0)),\"\")","v":""}]
[{"$f":"IF(Compétances!$D$1=Compétances!C131,Compétances!$B131,\"zz\")","v":"Eric"},{"$f":"IF(Compétances!$D$1=Compétances!D131,Compétances!$B131,\"zz\")","v":"zz"},{"$f":"IF(Compétances!$D$1=Compétances!E131,Compétances!$B131,\"zz\")","v":"Eric"},{"$f":"IF(Compétances!$D$1=Compétances!F131,Compétances!$B131,\"zz\")","v":"zz"},{"$f":"IFERROR(IF(INDEX(A156:D156,MATCH($I$3,$A$5:$D$5,0))<>\"zz\",MAX($E$5:E155)+1,\"\"),\"\")","v":""},{"$f":"IF(ROWS(F$6:F156)<=MAX(E:E),INDEX(A:D,MATCH(ROWS(F$6:F156),E:E,0),MATCH($I$3,$A$5:$D$5,0)),\"\")","v":""}]
[{"$f":"IF(Compétances!$D$1=Compétances!C132,Compétances!$B132,\"zz\")","v":"zz"},{"$f":"IF(Compétances!$D$1=Compétances!D132,Compétances!$B132,\"zz\")","v":"zz"},{"$f":"IF(Compétances!$D$1=Compétances!E132,Compétances!$B132,\"zz\")","v":"Paul "},{"$f":"IF(Compétances!$D$1=Compétances!F132,Compétances!$B132,\"zz\")","v":"zz"},{"$f":"IFERROR(IF(INDEX(A157:D157,MATCH($I$3,$A$5:$D$5,0))<>\"zz\",MAX($E$5:E156)+1,\"\"),\"\")","v":""},{"$f":"IF(ROWS(F$6:F157)<=MAX(E:E),INDEX(A:D,MATCH(ROWS(F$6:F157),E:E,0),MATCH($I$3,$A$5:$D$5,0)),\"\")","v":""}]
[{"$f":"IF(Compétances!$D$1=Compétances!C133,Compétances!$B133,\"zz\")","v":"Michel"},{"$f":"IF(Compétances!$D$1=Compétances!D133,Compétances!$B133,\"zz\")","v":"Michel"},{"$f":"IF(Compétances!$D$1=Compétances!E133,Compétances!$B133,\"zz\")","v":"Michel"},{"$f":"IF(Compétances!$D$1=Compétances!F133,Compétances!$B133,\"zz\")","v":"Michel"},{"$f":"IFERROR(IF(INDEX(A158:D158,MATCH($I$3,$A$5:$D$5,0))<>\"zz\",MAX($E$5:E157)+1,\"\"),\"\")","v":76},{"$f":"IF(ROWS(F$6:F158)<=MAX(E:E),INDEX(A:D,MATCH(ROWS(F$6:F158),E:E,0),MATCH($I$3,$A$5:$D$5,0)),\"\")","v":""}]
[{"$f":"IF(Compétances!$D$1=Compétances!C134,Compétances!$B134,\"zz\")","v":"zz"},{"$f":"IF(Compétances!$D$1=Compétances!D134,Compétances!$B134,\"zz\")","v":"Jacques "},{"$f":"IF(Compétances!$D$1=Compétances!E134,Compétances!$B134,\"zz\")","v":"zz"},{"$f":"IF(Compétances!$D$1=Compétances!F134,Compétances!$B134,\"zz\")","v":"zz"},{"$f":"IFERROR(IF(INDEX(A159:D159,MATCH($I$3,$A$5:$D$5,0))<>\"zz\",MAX($E$5:E158)+1,\"\"),\"\")","v":77},{"$f":"IF(ROWS(F$6:F159)<=MAX(E:E),INDEX(A:D,MATCH(ROWS(F$6:F159),E:E,0),MATCH($I$3,$A$5:$D$5,0)),\"\")","v":""}]
[{"$f":"IF(Compétances!$D$1=Compétances!#REF!,Compétances!#REF!,\"zz\")","v":{"$error":"#REF!"}},{"$f":"IF(Compétances!$D$1=Compétances!#REF!,Compétances!#REF!,\"zz\")","v":{"$error":"#REF!"}},{"$f":"IF(Compétances!$D$1=Compétances!#REF!,Compétances!#REF!,\"zz\")","v":{"$error":"#REF!"}},{"$f":"IF(Compétances!$D$1=Compétances!#REF!,Compétances!#REF!,\"zz\")","v":{"$error":"#REF!"}},{"$f":"IFERROR(IF(INDEX(A160:D160,MATCH($I$3,$A$5:$D$5,0))<>\"zz\",MAX($E$5:E159)+1,\"\"),\"\")","v":""},{"$f":"IF(ROWS(F$6:F160)<=MAX(E:E),INDEX(A:D,MATCH(ROWS(F$6:F160),E:E,0),MATCH($I$3,$A$5:$D$5,0)),\"\")","v":""}]
[{"$f":"IF(Compétances!$D$1=Compétances!C135,Compétances!$B135,\"zz\")","v":"Jean Mi"},{"$f":"IF(Compétances!$D$1=Compétances!D135,Compétances!$B135,\"zz\")","v":"Jean Mi"},{"$f":"IF(Compétances!$D$1=Compétances!E135,Compétances!$B135,\"zz\")","v":"Jean Mi"},{"$f":"IF(Compétances!$D$1=Compétances!F135,Compétances!$B135,\"zz\")","v":"Jean Mi"},{"$f":"IFERROR(IF(INDEX(A161:D161,MATCH($I$3,$A$5:$D$5,0))<>\"zz\",MAX($E$5:E160)+1,\"\"),\"\")","v":78},{"$f":"IF(ROWS(F$6:F161)<=MAX(E:E),INDEX(A:D,MATCH(ROWS(F$6:F161),E:E,0),MATCH($I$3,$A$5:$D$5,0)),\"\")","v":""}]
[{"$f":"IF(Compétances!$D$1=Compétances!C136,Compétances!$B136,\"zz\")","v":"Eric"},{"$f":"IF(Compétances!$D$1=Compétances!D136,Compétances!$B136,\"zz\")","v":"zz"},{"$f":"IF(Compétances!$D$1=Compétances!E136,Compétances!$B136,\"zz\")","v":"Eric"},{"$f":"IF(Compétances!$D$1=Compétances!F136,Compétances!$B136,\"zz\")","v":"zz"},{"$f":"IFERROR(IF(INDEX(A162:D162,MATCH($I$3,$A$5:$D$5,0))<>\"zz\",MAX($E$5:E161)+1,\"\"),\"\")","v":""},{"$f":"IF(ROWS(F$6:F162)<=MAX(E:E),INDEX(A:D,MATCH(ROWS(F$6:F162),E:E,0),MATCH($I$3,$A$5:$D$5,0)),\"\")","v":""}]
[{"$f":"IF(Compétances!$D$1=Compétances!C137,Compétances!$B137,\"zz\")","v":"zz"},{"$f":"IF(Compétances!$D$1=Compétances!D137,Compétances!$B137,\"zz\")","v":"zz"},{"$f":"IF(Compétances!$D$1=Compétances!E137,Compétances!$B137,\"zz\")","v":"Paul "},{"$f":"IF(Compétances!$D$1=Compétances!F137,Compétances!$B137,\"zz\")","v":"zz"},{"$f":"IFERROR(IF(INDEX(A163:D163,MATCH($I$3,$A$5:$D$5,0))<>\"zz\",MAX($E$5:E162)+1,\"\"),\"\")","v":""},{"$f":"IF(ROWS(F$6:F163)<=MAX(E:E),INDEX(A:D,MATCH(ROWS(F$6:F163),E:E,0),MATCH($I$3,$A$5:$D$5,0)),\"\")","v":""}]
[{"$f":"IF(Compétances!$D$1=Compétances!C138,Compétances!$B138,\"zz\")","v":"Michel"},{"$f":"IF(Compétances!$D$1=Compétances!D138,Compétances!$B138,\"zz\")","v":"Michel"},{"$f":"IF(Compétances!$D$1=Compétances!E138,Compétances!$B138,\"zz\")","v":"Michel"},{"$f":"IF(Compétances!$D$1=Compétances!F138,Compétances!$B138,\"zz\")","v":"Michel"},{"$f":"IFERROR(IF(INDEX(A164:D164,MATCH($I$3,$A$5:$D$5,0))<>\"zz\",MAX($E$5:E163)+1,\"\"),\"\")","v":79},{"$f":"IF(ROWS(F$6:F164)<=MAX(E:E),INDEX(A:D,MATCH(ROWS(F$6:F164),E:E,0),MATCH($I$3,$A$5:$D$5,0)),\"\")","v":""}]
[{"$f":"IF(Compétances!$D$1=Compétances!C139,Compétances!$B139,\"zz\")","v":"zz"},{"$f":"IF(Compétances!$D$1=Compétances!D139,Compétances!$B139,\"zz\")","v":"Jacques "},{"$f":"IF(Compétances!$D$1=Compétances!E139,Compétances!$B139,\"zz\")","v":"zz"},{"$f":"IF(Compétances!$D$1=Compétances!F139,Compétances!$B139,\"zz\")","v":"zz"},{"$f":"IFERROR(IF(INDEX(A165:D165,MATCH($I$3,$A$5:$D$5,0))<>\"zz\",MAX($E$5:E164)+1,\"\"),\"\")","v":80},{"$f":"IF(ROWS(F$6:F165)<=MAX(E:E),INDEX(A:D,MATCH(ROWS(F$6:F165),E:E,0),MATCH($I$3,$A$5:$D$5,0)),\"\")","v":""}]
[{"$f":"IF(Compétances!$D$1=Compétances!#REF!,Compétances!#REF!,\"zz\")","v":{"$error":"#REF!"}},{"$f":"IF(Compétances!$D$1=Compétances!#REF!,Compétances!#REF!,\"zz\")","v":{"$error":"#REF!"}},{"$f":"IF(Compétances!$D$1=Compétances!#REF!,Compétances!#REF!,\"zz\")","v":{"$error":"#REF!"}},{"$f":"IF(Compétances!$D$1=Compétances!#REF!,Compétances!#REF!,\"zz\")","v":{"$error":"#REF!"}},{"$f":"IFERROR(IF(INDEX(A166:D166,MATCH($I$3,$A$5:$D$5,0))<>\"zz\",MAX($E$5:E165)+1,\"\"),\"\")","v":""},{"$f":"IF(ROWS(F$6:F166)<=MAX(E:E),INDEX(A:D,MATCH(ROWS(F$6:F166),E:E,0),MATCH($I$3,$A$5:$D$5,0)),\"\")","v":""}]
[{"$f":"IF(Compétances!$D$1=Compétances!C140,Compétances!$B140,\"zz\")","v":"Jean Mi"},{"$f":"IF(Compétances!$D$1=Compétances!D140,Compétances!$B140,\"zz\")","v":"Jean Mi"},{"$f":"IF(Compétances!$D$1=Compétances!E140,Compétances!$B140,\"zz\")","v":"Jean Mi"},{"$f":"IF(Compétances!$D$1=Compétances!F140,Compétances!$B140,\"zz\")","v":"Jean Mi"},{"$f":"IFERROR(IF(INDEX(A167:D167,MATCH($I$3,$A$5:$D$5,0))<>\"zz\",MAX($E$5:E166)+1,\"\"),\"\")","v":81},{"$f":"IF(ROWS(F$6:F167)<=MAX(E:E),INDEX(A:D,MATCH(ROWS(F$6:F167),E:E,0),MATCH($I$3,$A$5:$D$5,0)),\"\")","v":""}]
[{"$f":"IF(Compétances!$D$1=Compétances!C141,Compétances!$B141,\"zz\")","v":"Eric"},{"$f":"IF(Compétances!$D$1=Compétances!D141,Compétances!$B141,\"zz\")","v":"zz"},{"$f":"IF(Compétances!$D$1=Compétances!E141,Compétances!$B141,\"zz\")","v":"Eric"},{"$f":"IF(Compétances!$D$1=Compétances!F141,Compétances!$B141,\"zz\")","v":"zz"},{"$f":"IFERROR(IF(INDEX(A168:D168,MATCH($I$3,$A$5:$D$5,0))<>\"zz\",MAX($E$5:E167)+1,\"\"),\"\")","v":""},{"$f":"IF(ROWS(F$6:F168)<=MAX(E:E),INDEX(A:D,MATCH(ROWS(F$6:F168),E:E,0),MATCH($I$3,$A$5:$D$5,0)),\"\")","v":""}]
[{"$f":"IF(Compétances!$D$1=Compétances!C142,Compétances!$B142,\"zz\")","v":"zz"},{"$f":"IF(Compétances!$D$1=Compétances!D142,Compétances!$B142,\"zz\")","v":"zz"},{"$f":"IF(Compétances!$D$1=Compétances!E142,Compétances!$B142,\"zz\")","v":"Paul "},{"$f":"IF(Compétances!$D$1=Compétances!F142,Compétances!$B142,\"zz\")","v":"zz"},{"$f":"IFERROR(IF(INDEX(A169:D169,MATCH($I$3,$A$5:$D$5,0))<>\"zz\",MAX($E$5:E168)+1,\"\"),\"\")","v":""},{"$f":"IF(ROWS(F$6:F169)<=MAX(E:E),INDEX(A:D,MATCH(ROWS(F$6:F169),E:E,0),MATCH($I$3,$A$5:$D$5,0)),\"\")","v":""}]
[{"$f":"IF(Compétances!$D$1=Compétances!C143,Compétances!$B143,\"zz\")","v":"Michel"},{"$f":"IF(Compétances!$D$1=Compétances!D143,Compétances!$B143,\"zz\")","v":"Michel"},{"$f":"IF(Compétances!$D$1=Compétances!E143,Compétances!$B143,\"zz\")","v":"Michel"},{"$f":"IF(Compétances!$D$1=Compétances!F143,Compétances!$B143,\"zz\")","v":"Michel"},{"$f":"IFERROR(IF(INDEX(A170:D170,MATCH($I$3,$A$5:$D$5,0))<>\"zz\",MAX($E$5:E169)+1,\"\"),\"\")","v":82},{"$f":"IF(ROWS(F$6:F170)<=MAX(E:E),INDEX(A:D,MATCH(ROWS(F$6:F170),E:E,0),MATCH($I$3,$A$5:$D$5,0)),\"\")","v":""}]
[{"$f":"IF(Compétances!$D$1=Compétances!C144,Compétances!$B144,\"zz\")","v":"zz"},{"$f":"IF(Compétances!$D$1=Compétances!D144,Compétances!$B144,\"zz\")","v":"Jacques "},{"$f":"IF(Compétances!$D$1=Compétances!E144,Compétances!$B144,\"zz\")","v":"zz"},{"$f":"IF(Compétances!$D$1=Compétances!F144,Compétances!$B144,\"zz\")","v":"zz"},{"$f":"IFERROR(IF(INDEX(A171:D171,MATCH($I$3,$A$5:$D$5,0))<>\"zz\",MAX($E$5:E170)+1,\"\"),\"\")","v":83},{"$f":"IF(ROWS(F$6:F171)<=MAX(E:E),INDEX(A:D,MATCH(ROWS(F$6:F171),E:E,0),MATCH($I$3,$A$5:$D$5,0)),\"\")","v":""}]
[{"$f":"IF(Compétances!$D$1=Compétances!#REF!,Compétances!#REF!,\"zz\")","v":{"$error":"#REF!"}},{"$f":"IF(Compétances!$D$1=Compétances!#REF!,Compétances!#REF!,\"zz\")","v":{"$error":"#REF!"}},{"$f":"IF(Compétances!$D$1=Compétances!#REF!,Compétances!#REF!,\"zz\")","v":{"$error":"#REF!"}},{"$f":"IF(Compétances!$D$1=Compétances!#REF!,Compétances!#REF!,\"zz\")","v":{"$error":"#REF!"}},{"$f":"IFERROR(IF(INDEX(A172:D172,MATCH($I$3,$A$5:$D$5,0))<>\"zz\",MAX($E$5:E171)+1,\"\"),\"\")","v":""},{"$f":"IF(ROWS(F$6:F172)<=MAX(E:E),INDEX(A:D,MATCH(ROWS(F$6:F172),E:E,0),MATCH($I$3,$A$5:$D$5,0)),\"\")","v":""}]
[{"$f":"IF(Compétances!$D$1=Compétances!C145,Compétances!$B145,\"zz\")","v":"Jean Mi"},{"$f":"IF(Compétances!$D$1=Compétances!D145,Compétances!$B145,\"zz\")","v":"Jean Mi"},{"$f":"IF(Compétances!$D$1=Compétances!E145,Compétances!$B145,\"zz\")","v":"Jean Mi"},{"$f":"IF(Compétances!$D$1=Compétances!F145,Compétances!$B145,\"zz\")","v":"Jean Mi"},{"$f":"IFERROR(IF(INDEX(A173:D173,MATCH($I$3,$A$5:$D$5,0))<>\"zz\",MAX($E$5:E172)+1,\"\"),\"\")","v":84},{"$f":"IF(ROWS(F$6:F173)<=MAX(E:E),INDEX(A:D,MATCH(ROWS(F$6:F173),E:E,0),MATCH($I$3,$A$5:$D$5,0)),\"\")","v":""}]
[{"$f":"IF(Compétances!$D$1=Compétances!C146,Compétances!$B146,\"zz\")","v":"Eric"},{"$f":"IF(Compétances!$D$1=Compétances!D146,Compétances!$B146,\"zz\")","v":"zz"},{"$f":"IF(Compétances!$D$1=Compétances!E146,Compétances!$B146,\"zz\")","v":"Eric"},{"$f":"IF(Compétances!$D$1=Compétances!F146,Compétances!$B146,\"zz\")","v":"zz"},{"$f":"IFERROR(IF(INDEX(A174:D174,MATCH($I$3,$A$5:$D$5,0))<>\"zz\",MAX($E$5:E173)+1,\"\"),\"\")","v":""},{"$f":"IF(ROWS(F$6:F174)<=MAX(E:E),INDEX(A:D,MATCH(ROWS(F$6:F174),E:E,0),MATCH($I$3,$A$5:$D$5,0)),\"\")","v":""}]
[{"$f":"IF(Compétances!$D$1=Compétances!C147,Compétances!$B147,\"zz\")","v":"zz"},{"$f":"IF(Compétances!$D$1=Compétances!D147,Compétances!$B147,\"zz\")","v":"zz"},{"$f":"IF(Compétances!$D$1=Compétances!E147,Compétances!$B147,\"zz\")","v":"Paul "},{"$f":"IF(Compétances!$D$1=Compétances!F147,Compétances!$B147,\"zz\")","v":"zz"},{"$f":"IFERROR(IF(INDEX(A175:D175,MATCH($I$3,$A$5:$D$5,0))<>\"zz\",MAX($E$5:E174)+1,\"\"),\"\")","v":""},{"$f":"IF(ROWS(F$6:F175)<=MAX(E:E),INDEX(A:D,MATCH(ROWS(F$6:F175),E:E,0),MATCH($I$3,$A$5:$D$5,0)),\"\")","v":""}]
[{"$f":"IF(Compétances!$D$1=Compétances!C148,Compétances!$B148,\"zz\")","v":"Michel"},{"$f":"IF(Compétances!$D$1=Compétances!D148,Compétances!$B148,\"zz\")","v":"Michel"},{"$f":"IF(Compétances!$D$1=Compétances!E148,Compétances!$B148,\"zz\")","v":"Michel"},{"$f":"IF(Compétances!$D$1=Compétances!F148,Compétances!$B148,\"zz\")","v":"Michel"},{"$f":"IFERROR(IF(INDEX(A176:D176,MATCH($I$3,$A$5:$D$5,0))<>\"zz\",MAX($E$5:E175)+1,\"\"),\"\")","v":85},{"$f":"IF(ROWS(F$6:F176)<=MAX(E:E),INDEX(A:D,MATCH(ROWS(F$6:F176),E:E,0),MATCH($I$3,$A$5:$D$5,0)),\"\")","v":""}]
[{"$f":"IF(Compétances!$D$1=Compétances!C149,Compétances!$B149,\"zz\")","v":"zz"},{"$f":"IF(Compétances!$D$1=Compétances!D149,Compétances!$B149,\"zz\")","v":"Jacques "},{"$f":"IF(Compétances!$D$1=Compétances!E149,Compétances!$B149,\"zz\")","v":"zz"},{"$f":"IF(Compétances!$D$1=Compétances!F149,Compétances!$B149,\"zz\")","v":"zz"},{"$f":"IFERROR(IF(INDEX(A177:D177,MATCH($I$3,$A$5:$D$5,0))<>\"zz\",MAX($E$5:E176)+1,\"\"),\"\")","v":86},{"$f":"IF(ROWS(F$6:F177)<=MAX(E:E),INDEX(A:D,MATCH(ROWS(F$6:F177),E:E,0),MATCH($I$3,$A$5:$D$5,0)),\"\")","v":""}]
[{"$f":"IF(Compétances!$D$1=Compétances!#REF!,Compétances!#REF!,\"zz\")","v":{"$error":"#REF!"}},{"$f":"IF(Compétances!$D$1=Compétances!#REF!,Compétances!#REF!,\"zz\")","v":{"$error":"#REF!"}},{"$f":"IF(Compétances!$D$1=Compétances!#REF!,Compétances!#REF!,\"zz\")","v":{"$error":"#REF!"}},{"$f":"IF(Compétances!$D$1=Compétances!#REF!,Compétances!#REF!,\"zz\")","v":{"$error":"#REF!"}},{"$f":"IFERROR(IF(INDEX(A178:D178,MATCH($I$3,$A$5:$D$5,0))<>\"zz\",MAX($E$5:E177)+1,\"\"),\"\")","v":""},{"$f":"IF(ROWS(F$6:F178)<=MAX(E:E),INDEX(A:D,MATCH(ROWS(F$6:F178),E:E,0),MATCH($I$3,$A$5:$D$5,0)),\"\")","v":""}]
[{"$f":"IF(Compétances!$D$1=Compétances!C150,Compétances!$B150,\"zz\")","v":"Jean Mi"},{"$f":"IF(Compétances!$D$1=Compétances!D150,Compétances!$B150,\"zz\")","v":"Jean Mi"},{"$f":"IF(Compétances!$D$1=Compétances!E150,Compétances!$B150,\"zz\")","v":"Jean Mi"},{"$f":"IF(Compétances!$D$1=Compétances!F150,Compétances!$B150,\"zz\")","v":"Jean Mi"},{"$f":"IFERROR(IF(INDEX(A179:D179,MATCH($I$3,$A$5:$D$5,0))<>\"zz\",MAX($E$5:E178)+1,\"\"),\"\")","v":87},{"$f":"IF(ROWS(F$6:F179)<=MAX(E:E),INDEX(A:D,MATCH(ROWS(F$6:F179),E:E,0),MATCH($I$3,$A$5:$D$5,0)),\"\")","v":""}]
[{"$f":"IF(Compétances!$D$1=Compétances!C151,Compétances!$B151,\"zz\")","v":"Eric"},{"$f":"IF(Compétances!$D$1=Compétances!D151,Compétances!$B151,\"zz\")","v":"zz"},{"$f":"IF(Compétances!$D$1=Compétances!E151,Compétances!$B151,\"zz\")","v":"Eric"},{"$f":"IF(Compétances!$D$1=Compétances!F151,Compétances!$B151,\"zz\")","v":"zz"},{"$f":"IFERROR(IF(INDEX(A180:D180,MATCH($I$3,$A$5:$D$5,0))<>\"zz\",MAX($E$5:E179)+1,\"\"),\"\")","v":""},{"$f":"IF(ROWS(F$6:F180)<=MAX(E:E),INDEX(A:D,MATCH(ROWS(F$6:F180),E:E,0),MATCH($I$3,$A$5:$D$5,0)),\"\")","v":""}]
[{"$f":"IF(Compétances!$D$1=Compétances!C152,Compétances!$B152,\"zz\")","v":"zz"},{"$f":"IF(Compétances!$D$1=Compétances!D152,Compétances!$B152,\"zz\")","v":"zz"},{"$f":"IF(Compétances!$D$1=Compétances!E152,Compétances!$B152,\"zz\")","v":"Paul "},{"$f":"IF(Compétances!$D$1=Compétances!F152,Compétances!$B152,\"zz\")","v":"zz"},{"$f":"IFERROR(IF(INDEX(A181:D181,MATCH($I$3,$A$5:$D$5,0))<>\"zz\",MAX($E$5:E180)+1,\"\"),\"\")","v":""},{"$f":"IF(ROWS(F$6:F181)<=MAX(E:E),INDEX(A:D,MATCH(ROWS(F$6:F181),E:E,0),MATCH($I$3,$A$5:$D$5,0)),\"\")","v":""}]
[{"$f":"IF(Compétances!$D$1=Compétances!C153,Compétances!$B153,\"zz\")","v":"Michel"},{"$f":"IF(Compétances!$D$1=Compétances!D153,Compétances!$B153,\"zz\")","v":"Michel"},{"$f":"IF(Compétances!$D$1=Compétances!E153,Compétances!$B153,\"zz\")","v":"Michel"},{"$f":"IF(Compétances!$D$1=Compétances!F153,Compétances!$B153,\"zz\")","v":"Michel"},{"$f":"IFERROR(IF(INDEX(A182:D182,MATCH($I$3,$A$5:$D$5,0))<>\"zz\",MAX($E$5:E181)+1,\"\"),\"\")","v":88},{"$f":"IF(ROWS(F$6:F182)<=MAX(E:E),INDEX(A:D,MATCH(ROWS(F$6:F182),E:E,0),MATCH($I$3,$A$5:$D$5,0)),\"\")","v":""}]
[{"$f":"IF(Compétances!$D$1=Compétances!C154,Compétances!$B154,\"zz\")","v":"zz"},{"$f":"IF(Compétances!$D$1=Compétances!D154,Compétances!$B154,\"zz\")","v":"Jacques "},{"$f":"IF(Compétances!$D$1=Compétances!E154,Compétances!$B154,\"zz\")","v":"zz"},{"$f":"IF(Compétances!$D$1=Compétances!F154,Compétances!$B154,\"zz\")","v":"zz"},{"$f":"IFERROR(IF(INDEX(A183:D183,MATCH($I$3,$A$5:$D$5,0))<>\"zz\",MAX($E$5:E182)+1,\"\"),\"\")","v":89},{"$f":"IF(ROWS(F$6:F183)<=MAX(E:E),INDEX(A:D,MATCH(ROWS(F$6:F183),E:E,0),MATCH($I$3,$A$5:$D$5,0)),\"\")","v":""}]
[{"$f":"IF(Compétances!$D$1=Compétances!#REF!,Compétances!#REF!,\"zz\")","v":{"$error":"#REF!"}},{"$f":"IF(Compétances!$D$1=Compétances!#REF!,Compétances!#REF!,\"zz\")","v":{"$error":"#REF!"}},{"$f":"IF(Compétances!$D$1=Compétances!#REF!,Compétances!#REF!,\"zz\")","v":{"$error":"#REF!"}},{"$f":"IF(Compétances!$D$1=Compétances!#REF!,Compétances!#REF!,\"zz\")","v":{"$error":"#REF!"}},{"$f":"IFERROR(IF(INDEX(A184:D184,MATCH($I$3,$A$5:$D$5,0))<>\"zz\",MAX($E$5:E183)+1,\"\"),\"\")","v":""},{"$f":"IF(ROWS(F$6:F184)<=MAX(E:E),INDEX(A:D,MATCH(ROWS(F$6:F184),E:E,0),MATCH($I$3,$A$5:$D$5,0)),\"\")","v":""}]
[{"$f":"IF(Compétances!$D$1=Compétances!C155,Compétances!$B155,\"zz\")","v":"Jean Mi"},{"$f":"IF(Compétances!$D$1=Compétances!D155,Compétances!$B155,\"zz\")","v":"Jean Mi"},{"$f":"IF(Compétances!$D$1=Compétances!E155,Compétances!$B155,\"zz\")","v":"Jean Mi"},{"$f":"IF(Compétances!$D$1=Compétances!F155,Compétances!$B155,\"zz\")","v":"Jean Mi"},{"$f":"IFERROR(IF(INDEX(A185:D185,MATCH($I$3,$A$5:$D$5,0))<>\"zz\",MAX($E$5:E184)+1,\"\"),\"\")","v":90},{"$f":"IF(ROWS(F$6:F185)<=MAX(E:E),INDEX(A:D,MATCH(ROWS(F$6:F185),E:E,0),MATCH($I$3,$A$5:$D$5,0)),\"\")","v":""}]
[{"$f":"IF(Compétances!$D$1=Compétances!C156,Compétances!$B156,\"zz\")","v":"Eric"},{"$f":"IF(Compétances!$D$1=Compétances!D156,Compétances!$B156,\"zz\")","v":"zz"},{"$f":"IF(Compétances!$D$1=Compétances!E156,Compétances!$B156,\"zz\")","v":"Eric"},{"$f":"IF(Compétances!$D$1=Compétances!F156,Compétances!$B156,\"zz\")","v":"zz"},{"$f":"IFERROR(IF(INDEX(A186:D186,MATCH($I$3,$A$5:$D$5,0))<>\"zz\",MAX($E$5:E185)+1,\"\"),\"\")","v":""},{"$f":"IF(ROWS(F$6:F186)<=MAX(E:E),INDEX(A:D,MATCH(ROWS(F$6:F186),E:E,0),MATCH($I$3,$A$5:$D$5,0)),\"\")","v":""}]
[{"$f":"IF(Compétances!$D$1=Compétances!C157,Compétances!$B157,\"zz\")","v":"zz"},{"$f":"IF(Compétances!$D$1=Compétances!D157,Compétances!$B157,\"zz\")","v":"zz"},{"$f":"IF(Compétances!$D$1=Compétances!E157,Compétances!$B157,\"zz\")","v":"Paul "},{"$f":"IF(Compétances!$D$1=Compétances!F157,Compétances!$B157,\"zz\")","v":"zz"},{"$f":"IFERROR(IF(INDEX(A187:D187,MATCH($I$3,$A$5:$D$5,0))<>\"zz\",MAX($E$5:E186)+1,\"\"),\"\")","v":""},{"$f":"IF(ROWS(F$6:F187)<=MAX(E:E),INDEX(A:D,MATCH(ROWS(F$6:F187),E:E,0),MATCH($I$3,$A$5:$D$5,0)),\"\")","v":""}]
[{"$f":"IF(Compétances!$D$1=Compétances!C158,Compétances!$B158,\"zz\")","v":"Michel"},{"$f":"IF(Compétances!$D$1=Compétances!D158,Compétances!$B158,\"zz\")","v":"Michel"},{"$f":"IF(Compétances!$D$1=Compétances!E158,Compétances!$B158,\"zz\")","v":"Michel"},{"$f":"IF(Compétances!$D$1=Compétances!F158,Compétances!$B158,\"zz\")","v":"Michel"},{"$f":"IFERROR(IF(INDEX(A188:D188,MATCH($I$3,$A$5:$D$5,0))<>\"zz\",MAX($E$5:E187)+1,\"\"),\"\")","v":91},{"$f":"IF(ROWS(F$6:F188)<=MAX(E:E),INDEX(A:D,MATCH(ROWS(F$6:F188),E:E,0),MATCH($I$3,$A$5:$D$5,0)),\"\")","v":""}]
[{"$f":"IF(Compétances!$D$1=Compétances!C159,Compétances!$B159,\"zz\")","v":"zz"},{"$f":"IF(Compétances!$D$1=Compétances!D159,Compétances!$B159,\"zz\")","v":"Jacques "},{"$f":"IF(Compétances!$D$1=Compétances!E159,Compétances!$B159,\"zz\")","v":"zz"},{"$f":"IF(Compétances!$D$1=Compétances!F159,Compétances!$B159,\"zz\")","v":"zz"},{"$f":"IFERROR(IF(INDEX(A189:D189,MATCH($I$3,$A$5:$D$5,0))<>\"zz\",MAX($E$5:E188)+1,\"\"),\"\")","v":92},{"$f":"IF(ROWS(F$6:F189)<=MAX(E:E),INDEX(A:D,MATCH(ROWS(F$6:F189),E:E,0),MATCH($I$3,$A$5:$D$5,0)),\"\")","v":""}]
[{"$f":"IF(Compétances!$D$1=Compétances!#REF!,Compétances!#REF!,\"zz\")","v":{"$error":"#REF!"}},{"$f":"IF(Compétances!$D$1=Compétances!#REF!,Compétances!#REF!,\"zz\")","v":{"$error":"#REF!"}},{"$f":"IF(Compétances!$D$1=Compétances!#REF!,Compétances!#REF!,\"zz\")","v":{"$error":"#REF!"}},{"$f":"IF(Compétances!$D$1=Compétances!#REF!,Compétances!#REF!,\"zz\")","v":{"$error":"#REF!"}},{"$f":"IFERROR(IF(INDEX(A190:D190,MATCH($I$3,$A$5:$D$5,0))<>\"zz\",MAX($E$5:E189)+1,\"\"),\"\")","v":""},{"$f":"IF(ROWS(F$6:F190)<=MAX(E:E),INDEX(A:D,MATCH(ROWS(F$6:F190),E:E,0),MATCH($I$3,$A$5:$D$5,0)),\"\")","v":""}]
[{"$f":"IF(Compétances!$D$1=Compétances!C160,Compétances!$B160,\"zz\")","v":"Jean Mi"},{"$f":"IF(Compétances!$D$1=Compétances!D160,Compétances!$B160,\"zz\")","v":"Jean Mi"},{"$f":"IF(Compétances!$D$1=Compétances!E160,Compétances!$B160,\"zz\")","v":"Jean Mi"},{"$f":"IF(Compétances!$D$1=Compétances!F160,Compétances!$B160,\"zz\")","v":"Jean Mi"},{"$f":"IFERROR(IF(INDEX(A191:D191,MATCH($I$3,$A$5:$D$5,0))<>\"zz\",MAX($E$5:E190)+1,\"\"),\"\")","v":93},{"$f":"IF(ROWS(F$6:F191)<=MAX(E:E),INDEX(A:D,MATCH(ROWS(F$6:F191),E:E,0),MATCH($I$3,$A$5:$D$5,0)),\"\")","v":""}]
[{"$f":"IF(Compétances!$D$1=Compétances!C161,Compétances!$B161,\"zz\")","v":"Eric"},{"$f":"IF(Compétances!$D$1=Compétances!D161,Compétances!$B161,\"zz\")","v":"zz"},{"$f":"IF(Compétances!$D$1=Compétances!E161,Compétances!$B161,\"zz\")","v":"Eric"},{"$f":"IF(Compétances!$D$1=Compétances!F161,Compétances!$B161,\"zz\")","v":"zz"},{"$f":"IFERROR(IF(INDEX(A192:D192,MATCH($I$3,$A$5:$D$5,0))<>\"zz\",MAX($E$5:E191)+1,\"\"),\"\")","v":""},{"$f":"IF(ROWS(F$6:F192)<=MAX(E:E),INDEX(A:D,MATCH(ROWS(F$6:F192),E:E,0),MATCH($I$3,$A$5:$D$5,0)),\"\")","v":""}]
[{"$f":"IF(Compétances!$D$1=Compétances!C162,Compétances!$B162,\"zz\")","v":"zz"},{"$f":"IF(Compétances!$D$1=Compétances!D162,Compétances!$B162,\"zz\")","v":"zz"},{"$f":"IF(Compétances!$D$1=Compétances!E162,Compétances!$B162,\"zz\")","v":"Paul "},{"$f":"IF(Compétances!$D$1=Compétances!F162,Compétances!$B162,\"zz\")","v":"zz"},{"$f":"IFERROR(IF(INDEX(A193:D193,MATCH($I$3,$A$5:$D$5,0))<>\"zz\",MAX($E$5:E192)+1,\"\"),\"\")","v":""},{"$f":"IF(ROWS(F$6:F193)<=MAX(E:E),INDEX(A:D,MATCH(ROWS(F$6:F193),E:E,0),MATCH($I$3,$A$5:$D$5,0)),\"\")","v":""}]
[{"$f":"IF(Compétances!$D$1=Compétances!C163,Compétances!$B163,\"zz\")","v":"Michel"},{"$f":"IF(Compétances!$D$1=Compétances!D163,Compétances!$B163,\"zz\")","v":"Michel"},{"$f":"IF(Compétances!$D$1=Compétances!E163,Compétances!$B163,\"zz\")","v":"Michel"},{"$f":"IF(Compétances!$D$1=Compétances!F163,Compétances!$B163,\"zz\")","v":"Michel"},{"$f":"IFERROR(IF(INDEX(A194:D194,MATCH($I$3,$A$5:$D$5,0))<>\"zz\",MAX($E$5:E193)+1,\"\"),\"\")","v":94},{"$f":"IF(ROWS(F$6:F194)<=MAX(E:E),INDEX(A:D,MATCH(ROWS(F$6:F194),E:E,0),MATCH($I$3,$A$5:$D$5,0)),\"\")","v":""}]
[{"$f":"IF(Compétances!$D$1=Compétances!C164,Compétances!$B164,\"zz\")","v":"zz"},{"$f":"IF(Compétances!$D$1=Compétances!D164,Compétances!$B164,\"zz\")","v":"Jacques "},{"$f":"IF(Compétances!$D$1=Compétances!E164,Compétances!$B164,\"zz\")","v":"zz"},{"$f":"IF(Compétances!$D$1=Compétances!F164,Compétances!$B164,\"zz\")","v":"zz"},{"$f":"IFERROR(IF(INDEX(A195:D195,MATCH($I$3,$A$5:$D$5,0))<>\"zz\",MAX($E$5:E194)+1,\"\"),\"\")","v":95},{"$f":"IF(ROWS(F$6:F195)<=MAX(E:E),INDEX(A:D,MATCH(ROWS(F$6:F195),E:E,0),MATCH($I$3,$A$5:$D$5,0)),\"\")","v":""}]
[{"$f":"IF(Compétances!$D$1=Compétances!#REF!,Compétances!#REF!,\"zz\")","v":{"$error":"#REF!"}},{"$f":"IF(Compétances!$D$1=Compétances!#REF!,Compétances!#REF!,\"zz\")","v":{"$error":"#REF!"}},{"$f":"IF(Compétances!$D$1=Compétances!#REF!,Compétances!#REF!,\"zz\")","v":{"$error":"#REF!"}},{"$f":"IF(Compétances!$D$1=Compétances!#REF!,Compétances!#REF!,\"zz\")","v":{"$error":"#REF!"}},{"$f":"IFERROR(IF(INDEX(A196:D196,MATCH($I$3,$A$5:$D$5,0))<>\"zz\",MAX($E$5:E195)+1,\"\"),\"\")","v":""},{"$f":"IF(ROWS(F$6:F196)<=MAX(E:E),INDEX(A:D,MATCH(ROWS(F$6:F196),E:E,0),MATCH($I$3,$A$5:$D$5,0)),\"\")","v":""}]
[{"$f":"IF(Compétances!$D$1=Compétances!C165,Compétances!$B165,\"zz\")","v":"Jean Mi"},{"$f":"IF(Compétances!$D$1=Compétances!D165,Compétances!$B165,\"zz\")","v":"Jean Mi"},{"$f":"IF(Compétances!$D$1=Compétances!E165,Compétances!$B165,\"zz\")","v":"Jean Mi"},{"$f":"IF(Compétances!$D$1=Compétances!F165,Compétances!$B165,\"zz\")","v":"Jean Mi"},{"$f":"IFERROR(IF(INDEX(A197:D197,MATCH($I$3,$A$5:$D$5,0))<>\"zz\",MAX($E$5:E196)+1,\"\"),\"\")","v":96},{"$f":"IF(ROWS(F$6:F197)<=MAX(E:E),INDEX(A:D,MATCH(ROWS(F$6:F197),E:E,0),MATCH($I$3,$A$5:$D$5,0)),\"\")","v":""}]
[{"$f":"IF(Compétances!$D$1=Compétances!C166,Compétances!$B166,\"zz\")","v":"Eric"},{"$f":"IF(Compétances!$D$1=Compétances!D166,Compétances!$B166,\"zz\")","v":"zz"},{"$f":"IF(Compétances!$D$1=Compétances!E166,Compétances!$B166,\"zz\")","v":"Eric"},{"$f":"IF(Compétances!$D$1=Compétances!F166,Compétances!$B166,\"zz\")","v":"zz"},{"$f":"IFERROR(IF(INDEX(A198:D198,MATCH($I$3,$A$5:$D$5,0))<>\"zz\",MAX($E$5:E197)+1,\"\"),\"\")","v":""},{"$f":"IF(ROWS(F$6:F198)<=MAX(E:E),INDEX(A:D,MATCH(ROWS(F$6:F198),E:E,0),MATCH($I$3,$A$5:$D$5,0)),\"\")","v":""}]
[{"$f":"IF(Compétances!$D$1=Compétances!C167,Compétances!$B167,\"zz\")","v":"zz"},{"$f":"IF(Compétances!$D$1=Compétances!D167,Compétances!$B167,\"zz\")","v":"zz"},{"$f":"IF(Compétances!$D$1=Compétances!E167,Compétances!$B167,\"zz\")","v":"Paul "},{"$f":"IF(Compétances!$D$1=Compétances!F167,Compétances!$B167,\"zz\")","v":"zz"},{"$f":"IFERROR(IF(INDEX(A199:D199,MATCH($I$3,$A$5:$D$5,0))<>\"zz\",MAX($E$5:E198)+1,\"\"),\"\")","v":""},{"$f":"IF(ROWS(F$6:F199)<=MAX(E:E),INDEX(A:D,MATCH(ROWS(F$6:F199),E:E,0),MATCH($I$3,$A$5:$D$5,0)),\"\")","v":""}]
[{"$f":"IF(Compétances!$D$1=Compétances!C168,Compétances!$B168,\"zz\")","v":"Michel"},{"$f":"IF(Compétances!$D$1=Compétances!D168,Compétances!$B168,\"zz\")","v":"Michel"},{"$f":"IF(Compétances!$D$1=Compétances!E168,Compétances!$B168,\"zz\")","v":"Michel"},{"$f":"IF(Compétances!$D$1=Compétances!F168,Compétances!$B168,\"zz\")","v":"Michel"},{"$f":"IFERROR(IF(INDEX(A200:D200,MATCH($I$3,$A$5:$D$5,0))<>\"zz\",MAX($E$5:E199)+1,\"\"),\"\")","v":97},{"$f":"IF(ROWS(F$6:F200)<=MAX(E:E),INDEX(A:D,MATCH(ROWS(F$6:F200),E:E,0),MATCH($I$3,$A$5:$D$5,0)),\"\")","v":""}]
[{"$f":"IF(Compétances!$D$1=Compétances!C169,Compétances!$B169,\"zz\")","v":"zz"},{"$f":"IF(Compétances!$D$1=Compétances!D169,Compétances!$B169,\"zz\")","v":"Jacques "},{"$f":"IF(Compétances!$D$1=Compétances!E169,Compétances!$B169,\"zz\")","v":"zz"},{"$f":"IF(Compétances!$D$1=Compétances!F169,Compétances!$B169,\"zz\")","v":"zz"},{"$f":"IFERROR(IF(INDEX(A201:D201,MATCH($I$3,$A$5:$D$5,0))<>\"zz\",MAX($E$5:E200)+1,\"\"),\"\")","v":98},{"$f":"IF(ROWS(F$6:F201)<=MAX(E:E),INDEX(A:D,MATCH(ROWS(F$6:F201),E:E,0),MATCH($I$3,$A$5:$D$5,0)),\"\")","v":""}]
[{"$f":"IF(Compétances!$D$1=Compétances!#REF!,Compétances!#REF!,\"zz\")","v":{"$error":"#REF!"}},{"$f":"IF(Compétances!$D$1=Compétances!#REF!,Compétances!#REF!,\"zz\")","v":{"$error":"#REF!"}},{"$f":"IF(Compétances!$D$1=Compétances!#REF!,Compétances!#REF!,\"zz\")","v":{"$error":"#REF!"}},{"$f":"IF(Compétances!$D$1=Compétances!#REF!,Compétances!#REF!,\"zz\")","v":{"$error":"#REF!"}},{"$f":"IFERROR(IF(INDEX(A202:D202,MATCH($I$3,$A$5:$D$5,0))<>\"zz\",MAX($E$5:E201)+1,\"\"),\"\")","v":""},{"$f":"IF(ROWS(F$6:F202)<=MAX(E:E),INDEX(A:D,MATCH(ROWS(F$6:F202),E:E,0),MATCH($I$3,$A$5:$D$5,0)),\"\")","v":""}]
[{"$f":"IF(Compétances!$D$1=Compétances!C170,Compétances!$B170,\"zz\")","v":"Jean Mi"},{"$f":"IF(Compétances!$D$1=Compétances!D170,Compétances!$B170,\"zz\")","v":"Jean Mi"},{"$f":"IF(Compétances!$D$1=Compétances!E170,Compétances!$B170,\"zz\")","v":"Jean Mi"},{"$f":"IF(Compétances!$D$1=Compétances!F170,Compétances!$B170,\"zz\")","v":"Jean Mi"},{"$f":"IFERROR(IF(INDEX(A203:D203,MATCH($I$3,$A$5:$D$5,0))<>\"zz\",MAX($E$5:E202)+1,\"\"),\"\")","v":99},{"$f":"IF(ROWS(F$6:F203)<=MAX(E:E),INDEX(A:D,MATCH(ROWS(F$6:F203),E:E,0),MATCH($I$3,$A$5:$D$5,0)),\"\")","v":""}]
[{"$f":"IF(Compétances!$D$1=Compétances!C171,Compétances!$B171,\"zz\")","v":"Eric"},{"$f":"IF(Compétances!$D$1=Compétances!D171,Compétances!$B171,\"zz\")","v":"zz"},{"$f":"IF(Compétances!$D$1=Compétances!E171,Compétances!$B171,\"zz\")","v":"Eric"},{"$f":"IF(Compétances!$D$1=Compétances!F171,Compétances!$B171,\"zz\")","v":"zz"},{"$f":"IFERROR(IF(INDEX(A204:D204,MATCH($I$3,$A$5:$D$5,0))<>\"zz\",MAX($E$5:E203)+1,\"\"),\"\")","v":""},{"$f":"IF(ROWS(F$6:F204)<=MAX(E:E),INDEX(A:D,MATCH(ROWS(F$6:F204),E:E,0),MATCH($I$3,$A$5:$D$5,0)),\"\")","v":""}]
[{"$f":"IF(Compétances!$D$1=Compétances!C172,Compétances!$B172,\"zz\")","v":"zz"},{"$f":"IF(Compétances!$D$1=Compétances!D172,Compétances!$B172,\"zz\")","v":"zz"},{"$f":"IF(Compétances!$D$1=Compétances!E172,Compétances!$B172,\"zz\")","v":"Paul "},{"$f":"IF(Compétances!$D$1=Compétances!F172,Compétances!$B172,\"zz\")","v":"zz"},{"$f":"IFERROR(IF(INDEX(A205:D205,MATCH($I$3,$A$5:$D$5,0))<>\"zz\",MAX($E$5:E204)+1,\"\"),\"\")","v":""},{"$f":"IF(ROWS(F$6:F205)<=MAX(E:E),INDEX(A:D,MATCH(ROWS(F$6:F205),E:E,0),MATCH($I$3,$A$5:$D$5,0)),\"\")","v":""}]
[{"$f":"IF(Compétances!$D$1=Compétances!C173,Compétances!$B173,\"zz\")","v":"Michel"},{"$f":"IF(Compétances!$D$1=Compétances!D173,Compétances!$B173,\"zz\")","v":"Michel"},{"$f":"IF(Compétances!$D$1=Compétances!E173,Compétances!$B173,\"zz\")","v":"Michel"},{"$f":"IF(Compétances!$D$1=Compétances!F173,Compétances!$B173,\"zz\")","v":"Michel"},{"$f":"IFERROR(IF(INDEX(A206:D206,MATCH($I$3,$A$5:$D$5,0))<>\"zz\",MAX($E$5:E205)+1,\"\"),\"\")","v":100},{"$f":"IF(ROWS(F$6:F206)<=MAX(E:E),INDEX(A:D,MATCH(ROWS(F$6:F206),E:E,0),MATCH($I$3,$A$5:$D$5,0)),\"\")","v":""}]
[{"$f":"IF(Compétances!$D$1=Compétances!C174,Compétances!$B174,\"zz\")","v":"zz"},{"$f":"IF(Compétances!$D$1=Compétances!D174,Compétances!$B174,\"zz\")","v":"Jacques "},{"$f":"IF(Compétances!$D$1=Compétances!E174,Compétances!$B174,\"zz\")","v":"zz"},{"$f":"IF(Compétances!$D$1=Compétances!F174,Compétances!$B174,\"zz\")","v":"zz"},{"$f":"IFERROR(IF(INDEX(A207:D207,MATCH($I$3,$A$5:$D$5,0))<>\"zz\",MAX($E$5:E206)+1,\"\"),\"\")","v":101},{"$f":"IF(ROWS(F$6:F207)<=MAX(E:E),INDEX(A:D,MATCH(ROWS(F$6:F207),E:E,0),MATCH($I$3,$A$5:$D$5,0)),\"\")","v":""}]
[{"$f":"IF(Compétances!$D$1=Compétances!#REF!,Compétances!#REF!,\"zz\")","v":{"$error":"#REF!"}},{"$f":"IF(Compétances!$D$1=Compétances!#REF!,Compétances!#REF!,\"zz\")","v":{"$error":"#REF!"}},{"$f":"IF(Compétances!$D$1=Compétances!#REF!,Compétances!#REF!,\"zz\")","v":{"$error":"#REF!"}},{"$f":"IF(Compétances!$D$1=Compétances!#REF!,Compétances!#REF!,\"zz\")","v":{"$error":"#REF!"}},{"$f":"IFERROR(IF(INDEX(A208:D208,MATCH($I$3,$A$5:$D$5,0))<>\"zz\",MAX($E$5:E207)+1,\"\"),\"\")","v":""},{"$f":"IF(ROWS(F$6:F208)<=MAX(E:E),INDEX(A:D,MATCH(ROWS(F$6:F208),E:E,0),MATCH($I$3,$A$5:$D$5,0)),\"\")","v":""}]
[{"$f":"IF(Compétances!$D$1=Compétances!C175,Compétances!$B175,\"zz\")","v":"Jean Mi"},{"$f":"IF(Compétances!$D$1=Compétances!D175,Compétances!$B175,\"zz\")","v":"Jean Mi"},{"$f":"IF(Compétances!$D$1=Compétances!E175,Compétances!$B175,\"zz\")","v":"Jean Mi"},{"$f":"IF(Compétances!$D$1=Compétances!F175,Compétances!$B175,\"zz\")","v":"Jean Mi"},{"$f":"IFERROR(IF(INDEX(A209:D209,MATCH($I$3,$A$5:$D$5,0))<>\"zz\",MAX($E$5:E208)+1,\"\"),\"\")","v":102},{"$f":"IF(ROWS(F$6:F209)<=MAX(E:E),INDEX(A:D,MATCH(ROWS(F$6:F209),E:E,0),MATCH($I$3,$A$5:$D$5,0)),\"\")","v":""}]
[{"$f":"IF(Compétances!$D$1=Compétances!C176,Compétances!$B176,\"zz\")","v":"Eric"},{"$f":"IF(Compétances!$D$1=Compétances!D176,Compétances!$B176,\"zz\")","v":"zz"},{"$f":"IF(Compétances!$D$1=Compétances!E176,Compétances!$B176,\"zz\")","v":"Eric"},{"$f":"IF(Compétances!$D$1=Compétances!F176,Compétances!$B176,\"zz\")","v":"zz"},{"$f":"IFERROR(IF(INDEX(A210:D210,MATCH($I$3,$A$5:$D$5,0))<>\"zz\",MAX($E$5:E209)+1,\"\"),\"\")","v":""},{"$f":"IF(ROWS(F$6:F210)<=MAX(E:E),INDEX(A:D,MATCH(ROWS(F$6:F210),E:E,0),MATCH($I$3,$A$5:$D$5,0)),\"\")","v":""}]
[{"$f":"IF(Compétances!$D$1=Compétances!C177,Compétances!$B177,\"zz\")","v":"zz"},{"$f":"IF(Compétances!$D$1=Compétances!D177,Compétances!$B177,\"zz\")","v":"zz"},{"$f":"IF(Compétances!$D$1=Compétances!E177,Compétances!$B177,\"zz\")","v":"Paul "},{"$f":"IF(Compétances!$D$1=Compétances!F177,Compétances!$B177,\"zz\")","v":"zz"},{"$f":"IFERROR(IF(INDEX(A211:D211,MATCH($I$3,$A$5:$D$5,0))<>\"zz\",MAX($E$5:E210)+1,\"\"),\"\")","v":""},{"$f":"IF(ROWS(F$6:F211)<=MAX(E:E),INDEX(A:D,MATCH(ROWS(F$6:F211),E:E,0),MATCH($I$3,$A$5:$D$5,0)),\"\")","v":""}]
[{"$f":"IF(Compétances!$D$1=Compétances!C178,Compétances!$B178,\"zz\")","v":"Michel"},{"$f":"IF(Compétances!$D$1=Compétances!D178,Compétances!$B178,\"zz\")","v":"Michel"},{"$f":"IF(Compétances!$D$1=Compétances!E178,Compétances!$B178,\"zz\")","v":"Michel"},{"$f":"IF(Compétances!$D$1=Compétances!F178,Compétances!$B178,\"zz\")","v":"Michel"},{"$f":"IFERROR(IF(INDEX(A212:D212,MATCH($I$3,$A$5:$D$5,0))<>\"zz\",MAX($E$5:E211)+1,\"\"),\"\")","v":103},{"$f":"IF(ROWS(F$6:F212)<=MAX(E:E),INDEX(A:D,MATCH(ROWS(F$6:F212),E:E,0),MATCH($I$3,$A$5:$D$5,0)),\"\")","v":""}]
[{"$f":"IF(Compétances!$D$1=Compétances!C179,Compétances!$B179,\"zz\")","v":"zz"},{"$f":"IF(Compétances!$D$1=Compétances!D179,Compétances!$B179,\"zz\")","v":"Jacques "},{"$f":"IF(Compétances!$D$1=Compétances!E179,Compétances!$B179,\"zz\")","v":"zz"},{"$f":"IF(Compétances!$D$1=Compétances!F179,Compétances!$B179,\"zz\")","v":"zz"},{"$f":"IFERROR(IF(INDEX(A213:D213,MATCH($I$3,$A$5:$D$5,0))<>\"zz\",MAX($E$5:E212)+1,\"\"),\"\")","v":104},{"$f":"IF(ROWS(F$6:F213)<=MAX(E:E),INDEX(A:D,MATCH(ROWS(F$6:F213),E:E,0),MATCH($I$3,$A$5:$D$5,0)),\"\")","v":""}]
[{"$f":"IF(Compétances!$D$1=Compétances!#REF!,Compétances!#REF!,\"zz\")","v":{"$error":"#REF!"}},{"$f":"IF(Compétances!$D$1=Compétances!#REF!,Compétances!#REF!,\"zz\")","v":{"$error":"#REF!"}},{"$f":"IF(Compétances!$D$1=Compétances!#REF!,Compétances!#REF!,\"zz\")","v":{"$error":"#REF!"}},{"$f":"IF(Compétances!$D$1=Compétances!#REF!,Compétances!#REF!,\"zz\")","v":{"$error":"#REF!"}},{"$f":"IFERROR(IF(INDEX(A214:D214,MATCH($I$3,$A$5:$D$5,0))<>\"zz\",MAX($E$5:E213)+1,\"\"),\"\")","v":""},{"$f":"IF(ROWS(F$6:F214)<=MAX(E:E),INDEX(A:D,MATCH(ROWS(F$6:F214),E:E,0),MATCH($I$3,$A$5:$D$5,0)),\"\")","v":""}]
[{"$f":"IF(Compétances!$D$1=Compétances!C180,Compétances!$B180,\"zz\")","v":"Jean Mi"},{"$f":"IF(Compétances!$D$1=Compétances!D180,Compétances!$B180,\"zz\")","v":"Jean Mi"},{"$f":"IF(Compétances!$D$1=Compétances!E180,Compétances!$B180,\"zz\")","v":"Jean Mi"},{"$f":"IF(Compétances!$D$1=Compétances!F180,Compétances!$B180,\"zz\")","v":"Jean Mi"},{"$f":"IFERROR(IF(INDEX(A215:D215,MATCH($I$3,$A$5:$D$5,0))<>\"zz\",MAX($E$5:E214)+1,\"\"),\"\")","v":105},{"$f":"IF(ROWS(F$6:F215)<=MAX(E:E),INDEX(A:D,MATCH(ROWS(F$6:F215),E:E,0),MATCH($I$3,$A$5:$D$5,0)),\"\")","v":""}]
[{"$f":"IF(Compétances!$D$1=Compétances!C181,Compétances!$B181,\"zz\")","v":"Eric"},{"$f":"IF(Compétances!$D$1=Compétances!D181,Compétances!$B181,\"zz\")","v":"zz"},{"$f":"IF(Compétances!$D$1=Compétances!E181,Compétances!$B181,\"zz\")","v":"Eric"},{"$f":"IF(Compétances!$D$1=Compétances!F181,Compétances!$B181,\"zz\")","v":"zz"},{"$f":"IFERROR(IF(INDEX(A216:D216,MATCH($I$3,$A$5:$D$5,0))<>\"zz\",MAX($E$5:E215)+1,\"\"),\"\")","v":""},{"$f":"IF(ROWS(F$6:F216)<=MAX(E:E),INDEX(A:D,MATCH(ROWS(F$6:F216),E:E,0),MATCH($I$3,$A$5:$D$5,0)),\"\")","v":""}]
[{"$f":"IF(Compétances!$D$1=Compétances!C182,Compétances!$B182,\"zz\")","v":"zz"},{"$f":"IF(Compétances!$D$1=Compétances!D182,Compétances!$B182,\"zz\")","v":"zz"},{"$f":"IF(Compétances!$D$1=Compétances!E182,Compétances!$B182,\"zz\")","v":"Paul "},{"$f":"IF(Compétances!$D$1=Compétances!F182,Compétances!$B182,\"zz\")","v":"zz"},{"$f":"IFERROR(IF(INDEX(A217:D217,MATCH($I$3,$A$5:$D$5,0))<>\"zz\",MAX($E$5:E216)+1,\"\"),\"\")","v":""},{"$f":"IF(ROWS(F$6:F217)<=MAX(E:E),INDEX(A:D,MATCH(ROWS(F$6:F217),E:E,0),MATCH($I$3,$A$5:$D$5,0)),\"\")","v":""}]
[{"$f":"IF(Compétances!$D$1=Compétances!C183,Compétances!$B183,\"zz\")","v":"Michel"},{"$f":"IF(Compétances!$D$1=Compétances!D183,Compétances!$B183,\"zz\")","v":"Michel"},{"$f":"IF(Compétances!$D$1=Compétances!E183,Compétances!$B183,\"zz\")","v":"Michel"},{"$f":"IF(Compétances!$D$1=Compétances!F183,Compétances!$B183,\"zz\")","v":"Michel"},{"$f":"IFERROR(IF(INDEX(A218:D218,MATCH($I$3,$A$5:$D$5,0))<>\"zz\",MAX($E$5:E217)+1,\"\"),\"\")","v":106},{"$f":"IF(ROWS(F$6:F218)<=MAX(E:E),INDEX(A:D,MATCH(ROWS(F$6:F218),E:E,0),MATCH($I$3,$A$5:$D$5,0)),\"\")","v":""}]
[{"$f":"IF(Compétances!$D$1=Compétances!C184,Compétances!$B184,\"zz\")","v":"zz"},{"$f":"IF(Compétances!$D$1=Compétances!D184,Compétances!$B184,\"zz\")","v":"Jacques "},{"$f":"IF(Compétances!$D$1=Compétances!E184,Compétances!$B184,\"zz\")","v":"zz"},{"$f":"IF(Compétances!$D$1=Compétances!F184,Compétances!$B184,\"zz\")","v":"zz"},{"$f":"IFERROR(IF(INDEX(A219:D219,MATCH($I$3,$A$5:$D$5,0))<>\"zz\",MAX($E$5:E218)+1,\"\"),\"\")","v":107},{"$f":"IF(ROWS(F$6:F219)<=MAX(E:E),INDEX(A:D,MATCH(ROWS(F$6:F219),E:E,0),MATCH($I$3,$A$5:$D$5,0)),\"\")","v":""}]
[{"$f":"IF(Compétances!$D$1=Compétances!#REF!,Compétances!#REF!,\"zz\")","v":{"$error":"#REF!"}},{"$f":"IF(Compétances!$D$1=Compétances!#REF!,Compétances!#REF!,\"zz\")","v":{"$error":"#REF!"}},{"$f":"IF(Compétances!$D$1=Compétances!#REF!,Compétances!#REF!,\"zz\")","v":{"$error":"#REF!"}},{"$f":"IF(Compétances!$D$1=Compétances!#REF!,Compétances!#REF!,\"zz\")","v":{"$error":"#REF!"}},{"$f":"IFERROR(IF(INDEX(A220:D220,MATCH($I$3,$A$5:$D$5,0))<>\"zz\",MAX($E$5:E219)+1,\"\"),\"\")","v":""},{"$f":"IF(ROWS(F$6:F220)<=MAX(E:E),INDEX(A:D,MATCH(ROWS(F$6:F220),E:E,0),MATCH($I$3,$A$5:$D$5,0)),\"\")","v":""}]
[{"$f":"IF(Compétances!$D$1=Compétances!C185,Compétances!$B185,\"zz\")","v":"Jean Mi"},{"$f":"IF(Compétances!$D$1=Compétances!D185,Compétances!$B185,\"zz\")","v":"Jean Mi"},{"$f":"IF(Compétances!$D$1=Compétances!E185,Compétances!$B185,\"zz\")","v":"Jean Mi"},{"$f":"IF(Compétances!$D$1=Compétances!F185,Compétances!$B185,\"zz\")","v":"Jean Mi"},{"$f":"IFERROR(IF(INDEX(A221:D221,MATCH($I$3,$A$5:$D$5,0))<>\"zz\",MAX($E$5:E220)+1,\"\"),\"\")","v":108},{"$f":"IF(ROWS(F$6:F221)<=MAX(E:E),INDEX(A:D,MATCH(ROWS(F$6:F221),E:E,0),MATCH($I$3,$A$5:$D$5,0)),\"\")","v":""}]
[{"$f":"IF(Compétances!$D$1=Compétances!C186,Compétances!$B186,\"zz\")","v":"Eric"},{"$f":"IF(Compétances!$D$1=Compétances!D186,Compétances!$B186,\"zz\")","v":"zz"},{"$f":"IF(Compétances!$D$1=Compétances!E186,Compétances!$B186,\"zz\")","v":"Eric"},{"$f":"IF(Compétances!$D$1=Compétances!F186,Compétances!$B186,\"zz\")","v":"zz"},{"$f":"IFERROR(IF(INDEX(A222:D222,MATCH($I$3,$A$5:$D$5,0))<>\"zz\",MAX($E$5:E221)+1,\"\"),\"\")","v":""},{"$f":"IF(ROWS(F$6:F222)<=MAX(E:E),INDEX(A:D,MATCH(ROWS(F$6:F222),E:E,0),MATCH($I$3,$A$5:$D$5,0)),\"\")","v":""}]
[{"$f":"IF(Compétances!$D$1=Compétances!C187,Compétances!$B187,\"zz\")","v":"zz"},{"$f":"IF(Compétances!$D$1=Compétances!D187,Compétances!$B187,\"zz\")","v":"zz"},{"$f":"IF(Compétances!$D$1=Compétances!E187,Compétances!$B187,\"zz\")","v":"Paul "},{"$f":"IF(Compétances!$D$1=Compétances!F187,Compétances!$B187,\"zz\")","v":"zz"},{"$f":"IFERROR(IF(INDEX(A223:D223,MATCH($I$3,$A$5:$D$5,0))<>\"zz\",MAX($E$5:E222)+1,\"\"),\"\")","v":""},{"$f":"IF(ROWS(F$6:F223)<=MAX(E:E),INDEX(A:D,MATCH(ROWS(F$6:F223),E:E,0),MATCH($I$3,$A$5:$D$5,0)),\"\")","v":""}]
[{"$f":"IF(Compétances!$D$1=Compétances!C188,Compétances!$B188,\"zz\")","v":"Michel"},{"$f":"IF(Compétances!$D$1=Compétances!D188,Compétances!$B188,\"zz\")","v":"Michel"},{"$f":"IF(Compétances!$D$1=Compétances!E188,Compétances!$B188,\"zz\")","v":"Michel"},{"$f":"IF(Compétances!$D$1=Compétances!F188,Compétances!$B188,\"zz\")","v":"Michel"},{"$f":"IFERROR(IF(INDEX(A224:D224,MATCH($I$3,$A$5:$D$5,0))<>\"zz\",MAX($E$5:E223)+1,\"\"),\"\")","v":109},{"$f":"IF(ROWS(F$6:F224)<=MAX(E:E),INDEX(A:D,MATCH(ROWS(F$6:F224),E:E,0),MATCH($I$3,$A$5:$D$5,0)),\"\")","v":""}]
[{"$f":"IF(Compétances!$D$1=Compétances!C189,Compétances!$B189,\"zz\")","v":"zz"},{"$f":"IF(Compétances!$D$1=Compétances!D189,Compétances!$B189,\"zz\")","v":"Jacques "},{"$f":"IF(Compétances!$D$1=Compétances!E189,Compétances!$B189,\"zz\")","v":"zz"},{"$f":"IF(Compétances!$D$1=Compétances!F189,Compétances!$B189,\"zz\")","v":"zz"},{"$f":"IFERROR(IF(INDEX(A225:D225,MATCH($I$3,$A$5:$D$5,0))<>\"zz\",MAX($E$5:E224)+1,\"\"),\"\")","v":110},{"$f":"IF(ROWS(F$6:F225)<=MAX(E:E),INDEX(A:D,MATCH(ROWS(F$6:F225),E:E,0),MATCH($I$3,$A$5:$D$5,0)),\"\")","v":""}]
[{"$f":"IF(Compétances!$D$1=Compétances!#REF!,Compétances!#REF!,\"zz\")","v":{"$error":"#REF!"}},{"$f":"IF(Compétances!$D$1=Compétances!#REF!,Compétances!#REF!,\"zz\")","v":{"$error":"#REF!"}},{"$f":"IF(Compétances!$D$1=Compétances!#REF!,Compétances!#REF!,\"zz\")","v":{"$error":"#REF!"}},{"$f":"IF(Compétances!$D$1=Compétances!#REF!,Compétances!#REF!,\"zz\")","v":{"$error":"#REF!"}},{"$f":"IFERROR(IF(INDEX(A226:D226,MATCH($I$3,$A$5:$D$5,0))<>\"zz\",MAX($E$5:E225)+1,\"\"),\"\")","v":""},{"$f":"IF(ROWS(F$6:F226)<=MAX(E:E),INDEX(A:D,MATCH(ROWS(F$6:F226),E:E,0),MATCH($I$3,$A$5:$D$5,0)),\"\")","v":""}]
[{"$f":"IF(Compétances!$D$1=Compétances!C190,Compétances!$B190,\"zz\")","v":"Jean Mi"},{"$f":"IF(Compétances!$D$1=Compétances!D190,Compétances!$B190,\"zz\")","v":"Jean Mi"},{"$f":"IF(Compétances!$D$1=Compétances!E190,Compétances!$B190,\"zz\")","v":"Jean Mi"},{"$f":"IF(Compétances!$D$1=Compétances!F190,Compétances!$B190,\"zz\")","v":"Jean Mi"},{"$f":"IFERROR(IF(INDEX(A227:D227,MATCH($I$3,$A$5:$D$5,0))<>\"zz\",MAX($E$5:E226)+1,\"\"),\"\")","v":111},{"$f":"IF(ROWS(F$6:F227)<=MAX(E:E),INDEX(A:D,MATCH(ROWS(F$6:F227),E:E,0),MATCH($I$3,$A$5:$D$5,0)),\"\")","v":""}]
[{"$f":"IF(Compétances!$D$1=Compétances!C191,Compétances!$B191,\"zz\")","v":"Eric"},{"$f":"IF(Compétances!$D$1=Compétances!D191,Compétances!$B191,\"zz\")","v":"zz"},{"$f":"IF(Compétances!$D$1=Compétances!E191,Compétances!$B191,\"zz\")","v":"Eric"},{"$f":"IF(Compétances!$D$1=Compétances!F191,Compétances!$B191,\"zz\")","v":"zz"},{"$f":"IFERROR(IF(INDEX(A228:D228,MATCH($I$3,$A$5:$D$5,0))<>\"zz\",MAX($E$5:E227)+1,\"\"),\"\")","v":""},{"$f":"IF(ROWS(F$6:F228)<=MAX(E:E),INDEX(A:D,MATCH(ROWS(F$6:F228),E:E,0),MATCH($I$3,$A$5:$D$5,0)),\"\")","v":""}]
[{"$f":"IF(Compétances!$D$1=Compétances!C192,Compétances!$B192,\"zz\")","v":"zz"},{"$f":"IF(Compétances!$D$1=Compétances!D192,Compétances!$B192,\"zz\")","v":"zz"},{"$f":"IF(Compétances!$D$1=Compétances!E192,Compétances!$B192,\"zz\")","v":"Paul "},{"$f":"IF(Compétances!$D$1=Compétances!F192,Compétances!$B192,\"zz\")","v":"zz"},{"$f":"IFERROR(IF(INDEX(A229:D229,MATCH($I$3,$A$5:$D$5,0))<>\"zz\",MAX($E$5:E228)+1,\"\"),\"\")","v":""},{"$f":"IF(ROWS(F$6:F229)<=MAX(E:E),INDEX(A:D,MATCH(ROWS(F$6:F229),E:E,0),MATCH($I$3,$A$5:$D$5,0)),\"\")","v":""}]
[{"$f":"IF(Compétances!$D$1=Compétances!C193,Compétances!$B193,\"zz\")","v":"Michel"},{"$f":"IF(Compétances!$D$1=Compétances!D193,Compétances!$B193,\"zz\")","v":"Michel"},{"$f":"IF(Compétances!$D$1=Compétances!E193,Compétances!$B193,\"zz\")","v":"Michel"},{"$f":"IF(Compétances!$D$1=Compétances!F193,Compétances!$B193,\"zz\")","v":"Michel"},{"$f":"IFERROR(IF(INDEX(A230:D230,MATCH($I$3,$A$5:$D$5,0))<>\"zz\",MAX($E$5:E229)+1,\"\"),\"\")","v":112},{"$f":"IF(ROWS(F$6:F230)<=MAX(E:E),INDEX(A:D,MATCH(ROWS(F$6:F230),E:E,0),MATCH($I$3,$A$5:$D$5,0)),\"\")","v":""}]
[{"$f":"IF(Compétances!$D$1=Compétances!C194,Compétances!$B194,\"zz\")","v":"zz"},{"$f":"IF(Compétances!$D$1=Compétances!D194,Compétances!$B194,\"zz\")","v":"Jacques "},{"$f":"IF(Compétances!$D$1=Compétances!E194,Compétances!$B194,\"zz\")","v":"zz"},{"$f":"IF(Compétances!$D$1=Compétances!F194,Compétances!$B194,\"zz\")","v":"zz"},{"$f":"IFERROR(IF(INDEX(A231:D231,MATCH($I$3,$A$5:$D$5,0))<>\"zz\",MAX($E$5:E230)+1,\"\"),\"\")","v":113},{"$f":"IF(ROWS(F$6:F231)<=MAX(E:E),INDEX(A:D,MATCH(ROWS(F$6:F231),E:E,0),MATCH($I$3,$A$5:$D$5,0)),\"\")","v":""}]
[{"$f":"IF(Compétances!$D$1=Compétances!#REF!,Compétances!#REF!,\"zz\")","v":{"$error":"#REF!"}},{"$f":"IF(Compétances!$D$1=Compétances!#REF!,Compétances!#REF!,\"zz\")","v":{"$error":"#REF!"}},{"$f":"IF(Compétances!$D$1=Compétances!#REF!,Compétances!#REF!,\"zz\")","v":{"$error":"#REF!"}},{"$f":"IF(Compétances!$D$1=Compétances!#REF!,Compétances!#REF!,\"zz\")","v":{"$error":"#REF!"}},{"$f":"IFERROR(IF(INDEX(A232:D232,MATCH($I$3,$A$5:$D$5,0))<>\"zz\",MAX($E$5:E231)+1,\"\"),\"\")","v":""},{"$f":"IF(ROWS(F$6:F232)<=MAX(E:E),INDEX(A:D,MATCH(ROWS(F$6:F232),E:E,0),MATCH($I$3,$A$5:$D$5,0)),\"\")","v":""}]
[{"$f":"IF(Compétances!$D$1=Compétances!C195,Compétances!$B195,\"zz\")","v":"Jean Mi"},{"$f":"IF(Compétances!$D$1=Compétances!D195,Compétances!$B195,\"zz\")","v":"Jean Mi"},{"$f":"IF(Compétances!$D$1=Compétances!E195,Compétances!$B195,\"zz\")","v":"Jean Mi"},{"$f":"IF(Compétances!$D$1=Compétances!F195,Compétances!$B195,\"zz\")","v":"Jean Mi"},{"$f":"IFERROR(IF(INDEX(A233:D233,MATCH($I$3,$A$5:$D$5,0))<>\"zz\",MAX($E$5:E232)+1,\"\"),\"\")","v":114},{"$f":"IF(ROWS(F$6:F233)<=MAX(E:E),INDEX(A:D,MATCH(ROWS(F$6:F233),E:E,0),MATCH($I$3,$A$5:$D$5,0)),\"\")","v":""}]
[{"$f":"IF(Compétances!$D$1=Compétances!C196,Compétances!$B196,\"zz\")","v":"Eric"},{"$f":"IF(Compétances!$D$1=Compétances!D196,Compétances!$B196,\"zz\")","v":"zz"},{"$f":"IF(Compétances!$D$1=Compétances!E196,Compétances!$B196,\"zz\")","v":"Eric"},{"$f":"IF(Compétances!$D$1=Compétances!F196,Compétances!$B196,\"zz\")","v":"zz"},{"$f":"IFERROR(IF(INDEX(A234:D234,MATCH($I$3,$A$5:$D$5,0))<>\"zz\",MAX($E$5:E233)+1,\"\"),\"\")","v":""},{"$f":"IF(ROWS(F$6:F234)<=MAX(E:E),INDEX(A:D,MATCH(ROWS(F$6:F234),E:E,0),MATCH($I$3,$A$5:$D$5,0)),\"\")","v":""}]
[{"$f":"IF(Compétances!$D$1=Compétances!C197,Compétances!$B197,\"zz\")","v":"zz"},{"$f":"IF(Compétances!$D$1=Compétances!D197,Compétances!$B197,\"zz\")","v":"zz"},{"$f":"IF(Compétances!$D$1=Compétances!E197,Compétances!$B197,\"zz\")","v":"Paul "},{"$f":"IF(Compétances!$D$1=Compétances!F197,Compétances!$B197,\"zz\")","v":"zz"},{"$f":"IFERROR(IF(INDEX(A235:D235,MATCH($I$3,$A$5:$D$5,0))<>\"zz\",MAX($E$5:E234)+1,\"\"),\"\")","v":""},{"$f":"IF(ROWS(F$6:F235)<=MAX(E:E),INDEX(A:D,MATCH(ROWS(F$6:F235),E:E,0),MATCH($I$3,$A$5:$D$5,0)),\"\")","v":""}]
[{"$f":"IF(Compétances!$D$1=Compétances!C198,Compétances!$B198,\"zz\")","v":"Michel"},{"$f":"IF(Compétances!$D$1=Compétances!D198,Compétances!$B198,\"zz\")","v":"Michel"},{"$f":"IF(Compétances!$D$1=Compétances!E198,Compétances!$B198,\"zz\")","v":"Michel"},{"$f":"IF(Compétances!$D$1=Compétances!F198,Compétances!$B198,\"zz\")","v":"Michel"},{"$f":"IFERROR(IF(INDEX(A236:D236,MATCH($I$3,$A$5:$D$5,0))<>\"zz\",MAX($E$5:E235)+1,\"\"),\"\")","v":115},{"$f":"IF(ROWS(F$6:F236)<=MAX(E:E),INDEX(A:D,MATCH(ROWS(F$6:F236),E:E,0),MATCH($I$3,$A$5:$D$5,0)),\"\")","v":""}]
[{"$f":"IF(Compétances!$D$1=Compétances!C199,Compétances!$B199,\"zz\")","v":"zz"},{"$f":"IF(Compétances!$D$1=Compétances!D199,Compétances!$B199,\"zz\")","v":"Jacques "},{"$f":"IF(Compétances!$D$1=Compétances!E199,Compétances!$B199,\"zz\")","v":"zz"},{"$f":"IF(Compétances!$D$1=Compétances!F199,Compétances!$B199,\"zz\")","v":"zz"},{"$f":"IFERROR(IF(INDEX(A237:D237,MATCH($I$3,$A$5:$D$5,0))<>\"zz\",MAX($E$5:E236)+1,\"\"),\"\")","v":116},{"$f":"IF(ROWS(F$6:F237)<=MAX(E:E),INDEX(A:D,MATCH(ROWS(F$6:F237),E:E,0),MATCH($I$3,$A$5:$D$5,0)),\"\")","v":""}]
[{"$f":"IF(Compétances!$D$1=Compétances!#REF!,Compétances!#REF!,\"zz\")","v":{"$error":"#REF!"}},{"$f":"IF(Compétances!$D$1=Compétances!#REF!,Compétances!#REF!,\"zz\")","v":{"$error":"#REF!"}},{"$f":"IF(Compétances!$D$1=Compétances!#REF!,Compétances!#REF!,\"zz\")","v":{"$error":"#REF!"}},{"$f":"IF(Compétances!$D$1=Compétances!#REF!,Compétances!#REF!,\"zz\")","v":{"$error":"#REF!"}},{"$f":"IFERROR(IF(INDEX(A238:D238,MATCH($I$3,$A$5:$D$5,0))<>\"zz\",MAX($E$5:E237)+1,\"\"),\"\")","v":""},{"$f":"IF(ROWS(F$6:F238)<=MAX(E:E),INDEX(A:D,MATCH(ROWS(F$6:F238),E:E,0),MATCH($I$3,$A$5:$D$5,0)),\"\")","v":""}]
[{"$f":"IF(Compétances!$D$1=Compétances!C200,Compétances!$B200,\"zz\")","v":"Jean Mi"},{"$f":"IF(Compétances!$D$1=Compétances!D200,Compétances!$B200,\"zz\")","v":"Jean Mi"},{"$f":"IF(Compétances!$D$1=Compétances!E200,Compétances!$B200,\"zz\")","v":"Jean Mi"},{"$f":"IF(Compétances!$D$1=Compétances!F200,Compétances!$B200,\"zz\")","v":"Jean Mi"},{"$f":"IFERROR(IF(INDEX(A239:D239,MATCH($I$3,$A$5:$D$5,0))<>\"zz\",MAX($E$5:E238)+1,\"\"),\"\")","v":117},{"$f":"IF(ROWS(F$6:F239)<=MAX(E:E),INDEX(A:D,MATCH(ROWS(F$6:F239),E:E,0),MATCH($I$3,$A$5:$D$5,0)),\"\")","v":""}]
[{"$f":"IF(Compétances!$D$1=Compétances!C201,Compétances!$B201,\"zz\")","v":"Eric"},{"$f":"IF(Compétances!$D$1=Compétances!D201,Compétances!$B201,\"zz\")","v":"zz"},{"$f":"IF(Compétances!$D$1=Compétances!E201,Compétances!$B201,\"zz\")","v":"Eric"},{"$f":"IF(Compétances!$D$1=Compétances!F201,Compétances!$B201,\"zz\")","v":"zz"},{"$f":"IFERROR(IF(INDEX(A240:D240,MATCH($I$3,$A$5:$D$5,0))<>\"zz\",MAX($E$5:E239)+1,\"\"),\"\")","v":""},{"$f":"IF(ROWS(F$6:F240)<=MAX(E:E),INDEX(A:D,MATCH(ROWS(F$6:F240),E:E,0),MATCH($I$3,$A$5:$D$5,0)),\"\")","v":""}]
[{"$f":"IF(Compétances!$D$1=Compétances!C202,Compétances!$B202,\"zz\")","v":"zz"},{"$f":"IF(Compétances!$D$1=Compétances!D202,Compétances!$B202,\"zz\")","v":"zz"},{"$f":"IF(Compétances!$D$1=Compétances!E202,Compétances!$B202,\"zz\")","v":"Paul "},{"$f":"IF(Compétances!$D$1=Compétances!F202,Compétances!$B202,\"zz\")","v":"zz"},{"$f":"IFERROR(IF(INDEX(A241:D241,MATCH($I$3,$A$5:$D$5,0))<>\"zz\",MAX($E$5:E240)+1,\"\"),\"\")","v":""},{"$f":"IF(ROWS(F$6:F241)<=MAX(E:E),INDEX(A:D,MATCH(ROWS(F$6:F241),E:E,0),MATCH($I$3,$A$5:$D$5,0)),\"\")","v":""}]
[{"$f":"IF(Compétances!$D$1=Compétances!C203,Compétances!$B203,\"zz\")","v":"Michel"},{"$f":"IF(Compétances!$D$1=Compétances!D203,Compétances!$B203,\"zz\")","v":"Michel"},{"$f":"IF(Compétances!$D$1=Compétances!E203,Compétances!$B203,\"zz\")","v":"Michel"},{"$f":"IF(Compétances!$D$1=Compétances!F203,Compétances!$B203,\"zz\")","v":"Michel"},{"$f":"IFERROR(IF(INDEX(A242:D242,MATCH($I$3,$A$5:$D$5,0))<>\"zz\",MAX($E$5:E241)+1,\"\"),\"\")","v":118},{"$f":"IF(ROWS(F$6:F242)<=MAX(E:E),INDEX(A:D,MATCH(ROWS(F$6:F242),E:E,0),MATCH($I$3,$A$5:$D$5,0)),\"\")","v":""}]
[{"$f":"IF(Compétances!$D$1=Compétances!C204,Compétances!$B204,\"zz\")","v":"zz"},{"$f":"IF(Compétances!$D$1=Compétances!D204,Compétances!$B204,\"zz\")","v":"Jacques "},{"$f":"IF(Compétances!$D$1=Compétances!E204,Compétances!$B204,\"zz\")","v":"zz"},{"$f":"IF(Compétances!$D$1=Compétances!F204,Compétances!$B204,\"zz\")","v":"zz"},{"$f":"IFERROR(IF(INDEX(A243:D243,MATCH($I$3,$A$5:$D$5,0))<>\"zz\",MAX($E$5:E242)+1,\"\"),\"\")","v":119},{"$f":"IF(ROWS(F$6:F243)<=MAX(E:E),INDEX(A:D,MATCH(ROWS(F$6:F243),E:E,0),MATCH($I$3,$A$5:$D$5,0)),\"\")","v":""}]
[{"$f":"IF(Compétances!$D$1=Compétances!#REF!,Compétances!#REF!,\"zz\")","v":{"$error":"#REF!"}},{"$f":"IF(Compétances!$D$1=Compétances!#REF!,Compétances!#REF!,\"zz\")","v":{"$error":"#REF!"}},{"$f":"IF(Compétances!$D$1=Compétances!#REF!,Compétances!#REF!,\"zz\")","v":{"$error":"#REF!"}},{"$f":"IF(Compétances!$D$1=Compétances!#REF!,Compétances!#REF!,\"zz\")","v":{"$error":"#REF!"}},{"$f":"IFERROR(IF(INDEX(A244:D244,MATCH($I$3,$A$5:$D$5,0))<>\"zz\",MAX($E$5:E243)+1,\"\"),\"\")","v":""},{"$f":"IF(ROWS(F$6:F244)<=MAX(E:E),INDEX(A:D,MATCH(ROWS(F$6:F244),E:E,0),MATCH($I$3,$A$5:$D$5,0)),\"\")","v":""}]
[{"$f":"IF(Compétances!$D$1=Compétances!C205,Compétances!$B205,\"zz\")","v":"Jean Mi"},{"$f":"IF(Compétances!$D$1=Compétances!D205,Compétances!$B205,\"zz\")","v":"Jean Mi"},{"$f":"IF(Compétances!$D$1=Compétances!E205,Compétances!$B205,\"zz\")","v":"Jean Mi"},{"$f":"IF(Compétances!$D$1=Compétances!F205,Compétances!$B205,\"zz\")","v":"Jean Mi"},{"$f":"IFERROR(IF(INDEX(A245:D245,MATCH($I$3,$A$5:$D$5,0))<>\"zz\",MAX($E$5:E244)+1,\"\"),\"\")","v":120},{"$f":"IF(ROWS(F$6:F245)<=MAX(E:E),INDEX(A:D,MATCH(ROWS(F$6:F245),E:E,0),MATCH($I$3,$A$5:$D$5,0)),\"\")","v":""}]
[{"$f":"IF(Compétances!$D$1=Compétances!C206,Compétances!$B206,\"zz\")","v":"Eric"},{"$f":"IF(Compétances!$D$1=Compétances!D206,Compétances!$B206,\"zz\")","v":"zz"},{"$f":"IF(Compétances!$D$1=Compétances!E206,Compétances!$B206,\"zz\")","v":"Eric"},{"$f":"IF(Compétances!$D$1=Compétances!F206,Compétances!$B206,\"zz\")","v":"zz"},{"$f":"IFERROR(IF(INDEX(A246:D246,MATCH($I$3,$A$5:$D$5,0))<>\"zz\",MAX($E$5:E245)+1,\"\"),\"\")","v":""},{"$f":"IF(ROWS(F$6:F246)<=MAX(E:E),INDEX(A:D,MATCH(ROWS(F$6:F246),E:E,0),MATCH($I$3,$A$5:$D$5,0)),\"\")","v":""}]
[{"$f":"IF(Compétances!$D$1=Compétances!C207,Compétances!$B207,\"zz\")","v":"zz"},{"$f":"IF(Compétances!$D$1=Compétances!D207,Compétances!$B207,\"zz\")","v":"zz"},{"$f":"IF(Compétances!$D$1=Compétances!E207,Compétances!$B207,\"zz\")","v":"Paul "},{"$f":"IF(Compétances!$D$1=Compétances!F207,Compétances!$B207,\"zz\")","v":"zz"},{"$f":"IFERROR(IF(INDEX(A247:D247,MATCH($I$3,$A$5:$D$5,0))<>\"zz\",MAX($E$5:E246)+1,\"\"),\"\")","v":""},{"$f":"IF(ROWS(F$6:F247)<=MAX(E:E),INDEX(A:D,MATCH(ROWS(F$6:F247),E:E,0),MATCH($I$3,$A$5:$D$5,0)),\"\")","v":""}]
[{"$f":"IF(Compétances!$D$1=Compétances!C208,Compétances!$B208,\"zz\")","v":"Michel"},{"$f":"IF(Compétances!$D$1=Compétances!D208,Compétances!$B208,\"zz\")","v":"Michel"},{"$f":"IF(Compétances!$D$1=Compétances!E208,Compétances!$B208,\"zz\")","v":"Michel"},{"$f":"IF(Compétances!$D$1=Compétances!F208,Compétances!$B208,\"zz\")","v":"Michel"},{"$f":"IFERROR(IF(INDEX(A248:D248,MATCH($I$3,$A$5:$D$5,0))<>\"zz\",MAX($E$5:E247)+1,\"\"),\"\")","v":121},{"$f":"IF(ROWS(F$6:F248)<=MAX(E:E),INDEX(A:D,MATCH(ROWS(F$6:F248),E:E,0),MATCH($I$3,$A$5:$D$5,0)),\"\")","v":""}]
[{"$f":"IF(Compétances!$D$1=Compétances!C209,Compétances!$B209,\"zz\")","v":"zz"},{"$f":"IF(Compétances!$D$1=Compétances!D209,Compétances!$B209,\"zz\")","v":"Jacques "},{"$f":"IF(Compétances!$D$1=Compétances!E209,Compétances!$B209,\"zz\")","v":"zz"},{"$f":"IF(Compétances!$D$1=Compétances!F209,Compétances!$B209,\"zz\")","v":"zz"},{"$f":"IFERROR(IF(INDEX(A249:D249,MATCH($I$3,$A$5:$D$5,0))<>\"zz\",MAX($E$5:E248)+1,\"\"),\"\")","v":122},{"$f":"IF(ROWS(F$6:F249)<=MAX(E:E),INDEX(A:D,MATCH(ROWS(F$6:F249),E:E,0),MATCH($I$3,$A$5:$D$5,0)),\"\")","v":""}]
[{"$f":"IF(Compétances!$D$1=Compétances!#REF!,Compétances!#REF!,\"zz\")","v":{"$error":"#REF!"}},{"$f":"IF(Compétances!$D$1=Compétances!#REF!,Compétances!#REF!,\"zz\")","v":{"$error":"#REF!"}},{"$f":"IF(Compétances!$D$1=Compétances!#REF!,Compétances!#REF!,\"zz\")","v":{"$error":"#REF!"}},{"$f":"IF(Compétances!$D$1=Compétances!#REF!,Compétances!#REF!,\"zz\")","v":{"$error":"#REF!"}},{"$f":"IFERROR(IF(INDEX(A250:D250,MATCH($I$3,$A$5:$D$5,0))<>\"zz\",MAX($E$5:E249)+1,\"\"),\"\")","v":""},{"$f":"IF(ROWS(F$6:F250)<=MAX(E:E),INDEX(A:D,MATCH(ROWS(F$6:F250),E:E,0),MATCH($I$3,$A$5:$D$5,0)),\"\")","v":""}]
[{"$f":"IF(Compétances!$D$1=Compétances!C210,Compétances!$B210,\"zz\")","v":"Jean Mi"},{"$f":"IF(Compétances!$D$1=Compétances!D210,Compétances!$B210,\"zz\")","v":"Jean Mi"},{"$f":"IF(Compétances!$D$1=Compétances!E210,Compétances!$B210,\"zz\")","v":"Jean Mi"},{"$f":"IF(Compétances!$D$1=Compétances!F210,Compétances!$B210,\"zz\")","v":"Jean Mi"},{"$f":"IFERROR(IF(INDEX(A251:D251,MATCH($I$3,$A$5:$D$5,0))<>\"zz\",MAX($E$5:E250)+1,\"\"),\"\")","v":123},{"$f":"IF(ROWS(F$6:F251)<=MAX(E:E),INDEX(A:D,MATCH(ROWS(F$6:F251),E:E,0),MATCH($I$3,$A$5:$D$5,0)),\"\")","v":""}]
[{"$f":"IF(Compétances!$D$1=Compétances!C211,Compétances!$B211,\"zz\")","v":"Eric"},{"$f":"IF(Compétances!$D$1=Compétances!D211,Compétances!$B211,\"zz\")","v":"zz"},{"$f":"IF(Compétances!$D$1=Compétances!E211,Compétances!$B211,\"zz\")","v":"Eric"},{"$f":"IF(Compétances!$D$1=Compétances!F211,Compétances!$B211,\"zz\")","v":"zz"},{"$f":"IFERROR(IF(INDEX(A252:D252,MATCH($I$3,$A$5:$D$5,0))<>\"zz\",MAX($E$5:E251)+1,\"\"),\"\")","v":""},{"$f":"IF(ROWS(F$6:F252)<=MAX(E:E),INDEX(A:D,MATCH(ROWS(F$6:F252),E:E,0),MATCH($I$3,$A$5:$D$5,0)),\"\")","v":""}]
[{"$f":"IF(Compétances!$D$1=Compétances!C212,Compétances!$B212,\"zz\")","v":"zz"},{"$f":"IF(Compétances!$D$1=Compétances!D212,Compétances!$B212,\"zz\")","v":"zz"},{"$f":"IF(Compétances!$D$1=Compétances!E212,Compétances!$B212,\"zz\")","v":"Paul "},{"$f":"IF(Compétances!$D$1=Compétances!F212,Compétances!$B212,\"zz\")","v":"zz"},{"$f":"IFERROR(IF(INDEX(A253:D253,MATCH($I$3,$A$5:$D$5,0))<>\"zz\",MAX($E$5:E252)+1,\"\"),\"\")","v":""},{"$f":"IF(ROWS(F$6:F253)<=MAX(E:E),INDEX(A:D,MATCH(ROWS(F$6:F253),E:E,0),MATCH($I$3,$A$5:$D$5,0)),\"\")","v":""}]
[{"$f":"IF(Compétances!$D$1=Compétances!C213,Compétances!$B213,\"zz\")","v":"Michel"},{"$f":"IF(Compétances!$D$1=Compétances!D213,Compétances!$B213,\"zz\")","v":"Michel"},{"$f":"IF(Compétances!$D$1=Compétances!E213,Compétances!$B213,\"zz\")","v":"Michel"},{"$f":"IF(Compétances!$D$1=Compétances!F213,Compétances!$B213,\"zz\")","v":"Michel"},{"$f":"IFERROR(IF(INDEX(A254:D254,MATCH($I$3,$A$5:$D$5,0))<>\"zz\",MAX($E$5:E253)+1,\"\"),\"\")","v":124},{"$f":"IF(ROWS(F$6:F254)<=MAX(E:E),INDEX(A:D,MATCH(ROWS(F$6:F254),E:E,0),MATCH($I$3,$A$5:$D$5,0)),\"\")","v":""}]
[{"$f":"IF(Compétances!$D$1=Compétances!C214,Compétances!$B214,\"zz\")","v":"zz"},{"$f":"IF(Compétances!$D$1=Compétances!D214,Compétances!$B214,\"zz\")","v":"Jacques "},{"$f":"IF(Compétances!$D$1=Compétances!E214,Compétances!$B214,\"zz\")","v":"zz"},{"$f":"IF(Compétances!$D$1=Compétances!F214,Compétances!$B214,\"zz\")","v":"zz"},{"$f":"IFERROR(IF(INDEX(A255:D255,MATCH($I$3,$A$5:$D$5,0))<>\"zz\",MAX($E$5:E254)+1,\"\"),\"\")","v":125},{"$f":"IF(ROWS(F$6:F255)<=MAX(E:E),INDEX(A:D,MATCH(ROWS(F$6:F255),E:E,0),MATCH($I$3,$A$5:$D$5,0)),\"\")","v":""}]
[{"$f":"IF(Compétances!$D$1=Compétances!#REF!,Compétances!#REF!,\"zz\")","v":{"$error":"#REF!"}},{"$f":"IF(Compétances!$D$1=Compétances!#REF!,Compétances!#REF!,\"zz\")","v":{"$error":"#REF!"}},{"$f":"IF(Compétances!$D$1=Compétances!#REF!,Compétances!#REF!,\"zz\")","v":{"$error":"#REF!"}},{"$f":"IF(Compétances!$D$1=Compétances!#REF!,Compétances!#REF!,\"zz\")","v":{"$error":"#REF!"}},{"$f":"IFERROR(IF(INDEX(A256:D256,MATCH($I$3,$A$5:$D$5,0))<>\"zz\",MAX($E$5:E255)+1,\"\"),\"\")","v":""},{"$f":"IF(ROWS(F$6:F256)<=MAX(E:E),INDEX(A:D,MATCH(ROWS(F$6:F256),E:E,0),MATCH($I$3,$A$5:$D$5,0)),\"\")","v":""}]
[{"$f":"IF(Compétances!$D$1=Compétances!C215,Compétances!$B215,\"zz\")","v":"Jean Mi"},{"$f":"IF(Compétances!$D$1=Compétances!D215,Compétances!$B215,\"zz\")","v":"Jean Mi"},{"$f":"IF(Compétances!$D$1=Compétances!E215,Compétances!$B215,\"zz\")","v":"Jean Mi"},{"$f":"IF(Compétances!$D$1=Compétances!F215,Compétances!$B215,\"zz\")","v":"Jean Mi"},{"$f":"IFERROR(IF(INDEX(A257:D257,MATCH($I$3,$A$5:$D$5,0))<>\"zz\",MAX($E$5:E256)+1,\"\"),\"\")","v":126},{"$f":"IF(ROWS(F$6:F257)<=MAX(E:E),INDEX(A:D,MATCH(ROWS(F$6:F257),E:E,0),MATCH($I$3,$A$5:$D$5,0)),\"\")","v":""}]
[{"$f":"IF(Compétances!$D$1=Compétances!C216,Compétances!$B216,\"zz\")","v":"Eric"},{"$f":"IF(Compétances!$D$1=Compétances!D216,Compétances!$B216,\"zz\")","v":"zz"},{"$f":"IF(Compétances!$D$1=Compétances!E216,Compétances!$B216,\"zz\")","v":"Eric"},{"$f":"IF(Compétances!$D$1=Compétances!F216,Compétances!$B216,\"zz\")","v":"zz"},{"$f":"IFERROR(IF(INDEX(A258:D258,MATCH($I$3,$A$5:$D$5,0))<>\"zz\",MAX($E$5:E257)+1,\"\"),\"\")","v":""},{"$f":"IF(ROWS(F$6:F258)<=MAX(E:E),INDEX(A:D,MATCH(ROWS(F$6:F258),E:E,0),MATCH($I$3,$A$5:$D$5,0)),\"\")","v":""}]
[{"$f":"IF(Compétances!$D$1=Compétances!C217,Compétances!$B217,\"zz\")","v":"zz"},{"$f":"IF(Compétances!$D$1=Compétances!D217,Compétances!$B217,\"zz\")","v":"zz"},{"$f":"IF(Compétances!$D$1=Compétances!E217,Compétances!$B217,\"zz\")","v":"Paul "},{"$f":"IF(Compétances!$D$1=Compétances!F217,Compétances!$B217,\"zz\")","v":"zz"},{"$f":"IFERROR(IF(INDEX(A259:D259,MATCH($I$3,$A$5:$D$5,0))<>\"zz\",MAX($E$5:E258)+1,\"\"),\"\")","v":""},{"$f":"IF(ROWS(F$6:F259)<=MAX(E:E),INDEX(A:D,MATCH(ROWS(F$6:F259),E:E,0),MATCH($I$3,$A$5:$D$5,0)),\"\")","v":""}]
[{"$f":"IF(Compétances!$D$1=Compétances!C218,Compétances!$B218,\"zz\")","v":"Michel"},{"$f":"IF(Compétances!$D$1=Compétances!D218,Compétances!$B218,\"zz\")","v":"Michel"},{"$f":"IF(Compétances!$D$1=Compétances!E218,Compétances!$B218,\"zz\")","v":"Michel"},{"$f":"IF(Compétances!$D$1=Compétances!F218,Compétances!$B218,\"zz\")","v":"Michel"},{"$f":"IFERROR(IF(INDEX(A260:D260,MATCH($I$3,$A$5:$D$5,0))<>\"zz\",MAX($E$5:E259)+1,\"\"),\"\")","v":127},{"$f":"IF(ROWS(F$6:F260)<=MAX(E:E),INDEX(A:D,MATCH(ROWS(F$6:F260),E:E,0),MATCH($I$3,$A$5:$D$5,0)),\"\")","v":""}]
[{"$f":"IF(Compétances!$D$1=Compétances!C219,Compétances!$B219,\"zz\")","v":"zz"},{"$f":"IF(Compétances!$D$1=Compétances!D219,Compétances!$B219,\"zz\")","v":"Jacques "},{"$f":"IF(Compétances!$D$1=Compétances!E219,Compétances!$B219,\"zz\")","v":"zz"},{"$f":"IF(Compétances!$D$1=Compétances!F219,Compétances!$B219,\"zz\")","v":"zz"},{"$f":"IFERROR(IF(INDEX(A261:D261,MATCH($I$3,$A$5:$D$5,0))<>\"zz\",MAX($E$5:E260)+1,\"\"),\"\")","v":128},{"$f":"IF(ROWS(F$6:F261)<=MAX(E:E),INDEX(A:D,MATCH(ROWS(F$6:F261),E:E,0),MATCH($I$3,$A$5:$D$5,0)),\"\")","v":""}]
[{"$f":"IF(Compétances!$D$1=Compétances!#REF!,Compétances!#REF!,\"zz\")","v":{"$error":"#REF!"}},{"$f":"IF(Compétances!$D$1=Compétances!#REF!,Compétances!#REF!,\"zz\")","v":{"$error":"#REF!"}},{"$f":"IF(Compétances!$D$1=Compétances!#REF!,Compétances!#REF!,\"zz\")","v":{"$error":"#REF!"}},{"$f":"IF(Compétances!$D$1=Compétances!#REF!,Compétances!#REF!,\"zz\")","v":{"$error":"#REF!"}},{"$f":"IFERROR(IF(INDEX(A262:D262,MATCH($I$3,$A$5:$D$5,0))<>\"zz\",MAX($E$5:E261)+1,\"\"),\"\")","v":""},{"$f":"IF(ROWS(F$6:F262)<=MAX(E:E),INDEX(A:D,MATCH(ROWS(F$6:F262),E:E,0),MATCH($I$3,$A$5:$D$5,0)),\"\")","v":""}]
[{"$f":"IF(Compétances!$D$1=Compétances!C220,Compétances!$B220,\"zz\")","v":"Jean Mi"},{"$f":"IF(Compétances!$D$1=Compétances!D220,Compétances!$B220,\"zz\")","v":"Jean Mi"},{"$f":"IF(Compétances!$D$1=Compétances!E220,Compétances!$B220,\"zz\")","v":"Jean Mi"},{"$f":"IF(Compétances!$D$1=Compétances!F220,Compétances!$B220,\"zz\")","v":"Jean Mi"},{"$f":"IFERROR(IF(INDEX(A263:D263,MATCH($I$3,$A$5:$D$5,0))<>\"zz\",MAX($E$5:E262)+1,\"\"),\"\")","v":129},{"$f":"IF(ROWS(F$6:F263)<=MAX(E:E),INDEX(A:D,MATCH(ROWS(F$6:F263),E:E,0),MATCH($I$3,$A$5:$D$5,0)),\"\")","v":""}]
[{"$f":"IF(Compétances!$D$1=Compétances!C221,Compétances!$B221,\"zz\")","v":"Eric"},{"$f":"IF(Compétances!$D$1=Compétances!D221,Compétances!$B221,\"zz\")","v":"zz"},{"$f":"IF(Compétances!$D$1=Compétances!E221,Compétances!$B221,\"zz\")","v":"Eric"},{"$f":"IF(Compétances!$D$1=Compétances!F221,Compétances!$B221,\"zz\")","v":"zz"},{"$f":"IFERROR(IF(INDEX(A264:D264,MATCH($I$3,$A$5:$D$5,0))<>\"zz\",MAX($E$5:E263)+1,\"\"),\"\")","v":""},{"$f":"IF(ROWS(F$6:F264)<=MAX(E:E),INDEX(A:D,MATCH(ROWS(F$6:F264),E:E,0),MATCH($I$3,$A$5:$D$5,0)),\"\")","v":""}]
[{"$f":"IF(Compétances!$D$1=Compétances!C222,Compétances!$B222,\"zz\")","v":"zz"},{"$f":"IF(Compétances!$D$1=Compétances!D222,Compétances!$B222,\"zz\")","v":"zz"},{"$f":"IF(Compétances!$D$1=Compétances!E222,Compétances!$B222,\"zz\")","v":"Paul "},{"$f":"IF(Compétances!$D$1=Compétances!F222,Compétances!$B222,\"zz\")","v":"zz"},{"$f":"IFERROR(IF(INDEX(A265:D265,MATCH($I$3,$A$5:$D$5,0))<>\"zz\",MAX($E$5:E264)+1,\"\"),\"\")","v":""},{"$f":"IF(ROWS(F$6:F265)<=MAX(E:E),INDEX(A:D,MATCH(ROWS(F$6:F265),E:E,0),MATCH($I$3,$A$5:$D$5,0)),\"\")","v":""}]
[{"$f":"IF(Compétances!$D$1=Compétances!C223,Compétances!$B223,\"zz\")","v":"Michel"},{"$f":"IF(Compétances!$D$1=Compétances!D223,Compétances!$B223,\"zz\")","v":"Michel"},{"$f":"IF(Compétances!$D$1=Compétances!E223,Compétances!$B223,\"zz\")","v":"Michel"},{"$f":"IF(Compétances!$D$1=Compétances!F223,Compétances!$B223,\"zz\")","v":"Michel"},{"$f":"IFERROR(IF(INDEX(A266:D266,MATCH($I$3,$A$5:$D$5,0))<>\"zz\",MAX($E$5:E265)+1,\"\"),\"\")","v":130},{"$f":"IF(ROWS(F$6:F266)<=MAX(E:E),INDEX(A:D,MATCH(ROWS(F$6:F266),E:E,0),MATCH($I$3,$A$5:$D$5,0)),\"\")","v":""}]
[{"$f":"IF(Compétances!$D$1=Compétances!C224,Compétances!$B224,\"zz\")","v":"zz"},{"$f":"IF(Compétances!$D$1=Compétances!D224,Compétances!$B224,\"zz\")","v":"Jacques "},{"$f":"IF(Compétances!$D$1=Compétances!E224,Compétances!$B224,\"zz\")","v":"zz"},{"$f":"IF(Compétances!$D$1=Compétances!F224,Compétances!$B224,\"zz\")","v":"zz"},{"$f":"IFERROR(IF(INDEX(A267:D267,MATCH($I$3,$A$5:$D$5,0))<>\"zz\",MAX($E$5:E266)+1,\"\"),\"\")","v":131},{"$f":"IF(ROWS(F$6:F267)<=MAX(E:E),INDEX(A:D,MATCH(ROWS(F$6:F267),E:E,0),MATCH($I$3,$A$5:$D$5,0)),\"\")","v":""}]
[{"$f":"IF(Compétances!$D$1=Compétances!#REF!,Compétances!#REF!,\"zz\")","v":{"$error":"#REF!"}},{"$f":"IF(Compétances!$D$1=Compétances!#REF!,Compétances!#REF!,\"zz\")","v":{"$error":"#REF!"}},{"$f":"IF(Compétances!$D$1=Compétances!#REF!,Compétances!#REF!,\"zz\")","v":{"$error":"#REF!"}},{"$f":"IF(Compétances!$D$1=Compétances!#REF!,Compétances!#REF!,\"zz\")","v":{"$error":"#REF!"}},{"$f":"IFERROR(IF(INDEX(A268:D268,MATCH($I$3,$A$5:$D$5,0))<>\"zz\",MAX($E$5:E267)+1,\"\"),\"\")","v":""},{"$f":"IF(ROWS(F$6:F268)<=MAX(E:E),INDEX(A:D,MATCH(ROWS(F$6:F268),E:E,0),MATCH($I$3,$A$5:$D$5,0)),\"\")","v":""}]
[{"$f":"IF(Compétances!$D$1=Compétances!C225,Compétances!$B225,\"zz\")","v":"Jean Mi"},{"$f":"IF(Compétances!$D$1=Compétances!D225,Compétances!$B225,\"zz\")","v":"Jean Mi"},{"$f":"IF(Compétances!$D$1=Compétances!E225,Compétances!$B225,\"zz\")","v":"Jean Mi"},{"$f":"IF(Compétances!$D$1=Compétances!F225,Compétances!$B225,\"zz\")","v":"Jean Mi"},{"$f":"IFERROR(IF(INDEX(A269:D269,MATCH($I$3,$A$5:$D$5,0))<>\"zz\",MAX($E$5:E268)+1,\"\"),\"\")","v":132},{"$f":"IF(ROWS(F$6:F269)<=MAX(E:E),INDEX(A:D,MATCH(ROWS(F$6:F269),E:E,0),MATCH($I$3,$A$5:$D$5,0)),\"\")","v":""}]
[{"$f":"IF(Compétances!$D$1=Compétances!C226,Compétances!$B226,\"zz\")","v":"Eric"},{"$f":"IF(Compétances!$D$1=Compétances!D226,Compétances!$B226,\"zz\")","v":"zz"},{"$f":"IF(Compétances!$D$1=Compétances!E226,Compétances!$B226,\"zz\")","v":"Eric"},{"$f":"IF(Compétances!$D$1=Compétances!F226,Compétances!$B226,\"zz\")","v":"zz"},{"$f":"IFERROR(IF(INDEX(A270:D270,MATCH($I$3,$A$5:$D$5,0))<>\"zz\",MAX($E$5:E269)+1,\"\"),\"\")","v":""},{"$f":"IF(ROWS(F$6:F270)<=MAX(E:E),INDEX(A:D,MATCH(ROWS(F$6:F270),E:E,0),MATCH($I$3,$A$5:$D$5,0)),\"\")","v":""}]
[{"$f":"IF(Compétances!$D$1=Compétances!C227,Compétances!$B227,\"zz\")","v":"zz"},{"$f":"IF(Compétances!$D$1=Compétances!D227,Compétances!$B227,\"zz\")","v":"zz"},{"$f":"IF(Compétances!$D$1=Compétances!E227,Compétances!$B227,\"zz\")","v":"Paul "},{"$f":"IF(Compétances!$D$1=Compétances!F227,Compétances!$B227,\"zz\")","v":"zz"},{"$f":"IFERROR(IF(INDEX(A271:D271,MATCH($I$3,$A$5:$D$5,0))<>\"zz\",MAX($E$5:E270)+1,\"\"),\"\")","v":""},{"$f":"IF(ROWS(F$6:F271)<=MAX(E:E),INDEX(A:D,MATCH(ROWS(F$6:F271),E:E,0),MATCH($I$3,$A$5:$D$5,0)),\"\")","v":""}]
[{"$f":"IF(Compétances!$D$1=Compétances!C228,Compétances!$B228,\"zz\")","v":"Michel"},{"$f":"IF(Compétances!$D$1=Compétances!D228,Compétances!$B228,\"zz\")","v":"Michel"},{"$f":"IF(Compétances!$D$1=Compétances!E228,Compétances!$B228,\"zz\")","v":"Michel"},{"$f":"IF(Compétances!$D$1=Compétances!F228,Compétances!$B228,\"zz\")","v":"Michel"},{"$f":"IFERROR(IF(INDEX(A272:D272,MATCH($I$3,$A$5:$D$5,0))<>\"zz\",MAX($E$5:E271)+1,\"\"),\"\")","v":133},{"$f":"IF(ROWS(F$6:F272)<=MAX(E:E),INDEX(A:D,MATCH(ROWS(F$6:F272),E:E,0),MATCH($I$3,$A$5:$D$5,0)),\"\")","v":""}]
[{"$f":"IF(Compétances!$D$1=Compétances!C229,Compétances!$B229,\"zz\")","v":"zz"},{"$f":"IF(Compétances!$D$1=Compétances!D229,Compétances!$B229,\"zz\")","v":"Jacques "},{"$f":"IF(Compétances!$D$1=Compétances!E229,Compétances!$B229,\"zz\")","v":"zz"},{"$f":"IF(Compétances!$D$1=Compétances!F229,Compétances!$B229,\"zz\")","v":"zz"},{"$f":"IFERROR(IF(INDEX(A273:D273,MATCH($I$3,$A$5:$D$5,0))<>\"zz\",MAX($E$5:E272)+1,\"\"),\"\")","v":134},{"$f":"IF(ROWS(F$6:F273)<=MAX(E:E),INDEX(A:D,MATCH(ROWS(F$6:F273),E:E,0),MATCH($I$3,$A$5:$D$5,0)),\"\")","v":""}]
[{"$f":"IF(Compétances!$D$1=Compétances!#REF!,Compétances!#REF!,\"zz\")","v":{"$error":"#REF!"}},{"$f":"IF(Compétances!$D$1=Compétances!#REF!,Compétances!#REF!,\"zz\")","v":{"$error":"#REF!"}},{"$f":"IF(Compétances!$D$1=Compétances!#REF!,Compétances!#REF!,\"zz\")","v":{"$error":"#REF!"}},{"$f":"IF(Compétances!$D$1=Compétances!#REF!,Compétances!#REF!,\"zz\")","v":{"$error":"#REF!"}},{"$f":"IFERROR(IF(INDEX(A274:D274,MATCH($I$3,$A$5:$D$5,0))<>\"zz\",MAX($E$5:E273)+1,\"\"),\"\")","v":""},{"$f":"IF(ROWS(F$6:F274)<=MAX(E:E),INDEX(A:D,MATCH(ROWS(F$6:F274),E:E,0),MATCH($I$3,$A$5:$D$5,0)),\"\")","v":""}]
[{"$f":"IF(Compétances!$D$1=Compétances!C230,Compétances!$B230,\"zz\")","v":"Jean Mi"},{"$f":"IF(Compétances!$D$1=Compétances!D230,Compétances!$B230,\"zz\")","v":"Jean Mi"},{"$f":"IF(Compétances!$D$1=Compétances!E230,Compétances!$B230,\"zz\")","v":"Jean Mi"},{"$f":"IF(Compétances!$D$1=Compétances!F230,Compétances!$B230,\"zz\")","v":"Jean Mi"},{"$f":"IFERROR(IF(INDEX(A275:D275,MATCH($I$3,$A$5:$D$5,0))<>\"zz\",MAX($E$5:E274)+1,\"\"),\"\")","v":135},{"$f":"IF(ROWS(F$6:F275)<=MAX(E:E),INDEX(A:D,MATCH(ROWS(F$6:F275),E:E,0),MATCH($I$3,$A$5:$D$5,0)),\"\")","v":""}]
[{"$f":"IF(Compétances!$D$1=Compétances!C231,Compétances!$B231,\"zz\")","v":"Eric"},{"$f":"IF(Compétances!$D$1=Compétances!D231,Compétances!$B231,\"zz\")","v":"zz"},{"$f":"IF(Compétances!$D$1=Compétances!E231,Compétances!$B231,\"zz\")","v":"Eric"},{"$f":"IF(Compétances!$D$1=Compétances!F231,Compétances!$B231,\"zz\")","v":"zz"},{"$f":"IFERROR(IF(INDEX(A276:D276,MATCH($I$3,$A$5:$D$5,0))<>\"zz\",MAX($E$5:E275)+1,\"\"),\"\")","v":""},{"$f":"IF(ROWS(F$6:F276)<=MAX(E:E),INDEX(A:D,MATCH(ROWS(F$6:F276),E:E,0),MATCH($I$3,$A$5:$D$5,0)),\"\")","v":""}]
[{"$f":"IF(Compétances!$D$1=Compétances!C232,Compétances!$B232,\"zz\")","v":"zz"},{"$f":"IF(Compétances!$D$1=Compétances!D232,Compétances!$B232,\"zz\")","v":"zz"},{"$f":"IF(Compétances!$D$1=Compétances!E232,Compétances!$B232,\"zz\")","v":"Paul "},{"$f":"IF(Compétances!$D$1=Compétances!F232,Compétances!$B232,\"zz\")","v":"zz"},{"$f":"IFERROR(IF(INDEX(A277:D277,MATCH($I$3,$A$5:$D$5,0))<>\"zz\",MAX($E$5:E276)+1,\"\"),\"\")","v":""},{"$f":"IF(ROWS(F$6:F277)<=MAX(E:E),INDEX(A:D,MATCH(ROWS(F$6:F277),E:E,0),MATCH($I$3,$A$5:$D$5,0)),\"\")","v":""}]
[{"$f":"IF(Compétances!$D$1=Compétances!C233,Compétances!$B233,\"zz\")","v":"Michel"},{"$f":"IF(Compétances!$D$1=Compétances!D233,Compétances!$B233,\"zz\")","v":"Michel"},{"$f":"IF(Compétances!$D$1=Compétances!E233,Compétances!$B233,\"zz\")","v":"Michel"},{"$f":"IF(Compétances!$D$1=Compétances!F233,Compétances!$B233,\"zz\")","v":"Michel"},{"$f":"IFERROR(IF(INDEX(A278:D278,MATCH($I$3,$A$5:$D$5,0))<>\"zz\",MAX($E$5:E277)+1,\"\"),\"\")","v":136},{"$f":"IF(ROWS(F$6:F278)<=MAX(E:E),INDEX(A:D,MATCH(ROWS(F$6:F278),E:E,0),MATCH($I$3,$A$5:$D$5,0)),\"\")","v":""}]
[{"$f":"IF(Compétances!$D$1=Compétances!C234,Compétances!$B234,\"zz\")","v":"zz"},{"$f":"IF(Compétances!$D$1=Compétances!D234,Compétances!$B234,\"zz\")","v":"Jacques "},{"$f":"IF(Compétances!$D$1=Compétances!E234,Compétances!$B234,\"zz\")","v":"zz"},{"$f":"IF(Compétances!$D$1=Compétances!F234,Compétances!$B234,\"zz\")","v":"zz"},{"$f":"IFERROR(IF(INDEX(A279:D279,MATCH($I$3,$A$5:$D$5,0))<>\"zz\",MAX($E$5:E278)+1,\"\"),\"\")","v":137},{"$f":"IF(ROWS(F$6:F279)<=MAX(E:E),INDEX(A:D,MATCH(ROWS(F$6:F279),E:E,0),MATCH($I$3,$A$5:$D$5,0)),\"\")","v":""}]
[{"$f":"IF(Compétances!$D$1=Compétances!#REF!,Compétances!#REF!,\"zz\")","v":{"$error":"#REF!"}},{"$f":"IF(Compétances!$D$1=Compétances!#REF!,Compétances!#REF!,\"zz\")","v":{"$error":"#REF!"}},{"$f":"IF(Compétances!$D$1=Compétances!#REF!,Compétances!#REF!,\"zz\")","v":{"$error":"#REF!"}},{"$f":"IF(Compétances!$D$1=Compétances!#REF!,Compétances!#REF!,\"zz\")","v":{"$error":"#REF!"}},{"$f":"IFERROR(IF(INDEX(A280:D280,MATCH($I$3,$A$5:$D$5,0))<>\"zz\",MAX($E$5:E279)+1,\"\"),\"\")","v":""},{"$f":"IF(ROWS(F$6:F280)<=MAX(E:E),INDEX(A:D,MATCH(ROWS(F$6:F280),E:E,0),MATCH($I$3,$A$5:$D$5,0)),\"\")","v":""}]
[{"$f":"IF(Compétances!$D$1=Compétances!C235,Compétances!$B235,\"zz\")","v":"Jean Mi"},{"$f":"IF(Compétances!$D$1=Compétances!D235,Compétances!$B235,\"zz\")","v":"Jean Mi"},{"$f":"IF(Compétances!$D$1=Compétances!E235,Compétances!$B235,\"zz\")","v":"Jean Mi"},{"$f":"IF(Compétances!$D$1=Compétances!F235,Compétances!$B235,\"zz\")","v":"Jean Mi"},{"$f":"IFERROR(IF(INDEX(A281:D281,MATCH($I$3,$A$5:$D$5,0))<>\"zz\",MAX($E$5:E280)+1,\"\"),\"\")","v":138},{"$f":"IF(ROWS(F$6:F281)<=MAX(E:E),INDEX(A:D,MATCH(ROWS(F$6:F281),E:E,0),MATCH($I$3,$A$5:$D$5,0)),\"\")","v":""}]
[{"$f":"IF(Compétances!$D$1=Compétances!C236,Compétances!$B236,\"zz\")","v":"Eric"},{"$f":"IF(Compétances!$D$1=Compétances!D236,Compétances!$B236,\"zz\")","v":"zz"},{"$f":"IF(Compétances!$D$1=Compétances!E236,Compétances!$B236,\"zz\")","v":"Eric"},{"$f":"IF(Compétances!$D$1=Compétances!F236,Compétances!$B236,\"zz\")","v":"zz"},{"$f":"IFERROR(IF(INDEX(A282:D282,MATCH($I$3,$A$5:$D$5,0))<>\"zz\",MAX($E$5:E281)+1,\"\"),\"\")","v":""},{"$f":"IF(ROWS(F$6:F282)<=MAX(E:E),INDEX(A:D,MATCH(ROWS(F$6:F282),E:E,0),MATCH($I$3,$A$5:$D$5,0)),\"\")","v":""}]
[{"$f":"IF(Compétances!$D$1=Compétances!C237,Compétances!$B237,\"zz\")","v":"zz"},{"$f":"IF(Compétances!$D$1=Compétances!D237,Compétances!$B237,\"zz\")","v":"zz"},{"$f":"IF(Compétances!$D$1=Compétances!E237,Compétances!$B237,\"zz\")","v":"Paul "},{"$f":"IF(Compétances!$D$1=Compétances!F237,Compétances!$B237,\"zz\")","v":"zz"},{"$f":"IFERROR(IF(INDEX(A283:D283,MATCH($I$3,$A$5:$D$5,0))<>\"zz\",MAX($E$5:E282)+1,\"\"),\"\")","v":""},{"$f":"IF(ROWS(F$6:F283)<=MAX(E:E),INDEX(A:D,MATCH(ROWS(F$6:F283),E:E,0),MATCH($I$3,$A$5:$D$5,0)),\"\")","v":""}]
[{"$f":"IF(Compétances!$D$1=Compétances!C238,Compétances!$B238,\"zz\")","v":"Michel"},{"$f":"IF(Compétances!$D$1=Compétances!D238,Compétances!$B238,\"zz\")","v":"Michel"},{"$f":"IF(Compétances!$D$1=Compétances!E238,Compétances!$B238,\"zz\")","v":"Michel"},{"$f":"IF(Compétances!$D$1=Compétances!F238,Compétances!$B238,\"zz\")","v":"Michel"},{"$f":"IFERROR(IF(INDEX(A284:D284,MATCH($I$3,$A$5:$D$5,0))<>\"zz\",MAX($E$5:E283)+1,\"\"),\"\")","v":139},{"$f":"IF(ROWS(F$6:F284)<=MAX(E:E),INDEX(A:D,MATCH(ROWS(F$6:F284),E:E,0),MATCH($I$3,$A$5:$D$5,0)),\"\")","v":""}]
[{"$f":"IF(Compétances!$D$1=Compétances!C239,Compétances!$B239,\"zz\")","v":"zz"},{"$f":"IF(Compétances!$D$1=Compétances!D239,Compétances!$B239,\"zz\")","v":"Jacques "},{"$f":"IF(Compétances!$D$1=Compétances!E239,Compétances!$B239,\"zz\")","v":"zz"},{"$f":"IF(Compétances!$D$1=Compétances!F239,Compétances!$B239,\"zz\")","v":"zz"},{"$f":"IFERROR(IF(INDEX(A285:D285,MATCH($I$3,$A$5:$D$5,0))<>\"zz\",MAX($E$5:E284)+1,\"\"),\"\")","v":140},{"$f":"IF(ROWS(F$6:F285)<=MAX(E:E),INDEX(A:D,MATCH(ROWS(F$6:F285),E:E,0),MATCH($I$3,$A$5:$D$5,0)),\"\")","v":""}]
[{"$f":"IF(Compétances!$D$1=Compétances!#REF!,Compétances!#REF!,\"zz\")","v":{"$error":"#REF!"}},{"$f":"IF(Compétances!$D$1=Compétances!#REF!,Compétances!#REF!,\"zz\")","v":{"$error":"#REF!"}},{"$f":"IF(Compétances!$D$1=Compétances!#REF!,Compétances!#REF!,\"zz\")","v":{"$error":"#REF!"}},{"$f":"IF(Compétances!$D$1=Compétances!#REF!,Compétances!#REF!,\"zz\")","v":{"$error":"#REF!"}},{"$f":"IFERROR(IF(INDEX(A286:D286,MATCH($I$3,$A$5:$D$5,0))<>\"zz\",MAX($E$5:E285)+1,\"\"),\"\")","v":""},{"$f":"IF(ROWS(F$6:F286)<=MAX(E:E),INDEX(A:D,MATCH(ROWS(F$6:F286),E:E,0),MATCH($I$3,$A$5:$D$5,0)),\"\")","v":""}]
[{"$f":"IF(Compétances!$D$1=Compétances!C240,Compétances!$B240,\"zz\")","v":"Jean Mi"},{"$f":"IF(Compétances!$D$1=Compétances!D240,Compétances!$B240,\"zz\")","v":"Jean Mi"},{"$f":"IF(Compétances!$D$1=Compétances!E240,Compétances!$B240,\"zz\")","v":"Jean Mi"},{"$f":"IF(Compétances!$D$1=Compétances!F240,Compétances!$B240,\"zz\")","v":"Jean Mi"},{"$f":"IFERROR(IF(INDEX(A287:D287,MATCH($I$3,$A$5:$D$5,0))<>\"zz\",MAX($E$5:E286)+1,\"\"),\"\")","v":141},{"$f":"IF(ROWS(F$6:F287)<=MAX(E:E),INDEX(A:D,MATCH(ROWS(F$6:F287),E:E,0),MATCH($I$3,$A$5:$D$5,0)),\"\")","v":""}]
[{"$f":"IF(Compétances!$D$1=Compétances!C241,Compétances!$B241,\"zz\")","v":"Eric"},{"$f":"IF(Compétances!$D$1=Compétances!D241,Compétances!$B241,\"zz\")","v":"zz"},{"$f":"IF(Compétances!$D$1=Compétances!E241,Compétances!$B241,\"zz\")","v":"Eric"},{"$f":"IF(Compétances!$D$1=Compétances!F241,Compétances!$B241,\"zz\")","v":"zz"},{"$f":"IFERROR(IF(INDEX(A288:D288,MATCH($I$3,$A$5:$D$5,0))<>\"zz\",MAX($E$5:E287)+1,\"\"),\"\")","v":""},{"$f":"IF(ROWS(F$6:F288)<=MAX(E:E),INDEX(A:D,MATCH(ROWS(F$6:F288),E:E,0),MATCH($I$3,$A$5:$D$5,0)),\"\")","v":""}]
[{"$f":"IF(Compétances!$D$1=Compétances!C242,Compétances!$B242,\"zz\")","v":"zz"},{"$f":"IF(Compétances!$D$1=Compétances!D242,Compétances!$B242,\"zz\")","v":"zz"},{"$f":"IF(Compétances!$D$1=Compétances!E242,Compétances!$B242,\"zz\")","v":"Paul "},{"$f":"IF(Compétances!$D$1=Compétances!F242,Compétances!$B242,\"zz\")","v":"zz"},{"$f":"IFERROR(IF(INDEX(A289:D289,MATCH($I$3,$A$5:$D$5,0))<>\"zz\",MAX($E$5:E288)+1,\"\"),\"\")","v":""},{"$f":"IF(ROWS(F$6:F289)<=MAX(E:E),INDEX(A:D,MATCH(ROWS(F$6:F289),E:E,0),MATCH($I$3,$A$5:$D$5,0)),\"\")","v":""}]
[{"$f":"IF(Compétances!$D$1=Compétances!C243,Compétances!$B243,\"zz\")","v":"Michel"},{"$f":"IF(Compétances!$D$1=Compétances!D243,Compétances!$B243,\"zz\")","v":"Michel"},{"$f":"IF(Compétances!$D$1=Compétances!E243,Compétances!$B243,\"zz\")","v":"Michel"},{"$f":"IF(Compétances!$D$1=Compétances!F243,Compétances!$B243,\"zz\")","v":"Michel"},{"$f":"IFERROR(IF(INDEX(A290:D290,MATCH($I$3,$A$5:$D$5,0))<>\"zz\",MAX($E$5:E289)+1,\"\"),\"\")","v":142},{"$f":"IF(ROWS(F$6:F290)<=MAX(E:E),INDEX(A:D,MATCH(ROWS(F$6:F290),E:E,0),MATCH($I$3,$A$5:$D$5,0)),\"\")","v":""}]
[{"$f":"IF(Compétances!$D$1=Compétances!C244,Compétances!$B244,\"zz\")","v":"zz"},{"$f":"IF(Compétances!$D$1=Compétances!D244,Compétances!$B244,\"zz\")","v":"Jacques "},{"$f":"IF(Compétances!$D$1=Compétances!E244,Compétances!$B244,\"zz\")","v":"zz"},{"$f":"IF(Compétances!$D$1=Compétances!F244,Compétances!$B244,\"zz\")","v":"zz"},{"$f":"IFERROR(IF(INDEX(A291:D291,MATCH($I$3,$A$5:$D$5,0))<>\"zz\",MAX($E$5:E290)+1,\"\"),\"\")","v":143},{"$f":"IF(ROWS(F$6:F291)<=MAX(E:E),INDEX(A:D,MATCH(ROWS(F$6:F291),E:E,0),MATCH($I$3,$A$5:$D$5,0)),\"\")","v":""}]
[{"$f":"IF(Compétances!$D$1=Compétances!#REF!,Compétances!#REF!,\"zz\")","v":{"$error":"#REF!"}},{"$f":"IF(Compétances!$D$1=Compétances!#REF!,Compétances!#REF!,\"zz\")","v":{"$error":"#REF!"}},{"$f":"IF(Compétances!$D$1=Compétances!#REF!,Compétances!#REF!,\"zz\")","v":{"$error":"#REF!"}},{"$f":"IF(Compétances!$D$1=Compétances!#REF!,Compétances!#REF!,\"zz\")","v":{"$error":"#REF!"}},{"$f":"IFERROR(IF(INDEX(A292:D292,MATCH($I$3,$A$5:$D$5,0))<>\"zz\",MAX($E$5:E291)+1,\"\"),\"\")","v":""},{"$f":"IF(ROWS(F$6:F292)<=MAX(E:E),INDEX(A:D,MATCH(ROWS(F$6:F292),E:E,0),MATCH($I$3,$A$5:$D$5,0)),\"\")","v":""}]
[{"$f":"IF(Compétances!$D$1=Compétances!C245,Compétances!$B245,\"zz\")","v":"Jean Mi"},{"$f":"IF(Compétances!$D$1=Compétances!D245,Compétances!$B245,\"zz\")","v":"Jean Mi"},{"$f":"IF(Compétances!$D$1=Compétances!E245,Compétances!$B245,\"zz\")","v":"Jean Mi"},{"$f":"IF(Compétances!$D$1=Compétances!F245,Compétances!$B245,\"zz\")","v":"Jean Mi"},{"$f":"IFERROR(IF(INDEX(A293:D293,MATCH($I$3,$A$5:$D$5,0))<>\"zz\",MAX($E$5:E292)+1,\"\"),\"\")","v":144},{"$f":"IF(ROWS(F$6:F293)<=MAX(E:E),INDEX(A:D,MATCH(ROWS(F$6:F293),E:E,0),MATCH($I$3,$A$5:$D$5,0)),\"\")","v":""}]
[{"$f":"IF(Compétances!$D$1=Compétances!C246,Compétances!$B246,\"zz\")","v":"Eric"},{"$f":"IF(Compétances!$D$1=Compétances!D246,Compétances!$B246,\"zz\")","v":"zz"},{"$f":"IF(Compétances!$D$1=Compétances!E246,Compétances!$B246,\"zz\")","v":"Eric"},{"$f":"IF(Compétances!$D$1=Compétances!F246,Compétances!$B246,\"zz\")","v":"zz"},{"$f":"IFERROR(IF(INDEX(A294:D294,MATCH($I$3,$A$5:$D$5,0))<>\"zz\",MAX($E$5:E293)+1,\"\"),\"\")","v":""},{"$f":"IF(ROWS(F$6:F294)<=MAX(E:E),INDEX(A:D,MATCH(ROWS(F$6:F294),E:E,0),MATCH($I$3,$A$5:$D$5,0)),\"\")","v":""}]
[{"$f":"IF(Compétances!$D$1=Compétances!C247,Compétances!$B247,\"zz\")","v":"zz"},{"$f":"IF(Compétances!$D$1=Compétances!D247,Compétances!$B247,\"zz\")","v":"zz"},{"$f":"IF(Compétances!$D$1=Compétances!E247,Compétances!$B247,\"zz\")","v":"Paul "},{"$f":"IF(Compétances!$D$1=Compétances!F247,Compétances!$B247,\"zz\")","v":"zz"},{"$f":"IFERROR(IF(INDEX(A295:D295,MATCH($I$3,$A$5:$D$5,0))<>\"zz\",MAX($E$5:E294)+1,\"\"),\"\")","v":""},{"$f":"IF(ROWS(F$6:F295)<=MAX(E:E),INDEX(A:D,MATCH(ROWS(F$6:F295),E:E,0),MATCH($I$3,$A$5:$D$5,0)),\"\")","v":""}]
[{"$f":"IF(Compétances!$D$1=Compétances!C248,Compétances!$B248,\"zz\")","v":"Michel"},{"$f":"IF(Compétances!$D$1=Compétances!D248,Compétances!$B248,\"zz\")","v":"Michel"},{"$f":"IF(Compétances!$D$1=Compétances!E248,Compétances!$B248,\"zz\")","v":"Michel"},{"$f":"IF(Compétances!$D$1=Compétances!F248,Compétances!$B248,\"zz\")","v":"Michel"},{"$f":"IFERROR(IF(INDEX(A296:D296,MATCH($I$3,$A$5:$D$5,0))<>\"zz\",MAX($E$5:E295)+1,\"\"),\"\")","v":145},{"$f":"IF(ROWS(F$6:F296)<=MAX(E:E),INDEX(A:D,MATCH(ROWS(F$6:F296),E:E,0),MATCH($I$3,$A$5:$D$5,0)),\"\")","v":""}]
[{"$f":"IF(Compétances!$D$1=Compétances!C249,Compétances!$B249,\"zz\")","v":"zz"},{"$f":"IF(Compétances!$D$1=Compétances!D249,Compétances!$B249,\"zz\")","v":"Jacques "},{"$f":"IF(Compétances!$D$1=Compétances!E249,Compétances!$B249,\"zz\")","v":"zz"},{"$f":"IF(Compétances!$D$1=Compétances!F249,Compétances!$B249,\"zz\")","v":"zz"},{"$f":"IFERROR(IF(INDEX(A297:D297,MATCH($I$3,$A$5:$D$5,0))<>\"zz\",MAX($E$5:E296)+1,\"\"),\"\")","v":146},{"$f":"IF(ROWS(F$6:F297)<=MAX(E:E),INDEX(A:D,MATCH(ROWS(F$6:F297),E:E,0),MATCH($I$3,$A$5:$D$5,0)),\"\")","v":""}]
[{"$f":"IF(Compétances!$D$1=Compétances!#REF!,Compétances!#REF!,\"zz\")","v":{"$error":"#REF!"}},{"$f":"IF(Compétances!$D$1=Compétances!#REF!,Compétances!#REF!,\"zz\")","v":{"$error":"#REF!"}},{"$f":"IF(Compétances!$D$1=Compétances!#REF!,Compétances!#REF!,\"zz\")","v":{"$error":"#REF!"}},{"$f":"IF(Compétances!$D$1=Compétances!#REF!,Compétances!#REF!,\"zz\")","v":{"$error":"#REF!"}},{"$f":"IFERROR(IF(INDEX(A298:D298,MATCH($I$3,$A$5:$D$5,0))<>\"zz\",MAX($E$5:E297)+1,\"\"),\"\")","v":""},{"$f":"IF(ROWS(F$6:F298)<=MAX(E:E),INDEX(A:D,MATCH(ROWS(F$6:F298),E:E,0),MATCH($I$3,$A$5:$D$5,0)),\"\")","v":""}]
[{"$f":"IF(Compétances!$D$1=Compétances!C250,Compétances!$B250,\"zz\")","v":"Jean Mi"},{"$f":"IF(Compétances!$D$1=Compétances!D250,Compétances!$B250,\"zz\")","v":"Jean Mi"},{"$f":"IF(Compétances!$D$1=Compétances!E250,Compétances!$B250,\"zz\")","v":"Jean Mi"},{"$f":"IF(Compétances!$D$1=Compétances!F250,Compétances!$B250,\"zz\")","v":"Jean Mi"},{"$f":"IFERROR(IF(INDEX(A299:D299,MATCH($I$3,$A$5:$D$5,0))<>\"zz\",MAX($E$5:E298)+1,\"\"),\"\")","v":147},{"$f":"IF(ROWS(F$6:F299)<=MAX(E:E),INDEX(A:D,MATCH(ROWS(F$6:F299),E:E,0),MATCH($I$3,$A$5:$D$5,0)),\"\")","v":""}]
[{"$f":"IF(Compétances!$D$1=Compétances!C251,Compétances!$B251,\"zz\")","v":"Eric"},{"$f":"IF(Compétances!$D$1=Compétances!D251,Compétances!$B251,\"zz\")","v":"zz"},{"$f":"IF(Compétances!$D$1=Compétances!E251,Compétances!$B251,\"zz\")","v":"Eric"},{"$f":"IF(Compétances!$D$1=Compétances!F251,Compétances!$B251,\"zz\")","v":"zz"},{"$f":"IFERROR(IF(INDEX(A300:D300,MATCH($I$3,$A$5:$D$5,0))<>\"zz\",MAX($E$5:E299)+1,\"\"),\"\")","v":""},{"$f":"IF(ROWS(F$6:F300)<=MAX(E:E),INDEX(A:D,MATCH(ROWS(F$6:F300),E:E,0),MATCH($I$3,$A$5:$D$5,0)),\"\")","v":""}]

{"sheet":"Tri 2","index":2,"n_rows":1,"n_cols":4,"rows_kept":1,"cut":false,"hidden":false,"merged":[]}
["Fraise","Chocolat","Pomme ","Poire "]

{"sheet":"ABS Chronos","index":3,"n_rows":31,"n_cols":8,"rows_kept":31,"cut":false,"hidden":false,"merged":[]}
["Planning "]
[{"$f":"RIGHT(LEFT('[1]abs Chronos'!A1,24),4)","v":"2018"}]
["Lundi",null,"2018-12-17"]
["SEMAINE",null,51,null,null,"07:00:00"]
[]
[]
["BOVINS (CH 60)",null,"VEAUX (CH 70)",null,"VEAUX",null,"AGNEAUX"]
[]
["Début:","07:30:00","Début:","07:30:00","Début:","07:00:00","Début:","06:30:00"]
[]
[null,null,null,null,"Paul ",null,"GUILLAUME BENJAMIN"]
["Martine",null,"DOPAVOGUI GABRIEL",null,null,null,"MENDY KAROTONOU"]
["JABBIE SAKOUMBA",null,"DIAKHABY MOHAMED",null,null,null,"MENDY JEAN-PAUL"]
["DIABY MOUSTAPHA",null,"DIABY BAKASSO",null,"Caillettes de veaux",null,"NOYALET ALAIN"]
["GUIRASSY HAOUSSOU",null,null,null,"SORRE YANN"]
[]
["DEROULAGE BOYAUX",null,"ECHAUDAGE ",null,"FRAISES DE VEAUX"]
["FAUVELAIS REGIS"]
["GUILLET RAYMONDE",null,"LOUAPRE ROLAND",null,"M SA AZIHAR"]
[]
[]
["LANIERES",null,"PARAGE TRIPES",null,"SANG",null,"SOUS   SOL"]
["BRISSIER MARIE-CHRISTINE",null,null,null,null,null,"SOUS   SOL","(12h-19h)"]
["GUINEHEUX NADINE",null,"GUENEE SYLVIE",null,"PAINCHAUD MARIE-AGNES","Bœuf","HILLION DAVID","Chargement"]
["PELHERBE CHRISTELLE ",null,"HERMENIER SOLANGE",null,"HELLEUX KAREN","Veau","ERNAULT GAEL","Caddie"]
[null,null,null,null,null,"Fœtus","GASSAMA SOUEREBA","Mamelles"]
[null,null,null,null,null,null,"FOUCHER PHILIPPE","MASQUES "]
["GRAS DOUBLE",null,"PANCREAS",null,null,null,"TIMALSINA GOVINDA PRASAD","Couloirs"]
[null,null,"COURSIN ENGUERRAN",null,null,null,"GASSAMA SOUEREBA","Couloirs"]
["PAUTREL LOIC",null,null,null,null,null,"CONDE MOHAMED","Couloirs"]
[null,null,null,null,null,null,null,"Nerfs"]

{"sheet":"Feuil1","index":4,"n_rows":0,"n_cols":0,"rows_kept":0,"cut":false,"hidden":false,"merged":[]}