{"text_format":"1","workbook":"xlsx","n_sheets":4,"sheets":["Application","Dégustation Cadeau Casse Perso","Tarif de base","formulaire"],"not_rendered":{"charts":0,"images":0,"macros":1,"external_links":0,"defined_names":5,"comments":0,"pivot_tables":0},"unopened":[],"bounds":{"document_bytes":16777216,"sheet_cells":100000,"rows_first":2000,"rows_last":500,"rows_between":2000,"halvings":0,"cell_chars":16384,"cell_head_chars":4096},"cells_cut":0,"cells_raw":0,"read":"whole","date_system":"1900"}

{"sheet":"Application","index":0,"n_rows":2250,"n_cols":15,"rows_kept":2250,"cut":false,"hidden":false,"merged":[[17,9,23,9],[17,10,23,10],[17,11,23,11],[17,12,23,12],[18,13,23,13],[17,0,23,0],[17,2,23,2],[17,3,23,3],[17,7,23,7],[17,8,23,8],[10,8,16,8],[10,9,16,9],[10,10,16,10],[10,11,16,11],[11,13,16,13],[7,0,7,2],[10,0,16,0],[10,2,16,2],[10,3,16,3],[10,7,16,7],[10,12,16,12],[31,9,37,9],[31,10,37,10],[31,11,37,11],[31,12,37,12],[32,13,37,13],[31,0,37,0],[31,2,37,2],[31,3,37,3],[31,7,37,7],[31,8,37,8],[24,9,30,9],[24,10,30,10],[24,11,30,11],[24,12,30,12],[24,0,30,0],[24,2,30,2],[24,3,30,3],[24,7,30,7],[24,8,30,8],[25,13,30,13],[45,9,51,9],[45,10,51,10],[45,11,51,11],[45,12,51,12],[46,13,51,13],[45,0,51,0],[45,2,51,2],[45,3,51,3],[45,7,51,7],[45,8,51,8],[38,9,44,9],[38,10,44,10],[38,11,44,11],[38,12,44,12],[39,13,44,13],[38,0,44,0],[38,2,44,2],[38,3,44,3],[38,7,44,7],[38,8,44,8],[59,9,65,9],[59,10,65,10],[59,11,65,11],[59,12,65,12],[60,13,65,13],[59,0,65,0],[59,2,65,2],[59,3,65,3],[59,7,65,7],[59,8,65,8],[52,9,58,9],[52,10,58,10],[52,11,58,11],[52,12,58,12],[53,13,58,13],[52,0,58,0],[52,2,58,2],[52,3,58,3],[52,7,58,7],[52,8,58,8],[73,9,79,9],[73,10,79,10],[73,11,79,11],[73,12,79,12],[74,13,79,13],[73,0,79,0],[73,2,79,2],[73,3,79,3],[73,7,79,7],[73,8,79,8],[66,9,72,9],[66,10,72,10],[66,11,72,11],[66,12,72,12],[67,13,72,13],[66,0,72,0],[66,2,72,2],[66,3,72,3],[66,7,72,7],[66,8,72,8],[87,9,93,9],[87,10,93,10],[87,11,93,11],[87,12,93,12],[88,13,93,13],[87,0,93,0],[87,2,93,2],[87,3,93,3],[87,7,93,7],[87,8,93,8],[80,9,86,9],[80,10,86,10],[80,11,86,11],[80,12,86,12],[81,13,86,13],[80,0,86,0],[80,2,86,2],[80,3,86,3],[80,7,86,7],[80,8,86,8],[101,9,107,9],[101,10,107,10],[101,11,107,11],[101,12,107,12],[102,13,107,13],[101,0,107,0],[101,2,107,2],[101,3,107,3],[101,7,107,7],[101,8,107,8],[94,9,100,9],[94,10,100,10],[94,11,100,11],[94,12,100,12],[95,13,100,13],[94,0,100,0],[94,2,100,2],[94,3,100,3],[94,7,100,7],[94,8,100,8],[115,9,121,9],[115,10,121,10],[115,11,121,11],[115,12,121,12],[116,13,121,13],[115,0,121,0],[115,2,121,2],[115,3,121,3],[115,7,121,7],[115,8,121,8],[108,9,114,9],[108,10,114,10],[108,11,114,11],[108,12,114,12],[109,13,114,13],[108,0,114,0],[108,2,114,2],[108,3,114,3],[108,7,114,7],[108,8,114,8],[129,9,135,9],[129,10,135,10],[129,11,135,11],[129,12,135,12],[130,13,135,13],[129,0,135,0],[129,2,135,2],[129,3,135,3],[129,7,135,7],[129,8,135,8],[122,9,128,9],[122,10,128,10],[122,11,128,11],[122,12,128,12],[123,13,128,13],[122,0,128,0],[122,2,128,2],[122,3,128,3],[122,7,128,7],[122,8,128,8],[143,9,149,9],[143,10,149,10],[143,11,149,11],[143,12,149,12],[143,0,149,0],[143,2,149,2],[143,3,149,3],[143,7,149,7],[143,8,149,8],[136,9,142,9],[136,10,142,10],[136,11,142,11],[136,12,142,12],[137,13,142,13],[136,0,142,0],[136,2,142,2],[136,3,142,3],[136,7,142,7],[136,8,142,8],[144,13,149,13],[164,2,170,2],[164,3,170,3],[164,7,170,7],[164,8,170,8],[165,13,170,13],[172,13,177,13],[157,9,163,9],[157,10,163,10],[157,11,163,11],[157,12,163,12],[157,0,163,0],[157,2,163,2],[157,3,163,3],[157,7,163,7],[157,8,163,8],[150,9,156,9],[150,10,156,10],[150,11,156,11],[150,12,156,12],[150,0,156,0],[150,2,156,2],[150,3,156,3],[150,7,156,7],[150,8,156,8],[185,11,191,11],[185,12,191,12],[185,0,191,0],[185,2,191,2],[185,3,191,3],[185,7,191,7],[185,8,191,8],[178,9,184,9],[178,10,184,10],[178,11,184,11],[178,12,184,12],[178,0,184,0],[178,2,184,2],[178,3,184,3],[178,7,184,7],[178,8,184,8],[151,13,156,13],[158,13,163,13],[171,9,177,9],[171,10,177,10],[171,11,177,11],[171,12,177,12],[171,0,177,0],[171,2,177,2],[171,3,177,3],[171,7,177,7],[171,8,177,8],[164,9,170,9],[164,10,170,10],[164,11,170,11],[164,12,170,12],[164,0,170,0],[206,10,212,10],[206,11,212,11],[206,12,212,12],[206,0,212,0],[206,2,212,2],[206,3,212,3],[206,7,212,7],[206,8,212,8],[179,13,184,13],[186,13,191,13],[199,9,205,9],[199,10,205,10],[199,11,205,11],[199,12,205,12],[199,0,205,0],[199,2,205,2],[199,3,205,3],[199,7,205,7],[199,8,205,8],[192,9,198,9],[192,10,198,10],[192,11,198,11],[192,12,198,12],[192,0,198,0],[192,2,198,2],[192,3,198,3],[192,7,198,7],[192,8,198,8],[193,13,198,13],[200,13,205,13],[185,9,191,9],[185,10,191,10],[207,13,212,13],[214,13,219,13],[227,9,233,9],[227,10,233,10],[227,11,233,11],[227,12,233,12],[227,0,233,0],[227,2,233,2],[227,3,233,3],[227,7,233,7],[227,8,233,8],[220,9,226,9],[220,10,226,10],[220,11,226,11],[220,12,226,12],[220,0,226,0],[220,2,226,2],[220,3,226,3],[220,7,226,7],[220,8,226,8],[221,13,226,13],[228,13,233,13],[213,9,219,9],[213,10,219,10],[213,11,219,11],[213,12,219,12],[213,0,219,0],[213,2,219,2],[213,3,219,3],[213,7,219,7],[213,8,219,8],[206,9,212,9],[248,2,254,2],[248,3,254,3],[248,7,254,7],[248,8,254,8],[249,13,254,13],[256,13,261,13],[241,9,247,9],[241,10,247,10],[241,11,247,11],[241,12,247,12],[241,0,247,0],[241,2,247,2],[241,3,247,3],[241,7,247,7],[241,8,247,8],[234,9,240,9],[234,10,240,10],[234,11,240,11],[234,12,240,12],[234,0,240,0],[234,2,240,2],[234,3,240,3],[234,7,240,7],[234,8,240,8],[269,11,275,11],[269,12,275,12],[269,0,275,0],[269,2,275,2],[269,3,275,3],[269,7,275,7],[269,8,275,8],[262,9,268,9],[262,10,268,10],[262,11,268,11],[262,12,268,12],[262,0,268,0],[262,2,268,2],[262,3,268,3],[262,7,268,7],[262,8,268,8],[235,13,240,13],[242,13,247,13],[255,9,261,9],[255,10,261,10],[255,11,261,11],[255,12,261,12],[255,0,261,0],[255,2,261,2],[255,3,261,3],[255,7,261,7],[255,8,261,8],[248,9,254,9],[248,10,254,10],[248,11,254,11],[248,12,254,12],[248,0,254,0],[290,10,296,10],[290,11,296,11],[290,12,296,12],[290,0,296,0],[290,2,296,2],[290,3,296,3],[290,7,296,7],[290,8,296,8],[263,13,268,13],[270,13,275,13],[283,9,289,9],[283,10,289,10],[283,11,289,11],[283,12,289,12],[283,0,289,0],[283,2,289,2],[283,3,289,3],[283,7,289,7],[283,8,289,8],[276,9,282,9],[276,10,282,10],[276,11,282,11],[276,12,282,12],[276,0,282,0],[276,2,282,2],[276,3,282,3],[276,7,282,7],[276,8,282,8],[277,13,282,13],[284,13,289,13],[269,9,275,9],[269,10,275,10],[291,13,296,13],[298,13,303,13],[311,9,317,9],[311,10,317,10],[311,11,317,11],[311,12,317,12],[311,0,317,0],[311,2,317,2],[311,3,317,3],[311,7,317,7],[311,8,317,8],[304,9,310,9],[304,10,310,10],[304,11,310,11],[304,12,310,12],[304,0,310,0],[304,2,310,2],[304,3,310,3],[304,7,310,7],[304,8,310,8],[305,13,310,13],[312,13,317,13],[297,9,303,9],[297,10,303,10],[297,11,303,11],[297,12,303,12],[297,0,303,0],[297,2,303,2],[297,3,303,3],[297,7,303,7],[297,8,303,8],[290,9,296,9],[332,2,338,2],[332,3,338,3],[332,7,338,7],[332,8,338,8],[333,13,338,13],[340,13,345,13],[325,9,331,9],[325,10,331,10],[325,11,331,11],[325,12,331,12],[325,0,331,0],[325,2,331,2],[325,3,331,3],[325,7,331,7],[325,8,331,8],[318,9,324,9],[318,10,324,10],[318,11,324,11],[318,12,324,12],[318,0,324,0],[318,2,324,2],[318,3,324,3],[318,7,324,7],[318,8,324,8],[353,11,359,11],[353,12,359,12],[353,0,359,0],[353,2,359,2],[353,3,359,3],[353,7,359,7],[353,8,359,8],[346,9,352,9],[346,10,352,10],[346,11,352,11],[346,12,352,12],[346,0,352,0],[346,2,352,2],[346,3,352,3],[346,7,352,7],[346,8,352,8],[319,13,324,13],[326,13,331,13],[339,9,345,9],[339,10,345,10],[339,11,345,11],[339,12,345,12],[339,0,345,0],[339,2,345,2],[339,3,345,3],[339,7,345,7],[339,8,345,8],[332,9,338,9],[332,10,338,10],[332,11,338,11],[332,12,338,12],[332,0,338,0],[374,10,380,10],[374,11,380,11],[374,12,380,12],[374,0,380,0],[374,2,380,2],[374,3,380,3],[374,7,380,7],[374,8,380,8],[347,13,352,13],[354,13,359,13],[367,9,373,9],[367,10,373,10],[367,11,373,11],[367,12,373,12],[367,0,373,0],[367,2,373,2],[367,3,373,3],[367,7,373,7],[367,8,373,8],[360,9,366,9],[360,10,366,10],[360,11,366,11],[360,12,366,12],[360,0,366,0],[360,2,366,2],[360,3,366,3],[360,7,366,7],[360,8,366,8],[361,13,366,13],[368,13,373,13],[353,9,359,9],[353,10,359,10],[375,13,380,13],[382,13,387,13],[395,9,401,9],[395,10,401,10],[395,11,401,11],[395,12,401,12],[395,0,401,0],[395,2,401,2],[395,3,401,3],[395,7,401,7],[395,8,401,8],[388,9,394,9],[388,10,394,10],[388,11,394,11],[388,12,394,12],[388,0,394,0],[388,2,394,2],[388,3,394,3],[388,7,394,7],[388,8,394,8],[389,13,394,13],[396,13,401,13],[381,9,387,9],[381,10,387,10],[381,11,387,11],[381,12,387,12],[381,0,387,0],[381,2,387,2],[381,3,387,3],[381,7,387,7],[381,8,387,8],[374,9,380,9],[416,2,422,2],[416,3,422,3],[416,7,422,7],[416,8,422,8],[417,13,422,13],[424,13,429,13],[409,9,415,9],[409,10,415,10],[409,11,415,11],[409,12,415,12],[409,0,415,0],[409,2,415,2],[409,3,415,3],[409,7,415,7],[409,8,415,8],[402,9,408,9],[402,10,408,10],[402,11,408,11],[402,12,408,12],[402,0,408,0],[402,2,408,2],[402,3,408,3],[402,7,408,7],[402,8,408,8],[437,11,443,11],[437,12,443,12],[437,0,443,0],[437,2,443,2],[437,3,443,3],[437,7,443,7],[437,8,443,8],[430,9,436,9],[430,10,436,10],[430,11,436,11],[430,12,436,12],[430,0,436,0],[430,2,436,2],[430,3,436,3],[430,7,436,7],[430,8,436,8],[403,13,408,13],[410,13,415,13],[423,9,429,9],[423,10,429,10],[423,11,429,11],[423,12,429,12],[423,0,429,0],[423,2,429,2],[423,3,429,3],[423,7,429,7],[423,8,429,8],[416,9,422,9],[416,10,422,10],[416,11,422,11],[416,12,422,12],[416,0,422,0],[458,10,464,10],[458,11,464,11],[458,12,464,12],[458,0,464,0],[458,2,464,2],[458,3,464,3],[458,7,464,7],[458,8,464,8],[431,13,436,13],[438,13,443,13],[451,9,457,9],[451,10,457,10],[451,11,457,11],[451,12,457,12],[451,0,457,0],[451,2,457,2],[451,3,457,3],[451,7,457,7],[451,8,457,8],[444,9,450,9],[444,10,450,10],[444,11,450,11],[444,12,450,12],[444,0,450,0],[444,2,450,2],[444,3,450,3],[444,7,450,7],[444,8,450,8],[445,13,450,13],[452,13,457,13],[437,9,443,9],[437,10,443,10],[459,13,464,13],[466,13,471,13],[479,9,485,9],[479,10,485,10],[479,11,485,11],[479,12,485,12],[479,0,485,0],[479,2,485,2],[479,3,485,3],[479,7,485,7],[479,8,485,8],[472,9,478,9],[472,10,478,10],[472,11,478,11],[472,12,478,12],[472,0,478,0],[472,2,478,2],[472,3,478,3],[472,7,478,7],[472,8,478,8],[473,13,478,13],[480,13,485,13],[465,9,471,9],[465,10,471,10],[465,11,471,11],[465,12,471,12],[465,0,471,0],[465,2,471,2],[465,3,471,3],[465,7,471,7],[465,8,471,8],[458,9,464,9],[500,2,506,2],[500,3,506,3],[500,7,506,7],[500,8,506,8],[501,13,506,13],[508,13,513,13],[493,9,499,9],[493,10,499,10],[493,11,499,11],[493,12,499,12],[493,0,499,0],[493,2,499,2],[493,3,499,3],[493,7,499,7],[493,8,499,8],[486,9,492,9],[486,10,492,10],[486,11,492,11],[486,12,492,12],[486,0,492,0],[486,2,492,2],[486,3,492,3],[486,7,492,7],[486,8,492,8],[521,11,527,11],[521,12,527,12],[521,0,527,0],[521,2,527,2],[521,3,527,3],[521,7,527,7],[521,8,527,8],[514,9,520,9],[514,10,520,10],[514,11,520,11],[514,12,520,12],[514,0,520,0],[514,2,520,2],[514,3,520,3],[514,7,520,7],[514,8,520,8],[487,13,492,13],[494,13,499,13],[507,9,513,9],[507,10,513,10],[507,11,513,11],[507,12,513,12],[507,0,513,0],[507,2,513,2],[507,3,513,3],[507,7,513,7],[507,8,513,8],[500,9,506,9],[500,10,506,10],[500,11,506,11],[500,12,506,12],[500,0,506,0],[542,10,548,10],[542,11,548,11],[542,12,548,12],[542,0,548,0],[542,2,548,2],[542,3,548,3],[542,7,548,7],[542,8,548,8],[515,13,520,13],[522,13,527,13],[535,9,541,9],[535,10,541,10],[535,11,541,11],[535,12,541,12],[535,0,541,0],[535,2,541,2],[535,3,541,3],[535,7,541,7],[535,8,541,8],[528,9,534,9],[528,10,534,10],[528,11,534,11],[528,12,534,12],[528,0,534,0],[528,2,534,2],[528,3,534,3],[528,7,534,7],[528,8,534,8],[529,13,534,13],[536,13,541,13],[521,9,527,9],[521,10,527,10],[543,13,548,13],[550,13,555,13],[563,9,569,9],[563,10,569,10],[563,11,569,11],[563,12,569,12],[563,0,569,0],[563,2,569,2],[563,3,569,3],[563,7,569,7],[563,8,569,8],[556,9,562,9],[556,10,562,10],[556,11,562,11],[556,12,562,12],[556,0,562,0],[556,2,562,2],[556,3,562,3],[556,7,562,7],[556,8,562,8],[557,13,562,13],[564,13,569,13],[549,9,555,9],[549,10,555,10],[549,11,555,11],[549,12,555,12],[549,0,555,0],[549,2,555,2],[549,3,555,3],[549,7,555,7],[549,8,555,8],[542,9,548,9],[584,2,590,2],[584,3,590,3],[584,7,590,7],[584,8,590,8],[585,13,590,13],[592,13,597,13],[577,9,583,9],[577,10,583,10],[577,11,583,11],[577,12,583,12],[577,0,583,0],[577,2,583,2],[577,3,583,3],[577,7,583,7],[577,8,583,8],[570,9,576,9],[570,10,576,10],[570,11,576,11],[570,12,576,12],[570,0,576,0],[570,2,576,2],[570,3,576,3],[570,7,576,7],[570,8,576,8],[605,11,611,11],[605,12,611,12],[605,0,611,0],[605,2,611,2],[605,3,611,3],[605,7,611,7],[605,8,611,8],[598,9,604,9],[598,10,604,10],[598,11,604,11],[598,12,604,12],[598,0,604,0],[598,2,604,2],[598,3,604,3],[598,7,604,7],[598,8,604,8],[571,13,576,13],[578,13,583,13],[591,9,597,9],[591,10,597,10],[591,11,597,11],[591,12,597,12],[591,0,597,0],[591,2,597,2],[591,3,597,3],[591,7,597,7],[591,8,597,8],[584,9,590,9],[584,10,590,10],[584,11,590,11],[584,12,590,12],[584,0,590,0],[626,10,632,10],[626,11,632,11],[626,12,632,12],[626,0,632,0],[626,2,632,2],[626,3,632,3],[626,7,632,7],[626,8,632,8],[599,13,604,13],[606,13,611,13],[619,9,625,9],[619,10,625,10],[619,11,625,11],[619,12,625,12],[619,0,625,0],[619,2,625,2],[619,3,625,3],[619,7,625,7],[619,8,625,8],[612,9,618,9],[612,10,618,10],[612,11,618,11],[612,12,618,12],[612,0,618,0],[612,2,618,2],[612,3,618,3],[612,7,618,7],[612,8,618,8],[613,13,618,13],[620,13,625,13],[605,9,611,9],[605,10,611,10],[627,13,632,13],[634,13,639,13],[647,9,653,9],[647,10,653,10],[647,11,653,11],[647,12,653,12],[647,0,653,0],[647,2,653,2],[647,3,653,3],[647,7,653,7],[647,8,653,8],[640,9,646,9],[640,10,646,10],[640,11,646,11],[640,12,646,12],[640,0,646,0],[640,2,646,2],[640,3,646,3],[640,7,646,7],[640,8,646,8],[641,13,646,13],[648,13,653,13],[633,9,639,9],[633,10,639,10],[633,11,639,11],[633,12,639,12],[633,0,639,0],[633,2,639,2],[633,3,639,3],[633,7,639,7],[633,8,639,8],[626,9,632,9],[668,2,674,2],[668,3,674,3],[668,7,674,7],[668,8,674,8],[669,13,674,13],[676,13,681,13],[661,9,667,9],[661,10,667,10],[661,11,667,11],[661,12,667,12],[661,0,667,0],[661,2,667,2],[661,3,667,3],[661,7,667,7],[661,8,667,8],[654,9,660,9],[654,10,660,10],[654,11,660,11],[654,12,660,12],[654,0,660,0],[654,2,660,2],[654,3,660,3],[654,7,660,7],[654,8,660,8],[689,11,695,11],[689,12,695,12],[689,0,695,0],[689,2,695,2],[689,3,695,3],[689,7,695,7],[689,8,695,8],[682,9,688,9],[682,10,688,10],[682,11,688,11],[682,12,688,12],[682,0,688,0],[682,2,688,2],[682,3,688,3],[682,7,688,7],[682,8,688,8],[655,13,660,13],[662,13,667,13],[675,9,681,9],[675,10,681,10],[675,11,681,11],[675,12,681,12],[675,0,681,0],[675,2,681,2],[675,3,681,3],[675,7,681,7],[675,8,681,8],[668,9,674,9],[668,10,674,10],[668,11,674,11],[668,12,674,12],[668,0,674,0],[710,10,716,10],[710,11,716,11],[710,12,716,12],[710,0,716,0],[710,2,716,2],[710,3,716,3],[710,7,716,7],[710,8,716,8],[683,13,688,13],[690,13,695,13],[703,9,709,9],[703,10,709,10],[703,11,709,11],[703,12,709,12],[703,0,709,0],[703,2,709,2],[703,3,709,3],[703,7,709,7],[703,8,709,8],[696,9,702,9],[696,10,702,10],[696,11,702,11],[696,12,702,12]],"merged_total":3201,"flags":["merged_cut"]}
[]
[]
[]
[]
[]
[]
[]
[]
[]
["Action","Mois","Date","Client","Produits ","Qté de bouteille ou litre","Montant","Somme reçue en CB","Somme reçue en chèque","Somme reçue en espèces","Contrôle","Observations","Comptabilisé\noui/non","n°action","comptabilisé ?"]
[null,null,null,null,null,null,{"$f":"IFERROR(VLOOKUP(E11,'Tarif de base'!D:E,2,FALSE)*F11,\"\")","v":""},null,null,null,{"$f":"IFERROR(IF(G17-H11-I11-J11<>0,\"Attention il manque \"&G17-H11-I11-J11&\"€\",\"Règlement OK\"),\"Pas de règlement\")","v":"Règlement OK"},null,"non",1,{"$f":"M11","v":"non"}]
[null,null,null,null,null,null,{"$f":"IFERROR(VLOOKUP(E12,'Tarif de base'!D:E,2,FALSE)*F12,\"\")","v":""},null,null,null,null,null,null,"Double cliquer sur le chiffre  au dessus pour masquer l'onglet correspondant",{"$f":"O11","v":"non"}]
[null,null,null,null,null,null,{"$f":"IFERROR(VLOOKUP(E13,'Tarif de base'!D:E,2,FALSE)*F13,\"\")","v":""},null,null,null,null,null,null,null,{"$f":"O12","v":"non"}]
[null,null,null,null,null,null,{"$f":"IFERROR(VLOOKUP(E14,'Tarif de base'!D:E,2,FALSE)*F14,\"\")","v":""},null,null,null,null,null,null,null,"non"]
[null,null,null,null,null,null,{"$f":"IFERROR(VLOOKUP(E15,'Tarif de base'!D:E,2,FALSE)*F15,\"\")","v":""},null,null,null,null,null,null,null,"non"]
[null,null,null,null,null,null,{"$f":"IFERROR(VLOOKUP(E16,'Tarif de base'!D:E,2,FALSE)*F16,\"\")","v":""},null,null,null,null,null,null,null,"non"]
[null,null,null,null,null,null,{"$f":"SUM(G11:G16)","v":0},null,null,null,null,null,null,null,"non"]
[null,null,null,null,null,null,{"$f":"IFERROR(VLOOKUP(E18,'Tarif de base'!D:E,2,FALSE)*F18,\"\")","v":""},null,null,null,{"$f":"IFERROR(IF(G24-H18-I18-J18<>0,\"Attention il manque \"&G24-H18-I18-J18&\"€\",\"Règlement OK\"),\"Pas de règlement\")","v":"Règlement OK"},null,"non",2,{"$f":"M18","v":"non"}]
[null,null,null,null,null,null,{"$f":"IFERROR(VLOOKUP(E19,'Tarif de base'!D:E,2,FALSE)*F19,\"\")","v":""},null,null,null,null,null,null,null,{"$f":"O18","v":"non"}]
[null,null,null,null,null,null,{"$f":"IFERROR(VLOOKUP(E20,'Tarif de base'!D:E,2,FALSE)*F20,\"\")","v":""},null,null,null,null,null,null,null,{"$f":"O19","v":"non"}]
[null,null,null,null,null,null,{"$f":"IFERROR(VLOOKUP(E21,'Tarif de base'!D:E,2,FALSE)*F21,\"\")","v":""},null,null,null,null,null,null,null,"non"]
[null,null,null,null,null,null,{"$f":"IFERROR(VLOOKUP(E22,'Tarif de base'!D:E,2,FALSE)*F22,\"\")","v":""},null,null,null,null,null,null,null,"non"]
[null,null,null,null,null,null,{"$f":"IFERROR(VLOOKUP(E23,'Tarif de base'!D:E,2,FALSE)*F23,\"\")","v":""},null,null,null,null,null,null,null,"non"]
[null,null,null,null,null,null,{"$f":"SUM(G18:G23)","v":0},null,null,null,null,null,null,null,"non"]
[null,null,null,null,null,null,{"$f":"IFERROR(VLOOKUP(E25,'Tarif de base'!D:E,2,FALSE)*F25,\"\")","v":""},null,null,null,{"$f":"IFERROR(IF(G31-H25-I25-J25<>0,\"Attention il manque \"&G31-H25-I25-J25&\"€\",\"Règlement OK\"),\"Pas de règlement\")","v":"Règlement OK"},null,"non",3,{"$f":"M25","v":"non"}]
[null,null,null,null,null,null,{"$f":"IFERROR(VLOOKUP(E26,'Tarif de base'!D:E,2,FALSE)*F26,\"\")","v":""},null,null,null,null,null,null,null,{"$f":"O25","v":"non"}]
[null,null,null,null,null,null,{"$f":"IFERROR(VLOOKUP(E27,'Tarif de base'!D:E,2,FALSE)*F27,\"\")","v":""},null,null,null,null,null,null,null,{"$f":"O26","v":"non"}]
[null,null,null,null,null,null,{"$f":"IFERROR(VLOOKUP(E28,'Tarif de base'!D:E,2,FALSE)*F28,\"\")","v":""},null,null,null,null,null,null,null,"non"]
[null,null,null,null,null,null,{"$f":"IFERROR(VLOOKUP(E29,'Tarif de base'!D:E,2,FALSE)*F29,\"\")","v":""},null,null,null,null,null,null,null,"non"]
[null,null,null,null,null,null,{"$f":"IFERROR(VLOOKUP(E30,'Tarif de base'!D:E,2,FALSE)*F30,\"\")","v":""},null,null,null,null,null,null,null,"non"]
[null,null,null,null,null,null,{"$f":"SUM(G25:G30)","v":0},null,null,null,null,null,null,null,"non"]
[null,null,null,null,null,null,{"$f":"IFERROR(VLOOKUP(E32,'Tarif de base'!D:E,2,FALSE)*F32,\"\")","v":""},null,null,null,{"$f":"IFERROR(IF(G38-H32-I32-J32<>0,\"Attention il manque \"&G38-H32-I32-J32&\"€\",\"Règlement OK\"),\"Pas de règlement\")","v":"Règlement OK"},null,"non",4,{"$f":"M32","v":"non"}]
[null,null,null,null,null,null,{"$f":"IFERROR(VLOOKUP(E33,'Tarif de base'!D:E,2,FALSE)*F33,\"\")","v":""},null,null,null,null,null,null,null,"non"]
[null,null,null,null,null,null,{"$f":"IFERROR(VLOOKUP(E34,'Tarif de base'!D:E,2,FALSE)*F34,\"\")","v":""},null,null,null,null,null,null,null,"non"]
[null,null,null,null,null,null,{"$f":"IFERROR(VLOOKUP(E35,'Tarif de base'!D:E,2,FALSE)*F35,\"\")","v":""},null,null,null,null,null,null,null,"non"]
[null,null,null,null,null,null,{"$f":"IFERROR(VLOOKUP(E36,'Tarif de base'!D:E,2,FALSE)*F36,\"\")","v":""},null,null,null,null,null,null,null,"non"]
[null,null,null,null,null,null,{"$f":"IFERROR(VLOOKUP(E37,'Tarif de base'!D:E,2,FALSE)*F37,\"\")","v":""},null,null,null,null,null,null,null,"non"]
[null,null,null,null,null,null,{"$f":"SUM(G32:G37)","v":0},null,null,null,null,null,null,null,"non"]
[null,null,null,null,null,null,{"$f":"IFERROR(VLOOKUP(E39,'Tarif de base'!D:E,2,FALSE)*F39,\"\")","v":""},null,null,null,{"$f":"IFERROR(IF(G45-H39-I39-J39<>0,\"Attention il manque \"&G45-H39-I39-J39&\"€\",\"Règlement OK\"),\"Pas de règlement\")","v":"Règlement OK"},null,"non",5,{"$f":"M39","v":"non"}]
[null,null,null,null,null,null,{"$f":"IFERROR(VLOOKUP(E40,'Tarif de base'!D:E,2,FALSE)*F40,\"\")","v":""},null,null,null,null,null,null,null,"non"]
[null,null,null,null,null,null,{"$f":"IFERROR(VLOOKUP(E41,'Tarif de base'!D:E,2,FALSE)*F41,\"\")","v":""},null,null,null,null,null,null,null,"non"]
[null,null,null,null,null,null,{"$f":"IFERROR(VLOOKUP(E42,'Tarif de base'!D:E,2,FALSE)*F42,\"\")","v":""},null,null,null,null,null,null,null,"non"]
[null,null,null,null,null,null,{"$f":"IFERROR(VLOOKUP(E43,'Tarif de base'!D:E,2,FALSE)*F43,\"\")","v":""},null,null,null,null,null,null,null,"non"]
[null,null,null,null,null,null,{"$f":"IFERROR(VLOOKUP(E44,'Tarif de base'!D:E,2,FALSE)*F44,\"\")","v":""},null,null,null,null,null,null,null,"non"]
[null,null,null,null,null,null,{"$f":"SUM(G39:G44)","v":0},null,null,null,null,null,null,null,"non"]
[null,null,null,null,null,null,{"$f":"IFERROR(VLOOKUP(E46,'Tarif de base'!D:E,2,FALSE)*F46,\"\")","v":""},null,null,null,{"$f":"IFERROR(IF(G52-H46-I46-J46<>0,\"Attention il manque \"&G52-H46-I46-J46&\"€\",\"Règlement OK\"),\"Pas de règlement\")","v":"Règlement OK"},null,"non",6,{"$f":"M46","v":"non"}]
[null,null,null,null,null,null,{"$f":"IFERROR(VLOOKUP(E47,'Tarif de base'!D:E,2,FALSE)*F47,\"\")","v":""},null,null,null,null,null,null,null,"non"]
[null,null,null,null,null,null,{"$f":"IFERROR(VLOOKUP(E48,'Tarif de base'!D:E,2,FALSE)*F48,\"\")","v":""},null,null,null,null,null,null,null,"non"]
[null,null,null,null,null,null,{"$f":"IFERROR(VLOOKUP(E49,'Tarif de base'!D:E,2,FALSE)*F49,\"\")","v":""},null,null,null,null,null,null,null,"non"]
[null,null,null,null,null,null,{"$f":"IFERROR(VLOOKUP(E50,'Tarif de base'!D:E,2,FALSE)*F50,\"\")","v":""},null,null,null,null,null,null,null,"non"]
[null,null,null,null,null,null,{"$f":"IFERROR(VLOOKUP(E51,'Tarif de base'!D:E,2,FALSE)*F51,\"\")","v":""},null,null,null,null,null,null,null,"non"]
[null,null,null,null,null,null,{"$f":"SUM(G46:G51)","v":0},null,null,null,null,null,null,null,"non"]
[null,null,null,null,null,null,{"$f":"IFERROR(VLOOKUP(E53,'Tarif de base'!D:E,2,FALSE)*F53,\"\")","v":""},null,null,null,{"$f":"IFERROR(IF(G59-H53-I53-J53<>0,\"Attention il manque \"&G59-H53-I53-J53&\"€\",\"Règlement OK\"),\"Pas de règlement\")","v":"Règlement OK"},null,"non",7,{"$f":"M53","v":"non"}]
[null,null,null,null,null,null,{"$f":"IFERROR(VLOOKUP(E54,'Tarif de base'!D:E,2,FALSE)*F54,\"\")","v":""},null,null,null,null,null,null,null,"non"]
[null,null,null,null,null,null,{"$f":"IFERROR(VLOOKUP(E55,'Tarif de base'!D:E,2,FALSE)*F55,\"\")","v":""},null,null,null,null,null,null,null,"non"]
[null,null,null,null,null,null,{"$f":"IFERROR(VLOOKUP(E56,'Tarif de base'!D:E,2,FALSE)*F56,\"\")","v":""},null,null,null,null,null,null,null,"non"]
[null,null,null,null,null,null,{"$f":"IFERROR(VLOOKUP(E57,'Tarif de base'!D:E,2,FALSE)*F57,\"\")","v":""},null,null,null,null,null,null,null,"non"]
[null,null,null,null,null,null,{"$f":"IFERROR(VLOOKUP(E58,'Tarif de base'!D:E,2,FALSE)*F58,\"\")","v":""},null,null,null,null,null,null,null,"non"]
[null,null,null,null,null,null,{"$f":"SUM(G53:G58)","v":0},null,null,null,null,null,null,null,"non"]
[null,null,null,null,null,null,{"$f":"IFERROR(VLOOKUP(E60,'Tarif de base'!D:E,2,FALSE)*F60,\"\")","v":""},null,null,null,{"$f":"IFERROR(IF(G66-H60-I60-J60<>0,\"Attention il manque \"&G66-H60-I60-J60&\"€\",\"Règlement OK\"),\"Pas de règlement\")","v":"Règlement OK"},null,"non",8,{"$f":"M60","v":"non"}]
[null,null,null,null,null,null,{"$f":"IFERROR(VLOOKUP(E61,'Tarif de base'!D:E,2,FALSE)*F61,\"\")","v":""},null,null,null,null,null,null,null,"non"]
[null,null,null,null,null,null,{"$f":"IFERROR(VLOOKUP(E62,'Tarif de base'!D:E,2,FALSE)*F62,\"\")","v":""},null,null,null,null,null,null,null,"non"]
[null,null,null,null,null,null,{"$f":"IFERROR(VLOOKUP(E63,'Tarif de base'!D:E,2,FALSE)*F63,\"\")","v":""},null,null,null,null,null,null,null,"non"]
[null,null,null,null,null,null,{"$f":"IFERROR(VLOOKUP(E64,'Tarif de base'!D:E,2,FALSE)*F64,\"\")","v":""},null,null,null,null,null,null,null,"non"]
[null,null,null,null,null,null,{"$f":"IFERROR(VLOOKUP(E65,'Tarif de base'!D:E,2,FALSE)*F65,\"\")","v":""},null,null,null,null,null,null,null,"non"]
[null,null,null,null,null,null,{"$f":"SUM(G60:G65)","v":0},null,null,null,null,null,null,null,"non"]
[null,null,null,null,null,null,{"$f":"IFERROR(VLOOKUP(E67,'Tarif de base'!D:E,2,FALSE)*F67,\"\")","v":""},null,null,null,{"$f":"IFERROR(IF(G73-H67-I67-J67<>0,\"Attention il manque \"&G73-H67-I67-J67&\"€\",\"Règlement OK\"),\"Pas de règlement\")","v":"Règlement OK"},null,"non",9,{"$f":"M67","v":"non"}]
[null,null,null,null,null,null,{"$f":"IFERROR(VLOOKUP(E68,'Tarif de base'!D:E,2,FALSE)*F68,\"\")","v":""},null,null,null,null,null,null,null,"non"]
[null,null,null,null,null,null,{"$f":"IFERROR(VLOOKUP(E69,'Tarif de base'!D:E,2,FALSE)*F69,\"\")","v":""},null,null,null,null,null,null,null,"non"]
[null,null,null,null,null,null,{"$f":"IFERROR(VLOOKUP(E70,'Tarif de base'!D:E,2,FALSE)*F70,\"\")","v":""},null,null,null,null,null,null,null,"non"]
[null,null,null,null,null,null,{"$f":"IFERROR(VLOOKUP(E71,'Tarif de base'!D:E,2,FALSE)*F71,\"\")","v":""},null,null,null,null,null,null,null,"non"]
[null,null,null,null,null,null,{"$f":"IFERROR(VLOOKUP(E72,'Tarif de base'!D:E,2,FALSE)*F72,\"\")","v":""},null,null,null,null,null,null,null,"non"]
[null,null,null,null,null,null,{"$f":"SUM(G67:G72)","v":0},null,null,null,null,null,null,null,"non"]
[null,null,null,null,null,null,{"$f":"IFERROR(VLOOKUP(E74,'Tarif de base'!D:E,2,FALSE)*F74,\"\")","v":""},null,null,null,{"$f":"IFERROR(IF(G80-H74-I74-J74<>0,\"Attention il manque \"&G80-H74-I74-J74&\"€\",\"Règlement OK\"),\"Pas de règlement\")","v":"Règlement OK"},null,"non",10,{"$f":"M74","v":"non"}]
[null,null,null,null,null,null,{"$f":"IFERROR(VLOOKUP(E75,'Tarif de base'!D:E,2,FALSE)*F75,\"\")","v":""},null,null,null,null,null,null,null,"non"]
[null,null,null,null,null,null,{"$f":"IFERROR(VLOOKUP(E76,'Tarif de base'!D:E,2,FALSE)*F76,\"\")","v":""},null,null,null,null,null,null,null,"non"]
[null,null,null,null,null,null,{"$f":"IFERROR(VLOOKUP(E77,'Tarif de base'!D:E,2,FALSE)*F77,\"\")","v":""},null,null,null,null,null,null,null,"non"]
[null,null,null,null,null,null,{"$f":"IFERROR(VLOOKUP(E78,'Tarif de base'!D:E,2,FALSE)*F78,\"\")","v":""},null,null,null,null,null,null,null,"non"]
[null,null,null,null,null,null,{"$f":"IFERROR(VLOOKUP(E79,'Tarif de base'!D:E,2,FALSE)*F79,\"\")","v":""},null,null,null,null,null,null,null,"non"]
[null,null,null,null,null,null,{"$f":"SUM(G74:G79)","v":0},null,null,null,null,null,null,null,"non"]
[null,null,null,null,null,null,{"$f":"IFERROR(VLOOKUP(E81,'Tarif de base'!D:E,2,FALSE)*F81,\"\")","v":""},null,null,null,{"$f":"IFERROR(IF(G87-H81-I81-J81<>0,\"Attention il manque \"&G87-H81-I81-J81&\"€\",\"Règlement OK\"),\"Pas de règlement\")","v":"Règlement OK"},null,"non",11,{"$f":"M81","v":"non"}]
[null,null,null,null,null,null,{"$f":"IFERROR(VLOOKUP(E82,'Tarif de base'!D:E,2,FALSE)*F82,\"\")","v":""},null,null,null,null,null,null,null,"non"]
[null,null,null,null,null,null,{"$f":"IFERROR(VLOOKUP(E83,'Tarif de base'!D:E,2,FALSE)*F83,\"\")","v":""},null,null,null,null,null,null,null,"non"]
[null,null,null,null,null,null,{"$f":"IFERROR(VLOOKUP(E84,'Tarif de base'!D:E,2,FALSE)*F84,\"\")","v":""},null,null,null,null,null,null,null,"non"]
[null,null,null,null,null,null,{"$f":"IFERROR(VLOOKUP(E85,'Tarif de base'!D:E,2,FALSE)*F85,\"\")","v":""},null,null,null,null,null,null,null,"non"]
[null,null,null,null,null,null,{"$f":"IFERROR(VLOOKUP(E86,'Tarif de base'!D:E,2,FALSE)*F86,\"\")","v":""},null,null,null,null,null,null,null,"non"]
[null,null,null,null,null,null,{"$f":"SUM(G81:G86)","v":0},null,null,null,null,null,null,null,"non"]
[null,null,null,null,null,null,{"$f":"IFERROR(VLOOKUP(E88,'Tarif de base'!D:E,2,FALSE)*F88,\"\")","v":""},null,null,null,{"$f":"IFERROR(IF(G94-H88-I88-J88<>0,\"Attention il manque \"&G94-H88-I88-J88&\"€\",\"Règlement OK\"),\"Pas de règlement\")","v":"Règlement OK"},null,"non",12,{"$f":"M88","v":"non"}]
[null,null,null,null,null,null,{"$f":"IFERROR(VLOOKUP(E89,'Tarif de base'!D:E,2,FALSE)*F89,\"\")","v":""},null,null,null,null,null,null,null,"non"]
[null,null,null,null,null,null,{"$f":"IFERROR(VLOOKUP(E90,'Tarif de base'!D:E,2,FALSE)*F90,\"\")","v":""},null,null,null,null,null,null,null,"non"]
[null,null,null,null,null,null,{"$f":"IFERROR(VLOOKUP(E91,'Tarif de base'!D:E,2,FALSE)*F91,\"\")","v":""},null,null,null,null,null,null,null,{"$f":"O90","v":"non"}]
[null,null,null,null,null,null,{"$f":"IFERROR(VLOOKUP(E92,'Tarif de base'!D:E,2,FALSE)*F92,\"\")","v":""},null,null,null,null,null,null,null,"non"]
[null,null,null,null,null,null,{"$f":"IFERROR(VLOOKUP(E93,'Tarif de base'!D:E,2,FALSE)*F93,\"\")","v":""},null,null,null,null,null,null,null,"non"]
[null,null,null,null,null,null,{"$f":"SUM(G88:G93)","v":0},null,null,null,null,null,null,null,"non"]
[null,null,null,null,null,null,{"$f":"IFERROR(VLOOKUP(E95,'Tarif de base'!D:E,2,FALSE)*F95,\"\")","v":""},null,null,null,{"$f":"IFERROR(IF(G101-H95-I95-J95<>0,\"Attention il manque \"&G101-H95-I95-J95&\"€\",\"Règlement OK\"),\"Pas de règlement\")","v":"Règlement OK"},null,"non",13,{"$f":"M95","v":"non"}]
[null,null,null,null,null,null,{"$f":"IFERROR(VLOOKUP(E96,'Tarif de base'!D:E,2,FALSE)*F96,\"\")","v":""},null,null,null,null,null,null,null,"non"]
[null,null,null,null,null,null,{"$f":"IFERROR(VLOOKUP(E97,'Tarif de base'!D:E,2,FALSE)*F97,\"\")","v":""},null,null,null,null,null,null,null,"non"]
[null,null,null,null,null,null,{"$f":"IFERROR(VLOOKUP(E98,'Tarif de base'!D:E,2,FALSE)*F98,\"\")","v":""},null,null,null,null,null,null,null,"non"]
[null,null,null,null,null,null,{"$f":"IFERROR(VLOOKUP(E99,'Tarif de base'!D:E,2,FALSE)*F99,\"\")","v":""},null,null,null,null,null,null,null,"non"]
[null,null,null,null,null,null,{"$f":"IFERROR(VLOOKUP(E100,'Tarif de base'!D:E,2,FALSE)*F100,\"\")","v":""},null,null,null,null,null,null,null,"non"]
[null,null,null,null,null,null,{"$f":"SUM(G95:G100)","v":0},null,null,null,null,null,null,null,"non"]
[null,null,null,null,null,null,{"$f":"IFERROR(VLOOKUP(E102,'Tarif de base'!D:E,2,FALSE)*F102,\"\")","v":""},null,null,null,{"$f":"IFERROR(IF(G108-H102-I102-J102<>0,\"Attention il manque \"&G108-H102-I102-J102&\"€\",\"Règlement OK\"),\"Pas de règlement\")","v":"Règlement OK"},null,"non",14,{"$f":"M102","v":"non"}]
[null,null,null,null,null,null,{"$f":"IFERROR(VLOOKUP(E103,'Tarif de base'!D:E,2,FALSE)*F103,\"\")","v":""},null,null,null,null,null,null,null,"non"]
[null,null,null,null,null,null,{"$f":"IFERROR(VLOOKUP(E104,'Tarif de base'!D:E,2,FALSE)*F104,\"\")","v":""},null,null,null,null,null,null,null,"non"]
[null,null,null,null,null,null,{"$f":"IFERROR(VLOOKUP(E105,'Tarif de base'!D:E,2,FALSE)*F105,\"\")","v":""},null,null,null,null,null,null,null,"non"]
[null,null,null,null,null,null,{"$f":"IFERROR(VLOOKUP(E106,'Tarif de base'!D:E,2,FALSE)*F106,\"\")","v":""},null,null,null,null,null,null,null,"non"]
[null,null,null,null,null,null,{"$f":"IFERROR(VLOOKUP(E107,'Tarif de base'!D:E,2,FALSE)*F107,\"\")","v":""},null,null,null,null,null,null,null,"non"]
[null,null,null,null,null,null,{"$f":"SUM(G102:G107)","v":0},null,null,null,null,null,null,null,"non"]
[null,null,null,null,null,null,{"$f":"IFERROR(VLOOKUP(E109,'Tarif de base'!D:E,2,FALSE)*F109,\"\")","v":""},null,null,null,{"$f":"IFERROR(IF(G115-H109-I109-J109<>0,\"Attention il manque \"&G115-H109-I109-J109&\"€\",\"Règlement OK\"),\"Pas de règlement\")","v":"Règlement OK"},null,"non",15,{"$f":"M109","v":"non"}]
[null,null,null,null,null,null,{"$f":"IFERROR(VLOOKUP(E110,'Tarif de base'!D:E,2,FALSE)*F110,\"\")","v":""},null,null,null,null,null,null,null,"non"]
[null,null,null,null,null,null,{"$f":"IFERROR(VLOOKUP(E111,'Tarif de base'!D:E,2,FALSE)*F111,\"\")","v":""},null,null,null,null,null,null,null,"non"]
[null,null,null,null,null,null,{"$f":"IFERROR(VLOOKUP(E112,'Tarif de base'!D:E,2,FALSE)*F112,\"\")","v":""},null,null,null,null,null,null,null,"non"]
[null,null,null,null,null,null,{"$f":"IFERROR(VLOOKUP(E113,'Tarif de base'!D:E,2,FALSE)*F113,\"\")","v":""},null,null,null,null,null,null,null,"non"]
[null,null,null,null,null,null,{"$f":"IFERROR(VLOOKUP(E114,'Tarif de base'!D:E,2,FALSE)*F114,\"\")","v":""},null,null,null,null,null,null,null,"non"]
[null,null,null,null,null,null,{"$f":"SUM(G109:G114)","v":0},null,null,null,null,null,null,null,"non"]
[null,null,null,null,null,null,{"$f":"IFERROR(VLOOKUP(E116,'Tarif de base'!D:E,2,FALSE)*F116,\"\")","v":""},null,null,null,{"$f":"IFERROR(IF(G122-H116-I116-J116<>0,\"Attention il manque \"&G122-H116-I116-J116&\"€\",\"Règlement OK\"),\"Pas de règlement\")","v":"Règlement OK"},null,"non",16,{"$f":"M116","v":"non"}]
[null,null,null,null,null,null,{"$f":"IFERROR(VLOOKUP(E117,'Tarif de base'!D:E,2,FALSE)*F117,\"\")","v":""},null,null,null,null,null,null,null,{"$f":"O116","v":"non"}]
[null,null,null,null,null,null,{"$f":"IFERROR(VLOOKUP(E118,'Tarif de base'!D:E,2,FALSE)*F118,\"\")","v":""},null,null,null,null,null,null,null,"non"]
[null,null,null,null,null,null,{"$f":"IFERROR(VLOOKUP(E119,'Tarif de base'!D:E,2,FALSE)*F119,\"\")","v":""},null,null,null,null,null,null,null,"non"]
[null,null,null,null,null,null,{"$f":"IFERROR(VLOOKUP(E120,'Tarif de base'!D:E,2,FALSE)*F120,\"\")","v":""},null,null,null,null,null,null,null,"non"]
[null,null,null,null,null,null,{"$f":"IFERROR(VLOOKUP(E121,'Tarif de base'!D:E,2,FALSE)*F121,\"\")","v":""},null,null,null,null,null,null,null,"non"]
[null,null,null,null,null,null,{"$f":"SUM(G116:G121)","v":0},null,null,null,null,null,null,null,"non"]
[null,null,null,null,null,null,{"$f":"IFERROR(VLOOKUP(E123,'Tarif de base'!D:E,2,FALSE)*F123,\"\")","v":""},null,null,null,{"$f":"IFERROR(IF(G129-H123-I123-J123<>0,\"Attention il manque \"&G129-H123-I123-J123&\"€\",\"Règlement OK\"),\"Pas de règlement\")","v":"Règlement OK"},null,"non",17,{"$f":"M123","v":"non"}]
[null,null,null,null,null,null,{"$f":"IFERROR(VLOOKUP(E124,'Tarif de base'!D:E,2,FALSE)*F124,\"\")","v":""},null,null,null,null,null,null,null,"non"]
[null,null,null,null,null,null,{"$f":"IFERROR(VLOOKUP(E125,'Tarif de base'!D:E,2,FALSE)*F125,\"\")","v":""},null,null,null,null,null,null,null,"non"]
[null,null,null,null,null,null,{"$f":"IFERROR(VLOOKUP(E126,'Tarif de base'!D:E,2,FALSE)*F126,\"\")","v":""},null,null,null,null,null,null,null,"non"]
[null,null,null,null,null,null,{"$f":"IFERROR(VLOOKUP(E127,'Tarif de base'!D:E,2,FALSE)*F127,\"\")","v":""},null,null,null,null,null,null,null,"non"]
[null,null,null,null,null,null,{"$f":"IFERROR(VLOOKUP(E128,'Tarif de base'!D:E,2,FALSE)*F128,\"\")","v":""},null,null,null,null,null,null,null,"non"]
[null,null,null,null,null,null,{"$f":"SUM(G123:G128)","v":0},null,null,null,null,null,null,null,"non"]
[null,null,null,null,null,null,{"$f":"IFERROR(VLOOKUP(E130,'Tarif de base'!D:E,2,FALSE)*F130,\"\")","v":""},null,null,null,{"$f":"IFERROR(IF(G136-H130-I130-J130<>0,\"Attention il manque \"&G136-H130-I130-J130&\"€\",\"Règlement OK\"),\"Pas de règlement\")","v":"Règlement OK"},null,"non",18,{"$f":"M130","v":"non"}]
[null,null,null,null,null,null,{"$f":"IFERROR(VLOOKUP(E131,'Tarif de base'!D:E,2,FALSE)*F131,\"\")","v":""},null,null,null,null,null,null,null,"non"]
[null,null,null,null,null,null,{"$f":"IFERROR(VLOOKUP(E132,'Tarif de base'!D:E,2,FALSE)*F132,\"\")","v":""},null,null,null,null,null,null,null,"non"]
[null,null,null,null,null,null,{"$f":"IFERROR(VLOOKUP(E133,'Tarif de base'!D:E,2,FALSE)*F133,\"\")","v":""},null,null,null,null,null,null,null,"non"]
[null,null,null,null,null,null,{"$f":"IFERROR(VLOOKUP(E134,'Tarif de base'!D:E,2,FALSE)*F134,\"\")","v":""},null,null,null,null,null,null,null,"non"]
[null,null,null,null,null,null,{"$f":"IFERROR(VLOOKUP(E135,'Tarif de base'!D:E,2,FALSE)*F135,\"\")","v":""},null,null,null,null,null,null,null,"non"]
[null,null,null,null,null,null,{"$f":"SUM(G130:G135)","v":0},null,null,null,null,null,null,null,"non"]
[null,null,null,null,null,null,{"$f":"IFERROR(VLOOKUP(E137,'Tarif de base'!D:E,2,FALSE)*F137,\"\")","v":""},null,null,null,{"$f":"IFERROR(IF(G143-H137-I137-J137<>0,\"Attention il manque \"&G143-H137-I137-J137&\"€\",\"Règlement OK\"),\"Pas de règlement\")","v":"Règlement OK"},null,"non",19,{"$f":"M137","v":"non"}]
[null,null,null,null,null,null,{"$f":"IFERROR(VLOOKUP(E138,'Tarif de base'!D:E,2,FALSE)*F138,\"\")","v":""},null,null,null,null,null,null,null,"non"]
[null,null,null,null,null,null,{"$f":"IFERROR(VLOOKUP(E139,'Tarif de base'!D:E,2,FALSE)*F139,\"\")","v":""},null,null,null,null,null,null,null,"non"]
[null,null,null,null,null,null,{"$f":"IFERROR(VLOOKUP(E140,'Tarif de base'!D:E,2,FALSE)*F140,\"\")","v":""},null,null,null,null,null,null,null,"non"]
[null,null,null,null,null,null,{"$f":"IFERROR(VLOOKUP(E141,'Tarif de base'!D:E,2,FALSE)*F141,\"\")","v":""},null,null,null,null,null,null,null,"non"]
[null,null,null,null,null,null,{"$f":"IFERROR(VLOOKUP(E142,'Tarif de base'!D:E,2,FALSE)*F142,\"\")","v":""},null,null,null,null,null,null,null,"non"]
[null,null,null,null,null,null,{"$f":"SUM(G137:G142)","v":0},null,null,null,null,null,null,null,"non"]
[null,null,null,null,null,null,{"$f":"IFERROR(VLOOKUP(E144,'Tarif de base'!D:E,2,FALSE)*F144,\"\")","v":""},null,null,null,{"$f":"IFERROR(IF(G150-H144-I144-J144<>0,\"Attention il manque \"&G150-H144-I144-J144&\"€\",\"Règlement OK\"),\"Pas de règlement\")","v":"Règlement OK"},null,"non",20,{"$f":"M144","v":"non"}]
[null,null,null,null,null,null,{"$f":"IFERROR(VLOOKUP(E145,'Tarif de base'!D:E,2,FALSE)*F145,\"\")","v":""},null,null,null,null,null,null,null,{"$f":"O144","v":"non"}]
[null,null,null,null,null,null,{"$f":"IFERROR(VLOOKUP(E146,'Tarif de base'!D:E,2,FALSE)*F146,\"\")","v":""},null,null,null,null,null,null,null,{"$f":"O145","v":"non"}]
[null,null,null,null,null,null,{"$f":"IFERROR(VLOOKUP(E147,'Tarif de base'!D:E,2,FALSE)*F147,\"\")","v":""},null,null,null,null,null,null,null,"non"]
[null,null,null,null,null,null,{"$f":"IFERROR(VLOOKUP(E148,'Tarif de base'!D:E,2,FALSE)*F148,\"\")","v":""},null,null,null,null,null,null,null,"non"]
[null,null,null,null,null,null,{"$f":"IFERROR(VLOOKUP(E149,'Tarif de base'!D:E,2,FALSE)*F149,\"\")","v":""},null,null,null,null,null,null,null,"non"]
[null,null,null,null,null,null,{"$f":"SUM(G144:G149)","v":0},null,null,null,null,null,null,null,"non"]
[null,null,null,null,null,null,{"$f":"IFERROR(VLOOKUP(E151,'Tarif de base'!D:E,2,FALSE)*F151,\"\")","v":""},null,null,null,{"$f":"IFERROR(IF(G157-H151-I151-J151<>0,\"Attention il manque \"&G157-H151-I151-J151&\"€\",\"Règlement OK\"),\"Pas de règlement\")","v":"Règlement OK"},null,"non",21,{"$f":"M151","v":"non"}]
[null,null,null,null,null,null,{"$f":"IFERROR(VLOOKUP(E152,'Tarif de base'!D:E,2,FALSE)*F152,\"\")","v":""},null,null,null,null,null,null,null,{"$f":"O151","v":"non"}]
[null,null,null,null,null,null,{"$f":"IFERROR(VLOOKUP(E153,'Tarif de base'!D:E,2,FALSE)*F153,\"\")","v":""},null,null,null,null,null,null,null,{"$f":"O152","v":"non"}]
[null,null,null,null,null,null,{"$f":"IFERROR(VLOOKUP(E154,'Tarif de base'!D:E,2,FALSE)*F154,\"\")","v":""},null,null,null,null,null,null,null,"non"]
[null,null,null,null,null,null,{"$f":"IFERROR(VLOOKUP(E155,'Tarif de base'!D:E,2,FALSE)*F155,\"\")","v":""},null,null,null,null,null,null,null,"non"]
[null,null,null,null,null,null,{"$f":"IFERROR(VLOOKUP(E156,'Tarif de base'!D:E,2,FALSE)*F156,\"\")","v":""},null,null,null,null,null,null,null,"non"]
[null,null,null,null,null,null,{"$f":"SUM(G151:G156)","v":0},null,null,null,null,null,null,null,"non"]
[null,null,null,null,null,null,{"$f":"IFERROR(VLOOKUP(E158,'Tarif de base'!D:E,2,FALSE)*F158,\"\")","v":""},null,null,null,{"$f":"IFERROR(IF(G164-H158-I158-J158<>0,\"Attention il manque \"&G164-H158-I158-J158&\"€\",\"Règlement OK\"),\"Pas de règlement\")","v":"Règlement OK"},null,"non",22,{"$f":"M158","v":"non"}]
[null,null,null,null,null,null,{"$f":"IFERROR(VLOOKUP(E159,'Tarif de base'!D:E,2,FALSE)*F159,\"\")","v":""},null,null,null,null,null,null,null,"non"]
[null,null,null,null,null,null,{"$f":"IFERROR(VLOOKUP(E160,'Tarif de base'!D:E,2,FALSE)*F160,\"\")","v":""},null,null,null,null,null,null,null,"non"]
[null,null,null,null,null,null,{"$f":"IFERROR(VLOOKUP(E161,'Tarif de base'!D:E,2,FALSE)*F161,\"\")","v":""},null,null,null,null,null,null,null,"non"]
[null,null,null,null,null,null,{"$f":"IFERROR(VLOOKUP(E162,'Tarif de base'!D:E,2,FALSE)*F162,\"\")","v":""},null,null,null,null,null,null,null,"non"]
[null,null,null,null,null,null,{"$f":"IFERROR(VLOOKUP(E163,'Tarif de base'!D:E,2,FALSE)*F163,\"\")","v":""},null,null,null,null,null,null,null,"non"]
[null,null,null,null,null,null,{"$f":"SUM(G158:G163)","v":0},null,null,null,null,null,null,null,"non"]
[null,null,null,null,null,null,{"$f":"IFERROR(VLOOKUP(E165,'Tarif de base'!D:E,2,FALSE)*F165,\"\")","v":""},null,null,null,{"$f":"IFERROR(IF(G171-H165-I165-J165<>0,\"Attention il manque \"&G171-H165-I165-J165&\"€\",\"Règlement OK\"),\"Pas de règlement\")","v":"Règlement OK"},null,"non",23,{"$f":"M165","v":"non"}]
[null,null,null,null,null,null,{"$f":"IFERROR(VLOOKUP(E166,'Tarif de base'!D:E,2,FALSE)*F166,\"\")","v":""},null,null,null,null,null,null,null,"non"]
[null,null,null,null,null,null,{"$f":"IFERROR(VLOOKUP(E167,'Tarif de base'!D:E,2,FALSE)*F167,\"\")","v":""},null,null,null,null,null,null,null,"non"]
[null,null,null,null,null,null,{"$f":"IFERROR(VLOOKUP(E168,'Tarif de base'!D:E,2,FALSE)*F168,\"\")","v":""},null,null,null,null,null,null,null,"non"]
[null,null,null,null,null,null,{"$f":"IFERROR(VLOOKUP(E169,'Tarif de base'!D:E,2,FALSE)*F169,\"\")","v":""},null,null,null,null,null,null,null,"non"]
[null,null,null,null,null,null,{"$f":"IFERROR(VLOOKUP(E170,'Tarif de base'!D:E,2,FALSE)*F170,\"\")","v":""},null,null,null,null,null,null,null,"non"]
[null,null,null,null,null,null,{"$f":"SUM(G165:G170)","v":0},null,null,null,null,null,null,null,"non"]
[null,null,null,null,null,null,{"$f":"IFERROR(VLOOKUP(E172,'Tarif de base'!D:E,2,FALSE)*F172,\"\")","v":""},null,null,null,{"$f":"IFERROR(IF(G178-H172-I172-J172<>0,\"Attention il manque \"&G178-H172-I172-J172&\"€\",\"Règlement OK\"),\"Pas de règlement\")","v":"Règlement OK"},null,"non",24,{"$f":"M172","v":"non"}]
[null,null,null,null,null,null,{"$f":"IFERROR(VLOOKUP(E173,'Tarif de base'!D:E,2,FALSE)*F173,\"\")","v":""},null,null,null,null,null,null,null,"non"]
[null,null,null,null,null,null,{"$f":"IFERROR(VLOOKUP(E174,'Tarif de base'!D:E,2,FALSE)*F174,\"\")","v":""},null,null,null,null,null,null,null,"non"]
[null,null,null,null,null,null,{"$f":"IFERROR(VLOOKUP(E175,'Tarif de base'!D:E,2,FALSE)*F175,\"\")","v":""},null,null,null,null,null,null,null,"non"]
[null,null,null,null,null,null,{"$f":"IFERROR(VLOOKUP(E176,'Tarif de base'!D:E,2,FALSE)*F176,\"\")","v":""},null,null,null,null,null,null,null,"non"]
[null,null,null,null,null,null,{"$f":"IFERROR(VLOOKUP(E177,'Tarif de base'!D:E,2,FALSE)*F177,\"\")","v":""},null,null,null,null,null,null,null,"non"]
[null,null,null,null,null,null,{"$f":"SUM(G172:G177)","v":0},null,null,null,null,null,null,null,"non"]
[null,null,null,null,null,null,{"$f":"IFERROR(VLOOKUP(E179,'Tarif de base'!D:E,2,FALSE)*F179,\"\")","v":""},null,null,null,{"$f":"IFERROR(IF(G185-H179-I179-J179<>0,\"Attention il manque \"&G185-H179-I179-J179&\"€\",\"Règlement OK\"),\"Pas de règlement\")","v":"Règlement OK"},null,"non",25,{"$f":"M179","v":"non"}]
[null,null,null,null,null,null,{"$f":"IFERROR(VLOOKUP(E180,'Tarif de base'!D:E,2,FALSE)*F180,\"\")","v":""},null,null,null,null,null,null,null,"non"]
[null,null,null,null,null,null,{"$f":"IFERROR(VLOOKUP(E181,'Tarif de base'!D:E,2,FALSE)*F181,\"\")","v":""},null,null,null,null,null,null,null,"non"]
[null,null,null,null,null,null,{"$f":"IFERROR(VLOOKUP(E182,'Tarif de base'!D:E,2,FALSE)*F182,\"\")","v":""},null,null,null,null,null,null,null,"non"]
[null,null,null,null,null,null,{"$f":"IFERROR(VLOOKUP(E183,'Tarif de base'!D:E,2,FALSE)*F183,\"\")","v":""},null,null,null,null,null,null,null,"non"]
[null,null,null,null,null,null,{"$f":"IFERROR(VLOOKUP(E184,'Tarif de base'!D:E,2,FALSE)*F184,\"\")","v":""},null,null,null,null,null,null,null,"non"]
[null,null,null,null,null,null,{"$f":"SUM(G179:G184)","v":0},null,null,null,null,null,null,null,"non"]
[null,null,null,null,null,null,{"$f":"IFERROR(VLOOKUP(E186,'Tarif de base'!D:E,2,FALSE)*F186,\"\")","v":""},null,null,null,{"$f":"IFERROR(IF(G192-H186-I186-J186<>0,\"Attention il manque \"&G192-H186-I186-J186&\"€\",\"Règlement OK\"),\"Pas de règlement\")","v":"Règlement OK"},null,"non",26,{"$f":"M186","v":"non"}]
[null,null,null,null,null,null,{"$f":"IFERROR(VLOOKUP(E187,'Tarif de base'!D:E,2,FALSE)*F187,\"\")","v":""},null,null,null,null,null,null,null,"non"]
[null,null,null,null,null,null,{"$f":"IFERROR(VLOOKUP(E188,'Tarif de base'!D:E,2,FALSE)*F188,\"\")","v":""},null,null,null,null,null,null,null,"non"]
[null,null,null,null,null,null,{"$f":"IFERROR(VLOOKUP(E189,'Tarif de base'!D:E,2,FALSE)*F189,\"\")","v":""},null,null,null,null,null,null,null,"non"]
[null,null,null,null,null,null,{"$f":"IFERROR(VLOOKUP(E190,'Tarif de base'!D:E,2,FALSE)*F190,\"\")","v":""},null,null,null,null,null,null,null,"non"]
[null,null,null,null,null,null,{"$f":"IFERROR(VLOOKUP(E191,'Tarif de base'!D:E,2,FALSE)*F191,\"\")","v":""},null,null,null,null,null,null,null,"non"]
[null,null,null,null,null,null,{"$f":"SUM(G186:G191)","v":0},null,null,null,null,null,null,null,"non"]
[null,null,null,null,null,null,{"$f":"IFERROR(VLOOKUP(E193,'Tarif de base'!D:E,2,FALSE)*F193,\"\")","v":""},null,null,null,{"$f":"IFERROR(IF(G199-H193-I193-J193<>0,\"Attention il manque \"&G199-H193-I193-J193&\"€\",\"Règlement OK\"),\"Pas de règlement\")","v":"Règlement OK"},null,"non",27,{"$f":"M193","v":"non"}]
[null,null,null,null,null,null,{"$f":"IFERROR(VLOOKUP(E194,'Tarif de base'!D:E,2,FALSE)*F194,\"\")","v":""},null,null,null,null,null,null,null,"non"]
[null,null,null,null,null,null,{"$f":"IFERROR(VLOOKUP(E195,'Tarif de base'!D:E,2,FALSE)*F195,\"\")","v":""},null,null,null,null,null,null,null,"non"]
[null,null,null,null,null,null,{"$f":"IFERROR(VLOOKUP(E196,'Tarif de base'!D:E,2,FALSE)*F196,\"\")","v":""},null,null,null,null,null,null,null,"non"]
[null,null,null,null,null,null,{"$f":"IFERROR(VLOOKUP(E197,'Tarif de base'!D:E,2,FALSE)*F197,\"\")","v":""},null,null,null,null,null,null,null,"non"]
[null,null,null,null,null,null,{"$f":"IFERROR(VLOOKUP(E198,'Tarif de base'!D:E,2,FALSE)*F198,\"\")","v":""},null,null,null,null,null,null,null,"non"]
[null,null,null,null,null,null,{"$f":"SUM(G193:G198)","v":0},null,null,null,null,null,null,null,"non"]
[null,null,null,null,null,null,{"$f":"IFERROR(VLOOKUP(E200,'Tarif de base'!D:E,2,FALSE)*F200,\"\")","v":""},null,null,null,{"$f":"IFERROR(IF(G206-H200-I200-J200<>0,\"Attention il manque \"&G206-H200-I200-J200&\"€\",\"Règlement OK\"),\"Pas de règlement\")","v":"Règlement OK"},null,"non",28,{"$f":"M200","v":"non"}]
[null,null,null,null,null,null,{"$f":"IFERROR(VLOOKUP(E201,'Tarif de base'!D:E,2,FALSE)*F201,\"\")","v":""},null,null,null,null,null,null,null,"non"]
[null,null,null,null,null,null,{"$f":"IFERROR(VLOOKUP(E202,'Tarif de base'!D:E,2,FALSE)*F202,\"\")","v":""},null,null,null,null,null,null,null,"non"]
[null,null,null,null,null,null,{"$f":"IFERROR(VLOOKUP(E203,'Tarif de base'!D:E,2,FALSE)*F203,\"\")","v":""},null,null,null,null,null,null,null,"non"]
[null,null,null,null,null,null,{"$f":"IFERROR(VLOOKUP(E204,'Tarif de base'!D:E,2,FALSE)*F204,\"\")","v":""},null,null,null,null,null,null,null,"non"]
[null,null,null,null,null,null,{"$f":"IFERROR(VLOOKUP(E205,'Tarif de base'!D:E,2,FALSE)*F205,\"\")","v":""},null,null,null,null,null,null,null,"non"]
[null,null,null,null,null,null,{"$f":"SUM(G200:G205)","v":0},null,null,null,null,null,null,null,"non"]
[null,null,null,null,null,null,{"$f":"IFERROR(VLOOKUP(E207,'Tarif de base'!D:E,2,FALSE)*F207,\"\")","v":""},null,null,null,{"$f":"IFERROR(IF(G213-H207-I207-J207<>0,\"Attention il manque \"&G213-H207-I207-J207&\"€\",\"Règlement OK\"),\"Pas de règlement\")","v":"Règlement OK"},null,"non",29,{"$f":"M207","v":"non"}]
[null,null,null,null,null,null,{"$f":"IFERROR(VLOOKUP(E208,'Tarif de base'!D:E,2,FALSE)*F208,\"\")","v":""},null,null,null,null,null,null,null,"non"]
[null,null,null,null,null,null,{"$f":"IFERROR(VLOOKUP(E209,'Tarif de base'!D:E,2,FALSE)*F209,\"\")","v":""},null,null,null,null,null,null,null,"non"]
[null,null,null,null,null,null,{"$f":"IFERROR(VLOOKUP(E210,'Tarif de base'!D:E,2,FALSE)*F210,\"\")","v":""},null,null,null,null,null,null,null,"non"]
[null,null,null,null,null,null,{"$f":"IFERROR(VLOOKUP(E211,'Tarif de base'!D:E,2,FALSE)*F211,\"\")","v":""},null,null,null,null,null,null,null,"non"]
[null,null,null,null,null,null,{"$f":"IFERROR(VLOOKUP(E212,'Tarif de base'!D:E,2,FALSE)*F212,\"\")","v":""},null,null,null,null,null,null,null,"non"]
[null,null,null,null,null,null,{"$f":"SUM(G207:G212)","v":0},null,null,null,null,null,null,null,"non"]
[null,null,null,null,null,null,{"$f":"IFERROR(VLOOKUP(E214,'Tarif de base'!D:E,2,FALSE)*F214,\"\")","v":""},null,null,null,{"$f":"IFERROR(IF(G220-H214-I214-J214<>0,\"Attention il manque \"&G220-H214-I214-J214&\"€\",\"Règlement OK\"),\"Pas de règlement\")","v":"Règlement OK"},null,"non",30,{"$f":"M214","v":"non"}]
[null,null,null,null,null,null,{"$f":"IFERROR(VLOOKUP(E215,'Tarif de base'!D:E,2,FALSE)*F215,\"\")","v":""},null,null,null,null,null,null,null,"non"]
[null,null,null,null,null,null,{"$f":"IFERROR(VLOOKUP(E216,'Tarif de base'!D:E,2,FALSE)*F216,\"\")","v":""},null,null,null,null,null,null,null,"non"]
[null,null,null,null,null,null,{"$f":"IFERROR(VLOOKUP(E217,'Tarif de base'!D:E,2,FALSE)*F217,\"\")","v":""},null,null,null,null,null,null,null,{"$f":"O216","v":"non"}]
[null,null,null,null,null,null,{"$f":"IFERROR(VLOOKUP(E218,'Tarif de base'!D:E,2,FALSE)*F218,\"\")","v":""},null,null,null,null,null,null,null,"non"]
[null,null,null,null,null,null,{"$f":"IFERROR(VLOOKUP(E219,'Tarif de base'!D:E,2,FALSE)*F219,\"\")","v":""},null,null,null,null,null,null,null,"non"]
[null,null,null,null,null,null,{"$f":"SUM(G214:G219)","v":0},null,null,null,null,null,null,null,"non"]
[null,null,null,null,null,null,{"$f":"IFERROR(VLOOKUP(E221,'Tarif de base'!D:E,2,FALSE)*F221,\"\")","v":""},null,null,null,{"$f":"IFERROR(IF(G227-H221-I221-J221<>0,\"Attention il manque \"&G227-H221-I221-J221&\"€\",\"Règlement OK\"),\"Pas de règlement\")","v":"Règlement OK"},null,"non",31,{"$f":"M221","v":"non"}]
[null,null,null,null,null,null,{"$f":"IFERROR(VLOOKUP(E222,'Tarif de base'!D:E,2,FALSE)*F222,\"\")","v":""},null,null,null,null,null,null,null,"non"]
[null,null,null,null,null,null,{"$f":"IFERROR(VLOOKUP(E223,'Tarif de base'!D:E,2,FALSE)*F223,\"\")","v":""},null,null,null,null,null,null,null,"non"]
[null,null,null,null,null,null,{"$f":"IFERROR(VLOOKUP(E224,'Tarif de base'!D:E,2,FALSE)*F224,\"\")","v":""},null,null,null,null,null,null,null,"non"]
[null,null,null,null,null,null,{"$f":"IFERROR(VLOOKUP(E225,'Tarif de base'!D:E,2,FALSE)*F225,\"\")","v":""},null,null,null,null,null,null,null,"non"]
[null,null,null,null,null,null,{"$f":"IFERROR(VLOOKUP(E226,'Tarif de base'!D:E,2,FALSE)*F226,\"\")","v":""},null,null,null,null,null,null,null,"non"]
[null,null,null,null,null,null,{"$f":"SUM(G221:G226)","v":0},null,null,null,null,null,null,null,"non"]
[null,null,null,null,null,null,{"$f":"IFERROR(VLOOKUP(E228,'Tarif de base'!D:E,2,FALSE)*F228,\"\")","v":""},null,null,null,{"$f":"IFERROR(IF(G234-H228-I228-J228<>0,\"Attention il manque \"&G234-H228-I228-J228&\"€\",\"Règlement OK\"),\"Pas de règlement\")","v":"Règlement OK"},null,"non",32,{"$f":"M228","v":"non"}]
[null,null,null,null,null,null,{"$f":"IFERROR(VLOOKUP(E229,'Tarif de base'!D:E,2,FALSE)*F229,\"\")","v":""},null,null,null,null,null,null,null,"non"]
[null,null,null,null,null,null,{"$f":"IFERROR(VLOOKUP(E230,'Tarif de base'!D:E,2,FALSE)*F230,\"\")","v":""},null,null,null,null,null,null,null,"non"]
[null,null,null,null,null,null,{"$f":"IFERROR(VLOOKUP(E231,'Tarif de base'!D:E,2,FALSE)*F231,\"\")","v":""},null,null,null,null,null,null,null,"non"]
[null,null,null,null,null,null,{"$f":"IFERROR(VLOOKUP(E232,'Tarif de base'!D:E,2,FALSE)*F232,\"\")","v":""},null,null,null,null,null,null,null,"non"]
[null,null,null,null,null,null,{"$f":"IFERROR(VLOOKUP(E233,'Tarif de base'!D:E,2,FALSE)*F233,\"\")","v":""},null,null,null,null,null,null,null,"non"]
[null,null,null,null,null,null,{"$f":"SUM(G228:G233)","v":0},null,null,null,null,null,null,null,"non"]
[null,null,null,null,null,null,{"$f":"IFERROR(VLOOKUP(E235,'Tarif de base'!D:E,2,FALSE)*F235,\"\")","v":""},null,null,null,{"$f":"IFERROR(IF(G241-H235-I235-J235<>0,\"Attention il manque \"&G241-H235-I235-J235&\"€\",\"Règlement OK\"),\"Pas de règlement\")","v":"Règlement OK"},null,"non",33,{"$f":"M235","v":"non"}]
[null,null,null,null,null,null,{"$f":"IFERROR(VLOOKUP(E236,'Tarif de base'!D:E,2,FALSE)*F236,\"\")","v":""},null,null,null,null,null,null,null,"non"]
[null,null,null,null,null,null,{"$f":"IFERROR(VLOOKUP(E237,'Tarif de base'!D:E,2,FALSE)*F237,\"\")","v":""},null,null,null,null,null,null,null,"non"]
[null,null,null,null,null,null,{"$f":"IFERROR(VLOOKUP(E238,'Tarif de base'!D:E,2,FALSE)*F238,\"\")","v":""},null,null,null,null,null,null,null,"non"]
[null,null,null,null,null,null,{"$f":"IFERROR(VLOOKUP(E239,'Tarif de base'!D:E,2,FALSE)*F239,\"\")","v":""},null,null,null,null,null,null,null,"non"]
[null,null,null,null,null,null,{"$f":"IFERROR(VLOOKUP(E240,'Tarif de base'!D:E,2,FALSE)*F240,\"\")","v":""},null,null,null,null,null,null,null,"non"]
[null,null,null,null,null,null,{"$f":"SUM(G235:G240)","v":0},null,null,null,null,null,null,null,"non"]
[null,null,null,null,null,null,{"$f":"IFERROR(VLOOKUP(E242,'Tarif de base'!D:E,2,FALSE)*F242,\"\")","v":""},null,null,null,{"$f":"IFERROR(IF(G248-H242-I242-J242<>0,\"Attention il manque \"&G248-H242-I242-J242&\"€\",\"Règlement OK\"),\"Pas de règlement\")","v":"Règlement OK"},null,"non",34,{"$f":"M242","v":"non"}]
[null,null,null,null,null,null,{"$f":"IFERROR(VLOOKUP(E243,'Tarif de base'!D:E,2,FALSE)*F243,\"\")","v":""},null,null,null,null,null,null,null,{"$f":"O242","v":"non"}]
[null,null,null,null,null,null,{"$f":"IFERROR(VLOOKUP(E244,'Tarif de base'!D:E,2,FALSE)*F244,\"\")","v":""},null,null,null,null,null,null,null,"non"]
[null,null,null,null,null,null,{"$f":"IFERROR(VLOOKUP(E245,'Tarif de base'!D:E,2,FALSE)*F245,\"\")","v":""},null,null,null,null,null,null,null,"non"]
[null,null,null,null,null,null,{"$f":"IFERROR(VLOOKUP(E246,'Tarif de base'!D:E,2,FALSE)*F246,\"\")","v":""},null,null,null,null,null,null,null,"non"]
[null,null,null,null,null,null,{"$f":"IFERROR(VLOOKUP(E247,'Tarif de base'!D:E,2,FALSE)*F247,\"\")","v":""},null,null,null,null,null,null,null,"non"]
[null,null,null,null,null,null,{"$f":"SUM(G242:G247)","v":0},null,null,null,null,null,null,null,"non"]
[null,null,null,null,null,null,{"$f":"IFERROR(VLOOKUP(E249,'Tarif de base'!D:E,2,FALSE)*F249,\"\")","v":""},null,null,null,{"$f":"IFERROR(IF(G255-H249-I249-J249<>0,\"Attention il manque \"&G255-H249-I249-J249&\"€\",\"Règlement OK\"),\"Pas de règlement\")","v":"Règlement OK"},null,"non",35,{"$f":"M249","v":"non"}]
[null,null,null,null,null,null,{"$f":"IFERROR(VLOOKUP(E250,'Tarif de base'!D:E,2,FALSE)*F250,\"\")","v":""},null,null,null,null,null,null,null,"non"]
[null,null,null,null,null,null,{"$f":"IFERROR(VLOOKUP(E251,'Tarif de base'!D:E,2,FALSE)*F251,\"\")","v":""},null,null,null,null,null,null,null,"non"]
[null,null,null,null,null,null,{"$f":"IFERROR(VLOOKUP(E252,'Tarif de base'!D:E,2,FALSE)*F252,\"\")","v":""},null,null,null,null,null,null,null,"non"]
[null,null,null,null,null,null,{"$f":"IFERROR(VLOOKUP(E253,'Tarif de base'!D:E,2,FALSE)*F253,\"\")","v":""},null,null,null,null,null,null,null,"non"]
[null,null,null,null,null,null,{"$f":"IFERROR(VLOOKUP(E254,'Tarif de base'!D:E,2,FALSE)*F254,\"\")","v":""},null,null,null,null,null,null,null,"non"]
[null,null,null,null,null,null,{"$f":"SUM(G249:G254)","v":0},null,null,null,null,null,null,null,"non"]
[null,null,null,null,null,null,{"$f":"IFERROR(VLOOKUP(E256,'Tarif de base'!D:E,2,FALSE)*F256,\"\")","v":""},null,null,null,{"$f":"IFERROR(IF(G262-H256-I256-J256<>0,\"Attention il manque \"&G262-H256-I256-J256&\"€\",\"Règlement OK\"),\"Pas de règlement\")","v":"Règlement OK"},null,"non",36,{"$f":"M256","v":"non"}]
[null,null,null,null,null,null,{"$f":"IFERROR(VLOOKUP(E257,'Tarif de base'!D:E,2,FALSE)*F257,\"\")","v":""},null,null,null,null,null,null,null,"non"]
[null,null,null,null,null,null,{"$f":"IFERROR(VLOOKUP(E258,'Tarif de base'!D:E,2,FALSE)*F258,\"\")","v":""},null,null,null,null,null,null,null,"non"]
[null,null,null,null,null,null,{"$f":"IFERROR(VLOOKUP(E259,'Tarif de base'!D:E,2,FALSE)*F259,\"\")","v":""},null,null,null,null,null,null,null,"non"]
[null,null,null,null,null,null,{"$f":"IFERROR(VLOOKUP(E260,'Tarif de base'!D:E,2,FALSE)*F260,\"\")","v":""},null,null,null,null,null,null,null,"non"]
[null,null,null,null,null,null,{"$f":"IFERROR(VLOOKUP(E261,'Tarif de base'!D:E,2,FALSE)*F261,\"\")","v":""},null,null,null,null,null,null,null,"non"]
[null,null,null,null,null,null,{"$f":"SUM(G256:G261)","v":0},null,null,null,null,null,null,null,"non"]
[null,null,null,null,null,null,{"$f":"IFERROR(VLOOKUP(E263,'Tarif de base'!D:E,2,FALSE)*F263,\"\")","v":""},null,null,null,{"$f":"IFERROR(IF(G269-H263-I263-J263<>0,\"Attention il manque \"&G269-H263-I263-J263&\"€\",\"Règlement OK\"),\"Pas de règlement\")","v":"Règlement OK"},null,"non",37,{"$f":"M263","v":"non"}]
[null,null,null,null,null,null,{"$f":"IFERROR(VLOOKUP(E264,'Tarif de base'!D:E,2,FALSE)*F264,\"\")","v":""},null,null,null,null,null,null,null,"non"]
[null,null,null,null,null,null,{"$f":"IFERROR(VLOOKUP(E265,'Tarif de base'!D:E,2,FALSE)*F265,\"\")","v":""},null,null,null,null,null,null,null,"non"]
[null,null,null,null,null,null,{"$f":"IFERROR(VLOOKUP(E266,'Tarif de base'!D:E,2,FALSE)*F266,\"\")","v":""},null,null,null,null,null,null,null,"non"]
[null,null,null,null,null,null,{"$f":"IFERROR(VLOOKUP(E267,'Tarif de base'!D:E,2,FALSE)*F267,\"\")","v":""},null,null,null,null,null,null,null,"non"]
[null,null,null,null,null,null,{"$f":"IFERROR(VLOOKUP(E268,'Tarif de base'!D:E,2,FALSE)*F268,\"\")","v":""},null,null,null,null,null,null,null,"non"]
[null,null,null,null,null,null,{"$f":"SUM(G263:G268)","v":0},null,null,null,null,null,null,null,"non"]
[null,null,null,null,null,null,{"$f":"IFERROR(VLOOKUP(E270,'Tarif de base'!D:E,2,FALSE)*F270,\"\")","v":""},null,null,null,{"$f":"IFERROR(IF(G276-H270-I270-J270<>0,\"Attention il manque \"&G276-H270-I270-J270&\"€\",\"Règlement OK\"),\"Pas de règlement\")","v":"Règlement OK"},null,"non",38,{"$f":"M270","v":"non"}]
[null,null,null,null,null,null,{"$f":"IFERROR(VLOOKUP(E271,'Tarif de base'!D:E,2,FALSE)*F271,\"\")","v":""},null,null,null,null,null,null,null,{"$f":"O270","v":"non"}]
[null,null,null,null,null,null,{"$f":"IFERROR(VLOOKUP(E272,'Tarif de base'!D:E,2,FALSE)*F272,\"\")","v":""},null,null,null,null,null,null,null,{"$f":"O271","v":"non"}]
[null,null,null,null,null,null,{"$f":"IFERROR(VLOOKUP(E273,'Tarif de base'!D:E,2,FALSE)*F273,\"\")","v":""},null,null,null,null,null,null,null,"non"]
[null,null,null,null,null,null,{"$f":"IFERROR(VLOOKUP(E274,'Tarif de base'!D:E,2,FALSE)*F274,\"\")","v":""},null,null,null,null,null,null,null,"non"]
[null,null,null,null,null,null,{"$f":"IFERROR(VLOOKUP(E275,'Tarif de base'!D:E,2,FALSE)*F275,\"\")","v":""},null,null,null,null,null,null,null,"non"]
[null,null,null,null,null,null,{"$f":"SUM(G270:G275)","v":0},null,null,null,null,null,null,null,"non"]
[null,null,null,null,null,null,{"$f":"IFERROR(VLOOKUP(E277,'Tarif de base'!D:E,2,FALSE)*F277,\"\")","v":""},null,null,null,{"$f":"IFERROR(IF(G283-H277-I277-J277<>0,\"Attention il manque \"&G283-H277-I277-J277&\"€\",\"Règlement OK\"),\"Pas de règlement\")","v":"Règlement OK"},null,"non",39,{"$f":"M277","v":"non"}]
[null,null,null,null,null,null,{"$f":"IFERROR(VLOOKUP(E278,'Tarif de base'!D:E,2,FALSE)*F278,\"\")","v":""},null,null,null,null,null,null,null,{"$f":"O277","v":"non"}]
[null,null,null,null,null,null,{"$f":"IFERROR(VLOOKUP(E279,'Tarif de base'!D:E,2,FALSE)*F279,\"\")","v":""},null,null,null,null,null,null,null,{"$f":"O278","v":"non"}]
[null,null,null,null,null,null,{"$f":"IFERROR(VLOOKUP(E280,'Tarif de base'!D:E,2,FALSE)*F280,\"\")","v":""},null,null,null,null,null,null,null,"non"]
[null,null,null,null,null,null,{"$f":"IFERROR(VLOOKUP(E281,'Tarif de base'!D:E,2,FALSE)*F281,\"\")","v":""},null,null,null,null,null,null,null,"non"]
[null,null,null,null,null,null,{"$f":"IFERROR(VLOOKUP(E282,'Tarif de base'!D:E,2,FALSE)*F282,\"\")","v":""},null,null,null,null,null,null,null,"non"]
[null,null,null,null,null,null,{"$f":"SUM(G277:G282)","v":0},null,null,null,null,null,null,null,"non"]
[null,null,null,null,null,null,{"$f":"IFERROR(VLOOKUP(E284,'Tarif de base'!D:E,2,FALSE)*F284,\"\")","v":""},null,null,null,{"$f":"IFERROR(IF(G290-H284-I284-J284<>0,\"Attention il manque \"&G290-H284-I284-J284&\"€\",\"Règlement OK\"),\"Pas de règlement\")","v":"Règlement OK"},null,"non",40,{"$f":"M284","v":"non"}]
[null,null,null,null,null,null,{"$f":"IFERROR(VLOOKUP(E285,'Tarif de base'!D:E,2,FALSE)*F285,\"\")","v":""},null,null,null,null,null,null,null,"non"]
[null,null,null,null,null,null,{"$f":"IFERROR(VLOOKUP(E286,'Tarif de base'!D:E,2,FALSE)*F286,\"\")","v":""},null,null,null,null,null,null,null,"non"]
[null,null,null,null,null,null,{"$f":"IFERROR(VLOOKUP(E287,'Tarif de base'!D:E,2,FALSE)*F287,\"\")","v":""},null,null,null,null,null,null,null,"non"]
[null,null,null,null,null,null,{"$f":"IFERROR(VLOOKUP(E288,'Tarif de base'!D:E,2,FALSE)*F288,\"\")","v":""},null,null,null,null,null,null,null,"non"]
[null,null,null,null,null,null,{"$f":"IFERROR(VLOOKUP(E289,'Tarif de base'!D:E,2,FALSE)*F289,\"\")","v":""},null,null,null,null,null,null,null,"non"]
[null,null,null,null,null,null,{"$f":"SUM(G284:G289)","v":0},null,null,null,null,null,null,null,"non"]
[null,null,null,null,null,null,{"$f":"IFERROR(VLOOKUP(E291,'Tarif de base'!D:E,2,FALSE)*F291,\"\")","v":""},null,null,null,{"$f":"IFERROR(IF(G297-H291-I291-J291<>0,\"Attention il manque \"&G297-H291-I291-J291&\"€\",\"Règlement OK\"),\"Pas de règlement\")","v":"Règlement OK"},null,"non",41,{"$f":"M291","v":"non"}]
[null,null,null,null,null,null,{"$f":"IFERROR(VLOOKUP(E292,'Tarif de base'!D:E,2,FALSE)*F292,\"\")","v":""},null,null,null,null,null,null,null,"non"]
[null,null,null,null,null,null,{"$f":"IFERROR(VLOOKUP(E293,'Tarif de base'!D:E,2,FALSE)*F293,\"\")","v":""},null,null,null,null,null,null,null,"non"]
[null,null,null,null,null,null,{"$f":"IFERROR(VLOOKUP(E294,'Tarif de base'!D:E,2,FALSE)*F294,\"\")","v":""},null,null,null,null,null,null,null,"non"]
[null,null,null,null,null,null,{"$f":"IFERROR(VLOOKUP(E295,'Tarif de base'!D:E,2,FALSE)*F295,\"\")","v":""},null,null,null,null,null,null,null,"non"]
[null,null,null,null,null,null,{"$f":"IFERROR(VLOOKUP(E296,'Tarif de base'!D:E,2,FALSE)*F296,\"\")","v":""},null,null,null,null,null,null,null,"non"]
[null,null,null,null,null,null,{"$f":"SUM(G291:G296)","v":0},null,null,null,null,null,null,null,"non"]
[null,null,null,null,null,null,{"$f":"IFERROR(VLOOKUP(E298,'Tarif de base'!D:E,2,FALSE)*F298,\"\")","v":""},null,null,null,{"$f":"IFERROR(IF(G304-H298-I298-J298<>0,\"Attention il manque \"&G304-H298-I298-J298&\"€\",\"Règlement OK\"),\"Pas de règlement\")","v":"Règlement OK"},null,"non",42,{"$f":"M298","v":"non"}]
[null,null,null,null,null,null,{"$f":"IFERROR(VLOOKUP(E299,'Tarif de base'!D:E,2,FALSE)*F299,\"\")","v":""},null,null,null,null,null,null,null,"non"]
[null,null,null,null,null,null,{"$f":"IFERROR(VLOOKUP(E300,'Tarif de base'!D:E,2,FALSE)*F300,\"\")","v":""},null,null,null,null,null,null,null,"non"]
[null,null,null,null,null,null,{"$f":"IFERROR(VLOOKUP(E301,'Tarif de base'!D:E,2,FALSE)*F301,\"\")","v":""},null,null,null,null,null,null,null,"non"]
[null,null,null,null,null,null,{"$f":"IFERROR(VLOOKUP(E302,'Tarif de base'!D:E,2,FALSE)*F302,\"\")","v":""},null,null,null,null,null,null,null,"non"]
[null,null,null,null,null,null,{"$f":"IFERROR(VLOOKUP(E303,'Tarif de base'!D:E,2,FALSE)*F303,\"\")","v":""},null,null,null,null,null,null,null,"non"]
[null,null,null,null,null,null,{"$f":"SUM(G298:G303)","v":0},null,null,null,null,null,null,null,"non"]
[null,null,null,null,null,null,{"$f":"IFERROR(VLOOKUP(E305,'Tarif de base'!D:E,2,FALSE)*F305,\"\")","v":""},null,null,null,{"$f":"IFERROR(IF(G311-H305-I305-J305<>0,\"Attention il manque \"&G311-H305-I305-J305&\"€\",\"Règlement OK\"),\"Pas de règlement\")","v":"Règlement OK"},null,"non",43,{"$f":"M305","v":"non"}]
[null,null,null,null,null,null,{"$f":"IFERROR(VLOOKUP(E306,'Tarif de base'!D:E,2,FALSE)*F306,\"\")","v":""},null,null,null,null,null,null,null,"non"]
[null,null,null,null,null,null,{"$f":"IFERROR(VLOOKUP(E307,'Tarif de base'!D:E,2,FALSE)*F307,\"\")","v":""},null,null,null,null,null,null,null,"non"]
[null,null,null,null,null,null,{"$f":"IFERROR(VLOOKUP(E308,'Tarif de base'!D:E,2,FALSE)*F308,\"\")","v":""},null,null,null,null,null,null,null,"non"]
[null,null,null,null,null,null,{"$f":"IFERROR(VLOOKUP(E309,'Tarif de base'!D:E,2,FALSE)*F309,\"\")","v":""},null,null,null,null,null,null,null,"non"]
[null,null,null,null,null,null,{"$f":"IFERROR(VLOOKUP(E310,'Tarif de base'!D:E,2,FALSE)*F310,\"\")","v":""},null,null,null,null,null,null,null,"non"]
[null,null,null,null,null,null,{"$f":"SUM(G305:G310)","v":0},null,null,null,null,null,null,null,"non"]
[null,null,null,null,null,null,{"$f":"IFERROR(VLOOKUP(E312,'Tarif de base'!D:E,2,FALSE)*F312,\"\")","v":""},null,null,null,{"$f":"IFERROR(IF(G318-H312-I312-J312<>0,\"Attention il manque \"&G318-H312-I312-J312&\"€\",\"Règlement OK\"),\"Pas de règlement\")","v":"Règlement OK"},null,"non",44,{"$f":"M312","v":"non"}]
[null,null,null,null,null,null,{"$f":"IFERROR(VLOOKUP(E313,'Tarif de base'!D:E,2,FALSE)*F313,\"\")","v":""},null,null,null,null,null,null,null,"non"]
[null,null,null,null,null,null,{"$f":"IFERROR(VLOOKUP(E314,'Tarif de base'!D:E,2,FALSE)*F314,\"\")","v":""},null,null,null,null,null,null,null,"non"]
[null,null,null,null,null,null,{"$f":"IFERROR(VLOOKUP(E315,'Tarif de base'!D:E,2,FALSE)*F315,\"\")","v":""},null,null,null,null,null,null,null,"non"]
[null,null,null,null,null,null,{"$f":"IFERROR(VLOOKUP(E316,'Tarif de base'!D:E,2,FALSE)*F316,\"\")","v":""},null,null,null,null,null,null,null,"non"]
[null,null,null,null,null,null,{"$f":"IFERROR(VLOOKUP(E317,'Tarif de base'!D:E,2,FALSE)*F317,\"\")","v":""},null,null,null,null,null,null,null,"non"]
[null,null,null,null,null,null,{"$f":"SUM(G312:G317)","v":0},null,null,null,null,null,null,null,"non"]
[null,null,null,null,null,null,{"$f":"IFERROR(VLOOKUP(E319,'Tarif de base'!D:E,2,FALSE)*F319,\"\")","v":""},null,null,null,{"$f":"IFERROR(IF(G325-H319-I319-J319<>0,\"Attention il manque \"&G325-H319-I319-J319&\"€\",\"Règlement OK\"),\"Pas de règlement\")","v":"Règlement OK"},null,"non",45,{"$f":"M319","v":"non"}]
[null,null,null,null,null,null,{"$f":"IFERROR(VLOOKUP(E320,'Tarif de base'!D:E,2,FALSE)*F320,\"\")","v":""},null,null,null,null,null,null,null,"non"]
[null,null,null,null,null,null,{"$f":"IFERROR(VLOOKUP(E321,'Tarif de base'!D:E,2,FALSE)*F321,\"\")","v":""},null,null,null,null,null,null,null,"non"]
[null,null,null,null,null,null,{"$f":"IFERROR(VLOOKUP(E322,'Tarif de base'!D:E,2,FALSE)*F322,\"\")","v":""},null,null,null,null,null,null,null,"non"]
[null,null,null,null,null,null,{"$f":"IFERROR(VLOOKUP(E323,'Tarif de base'!D:E,2,FALSE)*F323,\"\")","v":""},null,null,null,null,null,null,null,"non"]
[null,null,null,null,null,null,{"$f":"IFERROR(VLOOKUP(E324,'Tarif de base'!D:E,2,FALSE)*F324,\"\")","v":""},null,null,null,null,null,null,null,"non"]
[null,null,null,null,null,null,{"$f":"SUM(G319:G324)","v":0},null,null,null,null,null,null,null,"non"]
[null,null,null,null,null,null,{"$f":"IFERROR(VLOOKUP(E326,'Tarif de base'!D:E,2,FALSE)*F326,\"\")","v":""},null,null,null,{"$f":"IFERROR(IF(G332-H326-I326-J326<>0,\"Attention il manque \"&G332-H326-I326-J326&\"€\",\"Règlement OK\"),\"Pas de règlement\")","v":"Règlement OK"},null,"non",46,{"$f":"M326","v":"non"}]
[null,null,null,null,null,null,{"$f":"IFERROR(VLOOKUP(E327,'Tarif de base'!D:E,2,FALSE)*F327,\"\")","v":""},null,null,null,null,null,null,null,"non"]
[null,null,null,null,null,null,{"$f":"IFERROR(VLOOKUP(E328,'Tarif de base'!D:E,2,FALSE)*F328,\"\")","v":""},null,null,null,null,null,null,null,"non"]
[null,null,null,null,null,null,{"$f":"IFERROR(VLOOKUP(E329,'Tarif de base'!D:E,2,FALSE)*F329,\"\")","v":""},null,null,null,null,null,null,null,"non"]
[null,null,null,null,null,null,{"$f":"IFERROR(VLOOKUP(E330,'Tarif de base'!D:E,2,FALSE)*F330,\"\")","v":""},null,null,null,null,null,null,null,"non"]
[null,null,null,null,null,null,{"$f":"IFERROR(VLOOKUP(E331,'Tarif de base'!D:E,2,FALSE)*F331,\"\")","v":""},null,null,null,null,null,null,null,"non"]
[null,null,null,null,null,null,{"$f":"SUM(G326:G331)","v":0},null,null,null,null,null,null,null,"non"]
[null,null,null,null,null,null,{"$f":"IFERROR(VLOOKUP(E333,'Tarif de base'!D:E,2,FALSE)*F333,\"\")","v":""},null,null,null,{"$f":"IFERROR(IF(G339-H333-I333-J333<>0,\"Attention il manque \"&G339-H333-I333-J333&\"€\",\"Règlement OK\"),\"Pas de règlement\")","v":"Règlement OK"},null,"non",47,{"$f":"M333","v":"non"}]
[null,null,null,null,null,null,{"$f":"IFERROR(VLOOKUP(E334,'Tarif de base'!D:E,2,FALSE)*F334,\"\")","v":""},null,null,null,null,null,null,null,"non"]
[null,null,null,null,null,null,{"$f":"IFERROR(VLOOKUP(E335,'Tarif de base'!D:E,2,FALSE)*F335,\"\")","v":""},null,null,null,null,null,null,null,"non"]
[null,null,null,null,null,null,{"$f":"IFERROR(VLOOKUP(E336,'Tarif de base'!D:E,2,FALSE)*F336,\"\")","v":""},null,null,null,null,null,null,null,"non"]
[null,null,null,null,null,null,{"$f":"IFERROR(VLOOKUP(E337,'Tarif de base'!D:E,2,FALSE)*F337,\"\")","v":""},null,null,null,null,null,null,null,"non"]
[null,null,null,null,null,null,{"$f":"IFERROR(VLOOKUP(E338,'Tarif de base'!D:E,2,FALSE)*F338,\"\")","v":""},null,null,null,null,null,null,null,"non"]
[null,null,null,null,null,null,{"$f":"SUM(G333:G338)","v":0},null,null,null,null,null,null,null,"non"]
[null,null,null,null,null,null,{"$f":"IFERROR(VLOOKUP(E340,'Tarif de base'!D:E,2,FALSE)*F340,\"\")","v":""},null,null,null,{"$f":"IFERROR(IF(G346-H340-I340-J340<>0,\"Attention il manque \"&G346-H340-I340-J340&\"€\",\"Règlement OK\"),\"Pas de règlement\")","v":"Règlement OK"},null,"non",48,{"$f":"M340","v":"non"}]
[null,null,null,null,null,null,{"$f":"IFERROR(VLOOKUP(E341,'Tarif de base'!D:E,2,FALSE)*F341,\"\")","v":""},null,null,null,null,null,null,null,"non"]
[null,null,null,null,null,null,{"$f":"IFERROR(VLOOKUP(E342,'Tarif de base'!D:E,2,FALSE)*F342,\"\")","v":""},null,null,null,null,null,null,null,"non"]
[null,null,null,null,null,null,{"$f":"IFERROR(VLOOKUP(E343,'Tarif de base'!D:E,2,FALSE)*F343,\"\")","v":""},null,null,null,null,null,null,null,{"$f":"O342","v":"non"}]
[null,null,null,null,null,null,{"$f":"IFERROR(VLOOKUP(E344,'Tarif de base'!D:E,2,FALSE)*F344,\"\")","v":""},null,null,null,null,null,null,null,"non"]
[null,null,null,null,null,null,{"$f":"IFERROR(VLOOKUP(E345,'Tarif de base'!D:E,2,FALSE)*F345,\"\")","v":""},null,null,null,null,null,null,null,"non"]
[null,null,null,null,null,null,{"$f":"SUM(G340:G345)","v":0},null,null,null,null,null,null,null,"non"]
[null,null,null,null,null,null,{"$f":"IFERROR(VLOOKUP(E347,'Tarif de base'!D:E,2,FALSE)*F347,\"\")","v":""},null,null,null,{"$f":"IFERROR(IF(G353-H347-I347-J347<>0,\"Attention il manque \"&G353-H347-I347-J347&\"€\",\"Règlement OK\"),\"Pas de règlement\")","v":"Règlement OK"},null,"non",49,{"$f":"M347","v":"non"}]
[null,null,null,null,null,null,{"$f":"IFERROR(VLOOKUP(E348,'Tarif de base'!D:E,2,FALSE)*F348,\"\")","v":""},null,null,null,null,null,null,null,"non"]
[null,null,null,null,null,null,{"$f":"IFERROR(VLOOKUP(E349,'Tarif de base'!D:E,2,FALSE)*F349,\"\")","v":""},null,null,null,null,null,null,null,"non"]
[null,null,null,null,null,null,{"$f":"IFERROR(VLOOKUP(E350,'Tarif de base'!D:E,2,FALSE)*F350,\"\")","v":""},null,null,null,null,null,null,null,"non"]
[null,null,null,null,null,null,{"$f":"IFERROR(VLOOKUP(E351,'Tarif de base'!D:E,2,FALSE)*F351,\"\")","v":""},null,null,null,null,null,null,null,"non"]
[null,null,null,null,null,null,{"$f":"IFERROR(VLOOKUP(E352,'Tarif de base'!D:E,2,FALSE)*F352,\"\")","v":""},null,null,null,null,null,null,null,"non"]
[null,null,null,null,null,null,{"$f":"SUM(G347:G352)","v":0},null,null,null,null,null,null,null,"non"]
[null,null,null,null,null,null,{"$f":"IFERROR(VLOOKUP(E354,'Tarif de base'!D:E,2,FALSE)*F354,\"\")","v":""},null,null,null,{"$f":"IFERROR(IF(G360-H354-I354-J354<>0,\"Attention il manque \"&G360-H354-I354-J354&\"€\",\"Règlement OK\"),\"Pas de règlement\")","v":"Règlement OK"},null,"non",50,{"$f":"M354","v":"non"}]
[null,null,null,null,null,null,{"$f":"IFERROR(VLOOKUP(E355,'Tarif de base'!D:E,2,FALSE)*F355,\"\")","v":""},null,null,null,null,null,null,null,"non"]
[null,null,null,null,null,null,{"$f":"IFERROR(VLOOKUP(E356,'Tarif de base'!D:E,2,FALSE)*F356,\"\")","v":""},null,null,null,null,null,null,null,"non"]
[null,null,null,null,null,null,{"$f":"IFERROR(VLOOKUP(E357,'Tarif de base'!D:E,2,FALSE)*F357,\"\")","v":""},null,null,null,null,null,null,null,"non"]
[null,null,null,null,null,null,{"$f":"IFERROR(VLOOKUP(E358,'Tarif de base'!D:E,2,FALSE)*F358,\"\")","v":""},null,null,null,null,null,null,null,"non"]
[null,null,null,null,null,null,{"$f":"IFERROR(VLOOKUP(E359,'Tarif de base'!D:E,2,FALSE)*F359,\"\")","v":""},null,null,null,null,null,null,null,"non"]
[null,null,null,null,null,null,{"$f":"SUM(G354:G359)","v":0},null,null,null,null,null,null,null,"non"]
[null,null,null,null,null,null,{"$f":"IFERROR(VLOOKUP(E361,'Tarif de base'!D:E,2,FALSE)*F361,\"\")","v":""},null,null,null,{"$f":"IFERROR(IF(G367-H361-I361-J361<>0,\"Attention il manque \"&G367-H361-I361-J361&\"€\",\"Règlement OK\"),\"Pas de règlement\")","v":"Règlement OK"},null,"non",51,{"$f":"M361","v":"non"}]
[null,null,null,null,null,null,{"$f":"IFERROR(VLOOKUP(E362,'Tarif de base'!D:E,2,FALSE)*F362,\"\")","v":""},null,null,null,null,null,null,null,"non"]
[null,null,null,null,null,null,{"$f":"IFERROR(VLOOKUP(E363,'Tarif de base'!D:E,2,FALSE)*F363,\"\")","v":""},null,null,null,null,null,null,null,"non"]
[null,null,null,null,null,null,{"$f":"IFERROR(VLOOKUP(E364,'Tarif de base'!D:E,2,FALSE)*F364,\"\")","v":""},null,null,null,null,null,null,null,"non"]
[null,null,null,null,null,null,{"$f":"IFERROR(VLOOKUP(E365,'Tarif de base'!D:E,2,FALSE)*F365,\"\")","v":""},null,null,null,null,null,null,null,"non"]
[null,null,null,null,null,null,{"$f":"IFERROR(VLOOKUP(E366,'Tarif de base'!D:E,2,FALSE)*F366,\"\")","v":""},null,null,null,null,null,null,null,"non"]
[null,null,null,null,null,null,{"$f":"SUM(G361:G366)","v":0},null,null,null,null,null,null,null,"non"]
[null,null,null,null,null,null,{"$f":"IFERROR(VLOOKUP(E368,'Tarif de base'!D:E,2,FALSE)*F368,\"\")","v":""},null,null,null,{"$f":"IFERROR(IF(G374-H368-I368-J368<>0,\"Attention il manque \"&G374-H368-I368-J368&\"€\",\"Règlement OK\"),\"Pas de règlement\")","v":"Règlement OK"},null,"non",52,{"$f":"M368","v":"non"}]
[null,null,null,null,null,null,{"$f":"IFERROR(VLOOKUP(E369,'Tarif de base'!D:E,2,FALSE)*F369,\"\")","v":""},null,null,null,null,null,null,null,{"$f":"O368","v":"non"}]
[null,null,null,null,null,null,{"$f":"IFERROR(VLOOKUP(E370,'Tarif de base'!D:E,2,FALSE)*F370,\"\")","v":""},null,null,null,null,null,null,null,"non"]
[null,null,null,null,null,null,{"$f":"IFERROR(VLOOKUP(E371,'Tarif de base'!D:E,2,FALSE)*F371,\"\")","v":""},null,null,null,null,null,null,null,"non"]
[null,null,null,null,null,null,{"$f":"IFERROR(VLOOKUP(E372,'Tarif de base'!D:E,2,FALSE)*F372,\"\")","v":""},null,null,null,null,null,null,null,"non"]
[null,null,null,null,null,null,{"$f":"IFERROR(VLOOKUP(E373,'Tarif de base'!D:E,2,FALSE)*F373,\"\")","v":""},null,null,null,null,null,null,null,"non"]
[null,null,null,null,null,null,{"$f":"SUM(G368:G373)","v":0},null,null,null,null,null,null,null,"non"]
[null,null,null,null,null,null,{"$f":"IFERROR(VLOOKUP(E375,'Tarif de base'!D:E,2,FALSE)*F375,\"\")","v":""},null,null,null,{"$f":"IFERROR(IF(G381-H375-I375-J375<>0,\"Attention il manque \"&G381-H375-I375-J375&\"€\",\"Règlement OK\"),\"Pas de règlement\")","v":"Règlement OK"},null,"non",53,{"$f":"M375","v":"non"}]
[null,null,null,null,null,null,{"$f":"IFERROR(VLOOKUP(E376,'Tarif de base'!D:E,2,FALSE)*F376,\"\")","v":""},null,null,null,null,null,null,null,"non"]
[null,null,null,null,null,null,{"$f":"IFERROR(VLOOKUP(E377,'Tarif de base'!D:E,2,FALSE)*F377,\"\")","v":""},null,null,null,null,null,null,null,"non"]
[null,null,null,null,null,null,{"$f":"IFERROR(VLOOKUP(E378,'Tarif de base'!D:E,2,FALSE)*F378,\"\")","v":""},null,null,null,null,null,null,null,"non"]
[null,null,null,null,null,null,{"$f":"IFERROR(VLOOKUP(E379,'Tarif de base'!D:E,2,FALSE)*F379,\"\")","v":""},null,null,null,null,null,null,null,"non"]
[null,null,null,null,null,null,{"$f":"IFERROR(VLOOKUP(E380,'Tarif de base'!D:E,2,FALSE)*F380,\"\")","v":""},null,null,null,null,null,null,null,"non"]
[null,null,null,null,null,null,{"$f":"SUM(G375:G380)","v":0},null,null,null,null,null,null,null,"non"]
[null,null,null,null,null,null,{"$f":"IFERROR(VLOOKUP(E382,'Tarif de base'!D:E,2,FALSE)*F382,\"\")","v":""},null,null,null,{"$f":"IFERROR(IF(G388-H382-I382-J382<>0,\"Attention il manque \"&G388-H382-I382-J382&\"€\",\"Règlement OK\"),\"Pas de règlement\")","v":"Règlement OK"},null,"non",54,{"$f":"M382","v":"non"}]
[null,null,null,null,null,null,{"$f":"IFERROR(VLOOKUP(E383,'Tarif de base'!D:E,2,FALSE)*F383,\"\")","v":""},null,null,null,null,null,null,null,"non"]
[null,null,null,null,null,null,{"$f":"IFERROR(VLOOKUP(E384,'Tarif de base'!D:E,2,FALSE)*F384,\"\")","v":""},null,null,null,null,null,null,null,"non"]
[null,null,null,null,null,null,{"$f":"IFERROR(VLOOKUP(E385,'Tarif de base'!D:E,2,FALSE)*F385,\"\")","v":""},null,null,null,null,null,null,null,"non"]
[null,null,null,null,null,null,{"$f":"IFERROR(VLOOKUP(E386,'Tarif de base'!D:E,2,FALSE)*F386,\"\")","v":""},null,null,null,null,null,null,null,"non"]
[null,null,null,null,null,null,{"$f":"IFERROR(VLOOKUP(E387,'Tarif de base'!D:E,2,FALSE)*F387,\"\")","v":""},null,null,null,null,null,null,null,"non"]
[null,null,null,null,null,null,{"$f":"SUM(G382:G387)","v":0},null,null,null,null,null,null,null,"non"]
[null,null,null,null,null,null,{"$f":"IFERROR(VLOOKUP(E389,'Tarif de base'!D:E,2,FALSE)*F389,\"\")","v":""},null,null,null,{"$f":"IFERROR(IF(G395-H389-I389-J389<>0,\"Attention il manque \"&G395-H389-I389-J389&\"€\",\"Règlement OK\"),\"Pas de règlement\")","v":"Règlement OK"},null,"non",55,{"$f":"M389","v":"non"}]
[null,null,null,null,null,null,{"$f":"IFERROR(VLOOKUP(E390,'Tarif de base'!D:E,2,FALSE)*F390,\"\")","v":""},null,null,null,null,null,null,null,"non"]
[null,null,null,null,null,null,{"$f":"IFERROR(VLOOKUP(E391,'Tarif de base'!D:E,2,FALSE)*F391,\"\")","v":""},null,null,null,null,null,null,null,"non"]
[null,null,null,null,null,null,{"$f":"IFERROR(VLOOKUP(E392,'Tarif de base'!D:E,2,FALSE)*F392,\"\")","v":""},null,null,null,null,null,null,null,"non"]
[null,null,null,null,null,null,{"$f":"IFERROR(VLOOKUP(E393,'Tarif de base'!D:E,2,FALSE)*F393,\"\")","v":""},null,null,null,null,null,null,null,"non"]
[null,null,null,null,null,null,{"$f":"IFERROR(VLOOKUP(E394,'Tarif de base'!D:E,2,FALSE)*F394,\"\")","v":""},null,null,null,null,null,null,null,"non"]
[null,null,null,null,null,null,{"$f":"SUM(G389:G394)","v":0},null,null,null,null,null,null,null,"non"]
[null,null,null,null,null,null,{"$f":"IFERROR(VLOOKUP(E396,'Tarif de base'!D:E,2,FALSE)*F396,\"\")","v":""},null,null,null,{"$f":"IFERROR(IF(G402-H396-I396-J396<>0,\"Attention il manque \"&G402-H396-I396-J396&\"€\",\"Règlement OK\"),\"Pas de règlement\")","v":"Règlement OK"},null,"non",56,{"$f":"M396","v":"non"}]
[null,null,null,null,null,null,{"$f":"IFERROR(VLOOKUP(E397,'Tarif de base'!D:E,2,FALSE)*F397,\"\")","v":""},null,null,null,null,null,null,null,{"$f":"O396","v":"non"}]
[null,null,null,null,null,null,{"$f":"IFERROR(VLOOKUP(E398,'Tarif de base'!D:E,2,FALSE)*F398,\"\")","v":""},null,null,null,null,null,null,null,{"$f":"O397","v":"non"}]
[null,null,null,null,null,null,{"$f":"IFERROR(VLOOKUP(E399,'Tarif de base'!D:E,2,FALSE)*F399,\"\")","v":""},null,null,null,null,null,null,null,"non"]
[null,null,null,null,null,null,{"$f":"IFERROR(VLOOKUP(E400,'Tarif de base'!D:E,2,FALSE)*F400,\"\")","v":""},null,null,null,null,null,null,null,"non"]
[null,null,null,null,null,null,{"$f":"IFERROR(VLOOKUP(E401,'Tarif de base'!D:E,2,FALSE)*F401,\"\")","v":""},null,null,null,null,null,null,null,"non"]
[null,null,null,null,null,null,{"$f":"SUM(G396:G401)","v":0},null,null,null,null,null,null,null,"non"]
[null,null,null,null,null,null,{"$f":"IFERROR(VLOOKUP(E403,'Tarif de base'!D:E,2,FALSE)*F403,\"\")","v":""},null,null,null,{"$f":"IFERROR(IF(G409-H403-I403-J403<>0,\"Attention il manque \"&G409-H403-I403-J403&\"€\",\"Règlement OK\"),\"Pas de règlement\")","v":"Règlement OK"},null,"non",57,{"$f":"M403","v":"non"}]
[null,null,null,null,null,null,{"$f":"IFERROR(VLOOKUP(E404,'Tarif de base'!D:E,2,FALSE)*F404,\"\")","v":""},null,null,null,null,null,null,null,{"$f":"O403","v":"non"}]
[null,null,null,null,null,null,{"$f":"IFERROR(VLOOKUP(E405,'Tarif de base'!D:E,2,FALSE)*F405,\"\")","v":""},null,null,null,null,null,null,null,{"$f":"O404","v":"non"}]
[null,null,null,null,null,null,{"$f":"IFERROR(VLOOKUP(E406,'Tarif de base'!D:E,2,FALSE)*F406,\"\")","v":""},null,null,null,null,null,null,null,"non"]
[null,null,null,null,null,null,{"$f":"IFERROR(VLOOKUP(E407,'Tarif de base'!D:E,2,FALSE)*F407,\"\")","v":""},null,null,null,null,null,null,null,"non"]
[null,null,null,null,null,null,{"$f":"IFERROR(VLOOKUP(E408,'Tarif de base'!D:E,2,FALSE)*F408,\"\")","v":""},null,null,null,null,null,null,null,"non"]
[null,null,null,null,null,null,{"$f":"SUM(G403:G408)","v":0},null,null,null,null,null,null,null,"non"]
[null,null,null,null,null,null,{"$f":"IFERROR(VLOOKUP(E410,'Tarif de base'!D:E,2,FALSE)*F410,\"\")","v":""},null,null,null,{"$f":"IFERROR(IF(G416-H410-I410-J410<>0,\"Attention il manque \"&G416-H410-I410-J410&\"€\",\"Règlement OK\"),\"Pas de règlement\")","v":"Règlement OK"},null,"non",58,{"$f":"M410","v":"non"}]
[null,null,null,null,null,null,{"$f":"IFERROR(VLOOKUP(E411,'Tarif de base'!D:E,2,FALSE)*F411,\"\")","v":""},null,null,null,null,null,null,null,"non"]
[null,null,null,null,null,null,{"$f":"IFERROR(VLOOKUP(E412,'Tarif de base'!D:E,2,FALSE)*F412,\"\")","v":""},null,null,null,null,null,null,null,"non"]
[null,null,null,null,null,null,{"$f":"IFERROR(VLOOKUP(E413,'Tarif de base'!D:E,2,FALSE)*F413,\"\")","v":""},null,null,null,null,null,null,null,"non"]
[null,null,null,null,null,null,{"$f":"IFERROR(VLOOKUP(E414,'Tarif de base'!D:E,2,FALSE)*F414,\"\")","v":""},null,null,null,null,null,null,null,"non"]
[null,null,null,null,null,null,{"$f":"IFERROR(VLOOKUP(E415,'Tarif de base'!D:E,2,FALSE)*F415,\"\")","v":""},null,null,null,null,null,null,null,"non"]
[null,null,null,null,null,null,{"$f":"SUM(G410:G415)","v":0},null,null,null,null,null,null,null,"non"]
[null,null,null,null,null,null,{"$f":"IFERROR(VLOOKUP(E417,'Tarif de base'!D:E,2,FALSE)*F417,\"\")","v":""},null,null,null,{"$f":"IFERROR(IF(G423-H417-I417-J417<>0,\"Attention il manque \"&G423-H417-I417-J417&\"€\",\"Règlement OK\"),\"Pas de règlement\")","v":"Règlement OK"},null,"non",59,{"$f":"M417","v":"non"}]
[null,null,null,null,null,null,{"$f":"IFERROR(VLOOKUP(E418,'Tarif de base'!D:E,2,FALSE)*F418,\"\")","v":""},null,null,null,null,null,null,null,"non"]
[null,null,null,null,null,null,{"$f":"IFERROR(VLOOKUP(E419,'Tarif de base'!D:E,2,FALSE)*F419,\"\")","v":""},null,null,null,null,null,null,null,"non"]
[null,null,null,null,null,null,{"$f":"IFERROR(VLOOKUP(E420,'Tarif de base'!D:E,2,FALSE)*F420,\"\")","v":""},null,null,null,null,null,null,null,"non"]
[null,null,null,null,null,null,{"$f":"IFERROR(VLOOKUP(E421,'Tarif de base'!D:E,2,FALSE)*F421,\"\")","v":""},null,null,null,null,null,null,null,"non"]
[null,null,null,null,null,null,{"$f":"IFERROR(VLOOKUP(E422,'Tarif de base'!D:E,2,FALSE)*F422,\"\")","v":""},null,null,null,null,null,null,null,"non"]
[null,null,null,null,null,null,{"$f":"SUM(G417:G422)","v":0},null,null,null,null,null,null,null,"non"]
[null,null,null,null,null,null,{"$f":"IFERROR(VLOOKUP(E424,'Tarif de base'!D:E,2,FALSE)*F424,\"\")","v":""},null,null,null,{"$f":"IFERROR(IF(G430-H424-I424-J424<>0,\"Attention il manque \"&G430-H424-I424-J424&\"€\",\"Règlement OK\"),\"Pas de règlement\")","v":"Règlement OK"},null,"non",60,{"$f":"M424","v":"non"}]
[null,null,null,null,null,null,{"$f":"IFERROR(VLOOKUP(E425,'Tarif de base'!D:E,2,FALSE)*F425,\"\")","v":""},null,null,null,null,null,null,null,"non"]
[null,null,null,null,null,null,{"$f":"IFERROR(VLOOKUP(E426,'Tarif de base'!D:E,2,FALSE)*F426,\"\")","v":""},null,null,null,null,null,null,null,"non"]
[null,null,null,null,null,null,{"$f":"IFERROR(VLOOKUP(E427,'Tarif de base'!D:E,2,FALSE)*F427,\"\")","v":""},null,null,null,null,null,null,null,"non"]
[null,null,null,null,null,null,{"$f":"IFERROR(VLOOKUP(E428,'Tarif de base'!D:E,2,FALSE)*F428,\"\")","v":""},null,null,null,null,null,null,null,"non"]
[null,null,null,null,null,null,{"$f":"IFERROR(VLOOKUP(E429,'Tarif de base'!D:E,2,FALSE)*F429,\"\")","v":""},null,null,null,null,null,null,null,"non"]
[null,null,null,null,null,null,{"$f":"SUM(G424:G429)","v":0},null,null,null,null,null,null,null,"non"]
[null,null,null,null,null,null,{"$f":"IFERROR(VLOOKUP(E431,'Tarif de base'!D:E,2,FALSE)*F431,\"\")","v":""},null,null,null,{"$f":"IFERROR(IF(G437-H431-I431-J431<>0,\"Attention il manque \"&G437-H431-I431-J431&\"€\",\"Règlement OK\"),\"Pas de règlement\")","v":"Règlement OK"},null,"non",61,{"$f":"M431","v":"non"}]
[null,null,null,null,null,null,{"$f":"IFERROR(VLOOKUP(E432,'Tarif de base'!D:E,2,FALSE)*F432,\"\")","v":""},null,null,null,null,null,null,null,"non"]
[null,null,null,null,null,null,{"$f":"IFERROR(VLOOKUP(E433,'Tarif de base'!D:E,2,FALSE)*F433,\"\")","v":""},null,null,null,null,null,null,null,"non"]
[null,null,null,null,null,null,{"$f":"IFERROR(VLOOKUP(E434,'Tarif de base'!D:E,2,FALSE)*F434,\"\")","v":""},null,null,null,null,null,null,null,"non"]
[null,null,null,null,null,null,{"$f":"IFERROR(VLOOKUP(E435,'Tarif de base'!D:E,2,FALSE)*F435,\"\")","v":""},null,null,null,null,null,null,null,"non"]
[null,null,null,null,null,null,{"$f":"IFERROR(VLOOKUP(E436,'Tarif de base'!D:E,2,FALSE)*F436,\"\")","v":""},null,null,null,null,null,null,null,"non"]
[null,null,null,null,null,null,{"$f":"SUM(G431:G436)","v":0},null,null,null,null,null,null,null,"non"]
[null,null,null,null,null,null,{"$f":"IFERROR(VLOOKUP(E438,'Tarif de base'!D:E,2,FALSE)*F438,\"\")","v":""},null,null,null,{"$f":"IFERROR(IF(G444-H438-I438-J438<>0,\"Attention il manque \"&G444-H438-I438-J438&\"€\",\"Règlement OK\"),\"Pas de règlement\")","v":"Règlement OK"},null,"non",62,{"$f":"M438","v":"non"}]
[null,null,null,null,null,null,{"$f":"IFERROR(VLOOKUP(E439,'Tarif de base'!D:E,2,FALSE)*F439,\"\")","v":""},null,null,null,null,null,null,null,"non"]
[null,null,null,null,null,null,{"$f":"IFERROR(VLOOKUP(E440,'Tarif de base'!D:E,2,FALSE)*F440,\"\")","v":""},null,null,null,null,null,null,null,"non"]
[null,null,null,null,null,null,{"$f":"IFERROR(VLOOKUP(E441,'Tarif de base'!D:E,2,FALSE)*F441,\"\")","v":""},null,null,null,null,null,null,null,"non"]
[null,null,null,null,null,null,{"$f":"IFERROR(VLOOKUP(E442,'Tarif de base'!D:E,2,FALSE)*F442,\"\")","v":""},null,null,null,null,null,null,null,"non"]
[null,null,null,null,null,null,{"$f":"IFERROR(VLOOKUP(E443,'Tarif de base'!D:E,2,FALSE)*F443,\"\")","v":""},null,null,null,null,null,null,null,"non"]
[null,null,null,null,null,null,{"$f":"SUM(G438:G443)","v":0},null,null,null,null,null,null,null,"non"]
[null,null,null,null,null,null,{"$f":"IFERROR(VLOOKUP(E445,'Tarif de base'!D:E,2,FALSE)*F445,\"\")","v":""},null,null,null,{"$f":"IFERROR(IF(G451-H445-I445-J445<>0,\"Attention il manque \"&G451-H445-I445-J445&\"€\",\"Règlement OK\"),\"Pas de règlement\")","v":"Règlement OK"},null,"non",63,{"$f":"M445","v":"non"}]
[null,null,null,null,null,null,{"$f":"IFERROR(VLOOKUP(E446,'Tarif de base'!D:E,2,FALSE)*F446,\"\")","v":""},null,null,null,null,null,null,null,"non"]
[null,null,null,null,null,null,{"$f":"IFERROR(VLOOKUP(E447,'Tarif de base'!D:E,2,FALSE)*F447,\"\")","v":""},null,null,null,null,null,null,null,"non"]
[null,null,null,null,null,null,{"$f":"IFERROR(VLOOKUP(E448,'Tarif de base'!D:E,2,FALSE)*F448,\"\")","v":""},null,null,null,null,null,null,null,"non"]
[null,null,null,null,null,null,{"$f":"IFERROR(VLOOKUP(E449,'Tarif de base'!D:E,2,FALSE)*F449,\"\")","v":""},null,null,null,null,null,null,null,"non"]
[null,null,null,null,null,null,{"$f":"IFERROR(VLOOKUP(E450,'Tarif de base'!D:E,2,FALSE)*F450,\"\")","v":""},null,null,null,null,null,null,null,"non"]
[null,null,null,null,null,null,{"$f":"SUM(G445:G450)","v":0},null,null,null,null,null,null,null,"non"]
[null,null,null,null,null,null,{"$f":"IFERROR(VLOOKUP(E452,'Tarif de base'!D:E,2,FALSE)*F452,\"\")","v":""},null,null,null,{"$f":"IFERROR(IF(G458-H452-I452-J452<>0,\"Attention il manque \"&G458-H452-I452-J452&\"€\",\"Règlement OK\"),\"Pas de règlement\")","v":"Règlement OK"},null,"non",64,{"$f":"M452","v":"non"}]
[null,null,null,null,null,null,{"$f":"IFERROR(VLOOKUP(E453,'Tarif de base'!D:E,2,FALSE)*F453,\"\")","v":""},null,null,null,null,null,null,null,"non"]
[null,null,null,null,null,null,{"$f":"IFERROR(VLOOKUP(E454,'Tarif de base'!D:E,2,FALSE)*F454,\"\")","v":""},null,null,null,null,null,null,null,"non"]
[null,null,null,null,null,null,{"$f":"IFERROR(VLOOKUP(E455,'Tarif de base'!D:E,2,FALSE)*F455,\"\")","v":""},null,null,null,null,null,null,null,"non"]
[null,null,null,null,null,null,{"$f":"IFERROR(VLOOKUP(E456,'Tarif de base'!D:E,2,FALSE)*F456,\"\")","v":""},null,null,null,null,null,null,null,"non"]
[null,null,null,null,null,null,{"$f":"IFERROR(VLOOKUP(E457,'Tarif de base'!D:E,2,FALSE)*F457,\"\")","v":""},null,null,null,null,null,null,null,"non"]
[null,null,null,null,null,null,{"$f":"SUM(G452:G457)","v":0},null,null,null,null,null,null,null,"non"]
[null,null,null,null,null,null,{"$f":"IFERROR(VLOOKUP(E459,'Tarif de base'!D:E,2,FALSE)*F459,\"\")","v":""},null,null,null,{"$f":"IFERROR(IF(G465-H459-I459-J459<>0,\"Attention il manque \"&G465-H459-I459-J459&\"€\",\"Règlement OK\"),\"Pas de règlement\")","v":"Règlement OK"},null,"non",65,{"$f":"M459","v":"non"}]
[null,null,null,null,null,null,{"$f":"IFERROR(VLOOKUP(E460,'Tarif de base'!D:E,2,FALSE)*F460,\"\")","v":""},null,null,null,null,null,null,null,"non"]
[null,null,null,null,null,null,{"$f":"IFERROR(VLOOKUP(E461,'Tarif de base'!D:E,2,FALSE)*F461,\"\")","v":""},null,null,null,null,null,null,null,"non"]
[null,null,null,null,null,null,{"$f":"IFERROR(VLOOKUP(E462,'Tarif de base'!D:E,2,FALSE)*F462,\"\")","v":""},null,null,null,null,null,null,null,"non"]
[null,null,null,null,null,null,{"$f":"IFERROR(VLOOKUP(E463,'Tarif de base'!D:E,2,FALSE)*F463,\"\")","v":""},null,null,null,null,null,null,null,"non"]
[null,null,null,null,null,null,{"$f":"IFERROR(VLOOKUP(E464,'Tarif de base'!D:E,2,FALSE)*F464,\"\")","v":""},null,null,null,null,null,null,null,"non"]
[null,null,null,null,null,null,{"$f":"SUM(G459:G464)","v":0},null,null,null,null,null,null,null,"non"]
[null,null,null,null,null,null,{"$f":"IFERROR(VLOOKUP(E466,'Tarif de base'!D:E,2,FALSE)*F466,\"\")","v":""},null,null,null,{"$f":"IFERROR(IF(G472-H466-I466-J466<>0,\"Attention il manque \"&G472-H466-I466-J466&\"€\",\"Règlement OK\"),\"Pas de règlement\")","v":"Règlement OK"},null,"non",66,{"$f":"M466","v":"non"}]
[null,null,null,null,null,null,{"$f":"IFERROR(VLOOKUP(E467,'Tarif de base'!D:E,2,FALSE)*F467,\"\")","v":""},null,null,null,null,null,null,null,"non"]
[null,null,null,null,null,null,{"$f":"IFERROR(VLOOKUP(E468,'Tarif de base'!D:E,2,FALSE)*F468,\"\")","v":""},null,null,null,null,null,null,null,"non"]
[null,null,null,null,null,null,{"$f":"IFERROR(VLOOKUP(E469,'Tarif de base'!D:E,2,FALSE)*F469,\"\")","v":""},null,null,null,null,null,null,null,{"$f":"O468","v":"non"}]
[null,null,null,null,null,null,{"$f":"IFERROR(VLOOKUP(E470,'Tarif de base'!D:E,2,FALSE)*F470,\"\")","v":""},null,null,null,null,null,null,null,"non"]
[null,null,null,null,null,null,{"$f":"IFERROR(VLOOKUP(E471,'Tarif de base'!D:E,2,FALSE)*F471,\"\")","v":""},null,null,null,null,null,null,null,"non"]
[null,null,null,null,null,null,{"$f":"SUM(G466:G471)","v":0},null,null,null,null,null,null,null,"non"]
[null,null,null,null,null,null,{"$f":"IFERROR(VLOOKUP(E473,'Tarif de base'!D:E,2,FALSE)*F473,\"\")","v":""},null,null,null,{"$f":"IFERROR(IF(G479-H473-I473-J473<>0,\"Attention il manque \"&G479-H473-I473-J473&\"€\",\"Règlement OK\"),\"Pas de règlement\")","v":"Règlement OK"},null,"non",67,{"$f":"M473","v":"non"}]
[null,null,null,null,null,null,{"$f":"IFERROR(VLOOKUP(E474,'Tarif de base'!D:E,2,FALSE)*F474,\"\")","v":""},null,null,null,null,null,null,null,"non"]
[null,null,null,null,null,null,{"$f":"IFERROR(VLOOKUP(E475,'Tarif de base'!D:E,2,FALSE)*F475,\"\")","v":""},null,null,null,null,null,null,null,"non"]
[null,null,null,null,null,null,{"$f":"IFERROR(VLOOKUP(E476,'Tarif de base'!D:E,2,FALSE)*F476,\"\")","v":""},null,null,null,null,null,null,null,"non"]
[null,null,null,null,null,null,{"$f":"IFERROR(VLOOKUP(E477,'Tarif de base'!D:E,2,FALSE)*F477,\"\")","v":""},null,null,null,null,null,null,null,"non"]
[null,null,null,null,null,null,{"$f":"IFERROR(VLOOKUP(E478,'Tarif de base'!D:E,2,FALSE)*F478,\"\")","v":""},null,null,null,null,null,null,null,"non"]
[null,null,null,null,null,null,{"$f":"SUM(G473:G478)","v":0},null,null,null,null,null,null,null,"non"]
[null,null,null,null,null,null,{"$f":"IFERROR(VLOOKUP(E480,'Tarif de base'!D:E,2,FALSE)*F480,\"\")","v":""},null,null,null,{"$f":"IFERROR(IF(G486-H480-I480-J480<>0,\"Attention il manque \"&G486-H480-I480-J480&\"€\",\"Règlement OK\"),\"Pas de règlement\")","v":"Règlement OK"},null,"non",68,{"$f":"M480","v":"non"}]
[null,null,null,null,null,null,{"$f":"IFERROR(VLOOKUP(E481,'Tarif de base'!D:E,2,FALSE)*F481,\"\")","v":""},null,null,null,null,null,null,null,"non"]
[null,null,null,null,null,null,{"$f":"IFERROR(VLOOKUP(E482,'Tarif de base'!D:E,2,FALSE)*F482,\"\")","v":""},null,null,null,null,null,null,null,"non"]
[null,null,null,null,null,null,{"$f":"IFERROR(VLOOKUP(E483,'Tarif de base'!D:E,2,FALSE)*F483,\"\")","v":""},null,null,null,null,null,null,null,"non"]
[null,null,null,null,null,null,{"$f":"IFERROR(VLOOKUP(E484,'Tarif de base'!D:E,2,FALSE)*F484,\"\")","v":""},null,null,null,null,null,null,null,"non"]
[null,null,null,null,null,null,{"$f":"IFERROR(VLOOKUP(E485,'Tarif de base'!D:E,2,FALSE)*F485,\"\")","v":""},null,null,null,null,null,null,null,"non"]
[null,null,null,null,null,null,{"$f":"SUM(G480:G485)","v":0},null,null,null,null,null,null,null,"non"]
[null,null,null,null,null,null,{"$f":"IFERROR(VLOOKUP(E487,'Tarif de base'!D:E,2,FALSE)*F487,\"\")","v":""},null,null,null,{"$f":"IFERROR(IF(G493-H487-I487-J487<>0,\"Attention il manque \"&G493-H487-I487-J487&\"€\",\"Règlement OK\"),\"Pas de règlement\")","v":"Règlement OK"},null,"non",69,{"$f":"M487","v":"non"}]
[null,null,null,null,null,null,{"$f":"IFERROR(VLOOKUP(E488,'Tarif de base'!D:E,2,FALSE)*F488,\"\")","v":""},null,null,null,null,null,null,null,"non"]
[null,null,null,null,null,null,{"$f":"IFERROR(VLOOKUP(E489,'Tarif de base'!D:E,2,FALSE)*F489,\"\")","v":""},null,null,null,null,null,null,null,"non"]
[null,null,null,null,null,null,{"$f":"IFERROR(VLOOKUP(E490,'Tarif de base'!D:E,2,FALSE)*F490,\"\")","v":""},null,null,null,null,null,null,null,"non"]
[null,null,null,null,null,null,{"$f":"IFERROR(VLOOKUP(E491,'Tarif de base'!D:E,2,FALSE)*F491,\"\")","v":""},null,null,null,null,null,null,null,"non"]
[null,null,null,null,null,null,{"$f":"IFERROR(VLOOKUP(E492,'Tarif de base'!D:E,2,FALSE)*F492,\"\")","v":""},null,null,null,null,null,null,null,"non"]
[null,null,null,null,null,null,{"$f":"SUM(G487:G492)","v":0},null,null,null,null,null,null,null,"non"]
[null,null,null,null,null,null,{"$f":"IFERROR(VLOOKUP(E494,'Tarif de base'!D:E,2,FALSE)*F494,\"\")","v":""},null,null,null,{"$f":"IFERROR(IF(G500-H494-I494-J494<>0,\"Attention il manque \"&G500-H494-I494-J494&\"€\",\"Règlement OK\"),\"Pas de règlement\")","v":"Règlement OK"},null,"non",70,{"$f":"M494","v":"non"}]
[null,null,null,null,null,null,{"$f":"IFERROR(VLOOKUP(E495,'Tarif de base'!D:E,2,FALSE)*F495,\"\")","v":""},null,null,null,null,null,null,null,{"$f":"O494","v":"non"}]
[null,null,null,null,null,null,{"$f":"IFERROR(VLOOKUP(E496,'Tarif de base'!D:E,2,FALSE)*F496,\"\")","v":""},null,null,null,null,null,null,null,"non"]
[null,null,null,null,null,null,{"$f":"IFERROR(VLOOKUP(E497,'Tarif de base'!D:E,2,FALSE)*F497,\"\")","v":""},null,null,null,null,null,null,null,"non"]
[null,null,null,null,null,null,{"$f":"IFERROR(VLOOKUP(E498,'Tarif de base'!D:E,2,FALSE)*F498,\"\")","v":""},null,null,null,null,null,null,null,"non"]
[null,null,null,null,null,null,{"$f":"IFERROR(VLOOKUP(E499,'Tarif de base'!D:E,2,FALSE)*F499,\"\")","v":""},null,null,null,null,null,null,null,"non"]
[null,null,null,null,null,null,{"$f":"SUM(G494:G499)","v":0},null,null,null,null,null,null,null,"non"]
[null,null,null,null,null,null,{"$f":"IFERROR(VLOOKUP(E501,'Tarif de base'!D:E,2,FALSE)*F501,\"\")","v":""},null,null,null,{"$f":"IFERROR(IF(G507-H501-I501-J501<>0,\"Attention il manque \"&G507-H501-I501-J501&\"€\",\"Règlement OK\"),\"Pas de règlement\")","v":"Règlement OK"},null,"non",71,{"$f":"M501","v":"non"}]
[null,null,null,null,null,null,{"$f":"IFERROR(VLOOKUP(E502,'Tarif de base'!D:E,2,FALSE)*F502,\"\")","v":""},null,null,null,null,null,null,null,"non"]
[null,null,null,null,null,null,{"$f":"IFERROR(VLOOKUP(E503,'Tarif de base'!D:E,2,FALSE)*F503,\"\")","v":""},null,null,null,null,null,null,null,"non"]
[null,null,null,null,null,null,{"$f":"IFERROR(VLOOKUP(E504,'Tarif de base'!D:E,2,FALSE)*F504,\"\")","v":""},null,null,null,null,null,null,null,"non"]
[null,null,null,null,null,null,{"$f":"IFERROR(VLOOKUP(E505,'Tarif de base'!D:E,2,FALSE)*F505,\"\")","v":""},null,null,null,null,null,null,null,"non"]
[null,null,null,null,null,null,{"$f":"IFERROR(VLOOKUP(E506,'Tarif de base'!D:E,2,FALSE)*F506,\"\")","v":""},null,null,null,null,null,null,null,"non"]
[null,null,null,null,null,null,{"$f":"SUM(G501:G506)","v":0},null,null,null,null,null,null,null,"non"]
[null,null,null,null,null,null,{"$f":"IFERROR(VLOOKUP(E508,'Tarif de base'!D:E,2,FALSE)*F508,\"\")","v":""},null,null,null,{"$f":"IFERROR(IF(G514-H508-I508-J508<>0,\"Attention il manque \"&G514-H508-I508-J508&\"€\",\"Règlement OK\"),\"Pas de règlement\")","v":"Règlement OK"},null,"non",72,{"$f":"M508","v":"non"}]
[null,null,null,null,null,null,{"$f":"IFERROR(VLOOKUP(E509,'Tarif de base'!D:E,2,FALSE)*F509,\"\")","v":""},null,null,null,null,null,null,null,"non"]
[null,null,null,null,null,null,{"$f":"IFERROR(VLOOKUP(E510,'Tarif de base'!D:E,2,FALSE)*F510,\"\")","v":""},null,null,null,null,null,null,null,"non"]
[null,null,null,null,null,null,{"$f":"IFERROR(VLOOKUP(E511,'Tarif de base'!D:E,2,FALSE)*F511,\"\")","v":""},null,null,null,null,null,null,null,"non"]
[null,null,null,null,null,null,{"$f":"IFERROR(VLOOKUP(E512,'Tarif de base'!D:E,2,FALSE)*F512,\"\")","v":""},null,null,null,null,null,null,null,"non"]
[null,null,null,null,null,null,{"$f":"IFERROR(VLOOKUP(E513,'Tarif de base'!D:E,2,FALSE)*F513,\"\")","v":""},null,null,null,null,null,null,null,"non"]
[null,null,null,null,null,null,{"$f":"SUM(G508:G513)","v":0},null,null,null,null,null,null,null,"non"]
[null,null,null,null,null,null,{"$f":"IFERROR(VLOOKUP(E515,'Tarif de base'!D:E,2,FALSE)*F515,\"\")","v":""},null,null,null,{"$f":"IFERROR(IF(G521-H515-I515-J515<>0,\"Attention il manque \"&G521-H515-I515-J515&\"€\",\"Règlement OK\"),\"Pas de règlement\")","v":"Règlement OK"},null,"non",73,{"$f":"M515","v":"non"}]
[null,null,null,null,null,null,{"$f":"IFERROR(VLOOKUP(E516,'Tarif de base'!D:E,2,FALSE)*F516,\"\")","v":""},null,null,null,null,null,null,null,"non"]
[null,null,null,null,null,null,{"$f":"IFERROR(VLOOKUP(E517,'Tarif de base'!D:E,2,FALSE)*F517,\"\")","v":""},null,null,null,null,null,null,null,"non"]
[null,null,null,null,null,null,{"$f":"IFERROR(VLOOKUP(E518,'Tarif de base'!D:E,2,FALSE)*F518,\"\")","v":""},null,null,null,null,null,null,null,"non"]
[null,null,null,null,null,null,{"$f":"IFERROR(VLOOKUP(E519,'Tarif de base'!D:E,2,FALSE)*F519,\"\")","v":""},null,null,null,null,null,null,null,"non"]
[null,null,null,null,null,null,{"$f":"IFERROR(VLOOKUP(E520,'Tarif de base'!D:E,2,FALSE)*F520,\"\")","v":""},null,null,null,null,null,null,null,"non"]
[null,null,null,null,null,null,{"$f":"SUM(G515:G520)","v":0},null,null,null,null,null,null,null,"non"]
[null,null,null,null,null,null,{"$f":"IFERROR(VLOOKUP(E522,'Tarif de base'!D:E,2,FALSE)*F522,\"\")","v":""},null,null,null,{"$f":"IFERROR(IF(G528-H522-I522-J522<>0,\"Attention il manque \"&G528-H522-I522-J522&\"€\",\"Règlement OK\"),\"Pas de règlement\")","v":"Règlement OK"},null,"non",74,{"$f":"M522","v":"non"}]
[null,null,null,null,null,null,{"$f":"IFERROR(VLOOKUP(E523,'Tarif de base'!D:E,2,FALSE)*F523,\"\")","v":""},null,null,null,null,null,null,null,{"$f":"O522","v":"non"}]
[null,null,null,null,null,null,{"$f":"IFERROR(VLOOKUP(E524,'Tarif de base'!D:E,2,FALSE)*F524,\"\")","v":""},null,null,null,null,null,null,null,{"$f":"O523","v":"non"}]
[null,null,null,null,null,null,{"$f":"IFERROR(VLOOKUP(E525,'Tarif de base'!D:E,2,FALSE)*F525,\"\")","v":""},null,null,null,null,null,null,null,"non"]
[null,null,null,null,null,null,{"$f":"IFERROR(VLOOKUP(E526,'Tarif de base'!D:E,2,FALSE)*F526,\"\")","v":""},null,null,null,null,null,null,null,"non"]
[null,null,null,null,null,null,{"$f":"IFERROR(VLOOKUP(E527,'Tarif de base'!D:E,2,FALSE)*F527,\"\")","v":""},null,null,null,null,null,null,null,"non"]
[null,null,null,null,null,null,{"$f":"SUM(G522:G527)","v":0},null,null,null,null,null,null,null,"non"]
[null,null,null,null,null,null,{"$f":"IFERROR(VLOOKUP(E529,'Tarif de base'!D:E,2,FALSE)*F529,\"\")","v":""},null,null,null,{"$f":"IFERROR(IF(G535-H529-I529-J529<>0,\"Attention il manque \"&G535-H529-I529-J529&\"€\",\"Règlement OK\"),\"Pas de règlement\")","v":"Règlement OK"},null,"non",75,{"$f":"M529","v":"non"}]
[null,null,null,null,null,null,{"$f":"IFERROR(VLOOKUP(E530,'Tarif de base'!D:E,2,FALSE)*F530,\"\")","v":""},null,null,null,null,null,null,null,{"$f":"O529","v":"non"}]
[null,null,null,null,null,null,{"$f":"IFERROR(VLOOKUP(E531,'Tarif de base'!D:E,2,FALSE)*F531,\"\")","v":""},null,null,null,null,null,null,null,{"$f":"O530","v":"non"}]
[null,null,null,null,null,null,{"$f":"IFERROR(VLOOKUP(E532,'Tarif de base'!D:E,2,FALSE)*F532,\"\")","v":""},null,null,null,null,null,null,null,"non"]
[null,null,null,null,null,null,{"$f":"IFERROR(VLOOKUP(E533,'Tarif de base'!D:E,2,FALSE)*F533,\"\")","v":""},null,null,null,null,null,null,null,"non"]
[null,null,null,null,null,null,{"$f":"IFERROR(VLOOKUP(E534,'Tarif de base'!D:E,2,FALSE)*F534,\"\")","v":""},null,null,null,null,null,null,null,"non"]
[null,null,null,null,null,null,{"$f":"SUM(G529:G534)","v":0},null,null,null,null,null,null,null,"non"]
[null,null,null,null,null,null,{"$f":"IFERROR(VLOOKUP(E536,'Tarif de base'!D:E,2,FALSE)*F536,\"\")","v":""},null,null,null,{"$f":"IFERROR(IF(G542-H536-I536-J536<>0,\"Attention il manque \"&G542-H536-I536-J536&\"€\",\"Règlement OK\"),\"Pas de règlement\")","v":"Règlement OK"},null,"non",76,{"$f":"M536","v":"non"}]
[null,null,null,null,null,null,{"$f":"IFERROR(VLOOKUP(E537,'Tarif de base'!D:E,2,FALSE)*F537,\"\")","v":""},null,null,null,null,null,null,null,"non"]
[null,null,null,null,null,null,{"$f":"IFERROR(VLOOKUP(E538,'Tarif de base'!D:E,2,FALSE)*F538,\"\")","v":""},null,null,null,null,null,null,null,"non"]
[null,null,null,null,null,null,{"$f":"IFERROR(VLOOKUP(E539,'Tarif de base'!D:E,2,FALSE)*F539,\"\")","v":""},null,null,null,null,null,null,null,"non"]
[null,null,null,null,null,null,{"$f":"IFERROR(VLOOKUP(E540,'Tarif de base'!D:E,2,FALSE)*F540,\"\")","v":""},null,null,null,null,null,null,null,"non"]
[null,null,null,null,null,null,{"$f":"IFERROR(VLOOKUP(E541,'Tarif de base'!D:E,2,FALSE)*F541,\"\")","v":""},null,null,null,null,null,null,null,"non"]
[null,null,null,null,null,null,{"$f":"SUM(G536:G541)","v":0},null,null,null,null,null,null,null,"non"]
[null,null,null,null,null,null,{"$f":"IFERROR(VLOOKUP(E543,'Tarif de base'!D:E,2,FALSE)*F543,\"\")","v":""},null,null,null,{"$f":"IFERROR(IF(G549-H543-I543-J543<>0,\"Attention il manque \"&G549-H543-I543-J543&\"€\",\"Règlement OK\"),\"Pas de règlement\")","v":"Règlement OK"},null,"non",77,{"$f":"M543","v":"non"}]
[null,null,null,null,null,null,{"$f":"IFERROR(VLOOKUP(E544,'Tarif de base'!D:E,2,FALSE)*F544,\"\")","v":""},null,null,null,null,null,null,null,"non"]
[null,null,null,null,null,null,{"$f":"IFERROR(VLOOKUP(E545,'Tarif de base'!D:E,2,FALSE)*F545,\"\")","v":""},null,null,null,null,null,null,null,"non"]
[null,null,null,null,null,null,{"$f":"IFERROR(VLOOKUP(E546,'Tarif de base'!D:E,2,FALSE)*F546,\"\")","v":""},null,null,null,null,null,null,null,"non"]
[null,null,null,null,null,null,{"$f":"IFERROR(VLOOKUP(E547,'Tarif de base'!D:E,2,FALSE)*F547,\"\")","v":""},null,null,null,null,null,null,null,"non"]
[null,null,null,null,null,null,{"$f":"IFERROR(VLOOKUP(E548,'Tarif de base'!D:E,2,FALSE)*F548,\"\")","v":""},null,null,null,null,null,null,null,"non"]
[null,null,null,null,null,null,{"$f":"SUM(G543:G548)","v":0},null,null,null,null,null,null,null,"non"]
[null,null,null,null,null,null,{"$f":"IFERROR(VLOOKUP(E550,'Tarif de base'!D:E,2,FALSE)*F550,\"\")","v":""},null,null,null,{"$f":"IFERROR(IF(G556-H550-I550-J550<>0,\"Attention il manque \"&G556-H550-I550-J550&\"€\",\"Règlement OK\"),\"Pas de règlement\")","v":"Règlement OK"},null,"non",78,{"$f":"M550","v":"non"}]
[null,null,null,null,null,null,{"$f":"IFERROR(VLOOKUP(E551,'Tarif de base'!D:E,2,FALSE)*F551,\"\")","v":""},null,null,null,null,null,null,null,"non"]
[null,null,null,null,null,null,{"$f":"IFERROR(VLOOKUP(E552,'Tarif de base'!D:E,2,FALSE)*F552,\"\")","v":""},null,null,null,null,null,null,null,"non"]
[null,null,null,null,null,null,{"$f":"IFERROR(VLOOKUP(E553,'Tarif de base'!D:E,2,FALSE)*F553,\"\")","v":""},null,null,null,null,null,null,null,"non"]
[null,null,null,null,null,null,{"$f":"IFERROR(VLOOKUP(E554,'Tarif de base'!D:E,2,FALSE)*F554,\"\")","v":""},null,null,null,null,null,null,null,"non"]
[null,null,null,null,null,null,{"$f":"IFERROR(VLOOKUP(E555,'Tarif de base'!D:E,2,FALSE)*F555,\"\")","v":""},null,null,null,null,null,null,null,"non"]
[null,null,null,null,null,null,{"$f":"SUM(G550:G555)","v":0},null,null,null,null,null,null,null,"non"]
[null,null,null,null,null,null,{"$f":"IFERROR(VLOOKUP(E557,'Tarif de base'!D:E,2,FALSE)*F557,\"\")","v":""},null,null,null,{"$f":"IFERROR(IF(G563-H557-I557-J557<>0,\"Attention il manque \"&G563-H557-I557-J557&\"€\",\"Règlement OK\"),\"Pas de règlement\")","v":"Règlement OK"},null,"non",79,{"$f":"M557","v":"non"}]
[null,null,null,null,null,null,{"$f":"IFERROR(VLOOKUP(E558,'Tarif de base'!D:E,2,FALSE)*F558,\"\")","v":""},null,null,null,null,null,null,null,"non"]
[null,null,null,null,null,null,{"$f":"IFERROR(VLOOKUP(E559,'Tarif de base'!D:E,2,FALSE)*F559,\"\")","v":""},null,null,null,null,null,null,null,"non"]
[null,null,null,null,null,null,{"$f":"IFERROR(VLOOKUP(E560,'Tarif de base'!D:E,2,FALSE)*F560,\"\")","v":""},null,null,null,null,null,null,null,"non"]
[null,null,null,null,null,null,{"$f":"IFERROR(VLOOKUP(E561,'Tarif de base'!D:E,2,FALSE)*F561,\"\")","v":""},null,null,null,null,null,null,null,"non"]
[null,null,null,null,null,null,{"$f":"IFERROR(VLOOKUP(E562,'Tarif de base'!D:E,2,FALSE)*F562,\"\")","v":""},null,null,null,null,null,null,null,"non"]
[null,null,null,null,null,null,{"$f":"SUM(G557:G562)","v":0},null,null,null,null,null,null,null,"non"]
[null,null,null,null,null,null,{"$f":"IFERROR(VLOOKUP(E564,'Tarif de base'!D:E,2,FALSE)*F564,\"\")","v":""},null,null,null,{"$f":"IFERROR(IF(G570-H564-I564-J564<>0,\"Attention il manque \"&G570-H564-I564-J564&\"€\",\"Règlement OK\"),\"Pas de règlement\")","v":"Règlement OK"},null,"non",80,{"$f":"M564","v":"non"}]
[null,null,null,null,null,null,{"$f":"IFERROR(VLOOKUP(E565,'Tarif de base'!D:E,2,FALSE)*F565,\"\")","v":""},null,null,null,null,null,null,null,"non"]
[null,null,null,null,null,null,{"$f":"IFERROR(VLOOKUP(E566,'Tarif de base'!D:E,2,FALSE)*F566,\"\")","v":""},null,null,null,null,null,null,null,"non"]
[null,null,null,null,null,null,{"$f":"IFERROR(VLOOKUP(E567,'Tarif de base'!D:E,2,FALSE)*F567,\"\")","v":""},null,null,null,null,null,null,null,"non"]
[null,null,null,null,null,null,{"$f":"IFERROR(VLOOKUP(E568,'Tarif de base'!D:E,2,FALSE)*F568,\"\")","v":""},null,null,null,null,null,null,null,"non"]
[null,null,null,null,null,null,{"$f":"IFERROR(VLOOKUP(E569,'Tarif de base'!D:E,2,FALSE)*F569,\"\")","v":""},null,null,null,null,null,null,null,"non"]
[null,null,null,null,null,null,{"$f":"SUM(G564:G569)","v":0},null,null,null,null,null,null,null,"non"]
[null,null,null,null,null,null,{"$f":"IFERROR(VLOOKUP(E571,'Tarif de base'!D:E,2,FALSE)*F571,\"\")","v":""},null,null,null,{"$f":"IFERROR(IF(G577-H571-I571-J571<>0,\"Attention il manque \"&G577-H571-I571-J571&\"€\",\"Règlement OK\"),\"Pas de règlement\")","v":"Règlement OK"},null,"non",81,{"$f":"M571","v":"non"}]
[null,null,null,null,null,null,{"$f":"IFERROR(VLOOKUP(E572,'Tarif de base'!D:E,2,FALSE)*F572,\"\")","v":""},null,null,null,null,null,null,null,"non"]
[null,null,null,null,null,null,{"$f":"IFERROR(VLOOKUP(E573,'Tarif de base'!D:E,2,FALSE)*F573,\"\")","v":""},null,null,null,null,null,null,null,"non"]
[null,null,null,null,null,null,{"$f":"IFERROR(VLOOKUP(E574,'Tarif de base'!D:E,2,FALSE)*F574,\"\")","v":""},null,null,null,null,null,null,null,"non"]
[null,null,null,null,null,null,{"$f":"IFERROR(VLOOKUP(E575,'Tarif de base'!D:E,2,FALSE)*F575,\"\")","v":""},null,null,null,null,null,null,null,"non"]
[null,null,null,null,null,null,{"$f":"IFERROR(VLOOKUP(E576,'Tarif de base'!D:E,2,FALSE)*F576,\"\")","v":""},null,null,null,null,null,null,null,"non"]
[null,null,null,null,null,null,{"$f":"SUM(G571:G576)","v":0},null,null,null,null,null,null,null,"non"]
[null,null,null,null,null,null,{"$f":"IFERROR(VLOOKUP(E578,'Tarif de base'!D:E,2,FALSE)*F578,\"\")","v":""},null,null,null,{"$f":"IFERROR(IF(G584-H578-I578-J578<>0,\"Attention il manque \"&G584-H578-I578-J578&\"€\",\"Règlement OK\"),\"Pas de règlement\")","v":"Règlement OK"},null,"non",82,{"$f":"M578","v":"non"}]
[null,null,null,null,null,null,{"$f":"IFERROR(VLOOKUP(E579,'Tarif de base'!D:E,2,FALSE)*F579,\"\")","v":""},null,null,null,null,null,null,null,"non"]
[null,null,null,null,null,null,{"$f":"IFERROR(VLOOKUP(E580,'Tarif de base'!D:E,2,FALSE)*F580,\"\")","v":""},null,null,null,null,null,null,null,"non"]
[null,null,null,null,null,null,{"$f":"IFERROR(VLOOKUP(E581,'Tarif de base'!D:E,2,FALSE)*F581,\"\")","v":""},null,null,null,null,null,null,null,"non"]
[null,null,null,null,null,null,{"$f":"IFERROR(VLOOKUP(E582,'Tarif de base'!D:E,2,FALSE)*F582,\"\")","v":""},null,null,null,null,null,null,null,"non"]
[null,null,null,null,null,null,{"$f":"IFERROR(VLOOKUP(E583,'Tarif de base'!D:E,2,FALSE)*F583,\"\")","v":""},null,null,null,null,null,null,null,"non"]
[null,null,null,null,null,null,{"$f":"SUM(G578:G583)","v":0},null,null,null,null,null,null,null,"non"]
[null,null,null,null,null,null,{"$f":"IFERROR(VLOOKUP(E585,'Tarif de base'!D:E,2,FALSE)*F585,\"\")","v":""},null,null,null,{"$f":"IFERROR(IF(G591-H585-I585-J585<>0,\"Attention il manque \"&G591-H585-I585-J585&\"€\",\"Règlement OK\"),\"Pas de règlement\")","v":"Règlement OK"},null,"non",83,{"$f":"M585","v":"non"}]
[null,null,null,null,null,null,{"$f":"IFERROR(VLOOKUP(E586,'Tarif de base'!D:E,2,FALSE)*F586,\"\")","v":""},null,null,null,null,null,null,null,"non"]
[null,null,null,null,null,null,{"$f":"IFERROR(VLOOKUP(E587,'Tarif de base'!D:E,2,FALSE)*F587,\"\")","v":""},null,null,null,null,null,null,null,"non"]
[null,null,null,null,null,null,{"$f":"IFERROR(VLOOKUP(E588,'Tarif de base'!D:E,2,FALSE)*F588,\"\")","v":""},null,null,null,null,null,null,null,"non"]
[null,null,null,null,null,null,{"$f":"IFERROR(VLOOKUP(E589,'Tarif de base'!D:E,2,FALSE)*F589,\"\")","v":""},null,null,null,null,null,null,null,"non"]
[null,null,null,null,null,null,{"$f":"IFERROR(VLOOKUP(E590,'Tarif de base'!D:E,2,FALSE)*F590,\"\")","v":""},null,null,null,null,null,null,null,"non"]
[null,null,null,null,null,null,{"$f":"SUM(G585:G590)","v":0},null,null,null,null,null,null,null,"non"]
[null,null,null,null,null,null,{"$f":"IFERROR(VLOOKUP(E592,'Tarif de base'!D:E,2,FALSE)*F592,\"\")","v":""},null,null,null,{"$f":"IFERROR(IF(G598-H592-I592-J592<>0,\"Attention il manque \"&G598-H592-I592-J592&\"€\",\"Règlement OK\"),\"Pas de règlement\")","v":"Règlement OK"},null,"non",84,{"$f":"M592","v":"non"}]
[null,null,null,null,null,null,{"$f":"IFERROR(VLOOKUP(E593,'Tarif de base'!D:E,2,FALSE)*F593,\"\")","v":""},null,null,null,null,null,null,null,"non"]
[null,null,null,null,null,null,{"$f":"IFERROR(VLOOKUP(E594,'Tarif de base'!D:E,2,FALSE)*F594,\"\")","v":""},null,null,null,null,null,null,null,"non"]
[null,null,null,null,null,null,{"$f":"IFERROR(VLOOKUP(E595,'Tarif de base'!D:E,2,FALSE)*F595,\"\")","v":""},null,null,null,null,null,null,null,{"$f":"O594","v":"non"}]
[null,null,null,null,null,null,{"$f":"IFERROR(VLOOKUP(E596,'Tarif de base'!D:E,2,FALSE)*F596,\"\")","v":""},null,null,null,null,null,null,null,"non"]
[null,null,null,null,null,null,{"$f":"IFERROR(VLOOKUP(E597,'Tarif de base'!D:E,2,FALSE)*F597,\"\")","v":""},null,null,null,null,null,null,null,"non"]
[null,null,null,null,null,null,{"$f":"SUM(G592:G597)","v":0},null,null,null,null,null,null,null,"non"]
[null,null,null,null,null,null,{"$f":"IFERROR(VLOOKUP(E599,'Tarif de base'!D:E,2,FALSE)*F599,\"\")","v":""},null,null,null,{"$f":"IFERROR(IF(G605-H599-I599-J599<>0,\"Attention il manque \"&G605-H599-I599-J599&\"€\",\"Règlement OK\"),\"Pas de règlement\")","v":"Règlement OK"},null,"non",85,{"$f":"M599","v":"non"}]
[null,null,null,null,null,null,{"$f":"IFERROR(VLOOKUP(E600,'Tarif de base'!D:E,2,FALSE)*F600,\"\")","v":""},null,null,null,null,null,null,null,"non"]
[null,null,null,null,null,null,{"$f":"IFERROR(VLOOKUP(E601,'Tarif de base'!D:E,2,FALSE)*F601,\"\")","v":""},null,null,null,null,null,null,null,"non"]
[null,null,null,null,null,null,{"$f":"IFERROR(VLOOKUP(E602,'Tarif de base'!D:E,2,FALSE)*F602,\"\")","v":""},null,null,null,null,null,null,null,"non"]
[null,null,null,null,null,null,{"$f":"IFERROR(VLOOKUP(E603,'Tarif de base'!D:E,2,FALSE)*F603,\"\")","v":""},null,null,null,null,null,null,null,"non"]
[null,null,null,null,null,null,{"$f":"IFERROR(VLOOKUP(E604,'Tarif de base'!D:E,2,FALSE)*F604,\"\")","v":""},null,null,null,null,null,null,null,"non"]
[null,null,null,null,null,null,{"$f":"SUM(G599:G604)","v":0},null,null,null,null,null,null,null,"non"]
[null,null,null,null,null,null,{"$f":"IFERROR(VLOOKUP(E606,'Tarif de base'!D:E,2,FALSE)*F606,\"\")","v":""},null,null,null,{"$f":"IFERROR(IF(G612-H606-I606-J606<>0,\"Attention il manque \"&G612-H606-I606-J606&\"€\",\"Règlement OK\"),\"Pas de règlement\")","v":"Règlement OK"},null,"non",86,{"$f":"M606","v":"non"}]
[null,null,null,null,null,null,{"$f":"IFERROR(VLOOKUP(E607,'Tarif de base'!D:E,2,FALSE)*F607,\"\")","v":""},null,null,null,null,null,null,null,"non"]
[null,null,null,null,null,null,{"$f":"IFERROR(VLOOKUP(E608,'Tarif de base'!D:E,2,FALSE)*F608,\"\")","v":""},null,null,null,null,null,null,null,"non"]
[null,null,null,null,null,null,{"$f":"IFERROR(VLOOKUP(E609,'Tarif de base'!D:E,2,FALSE)*F609,\"\")","v":""},null,null,null,null,null,null,null,"non"]
[null,null,null,null,null,null,{"$f":"IFERROR(VLOOKUP(E610,'Tarif de base'!D:E,2,FALSE)*F610,\"\")","v":""},null,null,null,null,null,null,null,"non"]
[null,null,null,null,null,null,{"$f":"IFERROR(VLOOKUP(E611,'Tarif de base'!D:E,2,FALSE)*F611,\"\")","v":""},null,null,null,null,null,null,null,"non"]
[null,null,null,null,null,null,{"$f":"SUM(G606:G611)","v":0},null,null,null,null,null,null,null,"non"]
[null,null,null,null,null,null,{"$f":"IFERROR(VLOOKUP(E613,'Tarif de base'!D:E,2,FALSE)*F613,\"\")","v":""},null,null,null,{"$f":"IFERROR(IF(G619-H613-I613-J613<>0,\"Attention il manque \"&G619-H613-I613-J613&\"€\",\"Règlement OK\"),\"Pas de règlement\")","v":"Règlement OK"},null,"non",87,{"$f":"M613","v":"non"}]
[null,null,null,null,null,null,{"$f":"IFERROR(VLOOKUP(E614,'Tarif de base'!D:E,2,FALSE)*F614,\"\")","v":""},null,null,null,null,null,null,null,"non"]
[null,null,null,null,null,null,{"$f":"IFERROR(VLOOKUP(E615,'Tarif de base'!D:E,2,FALSE)*F615,\"\")","v":""},null,null,null,null,null,null,null,"non"]
[null,null,null,null,null,null,{"$f":"IFERROR(VLOOKUP(E616,'Tarif de base'!D:E,2,FALSE)*F616,\"\")","v":""},null,null,null,null,null,null,null,"non"]
[null,null,null,null,null,null,{"$f":"IFERROR(VLOOKUP(E617,'Tarif de base'!D:E,2,FALSE)*F617,\"\")","v":""},null,null,null,null,null,null,null,"non"]
[null,null,null,null,null,null,{"$f":"IFERROR(VLOOKUP(E618,'Tarif de base'!D:E,2,FALSE)*F618,\"\")","v":""},null,null,null,null,null,null,null,"non"]
[null,null,null,null,null,null,{"$f":"SUM(G613:G618)","v":0},null,null,null,null,null,null,null,"non"]
[null,null,null,null,null,null,{"$f":"IFERROR(VLOOKUP(E620,'Tarif de base'!D:E,2,FALSE)*F620,\"\")","v":""},null,null,null,{"$f":"IFERROR(IF(G626-H620-I620-J620<>0,\"Attention il manque \"&G626-H620-I620-J620&\"€\",\"Règlement OK\"),\"Pas de règlement\")","v":"Règlement OK"},null,"non",88,{"$f":"M620","v":"non"}]
[null,null,null,null,null,null,{"$f":"IFERROR(VLOOKUP(E621,'Tarif de base'!D:E,2,FALSE)*F621,\"\")","v":""},null,null,null,null,null,null,null,{"$f":"O620","v":"non"}]
[null,null,null,null,null,null,{"$f":"IFERROR(VLOOKUP(E622,'Tarif de base'!D:E,2,FALSE)*F622,\"\")","v":""},null,null,null,null,null,null,null,"non"]
[null,null,null,null,null,null,{"$f":"IFERROR(VLOOKUP(E623,'Tarif de base'!D:E,2,FALSE)*F623,\"\")","v":""},null,null,null,null,null,null,null,"non"]
[null,null,null,null,null,null,{"$f":"IFERROR(VLOOKUP(E624,'Tarif de base'!D:E,2,FALSE)*F624,\"\")","v":""},null,null,null,null,null,null,null,"non"]
[null,null,null,null,null,null,{"$f":"IFERROR(VLOOKUP(E625,'Tarif de base'!D:E,2,FALSE)*F625,\"\")","v":""},null,null,null,null,null,null,null,"non"]
[null,null,null,null,null,null,{"$f":"SUM(G620:G625)","v":0},null,null,null,null,null,null,null,"non"]
[null,null,null,null,null,null,{"$f":"IFERROR(VLOOKUP(E627,'Tarif de base'!D:E,2,FALSE)*F627,\"\")","v":""},null,null,null,{"$f":"IFERROR(IF(G633-H627-I627-J627<>0,\"Attention il manque \"&G633-H627-I627-J627&\"€\",\"Règlement OK\"),\"Pas de règlement\")","v":"Règlement OK"},null,"non",89,{"$f":"M627","v":"non"}]
[null,null,null,null,null,null,{"$f":"IFERROR(VLOOKUP(E628,'Tarif de base'!D:E,2,FALSE)*F628,\"\")","v":""},null,null,null,null,null,null,null,"non"]
[null,null,null,null,null,null,{"$f":"IFERROR(VLOOKUP(E629,'Tarif de base'!D:E,2,FALSE)*F629,\"\")","v":""},null,null,null,null,null,null,null,"non"]
[null,null,null,null,null,null,{"$f":"IFERROR(VLOOKUP(E630,'Tarif de base'!D:E,2,FALSE)*F630,\"\")","v":""},null,null,null,null,null,null,null,"non"]
[null,null,null,null,null,null,{"$f":"IFERROR(VLOOKUP(E631,'Tarif de base'!D:E,2,FALSE)*F631,\"\")","v":""},null,null,null,null,null,null,null,"non"]
[null,null,null,null,null,null,{"$f":"IFERROR(VLOOKUP(E632,'Tarif de base'!D:E,2,FALSE)*F632,\"\")","v":""},null,null,null,null,null,null,null,"non"]
[null,null,null,null,null,null,{"$f":"SUM(G627:G632)","v":0},null,null,null,null,null,null,null,"non"]
[null,null,null,null,null,null,{"$f":"IFERROR(VLOOKUP(E634,'Tarif de base'!D:E,2,FALSE)*F634,\"\")","v":""},null,null,null,{"$f":"IFERROR(IF(G640-H634-I634-J634<>0,\"Attention il manque \"&G640-H634-I634-J634&\"€\",\"Règlement OK\"),\"Pas de règlement\")","v":"Règlement OK"},null,"non",90,{"$f":"M634","v":"non"}]
[null,null,null,null,null,null,{"$f":"IFERROR(VLOOKUP(E635,'Tarif de base'!D:E,2,FALSE)*F635,\"\")","v":""},null,null,null,null,null,null,null,"non"]
[null,null,null,null,null,null,{"$f":"IFERROR(VLOOKUP(E636,'Tarif de base'!D:E,2,FALSE)*F636,\"\")","v":""},null,null,null,null,null,null,null,"non"]
[null,null,null,null,null,null,{"$f":"IFERROR(VLOOKUP(E637,'Tarif de base'!D:E,2,FALSE)*F637,\"\")","v":""},null,null,null,null,null,null,null,"non"]
[null,null,null,null,null,null,{"$f":"IFERROR(VLOOKUP(E638,'Tarif de base'!D:E,2,FALSE)*F638,\"\")","v":""},null,null,null,null,null,null,null,"non"]
[null,null,null,null,null,null,{"$f":"IFERROR(VLOOKUP(E639,'Tarif de base'!D:E,2,FALSE)*F639,\"\")","v":""},null,null,null,null,null,null,null,"non"]
[null,null,null,null,null,null,{"$f":"SUM(G634:G639)","v":0},null,null,null,null,null,null,null,"non"]
[null,null,null,null,null,null,{"$f":"IFERROR(VLOOKUP(E641,'Tarif de base'!D:E,2,FALSE)*F641,\"\")","v":""},null,null,null,{"$f":"IFERROR(IF(G647-H641-I641-J641<>0,\"Attention il manque \"&G647-H641-I641-J641&\"€\",\"Règlement OK\"),\"Pas de règlement\")","v":"Règlement OK"},null,"non",91,{"$f":"M641","v":"non"}]
[null,null,null,null,null,null,{"$f":"IFERROR(VLOOKUP(E642,'Tarif de base'!D:E,2,FALSE)*F642,\"\")","v":""},null,null,null,null,null,null,null,"non"]
[null,null,null,null,null,null,{"$f":"IFERROR(VLOOKUP(E643,'Tarif de base'!D:E,2,FALSE)*F643,\"\")","v":""},null,null,null,null,null,null,null,"non"]
[null,null,null,null,null,null,{"$f":"IFERROR(VLOOKUP(E644,'Tarif de base'!D:E,2,FALSE)*F644,\"\")","v":""},null,null,null,null,null,null,null,"non"]
[null,null,null,null,null,null,{"$f":"IFERROR(VLOOKUP(E645,'Tarif de base'!D:E,2,FALSE)*F645,\"\")","v":""},null,null,null,null,null,null,null,"non"]
[null,null,null,null,null,null,{"$f":"IFERROR(VLOOKUP(E646,'Tarif de base'!D:E,2,FALSE)*F646,\"\")","v":""},null,null,null,null,null,null,null,"non"]
[null,null,null,null,null,null,{"$f":"SUM(G641:G646)","v":0},null,null,null,null,null,null,null,"non"]
[null,null,null,null,null,null,{"$f":"IFERROR(VLOOKUP(E648,'Tarif de base'!D:E,2,FALSE)*F648,\"\")","v":""},null,null,null,{"$f":"IFERROR(IF(G654-H648-I648-J648<>0,\"Attention il manque \"&G654-H648-I648-J648&\"€\",\"Règlement OK\"),\"Pas de règlement\")","v":"Règlement OK"},null,"non",92,{"$f":"M648","v":"non"}]
[null,null,null,null,null,null,{"$f":"IFERROR(VLOOKUP(E649,'Tarif de base'!D:E,2,FALSE)*F649,\"\")","v":""},null,null,null,null,null,null,null,{"$f":"O648","v":"non"}]
[null,null,null,null,null,null,{"$f":"IFERROR(VLOOKUP(E650,'Tarif de base'!D:E,2,FALSE)*F650,\"\")","v":""},null,null,null,null,null,null,null,{"$f":"O649","v":"non"}]
[null,null,null,null,null,null,{"$f":"IFERROR(VLOOKUP(E651,'Tarif de base'!D:E,2,FALSE)*F651,\"\")","v":""},null,null,null,null,null,null,null,"non"]
[null,null,null,null,null,null,{"$f":"IFERROR(VLOOKUP(E652,'Tarif de base'!D:E,2,FALSE)*F652,\"\")","v":""},null,null,null,null,null,null,null,"non"]
[null,null,null,null,null,null,{"$f":"IFERROR(VLOOKUP(E653,'Tarif de base'!D:E,2,FALSE)*F653,\"\")","v":""},null,null,null,null,null,null,null,"non"]
[null,null,null,null,null,null,{"$f":"SUM(G648:G653)","v":0},null,null,null,null,null,null,null,"non"]
[null,null,null,null,null,null,{"$f":"IFERROR(VLOOKUP(E655,'Tarif de base'!D:E,2,FALSE)*F655,\"\")","v":""},null,null,null,{"$f":"IFERROR(IF(G661-H655-I655-J655<>0,\"Attention il manque \"&G661-H655-I655-J655&\"€\",\"Règlement OK\"),\"Pas de règlement\")","v":"Règlement OK"},null,"non",93,{"$f":"M655","v":"non"}]
[null,null,null,null,null,null,{"$f":"IFERROR(VLOOKUP(E656,'Tarif de base'!D:E,2,FALSE)*F656,\"\")","v":""},null,null,null,null,null,null,null,{"$f":"O655","v":"non"}]
[null,null,null,null,null,null,{"$f":"IFERROR(VLOOKUP(E657,'Tarif de base'!D:E,2,FALSE)*F657,\"\")","v":""},null,null,null,null,null,null,null,{"$f":"O656","v":"non"}]
[null,null,null,null,null,null,{"$f":"IFERROR(VLOOKUP(E658,'Tarif de base'!D:E,2,FALSE)*F658,\"\")","v":""},null,null,null,null,null,null,null,"non"]
[null,null,null,null,null,null,{"$f":"IFERROR(VLOOKUP(E659,'Tarif de base'!D:E,2,FALSE)*F659,\"\")","v":""},null,null,null,null,null,null,null,"non"]
[null,null,null,null,null,null,{"$f":"IFERROR(VLOOKUP(E660,'Tarif de base'!D:E,2,FALSE)*F660,\"\")","v":""},null,null,null,null,null,null,null,"non"]
[null,null,null,null,null,null,{"$f":"SUM(G655:G660)","v":0},null,null,null,null,null,null,null,"non"]
[null,null,null,null,null,null,{"$f":"IFERROR(VLOOKUP(E662,'Tarif de base'!D:E,2,FALSE)*F662,\"\")","v":""},null,null,null,{"$f":"IFERROR(IF(G668-H662-I662-J662<>0,\"Attention il manque \"&G668-H662-I662-J662&\"€\",\"Règlement OK\"),\"Pas de règlement\")","v":"Règlement OK"},null,"non",94,{"$f":"M662","v":"non"}]
[null,null,null,null,null,null,{"$f":"IFERROR(VLOOKUP(E663,'Tarif de base'!D:E,2,FALSE)*F663,\"\")","v":""},null,null,null,null,null,null,null,"non"]
[null,null,null,null,null,null,{"$f":"IFERROR(VLOOKUP(E664,'Tarif de base'!D:E,2,FALSE)*F664,\"\")","v":""},null,null,null,null,null,null,null,"non"]
[null,null,null,null,null,null,{"$f":"IFERROR(VLOOKUP(E665,'Tarif de base'!D:E,2,FALSE)*F665,\"\")","v":""},null,null,null,null,null,null,null,"non"]
[null,null,null,null,null,null,{"$f":"IFERROR(VLOOKUP(E666,'Tarif de base'!D:E,2,FALSE)*F666,\"\")","v":""},null,null,null,null,null,null,null,"non"]
[null,null,null,null,null,null,{"$f":"IFERROR(VLOOKUP(E667,'Tarif de base'!D:E,2,FALSE)*F667,\"\")","v":""},null,null,null,null,null,null,null,"non"]
[null,null,null,null,null,null,{"$f":"SUM(G662:G667)","v":0},null,null,null,null,null,null,null,"non"]
[null,null,null,null,null,null,{"$f":"IFERROR(VLOOKUP(E669,'Tarif de base'!D:E,2,FALSE)*F669,\"\")","v":""},null,null,null,{"$f":"IFERROR(IF(G675-H669-I669-J669<>0,\"Attention il manque \"&G675-H669-I669-J669&\"€\",\"Règlement OK\"),\"Pas de règlement\")","v":"Règlement OK"},null,"non",95,{"$f":"M669","v":"non"}]
[null,null,null,null,null,null,{"$f":"IFERROR(VLOOKUP(E670,'Tarif de base'!D:E,2,FALSE)*F670,\"\")","v":""},null,null,null,null,null,null,null,"non"]
[null,null,null,null,null,null,{"$f":"IFERROR(VLOOKUP(E671,'Tarif de base'!D:E,2,FALSE)*F671,\"\")","v":""},null,null,null,null,null,null,null,"non"]
[null,null,null,null,null,null,{"$f":"IFERROR(VLOOKUP(E672,'Tarif de base'!D:E,2,FALSE)*F672,\"\")","v":""},null,null,null,null,null,null,null,"non"]
[null,null,null,null,null,null,{"$f":"IFERROR(VLOOKUP(E673,'Tarif de base'!D:E,2,FALSE)*F673,\"\")","v":""},null,null,null,null,null,null,null,"non"]
[null,null,null,null,null,null,{"$f":"IFERROR(VLOOKUP(E674,'Tarif de base'!D:E,2,FALSE)*F674,\"\")","v":""},null,null,null,null,null,null,null,"non"]
[null,null,null,null,null,null,{"$f":"SUM(G669:G674)","v":0},null,null,null,null,null,null,null,"non"]
[null,null,null,null,null,null,{"$f":"IFERROR(VLOOKUP(E676,'Tarif de base'!D:E,2,FALSE)*F676,\"\")","v":""},null,null,null,{"$f":"IFERROR(IF(G682-H676-I676-J676<>0,\"Attention il manque \"&G682-H676-I676-J676&\"€\",\"Règlement OK\"),\"Pas de règlement\")","v":"Règlement OK"},null,"non",96,{"$f":"M676","v":"non"}]
[null,null,null,null,null,null,{"$f":"IFERROR(VLOOKUP(E677,'Tarif de base'!D:E,2,FALSE)*F677,\"\")","v":""},null,null,null,null,null,null,null,"non"]
[null,null,null,null,null,null,{"$f":"IFERROR(VLOOKUP(E678,'Tarif de base'!D:E,2,FALSE)*F678,\"\")","v":""},null,null,null,null,null,null,null,"non"]
[null,null,null,null,null,null,{"$f":"IFERROR(VLOOKUP(E679,'Tarif de base'!D:E,2,FALSE)*F679,\"\")","v":""},null,null,null,null,null,null,null,"non"]
[null,null,null,null,null,null,{"$f":"IFERROR(VLOOKUP(E680,'Tarif de base'!D:E,2,FALSE)*F680,\"\")","v":""},null,null,null,null,null,null,null,"non"]
[null,null,null,null,null,null,{"$f":"IFERROR(VLOOKUP(E681,'Tarif de base'!D:E,2,FALSE)*F681,\"\")","v":""},null,null,null,null,null,null,null,"non"]
[null,null,null,null,null,null,{"$f":"SUM(G676:G681)","v":0},null,null,null,null,null,null,null,"non"]
[null,null,null,null,null,null,{"$f":"IFERROR(VLOOKUP(E683,'Tarif de base'!D:E,2,FALSE)*F683,\"\")","v":""},null,null,null,{"$f":"IFERROR(IF(G689-H683-I683-J683<>0,\"Attention il manque \"&G689-H683-I683-J683&\"€\",\"Règlement OK\"),\"Pas de règlement\")","v":"Règlement OK"},null,"non",97,{"$f":"M683","v":"non"}]
[null,null,null,null,null,null,{"$f":"IFERROR(VLOOKUP(E684,'Tarif de base'!D:E,2,FALSE)*F684,\"\")","v":""},null,null,null,null,null,null,null,"non"]
[null,null,null,null,null,null,{"$f":"IFERROR(VLOOKUP(E685,'Tarif de base'!D:E,2,FALSE)*F685,\"\")","v":""},null,null,null,null,null,null,null,"non"]
[null,null,null,null,null,null,{"$f":"IFERROR(VLOOKUP(E686,'Tarif de base'!D:E,2,FALSE)*F686,\"\")","v":""},null,null,null,null,null,null,null,"non"]
[null,null,null,null,null,null,{"$f":"IFERROR(VLOOKUP(E687,'Tarif de base'!D:E,2,FALSE)*F687,\"\")","v":""},null,null,null,null,null,null,null,"non"]
[null,null,null,null,null,null,{"$f":"IFERROR(VLOOKUP(E688,'Tarif de base'!D:E,2,FALSE)*F688,\"\")","v":""},null,null,null,null,null,null,null,"non"]
[null,null,null,null,null,null,{"$f":"SUM(G683:G688)","v":0},null,null,null,null,null,null,null,"non"]
[null,null,null,null,null,null,{"$f":"IFERROR(VLOOKUP(E690,'Tarif de base'!D:E,2,FALSE)*F690,\"\")","v":""},null,null,null,{"$f":"IFERROR(IF(G696-H690-I690-J690<>0,\"Attention il manque \"&G696-H690-I690-J690&\"€\",\"Règlement OK\"),\"Pas de règlement\")","v":"Règlement OK"},null,"non",98,{"$f":"M690","v":"non"}]
[null,null,null,null,null,null,{"$f":"IFERROR(VLOOKUP(E691,'Tarif de base'!D:E,2,FALSE)*F691,\"\")","v":""},null,null,null,null,null,null,null,"non"]
[null,null,null,null,null,null,{"$f":"IFERROR(VLOOKUP(E692,'Tarif de base'!D:E,2,FALSE)*F692,\"\")","v":""},null,null,null,null,null,null,null,"non"]
[null,null,null,null,null,null,{"$f":"IFERROR(VLOOKUP(E693,'Tarif de base'!D:E,2,FALSE)*F693,\"\")","v":""},null,null,null,null,null,null,null,"non"]
[null,null,null,null,null,null,{"$f":"IFERROR(VLOOKUP(E694,'Tarif de base'!D:E,2,FALSE)*F694,\"\")","v":""},null,null,null,null,null,null,null,"non"]
[null,null,null,null,null,null,{"$f":"IFERROR(VLOOKUP(E695,'Tarif de base'!D:E,2,FALSE)*F695,\"\")","v":""},null,null,null,null,null,null,null,"non"]
[null,null,null,null,null,null,{"$f":"SUM(G690:G695)","v":0},null,null,null,null,null,null,null,"non"]
[null,null,null,null,null,null,{"$f":"IFERROR(VLOOKUP(E697,'Tarif de base'!D:E,2,FALSE)*F697,\"\")","v":""},null,null,null,{"$f":"IFERROR(IF(G703-H697-I697-J697<>0,\"Attention il manque \"&G703-H697-I697-J697&\"€\",\"Règlement OK\"),\"Pas de règlement\")","v":"Règlement OK"},null,"non",99,{"$f":"M697","v":"non"}]
[null,null,null,null,null,null,{"$f":"IFERROR(VLOOKUP(E698,'Tarif de base'!D:E,2,FALSE)*F698,\"\")","v":""},null,null,null,null,null,null,null,"non"]
[null,null,null,null,null,null,{"$f":"IFERROR(VLOOKUP(E699,'Tarif de base'!D:E,2,FALSE)*F699,\"\")","v":""},null,null,null,null,null,null,null,"non"]
[null,null,null,null,null,null,{"$f":"IFERROR(VLOOKUP(E700,'Tarif de base'!D:E,2,FALSE)*F700,\"\")","v":""},null,null,null,null,null,null,null,"non"]
[null,null,null,null,null,null,{"$f":"IFERROR(VLOOKUP(E701,'Tarif de base'!D:E,2,FALSE)*F701,\"\")","v":""},null,null,null,null,null,null,null,"non"]
[null,null,null,null,null,null,{"$f":"IFERROR(VLOOKUP(E702,'Tarif de base'!D:E,2,FALSE)*F702,\"\")","v":""},null,null,null,null,null,null,null,"non"]
[null,null,null,null,null,null,{"$f":"SUM(G697:G702)","v":0},null,null,null,null,null,null,null,"non"]
[null,null,null,null,null,null,{"$f":"IFERROR(VLOOKUP(E704,'Tarif de base'!D:E,2,FALSE)*F704,\"\")","v":""},null,null,null,{"$f":"IFERROR(IF(G710-H704-I704-J704<>0,\"Attention il manque \"&G710-H704-I704-J704&\"€\",\"Règlement OK\"),\"Pas de règlement\")","v":"Règlement OK"},null,"non",100,{"$f":"M704","v":"non"}]
[null,null,null,null,null,null,{"$f":"IFERROR(VLOOKUP(E705,'Tarif de base'!D:E,2,FALSE)*F705,\"\")","v":""},null,null,null,null,null,null,null,"non"]
[null,null,null,null,null,null,{"$f":"IFERROR(VLOOKUP(E706,'Tarif de base'!D:E,2,FALSE)*F706,\"\")","v":""},null,null,null,null,null,null,null,"non"]
[null,null,null,null,null,null,{"$f":"IFERROR(VLOOKUP(E707,'Tarif de base'!D:E,2,FALSE)*F707,\"\")","v":""},null,null,null,null,null,null,null,"non"]
[null,null,null,null,null,null,{"$f":"IFERROR(VLOOKUP(E708,'Tarif de base'!D:E,2,FALSE)*F708,\"\")","v":""},null,null,null,null,null,null,null,"non"]
[null,null,null,null,null,null,{"$f":"IFERROR(VLOOKUP(E709,'Tarif de base'!D:E,2,FALSE)*F709,\"\")","v":""},null,null,null,null,null,null,null,"non"]
[null,null,null,null,null,null,{"$f":"SUM(G704:G709)","v":0},null,null,null,null,null,null,null,"non"]
[null,null,null,null,null,null,{"$f":"IFERROR(VLOOKUP(E711,'Tarif de base'!D:E,2,FALSE)*F711,\"\")","v":""},null,null,null,{"$f":"IFERROR(IF(G717-H711-I711-J711<>0,\"Attention il manque \"&G717-H711-I711-J711&\"€\",\"Règlement OK\"),\"Pas de règlement\")","v":"Règlement OK"},null,"non",101,{"$f":"M711","v":"non"}]
[null,null,null,null,null,null,{"$f":"IFERROR(VLOOKUP(E712,'Tarif de base'!D:E,2,FALSE)*F712,\"\")","v":""},null,null,null,null,null,null,null,"non"]
[null,null,null,null,null,null,{"$f":"IFERROR(VLOOKUP(E713,'Tarif de base'!D:E,2,FALSE)*F713,\"\")","v":""},null,null,null,null,null,null,null,"non"]
[null,null,null,null,null,null,{"$f":"IFERROR(VLOOKUP(E714,'Tarif de base'!D:E,2,FALSE)*F714,\"\")","v":""},null,null,null,null,null,null,null,"non"]
[null,null,null,null,null,null,{"$f":"IFERROR(VLOOKUP(E715,'Tarif de base'!D:E,2,FALSE)*F715,\"\")","v":""},null,null,null,null,null,null,null,"non"]
[null,null,null,null,null,null,{"$f":"IFERROR(VLOOKUP(E716,'Tarif de base'!D:E,2,FALSE)*F716,\"\")","v":""},null,null,null,null,null,null,null,"non"]
[null,null,null,null,null,null,{"$f":"SUM(G711:G716)","v":0},null,null,null,null,null,null,null,"non"]
[null,null,null,null,null,null,{"$f":"IFERROR(VLOOKUP(E718,'Tarif de base'!D:E,2,FALSE)*F718,\"\")","v":""},null,null,null,{"$f":"IFERROR(IF(G724-H718-I718-J718<>0,\"Attention il manque \"&G724-H718-I718-J718&\"€\",\"Règlement OK\"),\"Pas de règlement\")","v":"Règlement OK"},null,"non",102,{"$f":"M718","v":"non"}]
[null,null,null,null,null,null,{"$f":"IFERROR(VLOOKUP(E719,'Tarif de base'!D:E,2,FALSE)*F719,\"\")","v":""},null,null,null,null,null,null,null,"non"]
[null,null,null,null,null,null,{"$f":"IFERROR(VLOOKUP(E720,'Tarif de base'!D:E,2,FALSE)*F720,\"\")","v":""},null,null,null,null,null,null,null,"non"]
[null,null,null,null,null,null,{"$f":"IFERROR(VLOOKUP(E721,'Tarif de base'!D:E,2,FALSE)*F721,\"\")","v":""},null,null,null,null,null,null,null,{"$f":"O720","v":"non"}]
[null,null,null,null,null,null,{"$f":"IFERROR(VLOOKUP(E722,'Tarif de base'!D:E,2,FALSE)*F722,\"\")","v":""},null,null,null,null,null,null,null,"non"]
[null,null,null,null,null,null,{"$f":"IFERROR(VLOOKUP(E723,'Tarif de base'!D:E,2,FALSE)*F723,\"\")","v":""},null,null,null,null,null,null,null,"non"]
[null,null,null,null,null,null,{"$f":"SUM(G718:G723)","v":0},null,null,null,null,null,null,null,"non"]
[null,null,null,null,null,null,{"$f":"IFERROR(VLOOKUP(E725,'Tarif de base'!D:E,2,FALSE)*F725,\"\")","v":""},null,null,null,{"$f":"IFERROR(IF(G731-H725-I725-J725<>0,\"Attention il manque \"&G731-H725-I725-J725&\"€\",\"Règlement OK\"),\"Pas de règlement\")","v":"Règlement OK"},null,"non",103,{"$f":"M725","v":"non"}]
[null,null,null,null,null,null,{"$f":"IFERROR(VLOOKUP(E726,'Tarif de base'!D:E,2,FALSE)*F726,\"\")","v":""},null,null,null,null,null,null,null,"non"]
[null,null,null,null,null,null,{"$f":"IFERROR(VLOOKUP(E727,'Tarif de base'!D:E,2,FALSE)*F727,\"\")","v":""},null,null,null,null,null,null,null,"non"]
[null,null,null,null,null,null,{"$f":"IFERROR(VLOOKUP(E728,'Tarif de base'!D:E,2,FALSE)*F728,\"\")","v":""},null,null,null,null,null,null,null,"non"]
[null,null,null,null,null,null,{"$f":"IFERROR(VLOOKUP(E729,'Tarif de base'!D:E,2,FALSE)*F729,\"\")","v":""},null,null,null,null,null,null,null,"non"]
[null,null,null,null,null,null,{"$f":"IFERROR(VLOOKUP(E730,'Tarif de base'!D:E,2,FALSE)*F730,\"\")","v":""},null,null,null,null,null,null,null,"non"]
[null,null,null,null,null,null,{"$f":"SUM(G725:G730)","v":0},null,null,null,null,null,null,null,"non"]
[null,null,null,null,null,null,{"$f":"IFERROR(VLOOKUP(E732,'Tarif de base'!D:E,2,FALSE)*F732,\"\")","v":""},null,null,null,{"$f":"IFERROR(IF(G738-H732-I732-J732<>0,\"Attention il manque \"&G738-H732-I732-J732&\"€\",\"Règlement OK\"),\"Pas de règlement\")","v":"Règlement OK"},null,"non",104,{"$f":"M732","v":"non"}]
[null,null,null,null,null,null,{"$f":"IFERROR(VLOOKUP(E733,'Tarif de base'!D:E,2,FALSE)*F733,\"\")","v":""},null,null,null,null,null,null,null,"non"]
[null,null,null,null,null,null,{"$f":"IFERROR(VLOOKUP(E734,'Tarif de base'!D:E,2,FALSE)*F734,\"\")","v":""},null,null,null,null,null,null,null,"non"]
[null,null,null,null,null,null,{"$f":"IFERROR(VLOOKUP(E735,'Tarif de base'!D:E,2,FALSE)*F735,\"\")","v":""},null,null,null,null,null,null,null,"non"]
[null,null,null,null,null,null,{"$f":"IFERROR(VLOOKUP(E736,'Tarif de base'!D:E,2,FALSE)*F736,\"\")","v":""},null,null,null,null,null,null,null,"non"]
[null,null,null,null,null,null,{"$f":"IFERROR(VLOOKUP(E737,'Tarif de base'!D:E,2,FALSE)*F737,\"\")","v":""},null,null,null,null,null,null,null,"non"]
[null,null,null,null,null,null,{"$f":"SUM(G732:G737)","v":0},null,null,null,null,null,null,null,"non"]
[null,null,null,null,null,null,{"$f":"IFERROR(VLOOKUP(E739,'Tarif de base'!D:E,2,FALSE)*F739,\"\")","v":""},null,null,null,{"$f":"IFERROR(IF(G745-H739-I739-J739<>0,\"Attention il manque \"&G745-H739-I739-J739&\"€\",\"Règlement OK\"),\"Pas de règlement\")","v":"Règlement OK"},null,"non",105,{"$f":"M739","v":"non"}]
[null,null,null,null,null,null,{"$f":"IFERROR(VLOOKUP(E740,'Tarif de base'!D:E,2,FALSE)*F740,\"\")","v":""},null,null,null,null,null,null,null,"non"]
[null,null,null,null,null,null,{"$f":"IFERROR(VLOOKUP(E741,'Tarif de base'!D:E,2,FALSE)*F741,\"\")","v":""},null,null,null,null,null,null,null,"non"]
[null,null,null,null,null,null,{"$f":"IFERROR(VLOOKUP(E742,'Tarif de base'!D:E,2,FALSE)*F742,\"\")","v":""},null,null,null,null,null,null,null,"non"]
[null,null,null,null,null,null,{"$f":"IFERROR(VLOOKUP(E743,'Tarif de base'!D:E,2,FALSE)*F743,\"\")","v":""},null,null,null,null,null,null,null,"non"]
[null,null,null,null,null,null,{"$f":"IFERROR(VLOOKUP(E744,'Tarif de base'!D:E,2,FALSE)*F744,\"\")","v":""},null,null,null,null,null,null,null,"non"]
[null,null,null,null,null,null,{"$f":"SUM(G739:G744)","v":0},null,null,null,null,null,null,null,"non"]
[null,null,null,null,null,null,{"$f":"IFERROR(VLOOKUP(E746,'Tarif de base'!D:E,2,FALSE)*F746,\"\")","v":""},null,null,null,{"$f":"IFERROR(IF(G752-H746-I746-J746<>0,\"Attention il manque \"&G752-H746-I746-J746&\"€\",\"Règlement OK\"),\"Pas de règlement\")","v":"Règlement OK"},null,"non",106,{"$f":"M746","v":"non"}]
[null,null,null,null,null,null,{"$f":"IFERROR(VLOOKUP(E747,'Tarif de base'!D:E,2,FALSE)*F747,\"\")","v":""},null,null,null,null,null,null,null,{"$f":"O746","v":"non"}]
[null,null,null,null,null,null,{"$f":"IFERROR(VLOOKUP(E748,'Tarif de base'!D:E,2,FALSE)*F748,\"\")","v":""},null,null,null,null,null,null,null,"non"]
[null,null,null,null,null,null,{"$f":"IFERROR(VLOOKUP(E749,'Tarif de base'!D:E,2,FALSE)*F749,\"\")","v":""},null,null,null,null,null,null,null,"non"]
[null,null,null,null,null,null,{"$f":"IFERROR(VLOOKUP(E750,'Tarif de base'!D:E,2,FALSE)*F750,\"\")","v":""},null,null,null,null,null,null,null,"non"]
[null,null,null,null,null,null,{"$f":"IFERROR(VLOOKUP(E751,'Tarif de base'!D:E,2,FALSE)*F751,\"\")","v":""},null,null,null,null,null,null,null,"non"]
[null,null,null,null,null,null,{"$f":"SUM(G746:G751)","v":0},null,null,null,null,null,null,null,"non"]
[null,null,null,null,null,null,{"$f":"IFERROR(VLOOKUP(E753,'Tarif de base'!D:E,2,FALSE)*F753,\"\")","v":""},null,null,null,{"$f":"IFERROR(IF(G759-H753-I753-J753<>0,\"Attention il manque \"&G759-H753-I753-J753&\"€\",\"Règlement OK\"),\"Pas de règlement\")","v":"Règlement OK"},null,"non",107,{"$f":"M753","v":"non"}]
[null,null,null,null,null,null,{"$f":"IFERROR(VLOOKUP(E754,'Tarif de base'!D:E,2,FALSE)*F754,\"\")","v":""},null,null,null,null,null,null,null,"non"]
[null,null,null,null,null,null,{"$f":"IFERROR(VLOOKUP(E755,'Tarif de base'!D:E,2,FALSE)*F755,\"\")","v":""},null,null,null,null,null,null,null,"non"]
[null,null,null,null,null,null,{"$f":"IFERROR(VLOOKUP(E756,'Tarif de base'!D:E,2,FALSE)*F756,\"\")","v":""},null,null,null,null,null,null,null,"non"]
[null,null,null,null,null,null,{"$f":"IFERROR(VLOOKUP(E757,'Tarif de base'!D:E,2,FALSE)*F757,\"\")","v":""},null,null,null,null,null,null,null,"non"]
[null,null,null,null,null,null,{"$f":"IFERROR(VLOOKUP(E758,'Tarif de base'!D:E,2,FALSE)*F758,\"\")","v":""},null,null,null,null,null,null,null,"non"]
[null,null,null,null,null,null,{"$f":"SUM(G753:G758)","v":0},null,null,null,null,null,null,null,"non"]
[null,null,null,null,null,null,{"$f":"IFERROR(VLOOKUP(E760,'Tarif de base'!D:E,2,FALSE)*F760,\"\")","v":""},null,null,null,{"$f":"IFERROR(IF(G766-H760-I760-J760<>0,\"Attention il manque \"&G766-H760-I760-J760&\"€\",\"Règlement OK\"),\"Pas de règlement\")","v":"Règlement OK"},null,"non",108,{"$f":"M760","v":"non"}]
[null,null,null,null,null,null,{"$f":"IFERROR(VLOOKUP(E761,'Tarif de base'!D:E,2,FALSE)*F761,\"\")","v":""},null,null,null,null,null,null,null,"non"]
[null,null,null,null,null,null,{"$f":"IFERROR(VLOOKUP(E762,'Tarif de base'!D:E,2,FALSE)*F762,\"\")","v":""},null,null,null,null,null,null,null,"non"]
[null,null,null,null,null,null,{"$f":"IFERROR(VLOOKUP(E763,'Tarif de base'!D:E,2,FALSE)*F763,\"\")","v":""},null,null,null,null,null,null,null,"non"]
[null,null,null,null,null,null,{"$f":"IFERROR(VLOOKUP(E764,'Tarif de base'!D:E,2,FALSE)*F764,\"\")","v":""},null,null,null,null,null,null,null,"non"]
[null,null,null,null,null,null,{"$f":"IFERROR(VLOOKUP(E765,'Tarif de base'!D:E,2,FALSE)*F765,\"\")","v":""},null,null,null,null,null,null,null,"non"]
[null,null,null,null,null,null,{"$f":"SUM(G760:G765)","v":0},null,null,null,null,null,null,null,"non"]
[null,null,null,null,null,null,{"$f":"IFERROR(VLOOKUP(E767,'Tarif de base'!D:E,2,FALSE)*F767,\"\")","v":""},null,null,null,{"$f":"IFERROR(IF(G773-H767-I767-J767<>0,\"Attention il manque \"&G773-H767-I767-J767&\"€\",\"Règlement OK\"),\"Pas de règlement\")","v":"Règlement OK"},null,"non",109,{"$f":"M767","v":"non"}]
[null,null,null,null,null,null,{"$f":"IFERROR(VLOOKUP(E768,'Tarif de base'!D:E,2,FALSE)*F768,\"\")","v":""},null,null,null,null,null,null,null,"non"]
[null,null,null,null,null,null,{"$f":"IFERROR(VLOOKUP(E769,'Tarif de base'!D:E,2,FALSE)*F769,\"\")","v":""},null,null,null,null,null,null,null,"non"]
[null,null,null,null,null,null,{"$f":"IFERROR(VLOOKUP(E770,'Tarif de base'!D:E,2,FALSE)*F770,\"\")","v":""},null,null,null,null,null,null,null,"non"]
[null,null,null,null,null,null,{"$f":"IFERROR(VLOOKUP(E771,'Tarif de base'!D:E,2,FALSE)*F771,\"\")","v":""},null,null,null,null,null,null,null,"non"]
[null,null,null,null,null,null,{"$f":"IFERROR(VLOOKUP(E772,'Tarif de base'!D:E,2,FALSE)*F772,\"\")","v":""},null,null,null,null,null,null,null,"non"]
[null,null,null,null,null,null,{"$f":"SUM(G767:G772)","v":0},null,null,null,null,null,null,null,"non"]
[null,null,null,null,null,null,{"$f":"IFERROR(VLOOKUP(E774,'Tarif de base'!D:E,2,FALSE)*F774,\"\")","v":""},null,null,null,{"$f":"IFERROR(IF(G780-H774-I774-J774<>0,\"Attention il manque \"&G780-H774-I774-J774&\"€\",\"Règlement OK\"),\"Pas de règlement\")","v":"Règlement OK"},null,"non",110,{"$f":"M774","v":"non"}]
[null,null,null,null,null,null,{"$f":"IFERROR(VLOOKUP(E775,'Tarif de base'!D:E,2,FALSE)*F775,\"\")","v":""},null,null,null,null,null,null,null,{"$f":"O774","v":"non"}]
[null,null,null,null,null,null,{"$f":"IFERROR(VLOOKUP(E776,'Tarif de base'!D:E,2,FALSE)*F776,\"\")","v":""},null,null,null,null,null,null,null,{"$f":"O775","v":"non"}]
[null,null,null,null,null,null,{"$f":"IFERROR(VLOOKUP(E777,'Tarif de base'!D:E,2,FALSE)*F777,\"\")","v":""},null,null,null,null,null,null,null,"non"]
[null,null,null,null,null,null,{"$f":"IFERROR(VLOOKUP(E778,'Tarif de base'!D:E,2,FALSE)*F778,\"\")","v":""},null,null,null,null,null,null,null,"non"]
[null,null,null,null,null,null,{"$f":"IFERROR(VLOOKUP(E779,'Tarif de base'!D:E,2,FALSE)*F779,\"\")","v":""},null,null,null,null,null,null,null,"non"]
[null,null,null,null,null,null,{"$f":"SUM(G774:G779)","v":0},null,null,null,null,null,null,null,"non"]
[null,null,null,null,null,null,{"$f":"IFERROR(VLOOKUP(E781,'Tarif de base'!D:E,2,FALSE)*F781,\"\")","v":""},null,null,null,{"$f":"IFERROR(IF(G787-H781-I781-J781<>0,\"Attention il manque \"&G787-H781-I781-J781&\"€\",\"Règlement OK\"),\"Pas de règlement\")","v":"Règlement OK"},null,"non",111,{"$f":"M781","v":"non"}]
[null,null,null,null,null,null,{"$f":"IFERROR(VLOOKUP(E782,'Tarif de base'!D:E,2,FALSE)*F782,\"\")","v":""},null,null,null,null,null,null,null,{"$f":"O781","v":"non"}]
[null,null,null,null,null,null,{"$f":"IFERROR(VLOOKUP(E783,'Tarif de base'!D:E,2,FALSE)*F783,\"\")","v":""},null,null,null,null,null,null,null,{"$f":"O782","v":"non"}]
[null,null,null,null,null,null,{"$f":"IFERROR(VLOOKUP(E784,'Tarif de base'!D:E,2,FALSE)*F784,\"\")","v":""},null,null,null,null,null,null,null,"non"]
[null,null,null,null,null,null,{"$f":"IFERROR(VLOOKUP(E785,'Tarif de base'!D:E,2,FALSE)*F785,\"\")","v":""},null,null,null,null,null,null,null,"non"]
[null,null,null,null,null,null,{"$f":"IFERROR(VLOOKUP(E786,'Tarif de base'!D:E,2,FALSE)*F786,\"\")","v":""},null,null,null,null,null,null,null,"non"]
[null,null,null,null,null,null,{"$f":"SUM(G781:G786)","v":0},null,null,null,null,null,null,null,"non"]
[null,null,null,null,null,null,{"$f":"IFERROR(VLOOKUP(E788,'Tarif de base'!D:E,2,FALSE)*F788,\"\")","v":""},null,null,null,{"$f":"IFERROR(IF(G794-H788-I788-J788<>0,\"Attention il manque \"&G794-H788-I788-J788&\"€\",\"Règlement OK\"),\"Pas de règlement\")","v":"Règlement OK"},null,"non",112,{"$f":"M788","v":"non"}]
[null,null,null,null,null,null,{"$f":"IFERROR(VLOOKUP(E789,'Tarif de base'!D:E,2,FALSE)*F789,\"\")","v":""},null,null,null,null,null,null,null,"non"]
[null,null,null,null,null,null,{"$f":"IFERROR(VLOOKUP(E790,'Tarif de base'!D:E,2,FALSE)*F790,\"\")","v":""},null,null,null,null,null,null,null,"non"]
[null,null,null,null,null,null,{"$f":"IFERROR(VLOOKUP(E791,'Tarif de base'!D:E,2,FALSE)*F791,\"\")","v":""},null,null,null,null,null,null,null,"non"]
[null,null,null,null,null,null,{"$f":"IFERROR(VLOOKUP(E792,'Tarif de base'!D:E,2,FALSE)*F792,\"\")","v":""},null,null,null,null,null,null,null,"non"]
[null,null,null,null,null,null,{"$f":"IFERROR(VLOOKUP(E793,'Tarif de base'!D:E,2,FALSE)*F793,\"\")","v":""},null,null,null,null,null,null,null,"non"]
[null,null,null,null,null,null,{"$f":"SUM(G788:G793)","v":0},null,null,null,null,null,null,null,"non"]
[null,null,null,null,null,null,{"$f":"IFERROR(VLOOKUP(E795,'Tarif de base'!D:E,2,FALSE)*F795,\"\")","v":""},null,null,null,{"$f":"IFERROR(IF(G801-H795-I795-J795<>0,\"Attention il manque \"&G801-H795-I795-J795&\"€\",\"Règlement OK\"),\"Pas de règlement\")","v":"Règlement OK"},null,"non",113,{"$f":"M795","v":"non"}]
[null,null,null,null,null,null,{"$f":"IFERROR(VLOOKUP(E796,'Tarif de base'!D:E,2,FALSE)*F796,\"\")","v":""},null,null,null,null,null,null,null,"non"]
[null,null,null,null,null,null,{"$f":"IFERROR(VLOOKUP(E797,'Tarif de base'!D:E,2,FALSE)*F797,\"\")","v":""},null,null,null,null,null,null,null,"non"]
[null,null,null,null,null,null,{"$f":"IFERROR(VLOOKUP(E798,'Tarif de base'!D:E,2,FALSE)*F798,\"\")","v":""},null,null,null,null,null,null,null,"non"]
[null,null,null,null,null,null,{"$f":"IFERROR(VLOOKUP(E799,'Tarif de base'!D:E,2,FALSE)*F799,\"\")","v":""},null,null,null,null,null,null,null,"non"]
[null,null,null,null,null,null,{"$f":"IFERROR(VLOOKUP(E800,'Tarif de base'!D:E,2,FALSE)*F800,\"\")","v":""},null,null,null,null,null,null,null,"non"]
[null,null,null,null,null,null,{"$f":"SUM(G795:G800)","v":0},null,null,null,null,null,null,null,"non"]
[null,null,null,null,null,null,{"$f":"IFERROR(VLOOKUP(E802,'Tarif de base'!D:E,2,FALSE)*F802,\"\")","v":""},null,null,null,{"$f":"IFERROR(IF(G808-H802-I802-J802<>0,\"Attention il manque \"&G808-H802-I802-J802&\"€\",\"Règlement OK\"),\"Pas de règlement\")","v":"Règlement OK"},null,"non",114,{"$f":"M802","v":"non"}]
[null,null,null,null,null,null,{"$f":"IFERROR(VLOOKUP(E803,'Tarif de base'!D:E,2,FALSE)*F803,\"\")","v":""},null,null,null,null,null,null,null,"non"]
[null,null,null,null,null,null,{"$f":"IFERROR(VLOOKUP(E804,'Tarif de base'!D:E,2,FALSE)*F804,\"\")","v":""},null,null,null,null,null,null,null,"non"]
[null,null,null,null,null,null,{"$f":"IFERROR(VLOOKUP(E805,'Tarif de base'!D:E,2,FALSE)*F805,\"\")","v":""},null,null,null,null,null,null,null,"non"]
[null,null,null,null,null,null,{"$f":"IFERROR(VLOOKUP(E806,'Tarif de base'!D:E,2,FALSE)*F806,\"\")","v":""},null,null,null,null,null,null,null,"non"]
[null,null,null,null,null,null,{"$f":"IFERROR(VLOOKUP(E807,'Tarif de base'!D:E,2,FALSE)*F807,\"\")","v":""},null,null,null,null,null,null,null,"non"]
[null,null,null,null,null,null,{"$f":"SUM(G802:G807)","v":0},null,null,null,null,null,null,null,"non"]
[null,null,null,null,null,null,{"$f":"IFERROR(VLOOKUP(E809,'Tarif de base'!D:E,2,FALSE)*F809,\"\")","v":""},null,null,null,{"$f":"IFERROR(IF(G815-H809-I809-J809<>0,\"Attention il manque \"&G815-H809-I809-J809&\"€\",\"Règlement OK\"),\"Pas de règlement\")","v":"Règlement OK"},null,"non",115,{"$f":"M809","v":"non"}]
[null,null,null,null,null,null,{"$f":"IFERROR(VLOOKUP(E810,'Tarif de base'!D:E,2,FALSE)*F810,\"\")","v":""},null,null,null,null,null,null,null,"non"]
[null,null,null,null,null,null,{"$f":"IFERROR(VLOOKUP(E811,'Tarif de base'!D:E,2,FALSE)*F811,\"\")","v":""},null,null,null,null,null,null,null,"non"]
[null,null,null,null,null,null,{"$f":"IFERROR(VLOOKUP(E812,'Tarif de base'!D:E,2,FALSE)*F812,\"\")","v":""},null,null,null,null,null,null,null,"non"]
[null,null,null,null,null,null,{"$f":"IFERROR(VLOOKUP(E813,'Tarif de base'!D:E,2,FALSE)*F813,\"\")","v":""},null,null,null,null,null,null,null,"non"]
[null,null,null,null,null,null,{"$f":"IFERROR(VLOOKUP(E814,'Tarif de base'!D:E,2,FALSE)*F814,\"\")","v":""},null,null,null,null,null,null,null,"non"]
[null,null,null,null,null,null,{"$f":"SUM(G809:G814)","v":0},null,null,null,null,null,null,null,"non"]
[null,null,null,null,null,null,{"$f":"IFERROR(VLOOKUP(E816,'Tarif de base'!D:E,2,FALSE)*F816,\"\")","v":""},null,null,null,{"$f":"IFERROR(IF(G822-H816-I816-J816<>0,\"Attention il manque \"&G822-H816-I816-J816&\"€\",\"Règlement OK\"),\"Pas de règlement\")","v":"Règlement OK"},null,"non",116,{"$f":"M816","v":"non"}]
[null,null,null,null,null,null,{"$f":"IFERROR(VLOOKUP(E817,'Tarif de base'!D:E,2,FALSE)*F817,\"\")","v":""},null,null,null,null,null,null,null,"non"]
[null,null,null,null,null,null,{"$f":"IFERROR(VLOOKUP(E818,'Tarif de base'!D:E,2,FALSE)*F818,\"\")","v":""},null,null,null,null,null,null,null,"non"]
[null,null,null,null,null,null,{"$f":"IFERROR(VLOOKUP(E819,'Tarif de base'!D:E,2,FALSE)*F819,\"\")","v":""},null,null,null,null,null,null,null,"non"]
[null,null,null,null,null,null,{"$f":"IFERROR(VLOOKUP(E820,'Tarif de base'!D:E,2,FALSE)*F820,\"\")","v":""},null,null,null,null,null,null,null,"non"]
[null,null,null,null,null,null,{"$f":"IFERROR(VLOOKUP(E821,'Tarif de base'!D:E,2,FALSE)*F821,\"\")","v":""},null,null,null,null,null,null,null,"non"]
[null,null,null,null,null,null,{"$f":"SUM(G816:G821)","v":0},null,null,null,null,null,null,null,"non"]
[null,null,null,null,null,null,{"$f":"IFERROR(VLOOKUP(E823,'Tarif de base'!D:E,2,FALSE)*F823,\"\")","v":""},null,null,null,{"$f":"IFERROR(IF(G829-H823-I823-J823<>0,\"Attention il manque \"&G829-H823-I823-J823&\"€\",\"Règlement OK\"),\"Pas de règlement\")","v":"Règlement OK"},null,"non",117,{"$f":"M823","v":"non"}]
[null,null,null,null,null,null,{"$f":"IFERROR(VLOOKUP(E824,'Tarif de base'!D:E,2,FALSE)*F824,\"\")","v":""},null,null,null,null,null,null,null,"non"]
[null,null,null,null,null,null,{"$f":"IFERROR(VLOOKUP(E825,'Tarif de base'!D:E,2,FALSE)*F825,\"\")","v":""},null,null,null,null,null,null,null,"non"]
[null,null,null,null,null,null,{"$f":"IFERROR(VLOOKUP(E826,'Tarif de base'!D:E,2,FALSE)*F826,\"\")","v":""},null,null,null,null,null,null,null,"non"]
[null,null,null,null,null,null,{"$f":"IFERROR(VLOOKUP(E827,'Tarif de base'!D:E,2,FALSE)*F827,\"\")","v":""},null,null,null,null,null,null,null,"non"]
[null,null,null,null,null,null,{"$f":"IFERROR(VLOOKUP(E828,'Tarif de base'!D:E,2,FALSE)*F828,\"\")","v":""},null,null,null,null,null,null,null,"non"]
[null,null,null,null,null,null,{"$f":"SUM(G823:G828)","v":0},null,null,null,null,null,null,null,"non"]
[null,null,null,null,null,null,{"$f":"IFERROR(VLOOKUP(E830,'Tarif de base'!D:E,2,FALSE)*F830,\"\")","v":""},null,null,null,{"$f":"IFERROR(IF(G836-H830-I830-J830<>0,\"Attention il manque \"&G836-H830-I830-J830&\"€\",\"Règlement OK\"),\"Pas de règlement\")","v":"Règlement OK"},null,"non",118,{"$f":"M830","v":"non"}]
[null,null,null,null,null,null,{"$f":"IFERROR(VLOOKUP(E831,'Tarif de base'!D:E,2,FALSE)*F831,\"\")","v":""},null,null,null,null,null,null,null,"non"]
[null,null,null,null,null,null,{"$f":"IFERROR(VLOOKUP(E832,'Tarif de base'!D:E,2,FALSE)*F832,\"\")","v":""},null,null,null,null,null,null,null,"non"]
[null,null,null,null,null,null,{"$f":"IFERROR(VLOOKUP(E833,'Tarif de base'!D:E,2,FALSE)*F833,\"\")","v":""},null,null,null,null,null,null,null,"non"]
[null,null,null,null,null,null,{"$f":"IFERROR(VLOOKUP(E834,'Tarif de base'!D:E,2,FALSE)*F834,\"\")","v":""},null,null,null,null,null,null,null,"non"]
[null,null,null,null,null,null,{"$f":"IFERROR(VLOOKUP(E835,'Tarif de base'!D:E,2,FALSE)*F835,\"\")","v":""},null,null,null,null,null,null,null,"non"]
[null,null,null,null,null,null,{"$f":"SUM(G830:G835)","v":0},null,null,null,null,null,null,null,"non"]
[null,null,null,null,null,null,{"$f":"IFERROR(VLOOKUP(E837,'Tarif de base'!D:E,2,FALSE)*F837,\"\")","v":""},null,null,null,{"$f":"IFERROR(IF(G843-H837-I837-J837<>0,\"Attention il manque \"&G843-H837-I837-J837&\"€\",\"Règlement OK\"),\"Pas de règlement\")","v":"Règlement OK"},null,"non",119,{"$f":"M837","v":"non"}]
[null,null,null,null,null,null,{"$f":"IFERROR(VLOOKUP(E838,'Tarif de base'!D:E,2,FALSE)*F838,\"\")","v":""},null,null,null,null,null,null,null,"non"]
[null,null,null,null,null,null,{"$f":"IFERROR(VLOOKUP(E839,'Tarif de base'!D:E,2,FALSE)*F839,\"\")","v":""},null,null,null,null,null,null,null,"non"]
[null,null,null,null,null,null,{"$f":"IFERROR(VLOOKUP(E840,'Tarif de base'!D:E,2,FALSE)*F840,\"\")","v":""},null,null,null,null,null,null,null,"non"]
[null,null,null,null,null,null,{"$f":"IFERROR(VLOOKUP(E841,'Tarif de base'!D:E,2,FALSE)*F841,\"\")","v":""},null,null,null,null,null,null,null,"non"]
[null,null,null,null,null,null,{"$f":"IFERROR(VLOOKUP(E842,'Tarif de base'!D:E,2,FALSE)*F842,\"\")","v":""},null,null,null,null,null,null,null,"non"]
[null,null,null,null,null,null,{"$f":"SUM(G837:G842)","v":0},null,null,null,null,null,null,null,"non"]
[null,null,null,null,null,null,{"$f":"IFERROR(VLOOKUP(E844,'Tarif de base'!D:E,2,FALSE)*F844,\"\")","v":""},null,null,null,{"$f":"IFERROR(IF(G850-H844-I844-J844<>0,\"Attention il manque \"&G850-H844-I844-J844&\"€\",\"Règlement OK\"),\"Pas de règlement\")","v":"Règlement OK"},null,"non",120,{"$f":"M844","v":"non"}]
[null,null,null,null,null,null,{"$f":"IFERROR(VLOOKUP(E845,'Tarif de base'!D:E,2,FALSE)*F845,\"\")","v":""},null,null,null,null,null,null,null,"non"]
[null,null,null,null,null,null,{"$f":"IFERROR(VLOOKUP(E846,'Tarif de base'!D:E,2,FALSE)*F846,\"\")","v":""},null,null,null,null,null,null,null,"non"]
[null,null,null,null,null,null,{"$f":"IFERROR(VLOOKUP(E847,'Tarif de base'!D:E,2,FALSE)*F847,\"\")","v":""},null,null,null,null,null,null,null,{"$f":"O846","v":"non"}]
[null,null,null,null,null,null,{"$f":"IFERROR(VLOOKUP(E848,'Tarif de base'!D:E,2,FALSE)*F848,\"\")","v":""},null,null,null,null,null,null,null,"non"]
[null,null,null,null,null,null,{"$f":"IFERROR(VLOOKUP(E849,'Tarif de base'!D:E,2,FALSE)*F849,\"\")","v":""},null,null,null,null,null,null,null,"non"]
[null,null,null,null,null,null,{"$f":"SUM(G844:G849)","v":0},null,null,null,null,null,null,null,"non"]
[null,null,null,null,null,null,{"$f":"IFERROR(VLOOKUP(E851,'Tarif de base'!D:E,2,FALSE)*F851,\"\")","v":""},null,null,null,{"$f":"IFERROR(IF(G857-H851-I851-J851<>0,\"Attention il manque \"&G857-H851-I851-J851&\"€\",\"Règlement OK\"),\"Pas de règlement\")","v":"Règlement OK"},null,"non",121,{"$f":"M851","v":"non"}]
[null,null,null,null,null,null,{"$f":"IFERROR(VLOOKUP(E852,'Tarif de base'!D:E,2,FALSE)*F852,\"\")","v":""},null,null,null,null,null,null,null,"non"]
[null,null,null,null,null,null,{"$f":"IFERROR(VLOOKUP(E853,'Tarif de base'!D:E,2,FALSE)*F853,\"\")","v":""},null,null,null,null,null,null,null,"non"]
[null,null,null,null,null,null,{"$f":"IFERROR(VLOOKUP(E854,'Tarif de base'!D:E,2,FALSE)*F854,\"\")","v":""},null,null,null,null,null,null,null,"non"]
[null,null,null,null,null,null,{"$f":"IFERROR(VLOOKUP(E855,'Tarif de base'!D:E,2,FALSE)*F855,\"\")","v":""},null,null,null,null,null,null,null,"non"]
[null,null,null,null,null,null,{"$f":"IFERROR(VLOOKUP(E856,'Tarif de base'!D:E,2,FALSE)*F856,\"\")","v":""},null,null,null,null,null,null,null,"non"]
[null,null,null,null,null,null,{"$f":"SUM(G851:G856)","v":0},null,null,null,null,null,null,null,"non"]
[null,null,null,null,null,null,{"$f":"IFERROR(VLOOKUP(E858,'Tarif de base'!D:E,2,FALSE)*F858,\"\")","v":""},null,null,null,{"$f":"IFERROR(IF(G864-H858-I858-J858<>0,\"Attention il manque \"&G864-H858-I858-J858&\"€\",\"Règlement OK\"),\"Pas de règlement\")","v":"Règlement OK"},null,"non",122,{"$f":"M858","v":"non"}]
[null,null,null,null,null,null,{"$f":"IFERROR(VLOOKUP(E859,'Tarif de base'!D:E,2,FALSE)*F859,\"\")","v":""},null,null,null,null,null,null,null,"non"]
[null,null,null,null,null,null,{"$f":"IFERROR(VLOOKUP(E860,'Tarif de base'!D:E,2,FALSE)*F860,\"\")","v":""},null,null,null,null,null,null,null,"non"]
[null,null,null,null,null,null,{"$f":"IFERROR(VLOOKUP(E861,'Tarif de base'!D:E,2,FALSE)*F861,\"\")","v":""},null,null,null,null,null,null,null,"non"]
[null,null,null,null,null,null,{"$f":"IFERROR(VLOOKUP(E862,'Tarif de base'!D:E,2,FALSE)*F862,\"\")","v":""},null,null,null,null,null,null,null,"non"]
[null,null,null,null,null,null,{"$f":"IFERROR(VLOOKUP(E863,'Tarif de base'!D:E,2,FALSE)*F863,\"\")","v":""},null,null,null,null,null,null,null,"non"]
[null,null,null,null,null,null,{"$f":"SUM(G858:G863)","v":0},null,null,null,null,null,null,null,"non"]
[null,null,null,null,null,null,{"$f":"IFERROR(VLOOKUP(E865,'Tarif de base'!D:E,2,FALSE)*F865,\"\")","v":""},null,null,null,{"$f":"IFERROR(IF(G871-H865-I865-J865<>0,\"Attention il manque \"&G871-H865-I865-J865&\"€\",\"Règlement OK\"),\"Pas de règlement\")","v":"Règlement OK"},null,"non",123,{"$f":"M865","v":"non"}]
[null,null,null,null,null,null,{"$f":"IFERROR(VLOOKUP(E866,'Tarif de base'!D:E,2,FALSE)*F866,\"\")","v":""},null,null,null,null,null,null,null,"non"]
[null,null,null,null,null,null,{"$f":"IFERROR(VLOOKUP(E867,'Tarif de base'!D:E,2,FALSE)*F867,\"\")","v":""},null,null,null,null,null,null,null,"non"]
[null,null,null,null,null,null,{"$f":"IFERROR(VLOOKUP(E868,'Tarif de base'!D:E,2,FALSE)*F868,\"\")","v":""},null,null,null,null,null,null,null,"non"]
[null,null,null,null,null,null,{"$f":"IFERROR(VLOOKUP(E869,'Tarif de base'!D:E,2,FALSE)*F869,\"\")","v":""},null,null,null,null,null,null,null,"non"]
[null,null,null,null,null,null,{"$f":"IFERROR(VLOOKUP(E870,'Tarif de base'!D:E,2,FALSE)*F870,\"\")","v":""},null,null,null,null,null,null,null,"non"]
[null,null,null,null,null,null,{"$f":"SUM(G865:G870)","v":0},null,null,null,null,null,null,null,"non"]
[null,null,null,null,null,null,{"$f":"IFERROR(VLOOKUP(E872,'Tarif de base'!D:E,2,FALSE)*F872,\"\")","v":""},null,null,null,{"$f":"IFERROR(IF(G878-H872-I872-J872<>0,\"Attention il manque \"&G878-H872-I872-J872&\"€\",\"Règlement OK\"),\"Pas de règlement\")","v":"Règlement OK"},null,"non",124,{"$f":"M872","v":"non"}]
[null,null,null,null,null,null,{"$f":"IFERROR(VLOOKUP(E873,'Tarif de base'!D:E,2,FALSE)*F873,\"\")","v":""},null,null,null,null,null,null,null,{"$f":"O872","v":"non"}]
[null,null,null,null,null,null,{"$f":"IFERROR(VLOOKUP(E874,'Tarif de base'!D:E,2,FALSE)*F874,\"\")","v":""},null,null,null,null,null,null,null,"non"]
[null,null,null,null,null,null,{"$f":"IFERROR(VLOOKUP(E875,'Tarif de base'!D:E,2,FALSE)*F875,\"\")","v":""},null,null,null,null,null,null,null,"non"]
[null,null,null,null,null,null,{"$f":"IFERROR(VLOOKUP(E876,'Tarif de base'!D:E,2,FALSE)*F876,\"\")","v":""},null,null,null,null,null,null,null,"non"]
[null,null,null,null,null,null,{"$f":"IFERROR(VLOOKUP(E877,'Tarif de base'!D:E,2,FALSE)*F877,\"\")","v":""},null,null,null,null,null,null,null,"non"]
[null,null,null,null,null,null,{"$f":"SUM(G872:G877)","v":0},null,null,null,null,null,null,null,"non"]
[null,null,null,null,null,null,{"$f":"IFERROR(VLOOKUP(E879,'Tarif de base'!D:E,2,FALSE)*F879,\"\")","v":""},null,null,null,{"$f":"IFERROR(IF(G885-H879-I879-J879<>0,\"Attention il manque \"&G885-H879-I879-J879&\"€\",\"Règlement OK\"),\"Pas de règlement\")","v":"Règlement OK"},null,"non",125,{"$f":"M879","v":"non"}]
[null,null,null,null,null,null,{"$f":"IFERROR(VLOOKUP(E880,'Tarif de base'!D:E,2,FALSE)*F880,\"\")","v":""},null,null,null,null,null,null,null,"non"]
[null,null,null,null,null,null,{"$f":"IFERROR(VLOOKUP(E881,'Tarif de base'!D:E,2,FALSE)*F881,\"\")","v":""},null,null,null,null,null,null,null,"non"]
[null,null,null,null,null,null,{"$f":"IFERROR(VLOOKUP(E882,'Tarif de base'!D:E,2,FALSE)*F882,\"\")","v":""},null,null,null,null,null,null,null,"non"]
[null,null,null,null,null,null,{"$f":"IFERROR(VLOOKUP(E883,'Tarif de base'!D:E,2,FALSE)*F883,\"\")","v":""},null,null,null,null,null,null,null,"non"]
[null,null,null,null,null,null,{"$f":"IFERROR(VLOOKUP(E884,'Tarif de base'!D:E,2,FALSE)*F884,\"\")","v":""},null,null,null,null,null,null,null,"non"]
[null,null,null,null,null,null,{"$f":"SUM(G879:G884)","v":0},null,null,null,null,null,null,null,"non"]
[null,null,null,null,null,null,{"$f":"IFERROR(VLOOKUP(E886,'Tarif de base'!D:E,2,FALSE)*F886,\"\")","v":""},null,null,null,{"$f":"IFERROR(IF(G892-H886-I886-J886<>0,\"Attention il manque \"&G892-H886-I886-J886&\"€\",\"Règlement OK\"),\"Pas de règlement\")","v":"Règlement OK"},null,"non",126,{"$f":"M886","v":"non"}]
[null,null,null,null,null,null,{"$f":"IFERROR(VLOOKUP(E887,'Tarif de base'!D:E,2,FALSE)*F887,\"\")","v":""},null,null,null,null,null,null,null,"non"]
[null,null,null,null,null,null,{"$f":"IFERROR(VLOOKUP(E888,'Tarif de base'!D:E,2,FALSE)*F888,\"\")","v":""},null,null,null,null,null,null,null,"non"]
[null,null,null,null,null,null,{"$f":"IFERROR(VLOOKUP(E889,'Tarif de base'!D:E,2,FALSE)*F889,\"\")","v":""},null,null,null,null,null,null,null,"non"]
[null,null,null,null,null,null,{"$f":"IFERROR(VLOOKUP(E890,'Tarif de base'!D:E,2,FALSE)*F890,\"\")","v":""},null,null,null,null,null,null,null,"non"]
[null,null,null,null,null,null,{"$f":"IFERROR(VLOOKUP(E891,'Tarif de base'!D:E,2,FALSE)*F891,\"\")","v":""},null,null,null,null,null,null,null,"non"]
[null,null,null,null,null,null,{"$f":"SUM(G886:G891)","v":0},null,null,null,null,null,null,null,"non"]
[null,null,null,null,null,null,{"$f":"IFERROR(VLOOKUP(E893,'Tarif de base'!D:E,2,FALSE)*F893,\"\")","v":""},null,null,null,{"$f":"IFERROR(IF(G899-H893-I893-J893<>0,\"Attention il manque \"&G899-H893-I893-J893&\"€\",\"Règlement OK\"),\"Pas de règlement\")","v":"Règlement OK"},null,"non",127,{"$f":"M893","v":"non"}]
[null,null,null,null,null,null,{"$f":"IFERROR(VLOOKUP(E894,'Tarif de base'!D:E,2,FALSE)*F894,\"\")","v":""},null,null,null,null,null,null,null,"non"]
[null,null,null,null,null,null,{"$f":"IFERROR(VLOOKUP(E895,'Tarif de base'!D:E,2,FALSE)*F895,\"\")","v":""},null,null,null,null,null,null,null,"non"]
[null,null,null,null,null,null,{"$f":"IFERROR(VLOOKUP(E896,'Tarif de base'!D:E,2,FALSE)*F896,\"\")","v":""},null,null,null,null,null,null,null,"non"]
[null,null,null,null,null,null,{"$f":"IFERROR(VLOOKUP(E897,'Tarif de base'!D:E,2,FALSE)*F897,\"\")","v":""},null,null,null,null,null,null,null,"non"]
[null,null,null,null,null,null,{"$f":"IFERROR(VLOOKUP(E898,'Tarif de base'!D:E,2,FALSE)*F898,\"\")","v":""},null,null,null,null,null,null,null,"non"]
[null,null,null,null,null,null,{"$f":"SUM(G893:G898)","v":0},null,null,null,null,null,null,null,"non"]
[null,null,null,null,null,null,{"$f":"IFERROR(VLOOKUP(E900,'Tarif de base'!D:E,2,FALSE)*F900,\"\")","v":""},null,null,null,{"$f":"IFERROR(IF(G906-H900-I900-J900<>0,\"Attention il manque \"&G906-H900-I900-J900&\"€\",\"Règlement OK\"),\"Pas de règlement\")","v":"Règlement OK"},null,"non",128,{"$f":"M900","v":"non"}]
[null,null,null,null,null,null,{"$f":"IFERROR(VLOOKUP(E901,'Tarif de base'!D:E,2,FALSE)*F901,\"\")","v":""},null,null,null,null,null,null,null,{"$f":"O900","v":"non"}]
[null,null,null,null,null,null,{"$f":"IFERROR(VLOOKUP(E902,'Tarif de base'!D:E,2,FALSE)*F902,\"\")","v":""},null,null,null,null,null,null,null,{"$f":"O901","v":"non"}]
[null,null,null,null,null,null,{"$f":"IFERROR(VLOOKUP(E903,'Tarif de base'!D:E,2,FALSE)*F903,\"\")","v":""},null,null,null,null,null,null,null,"non"]
[null,null,null,null,null,null,{"$f":"IFERROR(VLOOKUP(E904,'Tarif de base'!D:E,2,FALSE)*F904,\"\")","v":""},null,null,null,null,null,null,null,"non"]
[null,null,null,null,null,null,{"$f":"IFERROR(VLOOKUP(E905,'Tarif de base'!D:E,2,FALSE)*F905,\"\")","v":""},null,null,null,null,null,null,null,"non"]
[null,null,null,null,null,null,{"$f":"SUM(G900:G905)","v":0},null,null,null,null,null,null,null,"non"]
[null,null,null,null,null,null,{"$f":"IFERROR(VLOOKUP(E907,'Tarif de base'!D:E,2,FALSE)*F907,\"\")","v":""},null,null,null,{"$f":"IFERROR(IF(G913-H907-I907-J907<>0,\"Attention il manque \"&G913-H907-I907-J907&\"€\",\"Règlement OK\"),\"Pas de règlement\")","v":"Règlement OK"},null,"non",129,{"$f":"M907","v":"non"}]
[null,null,null,null,null,null,{"$f":"IFERROR(VLOOKUP(E908,'Tarif de base'!D:E,2,FALSE)*F908,\"\")","v":""},null,null,null,null,null,null,null,{"$f":"O907","v":"non"}]
[null,null,null,null,null,null,{"$f":"IFERROR(VLOOKUP(E909,'Tarif de base'!D:E,2,FALSE)*F909,\"\")","v":""},null,null,null,null,null,null,null,{"$f":"O908","v":"non"}]
[null,null,null,null,null,null,{"$f":"IFERROR(VLOOKUP(E910,'Tarif de base'!D:E,2,FALSE)*F910,\"\")","v":""},null,null,null,null,null,null,null,"non"]
[null,null,null,null,null,null,{"$f":"IFERROR(VLOOKUP(E911,'Tarif de base'!D:E,2,FALSE)*F911,\"\")","v":""},null,null,null,null,null,null,null,"non"]
[null,null,null,null,null,null,{"$f":"IFERROR(VLOOKUP(E912,'Tarif de base'!D:E,2,FALSE)*F912,\"\")","v":""},null,null,null,null,null,null,null,"non"]
[null,null,null,null,null,null,{"$f":"SUM(G907:G912)","v":0},null,null,null,null,null,null,null,"non"]
[null,null,null,null,null,null,{"$f":"IFERROR(VLOOKUP(E914,'Tarif de base'!D:E,2,FALSE)*F914,\"\")","v":""},null,null,null,{"$f":"IFERROR(IF(G920-H914-I914-J914<>0,\"Attention il manque \"&G920-H914-I914-J914&\"€\",\"Règlement OK\"),\"Pas de règlement\")","v":"Règlement OK"},null,"non",130,{"$f":"M914","v":"non"}]
[null,null,null,null,null,null,{"$f":"IFERROR(VLOOKUP(E915,'Tarif de base'!D:E,2,FALSE)*F915,\"\")","v":""},null,null,null,null,null,null,null,"non"]
[null,null,null,null,null,null,{"$f":"IFERROR(VLOOKUP(E916,'Tarif de base'!D:E,2,FALSE)*F916,\"\")","v":""},null,null,null,null,null,null,null,"non"]
[null,null,null,null,null,null,{"$f":"IFERROR(VLOOKUP(E917,'Tarif de base'!D:E,2,FALSE)*F917,\"\")","v":""},null,null,null,null,null,null,null,"non"]
[null,null,null,null,null,null,{"$f":"IFERROR(VLOOKUP(E918,'Tarif de base'!D:E,2,FALSE)*F918,\"\")","v":""},null,null,null,null,null,null,null,"non"]
[null,null,null,null,null,null,{"$f":"IFERROR(VLOOKUP(E919,'Tarif de base'!D:E,2,FALSE)*F919,\"\")","v":""},null,null,null,null,null,null,null,"non"]
[null,null,null,null,null,null,{"$f":"SUM(G914:G919)","v":0},null,null,null,null,null,null,null,"non"]
[null,null,null,null,null,null,{"$f":"IFERROR(VLOOKUP(E921,'Tarif de base'!D:E,2,FALSE)*F921,\"\")","v":""},null,null,null,{"$f":"IFERROR(IF(G927-H921-I921-J921<>0,\"Attention il manque \"&G927-H921-I921-J921&\"€\",\"Règlement OK\"),\"Pas de règlement\")","v":"Règlement OK"},null,"non",131,{"$f":"M921","v":"non"}]
[null,null,null,null,null,null,{"$f":"IFERROR(VLOOKUP(E922,'Tarif de base'!D:E,2,FALSE)*F922,\"\")","v":""},null,null,null,null,null,null,null,"non"]
[null,null,null,null,null,null,{"$f":"IFERROR(VLOOKUP(E923,'Tarif de base'!D:E,2,FALSE)*F923,\"\")","v":""},null,null,null,null,null,null,null,"non"]
[null,null,null,null,null,null,{"$f":"IFERROR(VLOOKUP(E924,'Tarif de base'!D:E,2,FALSE)*F924,\"\")","v":""},null,null,null,null,null,null,null,"non"]
[null,null,null,null,null,null,{"$f":"IFERROR(VLOOKUP(E925,'Tarif de base'!D:E,2,FALSE)*F925,\"\")","v":""},null,null,null,null,null,null,null,"non"]
[null,null,null,null,null,null,{"$f":"IFERROR(VLOOKUP(E926,'Tarif de base'!D:E,2,FALSE)*F926,\"\")","v":""},null,null,null,null,null,null,null,"non"]
[null,null,null,null,null,null,{"$f":"SUM(G921:G926)","v":0},null,null,null,null,null,null,null,"non"]
[null,null,null,null,null,null,{"$f":"IFERROR(VLOOKUP(E928,'Tarif de base'!D:E,2,FALSE)*F928,\"\")","v":""},null,null,null,{"$f":"IFERROR(IF(G934-H928-I928-J928<>0,\"Attention il manque \"&G934-H928-I928-J928&\"€\",\"Règlement OK\"),\"Pas de règlement\")","v":"Règlement OK"},null,"non",132,{"$f":"M928","v":"non"}]
[null,null,null,null,null,null,{"$f":"IFERROR(VLOOKUP(E929,'Tarif de base'!D:E,2,FALSE)*F929,\"\")","v":""},null,null,null,null,null,null,null,"non"]
[null,null,null,null,null,null,{"$f":"IFERROR(VLOOKUP(E930,'Tarif de base'!D:E,2,FALSE)*F930,\"\")","v":""},null,null,null,null,null,null,null,"non"]
[null,null,null,null,null,null,{"$f":"IFERROR(VLOOKUP(E931,'Tarif de base'!D:E,2,FALSE)*F931,\"\")","v":""},null,null,null,null,null,null,null,"non"]
[null,null,null,null,null,null,{"$f":"IFERROR(VLOOKUP(E932,'Tarif de base'!D:E,2,FALSE)*F932,\"\")","v":""},null,null,null,null,null,null,null,"non"]
[null,null,null,null,null,null,{"$f":"IFERROR(VLOOKUP(E933,'Tarif de base'!D:E,2,FALSE)*F933,\"\")","v":""},null,null,null,null,null,null,null,"non"]
[null,null,null,null,null,null,{"$f":"SUM(G928:G933)","v":0},null,null,null,null,null,null,null,"non"]
[null,null,null,null,null,null,{"$f":"IFERROR(VLOOKUP(E935,'Tarif de base'!D:E,2,FALSE)*F935,\"\")","v":""},null,null,null,{"$f":"IFERROR(IF(G941-H935-I935-J935<>0,\"Attention il manque \"&G941-H935-I935-J935&\"€\",\"Règlement OK\"),\"Pas de règlement\")","v":"Règlement OK"},null,"non",133,{"$f":"M935","v":"non"}]
[null,null,null,null,null,null,{"$f":"IFERROR(VLOOKUP(E936,'Tarif de base'!D:E,2,FALSE)*F936,\"\")","v":""},null,null,null,null,null,null,null,"non"]
[null,null,null,null,null,null,{"$f":"IFERROR(VLOOKUP(E937,'Tarif de base'!D:E,2,FALSE)*F937,\"\")","v":""},null,null,null,null,null,null,null,"non"]
[null,null,null,null,null,null,{"$f":"IFERROR(VLOOKUP(E938,'Tarif de base'!D:E,2,FALSE)*F938,\"\")","v":""},null,null,null,null,null,null,null,"non"]
[null,null,null,null,null,null,{"$f":"IFERROR(VLOOKUP(E939,'Tarif de base'!D:E,2,FALSE)*F939,\"\")","v":""},null,null,null,null,null,null,null,"non"]
[null,null,null,null,null,null,{"$f":"IFERROR(VLOOKUP(E940,'Tarif de base'!D:E,2,FALSE)*F940,\"\")","v":""},null,null,null,null,null,null,null,"non"]
[null,null,null,null,null,null,{"$f":"SUM(G935:G940)","v":0},null,null,null,null,null,null,null,"non"]
[null,null,null,null,null,null,{"$f":"IFERROR(VLOOKUP(E942,'Tarif de base'!D:E,2,FALSE)*F942,\"\")","v":""},null,null,null,{"$f":"IFERROR(IF(G948-H942-I942-J942<>0,\"Attention il manque \"&G948-H942-I942-J942&\"€\",\"Règlement OK\"),\"Pas de règlement\")","v":"Règlement OK"},null,"non",134,{"$f":"M942","v":"non"}]
[null,null,null,null,null,null,{"$f":"IFERROR(VLOOKUP(E943,'Tarif de base'!D:E,2,FALSE)*F943,\"\")","v":""},null,null,null,null,null,null,null,"non"]
[null,null,null,null,null,null,{"$f":"IFERROR(VLOOKUP(E944,'Tarif de base'!D:E,2,FALSE)*F944,\"\")","v":""},null,null,null,null,null,null,null,"non"]
[null,null,null,null,null,null,{"$f":"IFERROR(VLOOKUP(E945,'Tarif de base'!D:E,2,FALSE)*F945,\"\")","v":""},null,null,null,null,null,null,null,"non"]
[null,null,null,null,null,null,{"$f":"IFERROR(VLOOKUP(E946,'Tarif de base'!D:E,2,FALSE)*F946,\"\")","v":""},null,null,null,null,null,null,null,"non"]
[null,null,null,null,null,null,{"$f":"IFERROR(VLOOKUP(E947,'Tarif de base'!D:E,2,FALSE)*F947,\"\")","v":""},null,null,null,null,null,null,null,"non"]
[null,null,null,null,null,null,{"$f":"SUM(G942:G947)","v":0},null,null,null,null,null,null,null,"non"]
[null,null,null,null,null,null,{"$f":"IFERROR(VLOOKUP(E949,'Tarif de base'!D:E,2,FALSE)*F949,\"\")","v":""},null,null,null,{"$f":"IFERROR(IF(G955-H949-I949-J949<>0,\"Attention il manque \"&G955-H949-I949-J949&\"€\",\"Règlement OK\"),\"Pas de règlement\")","v":"Règlement OK"},null,"non",135,{"$f":"M949","v":"non"}]
[null,null,null,null,null,null,{"$f":"IFERROR(VLOOKUP(E950,'Tarif de base'!D:E,2,FALSE)*F950,\"\")","v":""},null,null,null,null,null,null,null,"non"]
[null,null,null,null,null,null,{"$f":"IFERROR(VLOOKUP(E951,'Tarif de base'!D:E,2,FALSE)*F951,\"\")","v":""},null,null,null,null,null,null,null,"non"]
[null,null,null,null,null,null,{"$f":"IFERROR(VLOOKUP(E952,'Tarif de base'!D:E,2,FALSE)*F952,\"\")","v":""},null,null,null,null,null,null,null,"non"]
[null,null,null,null,null,null,{"$f":"IFERROR(VLOOKUP(E953,'Tarif de base'!D:E,2,FALSE)*F953,\"\")","v":""},null,null,null,null,null,null,null,"non"]
[null,null,null,null,null,null,{"$f":"IFERROR(VLOOKUP(E954,'Tarif de base'!D:E,2,FALSE)*F954,\"\")","v":""},null,null,null,null,null,null,null,"non"]
[null,null,null,null,null,null,{"$f":"SUM(G949:G954)","v":0},null,null,null,null,null,null,null,"non"]
[null,null,null,null,null,null,{"$f":"IFERROR(VLOOKUP(E956,'Tarif de base'!D:E,2,FALSE)*F956,\"\")","v":""},null,null,null,{"$f":"IFERROR(IF(G962-H956-I956-J956<>0,\"Attention il manque \"&G962-H956-I956-J956&\"€\",\"Règlement OK\"),\"Pas de règlement\")","v":"Règlement OK"},null,"non",136,{"$f":"M956","v":"non"}]
[null,null,null,null,null,null,{"$f":"IFERROR(VLOOKUP(E957,'Tarif de base'!D:E,2,FALSE)*F957,\"\")","v":""},null,null,null,null,null,null,null,"non"]
[null,null,null,null,null,null,{"$f":"IFERROR(VLOOKUP(E958,'Tarif de base'!D:E,2,FALSE)*F958,\"\")","v":""},null,null,null,null,null,null,null,"non"]
[null,null,null,null,null,null,{"$f":"IFERROR(VLOOKUP(E959,'Tarif de base'!D:E,2,FALSE)*F959,\"\")","v":""},null,null,null,null,null,null,null,"non"]
[null,null,null,null,null,null,{"$f":"IFERROR(VLOOKUP(E960,'Tarif de base'!D:E,2,FALSE)*F960,\"\")","v":""},null,null,null,null,null,null,null,"non"]
[null,null,null,null,null,null,{"$f":"IFERROR(VLOOKUP(E961,'Tarif de base'!D:E,2,FALSE)*F961,\"\")","v":""},null,null,null,null,null,null,null,"non"]
[null,null,null,null,null,null,{"$f":"SUM(G956:G961)","v":0},null,null,null,null,null,null,null,"non"]
[null,null,null,null,null,null,{"$f":"IFERROR(VLOOKUP(E963,'Tarif de base'!D:E,2,FALSE)*F963,\"\")","v":""},null,null,null,{"$f":"IFERROR(IF(G969-H963-I963-J963<>0,\"Attention il manque \"&G969-H963-I963-J963&\"€\",\"Règlement OK\"),\"Pas de règlement\")","v":"Règlement OK"},null,"non",137,{"$f":"M963","v":"non"}]
[null,null,null,null,null,null,{"$f":"IFERROR(VLOOKUP(E964,'Tarif de base'!D:E,2,FALSE)*F964,\"\")","v":""},null,null,null,null,null,null,null,"non"]
[null,null,null,null,null,null,{"$f":"IFERROR(VLOOKUP(E965,'Tarif de base'!D:E,2,FALSE)*F965,\"\")","v":""},null,null,null,null,null,null,null,"non"]
[null,null,null,null,null,null,{"$f":"IFERROR(VLOOKUP(E966,'Tarif de base'!D:E,2,FALSE)*F966,\"\")","v":""},null,null,null,null,null,null,null,"non"]
[null,null,null,null,null,null,{"$f":"IFERROR(VLOOKUP(E967,'Tarif de base'!D:E,2,FALSE)*F967,\"\")","v":""},null,null,null,null,null,null,null,"non"]
[null,null,null,null,null,null,{"$f":"IFERROR(VLOOKUP(E968,'Tarif de base'!D:E,2,FALSE)*F968,\"\")","v":""},null,null,null,null,null,null,null,"non"]
[null,null,null,null,null,null,{"$f":"SUM(G963:G968)","v":0},null,null,null,null,null,null,null,"non"]
[null,null,null,null,null,null,{"$f":"IFERROR(VLOOKUP(E970,'Tarif de base'!D:E,2,FALSE)*F970,\"\")","v":""},null,null,null,{"$f":"IFERROR(IF(G976-H970-I970-J970<>0,\"Attention il manque \"&G976-H970-I970-J970&\"€\",\"Règlement OK\"),\"Pas de règlement\")","v":"Règlement OK"},null,"non",138,{"$f":"M970","v":"non"}]
[null,null,null,null,null,null,{"$f":"IFERROR(VLOOKUP(E971,'Tarif de base'!D:E,2,FALSE)*F971,\"\")","v":""},null,null,null,null,null,null,null,"non"]
[null,null,null,null,null,null,{"$f":"IFERROR(VLOOKUP(E972,'Tarif de base'!D:E,2,FALSE)*F972,\"\")","v":""},null,null,null,null,null,null,null,"non"]
[null,null,null,null,null,null,{"$f":"IFERROR(VLOOKUP(E973,'Tarif de base'!D:E,2,FALSE)*F973,\"\")","v":""},null,null,null,null,null,null,null,{"$f":"O972","v":"non"}]
[null,null,null,null,null,null,{"$f":"IFERROR(VLOOKUP(E974,'Tarif de base'!D:E,2,FALSE)*F974,\"\")","v":""},null,null,null,null,null,null,null,"non"]
[null,null,null,null,null,null,{"$f":"IFERROR(VLOOKUP(E975,'Tarif de base'!D:E,2,FALSE)*F975,\"\")","v":""},null,null,null,null,null,null,null,"non"]
[null,null,null,null,null,null,{"$f":"SUM(G970:G975)","v":0},null,null,null,null,null,null,null,"non"]
[null,null,null,null,null,null,{"$f":"IFERROR(VLOOKUP(E977,'Tarif de base'!D:E,2,FALSE)*F977,\"\")","v":""},null,null,null,{"$f":"IFERROR(IF(G983-H977-I977-J977<>0,\"Attention il manque \"&G983-H977-I977-J977&\"€\",\"Règlement OK\"),\"Pas de règlement\")","v":"Règlement OK"},null,"non",139,{"$f":"M977","v":"non"}]
[null,null,null,null,null,null,{"$f":"IFERROR(VLOOKUP(E978,'Tarif de base'!D:E,2,FALSE)*F978,\"\")","v":""},null,null,null,null,null,null,null,"non"]
[null,null,null,null,null,null,{"$f":"IFERROR(VLOOKUP(E979,'Tarif de base'!D:E,2,FALSE)*F979,\"\")","v":""},null,null,null,null,null,null,null,"non"]
[null,null,null,null,null,null,{"$f":"IFERROR(VLOOKUP(E980,'Tarif de base'!D:E,2,FALSE)*F980,\"\")","v":""},null,null,null,null,null,null,null,"non"]
[null,null,null,null,null,null,{"$f":"IFERROR(VLOOKUP(E981,'Tarif de base'!D:E,2,FALSE)*F981,\"\")","v":""},null,null,null,null,null,null,null,"non"]
[null,null,null,null,null,null,{"$f":"IFERROR(VLOOKUP(E982,'Tarif de base'!D:E,2,FALSE)*F982,\"\")","v":""},null,null,null,null,null,null,null,"non"]
[null,null,null,null,null,null,{"$f":"SUM(G977:G982)","v":0},null,null,null,null,null,null,null,"non"]
[null,null,null,null,null,null,{"$f":"IFERROR(VLOOKUP(E984,'Tarif de base'!D:E,2,FALSE)*F984,\"\")","v":""},null,null,null,{"$f":"IFERROR(IF(G990-H984-I984-J984<>0,\"Attention il manque \"&G990-H984-I984-J984&\"€\",\"Règlement OK\"),\"Pas de règlement\")","v":"Règlement OK"},null,"non",140,{"$f":"M984","v":"non"}]
[null,null,null,null,null,null,{"$f":"IFERROR(VLOOKUP(E985,'Tarif de base'!D:E,2,FALSE)*F985,\"\")","v":""},null,null,null,null,null,null,null,"non"]
[null,null,null,null,null,null,{"$f":"IFERROR(VLOOKUP(E986,'Tarif de base'!D:E,2,FALSE)*F986,\"\")","v":""},null,null,null,null,null,null,null,"non"]
[null,null,null,null,null,null,{"$f":"IFERROR(VLOOKUP(E987,'Tarif de base'!D:E,2,FALSE)*F987,\"\")","v":""},null,null,null,null,null,null,null,"non"]
[null,null,null,null,null,null,{"$f":"IFERROR(VLOOKUP(E988,'Tarif de base'!D:E,2,FALSE)*F988,\"\")","v":""},null,null,null,null,null,null,null,"non"]
[null,null,null,null,null,null,{"$f":"IFERROR(VLOOKUP(E989,'Tarif de base'!D:E,2,FALSE)*F989,\"\")","v":""},null,null,null,null,null,null,null,"non"]
[null,null,null,null,null,null,{"$f":"SUM(G984:G989)","v":0},null,null,null,null,null,null,null,"non"]
[null,null,null,null,null,null,{"$f":"IFERROR(VLOOKUP(E991,'Tarif de base'!D:E,2,FALSE)*F991,\"\")","v":""},null,null,null,{"$f":"IFERROR(IF(G997-H991-I991-J991<>0,\"Attention il manque \"&G997-H991-I991-J991&\"€\",\"Règlement OK\"),\"Pas de règlement\")","v":"Règlement OK"},null,"non",141,{"$f":"M991","v":"non"}]
[null,null,null,null,null,null,{"$f":"IFERROR(VLOOKUP(E992,'Tarif de base'!D:E,2,FALSE)*F992,\"\")","v":""},null,null,null,null,null,null,null,"non"]
[null,null,null,null,null,null,{"$f":"IFERROR(VLOOKUP(E993,'Tarif de base'!D:E,2,FALSE)*F993,\"\")","v":""},null,null,null,null,null,null,null,"non"]
[null,null,null,null,null,null,{"$f":"IFERROR(VLOOKUP(E994,'Tarif de base'!D:E,2,FALSE)*F994,\"\")","v":""},null,null,null,null,null,null,null,"non"]
[null,null,null,null,null,null,{"$f":"IFERROR(VLOOKUP(E995,'Tarif de base'!D:E,2,FALSE)*F995,\"\")","v":""},null,null,null,null,null,null,null,"non"]
[null,null,null,null,null,null,{"$f":"IFERROR(VLOOKUP(E996,'Tarif de base'!D:E,2,FALSE)*F996,\"\")","v":""},null,null,null,null,null,null,null,"non"]
[null,null,null,null,null,null,{"$f":"SUM(G991:G996)","v":0},null,null,null,null,null,null,null,"non"]
[null,null,null,null,null,null,{"$f":"IFERROR(VLOOKUP(E998,'Tarif de base'!D:E,2,FALSE)*F998,\"\")","v":""},null,null,null,{"$f":"IFERROR(IF(G1004-H998-I998-J998<>0,\"Attention il manque \"&G1004-H998-I998-J998&\"€\",\"Règlement OK\"),\"Pas de règlement\")","v":"Règlement OK"},null,"non",142,{"$f":"M998","v":"non"}]
[null,null,null,null,null,null,{"$f":"IFERROR(VLOOKUP(E999,'Tarif de base'!D:E,2,FALSE)*F999,\"\")","v":""},null,null,null,null,null,null,null,{"$f":"O998","v":"non"}]
[null,null,null,null,null,null,{"$f":"IFERROR(VLOOKUP(E1000,'Tarif de base'!D:E,2,FALSE)*F1000,\"\")","v":""},null,null,null,null,null,null,null,"non"]
[null,null,null,null,null,null,{"$f":"IFERROR(VLOOKUP(E1001,'Tarif de base'!D:E,2,FALSE)*F1001,\"\")","v":""},null,null,null,null,null,null,null,"non"]
[null,null,null,null,null,null,{"$f":"IFERROR(VLOOKUP(E1002,'Tarif de base'!D:E,2,FALSE)*F1002,\"\")","v":""},null,null,null,null,null,null,null,"non"]
[null,null,null,null,null,null,{"$f":"IFERROR(VLOOKUP(E1003,'Tarif de base'!D:E,2,FALSE)*F1003,\"\")","v":""},null,null,null,null,null,null,null,"non"]
[null,null,null,null,null,null,{"$f":"SUM(G998:G1003)","v":0},null,null,null,null,null,null,null,"non"]
[null,null,null,null,null,null,{"$f":"IFERROR(VLOOKUP(E1005,'Tarif de base'!D:E,2,FALSE)*F1005,\"\")","v":""},null,null,null,{"$f":"IFERROR(IF(G1011-H1005-I1005-J1005<>0,\"Attention il manque \"&G1011-H1005-I1005-J1005&\"€\",\"Règlement OK\"),\"Pas de règlement\")","v":"Règlement OK"},null,"non",143,{"$f":"M1005","v":"non"}]
[null,null,null,null,null,null,{"$f":"IFERROR(VLOOKUP(E1006,'Tarif de base'!D:E,2,FALSE)*F1006,\"\")","v":""},null,null,null,null,null,null,null,"non"]
[null,null,null,null,null,null,{"$f":"IFERROR(VLOOKUP(E1007,'Tarif de base'!D:E,2,FALSE)*F1007,\"\")","v":""},null,null,null,null,null,null,null,"non"]
[null,null,null,null,null,null,{"$f":"IFERROR(VLOOKUP(E1008,'Tarif de base'!D:E,2,FALSE)*F1008,\"\")","v":""},null,null,null,null,null,null,null,"non"]
[null,null,null,null,null,null,{"$f":"IFERROR(VLOOKUP(E1009,'Tarif de base'!D:E,2,FALSE)*F1009,\"\")","v":""},null,null,null,null,null,null,null,"non"]
[null,null,null,null,null,null,{"$f":"IFERROR(VLOOKUP(E1010,'Tarif de base'!D:E,2,FALSE)*F1010,\"\")","v":""},null,null,null,null,null,null,null,"non"]
[null,null,null,null,null,null,{"$f":"SUM(G1005:G1010)","v":0},null,null,null,null,null,null,null,"non"]
[null,null,null,null,null,null,{"$f":"IFERROR(VLOOKUP(E1012,'Tarif de base'!D:E,2,FALSE)*F1012,\"\")","v":""},null,null,null,{"$f":"IFERROR(IF(G1018-H1012-I1012-J1012<>0,\"Attention il manque \"&G1018-H1012-I1012-J1012&\"€\",\"Règlement OK\"),\"Pas de règlement\")","v":"Règlement OK"},null,"non",144,{"$f":"M1012","v":"non"}]
[null,null,null,null,null,null,{"$f":"IFERROR(VLOOKUP(E1013,'Tarif de base'!D:E,2,FALSE)*F1013,\"\")","v":""},null,null,null,null,null,null,null,"non"]
[null,null,null,null,null,null,{"$f":"IFERROR(VLOOKUP(E1014,'Tarif de base'!D:E,2,FALSE)*F1014,\"\")","v":""},null,null,null,null,null,null,null,"non"]
[null,null,null,null,null,null,{"$f":"IFERROR(VLOOKUP(E1015,'Tarif de base'!D:E,2,FALSE)*F1015,\"\")","v":""},null,null,null,null,null,null,null,"non"]
[null,null,null,null,null,null,{"$f":"IFERROR(VLOOKUP(E1016,'Tarif de base'!D:E,2,FALSE)*F1016,\"\")","v":""},null,null,null,null,null,null,null,"non"]
[null,null,null,null,null,null,{"$f":"IFERROR(VLOOKUP(E1017,'Tarif de base'!D:E,2,FALSE)*F1017,\"\")","v":""},null,null,null,null,null,null,null,"non"]
[null,null,null,null,null,null,{"$f":"SUM(G1012:G1017)","v":0},null,null,null,null,null,null,null,"non"]
[null,null,null,null,null,null,{"$f":"IFERROR(VLOOKUP(E1019,'Tarif de base'!D:E,2,FALSE)*F1019,\"\")","v":""},null,null,null,{"$f":"IFERROR(IF(G1025-H1019-I1019-J1019<>0,\"Attention il manque \"&G1025-H1019-I1019-J1019&\"€\",\"Règlement OK\"),\"Pas de règlement\")","v":"Règlement OK"},null,"non",145,{"$f":"M1019","v":"non"}]
[null,null,null,null,null,null,{"$f":"IFERROR(VLOOKUP(E1020,'Tarif de base'!D:E,2,FALSE)*F1020,\"\")","v":""},null,null,null,null,null,null,null,"non"]
[null,null,null,null,null,null,{"$f":"IFERROR(VLOOKUP(E1021,'Tarif de base'!D:E,2,FALSE)*F1021,\"\")","v":""},null,null,null,null,null,null,null,"non"]
[null,null,null,null,null,null,{"$f":"IFERROR(VLOOKUP(E1022,'Tarif de base'!D:E,2,FALSE)*F1022,\"\")","v":""},null,null,null,null,null,null,null,"non"]
[null,null,null,null,null,null,{"$f":"IFERROR(VLOOKUP(E1023,'Tarif de base'!D:E,2,FALSE)*F1023,\"\")","v":""},null,null,null,null,null,null,null,"non"]
[null,null,null,null,null,null,{"$f":"IFERROR(VLOOKUP(E1024,'Tarif de base'!D:E,2,FALSE)*F1024,\"\")","v":""},null,null,null,null,null,null,null,"non"]
[null,null,null,null,null,null,{"$f":"SUM(G1019:G1024)","v":0},null,null,null,null,null,null,null,"non"]
[null,null,null,null,null,null,{"$f":"IFERROR(VLOOKUP(E1026,'Tarif de base'!D:E,2,FALSE)*F1026,\"\")","v":""},null,null,null,{"$f":"IFERROR(IF(G1032-H1026-I1026-J1026<>0,\"Attention il manque \"&G1032-H1026-I1026-J1026&\"€\",\"Règlement OK\"),\"Pas de règlement\")","v":"Règlement OK"},null,"non",146,{"$f":"M1026","v":"non"}]
[null,null,null,null,null,null,{"$f":"IFERROR(VLOOKUP(E1027,'Tarif de base'!D:E,2,FALSE)*F1027,\"\")","v":""},null,null,null,null,null,null,null,{"$f":"O1026","v":"non"}]
[null,null,null,null,null,null,{"$f":"IFERROR(VLOOKUP(E1028,'Tarif de base'!D:E,2,FALSE)*F1028,\"\")","v":""},null,null,null,null,null,null,null,{"$f":"O1027","v":"non"}]
[null,null,null,null,null,null,{"$f":"IFERROR(VLOOKUP(E1029,'Tarif de base'!D:E,2,FALSE)*F1029,\"\")","v":""},null,null,null,null,null,null,null,"non"]
[null,null,null,null,null,null,{"$f":"IFERROR(VLOOKUP(E1030,'Tarif de base'!D:E,2,FALSE)*F1030,\"\")","v":""},null,null,null,null,null,null,null,"non"]
[null,null,null,null,null,null,{"$f":"IFERROR(VLOOKUP(E1031,'Tarif de base'!D:E,2,FALSE)*F1031,\"\")","v":""},null,null,null,null,null,null,null,"non"]
[null,null,null,null,null,null,{"$f":"SUM(G1026:G1031)","v":0},null,null,null,null,null,null,null,"non"]
[null,null,null,null,null,null,{"$f":"IFERROR(VLOOKUP(E1033,'Tarif de base'!D:E,2,FALSE)*F1033,\"\")","v":""},null,null,null,{"$f":"IFERROR(IF(G1039-H1033-I1033-J1033<>0,\"Attention il manque \"&G1039-H1033-I1033-J1033&\"€\",\"Règlement OK\"),\"Pas de règlement\")","v":"Règlement OK"},null,"non",147,{"$f":"M1033","v":"non"}]
[null,null,null,null,null,null,{"$f":"IFERROR(VLOOKUP(E1034,'Tarif de base'!D:E,2,FALSE)*F1034,\"\")","v":""},null,null,null,null,null,null,null,{"$f":"O1033","v":"non"}]
[null,null,null,null,null,null,{"$f":"IFERROR(VLOOKUP(E1035,'Tarif de base'!D:E,2,FALSE)*F1035,\"\")","v":""},null,null,null,null,null,null,null,{"$f":"O1034","v":"non"}]
[null,null,null,null,null,null,{"$f":"IFERROR(VLOOKUP(E1036,'Tarif de base'!D:E,2,FALSE)*F1036,\"\")","v":""},null,null,null,null,null,null,null,"non"]
[null,null,null,null,null,null,{"$f":"IFERROR(VLOOKUP(E1037,'Tarif de base'!D:E,2,FALSE)*F1037,\"\")","v":""},null,null,null,null,null,null,null,"non"]
[null,null,null,null,null,null,{"$f":"IFERROR(VLOOKUP(E1038,'Tarif de base'!D:E,2,FALSE)*F1038,\"\")","v":""},null,null,null,null,null,null,null,"non"]
[null,null,null,null,null,null,{"$f":"SUM(G1033:G1038)","v":0},null,null,null,null,null,null,null,"non"]
[null,null,null,null,null,null,{"$f":"IFERROR(VLOOKUP(E1040,'Tarif de base'!D:E,2,FALSE)*F1040,\"\")","v":""},null,null,null,{"$f":"IFERROR(IF(G1046-H1040-I1040-J1040<>0,\"Attention il manque \"&G1046-H1040-I1040-J1040&\"€\",\"Règlement OK\"),\"Pas de règlement\")","v":"Règlement OK"},null,"non",148,{"$f":"M1040","v":"non"}]
[null,null,null,null,null,null,{"$f":"IFERROR(VLOOKUP(E1041,'Tarif de base'!D:E,2,FALSE)*F1041,\"\")","v":""},null,null,null,null,null,null,null,"non"]
[null,null,null,null,null,null,{"$f":"IFERROR(VLOOKUP(E1042,'Tarif de base'!D:E,2,FALSE)*F1042,\"\")","v":""},null,null,null,null,null,null,null,"non"]
[null,null,null,null,null,null,{"$f":"IFERROR(VLOOKUP(E1043,'Tarif de base'!D:E,2,FALSE)*F1043,\"\")","v":""},null,null,null,null,null,null,null,"non"]
[null,null,null,null,null,null,{"$f":"IFERROR(VLOOKUP(E1044,'Tarif de base'!D:E,2,FALSE)*F1044,\"\")","v":""},null,null,null,null,null,null,null,"non"]
[null,null,null,null,null,null,{"$f":"IFERROR(VLOOKUP(E1045,'Tarif de base'!D:E,2,FALSE)*F1045,\"\")","v":""},null,null,null,null,null,null,null,"non"]
[null,null,null,null,null,null,{"$f":"SUM(G1040:G1045)","v":0},null,null,null,null,null,null,null,"non"]
[null,null,null,null,null,null,{"$f":"IFERROR(VLOOKUP(E1047,'Tarif de base'!D:E,2,FALSE)*F1047,\"\")","v":""},null,null,null,{"$f":"IFERROR(IF(G1053-H1047-I1047-J1047<>0,\"Attention il manque \"&G1053-H1047-I1047-J1047&\"€\",\"Règlement OK\"),\"Pas de règlement\")","v":"Règlement OK"},null,"non",149,{"$f":"M1047","v":"non"}]
[null,null,null,null,null,null,{"$f":"IFERROR(VLOOKUP(E1048,'Tarif de base'!D:E,2,FALSE)*F1048,\"\")","v":""},null,null,null,null,null,null,null,"non"]
[null,null,null,null,null,null,{"$f":"IFERROR(VLOOKUP(E1049,'Tarif de base'!D:E,2,FALSE)*F1049,\"\")","v":""},null,null,null,null,null,null,null,"non"]
[null,null,null,null,null,null,{"$f":"IFERROR(VLOOKUP(E1050,'Tarif de base'!D:E,2,FALSE)*F1050,\"\")","v":""},null,null,null,null,null,null,null,"non"]
[null,null,null,null,null,null,{"$f":"IFERROR(VLOOKUP(E1051,'Tarif de base'!D:E,2,FALSE)*F1051,\"\")","v":""},null,null,null,null,null,null,null,"non"]
[null,null,null,null,null,null,{"$f":"IFERROR(VLOOKUP(E1052,'Tarif de base'!D:E,2,FALSE)*F1052,\"\")","v":""},null,null,null,null,null,null,null,"non"]
[null,null,null,null,null,null,{"$f":"SUM(G1047:G1052)","v":0},null,null,null,null,null,null,null,"non"]
[null,null,null,null,null,null,{"$f":"IFERROR(VLOOKUP(E1054,'Tarif de base'!D:E,2,FALSE)*F1054,\"\")","v":""},null,null,null,{"$f":"IFERROR(IF(G1060-H1054-I1054-J1054<>0,\"Attention il manque \"&G1060-H1054-I1054-J1054&\"€\",\"Règlement OK\"),\"Pas de règlement\")","v":"Règlement OK"},null,"non",150,{"$f":"M1054","v":"non"}]
[null,null,null,null,null,null,{"$f":"IFERROR(VLOOKUP(E1055,'Tarif de base'!D:E,2,FALSE)*F1055,\"\")","v":""},null,null,null,null,null,null,null,"non"]
[null,null,null,null,null,null,{"$f":"IFERROR(VLOOKUP(E1056,'Tarif de base'!D:E,2,FALSE)*F1056,\"\")","v":""},null,null,null,null,null,null,null,"non"]
[null,null,null,null,null,null,{"$f":"IFERROR(VLOOKUP(E1057,'Tarif de base'!D:E,2,FALSE)*F1057,\"\")","v":""},null,null,null,null,null,null,null,"non"]
[null,null,null,null,null,null,{"$f":"IFERROR(VLOOKUP(E1058,'Tarif de base'!D:E,2,FALSE)*F1058,\"\")","v":""},null,null,null,null,null,null,null,"non"]
[null,null,null,null,null,null,{"$f":"IFERROR(VLOOKUP(E1059,'Tarif de base'!D:E,2,FALSE)*F1059,\"\")","v":""},null,null,null,null,null,null,null,"non"]
[null,null,null,null,null,null,{"$f":"SUM(G1054:G1059)","v":0},null,null,null,null,null,null,null,"non"]
[null,null,null,null,null,null,{"$f":"IFERROR(VLOOKUP(E1061,'Tarif de base'!D:E,2,FALSE)*F1061,\"\")","v":""},null,null,null,{"$f":"IFERROR(IF(G1067-H1061-I1061-J1061<>0,\"Attention il manque \"&G1067-H1061-I1061-J1061&\"€\",\"Règlement OK\"),\"Pas de règlement\")","v":"Règlement OK"},null,"non",151,{"$f":"M1061","v":"non"}]
[null,null,null,null,null,null,{"$f":"IFERROR(VLOOKUP(E1062,'Tarif de base'!D:E,2,FALSE)*F1062,\"\")","v":""},null,null,null,null,null,null,null,"non"]
[null,null,null,null,null,null,{"$f":"IFERROR(VLOOKUP(E1063,'Tarif de base'!D:E,2,FALSE)*F1063,\"\")","v":""},null,null,null,null,null,null,null,"non"]
[null,null,null,null,null,null,{"$f":"IFERROR(VLOOKUP(E1064,'Tarif de base'!D:E,2,FALSE)*F1064,\"\")","v":""},null,null,null,null,null,null,null,"non"]
[null,null,null,null,null,null,{"$f":"IFERROR(VLOOKUP(E1065,'Tarif de base'!D:E,2,FALSE)*F1065,\"\")","v":""},null,null,null,null,null,null,null,"non"]
[null,null,null,null,null,null,{"$f":"IFERROR(VLOOKUP(E1066,'Tarif de base'!D:E,2,FALSE)*F1066,\"\")","v":""},null,null,null,null,null,null,null,"non"]
[null,null,null,null,null,null,{"$f":"SUM(G1061:G1066)","v":0},null,null,null,null,null,null,null,"non"]
[null,null,null,null,null,null,{"$f":"IFERROR(VLOOKUP(E1068,'Tarif de base'!D:E,2,FALSE)*F1068,\"\")","v":""},null,null,null,{"$f":"IFERROR(IF(G1074-H1068-I1068-J1068<>0,\"Attention il manque \"&G1074-H1068-I1068-J1068&\"€\",\"Règlement OK\"),\"Pas de règlement\")","v":"Règlement OK"},null,"non",152,{"$f":"M1068","v":"non"}]
[null,null,null,null,null,null,{"$f":"IFERROR(VLOOKUP(E1069,'Tarif de base'!D:E,2,FALSE)*F1069,\"\")","v":""},null,null,null,null,null,null,null,"non"]
[null,null,null,null,null,null,{"$f":"IFERROR(VLOOKUP(E1070,'Tarif de base'!D:E,2,FALSE)*F1070,\"\")","v":""},null,null,null,null,null,null,null,"non"]
[null,null,null,null,null,null,{"$f":"IFERROR(VLOOKUP(E1071,'Tarif de base'!D:E,2,FALSE)*F1071,\"\")","v":""},null,null,null,null,null,null,null,"non"]
[null,null,null,null,null,null,{"$f":"IFERROR(VLOOKUP(E1072,'Tarif de base'!D:E,2,FALSE)*F1072,\"\")","v":""},null,null,null,null,null,null,null,"non"]
[null,null,null,null,null,null,{"$f":"IFERROR(VLOOKUP(E1073,'Tarif de base'!D:E,2,FALSE)*F1073,\"\")","v":""},null,null,null,null,null,null,null,"non"]
[null,null,null,null,null,null,{"$f":"SUM(G1068:G1073)","v":0},null,null,null,null,null,null,null,"non"]
[null,null,null,null,null,null,{"$f":"IFERROR(VLOOKUP(E1075,'Tarif de base'!D:E,2,FALSE)*F1075,\"\")","v":""},null,null,null,{"$f":"IFERROR(IF(G1081-H1075-I1075-J1075<>0,\"Attention il manque \"&G1081-H1075-I1075-J1075&\"€\",\"Règlement OK\"),\"Pas de règlement\")","v":"Règlement OK"},null,"non",153,{"$f":"M1075","v":"non"}]
[null,null,null,null,null,null,{"$f":"IFERROR(VLOOKUP(E1076,'Tarif de base'!D:E,2,FALSE)*F1076,\"\")","v":""},null,null,null,null,null,null,null,"non"]
[null,null,null,null,null,null,{"$f":"IFERROR(VLOOKUP(E1077,'Tarif de base'!D:E,2,FALSE)*F1077,\"\")","v":""},null,null,null,null,null,null,null,"non"]
[null,null,null,null,null,null,{"$f":"IFERROR(VLOOKUP(E1078,'Tarif de base'!D:E,2,FALSE)*F1078,\"\")","v":""},null,null,null,null,null,null,null,"non"]
[null,null,null,null,null,null,{"$f":"IFERROR(VLOOKUP(E1079,'Tarif de base'!D:E,2,FALSE)*F1079,\"\")","v":""},null,null,null,null,null,null,null,"non"]
[null,null,null,null,null,null,{"$f":"IFERROR(VLOOKUP(E1080,'Tarif de base'!D:E,2,FALSE)*F1080,\"\")","v":""},null,null,null,null,null,null,null,"non"]
[null,null,null,null,null,null,{"$f":"SUM(G1075:G1080)","v":0},null,null,null,null,null,null,null,"non"]
[null,null,null,null,null,null,{"$f":"IFERROR(VLOOKUP(E1082,'Tarif de base'!D:E,2,FALSE)*F1082,\"\")","v":""},null,null,null,{"$f":"IFERROR(IF(G1088-H1082-I1082-J1082<>0,\"Attention il manque \"&G1088-H1082-I1082-J1082&\"€\",\"Règlement OK\"),\"Pas de règlement\")","v":"Règlement OK"},null,"non",154,{"$f":"M1082","v":"non"}]
[null,null,null,null,null,null,{"$f":"IFERROR(VLOOKUP(E1083,'Tarif de base'!D:E,2,FALSE)*F1083,\"\")","v":""},null,null,null,null,null,null,null,"non"]
[null,null,null,null,null,null,{"$f":"IFERROR(VLOOKUP(E1084,'Tarif de base'!D:E,2,FALSE)*F1084,\"\")","v":""},null,null,null,null,null,null,null,"non"]
[null,null,null,null,null,null,{"$f":"IFERROR(VLOOKUP(E1085,'Tarif de base'!D:E,2,FALSE)*F1085,\"\")","v":""},null,null,null,null,null,null,null,"non"]
[null,null,null,null,null,null,{"$f":"IFERROR(VLOOKUP(E1086,'Tarif de base'!D:E,2,FALSE)*F1086,\"\")","v":""},null,null,null,null,null,null,null,"non"]
[null,null,null,null,null,null,{"$f":"IFERROR(VLOOKUP(E1087,'Tarif de base'!D:E,2,FALSE)*F1087,\"\")","v":""},null,null,null,null,null,null,null,"non"]
[null,null,null,null,null,null,{"$f":"SUM(G1082:G1087)","v":0},null,null,null,null,null,null,null,"non"]
[null,null,null,null,null,null,{"$f":"IFERROR(VLOOKUP(E1089,'Tarif de base'!D:E,2,FALSE)*F1089,\"\")","v":""},null,null,null,{"$f":"IFERROR(IF(G1095-H1089-I1089-J1089<>0,\"Attention il manque \"&G1095-H1089-I1089-J1089&\"€\",\"Règlement OK\"),\"Pas de règlement\")","v":"Règlement OK"},null,"non",155,{"$f":"M1089","v":"non"}]
[null,null,null,null,null,null,{"$f":"IFERROR(VLOOKUP(E1090,'Tarif de base'!D:E,2,FALSE)*F1090,\"\")","v":""},null,null,null,null,null,null,null,"non"]
[null,null,null,null,null,null,{"$f":"IFERROR(VLOOKUP(E1091,'Tarif de base'!D:E,2,FALSE)*F1091,\"\")","v":""},null,null,null,null,null,null,null,"non"]
[null,null,null,null,null,null,{"$f":"IFERROR(VLOOKUP(E1092,'Tarif de base'!D:E,2,FALSE)*F1092,\"\")","v":""},null,null,null,null,null,null,null,"non"]
[null,null,null,null,null,null,{"$f":"IFERROR(VLOOKUP(E1093,'Tarif de base'!D:E,2,FALSE)*F1093,\"\")","v":""},null,null,null,null,null,null,null,"non"]
[null,null,null,null,null,null,{"$f":"IFERROR(VLOOKUP(E1094,'Tarif de base'!D:E,2,FALSE)*F1094,\"\")","v":""},null,null,null,null,null,null,null,"non"]
[null,null,null,null,null,null,{"$f":"SUM(G1089:G1094)","v":0},null,null,null,null,null,null,null,"non"]
[null,null,null,null,null,null,{"$f":"IFERROR(VLOOKUP(E1096,'Tarif de base'!D:E,2,FALSE)*F1096,\"\")","v":""},null,null,null,{"$f":"IFERROR(IF(G1102-H1096-I1096-J1096<>0,\"Attention il manque \"&G1102-H1096-I1096-J1096&\"€\",\"Règlement OK\"),\"Pas de règlement\")","v":"Règlement OK"},null,"non",156,{"$f":"M1096","v":"non"}]
[null,null,null,null,null,null,{"$f":"IFERROR(VLOOKUP(E1097,'Tarif de base'!D:E,2,FALSE)*F1097,\"\")","v":""},null,null,null,null,null,null,null,"non"]
[null,null,null,null,null,null,{"$f":"IFERROR(VLOOKUP(E1098,'Tarif de base'!D:E,2,FALSE)*F1098,\"\")","v":""},null,null,null,null,null,null,null,"non"]
[null,null,null,null,null,null,{"$f":"IFERROR(VLOOKUP(E1099,'Tarif de base'!D:E,2,FALSE)*F1099,\"\")","v":""},null,null,null,null,null,null,null,{"$f":"O1098","v":"non"}]
[null,null,null,null,null,null,{"$f":"IFERROR(VLOOKUP(E1100,'Tarif de base'!D:E,2,FALSE)*F1100,\"\")","v":""},null,null,null,null,null,null,null,"non"]
[null,null,null,null,null,null,{"$f":"IFERROR(VLOOKUP(E1101,'Tarif de base'!D:E,2,FALSE)*F1101,\"\")","v":""},null,null,null,null,null,null,null,"non"]
[null,null,null,null,null,null,{"$f":"SUM(G1096:G1101)","v":0},null,null,null,null,null,null,null,"non"]
[null,null,null,null,null,null,{"$f":"IFERROR(VLOOKUP(E1103,'Tarif de base'!D:E,2,FALSE)*F1103,\"\")","v":""},null,null,null,{"$f":"IFERROR(IF(G1109-H1103-I1103-J1103<>0,\"Attention il manque \"&G1109-H1103-I1103-J1103&\"€\",\"Règlement OK\"),\"Pas de règlement\")","v":"Règlement OK"},null,"non",157,{"$f":"M1103","v":"non"}]
[null,null,null,null,null,null,{"$f":"IFERROR(VLOOKUP(E1104,'Tarif de base'!D:E,2,FALSE)*F1104,\"\")","v":""},null,null,null,null,null,null,null,"non"]
[null,null,null,null,null,null,{"$f":"IFERROR(VLOOKUP(E1105,'Tarif de base'!D:E,2,FALSE)*F1105,\"\")","v":""},null,null,null,null,null,null,null,"non"]
[null,null,null,null,null,null,{"$f":"IFERROR(VLOOKUP(E1106,'Tarif de base'!D:E,2,FALSE)*F1106,\"\")","v":""},null,null,null,null,null,null,null,"non"]
[null,null,null,null,null,null,{"$f":"IFERROR(VLOOKUP(E1107,'Tarif de base'!D:E,2,FALSE)*F1107,\"\")","v":""},null,null,null,null,null,null,null,"non"]
[null,null,null,null,null,null,{"$f":"IFERROR(VLOOKUP(E1108,'Tarif de base'!D:E,2,FALSE)*F1108,\"\")","v":""},null,null,null,null,null,null,null,"non"]
[null,null,null,null,null,null,{"$f":"SUM(G1103:G1108)","v":0},null,null,null,null,null,null,null,"non"]
[null,null,null,null,null,null,{"$f":"IFERROR(VLOOKUP(E1110,'Tarif de base'!D:E,2,FALSE)*F1110,\"\")","v":""},null,null,null,{"$f":"IFERROR(IF(G1116-H1110-I1110-J1110<>0,\"Attention il manque \"&G1116-H1110-I1110-J1110&\"€\",\"Règlement OK\"),\"Pas de règlement\")","v":"Règlement OK"},null,"non",158,{"$f":"M1110","v":"non"}]
[null,null,null,null,null,null,{"$f":"IFERROR(VLOOKUP(E1111,'Tarif de base'!D:E,2,FALSE)*F1111,\"\")","v":""},null,null,null,null,null,null,null,"non"]
[null,null,null,null,null,null,{"$f":"IFERROR(VLOOKUP(E1112,'Tarif de base'!D:E,2,FALSE)*F1112,\"\")","v":""},null,null,null,null,null,null,null,"non"]
[null,null,null,null,null,null,{"$f":"IFERROR(VLOOKUP(E1113,'Tarif de base'!D:E,2,FALSE)*F1113,\"\")","v":""},null,null,null,null,null,null,null,"non"]
[null,null,null,null,null,null,{"$f":"IFERROR(VLOOKUP(E1114,'Tarif de base'!D:E,2,FALSE)*F1114,\"\")","v":""},null,null,null,null,null,null,null,"non"]
[null,null,null,null,null,null,{"$f":"IFERROR(VLOOKUP(E1115,'Tarif de base'!D:E,2,FALSE)*F1115,\"\")","v":""},null,null,null,null,null,null,null,"non"]
[null,null,null,null,null,null,{"$f":"SUM(G1110:G1115)","v":0},null,null,null,null,null,null,null,"non"]
[null,null,null,null,null,null,{"$f":"IFERROR(VLOOKUP(E1117,'Tarif de base'!D:E,2,FALSE)*F1117,\"\")","v":""},null,null,null,{"$f":"IFERROR(IF(G1123-H1117-I1117-J1117<>0,\"Attention il manque \"&G1123-H1117-I1117-J1117&\"€\",\"Règlement OK\"),\"Pas de règlement\")","v":"Règlement OK"},null,"non",159,{"$f":"M1117","v":"non"}]
[null,null,null,null,null,null,{"$f":"IFERROR(VLOOKUP(E1118,'Tarif de base'!D:E,2,FALSE)*F1118,\"\")","v":""},null,null,null,null,null,null,null,"non"]
[null,null,null,null,null,null,{"$f":"IFERROR(VLOOKUP(E1119,'Tarif de base'!D:E,2,FALSE)*F1119,\"\")","v":""},null,null,null,null,null,null,null,"non"]
[null,null,null,null,null,null,{"$f":"IFERROR(VLOOKUP(E1120,'Tarif de base'!D:E,2,FALSE)*F1120,\"\")","v":""},null,null,null,null,null,null,null,"non"]
[null,null,null,null,null,null,{"$f":"IFERROR(VLOOKUP(E1121,'Tarif de base'!D:E,2,FALSE)*F1121,\"\")","v":""},null,null,null,null,null,null,null,"non"]
[null,null,null,null,null,null,{"$f":"IFERROR(VLOOKUP(E1122,'Tarif de base'!D:E,2,FALSE)*F1122,\"\")","v":""},null,null,null,null,null,null,null,"non"]
[null,null,null,null,null,null,{"$f":"SUM(G1117:G1122)","v":0},null,null,null,null,null,null,null,"non"]
[null,null,null,null,null,null,{"$f":"IFERROR(VLOOKUP(E1124,'Tarif de base'!D:E,2,FALSE)*F1124,\"\")","v":""},null,null,null,{"$f":"IFERROR(IF(G1130-H1124-I1124-J1124<>0,\"Attention il manque \"&G1130-H1124-I1124-J1124&\"€\",\"Règlement OK\"),\"Pas de règlement\")","v":"Règlement OK"},null,"non",160,{"$f":"M1124","v":"non"}]
[null,null,null,null,null,null,{"$f":"IFERROR(VLOOKUP(E1125,'Tarif de base'!D:E,2,FALSE)*F1125,\"\")","v":""},null,null,null,null,null,null,null,{"$f":"O1124","v":"non"}]
[null,null,null,null,null,null,{"$f":"IFERROR(VLOOKUP(E1126,'Tarif de base'!D:E,2,FALSE)*F1126,\"\")","v":""},null,null,null,null,null,null,null,"non"]
[null,null,null,null,null,null,{"$f":"IFERROR(VLOOKUP(E1127,'Tarif de base'!D:E,2,FALSE)*F1127,\"\")","v":""},null,null,null,null,null,null,null,"non"]
[null,null,null,null,null,null,{"$f":"IFERROR(VLOOKUP(E1128,'Tarif de base'!D:E,2,FALSE)*F1128,\"\")","v":""},null,null,null,null,null,null,null,"non"]
[null,null,null,null,null,null,{"$f":"IFERROR(VLOOKUP(E1129,'Tarif de base'!D:E,2,FALSE)*F1129,\"\")","v":""},null,null,null,null,null,null,null,"non"]
[null,null,null,null,null,null,{"$f":"SUM(G1124:G1129)","v":0},null,null,null,null,null,null,null,"non"]
[null,null,null,null,null,null,{"$f":"IFERROR(VLOOKUP(E1131,'Tarif de base'!D:E,2,FALSE)*F1131,\"\")","v":""},null,null,null,{"$f":"IFERROR(IF(G1137-H1131-I1131-J1131<>0,\"Attention il manque \"&G1137-H1131-I1131-J1131&\"€\",\"Règlement OK\"),\"Pas de règlement\")","v":"Règlement OK"},null,"non",161,{"$f":"M1131","v":"non"}]
[null,null,null,null,null,null,{"$f":"IFERROR(VLOOKUP(E1132,'Tarif de base'!D:E,2,FALSE)*F1132,\"\")","v":""},null,null,null,null,null,null,null,"non"]
[null,null,null,null,null,null,{"$f":"IFERROR(VLOOKUP(E1133,'Tarif de base'!D:E,2,FALSE)*F1133,\"\")","v":""},null,null,null,null,null,null,null,"non"]
[null,null,null,null,null,null,{"$f":"IFERROR(VLOOKUP(E1134,'Tarif de base'!D:E,2,FALSE)*F1134,\"\")","v":""},null,null,null,null,null,null,null,"non"]
[null,null,null,null,null,null,{"$f":"IFERROR(VLOOKUP(E1135,'Tarif de base'!D:E,2,FALSE)*F1135,\"\")","v":""},null,null,null,null,null,null,null,"non"]
[null,null,null,null,null,null,{"$f":"IFERROR(VLOOKUP(E1136,'Tarif de base'!D:E,2,FALSE)*F1136,\"\")","v":""},null,null,null,null,null,null,null,"non"]
[null,null,null,null,null,null,{"$f":"SUM(G1131:G1136)","v":0},null,null,null,null,null,null,null,"non"]
[null,null,null,null,null,null,{"$f":"IFERROR(VLOOKUP(E1138,'Tarif de base'!D:E,2,FALSE)*F1138,\"\")","v":""},null,null,null,{"$f":"IFERROR(IF(G1144-H1138-I1138-J1138<>0,\"Attention il manque \"&G1144-H1138-I1138-J1138&\"€\",\"Règlement OK\"),\"Pas de règlement\")","v":"Règlement OK"},null,"non",162,{"$f":"M1138","v":"non"}]
[null,null,null,null,null,null,{"$f":"IFERROR(VLOOKUP(E1139,'Tarif de base'!D:E,2,FALSE)*F1139,\"\")","v":""},null,null,null,null,null,null,null,"non"]
[null,null,null,null,null,null,{"$f":"IFERROR(VLOOKUP(E1140,'Tarif de base'!D:E,2,FALSE)*F1140,\"\")","v":""},null,null,null,null,null,null,null,"non"]
[null,null,null,null,null,null,{"$f":"IFERROR(VLOOKUP(E1141,'Tarif de base'!D:E,2,FALSE)*F1141,\"\")","v":""},null,null,null,null,null,null,null,"non"]
[null,null,null,null,null,null,{"$f":"IFERROR(VLOOKUP(E1142,'Tarif de base'!D:E,2,FALSE)*F1142,\"\")","v":""},null,null,null,null,null,null,null,"non"]
[null,null,null,null,null,null,{"$f":"IFERROR(VLOOKUP(E1143,'Tarif de base'!D:E,2,FALSE)*F1143,\"\")","v":""},null,null,null,null,null,null,null,"non"]
[null,null,null,null,null,null,{"$f":"SUM(G1138:G1143)","v":0},null,null,null,null,null,null,null,"non"]
[null,null,null,null,null,null,{"$f":"IFERROR(VLOOKUP(E1145,'Tarif de base'!D:E,2,FALSE)*F1145,\"\")","v":""},null,null,null,{"$f":"IFERROR(IF(G1151-H1145-I1145-J1145<>0,\"Attention il manque \"&G1151-H1145-I1145-J1145&\"€\",\"Règlement OK\"),\"Pas de règlement\")","v":"Règlement OK"},null,"non",163,{"$f":"M1145","v":"non"}]
[null,null,null,null,null,null,{"$f":"IFERROR(VLOOKUP(E1146,'Tarif de base'!D:E,2,FALSE)*F1146,\"\")","v":""},null,null,null,null,null,null,null,"non"]
[null,null,null,null,null,null,{"$f":"IFERROR(VLOOKUP(E1147,'Tarif de base'!D:E,2,FALSE)*F1147,\"\")","v":""},null,null,null,null,null,null,null,"non"]
[null,null,null,null,null,null,{"$f":"IFERROR(VLOOKUP(E1148,'Tarif de base'!D:E,2,FALSE)*F1148,\"\")","v":""},null,null,null,null,null,null,null,"non"]
[null,null,null,null,null,null,{"$f":"IFERROR(VLOOKUP(E1149,'Tarif de base'!D:E,2,FALSE)*F1149,\"\")","v":""},null,null,null,null,null,null,null,"non"]
[null,null,null,null,null,null,{"$f":"IFERROR(VLOOKUP(E1150,'Tarif de base'!D:E,2,FALSE)*F1150,\"\")","v":""},null,null,null,null,null,null,null,"non"]
[null,null,null,null,null,null,{"$f":"SUM(G1145:G1150)","v":0},null,null,null,null,null,null,null,"non"]
[null,null,null,null,null,null,{"$f":"IFERROR(VLOOKUP(E1152,'Tarif de base'!D:E,2,FALSE)*F1152,\"\")","v":""},null,null,null,{"$f":"IFERROR(IF(G1158-H1152-I1152-J1152<>0,\"Attention il manque \"&G1158-H1152-I1152-J1152&\"€\",\"Règlement OK\"),\"Pas de règlement\")","v":"Règlement OK"},null,"non",164,{"$f":"M1152","v":"non"}]
[null,null,null,null,null,null,{"$f":"IFERROR(VLOOKUP(E1153,'Tarif de base'!D:E,2,FALSE)*F1153,\"\")","v":""},null,null,null,null,null,null,null,{"$f":"O1152","v":"non"}]
[null,null,null,null,null,null,{"$f":"IFERROR(VLOOKUP(E1154,'Tarif de base'!D:E,2,FALSE)*F1154,\"\")","v":""},null,null,null,null,null,null,null,{"$f":"O1153","v":"non"}]
[null,null,null,null,null,null,{"$f":"IFERROR(VLOOKUP(E1155,'Tarif de base'!D:E,2,FALSE)*F1155,\"\")","v":""},null,null,null,null,null,null,null,"non"]
[null,null,null,null,null,null,{"$f":"IFERROR(VLOOKUP(E1156,'Tarif de base'!D:E,2,FALSE)*F1156,\"\")","v":""},null,null,null,null,null,null,null,"non"]
[null,null,null,null,null,null,{"$f":"IFERROR(VLOOKUP(E1157,'Tarif de base'!D:E,2,FALSE)*F1157,\"\")","v":""},null,null,null,null,null,null,null,"non"]
[null,null,null,null,null,null,{"$f":"SUM(G1152:G1157)","v":0},null,null,null,null,null,null,null,"non"]
[null,null,null,null,null,null,{"$f":"IFERROR(VLOOKUP(E1159,'Tarif de base'!D:E,2,FALSE)*F1159,\"\")","v":""},null,null,null,{"$f":"IFERROR(IF(G1165-H1159-I1159-J1159<>0,\"Attention il manque \"&G1165-H1159-I1159-J1159&\"€\",\"Règlement OK\"),\"Pas de règlement\")","v":"Règlement OK"},null,"non",165,{"$f":"M1159","v":"non"}]
[null,null,null,null,null,null,{"$f":"IFERROR(VLOOKUP(E1160,'Tarif de base'!D:E,2,FALSE)*F1160,\"\")","v":""},null,null,null,null,null,null,null,{"$f":"O1159","v":"non"}]
[null,null,null,null,null,null,{"$f":"IFERROR(VLOOKUP(E1161,'Tarif de base'!D:E,2,FALSE)*F1161,\"\")","v":""},null,null,null,null,null,null,null,{"$f":"O1160","v":"non"}]
[null,null,null,null,null,null,{"$f":"IFERROR(VLOOKUP(E1162,'Tarif de base'!D:E,2,FALSE)*F1162,\"\")","v":""},null,null,null,null,null,null,null,"non"]
[null,null,null,null,null,null,{"$f":"IFERROR(VLOOKUP(E1163,'Tarif de base'!D:E,2,FALSE)*F1163,\"\")","v":""},null,null,null,null,null,null,null,"non"]
[null,null,null,null,null,null,{"$f":"IFERROR(VLOOKUP(E1164,'Tarif de base'!D:E,2,FALSE)*F1164,\"\")","v":""},null,null,null,null,null,null,null,"non"]
[null,null,null,null,null,null,{"$f":"SUM(G1159:G1164)","v":0},null,null,null,null,null,null,null,"non"]
[null,null,null,null,null,null,{"$f":"IFERROR(VLOOKUP(E1166,'Tarif de base'!D:E,2,FALSE)*F1166,\"\")","v":""},null,null,null,{"$f":"IFERROR(IF(G1172-H1166-I1166-J1166<>0,\"Attention il manque \"&G1172-H1166-I1166-J1166&\"€\",\"Règlement OK\"),\"Pas de règlement\")","v":"Règlement OK"},null,"non",166,{"$f":"M1166","v":"non"}]
[null,null,null,null,null,null,{"$f":"IFERROR(VLOOKUP(E1167,'Tarif de base'!D:E,2,FALSE)*F1167,\"\")","v":""},null,null,null,null,null,null,null,"non"]
[null,null,null,null,null,null,{"$f":"IFERROR(VLOOKUP(E1168,'Tarif de base'!D:E,2,FALSE)*F1168,\"\")","v":""},null,null,null,null,null,null,null,"non"]
[null,null,null,null,null,null,{"$f":"IFERROR(VLOOKUP(E1169,'Tarif de base'!D:E,2,FALSE)*F1169,\"\")","v":""},null,null,null,null,null,null,null,"non"]
[null,null,null,null,null,null,{"$f":"IFERROR(VLOOKUP(E1170,'Tarif de base'!D:E,2,FALSE)*F1170,\"\")","v":""},null,null,null,null,null,null,null,"non"]
[null,null,null,null,null,null,{"$f":"IFERROR(VLOOKUP(E1171,'Tarif de base'!D:E,2,FALSE)*F1171,\"\")","v":""},null,null,null,null,null,null,null,"non"]
[null,null,null,null,null,null,{"$f":"SUM(G1166:G1171)","v":0},null,null,null,null,null,null,null,"non"]
[null,null,null,null,null,null,{"$f":"IFERROR(VLOOKUP(E1173,'Tarif de base'!D:E,2,FALSE)*F1173,\"\")","v":""},null,null,null,{"$f":"IFERROR(IF(G1179-H1173-I1173-J1173<>0,\"Attention il manque \"&G1179-H1173-I1173-J1173&\"€\",\"Règlement OK\"),\"Pas de règlement\")","v":"Règlement OK"},null,"non",167,{"$f":"M1173","v":"non"}]
[null,null,null,null,null,null,{"$f":"IFERROR(VLOOKUP(E1174,'Tarif de base'!D:E,2,FALSE)*F1174,\"\")","v":""},null,null,null,null,null,null,null,"non"]
[null,null,null,null,null,null,{"$f":"IFERROR(VLOOKUP(E1175,'Tarif de base'!D:E,2,FALSE)*F1175,\"\")","v":""},null,null,null,null,null,null,null,"non"]
[null,null,null,null,null,null,{"$f":"IFERROR(VLOOKUP(E1176,'Tarif de base'!D:E,2,FALSE)*F1176,\"\")","v":""},null,null,null,null,null,null,null,"non"]
[null,null,null,null,null,null,{"$f":"IFERROR(VLOOKUP(E1177,'Tarif de base'!D:E,2,FALSE)*F1177,\"\")","v":""},null,null,null,null,null,null,null,"non"]
[null,null,null,null,null,null,{"$f":"IFERROR(VLOOKUP(E1178,'Tarif de base'!D:E,2,FALSE)*F1178,\"\")","v":""},null,null,null,null,null,null,null,"non"]
[null,null,null,null,null,null,{"$f":"SUM(G1173:G1178)","v":0},null,null,null,null,null,null,null,"non"]
[null,null,null,null,null,null,{"$f":"IFERROR(VLOOKUP(E1180,'Tarif de base'!D:E,2,FALSE)*F1180,\"\")","v":""},null,null,null,{"$f":"IFERROR(IF(G1186-H1180-I1180-J1180<>0,\"Attention il manque \"&G1186-H1180-I1180-J1180&\"€\",\"Règlement OK\"),\"Pas de règlement\")","v":"Règlement OK"},null,"non",168,{"$f":"M1180","v":"non"}]
[null,null,null,null,null,null,{"$f":"IFERROR(VLOOKUP(E1181,'Tarif de base'!D:E,2,FALSE)*F1181,\"\")","v":""},null,null,null,null,null,null,null,"non"]
[null,null,null,null,null,null,{"$f":"IFERROR(VLOOKUP(E1182,'Tarif de base'!D:E,2,FALSE)*F1182,\"\")","v":""},null,null,null,null,null,null,null,"non"]
[null,null,null,null,null,null,{"$f":"IFERROR(VLOOKUP(E1183,'Tarif de base'!D:E,2,FALSE)*F1183,\"\")","v":""},null,null,null,null,null,null,null,"non"]
[null,null,null,null,null,null,{"$f":"IFERROR(VLOOKUP(E1184,'Tarif de base'!D:E,2,FALSE)*F1184,\"\")","v":""},null,null,null,null,null,null,null,"non"]
[null,null,null,null,null,null,{"$f":"IFERROR(VLOOKUP(E1185,'Tarif de base'!D:E,2,FALSE)*F1185,\"\")","v":""},null,null,null,null,null,null,null,"non"]
[null,null,null,null,null,null,{"$f":"SUM(G1180:G1185)","v":0},null,null,null,null,null,null,null,"non"]
[null,null,null,null,null,null,{"$f":"IFERROR(VLOOKUP(E1187,'Tarif de base'!D:E,2,FALSE)*F1187,\"\")","v":""},null,null,null,{"$f":"IFERROR(IF(G1193-H1187-I1187-J1187<>0,\"Attention il manque \"&G1193-H1187-I1187-J1187&\"€\",\"Règlement OK\"),\"Pas de règlement\")","v":"Règlement OK"},null,"non",169,{"$f":"M1187","v":"non"}]
[null,null,null,null,null,null,{"$f":"IFERROR(VLOOKUP(E1188,'Tarif de base'!D:E,2,FALSE)*F1188,\"\")","v":""},null,null,null,null,null,null,null,"non"]
[null,null,null,null,null,null,{"$f":"IFERROR(VLOOKUP(E1189,'Tarif de base'!D:E,2,FALSE)*F1189,\"\")","v":""},null,null,null,null,null,null,null,"non"]
[null,null,null,null,null,null,{"$f":"IFERROR(VLOOKUP(E1190,'Tarif de base'!D:E,2,FALSE)*F1190,\"\")","v":""},null,null,null,null,null,null,null,"non"]
[null,null,null,null,null,null,{"$f":"IFERROR(VLOOKUP(E1191,'Tarif de base'!D:E,2,FALSE)*F1191,\"\")","v":""},null,null,null,null,null,null,null,"non"]
[null,null,null,null,null,null,{"$f":"IFERROR(VLOOKUP(E1192,'Tarif de base'!D:E,2,FALSE)*F1192,\"\")","v":""},null,null,null,null,null,null,null,"non"]
[null,null,null,null,null,null,{"$f":"SUM(G1187:G1192)","v":0},null,null,null,null,null,null,null,"non"]
[null,null,null,null,null,null,{"$f":"IFERROR(VLOOKUP(E1194,'Tarif de base'!D:E,2,FALSE)*F1194,\"\")","v":""},null,null,null,{"$f":"IFERROR(IF(G1200-H1194-I1194-J1194<>0,\"Attention il manque \"&G1200-H1194-I1194-J1194&\"€\",\"Règlement OK\"),\"Pas de règlement\")","v":"Règlement OK"},null,"non",170,{"$f":"M1194","v":"non"}]
[null,null,null,null,null,null,{"$f":"IFERROR(VLOOKUP(E1195,'Tarif de base'!D:E,2,FALSE)*F1195,\"\")","v":""},null,null,null,null,null,null,null,"non"]
[null,null,null,null,null,null,{"$f":"IFERROR(VLOOKUP(E1196,'Tarif de base'!D:E,2,FALSE)*F1196,\"\")","v":""},null,null,null,null,null,null,null,"non"]
[null,null,null,null,null,null,{"$f":"IFERROR(VLOOKUP(E1197,'Tarif de base'!D:E,2,FALSE)*F1197,\"\")","v":""},null,null,null,null,null,null,null,"non"]
[null,null,null,null,null,null,{"$f":"IFERROR(VLOOKUP(E1198,'Tarif de base'!D:E,2,FALSE)*F1198,\"\")","v":""},null,null,null,null,null,null,null,"non"]
[null,null,null,null,null,null,{"$f":"IFERROR(VLOOKUP(E1199,'Tarif de base'!D:E,2,FALSE)*F1199,\"\")","v":""},null,null,null,null,null,null,null,"non"]
[null,null,null,null,null,null,{"$f":"SUM(G1194:G1199)","v":0},null,null,null,null,null,null,null,"non"]
[null,null,null,null,null,null,{"$f":"IFERROR(VLOOKUP(E1201,'Tarif de base'!D:E,2,FALSE)*F1201,\"\")","v":""},null,null,null,{"$f":"IFERROR(IF(G1207-H1201-I1201-J1201<>0,\"Attention il manque \"&G1207-H1201-I1201-J1201&\"€\",\"Règlement OK\"),\"Pas de règlement\")","v":"Règlement OK"},null,"non",171,{"$f":"M1201","v":"non"}]
[null,null,null,null,null,null,{"$f":"IFERROR(VLOOKUP(E1202,'Tarif de base'!D:E,2,FALSE)*F1202,\"\")","v":""},null,null,null,null,null,null,null,"non"]
[null,null,null,null,null,null,{"$f":"IFERROR(VLOOKUP(E1203,'Tarif de base'!D:E,2,FALSE)*F1203,\"\")","v":""},null,null,null,null,null,null,null,"non"]
[null,null,null,null,null,null,{"$f":"IFERROR(VLOOKUP(E1204,'Tarif de base'!D:E,2,FALSE)*F1204,\"\")","v":""},null,null,null,null,null,null,null,"non"]
[null,null,null,null,null,null,{"$f":"IFERROR(VLOOKUP(E1205,'Tarif de base'!D:E,2,FALSE)*F1205,\"\")","v":""},null,null,null,null,null,null,null,"non"]
[null,null,null,null,null,null,{"$f":"IFERROR(VLOOKUP(E1206,'Tarif de base'!D:E,2,FALSE)*F1206,\"\")","v":""},null,null,null,null,null,null,null,"non"]
[null,null,null,null,null,null,{"$f":"SUM(G1201:G1206)","v":0},null,null,null,null,null,null,null,"non"]
[null,null,null,null,null,null,{"$f":"IFERROR(VLOOKUP(E1208,'Tarif de base'!D:E,2,FALSE)*F1208,\"\")","v":""},null,null,null,{"$f":"IFERROR(IF(G1214-H1208-I1208-J1208<>0,\"Attention il manque \"&G1214-H1208-I1208-J1208&\"€\",\"Règlement OK\"),\"Pas de règlement\")","v":"Règlement OK"},null,"non",172,{"$f":"M1208","v":"non"}]
[null,null,null,null,null,null,{"$f":"IFERROR(VLOOKUP(E1209,'Tarif de base'!D:E,2,FALSE)*F1209,\"\")","v":""},null,null,null,null,null,null,null,"non"]
[null,null,null,null,null,null,{"$f":"IFERROR(VLOOKUP(E1210,'Tarif de base'!D:E,2,FALSE)*F1210,\"\")","v":""},null,null,null,null,null,null,null,"non"]
[null,null,null,null,null,null,{"$f":"IFERROR(VLOOKUP(E1211,'Tarif de base'!D:E,2,FALSE)*F1211,\"\")","v":""},null,null,null,null,null,null,null,"non"]
[null,null,null,null,null,null,{"$f":"IFERROR(VLOOKUP(E1212,'Tarif de base'!D:E,2,FALSE)*F1212,\"\")","v":""},null,null,null,null,null,null,null,"non"]
[null,null,null,null,null,null,{"$f":"IFERROR(VLOOKUP(E1213,'Tarif de base'!D:E,2,FALSE)*F1213,\"\")","v":""},null,null,null,null,null,null,null,"non"]
[null,null,null,null,null,null,{"$f":"SUM(G1208:G1213)","v":0},null,null,null,null,null,null,null,"non"]
[null,null,null,null,null,null,{"$f":"IFERROR(VLOOKUP(E1215,'Tarif de base'!D:E,2,FALSE)*F1215,\"\")","v":""},null,null,null,{"$f":"IFERROR(IF(G1221-H1215-I1215-J1215<>0,\"Attention il manque \"&G1221-H1215-I1215-J1215&\"€\",\"Règlement OK\"),\"Pas de règlement\")","v":"Règlement OK"},null,"non",173,{"$f":"M1215","v":"non"}]
[null,null,null,null,null,null,{"$f":"IFERROR(VLOOKUP(E1216,'Tarif de base'!D:E,2,FALSE)*F1216,\"\")","v":""},null,null,null,null,null,null,null,"non"]
[null,null,null,null,null,null,{"$f":"IFERROR(VLOOKUP(E1217,'Tarif de base'!D:E,2,FALSE)*F1217,\"\")","v":""},null,null,null,null,null,null,null,"non"]
[null,null,null,null,null,null,{"$f":"IFERROR(VLOOKUP(E1218,'Tarif de base'!D:E,2,FALSE)*F1218,\"\")","v":""},null,null,null,null,null,null,null,"non"]
[null,null,null,null,null,null,{"$f":"IFERROR(VLOOKUP(E1219,'Tarif de base'!D:E,2,FALSE)*F1219,\"\")","v":""},null,null,null,null,null,null,null,"non"]
[null,null,null,null,null,null,{"$f":"IFERROR(VLOOKUP(E1220,'Tarif de base'!D:E,2,FALSE)*F1220,\"\")","v":""},null,null,null,null,null,null,null,"non"]
[null,null,null,null,null,null,{"$f":"SUM(G1215:G1220)","v":0},null,null,null,null,null,null,null,"non"]
[null,null,null,null,null,null,{"$f":"IFERROR(VLOOKUP(E1222,'Tarif de base'!D:E,2,FALSE)*F1222,\"\")","v":""},null,null,null,{"$f":"IFERROR(IF(G1228-H1222-I1222-J1222<>0,\"Attention il manque \"&G1228-H1222-I1222-J1222&\"€\",\"Règlement OK\"),\"Pas de règlement\")","v":"Règlement OK"},null,"non",174,{"$f":"M1222","v":"non"}]
[null,null,null,null,null,null,{"$f":"IFERROR(VLOOKUP(E1223,'Tarif de base'!D:E,2,FALSE)*F1223,\"\")","v":""},null,null,null,null,null,null,null,"non"]
[null,null,null,null,null,null,{"$f":"IFERROR(VLOOKUP(E1224,'Tarif de base'!D:E,2,FALSE)*F1224,\"\")","v":""},null,null,null,null,null,null,null,"non"]
[null,null,null,null,null,null,{"$f":"IFERROR(VLOOKUP(E1225,'Tarif de base'!D:E,2,FALSE)*F1225,\"\")","v":""},null,null,null,null,null,null,null,{"$f":"O1224","v":"non"}]
[null,null,null,null,null,null,{"$f":"IFERROR(VLOOKUP(E1226,'Tarif de base'!D:E,2,FALSE)*F1226,\"\")","v":""},null,null,null,null,null,null,null,"non"]
[null,null,null,null,null,null,{"$f":"IFERROR(VLOOKUP(E1227,'Tarif de base'!D:E,2,FALSE)*F1227,\"\")","v":""},null,null,null,null,null,null,null,"non"]
[null,null,null,null,null,null,{"$f":"SUM(G1222:G1227)","v":0},null,null,null,null,null,null,null,"non"]
[null,null,null,null,null,null,{"$f":"IFERROR(VLOOKUP(E1229,'Tarif de base'!D:E,2,FALSE)*F1229,\"\")","v":""},null,null,null,{"$f":"IFERROR(IF(G1235-H1229-I1229-J1229<>0,\"Attention il manque \"&G1235-H1229-I1229-J1229&\"€\",\"Règlement OK\"),\"Pas de règlement\")","v":"Règlement OK"},null,"non",175,{"$f":"M1229","v":"non"}]
[null,null,null,null,null,null,{"$f":"IFERROR(VLOOKUP(E1230,'Tarif de base'!D:E,2,FALSE)*F1230,\"\")","v":""},null,null,null,null,null,null,null,"non"]
[null,null,null,null,null,null,{"$f":"IFERROR(VLOOKUP(E1231,'Tarif de base'!D:E,2,FALSE)*F1231,\"\")","v":""},null,null,null,null,null,null,null,"non"]
[null,null,null,null,null,null,{"$f":"IFERROR(VLOOKUP(E1232,'Tarif de base'!D:E,2,FALSE)*F1232,\"\")","v":""},null,null,null,null,null,null,null,"non"]
[null,null,null,null,null,null,{"$f":"IFERROR(VLOOKUP(E1233,'Tarif de base'!D:E,2,FALSE)*F1233,\"\")","v":""},null,null,null,null,null,null,null,"non"]
[null,null,null,null,null,null,{"$f":"IFERROR(VLOOKUP(E1234,'Tarif de base'!D:E,2,FALSE)*F1234,\"\")","v":""},null,null,null,null,null,null,null,"non"]
[null,null,null,null,null,null,{"$f":"SUM(G1229:G1234)","v":0},null,null,null,null,null,null,null,"non"]
[null,null,null,null,null,null,{"$f":"IFERROR(VLOOKUP(E1236,'Tarif de base'!D:E,2,FALSE)*F1236,\"\")","v":""},null,null,null,{"$f":"IFERROR(IF(G1242-H1236-I1236-J1236<>0,\"Attention il manque \"&G1242-H1236-I1236-J1236&\"€\",\"Règlement OK\"),\"Pas de règlement\")","v":"Règlement OK"},null,"non",176,{"$f":"M1236","v":"non"}]
[null,null,null,null,null,null,{"$f":"IFERROR(VLOOKUP(E1237,'Tarif de base'!D:E,2,FALSE)*F1237,\"\")","v":""},null,null,null,null,null,null,null,"non"]
[null,null,null,null,null,null,{"$f":"IFERROR(VLOOKUP(E1238,'Tarif de base'!D:E,2,FALSE)*F1238,\"\")","v":""},null,null,null,null,null,null,null,"non"]
[null,null,null,null,null,null,{"$f":"IFERROR(VLOOKUP(E1239,'Tarif de base'!D:E,2,FALSE)*F1239,\"\")","v":""},null,null,null,null,null,null,null,"non"]
[null,null,null,null,null,null,{"$f":"IFERROR(VLOOKUP(E1240,'Tarif de base'!D:E,2,FALSE)*F1240,\"\")","v":""},null,null,null,null,null,null,null,"non"]
[null,null,null,null,null,null,{"$f":"IFERROR(VLOOKUP(E1241,'Tarif de base'!D:E,2,FALSE)*F1241,\"\")","v":""},null,null,null,null,null,null,null,"non"]
[null,null,null,null,null,null,{"$f":"SUM(G1236:G1241)","v":0},null,null,null,null,null,null,null,"non"]
[null,null,null,null,null,null,{"$f":"IFERROR(VLOOKUP(E1243,'Tarif de base'!D:E,2,FALSE)*F1243,\"\")","v":""},null,null,null,{"$f":"IFERROR(IF(G1249-H1243-I1243-J1243<>0,\"Attention il manque \"&G1249-H1243-I1243-J1243&\"€\",\"Règlement OK\"),\"Pas de règlement\")","v":"Règlement OK"},null,"non",177,{"$f":"M1243","v":"non"}]
[null,null,null,null,null,null,{"$f":"IFERROR(VLOOKUP(E1244,'Tarif de base'!D:E,2,FALSE)*F1244,\"\")","v":""},null,null,null,null,null,null,null,"non"]
[null,null,null,null,null,null,{"$f":"IFERROR(VLOOKUP(E1245,'Tarif de base'!D:E,2,FALSE)*F1245,\"\")","v":""},null,null,null,null,null,null,null,"non"]
[null,null,null,null,null,null,{"$f":"IFERROR(VLOOKUP(E1246,'Tarif de base'!D:E,2,FALSE)*F1246,\"\")","v":""},null,null,null,null,null,null,null,"non"]
[null,null,null,null,null,null,{"$f":"IFERROR(VLOOKUP(E1247,'Tarif de base'!D:E,2,FALSE)*F1247,\"\")","v":""},null,null,null,null,null,null,null,"non"]
[null,null,null,null,null,null,{"$f":"IFERROR(VLOOKUP(E1248,'Tarif de base'!D:E,2,FALSE)*F1248,\"\")","v":""},null,null,null,null,null,null,null,"non"]
[null,null,null,null,null,null,{"$f":"SUM(G1243:G1248)","v":0},null,null,null,null,null,null,null,"non"]
[null,null,null,null,null,null,{"$f":"IFERROR(VLOOKUP(E1250,'Tarif de base'!D:E,2,FALSE)*F1250,\"\")","v":""},null,null,null,{"$f":"IFERROR(IF(G1256-H1250-I1250-J1250<>0,\"Attention il manque \"&G1256-H1250-I1250-J1250&\"€\",\"Règlement OK\"),\"Pas de règlement\")","v":"Règlement OK"},null,"non",178,{"$f":"M1250","v":"non"}]
[null,null,null,null,null,null,{"$f":"IFERROR(VLOOKUP(E1251,'Tarif de base'!D:E,2,FALSE)*F1251,\"\")","v":""},null,null,null,null,null,null,null,{"$f":"O1250","v":"non"}]
[null,null,null,null,null,null,{"$f":"IFERROR(VLOOKUP(E1252,'Tarif de base'!D:E,2,FALSE)*F1252,\"\")","v":""},null,null,null,null,null,null,null,"non"]
[null,null,null,null,null,null,{"$f":"IFERROR(VLOOKUP(E1253,'Tarif de base'!D:E,2,FALSE)*F1253,\"\")","v":""},null,null,null,null,null,null,null,"non"]
[null,null,null,null,null,null,{"$f":"IFERROR(VLOOKUP(E1254,'Tarif de base'!D:E,2,FALSE)*F1254,\"\")","v":""},null,null,null,null,null,null,null,"non"]
[null,null,null,null,null,null,{"$f":"IFERROR(VLOOKUP(E1255,'Tarif de base'!D:E,2,FALSE)*F1255,\"\")","v":""},null,null,null,null,null,null,null,"non"]
[null,null,null,null,null,null,{"$f":"SUM(G1250:G1255)","v":0},null,null,null,null,null,null,null,"non"]
[null,null,null,null,null,null,{"$f":"IFERROR(VLOOKUP(E1257,'Tarif de base'!D:E,2,FALSE)*F1257,\"\")","v":""},null,null,null,{"$f":"IFERROR(IF(G1263-H1257-I1257-J1257<>0,\"Attention il manque \"&G1263-H1257-I1257-J1257&\"€\",\"Règlement OK\"),\"Pas de règlement\")","v":"Règlement OK"},null,"non",179,{"$f":"M1257","v":"non"}]
[null,null,null,null,null,null,{"$f":"IFERROR(VLOOKUP(E1258,'Tarif de base'!D:E,2,FALSE)*F1258,\"\")","v":""},null,null,null,null,null,null,null,"non"]
[null,null,null,null,null,null,{"$f":"IFERROR(VLOOKUP(E1259,'Tarif de base'!D:E,2,FALSE)*F1259,\"\")","v":""},null,null,null,null,null,null,null,"non"]
[null,null,null,null,null,null,{"$f":"IFERROR(VLOOKUP(E1260,'Tarif de base'!D:E,2,FALSE)*F1260,\"\")","v":""},null,null,null,null,null,null,null,"non"]
[null,null,null,null,null,null,{"$f":"IFERROR(VLOOKUP(E1261,'Tarif de base'!D:E,2,FALSE)*F1261,\"\")","v":""},null,null,null,null,null,null,null,"non"]
[null,null,null,null,null,null,{"$f":"IFERROR(VLOOKUP(E1262,'Tarif de base'!D:E,2,FALSE)*F1262,\"\")","v":""},null,null,null,null,null,null,null,"non"]
[null,null,null,null,null,null,{"$f":"SUM(G1257:G1262)","v":0},null,null,null,null,null,null,null,"non"]
[null,null,null,null,null,null,{"$f":"IFERROR(VLOOKUP(E1264,'Tarif de base'!D:E,2,FALSE)*F1264,\"\")","v":""},null,null,null,{"$f":"IFERROR(IF(G1270-H1264-I1264-J1264<>0,\"Attention il manque \"&G1270-H1264-I1264-J1264&\"€\",\"Règlement OK\"),\"Pas de règlement\")","v":"Règlement OK"},null,"non",180,{"$f":"M1264","v":"non"}]
[null,null,null,null,null,null,{"$f":"IFERROR(VLOOKUP(E1265,'Tarif de base'!D:E,2,FALSE)*F1265,\"\")","v":""},null,null,null,null,null,null,null,"non"]
[null,null,null,null,null,null,{"$f":"IFERROR(VLOOKUP(E1266,'Tarif de base'!D:E,2,FALSE)*F1266,\"\")","v":""},null,null,null,null,null,null,null,"non"]
[null,null,null,null,null,null,{"$f":"IFERROR(VLOOKUP(E1267,'Tarif de base'!D:E,2,FALSE)*F1267,\"\")","v":""},null,null,null,null,null,null,null,"non"]
[null,null,null,null,null,null,{"$f":"IFERROR(VLOOKUP(E1268,'Tarif de base'!D:E,2,FALSE)*F1268,\"\")","v":""},null,null,null,null,null,null,null,"non"]
[null,null,null,null,null,null,{"$f":"IFERROR(VLOOKUP(E1269,'Tarif de base'!D:E,2,FALSE)*F1269,\"\")","v":""},null,null,null,null,null,null,null,"non"]
[null,null,null,null,null,null,{"$f":"SUM(G1264:G1269)","v":0},null,null,null,null,null,null,null,"non"]
[null,null,null,null,null,null,{"$f":"IFERROR(VLOOKUP(E1271,'Tarif de base'!D:E,2,FALSE)*F1271,\"\")","v":""},null,null,null,{"$f":"IFERROR(IF(G1277-H1271-I1271-J1271<>0,\"Attention il manque \"&G1277-H1271-I1271-J1271&\"€\",\"Règlement OK\"),\"Pas de règlement\")","v":"Règlement OK"},null,"non",181,{"$f":"M1271","v":"non"}]
[null,null,null,null,null,null,{"$f":"IFERROR(VLOOKUP(E1272,'Tarif de base'!D:E,2,FALSE)*F1272,\"\")","v":""},null,null,null,null,null,null,null,"non"]
[null,null,null,null,null,null,{"$f":"IFERROR(VLOOKUP(E1273,'Tarif de base'!D:E,2,FALSE)*F1273,\"\")","v":""},null,null,null,null,null,null,null,"non"]
[null,null,null,null,null,null,{"$f":"IFERROR(VLOOKUP(E1274,'Tarif de base'!D:E,2,FALSE)*F1274,\"\")","v":""},null,null,null,null,null,null,null,"non"]
[null,null,null,null,null,null,{"$f":"IFERROR(VLOOKUP(E1275,'Tarif de base'!D:E,2,FALSE)*F1275,\"\")","v":""},null,null,null,null,null,null,null,"non"]
[null,null,null,null,null,null,{"$f":"IFERROR(VLOOKUP(E1276,'Tarif de base'!D:E,2,FALSE)*F1276,\"\")","v":""},null,null,null,null,null,null,null,"non"]
[null,null,null,null,null,null,{"$f":"SUM(G1271:G1276)","v":0},null,null,null,null,null,null,null,"non"]
[null,null,null,null,null,null,{"$f":"IFERROR(VLOOKUP(E1278,'Tarif de base'!D:E,2,FALSE)*F1278,\"\")","v":""},null,null,null,{"$f":"IFERROR(IF(G1284-H1278-I1278-J1278<>0,\"Attention il manque \"&G1284-H1278-I1278-J1278&\"€\",\"Règlement OK\"),\"Pas de règlement\")","v":"Règlement OK"},null,"non",182,{"$f":"M1278","v":"non"}]
[null,null,null,null,null,null,{"$f":"IFERROR(VLOOKUP(E1279,'Tarif de base'!D:E,2,FALSE)*F1279,\"\")","v":""},null,null,null,null,null,null,null,{"$f":"O1278","v":"non"}]
[null,null,null,null,null,null,{"$f":"IFERROR(VLOOKUP(E1280,'Tarif de base'!D:E,2,FALSE)*F1280,\"\")","v":""},null,null,null,null,null,null,null,{"$f":"O1279","v":"non"}]
[null,null,null,null,null,null,{"$f":"IFERROR(VLOOKUP(E1281,'Tarif de base'!D:E,2,FALSE)*F1281,\"\")","v":""},null,null,null,null,null,null,null,"non"]
[null,null,null,null,null,null,{"$f":"IFERROR(VLOOKUP(E1282,'Tarif de base'!D:E,2,FALSE)*F1282,\"\")","v":""},null,null,null,null,null,null,null,"non"]
[null,null,null,null,null,null,{"$f":"IFERROR(VLOOKUP(E1283,'Tarif de base'!D:E,2,FALSE)*F1283,\"\")","v":""},null,null,null,null,null,null,null,"non"]
[null,null,null,null,null,null,{"$f":"SUM(G1278:G1283)","v":0},null,null,null,null,null,null,null,"non"]
[null,null,null,null,null,null,{"$f":"IFERROR(VLOOKUP(E1285,'Tarif de base'!D:E,2,FALSE)*F1285,\"\")","v":""},null,null,null,{"$f":"IFERROR(IF(G1291-H1285-I1285-J1285<>0,\"Attention il manque \"&G1291-H1285-I1285-J1285&\"€\",\"Règlement OK\"),\"Pas de règlement\")","v":"Règlement OK"},null,"non",183,{"$f":"M1285","v":"non"}]
[null,null,null,null,null,null,{"$f":"IFERROR(VLOOKUP(E1286,'Tarif de base'!D:E,2,FALSE)*F1286,\"\")","v":""},null,null,null,null,null,null,null,{"$f":"O1285","v":"non"}]
[null,null,null,null,null,null,{"$f":"IFERROR(VLOOKUP(E1287,'Tarif de base'!D:E,2,FALSE)*F1287,\"\")","v":""},null,null,null,null,null,null,null,{"$f":"O1286","v":"non"}]
[null,null,null,null,null,null,{"$f":"IFERROR(VLOOKUP(E1288,'Tarif de base'!D:E,2,FALSE)*F1288,\"\")","v":""},null,null,null,null,null,null,null,"non"]
[null,null,null,null,null,null,{"$f":"IFERROR(VLOOKUP(E1289,'Tarif de base'!D:E,2,FALSE)*F1289,\"\")","v":""},null,null,null,null,null,null,null,"non"]
[null,null,null,null,null,null,{"$f":"IFERROR(VLOOKUP(E1290,'Tarif de base'!D:E,2,FALSE)*F1290,\"\")","v":""},null,null,null,null,null,null,null,"non"]
[null,null,null,null,null,null,{"$f":"SUM(G1285:G1290)","v":0},null,null,null,null,null,null,null,"non"]
[null,null,null,null,null,null,{"$f":"IFERROR(VLOOKUP(E1292,'Tarif de base'!D:E,2,FALSE)*F1292,\"\")","v":""},null,null,null,{"$f":"IFERROR(IF(G1298-H1292-I1292-J1292<>0,\"Attention il manque \"&G1298-H1292-I1292-J1292&\"€\",\"Règlement OK\"),\"Pas de règlement\")","v":"Règlement OK"},null,"non",184,{"$f":"M1292","v":"non"}]
[null,null,null,null,null,null,{"$f":"IFERROR(VLOOKUP(E1293,'Tarif de base'!D:E,2,FALSE)*F1293,\"\")","v":""},null,null,null,null,null,null,null,"non"]
[null,null,null,null,null,null,{"$f":"IFERROR(VLOOKUP(E1294,'Tarif de base'!D:E,2,FALSE)*F1294,\"\")","v":""},null,null,null,null,null,null,null,"non"]
[null,null,null,null,null,null,{"$f":"IFERROR(VLOOKUP(E1295,'Tarif de base'!D:E,2,FALSE)*F1295,\"\")","v":""},null,null,null,null,null,null,null,"non"]
[null,null,null,null,null,null,{"$f":"IFERROR(VLOOKUP(E1296,'Tarif de base'!D:E,2,FALSE)*F1296,\"\")","v":""},null,null,null,null,null,null,null,"non"]
[null,null,null,null,null,null,{"$f":"IFERROR(VLOOKUP(E1297,'Tarif de base'!D:E,2,FALSE)*F1297,\"\")","v":""},null,null,null,null,null,null,null,"non"]
[null,null,null,null,null,null,{"$f":"SUM(G1292:G1297)","v":0},null,null,null,null,null,null,null,"non"]
[null,null,null,null,null,null,{"$f":"IFERROR(VLOOKUP(E1299,'Tarif de base'!D:E,2,FALSE)*F1299,\"\")","v":""},null,null,null,{"$f":"IFERROR(IF(G1305-H1299-I1299-J1299<>0,\"Attention il manque \"&G1305-H1299-I1299-J1299&\"€\",\"Règlement OK\"),\"Pas de règlement\")","v":"Règlement OK"},null,"non",185,{"$f":"M1299","v":"non"}]
[null,null,null,null,null,null,{"$f":"IFERROR(VLOOKUP(E1300,'Tarif de base'!D:E,2,FALSE)*F1300,\"\")","v":""},null,null,null,null,null,null,null,"non"]
[null,null,null,null,null,null,{"$f":"IFERROR(VLOOKUP(E1301,'Tarif de base'!D:E,2,FALSE)*F1301,\"\")","v":""},null,null,null,null,null,null,null,"non"]
[null,null,null,null,null,null,{"$f":"IFERROR(VLOOKUP(E1302,'Tarif de base'!D:E,2,FALSE)*F1302,\"\")","v":""},null,null,null,null,null,null,null,"non"]
[null,null,null,null,null,null,{"$f":"IFERROR(VLOOKUP(E1303,'Tarif de base'!D:E,2,FALSE)*F1303,\"\")","v":""},null,null,null,null,null,null,null,"non"]
[null,null,null,null,null,null,{"$f":"IFERROR(VLOOKUP(E1304,'Tarif de base'!D:E,2,FALSE)*F1304,\"\")","v":""},null,null,null,null,null,null,null,"non"]
[null,null,null,null,null,null,{"$f":"SUM(G1299:G1304)","v":0},null,null,null,null,null,null,null,"non"]
[null,null,null,null,null,null,{"$f":"IFERROR(VLOOKUP(E1306,'Tarif de base'!D:E,2,FALSE)*F1306,\"\")","v":""},null,null,null,{"$f":"IFERROR(IF(G1312-H1306-I1306-J1306<>0,\"Attention il manque \"&G1312-H1306-I1306-J1306&\"€\",\"Règlement OK\"),\"Pas de règlement\")","v":"Règlement OK"},null,"non",186,{"$f":"M1306","v":"non"}]
[null,null,null,null,null,null,{"$f":"IFERROR(VLOOKUP(E1307,'Tarif de base'!D:E,2,FALSE)*F1307,\"\")","v":""},null,null,null,null,null,null,null,"non"]
[null,null,null,null,null,null,{"$f":"IFERROR(VLOOKUP(E1308,'Tarif de base'!D:E,2,FALSE)*F1308,\"\")","v":""},null,null,null,null,null,null,null,"non"]
[null,null,null,null,null,null,{"$f":"IFERROR(VLOOKUP(E1309,'Tarif de base'!D:E,2,FALSE)*F1309,\"\")","v":""},null,null,null,null,null,null,null,"non"]
[null,null,null,null,null,null,{"$f":"IFERROR(VLOOKUP(E1310,'Tarif de base'!D:E,2,FALSE)*F1310,\"\")","v":""},null,null,null,null,null,null,null,"non"]
[null,null,null,null,null,null,{"$f":"IFERROR(VLOOKUP(E1311,'Tarif de base'!D:E,2,FALSE)*F1311,\"\")","v":""},null,null,null,null,null,null,null,"non"]
[null,null,null,null,null,null,{"$f":"SUM(G1306:G1311)","v":0},null,null,null,null,null,null,null,"non"]
[null,null,null,null,null,null,{"$f":"IFERROR(VLOOKUP(E1313,'Tarif de base'!D:E,2,FALSE)*F1313,\"\")","v":""},null,null,null,{"$f":"IFERROR(IF(G1319-H1313-I1313-J1313<>0,\"Attention il manque \"&G1319-H1313-I1313-J1313&\"€\",\"Règlement OK\"),\"Pas de règlement\")","v":"Règlement OK"},null,"non",187,{"$f":"M1313","v":"non"}]
[null,null,null,null,null,null,{"$f":"IFERROR(VLOOKUP(E1314,'Tarif de base'!D:E,2,FALSE)*F1314,\"\")","v":""},null,null,null,null,null,null,null,"non"]
[null,null,null,null,null,null,{"$f":"IFERROR(VLOOKUP(E1315,'Tarif de base'!D:E,2,FALSE)*F1315,\"\")","v":""},null,null,null,null,null,null,null,"non"]
[null,null,null,null,null,null,{"$f":"IFERROR(VLOOKUP(E1316,'Tarif de base'!D:E,2,FALSE)*F1316,\"\")","v":""},null,null,null,null,null,null,null,"non"]
[null,null,null,null,null,null,{"$f":"IFERROR(VLOOKUP(E1317,'Tarif de base'!D:E,2,FALSE)*F1317,\"\")","v":""},null,null,null,null,null,null,null,"non"]
[null,null,null,null,null,null,{"$f":"IFERROR(VLOOKUP(E1318,'Tarif de base'!D:E,2,FALSE)*F1318,\"\")","v":""},null,null,null,null,null,null,null,"non"]
[null,null,null,null,null,null,{"$f":"SUM(G1313:G1318)","v":0},null,null,null,null,null,null,null,"non"]
[null,null,null,null,null,null,{"$f":"IFERROR(VLOOKUP(E1320,'Tarif de base'!D:E,2,FALSE)*F1320,\"\")","v":""},null,null,null,{"$f":"IFERROR(IF(G1326-H1320-I1320-J1320<>0,\"Attention il manque \"&G1326-H1320-I1320-J1320&\"€\",\"Règlement OK\"),\"Pas de règlement\")","v":"Règlement OK"},null,"non",188,{"$f":"M1320","v":"non"}]
[null,null,null,null,null,null,{"$f":"IFERROR(VLOOKUP(E1321,'Tarif de base'!D:E,2,FALSE)*F1321,\"\")","v":""},null,null,null,null,null,null,null,"non"]
[null,null,null,null,null,null,{"$f":"IFERROR(VLOOKUP(E1322,'Tarif de base'!D:E,2,FALSE)*F1322,\"\")","v":""},null,null,null,null,null,null,null,"non"]
[null,null,null,null,null,null,{"$f":"IFERROR(VLOOKUP(E1323,'Tarif de base'!D:E,2,FALSE)*F1323,\"\")","v":""},null,null,null,null,null,null,null,"non"]
[null,null,null,null,null,null,{"$f":"IFERROR(VLOOKUP(E1324,'Tarif de base'!D:E,2,FALSE)*F1324,\"\")","v":""},null,null,null,null,null,null,null,"non"]
[null,null,null,null,null,null,{"$f":"IFERROR(VLOOKUP(E1325,'Tarif de base'!D:E,2,FALSE)*F1325,\"\")","v":""},null,null,null,null,null,null,null,"non"]
[null,null,null,null,null,null,{"$f":"SUM(G1320:G1325)","v":0},null,null,null,null,null,null,null,"non"]
[null,null,null,null,null,null,{"$f":"IFERROR(VLOOKUP(E1327,'Tarif de base'!D:E,2,FALSE)*F1327,\"\")","v":""},null,null,null,{"$f":"IFERROR(IF(G1333-H1327-I1327-J1327<>0,\"Attention il manque \"&G1333-H1327-I1327-J1327&\"€\",\"Règlement OK\"),\"Pas de règlement\")","v":"Règlement OK"},null,"non",189,{"$f":"M1327","v":"non"}]
[null,null,null,null,null,null,{"$f":"IFERROR(VLOOKUP(E1328,'Tarif de base'!D:E,2,FALSE)*F1328,\"\")","v":""},null,null,null,null,null,null,null,"non"]
[null,null,null,null,null,null,{"$f":"IFERROR(VLOOKUP(E1329,'Tarif de base'!D:E,2,FALSE)*F1329,\"\")","v":""},null,null,null,null,null,null,null,"non"]
[null,null,null,null,null,null,{"$f":"IFERROR(VLOOKUP(E1330,'Tarif de base'!D:E,2,FALSE)*F1330,\"\")","v":""},null,null,null,null,null,null,null,"non"]
[null,null,null,null,null,null,{"$f":"IFERROR(VLOOKUP(E1331,'Tarif de base'!D:E,2,FALSE)*F1331,\"\")","v":""},null,null,null,null,null,null,null,"non"]
[null,null,null,null,null,null,{"$f":"IFERROR(VLOOKUP(E1332,'Tarif de base'!D:E,2,FALSE)*F1332,\"\")","v":""},null,null,null,null,null,null,null,"non"]
[null,null,null,null,null,null,{"$f":"SUM(G1327:G1332)","v":0},null,null,null,null,null,null,null,"non"]
[null,null,null,null,null,null,{"$f":"IFERROR(VLOOKUP(E1334,'Tarif de base'!D:E,2,FALSE)*F1334,\"\")","v":""},null,null,null,{"$f":"IFERROR(IF(G1340-H1334-I1334-J1334<>0,\"Attention il manque \"&G1340-H1334-I1334-J1334&\"€\",\"Règlement OK\"),\"Pas de règlement\")","v":"Règlement OK"},null,"non",190,{"$f":"M1334","v":"non"}]
[null,null,null,null,null,null,{"$f":"IFERROR(VLOOKUP(E1335,'Tarif de base'!D:E,2,FALSE)*F1335,\"\")","v":""},null,null,null,null,null,null,null,"non"]
[null,null,null,null,null,null,{"$f":"IFERROR(VLOOKUP(E1336,'Tarif de base'!D:E,2,FALSE)*F1336,\"\")","v":""},null,null,null,null,null,null,null,"non"]
[null,null,null,null,null,null,{"$f":"IFERROR(VLOOKUP(E1337,'Tarif de base'!D:E,2,FALSE)*F1337,\"\")","v":""},null,null,null,null,null,null,null,"non"]
[null,null,null,null,null,null,{"$f":"IFERROR(VLOOKUP(E1338,'Tarif de base'!D:E,2,FALSE)*F1338,\"\")","v":""},null,null,null,null,null,null,null,"non"]
[null,null,null,null,null,null,{"$f":"IFERROR(VLOOKUP(E1339,'Tarif de base'!D:E,2,FALSE)*F1339,\"\")","v":""},null,null,null,null,null,null,null,"non"]
[null,null,null,null,null,null,{"$f":"SUM(G1334:G1339)","v":0},null,null,null,null,null,null,null,"non"]
[null,null,null,null,null,null,{"$f":"IFERROR(VLOOKUP(E1341,'Tarif de base'!D:E,2,FALSE)*F1341,\"\")","v":""},null,null,null,{"$f":"IFERROR(IF(G1347-H1341-I1341-J1341<>0,\"Attention il manque \"&G1347-H1341-I1341-J1341&\"€\",\"Règlement OK\"),\"Pas de règlement\")","v":"Règlement OK"},null,"non",191,{"$f":"M1341","v":"non"}]
[null,null,null,null,null,null,{"$f":"IFERROR(VLOOKUP(E1342,'Tarif de base'!D:E,2,FALSE)*F1342,\"\")","v":""},null,null,null,null,null,null,null,"non"]
[null,null,null,null,null,null,{"$f":"IFERROR(VLOOKUP(E1343,'Tarif de base'!D:E,2,FALSE)*F1343,\"\")","v":""},null,null,null,null,null,null,null,"non"]
[null,null,null,null,null,null,{"$f":"IFERROR(VLOOKUP(E1344,'Tarif de base'!D:E,2,FALSE)*F1344,\"\")","v":""},null,null,null,null,null,null,null,"non"]
[null,null,null,null,null,null,{"$f":"IFERROR(VLOOKUP(E1345,'Tarif de base'!D:E,2,FALSE)*F1345,\"\")","v":""},null,null,null,null,null,null,null,"non"]
[null,null,null,null,null,null,{"$f":"IFERROR(VLOOKUP(E1346,'Tarif de base'!D:E,2,FALSE)*F1346,\"\")","v":""},null,null,null,null,null,null,null,"non"]
[null,null,null,null,null,null,{"$f":"SUM(G1341:G1346)","v":0},null,null,null,null,null,null,null,"non"]
[null,null,null,null,null,null,{"$f":"IFERROR(VLOOKUP(E1348,'Tarif de base'!D:E,2,FALSE)*F1348,\"\")","v":""},null,null,null,{"$f":"IFERROR(IF(G1354-H1348-I1348-J1348<>0,\"Attention il manque \"&G1354-H1348-I1348-J1348&\"€\",\"Règlement OK\"),\"Pas de règlement\")","v":"Règlement OK"},null,"non",192,{"$f":"M1348","v":"non"}]
[null,null,null,null,null,null,{"$f":"IFERROR(VLOOKUP(E1349,'Tarif de base'!D:E,2,FALSE)*F1349,\"\")","v":""},null,null,null,null,null,null,null,"non"]
[null,null,null,null,null,null,{"$f":"IFERROR(VLOOKUP(E1350,'Tarif de base'!D:E,2,FALSE)*F1350,\"\")","v":""},null,null,null,null,null,null,null,"non"]
[null,null,null,null,null,null,{"$f":"IFERROR(VLOOKUP(E1351,'Tarif de base'!D:E,2,FALSE)*F1351,\"\")","v":""},null,null,null,null,null,null,null,{"$f":"O1350","v":"non"}]
[null,null,null,null,null,null,{"$f":"IFERROR(VLOOKUP(E1352,'Tarif de base'!D:E,2,FALSE)*F1352,\"\")","v":""},null,null,null,null,null,null,null,"non"]
[null,null,null,null,null,null,{"$f":"IFERROR(VLOOKUP(E1353,'Tarif de base'!D:E,2,FALSE)*F1353,\"\")","v":""},null,null,null,null,null,null,null,"non"]
[null,null,null,null,null,null,{"$f":"SUM(G1348:G1353)","v":0},null,null,null,null,null,null,null,"non"]
[null,null,null,null,null,null,{"$f":"IFERROR(VLOOKUP(E1355,'Tarif de base'!D:E,2,FALSE)*F1355,\"\")","v":""},null,null,null,{"$f":"IFERROR(IF(G1361-H1355-I1355-J1355<>0,\"Attention il manque \"&G1361-H1355-I1355-J1355&\"€\",\"Règlement OK\"),\"Pas de règlement\")","v":"Règlement OK"},null,"non",193,{"$f":"M1355","v":"non"}]
[null,null,null,null,null,null,{"$f":"IFERROR(VLOOKUP(E1356,'Tarif de base'!D:E,2,FALSE)*F1356,\"\")","v":""},null,null,null,null,null,null,null,"non"]
[null,null,null,null,null,null,{"$f":"IFERROR(VLOOKUP(E1357,'Tarif de base'!D:E,2,FALSE)*F1357,\"\")","v":""},null,null,null,null,null,null,null,"non"]
[null,null,null,null,null,null,{"$f":"IFERROR(VLOOKUP(E1358,'Tarif de base'!D:E,2,FALSE)*F1358,\"\")","v":""},null,null,null,null,null,null,null,"non"]
[null,null,null,null,null,null,{"$f":"IFERROR(VLOOKUP(E1359,'Tarif de base'!D:E,2,FALSE)*F1359,\"\")","v":""},null,null,null,null,null,null,null,"non"]
[null,null,null,null,null,null,{"$f":"IFERROR(VLOOKUP(E1360,'Tarif de base'!D:E,2,FALSE)*F1360,\"\")","v":""},null,null,null,null,null,null,null,"non"]
[null,null,null,null,null,null,{"$f":"SUM(G1355:G1360)","v":0},null,null,null,null,null,null,null,"non"]
[null,null,null,null,null,null,{"$f":"IFERROR(VLOOKUP(E1362,'Tarif de base'!D:E,2,FALSE)*F1362,\"\")","v":""},null,null,null,{"$f":"IFERROR(IF(G1368-H1362-I1362-J1362<>0,\"Attention il manque \"&G1368-H1362-I1362-J1362&\"€\",\"Règlement OK\"),\"Pas de règlement\")","v":"Règlement OK"},null,"non",194,{"$f":"M1362","v":"non"}]
[null,null,null,null,null,null,{"$f":"IFERROR(VLOOKUP(E1363,'Tarif de base'!D:E,2,FALSE)*F1363,\"\")","v":""},null,null,null,null,null,null,null,"non"]
[null,null,null,null,null,null,{"$f":"IFERROR(VLOOKUP(E1364,'Tarif de base'!D:E,2,FALSE)*F1364,\"\")","v":""},null,null,null,null,null,null,null,"non"]
[null,null,null,null,null,null,{"$f":"IFERROR(VLOOKUP(E1365,'Tarif de base'!D:E,2,FALSE)*F1365,\"\")","v":""},null,null,null,null,null,null,null,"non"]
[null,null,null,null,null,null,{"$f":"IFERROR(VLOOKUP(E1366,'Tarif de base'!D:E,2,FALSE)*F1366,\"\")","v":""},null,null,null,null,null,null,null,"non"]
[null,null,null,null,null,null,{"$f":"IFERROR(VLOOKUP(E1367,'Tarif de base'!D:E,2,FALSE)*F1367,\"\")","v":""},null,null,null,null,null,null,null,"non"]
[null,null,null,null,null,null,{"$f":"SUM(G1362:G1367)","v":0},null,null,null,null,null,null,null,"non"]
[null,null,null,null,null,null,{"$f":"IFERROR(VLOOKUP(E1369,'Tarif de base'!D:E,2,FALSE)*F1369,\"\")","v":""},null,null,null,{"$f":"IFERROR(IF(G1375-H1369-I1369-J1369<>0,\"Attention il manque \"&G1375-H1369-I1369-J1369&\"€\",\"Règlement OK\"),\"Pas de règlement\")","v":"Règlement OK"},null,"non",195,{"$f":"M1369","v":"non"}]
[null,null,null,null,null,null,{"$f":"IFERROR(VLOOKUP(E1370,'Tarif de base'!D:E,2,FALSE)*F1370,\"\")","v":""},null,null,null,null,null,null,null,"non"]
[null,null,null,null,null,null,{"$f":"IFERROR(VLOOKUP(E1371,'Tarif de base'!D:E,2,FALSE)*F1371,\"\")","v":""},null,null,null,null,null,null,null,"non"]
[null,null,null,null,null,null,{"$f":"IFERROR(VLOOKUP(E1372,'Tarif de base'!D:E,2,FALSE)*F1372,\"\")","v":""},null,null,null,null,null,null,null,"non"]
[null,null,null,null,null,null,{"$f":"IFERROR(VLOOKUP(E1373,'Tarif de base'!D:E,2,FALSE)*F1373,\"\")","v":""},null,null,null,null,null,null,null,"non"]
[null,null,null,null,null,null,{"$f":"IFERROR(VLOOKUP(E1374,'Tarif de base'!D:E,2,FALSE)*F1374,\"\")","v":""},null,null,null,null,null,null,null,"non"]
[null,null,null,null,null,null,{"$f":"SUM(G1369:G1374)","v":0},null,null,null,null,null,null,null,"non"]
[null,null,null,null,null,null,{"$f":"IFERROR(VLOOKUP(E1376,'Tarif de base'!D:E,2,FALSE)*F1376,\"\")","v":""},null,null,null,{"$f":"IFERROR(IF(G1382-H1376-I1376-J1376<>0,\"Attention il manque \"&G1382-H1376-I1376-J1376&\"€\",\"Règlement OK\"),\"Pas de règlement\")","v":"Règlement OK"},null,"non",196,{"$f":"M1376","v":"non"}]
[null,null,null,null,null,null,{"$f":"IFERROR(VLOOKUP(E1377,'Tarif de base'!D:E,2,FALSE)*F1377,\"\")","v":""},null,null,null,null,null,null,null,{"$f":"O1376","v":"non"}]
[null,null,null,null,null,null,{"$f":"IFERROR(VLOOKUP(E1378,'Tarif de base'!D:E,2,FALSE)*F1378,\"\")","v":""},null,null,null,null,null,null,null,"non"]
[null,null,null,null,null,null,{"$f":"IFERROR(VLOOKUP(E1379,'Tarif de base'!D:E,2,FALSE)*F1379,\"\")","v":""},null,null,null,null,null,null,null,"non"]
[null,null,null,null,null,null,{"$f":"IFERROR(VLOOKUP(E1380,'Tarif de base'!D:E,2,FALSE)*F1380,\"\")","v":""},null,null,null,null,null,null,null,"non"]
[null,null,null,null,null,null,{"$f":"IFERROR(VLOOKUP(E1381,'Tarif de base'!D:E,2,FALSE)*F1381,\"\")","v":""},null,null,null,null,null,null,null,"non"]
[null,null,null,null,null,null,{"$f":"SUM(G1376:G1381)","v":0},null,null,null,null,null,null,null,"non"]
[null,null,null,null,null,null,{"$f":"IFERROR(VLOOKUP(E1383,'Tarif de base'!D:E,2,FALSE)*F1383,\"\")","v":""},null,null,null,{"$f":"IFERROR(IF(G1389-H1383-I1383-J1383<>0,\"Attention il manque \"&G1389-H1383-I1383-J1383&\"€\",\"Règlement OK\"),\"Pas de règlement\")","v":"Règlement OK"},null,"non",197,{"$f":"M1383","v":"non"}]
[null,null,null,null,null,null,{"$f":"IFERROR(VLOOKUP(E1384,'Tarif de base'!D:E,2,FALSE)*F1384,\"\")","v":""},null,null,null,null,null,null,null,"non"]
[null,null,null,null,null,null,{"$f":"IFERROR(VLOOKUP(E1385,'Tarif de base'!D:E,2,FALSE)*F1385,\"\")","v":""},null,null,null,null,null,null,null,"non"]
[null,null,null,null,null,null,{"$f":"IFERROR(VLOOKUP(E1386,'Tarif de base'!D:E,2,FALSE)*F1386,\"\")","v":""},null,null,null,null,null,null,null,"non"]
[null,null,null,null,null,null,{"$f":"IFERROR(VLOOKUP(E1387,'Tarif de base'!D:E,2,FALSE)*F1387,\"\")","v":""},null,null,null,null,null,null,null,"non"]
[null,null,null,null,null,null,{"$f":"IFERROR(VLOOKUP(E1388,'Tarif de base'!D:E,2,FALSE)*F1388,\"\")","v":""},null,null,null,null,null,null,null,"non"]
[null,null,null,null,null,null,{"$f":"SUM(G1383:G1388)","v":0},null,null,null,null,null,null,null,"non"]
[null,null,null,null,null,null,{"$f":"IFERROR(VLOOKUP(E1390,'Tarif de base'!D:E,2,FALSE)*F1390,\"\")","v":""},null,null,null,{"$f":"IFERROR(IF(G1396-H1390-I1390-J1390<>0,\"Attention il manque \"&G1396-H1390-I1390-J1390&\"€\",\"Règlement OK\"),\"Pas de règlement\")","v":"Règlement OK"},null,"non",198,{"$f":"M1390","v":"non"}]
[null,null,null,null,null,null,{"$f":"IFERROR(VLOOKUP(E1391,'Tarif de base'!D:E,2,FALSE)*F1391,\"\")","v":""},null,null,null,null,null,null,null,"non"]
[null,null,null,null,null,null,{"$f":"IFERROR(VLOOKUP(E1392,'Tarif de base'!D:E,2,FALSE)*F1392,\"\")","v":""},null,null,null,null,null,null,null,"non"]
[null,null,null,null,null,null,{"$f":"IFERROR(VLOOKUP(E1393,'Tarif de base'!D:E,2,FALSE)*F1393,\"\")","v":""},null,null,null,null,null,null,null,"non"]
[null,null,null,null,null,null,{"$f":"IFERROR(VLOOKUP(E1394,'Tarif de base'!D:E,2,FALSE)*F1394,\"\")","v":""},null,null,null,null,null,null,null,"non"]
[null,null,null,null,null,null,{"$f":"IFERROR(VLOOKUP(E1395,'Tarif de base'!D:E,2,FALSE)*F1395,\"\")","v":""},null,null,null,null,null,null,null,"non"]
[null,null,null,null,null,null,{"$f":"SUM(G1390:G1395)","v":0},null,null,null,null,null,null,null,"non"]
[null,null,null,null,null,null,{"$f":"IFERROR(VLOOKUP(E1397,'Tarif de base'!D:E,2,FALSE)*F1397,\"\")","v":""},null,null,null,{"$f":"IFERROR(IF(G1403-H1397-I1397-J1397<>0,\"Attention il manque \"&G1403-H1397-I1397-J1397&\"€\",\"Règlement OK\"),\"Pas de règlement\")","v":"Règlement OK"},null,"non",199,{"$f":"M1397","v":"non"}]
[null,null,null,null,null,null,{"$f":"IFERROR(VLOOKUP(E1398,'Tarif de base'!D:E,2,FALSE)*F1398,\"\")","v":""},null,null,null,null,null,null,null,"non"]
[null,null,null,null,null,null,{"$f":"IFERROR(VLOOKUP(E1399,'Tarif de base'!D:E,2,FALSE)*F1399,\"\")","v":""},null,null,null,null,null,null,null,"non"]
[null,null,null,null,null,null,{"$f":"IFERROR(VLOOKUP(E1400,'Tarif de base'!D:E,2,FALSE)*F1400,\"\")","v":""},null,null,null,null,null,null,null,"non"]
[null,null,null,null,null,null,{"$f":"IFERROR(VLOOKUP(E1401,'Tarif de base'!D:E,2,FALSE)*F1401,\"\")","v":""},null,null,null,null,null,null,null,"non"]
[null,null,null,null,null,null,{"$f":"IFERROR(VLOOKUP(E1402,'Tarif de base'!D:E,2,FALSE)*F1402,\"\")","v":""},null,null,null,null,null,null,null,"non"]
[null,null,null,null,null,null,{"$f":"SUM(G1397:G1402)","v":0},null,null,null,null,null,null,null,"non"]
[null,null,null,null,null,null,{"$f":"IFERROR(VLOOKUP(E1404,'Tarif de base'!D:E,2,FALSE)*F1404,\"\")","v":""},null,null,null,{"$f":"IFERROR(IF(G1410-H1404-I1404-J1404<>0,\"Attention il manque \"&G1410-H1404-I1404-J1404&\"€\",\"Règlement OK\"),\"Pas de règlement\")","v":"Règlement OK"},null,"non",200,{"$f":"M1404","v":"non"}]
[null,null,null,null,null,null,{"$f":"IFERROR(VLOOKUP(E1405,'Tarif de base'!D:E,2,FALSE)*F1405,\"\")","v":""},null,null,null,null,null,null,null,{"$f":"O1404","v":"non"}]
[null,null,null,null,null,null,{"$f":"IFERROR(VLOOKUP(E1406,'Tarif de base'!D:E,2,FALSE)*F1406,\"\")","v":""},null,null,null,null,null,null,null,{"$f":"O1405","v":"non"}]
[null,null,null,null,null,null,{"$f":"IFERROR(VLOOKUP(E1407,'Tarif de base'!D:E,2,FALSE)*F1407,\"\")","v":""},null,null,null,null,null,null,null,"non"]
[null,null,null,null,null,null,{"$f":"IFERROR(VLOOKUP(E1408,'Tarif de base'!D:E,2,FALSE)*F1408,\"\")","v":""},null,null,null,null,null,null,null,"non"]
[null,null,null,null,null,null,{"$f":"IFERROR(VLOOKUP(E1409,'Tarif de base'!D:E,2,FALSE)*F1409,\"\")","v":""},null,null,null,null,null,null,null,"non"]
[null,null,null,null,null,null,{"$f":"SUM(G1404:G1409)","v":0},null,null,null,null,null,null,null,"non"]
[null,null,null,null,null,null,{"$f":"IFERROR(VLOOKUP(E1411,'Tarif de base'!D:E,2,FALSE)*F1411,\"\")","v":""},null,null,null,{"$f":"IFERROR(IF(G1417-H1411-I1411-J1411<>0,\"Attention il manque \"&G1417-H1411-I1411-J1411&\"€\",\"Règlement OK\"),\"Pas de règlement\")","v":"Règlement OK"},null,"non",201,{"$f":"M1411","v":"non"}]
[null,null,null,null,null,null,{"$f":"IFERROR(VLOOKUP(E1412,'Tarif de base'!D:E,2,FALSE)*F1412,\"\")","v":""},null,null,null,null,null,null,null,{"$f":"O1411","v":"non"}]
[null,null,null,null,null,null,{"$f":"IFERROR(VLOOKUP(E1413,'Tarif de base'!D:E,2,FALSE)*F1413,\"\")","v":""},null,null,null,null,null,null,null,{"$f":"O1412","v":"non"}]
[null,null,null,null,null,null,{"$f":"IFERROR(VLOOKUP(E1414,'Tarif de base'!D:E,2,FALSE)*F1414,\"\")","v":""},null,null,null,null,null,null,null,"non"]
[null,null,null,null,null,null,{"$f":"IFERROR(VLOOKUP(E1415,'Tarif de base'!D:E,2,FALSE)*F1415,\"\")","v":""},null,null,null,null,null,null,null,"non"]
[null,null,null,null,null,null,{"$f":"IFERROR(VLOOKUP(E1416,'Tarif de base'!D:E,2,FALSE)*F1416,\"\")","v":""},null,null,null,null,null,null,null,"non"]
[null,null,null,null,null,null,{"$f":"SUM(G1411:G1416)","v":0},null,null,null,null,null,null,null,"non"]
[null,null,null,null,null,null,{"$f":"IFERROR(VLOOKUP(E1418,'Tarif de base'!D:E,2,FALSE)*F1418,\"\")","v":""},null,null,null,{"$f":"IFERROR(IF(G1424-H1418-I1418-J1418<>0,\"Attention il manque \"&G1424-H1418-I1418-J1418&\"€\",\"Règlement OK\"),\"Pas de règlement\")","v":"Règlement OK"},null,"non",202,{"$f":"M1418","v":"non"}]
[null,null,null,null,null,null,{"$f":"IFERROR(VLOOKUP(E1419,'Tarif de base'!D:E,2,FALSE)*F1419,\"\")","v":""},null,null,null,null,null,null,null,"non"]
[null,null,null,null,null,null,{"$f":"IFERROR(VLOOKUP(E1420,'Tarif de base'!D:E,2,FALSE)*F1420,\"\")","v":""},null,null,null,null,null,null,null,"non"]
[null,null,null,null,null,null,{"$f":"IFERROR(VLOOKUP(E1421,'Tarif de base'!D:E,2,FALSE)*F1421,\"\")","v":""},null,null,null,null,null,null,null,"non"]
[null,null,null,null,null,null,{"$f":"IFERROR(VLOOKUP(E1422,'Tarif de base'!D:E,2,FALSE)*F1422,\"\")","v":""},null,null,null,null,null,null,null,"non"]
[null,null,null,null,null,null,{"$f":"IFERROR(VLOOKUP(E1423,'Tarif de base'!D:E,2,FALSE)*F1423,\"\")","v":""},null,null,null,null,null,null,null,"non"]
[null,null,null,null,null,null,{"$f":"SUM(G1418:G1423)","v":0},null,null,null,null,null,null,null,"non"]
[null,null,null,null,null,null,{"$f":"IFERROR(VLOOKUP(E1425,'Tarif de base'!D:E,2,FALSE)*F1425,\"\")","v":""},null,null,null,{"$f":"IFERROR(IF(G1431-H1425-I1425-J1425<>0,\"Attention il manque \"&G1431-H1425-I1425-J1425&\"€\",\"Règlement OK\"),\"Pas de règlement\")","v":"Règlement OK"},null,"non",203,{"$f":"M1425","v":"non"}]
[null,null,null,null,null,null,{"$f":"IFERROR(VLOOKUP(E1426,'Tarif de base'!D:E,2,FALSE)*F1426,\"\")","v":""},null,null,null,null,null,null,null,"non"]
[null,null,null,null,null,null,{"$f":"IFERROR(VLOOKUP(E1427,'Tarif de base'!D:E,2,FALSE)*F1427,\"\")","v":""},null,null,null,null,null,null,null,"non"]
[null,null,null,null,null,null,{"$f":"IFERROR(VLOOKUP(E1428,'Tarif de base'!D:E,2,FALSE)*F1428,\"\")","v":""},null,null,null,null,null,null,null,"non"]
[null,null,null,null,null,null,{"$f":"IFERROR(VLOOKUP(E1429,'Tarif de base'!D:E,2,FALSE)*F1429,\"\")","v":""},null,null,null,null,null,null,null,"non"]
[null,null,null,null,null,null,{"$f":"IFERROR(VLOOKUP(E1430,'Tarif de base'!D:E,2,FALSE)*F1430,\"\")","v":""},null,null,null,null,null,null,null,"non"]
[null,null,null,null,null,null,{"$f":"SUM(G1425:G1430)","v":0},null,null,null,null,null,null,null,"non"]
[null,null,null,null,null,null,{"$f":"IFERROR(VLOOKUP(E1432,'Tarif de base'!D:E,2,FALSE)*F1432,\"\")","v":""},null,null,null,{"$f":"IFERROR(IF(G1438-H1432-I1432-J1432<>0,\"Attention il manque \"&G1438-H1432-I1432-J1432&\"€\",\"Règlement OK\"),\"Pas de règlement\")","v":"Règlement OK"},null,"non",204,{"$f":"M1432","v":"non"}]
[null,null,null,null,null,null,{"$f":"IFERROR(VLOOKUP(E1433,'Tarif de base'!D:E,2,FALSE)*F1433,\"\")","v":""},null,null,null,null,null,null,null,"non"]
[null,null,null,null,null,null,{"$f":"IFERROR(VLOOKUP(E1434,'Tarif de base'!D:E,2,FALSE)*F1434,\"\")","v":""},null,null,null,null,null,null,null,"non"]
[null,null,null,null,null,null,{"$f":"IFERROR(VLOOKUP(E1435,'Tarif de base'!D:E,2,FALSE)*F1435,\"\")","v":""},null,null,null,null,null,null,null,"non"]
[null,null,null,null,null,null,{"$f":"IFERROR(VLOOKUP(E1436,'Tarif de base'!D:E,2,FALSE)*F1436,\"\")","v":""},null,null,null,null,null,null,null,"non"]
[null,null,null,null,null,null,{"$f":"IFERROR(VLOOKUP(E1437,'Tarif de base'!D:E,2,FALSE)*F1437,\"\")","v":""},null,null,null,null,null,null,null,"non"]
[null,null,null,null,null,null,{"$f":"SUM(G1432:G1437)","v":0},null,null,null,null,null,null,null,"non"]
[null,null,null,null,null,null,{"$f":"IFERROR(VLOOKUP(E1439,'Tarif de base'!D:E,2,FALSE)*F1439,\"\")","v":""},null,null,null,{"$f":"IFERROR(IF(G1445-H1439-I1439-J1439<>0,\"Attention il manque \"&G1445-H1439-I1439-J1439&\"€\",\"Règlement OK\"),\"Pas de règlement\")","v":"Règlement OK"},null,"non",205,{"$f":"M1439","v":"non"}]
[null,null,null,null,null,null,{"$f":"IFERROR(VLOOKUP(E1440,'Tarif de base'!D:E,2,FALSE)*F1440,\"\")","v":""},null,null,null,null,null,null,null,"non"]
[null,null,null,null,null,null,{"$f":"IFERROR(VLOOKUP(E1441,'Tarif de base'!D:E,2,FALSE)*F1441,\"\")","v":""},null,null,null,null,null,null,null,"non"]
[null,null,null,null,null,null,{"$f":"IFERROR(VLOOKUP(E1442,'Tarif de base'!D:E,2,FALSE)*F1442,\"\")","v":""},null,null,null,null,null,null,null,"non"]
[null,null,null,null,null,null,{"$f":"IFERROR(VLOOKUP(E1443,'Tarif de base'!D:E,2,FALSE)*F1443,\"\")","v":""},null,null,null,null,null,null,null,"non"]
[null,null,null,null,null,null,{"$f":"IFERROR(VLOOKUP(E1444,'Tarif de base'!D:E,2,FALSE)*F1444,\"\")","v":""},null,null,null,null,null,null,null,"non"]
[null,null,null,null,null,null,{"$f":"SUM(G1439:G1444)","v":0},null,null,null,null,null,null,null,"non"]
[null,null,null,null,null,null,{"$f":"IFERROR(VLOOKUP(E1446,'Tarif de base'!D:E,2,FALSE)*F1446,\"\")","v":""},null,null,null,{"$f":"IFERROR(IF(G1452-H1446-I1446-J1446<>0,\"Attention il manque \"&G1452-H1446-I1446-J1446&\"€\",\"Règlement OK\"),\"Pas de règlement\")","v":"Règlement OK"},null,"non",206,{"$f":"M1446","v":"non"}]
[null,null,null,null,null,null,{"$f":"IFERROR(VLOOKUP(E1447,'Tarif de base'!D:E,2,FALSE)*F1447,\"\")","v":""},null,null,null,null,null,null,null,"non"]
[null,null,null,null,null,null,{"$f":"IFERROR(VLOOKUP(E1448,'Tarif de base'!D:E,2,FALSE)*F1448,\"\")","v":""},null,null,null,null,null,null,null,"non"]
[null,null,null,null,null,null,{"$f":"IFERROR(VLOOKUP(E1449,'Tarif de base'!D:E,2,FALSE)*F1449,\"\")","v":""},null,null,null,null,null,null,null,"non"]
[null,null,null,null,null,null,{"$f":"IFERROR(VLOOKUP(E1450,'Tarif de base'!D:E,2,FALSE)*F1450,\"\")","v":""},null,null,null,null,null,null,null,"non"]
[null,null,null,null,null,null,{"$f":"IFERROR(VLOOKUP(E1451,'Tarif de base'!D:E,2,FALSE)*F1451,\"\")","v":""},null,null,null,null,null,null,null,"non"]
[null,null,null,null,null,null,{"$f":"SUM(G1446:G1451)","v":0},null,null,null,null,null,null,null,"non"]
[null,null,null,null,null,null,{"$f":"IFERROR(VLOOKUP(E1453,'Tarif de base'!D:E,2,FALSE)*F1453,\"\")","v":""},null,null,null,{"$f":"IFERROR(IF(G1459-H1453-I1453-J1453<>0,\"Attention il manque \"&G1459-H1453-I1453-J1453&\"€\",\"Règlement OK\"),\"Pas de règlement\")","v":"Règlement OK"},null,"non",207,{"$f":"M1453","v":"non"}]
[null,null,null,null,null,null,{"$f":"IFERROR(VLOOKUP(E1454,'Tarif de base'!D:E,2,FALSE)*F1454,\"\")","v":""},null,null,null,null,null,null,null,"non"]
[null,null,null,null,null,null,{"$f":"IFERROR(VLOOKUP(E1455,'Tarif de base'!D:E,2,FALSE)*F1455,\"\")","v":""},null,null,null,null,null,null,null,"non"]
[null,null,null,null,null,null,{"$f":"IFERROR(VLOOKUP(E1456,'Tarif de base'!D:E,2,FALSE)*F1456,\"\")","v":""},null,null,null,null,null,null,null,"non"]
[null,null,null,null,null,null,{"$f":"IFERROR(VLOOKUP(E1457,'Tarif de base'!D:E,2,FALSE)*F1457,\"\")","v":""},null,null,null,null,null,null,null,"non"]
[null,null,null,null,null,null,{"$f":"IFERROR(VLOOKUP(E1458,'Tarif de base'!D:E,2,FALSE)*F1458,\"\")","v":""},null,null,null,null,null,null,null,"non"]
[null,null,null,null,null,null,{"$f":"SUM(G1453:G1458)","v":0},null,null,null,null,null,null,null,"non"]
[null,null,null,null,null,null,{"$f":"IFERROR(VLOOKUP(E1460,'Tarif de base'!D:E,2,FALSE)*F1460,\"\")","v":""},null,null,null,{"$f":"IFERROR(IF(G1466-H1460-I1460-J1460<>0,\"Attention il manque \"&G1466-H1460-I1460-J1460&\"€\",\"Règlement OK\"),\"Pas de règlement\")","v":"Règlement OK"},null,"non",208,{"$f":"M1460","v":"non"}]
[null,null,null,null,null,null,{"$f":"IFERROR(VLOOKUP(E1461,'Tarif de base'!D:E,2,FALSE)*F1461,\"\")","v":""},null,null,null,null,null,null,null,"non"]
[null,null,null,null,null,null,{"$f":"IFERROR(VLOOKUP(E1462,'Tarif de base'!D:E,2,FALSE)*F1462,\"\")","v":""},null,null,null,null,null,null,null,"non"]
[null,null,null,null,null,null,{"$f":"IFERROR(VLOOKUP(E1463,'Tarif de base'!D:E,2,FALSE)*F1463,\"\")","v":""},null,null,null,null,null,null,null,"non"]
[null,null,null,null,null,null,{"$f":"IFERROR(VLOOKUP(E1464,'Tarif de base'!D:E,2,FALSE)*F1464,\"\")","v":""},null,null,null,null,null,null,null,"non"]
[null,null,null,null,null,null,{"$f":"IFERROR(VLOOKUP(E1465,'Tarif de base'!D:E,2,FALSE)*F1465,\"\")","v":""},null,null,null,null,null,null,null,"non"]
[null,null,null,null,null,null,{"$f":"SUM(G1460:G1465)","v":0},null,null,null,null,null,null,null,"non"]
[null,null,null,null,null,null,{"$f":"IFERROR(VLOOKUP(E1467,'Tarif de base'!D:E,2,FALSE)*F1467,\"\")","v":""},null,null,null,{"$f":"IFERROR(IF(G1473-H1467-I1467-J1467<>0,\"Attention il manque \"&G1473-H1467-I1467-J1467&\"€\",\"Règlement OK\"),\"Pas de règlement\")","v":"Règlement OK"},null,"non",209,{"$f":"M1467","v":"non"}]
[null,null,null,null,null,null,{"$f":"IFERROR(VLOOKUP(E1468,'Tarif de base'!D:E,2,FALSE)*F1468,\"\")","v":""},null,null,null,null,null,null,null,"non"]
[null,null,null,null,null,null,{"$f":"IFERROR(VLOOKUP(E1469,'Tarif de base'!D:E,2,FALSE)*F1469,\"\")","v":""},null,null,null,null,null,null,null,"non"]
[null,null,null,null,null,null,{"$f":"IFERROR(VLOOKUP(E1470,'Tarif de base'!D:E,2,FALSE)*F1470,\"\")","v":""},null,null,null,null,null,null,null,"non"]
[null,null,null,null,null,null,{"$f":"IFERROR(VLOOKUP(E1471,'Tarif de base'!D:E,2,FALSE)*F1471,\"\")","v":""},null,null,null,null,null,null,null,"non"]
[null,null,null,null,null,null,{"$f":"IFERROR(VLOOKUP(E1472,'Tarif de base'!D:E,2,FALSE)*F1472,\"\")","v":""},null,null,null,null,null,null,null,"non"]
[null,null,null,null,null,null,{"$f":"SUM(G1467:G1472)","v":0},null,null,null,null,null,null,null,"non"]
[null,null,null,null,null,null,{"$f":"IFERROR(VLOOKUP(E1474,'Tarif de base'!D:E,2,FALSE)*F1474,\"\")","v":""},null,null,null,{"$f":"IFERROR(IF(G1480-H1474-I1474-J1474<>0,\"Attention il manque \"&G1480-H1474-I1474-J1474&\"€\",\"Règlement OK\"),\"Pas de règlement\")","v":"Règlement OK"},null,"non",210,{"$f":"M1474","v":"non"}]
[null,null,null,null,null,null,{"$f":"IFERROR(VLOOKUP(E1475,'Tarif de base'!D:E,2,FALSE)*F1475,\"\")","v":""},null,null,null,null,null,null,null,"non"]
[null,null,null,null,null,null,{"$f":"IFERROR(VLOOKUP(E1476,'Tarif de base'!D:E,2,FALSE)*F1476,\"\")","v":""},null,null,null,null,null,null,null,"non"]
[null,null,null,null,null,null,{"$f":"IFERROR(VLOOKUP(E1477,'Tarif de base'!D:E,2,FALSE)*F1477,\"\")","v":""},null,null,null,null,null,null,null,{"$f":"O1476","v":"non"}]
[null,null,null,null,null,null,{"$f":"IFERROR(VLOOKUP(E1478,'Tarif de base'!D:E,2,FALSE)*F1478,\"\")","v":""},null,null,null,null,null,null,null,"non"]
[null,null,null,null,null,null,{"$f":"IFERROR(VLOOKUP(E1479,'Tarif de base'!D:E,2,FALSE)*F1479,\"\")","v":""},null,null,null,null,null,null,null,"non"]
[null,null,null,null,null,null,{"$f":"SUM(G1474:G1479)","v":0},null,null,null,null,null,null,null,"non"]
[null,null,null,null,null,null,{"$f":"IFERROR(VLOOKUP(E1481,'Tarif de base'!D:E,2,FALSE)*F1481,\"\")","v":""},null,null,null,{"$f":"IFERROR(IF(G1487-H1481-I1481-J1481<>0,\"Attention il manque \"&G1487-H1481-I1481-J1481&\"€\",\"Règlement OK\"),\"Pas de règlement\")","v":"Règlement OK"},null,"non",211,{"$f":"M1481","v":"non"}]
[null,null,null,null,null,null,{"$f":"IFERROR(VLOOKUP(E1482,'Tarif de base'!D:E,2,FALSE)*F1482,\"\")","v":""},null,null,null,null,null,null,null,"non"]
[null,null,null,null,null,null,{"$f":"IFERROR(VLOOKUP(E1483,'Tarif de base'!D:E,2,FALSE)*F1483,\"\")","v":""},null,null,null,null,null,null,null,"non"]
[null,null,null,null,null,null,{"$f":"IFERROR(VLOOKUP(E1484,'Tarif de base'!D:E,2,FALSE)*F1484,\"\")","v":""},null,null,null,null,null,null,null,"non"]
[null,null,null,null,null,null,{"$f":"IFERROR(VLOOKUP(E1485,'Tarif de base'!D:E,2,FALSE)*F1485,\"\")","v":""},null,null,null,null,null,null,null,"non"]
[null,null,null,null,null,null,{"$f":"IFERROR(VLOOKUP(E1486,'Tarif de base'!D:E,2,FALSE)*F1486,\"\")","v":""},null,null,null,null,null,null,null,"non"]
[null,null,null,null,null,null,{"$f":"SUM(G1481:G1486)","v":0},null,null,null,null,null,null,null,"non"]
[null,null,null,null,null,null,{"$f":"IFERROR(VLOOKUP(E1488,'Tarif de base'!D:E,2,FALSE)*F1488,\"\")","v":""},null,null,null,{"$f":"IFERROR(IF(G1494-H1488-I1488-J1488<>0,\"Attention il manque \"&G1494-H1488-I1488-J1488&\"€\",\"Règlement OK\"),\"Pas de règlement\")","v":"Règlement OK"},null,"non",212,{"$f":"M1488","v":"non"}]
[null,null,null,null,null,null,{"$f":"IFERROR(VLOOKUP(E1489,'Tarif de base'!D:E,2,FALSE)*F1489,\"\")","v":""},null,null,null,null,null,null,null,"non"]
[null,null,null,null,null,null,{"$f":"IFERROR(VLOOKUP(E1490,'Tarif de base'!D:E,2,FALSE)*F1490,\"\")","v":""},null,null,null,null,null,null,null,"non"]
[null,null,null,null,null,null,{"$f":"IFERROR(VLOOKUP(E1491,'Tarif de base'!D:E,2,FALSE)*F1491,\"\")","v":""},null,null,null,null,null,null,null,"non"]
[null,null,null,null,null,null,{"$f":"IFERROR(VLOOKUP(E1492,'Tarif de base'!D:E,2,FALSE)*F1492,\"\")","v":""},null,null,null,null,null,null,null,"non"]
[null,null,null,null,null,null,{"$f":"IFERROR(VLOOKUP(E1493,'Tarif de base'!D:E,2,FALSE)*F1493,\"\")","v":""},null,null,null,null,null,null,null,"non"]
[null,null,null,null,null,null,{"$f":"SUM(G1488:G1493)","v":0},null,null,null,null,null,null,null,"non"]
[null,null,null,null,null,null,{"$f":"IFERROR(VLOOKUP(E1495,'Tarif de base'!D:E,2,FALSE)*F1495,\"\")","v":""},null,null,null,{"$f":"IFERROR(IF(G1501-H1495-I1495-J1495<>0,\"Attention il manque \"&G1501-H1495-I1495-J1495&\"€\",\"Règlement OK\"),\"Pas de règlement\")","v":"Règlement OK"},null,"non",213,{"$f":"M1495","v":"non"}]
[null,null,null,null,null,null,{"$f":"IFERROR(VLOOKUP(E1496,'Tarif de base'!D:E,2,FALSE)*F1496,\"\")","v":""},null,null,null,null,null,null,null,"non"]
[null,null,null,null,null,null,{"$f":"IFERROR(VLOOKUP(E1497,'Tarif de base'!D:E,2,FALSE)*F1497,\"\")","v":""},null,null,null,null,null,null,null,"non"]
[null,null,null,null,null,null,{"$f":"IFERROR(VLOOKUP(E1498,'Tarif de base'!D:E,2,FALSE)*F1498,\"\")","v":""},null,null,null,null,null,null,null,"non"]
[null,null,null,null,null,null,{"$f":"IFERROR(VLOOKUP(E1499,'Tarif de base'!D:E,2,FALSE)*F1499,\"\")","v":""},null,null,null,null,null,null,null,"non"]
[null,null,null,null,null,null,{"$f":"IFERROR(VLOOKUP(E1500,'Tarif de base'!D:E,2,FALSE)*F1500,\"\")","v":""},null,null,null,null,null,null,null,"non"]
[null,null,null,null,null,null,{"$f":"SUM(G1495:G1500)","v":0},null,null,null,null,null,null,null,"non"]
[null,null,null,null,null,null,{"$f":"IFERROR(VLOOKUP(E1502,'Tarif de base'!D:E,2,FALSE)*F1502,\"\")","v":""},null,null,null,{"$f":"IFERROR(IF(G1508-H1502-I1502-J1502<>0,\"Attention il manque \"&G1508-H1502-I1502-J1502&\"€\",\"Règlement OK\"),\"Pas de règlement\")","v":"Règlement OK"},null,"non",214,{"$f":"M1502","v":"non"}]
[null,null,null,null,null,null,{"$f":"IFERROR(VLOOKUP(E1503,'Tarif de base'!D:E,2,FALSE)*F1503,\"\")","v":""},null,null,null,null,null,null,null,{"$f":"O1502","v":"non"}]
[null,null,null,null,null,null,{"$f":"IFERROR(VLOOKUP(E1504,'Tarif de base'!D:E,2,FALSE)*F1504,\"\")","v":""},null,null,null,null,null,null,null,"non"]
[null,null,null,null,null,null,{"$f":"IFERROR(VLOOKUP(E1505,'Tarif de base'!D:E,2,FALSE)*F1505,\"\")","v":""},null,null,null,null,null,null,null,"non"]
[null,null,null,null,null,null,{"$f":"IFERROR(VLOOKUP(E1506,'Tarif de base'!D:E,2,FALSE)*F1506,\"\")","v":""},null,null,null,null,null,null,null,"non"]
[null,null,null,null,null,null,{"$f":"IFERROR(VLOOKUP(E1507,'Tarif de base'!D:E,2,FALSE)*F1507,\"\")","v":""},null,null,null,null,null,null,null,"non"]
[null,null,null,null,null,null,{"$f":"SUM(G1502:G1507)","v":0},null,null,null,null,null,null,null,"non"]
[null,null,null,null,null,null,{"$f":"IFERROR(VLOOKUP(E1509,'Tarif de base'!D:E,2,FALSE)*F1509,\"\")","v":""},null,null,null,{"$f":"IFERROR(IF(G1515-H1509-I1509-J1509<>0,\"Attention il manque \"&G1515-H1509-I1509-J1509&\"€\",\"Règlement OK\"),\"Pas de règlement\")","v":"Règlement OK"},null,"non",215,{"$f":"M1509","v":"non"}]
[null,null,null,null,null,null,{"$f":"IFERROR(VLOOKUP(E1510,'Tarif de base'!D:E,2,FALSE)*F1510,\"\")","v":""},null,null,null,null,null,null,null,"non"]
[null,null,null,null,null,null,{"$f":"IFERROR(VLOOKUP(E1511,'Tarif de base'!D:E,2,FALSE)*F1511,\"\")","v":""},null,null,null,null,null,null,null,"non"]
[null,null,null,null,null,null,{"$f":"IFERROR(VLOOKUP(E1512,'Tarif de base'!D:E,2,FALSE)*F1512,\"\")","v":""},null,null,null,null,null,null,null,"non"]
[null,null,null,null,null,null,{"$f":"IFERROR(VLOOKUP(E1513,'Tarif de base'!D:E,2,FALSE)*F1513,\"\")","v":""},null,null,null,null,null,null,null,"non"]
[null,null,null,null,null,null,{"$f":"IFERROR(VLOOKUP(E1514,'Tarif de base'!D:E,2,FALSE)*F1514,\"\")","v":""},null,null,null,null,null,null,null,"non"]
[null,null,null,null,null,null,{"$f":"SUM(G1509:G1514)","v":0},null,null,null,null,null,null,null,"non"]
[null,null,null,null,null,null,{"$f":"IFERROR(VLOOKUP(E1516,'Tarif de base'!D:E,2,FALSE)*F1516,\"\")","v":""},null,null,null,{"$f":"IFERROR(IF(G1522-H1516-I1516-J1516<>0,\"Attention il manque \"&G1522-H1516-I1516-J1516&\"€\",\"Règlement OK\"),\"Pas de règlement\")","v":"Règlement OK"},null,"non",216,{"$f":"M1516","v":"non"}]
[null,null,null,null,null,null,{"$f":"IFERROR(VLOOKUP(E1517,'Tarif de base'!D:E,2,FALSE)*F1517,\"\")","v":""},null,null,null,null,null,null,null,"non"]
[null,null,null,null,null,null,{"$f":"IFERROR(VLOOKUP(E1518,'Tarif de base'!D:E,2,FALSE)*F1518,\"\")","v":""},null,null,null,null,null,null,null,"non"]
[null,null,null,null,null,null,{"$f":"IFERROR(VLOOKUP(E1519,'Tarif de base'!D:E,2,FALSE)*F1519,\"\")","v":""},null,null,null,null,null,null,null,"non"]
[null,null,null,null,null,null,{"$f":"IFERROR(VLOOKUP(E1520,'Tarif de base'!D:E,2,FALSE)*F1520,\"\")","v":""},null,null,null,null,null,null,null,"non"]
[null,null,null,null,null,null,{"$f":"IFERROR(VLOOKUP(E1521,'Tarif de base'!D:E,2,FALSE)*F1521,\"\")","v":""},null,null,null,null,null,null,null,"non"]
[null,null,null,null,null,null,{"$f":"SUM(G1516:G1521)","v":0},null,null,null,null,null,null,null,"non"]
[null,null,null,null,null,null,{"$f":"IFERROR(VLOOKUP(E1523,'Tarif de base'!D:E,2,FALSE)*F1523,\"\")","v":""},null,null,null,{"$f":"IFERROR(IF(G1529-H1523-I1523-J1523<>0,\"Attention il manque \"&G1529-H1523-I1523-J1523&\"€\",\"Règlement OK\"),\"Pas de règlement\")","v":"Règlement OK"},null,"non",217,{"$f":"M1523","v":"non"}]
[null,null,null,null,null,null,{"$f":"IFERROR(VLOOKUP(E1524,'Tarif de base'!D:E,2,FALSE)*F1524,\"\")","v":""},null,null,null,null,null,null,null,"non"]
[null,null,null,null,null,null,{"$f":"IFERROR(VLOOKUP(E1525,'Tarif de base'!D:E,2,FALSE)*F1525,\"\")","v":""},null,null,null,null,null,null,null,"non"]
[null,null,null,null,null,null,{"$f":"IFERROR(VLOOKUP(E1526,'Tarif de base'!D:E,2,FALSE)*F1526,\"\")","v":""},null,null,null,null,null,null,null,"non"]
[null,null,null,null,null,null,{"$f":"IFERROR(VLOOKUP(E1527,'Tarif de base'!D:E,2,FALSE)*F1527,\"\")","v":""},null,null,null,null,null,null,null,"non"]
[null,null,null,null,null,null,{"$f":"IFERROR(VLOOKUP(E1528,'Tarif de base'!D:E,2,FALSE)*F1528,\"\")","v":""},null,null,null,null,null,null,null,"non"]
[null,null,null,null,null,null,{"$f":"SUM(G1523:G1528)","v":0},null,null,null,null,null,null,null,"non"]
[null,null,null,null,null,null,{"$f":"IFERROR(VLOOKUP(E1530,'Tarif de base'!D:E,2,FALSE)*F1530,\"\")","v":""},null,null,null,{"$f":"IFERROR(IF(G1536-H1530-I1530-J1530<>0,\"Attention il manque \"&G1536-H1530-I1530-J1530&\"€\",\"Règlement OK\"),\"Pas de règlement\")","v":"Règlement OK"},null,"non",218,{"$f":"M1530","v":"non"}]
[null,null,null,null,null,null,{"$f":"IFERROR(VLOOKUP(E1531,'Tarif de base'!D:E,2,FALSE)*F1531,\"\")","v":""},null,null,null,null,null,null,null,{"$f":"O1530","v":"non"}]
[null,null,null,null,null,null,{"$f":"IFERROR(VLOOKUP(E1532,'Tarif de base'!D:E,2,FALSE)*F1532,\"\")","v":""},null,null,null,null,null,null,null,{"$f":"O1531","v":"non"}]
[null,null,null,null,null,null,{"$f":"IFERROR(VLOOKUP(E1533,'Tarif de base'!D:E,2,FALSE)*F1533,\"\")","v":""},null,null,null,null,null,null,null,"non"]
[null,null,null,null,null,null,{"$f":"IFERROR(VLOOKUP(E1534,'Tarif de base'!D:E,2,FALSE)*F1534,\"\")","v":""},null,null,null,null,null,null,null,"non"]
[null,null,null,null,null,null,{"$f":"IFERROR(VLOOKUP(E1535,'Tarif de base'!D:E,2,FALSE)*F1535,\"\")","v":""},null,null,null,null,null,null,null,"non"]
[null,null,null,null,null,null,{"$f":"SUM(G1530:G1535)","v":0},null,null,null,null,null,null,null,"non"]
[null,null,null,null,null,null,{"$f":"IFERROR(VLOOKUP(E1537,'Tarif de base'!D:E,2,FALSE)*F1537,\"\")","v":""},null,null,null,{"$f":"IFERROR(IF(G1543-H1537-I1537-J1537<>0,\"Attention il manque \"&G1543-H1537-I1537-J1537&\"€\",\"Règlement OK\"),\"Pas de règlement\")","v":"Règlement OK"},null,"non",219,{"$f":"M1537","v":"non"}]
[null,null,null,null,null,null,{"$f":"IFERROR(VLOOKUP(E1538,'Tarif de base'!D:E,2,FALSE)*F1538,\"\")","v":""},null,null,null,null,null,null,null,{"$f":"O1537","v":"non"}]
[null,null,null,null,null,null,{"$f":"IFERROR(VLOOKUP(E1539,'Tarif de base'!D:E,2,FALSE)*F1539,\"\")","v":""},null,null,null,null,null,null,null,{"$f":"O1538","v":"non"}]
[null,null,null,null,null,null,{"$f":"IFERROR(VLOOKUP(E1540,'Tarif de base'!D:E,2,FALSE)*F1540,\"\")","v":""},null,null,null,null,null,null,null,"non"]
[null,null,null,null,null,null,{"$f":"IFERROR(VLOOKUP(E1541,'Tarif de base'!D:E,2,FALSE)*F1541,\"\")","v":""},null,null,null,null,null,null,null,"non"]
[null,null,null,null,null,null,{"$f":"IFERROR(VLOOKUP(E1542,'Tarif de base'!D:E,2,FALSE)*F1542,\"\")","v":""},null,null,null,null,null,null,null,"non"]
[null,null,null,null,null,null,{"$f":"SUM(G1537:G1542)","v":0},null,null,null,null,null,null,null,"non"]
[null,null,null,null,null,null,{"$f":"IFERROR(VLOOKUP(E1544,'Tarif de base'!D:E,2,FALSE)*F1544,\"\")","v":""},null,null,null,{"$f":"IFERROR(IF(G1550-H1544-I1544-J1544<>0,\"Attention il manque \"&G1550-H1544-I1544-J1544&\"€\",\"Règlement OK\"),\"Pas de règlement\")","v":"Règlement OK"},null,"non",220,{"$f":"M1544","v":"non"}]
[null,null,null,null,null,null,{"$f":"IFERROR(VLOOKUP(E1545,'Tarif de base'!D:E,2,FALSE)*F1545,\"\")","v":""},null,null,null,null,null,null,null,"non"]
[null,null,null,null,null,null,{"$f":"IFERROR(VLOOKUP(E1546,'Tarif de base'!D:E,2,FALSE)*F1546,\"\")","v":""},null,null,null,null,null,null,null,"non"]
[null,null,null,null,null,null,{"$f":"IFERROR(VLOOKUP(E1547,'Tarif de base'!D:E,2,FALSE)*F1547,\"\")","v":""},null,null,null,null,null,null,null,"non"]
[null,null,null,null,null,null,{"$f":"IFERROR(VLOOKUP(E1548,'Tarif de base'!D:E,2,FALSE)*F1548,\"\")","v":""},null,null,null,null,null,null,null,"non"]
[null,null,null,null,null,null,{"$f":"IFERROR(VLOOKUP(E1549,'Tarif de base'!D:E,2,FALSE)*F1549,\"\")","v":""},null,null,null,null,null,null,null,"non"]
[null,null,null,null,null,null,{"$f":"SUM(G1544:G1549)","v":0},null,null,null,null,null,null,null,"non"]
[null,null,null,null,null,null,{"$f":"IFERROR(VLOOKUP(E1551,'Tarif de base'!D:E,2,FALSE)*F1551,\"\")","v":""},null,null,null,{"$f":"IFERROR(IF(G1557-H1551-I1551-J1551<>0,\"Attention il manque \"&G1557-H1551-I1551-J1551&\"€\",\"Règlement OK\"),\"Pas de règlement\")","v":"Règlement OK"},null,"non",221,{"$f":"M1551","v":"non"}]
[null,null,null,null,null,null,{"$f":"IFERROR(VLOOKUP(E1552,'Tarif de base'!D:E,2,FALSE)*F1552,\"\")","v":""},null,null,null,null,null,null,null,"non"]
[null,null,null,null,null,null,{"$f":"IFERROR(VLOOKUP(E1553,'Tarif de base'!D:E,2,FALSE)*F1553,\"\")","v":""},null,null,null,null,null,null,null,"non"]
[null,null,null,null,null,null,{"$f":"IFERROR(VLOOKUP(E1554,'Tarif de base'!D:E,2,FALSE)*F1554,\"\")","v":""},null,null,null,null,null,null,null,"non"]
[null,null,null,null,null,null,{"$f":"IFERROR(VLOOKUP(E1555,'Tarif de base'!D:E,2,FALSE)*F1555,\"\")","v":""},null,null,null,null,null,null,null,"non"]
[null,null,null,null,null,null,{"$f":"IFERROR(VLOOKUP(E1556,'Tarif de base'!D:E,2,FALSE)*F1556,\"\")","v":""},null,null,null,null,null,null,null,"non"]
[null,null,null,null,null,null,{"$f":"SUM(G1551:G1556)","v":0},null,null,null,null,null,null,null,"non"]
[null,null,null,null,null,null,{"$f":"IFERROR(VLOOKUP(E1558,'Tarif de base'!D:E,2,FALSE)*F1558,\"\")","v":""},null,null,null,{"$f":"IFERROR(IF(G1564-H1558-I1558-J1558<>0,\"Attention il manque \"&G1564-H1558-I1558-J1558&\"€\",\"Règlement OK\"),\"Pas de règlement\")","v":"Règlement OK"},null,"non",222,{"$f":"M1558","v":"non"}]
[null,null,null,null,null,null,{"$f":"IFERROR(VLOOKUP(E1559,'Tarif de base'!D:E,2,FALSE)*F1559,\"\")","v":""},null,null,null,null,null,null,null,"non"]
[null,null,null,null,null,null,{"$f":"IFERROR(VLOOKUP(E1560,'Tarif de base'!D:E,2,FALSE)*F1560,\"\")","v":""},null,null,null,null,null,null,null,"non"]
[null,null,null,null,null,null,{"$f":"IFERROR(VLOOKUP(E1561,'Tarif de base'!D:E,2,FALSE)*F1561,\"\")","v":""},null,null,null,null,null,null,null,"non"]
[null,null,null,null,null,null,{"$f":"IFERROR(VLOOKUP(E1562,'Tarif de base'!D:E,2,FALSE)*F1562,\"\")","v":""},null,null,null,null,null,null,null,"non"]
[null,null,null,null,null,null,{"$f":"IFERROR(VLOOKUP(E1563,'Tarif de base'!D:E,2,FALSE)*F1563,\"\")","v":""},null,null,null,null,null,null,null,"non"]
[null,null,null,null,null,null,{"$f":"SUM(G1558:G1563)","v":0},null,null,null,null,null,null,null,"non"]
[null,null,null,null,null,null,{"$f":"IFERROR(VLOOKUP(E1565,'Tarif de base'!D:E,2,FALSE)*F1565,\"\")","v":""},null,null,null,{"$f":"IFERROR(IF(G1571-H1565-I1565-J1565<>0,\"Attention il manque \"&G1571-H1565-I1565-J1565&\"€\",\"Règlement OK\"),\"Pas de règlement\")","v":"Règlement OK"},null,"non",223,{"$f":"M1565","v":"non"}]
[null,null,null,null,null,null,{"$f":"IFERROR(VLOOKUP(E1566,'Tarif de base'!D:E,2,FALSE)*F1566,\"\")","v":""},null,null,null,null,null,null,null,"non"]
[null,null,null,null,null,null,{"$f":"IFERROR(VLOOKUP(E1567,'Tarif de base'!D:E,2,FALSE)*F1567,\"\")","v":""},null,null,null,null,null,null,null,"non"]
[null,null,null,null,null,null,{"$f":"IFERROR(VLOOKUP(E1568,'Tarif de base'!D:E,2,FALSE)*F1568,\"\")","v":""},null,null,null,null,null,null,null,"non"]
[null,null,null,null,null,null,{"$f":"IFERROR(VLOOKUP(E1569,'Tarif de base'!D:E,2,FALSE)*F1569,\"\")","v":""},null,null,null,null,null,null,null,"non"]
[null,null,null,null,null,null,{"$f":"IFERROR(VLOOKUP(E1570,'Tarif de base'!D:E,2,FALSE)*F1570,\"\")","v":""},null,null,null,null,null,null,null,"non"]
[null,null,null,null,null,null,{"$f":"SUM(G1565:G1570)","v":0},null,null,null,null,null,null,null,"non"]
[null,null,null,null,null,null,{"$f":"IFERROR(VLOOKUP(E1572,'Tarif de base'!D:E,2,FALSE)*F1572,\"\")","v":""},null,null,null,{"$f":"IFERROR(IF(G1578-H1572-I1572-J1572<>0,\"Attention il manque \"&G1578-H1572-I1572-J1572&\"€\",\"Règlement OK\"),\"Pas de règlement\")","v":"Règlement OK"},null,"non",224,{"$f":"M1572","v":"non"}]
[null,null,null,null,null,null,{"$f":"IFERROR(VLOOKUP(E1573,'Tarif de base'!D:E,2,FALSE)*F1573,\"\")","v":""},null,null,null,null,null,null,null,"non"]
[null,null,null,null,null,null,{"$f":"IFERROR(VLOOKUP(E1574,'Tarif de base'!D:E,2,FALSE)*F1574,\"\")","v":""},null,null,null,null,null,null,null,"non"]
[null,null,null,null,null,null,{"$f":"IFERROR(VLOOKUP(E1575,'Tarif de base'!D:E,2,FALSE)*F1575,\"\")","v":""},null,null,null,null,null,null,null,"non"]
[null,null,null,null,null,null,{"$f":"IFERROR(VLOOKUP(E1576,'Tarif de base'!D:E,2,FALSE)*F1576,\"\")","v":""},null,null,null,null,null,null,null,"non"]
[null,null,null,null,null,null,{"$f":"IFERROR(VLOOKUP(E1577,'Tarif de base'!D:E,2,FALSE)*F1577,\"\")","v":""},null,null,null,null,null,null,null,"non"]
[null,null,null,null,null,null,{"$f":"SUM(G1572:G1577)","v":0},null,null,null,null,null,null,null,"non"]
[null,null,null,null,null,null,{"$f":"IFERROR(VLOOKUP(E1579,'Tarif de base'!D:E,2,FALSE)*F1579,\"\")","v":""},null,null,null,{"$f":"IFERROR(IF(G1585-H1579-I1579-J1579<>0,\"Attention il manque \"&G1585-H1579-I1579-J1579&\"€\",\"Règlement OK\"),\"Pas de règlement\")","v":"Règlement OK"},null,"non",225,{"$f":"M1579","v":"non"}]
[null,null,null,null,null,null,{"$f":"IFERROR(VLOOKUP(E1580,'Tarif de base'!D:E,2,FALSE)*F1580,\"\")","v":""},null,null,null,null,null,null,null,"non"]
[null,null,null,null,null,null,{"$f":"IFERROR(VLOOKUP(E1581,'Tarif de base'!D:E,2,FALSE)*F1581,\"\")","v":""},null,null,null,null,null,null,null,"non"]
[null,null,null,null,null,null,{"$f":"IFERROR(VLOOKUP(E1582,'Tarif de base'!D:E,2,FALSE)*F1582,\"\")","v":""},null,null,null,null,null,null,null,"non"]
[null,null,null,null,null,null,{"$f":"IFERROR(VLOOKUP(E1583,'Tarif de base'!D:E,2,FALSE)*F1583,\"\")","v":""},null,null,null,null,null,null,null,"non"]
[null,null,null,null,null,null,{"$f":"IFERROR(VLOOKUP(E1584,'Tarif de base'!D:E,2,FALSE)*F1584,\"\")","v":""},null,null,null,null,null,null,null,"non"]
[null,null,null,null,null,null,{"$f":"SUM(G1579:G1584)","v":0},null,null,null,null,null,null,null,"non"]
[null,null,null,null,null,null,{"$f":"IFERROR(VLOOKUP(E1586,'Tarif de base'!D:E,2,FALSE)*F1586,\"\")","v":""},null,null,null,{"$f":"IFERROR(IF(G1592-H1586-I1586-J1586<>0,\"Attention il manque \"&G1592-H1586-I1586-J1586&\"€\",\"Règlement OK\"),\"Pas de règlement\")","v":"Règlement OK"},null,"non",226,{"$f":"M1586","v":"non"}]
[null,null,null,null,null,null,{"$f":"IFERROR(VLOOKUP(E1587,'Tarif de base'!D:E,2,FALSE)*F1587,\"\")","v":""},null,null,null,null,null,null,null,"non"]
[null,null,null,null,null,null,{"$f":"IFERROR(VLOOKUP(E1588,'Tarif de base'!D:E,2,FALSE)*F1588,\"\")","v":""},null,null,null,null,null,null,null,"non"]
[null,null,null,null,null,null,{"$f":"IFERROR(VLOOKUP(E1589,'Tarif de base'!D:E,2,FALSE)*F1589,\"\")","v":""},null,null,null,null,null,null,null,"non"]
[null,null,null,null,null,null,{"$f":"IFERROR(VLOOKUP(E1590,'Tarif de base'!D:E,2,FALSE)*F1590,\"\")","v":""},null,null,null,null,null,null,null,"non"]
[null,null,null,null,null,null,{"$f":"IFERROR(VLOOKUP(E1591,'Tarif de base'!D:E,2,FALSE)*F1591,\"\")","v":""},null,null,null,null,null,null,null,"non"]
[null,null,null,null,null,null,{"$f":"SUM(G1586:G1591)","v":0},null,null,null,null,null,null,null,"non"]
[null,null,null,null,null,null,{"$f":"IFERROR(VLOOKUP(E1593,'Tarif de base'!D:E,2,FALSE)*F1593,\"\")","v":""},null,null,null,{"$f":"IFERROR(IF(G1599-H1593-I1593-J1593<>0,\"Attention il manque \"&G1599-H1593-I1593-J1593&\"€\",\"Règlement OK\"),\"Pas de règlement\")","v":"Règlement OK"},null,"non",227,{"$f":"M1593","v":"non"}]
[null,null,null,null,null,null,{"$f":"IFERROR(VLOOKUP(E1594,'Tarif de base'!D:E,2,FALSE)*F1594,\"\")","v":""},null,null,null,null,null,null,null,"non"]
[null,null,null,null,null,null,{"$f":"IFERROR(VLOOKUP(E1595,'Tarif de base'!D:E,2,FALSE)*F1595,\"\")","v":""},null,null,null,null,null,null,null,"non"]
[null,null,null,null,null,null,{"$f":"IFERROR(VLOOKUP(E1596,'Tarif de base'!D:E,2,FALSE)*F1596,\"\")","v":""},null,null,null,null,null,null,null,"non"]
[null,null,null,null,null,null,{"$f":"IFERROR(VLOOKUP(E1597,'Tarif de base'!D:E,2,FALSE)*F1597,\"\")","v":""},null,null,null,null,null,null,null,"non"]
[null,null,null,null,null,null,{"$f":"IFERROR(VLOOKUP(E1598,'Tarif de base'!D:E,2,FALSE)*F1598,\"\")","v":""},null,null,null,null,null,null,null,"non"]
[null,null,null,null,null,null,{"$f":"SUM(G1593:G1598)","v":0},null,null,null,null,null,null,null,"non"]
[null,null,null,null,null,null,{"$f":"IFERROR(VLOOKUP(E1600,'Tarif de base'!D:E,2,FALSE)*F1600,\"\")","v":""},null,null,null,{"$f":"IFERROR(IF(G1606-H1600-I1600-J1600<>0,\"Attention il manque \"&G1606-H1600-I1600-J1600&\"€\",\"Règlement OK\"),\"Pas de règlement\")","v":"Règlement OK"},null,"non",228,{"$f":"M1600","v":"non"}]
[null,null,null,null,null,null,{"$f":"IFERROR(VLOOKUP(E1601,'Tarif de base'!D:E,2,FALSE)*F1601,\"\")","v":""},null,null,null,null,null,null,null,"non"]
[null,null,null,null,null,null,{"$f":"IFERROR(VLOOKUP(E1602,'Tarif de base'!D:E,2,FALSE)*F1602,\"\")","v":""},null,null,null,null,null,null,null,"non"]
[null,null,null,null,null,null,{"$f":"IFERROR(VLOOKUP(E1603,'Tarif de base'!D:E,2,FALSE)*F1603,\"\")","v":""},null,null,null,null,null,null,null,{"$f":"O1602","v":"non"}]
[null,null,null,null,null,null,{"$f":"IFERROR(VLOOKUP(E1604,'Tarif de base'!D:E,2,FALSE)*F1604,\"\")","v":""},null,null,null,null,null,null,null,"non"]
[null,null,null,null,null,null,{"$f":"IFERROR(VLOOKUP(E1605,'Tarif de base'!D:E,2,FALSE)*F1605,\"\")","v":""},null,null,null,null,null,null,null,"non"]
[null,null,null,null,null,null,{"$f":"SUM(G1600:G1605)","v":0},null,null,null,null,null,null,null,"non"]
[null,null,null,null,null,null,{"$f":"IFERROR(VLOOKUP(E1607,'Tarif de base'!D:E,2,FALSE)*F1607,\"\")","v":""},null,null,null,{"$f":"IFERROR(IF(G1613-H1607-I1607-J1607<>0,\"Attention il manque \"&G1613-H1607-I1607-J1607&\"€\",\"Règlement OK\"),\"Pas de règlement\")","v":"Règlement OK"},null,"non",229,{"$f":"M1607","v":"non"}]
[null,null,null,null,null,null,{"$f":"IFERROR(VLOOKUP(E1608,'Tarif de base'!D:E,2,FALSE)*F1608,\"\")","v":""},null,null,null,null,null,null,null,"non"]
[null,null,null,null,null,null,{"$f":"IFERROR(VLOOKUP(E1609,'Tarif de base'!D:E,2,FALSE)*F1609,\"\")","v":""},null,null,null,null,null,null,null,"non"]
[null,null,null,null,null,null,{"$f":"IFERROR(VLOOKUP(E1610,'Tarif de base'!D:E,2,FALSE)*F1610,\"\")","v":""},null,null,null,null,null,null,null,"non"]
[null,null,null,null,null,null,{"$f":"IFERROR(VLOOKUP(E1611,'Tarif de base'!D:E,2,FALSE)*F1611,\"\")","v":""},null,null,null,null,null,null,null,"non"]
[null,null,null,null,null,null,{"$f":"IFERROR(VLOOKUP(E1612,'Tarif de base'!D:E,2,FALSE)*F1612,\"\")","v":""},null,null,null,null,null,null,null,"non"]
[null,null,null,null,null,null,{"$f":"SUM(G1607:G1612)","v":0},null,null,null,null,null,null,null,"non"]
[null,null,null,null,null,null,{"$f":"IFERROR(VLOOKUP(E1614,'Tarif de base'!D:E,2,FALSE)*F1614,\"\")","v":""},null,null,null,{"$f":"IFERROR(IF(G1620-H1614-I1614-J1614<>0,\"Attention il manque \"&G1620-H1614-I1614-J1614&\"€\",\"Règlement OK\"),\"Pas de règlement\")","v":"Règlement OK"},null,"non",230,{"$f":"M1614","v":"non"}]
[null,null,null,null,null,null,{"$f":"IFERROR(VLOOKUP(E1615,'Tarif de base'!D:E,2,FALSE)*F1615,\"\")","v":""},null,null,null,null,null,null,null,"non"]
[null,null,null,null,null,null,{"$f":"IFERROR(VLOOKUP(E1616,'Tarif de base'!D:E,2,FALSE)*F1616,\"\")","v":""},null,null,null,null,null,null,null,"non"]
[null,null,null,null,null,null,{"$f":"IFERROR(VLOOKUP(E1617,'Tarif de base'!D:E,2,FALSE)*F1617,\"\")","v":""},null,null,null,null,null,null,null,"non"]
[null,null,null,null,null,null,{"$f":"IFERROR(VLOOKUP(E1618,'Tarif de base'!D:E,2,FALSE)*F1618,\"\")","v":""},null,null,null,null,null,null,null,"non"]
[null,null,null,null,null,null,{"$f":"IFERROR(VLOOKUP(E1619,'Tarif de base'!D:E,2,FALSE)*F1619,\"\")","v":""},null,null,null,null,null,null,null,"non"]
[null,null,null,null,null,null,{"$f":"SUM(G1614:G1619)","v":0},null,null,null,null,null,null,null,"non"]
[null,null,null,null,null,null,{"$f":"IFERROR(VLOOKUP(E1621,'Tarif de base'!D:E,2,FALSE)*F1621,\"\")","v":""},null,null,null,{"$f":"IFERROR(IF(G1627-H1621-I1621-J1621<>0,\"Attention il manque \"&G1627-H1621-I1621-J1621&\"€\",\"Règlement OK\"),\"Pas de règlement\")","v":"Règlement OK"},null,"non",231,{"$f":"M1621","v":"non"}]
[null,null,null,null,null,null,{"$f":"IFERROR(VLOOKUP(E1622,'Tarif de base'!D:E,2,FALSE)*F1622,\"\")","v":""},null,null,null,null,null,null,null,"non"]
[null,null,null,null,null,null,{"$f":"IFERROR(VLOOKUP(E1623,'Tarif de base'!D:E,2,FALSE)*F1623,\"\")","v":""},null,null,null,null,null,null,null,"non"]
[null,null,null,null,null,null,{"$f":"IFERROR(VLOOKUP(E1624,'Tarif de base'!D:E,2,FALSE)*F1624,\"\")","v":""},null,null,null,null,null,null,null,"non"]
[null,null,null,null,null,null,{"$f":"IFERROR(VLOOKUP(E1625,'Tarif de base'!D:E,2,FALSE)*F1625,\"\")","v":""},null,null,null,null,null,null,null,"non"]
[null,null,null,null,null,null,{"$f":"IFERROR(VLOOKUP(E1626,'Tarif de base'!D:E,2,FALSE)*F1626,\"\")","v":""},null,null,null,null,null,null,null,"non"]
[null,null,null,null,null,null,{"$f":"SUM(G1621:G1626)","v":0},null,null,null,null,null,null,null,"non"]
[null,null,null,null,null,null,{"$f":"IFERROR(VLOOKUP(E1628,'Tarif de base'!D:E,2,FALSE)*F1628,\"\")","v":""},null,null,null,{"$f":"IFERROR(IF(G1634-H1628-I1628-J1628<>0,\"Attention il manque \"&G1634-H1628-I1628-J1628&\"€\",\"Règlement OK\"),\"Pas de règlement\")","v":"Règlement OK"},null,"non",232,{"$f":"M1628","v":"non"}]
[null,null,null,null,null,null,{"$f":"IFERROR(VLOOKUP(E1629,'Tarif de base'!D:E,2,FALSE)*F1629,\"\")","v":""},null,null,null,null,null,null,null,{"$f":"O1628","v":"non"}]
[null,null,null,null,null,null,{"$f":"IFERROR(VLOOKUP(E1630,'Tarif de base'!D:E,2,FALSE)*F1630,\"\")","v":""},null,null,null,null,null,null,null,"non"]
[null,null,null,null,null,null,{"$f":"IFERROR(VLOOKUP(E1631,'Tarif de base'!D:E,2,FALSE)*F1631,\"\")","v":""},null,null,null,null,null,null,null,"non"]
[null,null,null,null,null,null,{"$f":"IFERROR(VLOOKUP(E1632,'Tarif de base'!D:E,2,FALSE)*F1632,\"\")","v":""},null,null,null,null,null,null,null,"non"]
[null,null,null,null,null,null,{"$f":"IFERROR(VLOOKUP(E1633,'Tarif de base'!D:E,2,FALSE)*F1633,\"\")","v":""},null,null,null,null,null,null,null,"non"]
[null,null,null,null,null,null,{"$f":"SUM(G1628:G1633)","v":0},null,null,null,null,null,null,null,"non"]
[null,null,null,null,null,null,{"$f":"IFERROR(VLOOKUP(E1635,'Tarif de base'!D:E,2,FALSE)*F1635,\"\")","v":""},null,null,null,{"$f":"IFERROR(IF(G1641-H1635-I1635-J1635<>0,\"Attention il manque \"&G1641-H1635-I1635-J1635&\"€\",\"Règlement OK\"),\"Pas de règlement\")","v":"Règlement OK"},null,"non",233,{"$f":"M1635","v":"non"}]
[null,null,null,null,null,null,{"$f":"IFERROR(VLOOKUP(E1636,'Tarif de base'!D:E,2,FALSE)*F1636,\"\")","v":""},null,null,null,null,null,null,null,"non"]
[null,null,null,null,null,null,{"$f":"IFERROR(VLOOKUP(E1637,'Tarif de base'!D:E,2,FALSE)*F1637,\"\")","v":""},null,null,null,null,null,null,null,"non"]
[null,null,null,null,null,null,{"$f":"IFERROR(VLOOKUP(E1638,'Tarif de base'!D:E,2,FALSE)*F1638,\"\")","v":""},null,null,null,null,null,null,null,"non"]
[null,null,null,null,null,null,{"$f":"IFERROR(VLOOKUP(E1639,'Tarif de base'!D:E,2,FALSE)*F1639,\"\")","v":""},null,null,null,null,null,null,null,"non"]
[null,null,null,null,null,null,{"$f":"IFERROR(VLOOKUP(E1640,'Tarif de base'!D:E,2,FALSE)*F1640,\"\")","v":""},null,null,null,null,null,null,null,"non"]
[null,null,null,null,null,null,{"$f":"SUM(G1635:G1640)","v":0},null,null,null,null,null,null,null,"non"]
[null,null,null,null,null,null,{"$f":"IFERROR(VLOOKUP(E1642,'Tarif de base'!D:E,2,FALSE)*F1642,\"\")","v":""},null,null,null,{"$f":"IFERROR(IF(G1648-H1642-I1642-J1642<>0,\"Attention il manque \"&G1648-H1642-I1642-J1642&\"€\",\"Règlement OK\"),\"Pas de règlement\")","v":"Règlement OK"},null,"non",234,{"$f":"M1642","v":"non"}]
[null,null,null,null,null,null,{"$f":"IFERROR(VLOOKUP(E1643,'Tarif de base'!D:E,2,FALSE)*F1643,\"\")","v":""},null,null,null,null,null,null,null,"non"]
[null,null,null,null,null,null,{"$f":"IFERROR(VLOOKUP(E1644,'Tarif de base'!D:E,2,FALSE)*F1644,\"\")","v":""},null,null,null,null,null,null,null,"non"]
[null,null,null,null,null,null,{"$f":"IFERROR(VLOOKUP(E1645,'Tarif de base'!D:E,2,FALSE)*F1645,\"\")","v":""},null,null,null,null,null,null,null,"non"]
[null,null,null,null,null,null,{"$f":"IFERROR(VLOOKUP(E1646,'Tarif de base'!D:E,2,FALSE)*F1646,\"\")","v":""},null,null,null,null,null,null,null,"non"]
[null,null,null,null,null,null,{"$f":"IFERROR(VLOOKUP(E1647,'Tarif de base'!D:E,2,FALSE)*F1647,\"\")","v":""},null,null,null,null,null,null,null,"non"]
[null,null,null,null,null,null,{"$f":"SUM(G1642:G1647)","v":0},null,null,null,null,null,null,null,"non"]
[null,null,null,null,null,null,{"$f":"IFERROR(VLOOKUP(E1649,'Tarif de base'!D:E,2,FALSE)*F1649,\"\")","v":""},null,null,null,{"$f":"IFERROR(IF(G1655-H1649-I1649-J1649<>0,\"Attention il manque \"&G1655-H1649-I1649-J1649&\"€\",\"Règlement OK\"),\"Pas de règlement\")","v":"Règlement OK"},null,"non",235,{"$f":"M1649","v":"non"}]
[null,null,null,null,null,null,{"$f":"IFERROR(VLOOKUP(E1650,'Tarif de base'!D:E,2,FALSE)*F1650,\"\")","v":""},null,null,null,null,null,null,null,"non"]
[null,null,null,null,null,null,{"$f":"IFERROR(VLOOKUP(E1651,'Tarif de base'!D:E,2,FALSE)*F1651,\"\")","v":""},null,null,null,null,null,null,null,"non"]
[null,null,null,null,null,null,{"$f":"IFERROR(VLOOKUP(E1652,'Tarif de base'!D:E,2,FALSE)*F1652,\"\")","v":""},null,null,null,null,null,null,null,"non"]
[null,null,null,null,null,null,{"$f":"IFERROR(VLOOKUP(E1653,'Tarif de base'!D:E,2,FALSE)*F1653,\"\")","v":""},null,null,null,null,null,null,null,"non"]
[null,null,null,null,null,null,{"$f":"IFERROR(VLOOKUP(E1654,'Tarif de base'!D:E,2,FALSE)*F1654,\"\")","v":""},null,null,null,null,null,null,null,"non"]
[null,null,null,null,null,null,{"$f":"SUM(G1649:G1654)","v":0},null,null,null,null,null,null,null,"non"]
[null,null,null,null,null,null,{"$f":"IFERROR(VLOOKUP(E1656,'Tarif de base'!D:E,2,FALSE)*F1656,\"\")","v":""},null,null,null,{"$f":"IFERROR(IF(G1662-H1656-I1656-J1656<>0,\"Attention il manque \"&G1662-H1656-I1656-J1656&\"€\",\"Règlement OK\"),\"Pas de règlement\")","v":"Règlement OK"},null,"non",236,{"$f":"M1656","v":"non"}]
[null,null,null,null,null,null,{"$f":"IFERROR(VLOOKUP(E1657,'Tarif de base'!D:E,2,FALSE)*F1657,\"\")","v":""},null,null,null,null,null,null,null,{"$f":"O1656","v":"non"}]
[null,null,null,null,null,null,{"$f":"IFERROR(VLOOKUP(E1658,'Tarif de base'!D:E,2,FALSE)*F1658,\"\")","v":""},null,null,null,null,null,null,null,{"$f":"O1657","v":"non"}]
[null,null,null,null,null,null,{"$f":"IFERROR(VLOOKUP(E1659,'Tarif de base'!D:E,2,FALSE)*F1659,\"\")","v":""},null,null,null,null,null,null,null,"non"]
[null,null,null,null,null,null,{"$f":"IFERROR(VLOOKUP(E1660,'Tarif de base'!D:E,2,FALSE)*F1660,\"\")","v":""},null,null,null,null,null,null,null,"non"]
[null,null,null,null,null,null,{"$f":"IFERROR(VLOOKUP(E1661,'Tarif de base'!D:E,2,FALSE)*F1661,\"\")","v":""},null,null,null,null,null,null,null,"non"]
[null,null,null,null,null,null,{"$f":"SUM(G1656:G1661)","v":0},null,null,null,null,null,null,null,"non"]
[null,null,null,null,null,null,{"$f":"IFERROR(VLOOKUP(E1663,'Tarif de base'!D:E,2,FALSE)*F1663,\"\")","v":""},null,null,null,{"$f":"IFERROR(IF(G1669-H1663-I1663-J1663<>0,\"Attention il manque \"&G1669-H1663-I1663-J1663&\"€\",\"Règlement OK\"),\"Pas de règlement\")","v":"Règlement OK"},null,"non",237,{"$f":"M1663","v":"non"}]
[null,null,null,null,null,null,{"$f":"IFERROR(VLOOKUP(E1664,'Tarif de base'!D:E,2,FALSE)*F1664,\"\")","v":""},null,null,null,null,null,null,null,{"$f":"O1663","v":"non"}]
[null,null,null,null,null,null,{"$f":"IFERROR(VLOOKUP(E1665,'Tarif de base'!D:E,2,FALSE)*F1665,\"\")","v":""},null,null,null,null,null,null,null,{"$f":"O1664","v":"non"}]
[null,null,null,null,null,null,{"$f":"IFERROR(VLOOKUP(E1666,'Tarif de base'!D:E,2,FALSE)*F1666,\"\")","v":""},null,null,null,null,null,null,null,"non"]
[null,null,null,null,null,null,{"$f":"IFERROR(VLOOKUP(E1667,'Tarif de base'!D:E,2,FALSE)*F1667,\"\")","v":""},null,null,null,null,null,null,null,"non"]
[null,null,null,null,null,null,{"$f":"IFERROR(VLOOKUP(E1668,'Tarif de base'!D:E,2,FALSE)*F1668,\"\")","v":""},null,null,null,null,null,null,null,"non"]
[null,null,null,null,null,null,{"$f":"SUM(G1663:G1668)","v":0},null,null,null,null,null,null,null,"non"]
[null,null,null,null,null,null,{"$f":"IFERROR(VLOOKUP(E1670,'Tarif de base'!D:E,2,FALSE)*F1670,\"\")","v":""},null,null,null,{"$f":"IFERROR(IF(G1676-H1670-I1670-J1670<>0,\"Attention il manque \"&G1676-H1670-I1670-J1670&\"€\",\"Règlement OK\"),\"Pas de règlement\")","v":"Règlement OK"},null,"non",238,{"$f":"M1670","v":"non"}]
[null,null,null,null,null,null,{"$f":"IFERROR(VLOOKUP(E1671,'Tarif de base'!D:E,2,FALSE)*F1671,\"\")","v":""},null,null,null,null,null,null,null,"non"]
[null,null,null,null,null,null,{"$f":"IFERROR(VLOOKUP(E1672,'Tarif de base'!D:E,2,FALSE)*F1672,\"\")","v":""},null,null,null,null,null,null,null,"non"]
[null,null,null,null,null,null,{"$f":"IFERROR(VLOOKUP(E1673,'Tarif de base'!D:E,2,FALSE)*F1673,\"\")","v":""},null,null,null,null,null,null,null,"non"]
[null,null,null,null,null,null,{"$f":"IFERROR(VLOOKUP(E1674,'Tarif de base'!D:E,2,FALSE)*F1674,\"\")","v":""},null,null,null,null,null,null,null,"non"]
[null,null,null,null,null,null,{"$f":"IFERROR(VLOOKUP(E1675,'Tarif de base'!D:E,2,FALSE)*F1675,\"\")","v":""},null,null,null,null,null,null,null,"non"]
[null,null,null,null,null,null,{"$f":"SUM(G1670:G1675)","v":0},null,null,null,null,null,null,null,"non"]
[null,null,null,null,null,null,{"$f":"IFERROR(VLOOKUP(E1677,'Tarif de base'!D:E,2,FALSE)*F1677,\"\")","v":""},null,null,null,{"$f":"IFERROR(IF(G1683-H1677-I1677-J1677<>0,\"Attention il manque \"&G1683-H1677-I1677-J1677&\"€\",\"Règlement OK\"),\"Pas de règlement\")","v":"Règlement OK"},null,"non",239,{"$f":"M1677","v":"non"}]
[null,null,null,null,null,null,{"$f":"IFERROR(VLOOKUP(E1678,'Tarif de base'!D:E,2,FALSE)*F1678,\"\")","v":""},null,null,null,null,null,null,null,"non"]
[null,null,null,null,null,null,{"$f":"IFERROR(VLOOKUP(E1679,'Tarif de base'!D:E,2,FALSE)*F1679,\"\")","v":""},null,null,null,null,null,null,null,"non"]
[null,null,null,null,null,null,{"$f":"IFERROR(VLOOKUP(E1680,'Tarif de base'!D:E,2,FALSE)*F1680,\"\")","v":""},null,null,null,null,null,null,null,"non"]
[null,null,null,null,null,null,{"$f":"IFERROR(VLOOKUP(E1681,'Tarif de base'!D:E,2,FALSE)*F1681,\"\")","v":""},null,null,null,null,null,null,null,"non"]
[null,null,null,null,null,null,{"$f":"IFERROR(VLOOKUP(E1682,'Tarif de base'!D:E,2,FALSE)*F1682,\"\")","v":""},null,null,null,null,null,null,null,"non"]
[null,null,null,null,null,null,{"$f":"SUM(G1677:G1682)","v":0},null,null,null,null,null,null,null,"non"]
[null,null,null,null,null,null,{"$f":"IFERROR(VLOOKUP(E1684,'Tarif de base'!D:E,2,FALSE)*F1684,\"\")","v":""},null,null,null,{"$f":"IFERROR(IF(G1690-H1684-I1684-J1684<>0,\"Attention il manque \"&G1690-H1684-I1684-J1684&\"€\",\"Règlement OK\"),\"Pas de règlement\")","v":"Règlement OK"},null,"non",240,{"$f":"M1684","v":"non"}]
[null,null,null,null,null,null,{"$f":"IFERROR(VLOOKUP(E1685,'Tarif de base'!D:E,2,FALSE)*F1685,\"\")","v":""},null,null,null,null,null,null,null,"non"]
[null,null,null,null,null,null,{"$f":"IFERROR(VLOOKUP(E1686,'Tarif de base'!D:E,2,FALSE)*F1686,\"\")","v":""},null,null,null,null,null,null,null,"non"]
[null,null,null,null,null,null,{"$f":"IFERROR(VLOOKUP(E1687,'Tarif de base'!D:E,2,FALSE)*F1687,\"\")","v":""},null,null,null,null,null,null,null,"non"]
[null,null,null,null,null,null,{"$f":"IFERROR(VLOOKUP(E1688,'Tarif de base'!D:E,2,FALSE)*F1688,\"\")","v":""},null,null,null,null,null,null,null,"non"]
[null,null,null,null,null,null,{"$f":"IFERROR(VLOOKUP(E1689,'Tarif de base'!D:E,2,FALSE)*F1689,\"\")","v":""},null,null,null,null,null,null,null,"non"]
[null,null,null,null,null,null,{"$f":"SUM(G1684:G1689)","v":0},null,null,null,null,null,null,null,"non"]
[null,null,null,null,null,null,{"$f":"IFERROR(VLOOKUP(E1691,'Tarif de base'!D:E,2,FALSE)*F1691,\"\")","v":""},null,null,null,{"$f":"IFERROR(IF(G1697-H1691-I1691-J1691<>0,\"Attention il manque \"&G1697-H1691-I1691-J1691&\"€\",\"Règlement OK\"),\"Pas de règlement\")","v":"Règlement OK"},null,"non",241,{"$f":"M1691","v":"non"}]
[null,null,null,null,null,null,{"$f":"IFERROR(VLOOKUP(E1692,'Tarif de base'!D:E,2,FALSE)*F1692,\"\")","v":""},null,null,null,null,null,null,null,"non"]
[null,null,null,null,null,null,{"$f":"IFERROR(VLOOKUP(E1693,'Tarif de base'!D:E,2,FALSE)*F1693,\"\")","v":""},null,null,null,null,null,null,null,"non"]
[null,null,null,null,null,null,{"$f":"IFERROR(VLOOKUP(E1694,'Tarif de base'!D:E,2,FALSE)*F1694,\"\")","v":""},null,null,null,null,null,null,null,"non"]
[null,null,null,null,null,null,{"$f":"IFERROR(VLOOKUP(E1695,'Tarif de base'!D:E,2,FALSE)*F1695,\"\")","v":""},null,null,null,null,null,null,null,"non"]
[null,null,null,null,null,null,{"$f":"IFERROR(VLOOKUP(E1696,'Tarif de base'!D:E,2,FALSE)*F1696,\"\")","v":""},null,null,null,null,null,null,null,"non"]
[null,null,null,null,null,null,{"$f":"SUM(G1691:G1696)","v":0},null,null,null,null,null,null,null,"non"]
[null,null,null,null,null,null,{"$f":"IFERROR(VLOOKUP(E1698,'Tarif de base'!D:E,2,FALSE)*F1698,\"\")","v":""},null,null,null,{"$f":"IFERROR(IF(G1704-H1698-I1698-J1698<>0,\"Attention il manque \"&G1704-H1698-I1698-J1698&\"€\",\"Règlement OK\"),\"Pas de règlement\")","v":"Règlement OK"},null,"non",242,{"$f":"M1698","v":"non"}]
[null,null,null,null,null,null,{"$f":"IFERROR(VLOOKUP(E1699,'Tarif de base'!D:E,2,FALSE)*F1699,\"\")","v":""},null,null,null,null,null,null,null,"non"]
[null,null,null,null,null,null,{"$f":"IFERROR(VLOOKUP(E1700,'Tarif de base'!D:E,2,FALSE)*F1700,\"\")","v":""},null,null,null,null,null,null,null,"non"]
[null,null,null,null,null,null,{"$f":"IFERROR(VLOOKUP(E1701,'Tarif de base'!D:E,2,FALSE)*F1701,\"\")","v":""},null,null,null,null,null,null,null,"non"]
[null,null,null,null,null,null,{"$f":"IFERROR(VLOOKUP(E1702,'Tarif de base'!D:E,2,FALSE)*F1702,\"\")","v":""},null,null,null,null,null,null,null,"non"]
[null,null,null,null,null,null,{"$f":"IFERROR(VLOOKUP(E1703,'Tarif de base'!D:E,2,FALSE)*F1703,\"\")","v":""},null,null,null,null,null,null,null,"non"]
[null,null,null,null,null,null,{"$f":"SUM(G1698:G1703)","v":0},null,null,null,null,null,null,null,"non"]
[null,null,null,null,null,null,{"$f":"IFERROR(VLOOKUP(E1705,'Tarif de base'!D:E,2,FALSE)*F1705,\"\")","v":""},null,null,null,{"$f":"IFERROR(IF(G1711-H1705-I1705-J1705<>0,\"Attention il manque \"&G1711-H1705-I1705-J1705&\"€\",\"Règlement OK\"),\"Pas de règlement\")","v":"Règlement OK"},null,"non",243,{"$f":"M1705","v":"non"}]
[null,null,null,null,null,null,{"$f":"IFERROR(VLOOKUP(E1706,'Tarif de base'!D:E,2,FALSE)*F1706,\"\")","v":""},null,null,null,null,null,null,null,"non"]
[null,null,null,null,null,null,{"$f":"IFERROR(VLOOKUP(E1707,'Tarif de base'!D:E,2,FALSE)*F1707,\"\")","v":""},null,null,null,null,null,null,null,"non"]
[null,null,null,null,null,null,{"$f":"IFERROR(VLOOKUP(E1708,'Tarif de base'!D:E,2,FALSE)*F1708,\"\")","v":""},null,null,null,null,null,null,null,"non"]
[null,null,null,null,null,null,{"$f":"IFERROR(VLOOKUP(E1709,'Tarif de base'!D:E,2,FALSE)*F1709,\"\")","v":""},null,null,null,null,null,null,null,"non"]
[null,null,null,null,null,null,{"$f":"IFERROR(VLOOKUP(E1710,'Tarif de base'!D:E,2,FALSE)*F1710,\"\")","v":""},null,null,null,null,null,null,null,"non"]
[null,null,null,null,null,null,{"$f":"SUM(G1705:G1710)","v":0},null,null,null,null,null,null,null,"non"]
[null,null,null,null,null,null,{"$f":"IFERROR(VLOOKUP(E1712,'Tarif de base'!D:E,2,FALSE)*F1712,\"\")","v":""},null,null,null,{"$f":"IFERROR(IF(G1718-H1712-I1712-J1712<>0,\"Attention il manque \"&G1718-H1712-I1712-J1712&\"€\",\"Règlement OK\"),\"Pas de règlement\")","v":"Règlement OK"},null,"non",244,{"$f":"M1712","v":"non"}]
[null,null,null,null,null,null,{"$f":"IFERROR(VLOOKUP(E1713,'Tarif de base'!D:E,2,FALSE)*F1713,\"\")","v":""},null,null,null,null,null,null,null,"non"]
[null,null,null,null,null,null,{"$f":"IFERROR(VLOOKUP(E1714,'Tarif de base'!D:E,2,FALSE)*F1714,\"\")","v":""},null,null,null,null,null,null,null,"non"]
[null,null,null,null,null,null,{"$f":"IFERROR(VLOOKUP(E1715,'Tarif de base'!D:E,2,FALSE)*F1715,\"\")","v":""},null,null,null,null,null,null,null,"non"]
[null,null,null,null,null,null,{"$f":"IFERROR(VLOOKUP(E1716,'Tarif de base'!D:E,2,FALSE)*F1716,\"\")","v":""},null,null,null,null,null,null,null,"non"]
[null,null,null,null,null,null,{"$f":"IFERROR(VLOOKUP(E1717,'Tarif de base'!D:E,2,FALSE)*F1717,\"\")","v":""},null,null,null,null,null,null,null,"non"]
[null,null,null,null,null,null,{"$f":"SUM(G1712:G1717)","v":0},null,null,null,null,null,null,null,"non"]
[null,null,null,null,null,null,{"$f":"IFERROR(VLOOKUP(E1719,'Tarif de base'!D:E,2,FALSE)*F1719,\"\")","v":""},null,null,null,{"$f":"IFERROR(IF(G1725-H1719-I1719-J1719<>0,\"Attention il manque \"&G1725-H1719-I1719-J1719&\"€\",\"Règlement OK\"),\"Pas de règlement\")","v":"Règlement OK"},null,"non",245,{"$f":"M1719","v":"non"}]
[null,null,null,null,null,null,{"$f":"IFERROR(VLOOKUP(E1720,'Tarif de base'!D:E,2,FALSE)*F1720,\"\")","v":""},null,null,null,null,null,null,null,"non"]
[null,null,null,null,null,null,{"$f":"IFERROR(VLOOKUP(E1721,'Tarif de base'!D:E,2,FALSE)*F1721,\"\")","v":""},null,null,null,null,null,null,null,"non"]
[null,null,null,null,null,null,{"$f":"IFERROR(VLOOKUP(E1722,'Tarif de base'!D:E,2,FALSE)*F1722,\"\")","v":""},null,null,null,null,null,null,null,"non"]
[null,null,null,null,null,null,{"$f":"IFERROR(VLOOKUP(E1723,'Tarif de base'!D:E,2,FALSE)*F1723,\"\")","v":""},null,null,null,null,null,null,null,"non"]
[null,null,null,null,null,null,{"$f":"IFERROR(VLOOKUP(E1724,'Tarif de base'!D:E,2,FALSE)*F1724,\"\")","v":""},null,null,null,null,null,null,null,"non"]
[null,null,null,null,null,null,{"$f":"SUM(G1719:G1724)","v":0},null,null,null,null,null,null,null,"non"]
[null,null,null,null,null,null,{"$f":"IFERROR(VLOOKUP(E1726,'Tarif de base'!D:E,2,FALSE)*F1726,\"\")","v":""},null,null,null,{"$f":"IFERROR(IF(G1732-H1726-I1726-J1726<>0,\"Attention il manque \"&G1732-H1726-I1726-J1726&\"€\",\"Règlement OK\"),\"Pas de règlement\")","v":"Règlement OK"},null,"non",246,{"$f":"M1726","v":"non"}]
[null,null,null,null,null,null,{"$f":"IFERROR(VLOOKUP(E1727,'Tarif de base'!D:E,2,FALSE)*F1727,\"\")","v":""},null,null,null,null,null,null,null,"non"]
[null,null,null,null,null,null,{"$f":"IFERROR(VLOOKUP(E1728,'Tarif de base'!D:E,2,FALSE)*F1728,\"\")","v":""},null,null,null,null,null,null,null,"non"]
[null,null,null,null,null,null,{"$f":"IFERROR(VLOOKUP(E1729,'Tarif de base'!D:E,2,FALSE)*F1729,\"\")","v":""},null,null,null,null,null,null,null,{"$f":"O1728","v":"non"}]
[null,null,null,null,null,null,{"$f":"IFERROR(VLOOKUP(E1730,'Tarif de base'!D:E,2,FALSE)*F1730,\"\")","v":""},null,null,null,null,null,null,null,"non"]
[null,null,null,null,null,null,{"$f":"IFERROR(VLOOKUP(E1731,'Tarif de base'!D:E,2,FALSE)*F1731,\"\")","v":""},null,null,null,null,null,null,null,"non"]
[null,null,null,null,null,null,{"$f":"SUM(G1726:G1731)","v":0},null,null,null,null,null,null,null,"non"]
[null,null,null,null,null,null,{"$f":"IFERROR(VLOOKUP(E1733,'Tarif de base'!D:E,2,FALSE)*F1733,\"\")","v":""},null,null,null,{"$f":"IFERROR(IF(G1739-H1733-I1733-J1733<>0,\"Attention il manque \"&G1739-H1733-I1733-J1733&\"€\",\"Règlement OK\"),\"Pas de règlement\")","v":"Règlement OK"},null,"non",247,{"$f":"M1733","v":"non"}]
[null,null,null,null,null,null,{"$f":"IFERROR(VLOOKUP(E1734,'Tarif de base'!D:E,2,FALSE)*F1734,\"\")","v":""},null,null,null,null,null,null,null,"non"]
[null,null,null,null,null,null,{"$f":"IFERROR(VLOOKUP(E1735,'Tarif de base'!D:E,2,FALSE)*F1735,\"\")","v":""},null,null,null,null,null,null,null,"non"]
[null,null,null,null,null,null,{"$f":"IFERROR(VLOOKUP(E1736,'Tarif de base'!D:E,2,FALSE)*F1736,\"\")","v":""},null,null,null,null,null,null,null,"non"]
[null,null,null,null,null,null,{"$f":"IFERROR(VLOOKUP(E1737,'Tarif de base'!D:E,2,FALSE)*F1737,\"\")","v":""},null,null,null,null,null,null,null,"non"]
[null,null,null,null,null,null,{"$f":"IFERROR(VLOOKUP(E1738,'Tarif de base'!D:E,2,FALSE)*F1738,\"\")","v":""},null,null,null,null,null,null,null,"non"]
[null,null,null,null,null,null,{"$f":"SUM(G1733:G1738)","v":0},null,null,null,null,null,null,null,"non"]
[null,null,null,null,null,null,{"$f":"IFERROR(VLOOKUP(E1740,'Tarif de base'!D:E,2,FALSE)*F1740,\"\")","v":""},null,null,null,{"$f":"IFERROR(IF(G1746-H1740-I1740-J1740<>0,\"Attention il manque \"&G1746-H1740-I1740-J1740&\"€\",\"Règlement OK\"),\"Pas de règlement\")","v":"Règlement OK"},null,"non",248,{"$f":"M1740","v":"non"}]
[null,null,null,null,null,null,{"$f":"IFERROR(VLOOKUP(E1741,'Tarif de base'!D:E,2,FALSE)*F1741,\"\")","v":""},null,null,null,null,null,null,null,"non"]
[null,null,null,null,null,null,{"$f":"IFERROR(VLOOKUP(E1742,'Tarif de base'!D:E,2,FALSE)*F1742,\"\")","v":""},null,null,null,null,null,null,null,"non"]
[null,null,null,null,null,null,{"$f":"IFERROR(VLOOKUP(E1743,'Tarif de base'!D:E,2,FALSE)*F1743,\"\")","v":""},null,null,null,null,null,null,null,"non"]
[null,null,null,null,null,null,{"$f":"IFERROR(VLOOKUP(E1744,'Tarif de base'!D:E,2,FALSE)*F1744,\"\")","v":""},null,null,null,null,null,null,null,"non"]
[null,null,null,null,null,null,{"$f":"IFERROR(VLOOKUP(E1745,'Tarif de base'!D:E,2,FALSE)*F1745,\"\")","v":""},null,null,null,null,null,null,null,"non"]
[null,null,null,null,null,null,{"$f":"SUM(G1740:G1745)","v":0},null,null,null,null,null,null,null,"non"]
[null,null,null,null,null,null,{"$f":"IFERROR(VLOOKUP(E1747,'Tarif de base'!D:E,2,FALSE)*F1747,\"\")","v":""},null,null,null,{"$f":"IFERROR(IF(G1753-H1747-I1747-J1747<>0,\"Attention il manque \"&G1753-H1747-I1747-J1747&\"€\",\"Règlement OK\"),\"Pas de règlement\")","v":"Règlement OK"},null,"non",249,{"$f":"M1747","v":"non"}]
[null,null,null,null,null,null,{"$f":"IFERROR(VLOOKUP(E1748,'Tarif de base'!D:E,2,FALSE)*F1748,\"\")","v":""},null,null,null,null,null,null,null,"non"]
[null,null,null,null,null,null,{"$f":"IFERROR(VLOOKUP(E1749,'Tarif de base'!D:E,2,FALSE)*F1749,\"\")","v":""},null,null,null,null,null,null,null,"non"]
[null,null,null,null,null,null,{"$f":"IFERROR(VLOOKUP(E1750,'Tarif de base'!D:E,2,FALSE)*F1750,\"\")","v":""},null,null,null,null,null,null,null,"non"]
[null,null,null,null,null,null,{"$f":"IFERROR(VLOOKUP(E1751,'Tarif de base'!D:E,2,FALSE)*F1751,\"\")","v":""},null,null,null,null,null,null,null,"non"]
[null,null,null,null,null,null,{"$f":"IFERROR(VLOOKUP(E1752,'Tarif de base'!D:E,2,FALSE)*F1752,\"\")","v":""},null,null,null,null,null,null,null,"non"]
[null,null,null,null,null,null,{"$f":"SUM(G1747:G1752)","v":0},null,null,null,null,null,null,null,"non"]
[null,null,null,null,null,null,{"$f":"IFERROR(VLOOKUP(E1754,'Tarif de base'!D:E,2,FALSE)*F1754,\"\")","v":""},null,null,null,{"$f":"IFERROR(IF(G1760-H1754-I1754-J1754<>0,\"Attention il manque \"&G1760-H1754-I1754-J1754&\"€\",\"Règlement OK\"),\"Pas de règlement\")","v":"Règlement OK"},null,"non",250,{"$f":"M1754","v":"non"}]
[null,null,null,null,null,null,{"$f":"IFERROR(VLOOKUP(E1755,'Tarif de base'!D:E,2,FALSE)*F1755,\"\")","v":""},null,null,null,null,null,null,null,{"$f":"O1754","v":"non"}]
[null,null,null,null,null,null,{"$f":"IFERROR(VLOOKUP(E1756,'Tarif de base'!D:E,2,FALSE)*F1756,\"\")","v":""},null,null,null,null,null,null,null,"non"]
[null,null,null,null,null,null,{"$f":"IFERROR(VLOOKUP(E1757,'Tarif de base'!D:E,2,FALSE)*F1757,\"\")","v":""},null,null,null,null,null,null,null,"non"]
[null,null,null,null,null,null,{"$f":"IFERROR(VLOOKUP(E1758,'Tarif de base'!D:E,2,FALSE)*F1758,\"\")","v":""},null,null,null,null,null,null,null,"non"]
[null,null,null,null,null,null,{"$f":"IFERROR(VLOOKUP(E1759,'Tarif de base'!D:E,2,FALSE)*F1759,\"\")","v":""},null,null,null,null,null,null,null,"non"]
[null,null,null,null,null,null,{"$f":"SUM(G1754:G1759)","v":0},null,null,null,null,null,null,null,"non"]
[null,null,null,null,null,null,{"$f":"IFERROR(VLOOKUP(E1761,'Tarif de base'!D:E,2,FALSE)*F1761,\"\")","v":""},null,null,null,{"$f":"IFERROR(IF(G1767-H1761-I1761-J1761<>0,\"Attention il manque \"&G1767-H1761-I1761-J1761&\"€\",\"Règlement OK\"),\"Pas de règlement\")","v":"Règlement OK"},null,"non",251,{"$f":"M1761","v":"non"}]
[null,null,null,null,null,null,{"$f":"IFERROR(VLOOKUP(E1762,'Tarif de base'!D:E,2,FALSE)*F1762,\"\")","v":""},null,null,null,null,null,null,null,"non"]
[null,null,null,null,null,null,{"$f":"IFERROR(VLOOKUP(E1763,'Tarif de base'!D:E,2,FALSE)*F1763,\"\")","v":""},null,null,null,null,null,null,null,"non"]
[null,null,null,null,null,null,{"$f":"IFERROR(VLOOKUP(E1764,'Tarif de base'!D:E,2,FALSE)*F1764,\"\")","v":""},null,null,null,null,null,null,null,"non"]
[null,null,null,null,null,null,{"$f":"IFERROR(VLOOKUP(E1765,'Tarif de base'!D:E,2,FALSE)*F1765,\"\")","v":""},null,null,null,null,null,null,null,"non"]
[null,null,null,null,null,null,{"$f":"IFERROR(VLOOKUP(E1766,'Tarif de base'!D:E,2,FALSE)*F1766,\"\")","v":""},null,null,null,null,null,null,null,"non"]
[null,null,null,null,null,null,{"$f":"SUM(G1761:G1766)","v":0},null,null,null,null,null,null,null,"non"]
[null,null,null,null,null,null,{"$f":"IFERROR(VLOOKUP(E1768,'Tarif de base'!D:E,2,FALSE)*F1768,\"\")","v":""},null,null,null,{"$f":"IFERROR(IF(G1774-H1768-I1768-J1768<>0,\"Attention il manque \"&G1774-H1768-I1768-J1768&\"€\",\"Règlement OK\"),\"Pas de règlement\")","v":"Règlement OK"},null,"non",252,{"$f":"M1768","v":"non"}]
[null,null,null,null,null,null,{"$f":"IFERROR(VLOOKUP(E1769,'Tarif de base'!D:E,2,FALSE)*F1769,\"\")","v":""},null,null,null,null,null,null,null,"non"]
[null,null,null,null,null,null,{"$f":"IFERROR(VLOOKUP(E1770,'Tarif de base'!D:E,2,FALSE)*F1770,\"\")","v":""},null,null,null,null,null,null,null,"non"]
[null,null,null,null,null,null,{"$f":"IFERROR(VLOOKUP(E1771,'Tarif de base'!D:E,2,FALSE)*F1771,\"\")","v":""},null,null,null,null,null,null,null,"non"]
[null,null,null,null,null,null,{"$f":"IFERROR(VLOOKUP(E1772,'Tarif de base'!D:E,2,FALSE)*F1772,\"\")","v":""},null,null,null,null,null,null,null,"non"]
[null,null,null,null,null,null,{"$f":"IFERROR(VLOOKUP(E1773,'Tarif de base'!D:E,2,FALSE)*F1773,\"\")","v":""},null,null,null,null,null,null,null,"non"]
[null,null,null,null,null,null,{"$f":"SUM(G1768:G1773)","v":0},null,null,null,null,null,null,null,"non"]
[null,null,null,null,null,null,{"$f":"IFERROR(VLOOKUP(E1775,'Tarif de base'!D:E,2,FALSE)*F1775,\"\")","v":""},null,null,null,{"$f":"IFERROR(IF(G1781-H1775-I1775-J1775<>0,\"Attention il manque \"&G1781-H1775-I1775-J1775&\"€\",\"Règlement OK\"),\"Pas de règlement\")","v":"Règlement OK"},null,"non",253,{"$f":"M1775","v":"non"}]
[null,null,null,null,null,null,{"$f":"IFERROR(VLOOKUP(E1776,'Tarif de base'!D:E,2,FALSE)*F1776,\"\")","v":""},null,null,null,null,null,null,null,"non"]
[null,null,null,null,null,null,{"$f":"IFERROR(VLOOKUP(E1777,'Tarif de base'!D:E,2,FALSE)*F1777,\"\")","v":""},null,null,null,null,null,null,null,"non"]
[null,null,null,null,null,null,{"$f":"IFERROR(VLOOKUP(E1778,'Tarif de base'!D:E,2,FALSE)*F1778,\"\")","v":""},null,null,null,null,null,null,null,"non"]
[null,null,null,null,null,null,{"$f":"IFERROR(VLOOKUP(E1779,'Tarif de base'!D:E,2,FALSE)*F1779,\"\")","v":""},null,null,null,null,null,null,null,"non"]
[null,null,null,null,null,null,{"$f":"IFERROR(VLOOKUP(E1780,'Tarif de base'!D:E,2,FALSE)*F1780,\"\")","v":""},null,null,null,null,null,null,null,"non"]
[null,null,null,null,null,null,{"$f":"SUM(G1775:G1780)","v":0},null,null,null,null,null,null,null,"non"]
[null,null,null,null,null,null,{"$f":"IFERROR(VLOOKUP(E1782,'Tarif de base'!D:E,2,FALSE)*F1782,\"\")","v":""},null,null,null,{"$f":"IFERROR(IF(G1788-H1782-I1782-J1782<>0,\"Attention il manque \"&G1788-H1782-I1782-J1782&\"€\",\"Règlement OK\"),\"Pas de règlement\")","v":"Règlement OK"},null,"non",254,{"$f":"M1782","v":"non"}]
[null,null,null,null,null,null,{"$f":"IFERROR(VLOOKUP(E1783,'Tarif de base'!D:E,2,FALSE)*F1783,\"\")","v":""},null,null,null,null,null,null,null,{"$f":"O1782","v":"non"}]
[null,null,null,null,null,null,{"$f":"IFERROR(VLOOKUP(E1784,'Tarif de base'!D:E,2,FALSE)*F1784,\"\")","v":""},null,null,null,null,null,null,null,{"$f":"O1783","v":"non"}]
[null,null,null,null,null,null,{"$f":"IFERROR(VLOOKUP(E1785,'Tarif de base'!D:E,2,FALSE)*F1785,\"\")","v":""},null,null,null,null,null,null,null,"non"]
[null,null,null,null,null,null,{"$f":"IFERROR(VLOOKUP(E1786,'Tarif de base'!D:E,2,FALSE)*F1786,\"\")","v":""},null,null,null,null,null,null,null,"non"]
[null,null,null,null,null,null,{"$f":"IFERROR(VLOOKUP(E1787,'Tarif de base'!D:E,2,FALSE)*F1787,\"\")","v":""},null,null,null,null,null,null,null,"non"]
[null,null,null,null,null,null,{"$f":"SUM(G1782:G1787)","v":0},null,null,null,null,null,null,null,"non"]
[null,null,null,null,null,null,{"$f":"IFERROR(VLOOKUP(E1789,'Tarif de base'!D:E,2,FALSE)*F1789,\"\")","v":""},null,null,null,{"$f":"IFERROR(IF(G1795-H1789-I1789-J1789<>0,\"Attention il manque \"&G1795-H1789-I1789-J1789&\"€\",\"Règlement OK\"),\"Pas de règlement\")","v":"Règlement OK"},null,"non",255,{"$f":"M1789","v":"non"}]
[null,null,null,null,null,null,{"$f":"IFERROR(VLOOKUP(E1790,'Tarif de base'!D:E,2,FALSE)*F1790,\"\")","v":""},null,null,null,null,null,null,null,{"$f":"O1789","v":"non"}]
[null,null,null,null,null,null,{"$f":"IFERROR(VLOOKUP(E1791,'Tarif de base'!D:E,2,FALSE)*F1791,\"\")","v":""},null,null,null,null,null,null,null,{"$f":"O1790","v":"non"}]
[null,null,null,null,null,null,{"$f":"IFERROR(VLOOKUP(E1792,'Tarif de base'!D:E,2,FALSE)*F1792,\"\")","v":""},null,null,null,null,null,null,null,"non"]
[null,null,null,null,null,null,{"$f":"IFERROR(VLOOKUP(E1793,'Tarif de base'!D:E,2,FALSE)*F1793,\"\")","v":""},null,null,null,null,null,null,null,"non"]
[null,null,null,null,null,null,{"$f":"IFERROR(VLOOKUP(E1794,'Tarif de base'!D:E,2,FALSE)*F1794,\"\")","v":""},null,null,null,null,null,null,null,"non"]
[null,null,null,null,null,null,{"$f":"SUM(G1789:G1794)","v":0},null,null,null,null,null,null,null,"non"]
[null,null,null,null,null,null,{"$f":"IFERROR(VLOOKUP(E1796,'Tarif de base'!D:E,2,FALSE)*F1796,\"\")","v":""},null,null,null,{"$f":"IFERROR(IF(G1802-H1796-I1796-J1796<>0,\"Attention il manque \"&G1802-H1796-I1796-J1796&\"€\",\"Règlement OK\"),\"Pas de règlement\")","v":"Règlement OK"},null,"non",256,{"$f":"M1796","v":"non"}]
[null,null,null,null,null,null,{"$f":"IFERROR(VLOOKUP(E1797,'Tarif de base'!D:E,2,FALSE)*F1797,\"\")","v":""},null,null,null,null,null,null,null,"non"]
[null,null,null,null,null,null,{"$f":"IFERROR(VLOOKUP(E1798,'Tarif de base'!D:E,2,FALSE)*F1798,\"\")","v":""},null,null,null,null,null,null,null,"non"]
[null,null,null,null,null,null,{"$f":"IFERROR(VLOOKUP(E1799,'Tarif de base'!D:E,2,FALSE)*F1799,\"\")","v":""},null,null,null,null,null,null,null,"non"]
[null,null,null,null,null,null,{"$f":"IFERROR(VLOOKUP(E1800,'Tarif de base'!D:E,2,FALSE)*F1800,\"\")","v":""},null,null,null,null,null,null,null,"non"]
[null,null,null,null,null,null,{"$f":"IFERROR(VLOOKUP(E1801,'Tarif de base'!D:E,2,FALSE)*F1801,\"\")","v":""},null,null,null,null,null,null,null,"non"]
[null,null,null,null,null,null,{"$f":"SUM(G1796:G1801)","v":0},null,null,null,null,null,null,null,"non"]
[null,null,null,null,null,null,{"$f":"IFERROR(VLOOKUP(E1803,'Tarif de base'!D:E,2,FALSE)*F1803,\"\")","v":""},null,null,null,{"$f":"IFERROR(IF(G1809-H1803-I1803-J1803<>0,\"Attention il manque \"&G1809-H1803-I1803-J1803&\"€\",\"Règlement OK\"),\"Pas de règlement\")","v":"Règlement OK"},null,"non",257,{"$f":"M1803","v":"non"}]
[null,null,null,null,null,null,{"$f":"IFERROR(VLOOKUP(E1804,'Tarif de base'!D:E,2,FALSE)*F1804,\"\")","v":""},null,null,null,null,null,null,null,"non"]
[null,null,null,null,null,null,{"$f":"IFERROR(VLOOKUP(E1805,'Tarif de base'!D:E,2,FALSE)*F1805,\"\")","v":""},null,null,null,null,null,null,null,"non"]
[null,null,null,null,null,null,{"$f":"IFERROR(VLOOKUP(E1806,'Tarif de base'!D:E,2,FALSE)*F1806,\"\")","v":""},null,null,null,null,null,null,null,"non"]
[null,null,null,null,null,null,{"$f":"IFERROR(VLOOKUP(E1807,'Tarif de base'!D:E,2,FALSE)*F1807,\"\")","v":""},null,null,null,null,null,null,null,"non"]
[null,null,null,null,null,null,{"$f":"IFERROR(VLOOKUP(E1808,'Tarif de base'!D:E,2,FALSE)*F1808,\"\")","v":""},null,null,null,null,null,null,null,"non"]
[null,null,null,null,null,null,{"$f":"SUM(G1803:G1808)","v":0},null,null,null,null,null,null,null,"non"]
[null,null,null,null,null,null,{"$f":"IFERROR(VLOOKUP(E1810,'Tarif de base'!D:E,2,FALSE)*F1810,\"\")","v":""},null,null,null,{"$f":"IFERROR(IF(G1816-H1810-I1810-J1810<>0,\"Attention il manque \"&G1816-H1810-I1810-J1810&\"€\",\"Règlement OK\"),\"Pas de règlement\")","v":"Règlement OK"},null,"non",258,{"$f":"M1810","v":"non"}]
[null,null,null,null,null,null,{"$f":"IFERROR(VLOOKUP(E1811,'Tarif de base'!D:E,2,FALSE)*F1811,\"\")","v":""},null,null,null,null,null,null,null,"non"]
[null,null,null,null,null,null,{"$f":"IFERROR(VLOOKUP(E1812,'Tarif de base'!D:E,2,FALSE)*F1812,\"\")","v":""},null,null,null,null,null,null,null,"non"]
[null,null,null,null,null,null,{"$f":"IFERROR(VLOOKUP(E1813,'Tarif de base'!D:E,2,FALSE)*F1813,\"\")","v":""},null,null,null,null,null,null,null,"non"]
[null,null,null,null,null,null,{"$f":"IFERROR(VLOOKUP(E1814,'Tarif de base'!D:E,2,FALSE)*F1814,\"\")","v":""},null,null,null,null,null,null,null,"non"]
[null,null,null,null,null,null,{"$f":"IFERROR(VLOOKUP(E1815,'Tarif de base'!D:E,2,FALSE)*F1815,\"\")","v":""},null,null,null,null,null,null,null,"non"]
[null,null,null,null,null,null,{"$f":"SUM(G1810:G1815)","v":0},null,null,null,null,null,null,null,"non"]
[null,null,null,null,null,null,{"$f":"IFERROR(VLOOKUP(E1817,'Tarif de base'!D:E,2,FALSE)*F1817,\"\")","v":""},null,null,null,{"$f":"IFERROR(IF(G1823-H1817-I1817-J1817<>0,\"Attention il manque \"&G1823-H1817-I1817-J1817&\"€\",\"Règlement OK\"),\"Pas de règlement\")","v":"Règlement OK"},null,"non",259,{"$f":"M1817","v":"non"}]
[null,null,null,null,null,null,{"$f":"IFERROR(VLOOKUP(E1818,'Tarif de base'!D:E,2,FALSE)*F1818,\"\")","v":""},null,null,null,null,null,null,null,"non"]
[null,null,null,null,null,null,{"$f":"IFERROR(VLOOKUP(E1819,'Tarif de base'!D:E,2,FALSE)*F1819,\"\")","v":""},null,null,null,null,null,null,null,"non"]
[null,null,null,null,null,null,{"$f":"IFERROR(VLOOKUP(E1820,'Tarif de base'!D:E,2,FALSE)*F1820,\"\")","v":""},null,null,null,null,null,null,null,"non"]
[null,null,null,null,null,null,{"$f":"IFERROR(VLOOKUP(E1821,'Tarif de base'!D:E,2,FALSE)*F1821,\"\")","v":""},null,null,null,null,null,null,null,"non"]
[null,null,null,null,null,null,{"$f":"IFERROR(VLOOKUP(E1822,'Tarif de base'!D:E,2,FALSE)*F1822,\"\")","v":""},null,null,null,null,null,null,null,"non"]
[null,null,null,null,null,null,{"$f":"SUM(G1817:G1822)","v":0},null,null,null,null,null,null,null,"non"]
[null,null,null,null,null,null,{"$f":"IFERROR(VLOOKUP(E1824,'Tarif de base'!D:E,2,FALSE)*F1824,\"\")","v":""},null,null,null,{"$f":"IFERROR(IF(G1830-H1824-I1824-J1824<>0,\"Attention il manque \"&G1830-H1824-I1824-J1824&\"€\",\"Règlement OK\"),\"Pas de règlement\")","v":"Règlement OK"},null,"non",260,{"$f":"M1824","v":"non"}]
[null,null,null,null,null,null,{"$f":"IFERROR(VLOOKUP(E1825,'Tarif de base'!D:E,2,FALSE)*F1825,\"\")","v":""},null,null,null,null,null,null,null,"non"]
[null,null,null,null,null,null,{"$f":"IFERROR(VLOOKUP(E1826,'Tarif de base'!D:E,2,FALSE)*F1826,\"\")","v":""},null,null,null,null,null,null,null,"non"]
[null,null,null,null,null,null,{"$f":"IFERROR(VLOOKUP(E1827,'Tarif de base'!D:E,2,FALSE)*F1827,\"\")","v":""},null,null,null,null,null,null,null,"non"]
[null,null,null,null,null,null,{"$f":"IFERROR(VLOOKUP(E1828,'Tarif de base'!D:E,2,FALSE)*F1828,\"\")","v":""},null,null,null,null,null,null,null,"non"]
[null,null,null,null,null,null,{"$f":"IFERROR(VLOOKUP(E1829,'Tarif de base'!D:E,2,FALSE)*F1829,\"\")","v":""},null,null,null,null,null,null,null,"non"]
[null,null,null,null,null,null,{"$f":"SUM(G1824:G1829)","v":0},null,null,null,null,null,null,null,"non"]
[null,null,null,null,null,null,{"$f":"IFERROR(VLOOKUP(E1831,'Tarif de base'!D:E,2,FALSE)*F1831,\"\")","v":""},null,null,null,{"$f":"IFERROR(IF(G1837-H1831-I1831-J1831<>0,\"Attention il manque \"&G1837-H1831-I1831-J1831&\"€\",\"Règlement OK\"),\"Pas de règlement\")","v":"Règlement OK"},null,"non",261,{"$f":"M1831","v":"non"}]
[null,null,null,null,null,null,{"$f":"IFERROR(VLOOKUP(E1832,'Tarif de base'!D:E,2,FALSE)*F1832,\"\")","v":""},null,null,null,null,null,null,null,"non"]
[null,null,null,null,null,null,{"$f":"IFERROR(VLOOKUP(E1833,'Tarif de base'!D:E,2,FALSE)*F1833,\"\")","v":""},null,null,null,null,null,null,null,"non"]
[null,null,null,null,null,null,{"$f":"IFERROR(VLOOKUP(E1834,'Tarif de base'!D:E,2,FALSE)*F1834,\"\")","v":""},null,null,null,null,null,null,null,"non"]
[null,null,null,null,null,null,{"$f":"IFERROR(VLOOKUP(E1835,'Tarif de base'!D:E,2,FALSE)*F1835,\"\")","v":""},null,null,null,null,null,null,null,"non"]
[null,null,null,null,null,null,{"$f":"IFERROR(VLOOKUP(E1836,'Tarif de base'!D:E,2,FALSE)*F1836,\"\")","v":""},null,null,null,null,null,null,null,"non"]
[null,null,null,null,null,null,{"$f":"SUM(G1831:G1836)","v":0},null,null,null,null,null,null,null,"non"]
[null,null,null,null,null,null,{"$f":"IFERROR(VLOOKUP(E1838,'Tarif de base'!D:E,2,FALSE)*F1838,\"\")","v":""},null,null,null,{"$f":"IFERROR(IF(G1844-H1838-I1838-J1838<>0,\"Attention il manque \"&G1844-H1838-I1838-J1838&\"€\",\"Règlement OK\"),\"Pas de règlement\")","v":"Règlement OK"},null,"non",262,{"$f":"M1838","v":"non"}]
[null,null,null,null,null,null,{"$f":"IFERROR(VLOOKUP(E1839,'Tarif de base'!D:E,2,FALSE)*F1839,\"\")","v":""},null,null,null,null,null,null,null,"non"]
[null,null,null,null,null,null,{"$f":"IFERROR(VLOOKUP(E1840,'Tarif de base'!D:E,2,FALSE)*F1840,\"\")","v":""},null,null,null,null,null,null,null,"non"]
[null,null,null,null,null,null,{"$f":"IFERROR(VLOOKUP(E1841,'Tarif de base'!D:E,2,FALSE)*F1841,\"\")","v":""},null,null,null,null,null,null,null,"non"]
[null,null,null,null,null,null,{"$f":"IFERROR(VLOOKUP(E1842,'Tarif de base'!D:E,2,FALSE)*F1842,\"\")","v":""},null,null,null,null,null,null,null,"non"]
[null,null,null,null,null,null,{"$f":"IFERROR(VLOOKUP(E1843,'Tarif de base'!D:E,2,FALSE)*F1843,\"\")","v":""},null,null,null,null,null,null,null,"non"]
[null,null,null,null,null,null,{"$f":"SUM(G1838:G1843)","v":0},null,null,null,null,null,null,null,"non"]
[null,null,null,null,null,null,{"$f":"IFERROR(VLOOKUP(E1845,'Tarif de base'!D:E,2,FALSE)*F1845,\"\")","v":""},null,null,null,{"$f":"IFERROR(IF(G1851-H1845-I1845-J1845<>0,\"Attention il manque \"&G1851-H1845-I1845-J1845&\"€\",\"Règlement OK\"),\"Pas de règlement\")","v":"Règlement OK"},null,"non",263,{"$f":"M1845","v":"non"}]
[null,null,null,null,null,null,{"$f":"IFERROR(VLOOKUP(E1846,'Tarif de base'!D:E,2,FALSE)*F1846,\"\")","v":""},null,null,null,null,null,null,null,"non"]
[null,null,null,null,null,null,{"$f":"IFERROR(VLOOKUP(E1847,'Tarif de base'!D:E,2,FALSE)*F1847,\"\")","v":""},null,null,null,null,null,null,null,"non"]
[null,null,null,null,null,null,{"$f":"IFERROR(VLOOKUP(E1848,'Tarif de base'!D:E,2,FALSE)*F1848,\"\")","v":""},null,null,null,null,null,null,null,"non"]
[null,null,null,null,null,null,{"$f":"IFERROR(VLOOKUP(E1849,'Tarif de base'!D:E,2,FALSE)*F1849,\"\")","v":""},null,null,null,null,null,null,null,"non"]
[null,null,null,null,null,null,{"$f":"IFERROR(VLOOKUP(E1850,'Tarif de base'!D:E,2,FALSE)*F1850,\"\")","v":""},null,null,null,null,null,null,null,"non"]
[null,null,null,null,null,null,{"$f":"SUM(G1845:G1850)","v":0},null,null,null,null,null,null,null,"non"]
[null,null,null,null,null,null,{"$f":"IFERROR(VLOOKUP(E1852,'Tarif de base'!D:E,2,FALSE)*F1852,\"\")","v":""},null,null,null,{"$f":"IFERROR(IF(G1858-H1852-I1852-J1852<>0,\"Attention il manque \"&G1858-H1852-I1852-J1852&\"€\",\"Règlement OK\"),\"Pas de règlement\")","v":"Règlement OK"},null,"non",264,{"$f":"M1852","v":"non"}]
[null,null,null,null,null,null,{"$f":"IFERROR(VLOOKUP(E1853,'Tarif de base'!D:E,2,FALSE)*F1853,\"\")","v":""},null,null,null,null,null,null,null,"non"]
[null,null,null,null,null,null,{"$f":"IFERROR(VLOOKUP(E1854,'Tarif de base'!D:E,2,FALSE)*F1854,\"\")","v":""},null,null,null,null,null,null,null,"non"]
[null,null,null,null,null,null,{"$f":"IFERROR(VLOOKUP(E1855,'Tarif de base'!D:E,2,FALSE)*F1855,\"\")","v":""},null,null,null,null,null,null,null,{"$f":"O1854","v":"non"}]
[null,null,null,null,null,null,{"$f":"IFERROR(VLOOKUP(E1856,'Tarif de base'!D:E,2,FALSE)*F1856,\"\")","v":""},null,null,null,null,null,null,null,"non"]
[null,null,null,null,null,null,{"$f":"IFERROR(VLOOKUP(E1857,'Tarif de base'!D:E,2,FALSE)*F1857,\"\")","v":""},null,null,null,null,null,null,null,"non"]
[null,null,null,null,null,null,{"$f":"SUM(G1852:G1857)","v":0},null,null,null,null,null,null,null,"non"]
[null,null,null,null,null,null,{"$f":"IFERROR(VLOOKUP(E1859,'Tarif de base'!D:E,2,FALSE)*F1859,\"\")","v":""},null,null,null,{"$f":"IFERROR(IF(G1865-H1859-I1859-J1859<>0,\"Attention il manque \"&G1865-H1859-I1859-J1859&\"€\",\"Règlement OK\"),\"Pas de règlement\")","v":"Règlement OK"},null,"non",265,{"$f":"M1859","v":"non"}]
[null,null,null,null,null,null,{"$f":"IFERROR(VLOOKUP(E1860,'Tarif de base'!D:E,2,FALSE)*F1860,\"\")","v":""},null,null,null,null,null,null,null,"non"]
[null,null,null,null,null,null,{"$f":"IFERROR(VLOOKUP(E1861,'Tarif de base'!D:E,2,FALSE)*F1861,\"\")","v":""},null,null,null,null,null,null,null,"non"]
[null,null,null,null,null,null,{"$f":"IFERROR(VLOOKUP(E1862,'Tarif de base'!D:E,2,FALSE)*F1862,\"\")","v":""},null,null,null,null,null,null,null,"non"]
[null,null,null,null,null,null,{"$f":"IFERROR(VLOOKUP(E1863,'Tarif de base'!D:E,2,FALSE)*F1863,\"\")","v":""},null,null,null,null,null,null,null,"non"]
[null,null,null,null,null,null,{"$f":"IFERROR(VLOOKUP(E1864,'Tarif de base'!D:E,2,FALSE)*F1864,\"\")","v":""},null,null,null,null,null,null,null,"non"]
[null,null,null,null,null,null,{"$f":"SUM(G1859:G1864)","v":0},null,null,null,null,null,null,null,"non"]
[null,null,null,null,null,null,{"$f":"IFERROR(VLOOKUP(E1866,'Tarif de base'!D:E,2,FALSE)*F1866,\"\")","v":""},null,null,null,{"$f":"IFERROR(IF(G1872-H1866-I1866-J1866<>0,\"Attention il manque \"&G1872-H1866-I1866-J1866&\"€\",\"Règlement OK\"),\"Pas de règlement\")","v":"Règlement OK"},null,"non",266,{"$f":"M1866","v":"non"}]
[null,null,null,null,null,null,{"$f":"IFERROR(VLOOKUP(E1867,'Tarif de base'!D:E,2,FALSE)*F1867,\"\")","v":""},null,null,null,null,null,null,null,"non"]
[null,null,null,null,null,null,{"$f":"IFERROR(VLOOKUP(E1868,'Tarif de base'!D:E,2,FALSE)*F1868,\"\")","v":""},null,null,null,null,null,null,null,"non"]
[null,null,null,null,null,null,{"$f":"IFERROR(VLOOKUP(E1869,'Tarif de base'!D:E,2,FALSE)*F1869,\"\")","v":""},null,null,null,null,null,null,null,"non"]
[null,null,null,null,null,null,{"$f":"IFERROR(VLOOKUP(E1870,'Tarif de base'!D:E,2,FALSE)*F1870,\"\")","v":""},null,null,null,null,null,null,null,"non"]
[null,null,null,null,null,null,{"$f":"IFERROR(VLOOKUP(E1871,'Tarif de base'!D:E,2,FALSE)*F1871,\"\")","v":""},null,null,null,null,null,null,null,"non"]
[null,null,null,null,null,null,{"$f":"SUM(G1866:G1871)","v":0},null,null,null,null,null,null,null,"non"]
[null,null,null,null,null,null,{"$f":"IFERROR(VLOOKUP(E1873,'Tarif de base'!D:E,2,FALSE)*F1873,\"\")","v":""},null,null,null,{"$f":"IFERROR(IF(G1879-H1873-I1873-J1873<>0,\"Attention il manque \"&G1879-H1873-I1873-J1873&\"€\",\"Règlement OK\"),\"Pas de règlement\")","v":"Règlement OK"},null,"non",267,{"$f":"M1873","v":"non"}]
[null,null,null,null,null,null,{"$f":"IFERROR(VLOOKUP(E1874,'Tarif de base'!D:E,2,FALSE)*F1874,\"\")","v":""},null,null,null,null,null,null,null,"non"]
[null,null,null,null,null,null,{"$f":"IFERROR(VLOOKUP(E1875,'Tarif de base'!D:E,2,FALSE)*F1875,\"\")","v":""},null,null,null,null,null,null,null,"non"]
[null,null,null,null,null,null,{"$f":"IFERROR(VLOOKUP(E1876,'Tarif de base'!D:E,2,FALSE)*F1876,\"\")","v":""},null,null,null,null,null,null,null,"non"]
[null,null,null,null,null,null,{"$f":"IFERROR(VLOOKUP(E1877,'Tarif de base'!D:E,2,FALSE)*F1877,\"\")","v":""},null,null,null,null,null,null,null,"non"]
[null,null,null,null,null,null,{"$f":"IFERROR(VLOOKUP(E1878,'Tarif de base'!D:E,2,FALSE)*F1878,\"\")","v":""},null,null,null,null,null,null,null,"non"]
[null,null,null,null,null,null,{"$f":"SUM(G1873:G1878)","v":0},null,null,null,null,null,null,null,"non"]
[null,null,null,null,null,null,{"$f":"IFERROR(VLOOKUP(E1880,'Tarif de base'!D:E,2,FALSE)*F1880,\"\")","v":""},null,null,null,{"$f":"IFERROR(IF(G1886-H1880-I1880-J1880<>0,\"Attention il manque \"&G1886-H1880-I1880-J1880&\"€\",\"Règlement OK\"),\"Pas de règlement\")","v":"Règlement OK"},null,"non",268,{"$f":"M1880","v":"non"}]
[null,null,null,null,null,null,{"$f":"IFERROR(VLOOKUP(E1881,'Tarif de base'!D:E,2,FALSE)*F1881,\"\")","v":""},null,null,null,null,null,null,null,{"$f":"O1880","v":"non"}]
[null,null,null,null,null,null,{"$f":"IFERROR(VLOOKUP(E1882,'Tarif de base'!D:E,2,FALSE)*F1882,\"\")","v":""},null,null,null,null,null,null,null,"non"]
[null,null,null,null,null,null,{"$f":"IFERROR(VLOOKUP(E1883,'Tarif de base'!D:E,2,FALSE)*F1883,\"\")","v":""},null,null,null,null,null,null,null,"non"]
[null,null,null,null,null,null,{"$f":"IFERROR(VLOOKUP(E1884,'Tarif de base'!D:E,2,FALSE)*F1884,\"\")","v":""},null,null,null,null,null,null,null,"non"]
[null,null,null,null,null,null,{"$f":"IFERROR(VLOOKUP(E1885,'Tarif de base'!D:E,2,FALSE)*F1885,\"\")","v":""},null,null,null,null,null,null,null,"non"]
[null,null,null,null,null,null,{"$f":"SUM(G1880:G1885)","v":0},null,null,null,null,null,null,null,"non"]
[null,null,null,null,null,null,{"$f":"IFERROR(VLOOKUP(E1887,'Tarif de base'!D:E,2,FALSE)*F1887,\"\")","v":""},null,null,null,{"$f":"IFERROR(IF(G1893-H1887-I1887-J1887<>0,\"Attention il manque \"&G1893-H1887-I1887-J1887&\"€\",\"Règlement OK\"),\"Pas de règlement\")","v":"Règlement OK"},null,"non",269,{"$f":"M1887","v":"non"}]
[null,null,null,null,null,null,{"$f":"IFERROR(VLOOKUP(E1888,'Tarif de base'!D:E,2,FALSE)*F1888,\"\")","v":""},null,null,null,null,null,null,null,"non"]
[null,null,null,null,null,null,{"$f":"IFERROR(VLOOKUP(E1889,'Tarif de base'!D:E,2,FALSE)*F1889,\"\")","v":""},null,null,null,null,null,null,null,"non"]
[null,null,null,null,null,null,{"$f":"IFERROR(VLOOKUP(E1890,'Tarif de base'!D:E,2,FALSE)*F1890,\"\")","v":""},null,null,null,null,null,null,null,"non"]
[null,null,null,null,null,null,{"$f":"IFERROR(VLOOKUP(E1891,'Tarif de base'!D:E,2,FALSE)*F1891,\"\")","v":""},null,null,null,null,null,null,null,"non"]
[null,null,null,null,null,null,{"$f":"IFERROR(VLOOKUP(E1892,'Tarif de base'!D:E,2,FALSE)*F1892,\"\")","v":""},null,null,null,null,null,null,null,"non"]
[null,null,null,null,null,null,{"$f":"SUM(G1887:G1892)","v":0},null,null,null,null,null,null,null,"non"]
[null,null,null,null,null,null,{"$f":"IFERROR(VLOOKUP(E1894,'Tarif de base'!D:E,2,FALSE)*F1894,\"\")","v":""},null,null,null,{"$f":"IFERROR(IF(G1900-H1894-I1894-J1894<>0,\"Attention il manque \"&G1900-H1894-I1894-J1894&\"€\",\"Règlement OK\"),\"Pas de règlement\")","v":"Règlement OK"},null,"non",270,{"$f":"M1894","v":"non"}]
[null,null,null,null,null,null,{"$f":"IFERROR(VLOOKUP(E1895,'Tarif de base'!D:E,2,FALSE)*F1895,\"\")","v":""},null,null,null,null,null,null,null,"non"]
[null,null,null,null,null,null,{"$f":"IFERROR(VLOOKUP(E1896,'Tarif de base'!D:E,2,FALSE)*F1896,\"\")","v":""},null,null,null,null,null,null,null,"non"]
[null,null,null,null,null,null,{"$f":"IFERROR(VLOOKUP(E1897,'Tarif de base'!D:E,2,FALSE)*F1897,\"\")","v":""},null,null,null,null,null,null,null,"non"]
[null,null,null,null,null,null,{"$f":"IFERROR(VLOOKUP(E1898,'Tarif de base'!D:E,2,FALSE)*F1898,\"\")","v":""},null,null,null,null,null,null,null,"non"]
[null,null,null,null,null,null,{"$f":"IFERROR(VLOOKUP(E1899,'Tarif de base'!D:E,2,FALSE)*F1899,\"\")","v":""},null,null,null,null,null,null,null,"non"]
[null,null,null,null,null,null,{"$f":"SUM(G1894:G1899)","v":0},null,null,null,null,null,null,null,"non"]
[null,null,null,null,null,null,{"$f":"IFERROR(VLOOKUP(E1901,'Tarif de base'!D:E,2,FALSE)*F1901,\"\")","v":""},null,null,null,{"$f":"IFERROR(IF(G1907-H1901-I1901-J1901<>0,\"Attention il manque \"&G1907-H1901-I1901-J1901&\"€\",\"Règlement OK\"),\"Pas de règlement\")","v":"Règlement OK"},null,"non",271,{"$f":"M1901","v":"non"}]
[null,null,null,null,null,null,{"$f":"IFERROR(VLOOKUP(E1902,'Tarif de base'!D:E,2,FALSE)*F1902,\"\")","v":""},null,null,null,null,null,null,null,"non"]
[null,null,null,null,null,null,{"$f":"IFERROR(VLOOKUP(E1903,'Tarif de base'!D:E,2,FALSE)*F1903,\"\")","v":""},null,null,null,null,null,null,null,"non"]
[null,null,null,null,null,null,{"$f":"IFERROR(VLOOKUP(E1904,'Tarif de base'!D:E,2,FALSE)*F1904,\"\")","v":""},null,null,null,null,null,null,null,"non"]
[null,null,null,null,null,null,{"$f":"IFERROR(VLOOKUP(E1905,'Tarif de base'!D:E,2,FALSE)*F1905,\"\")","v":""},null,null,null,null,null,null,null,"non"]
[null,null,null,null,null,null,{"$f":"IFERROR(VLOOKUP(E1906,'Tarif de base'!D:E,2,FALSE)*F1906,\"\")","v":""},null,null,null,null,null,null,null,"non"]
[null,null,null,null,null,null,{"$f":"SUM(G1901:G1906)","v":0},null,null,null,null,null,null,null,"non"]
[null,null,null,null,null,null,{"$f":"IFERROR(VLOOKUP(E1908,'Tarif de base'!D:E,2,FALSE)*F1908,\"\")","v":""},null,null,null,{"$f":"IFERROR(IF(G1914-H1908-I1908-J1908<>0,\"Attention il manque \"&G1914-H1908-I1908-J1908&\"€\",\"Règlement OK\"),\"Pas de règlement\")","v":"Règlement OK"},null,"non",272,{"$f":"M1908","v":"non"}]
[null,null,null,null,null,null,{"$f":"IFERROR(VLOOKUP(E1909,'Tarif de base'!D:E,2,FALSE)*F1909,\"\")","v":""},null,null,null,null,null,null,null,{"$f":"O1908","v":"non"}]
[null,null,null,null,null,null,{"$f":"IFERROR(VLOOKUP(E1910,'Tarif de base'!D:E,2,FALSE)*F1910,\"\")","v":""},null,null,null,null,null,null,null,{"$f":"O1909","v":"non"}]
[null,null,null,null,null,null,{"$f":"IFERROR(VLOOKUP(E1911,'Tarif de base'!D:E,2,FALSE)*F1911,\"\")","v":""},null,null,null,null,null,null,null,"non"]
[null,null,null,null,null,null,{"$f":"IFERROR(VLOOKUP(E1912,'Tarif de base'!D:E,2,FALSE)*F1912,\"\")","v":""},null,null,null,null,null,null,null,"non"]
[null,null,null,null,null,null,{"$f":"IFERROR(VLOOKUP(E1913,'Tarif de base'!D:E,2,FALSE)*F1913,\"\")","v":""},null,null,null,null,null,null,null,"non"]
[null,null,null,null,null,null,{"$f":"SUM(G1908:G1913)","v":0},null,null,null,null,null,null,null,"non"]
[null,null,null,null,null,null,{"$f":"IFERROR(VLOOKUP(E1915,'Tarif de base'!D:E,2,FALSE)*F1915,\"\")","v":""},null,null,null,{"$f":"IFERROR(IF(G1921-H1915-I1915-J1915<>0,\"Attention il manque \"&G1921-H1915-I1915-J1915&\"€\",\"Règlement OK\"),\"Pas de règlement\")","v":"Règlement OK"},null,"non",273,{"$f":"M1915","v":"non"}]
[null,null,null,null,null,null,{"$f":"IFERROR(VLOOKUP(E1916,'Tarif de base'!D:E,2,FALSE)*F1916,\"\")","v":""},null,null,null,null,null,null,null,{"$f":"O1915","v":"non"}]
[null,null,null,null,null,null,{"$f":"IFERROR(VLOOKUP(E1917,'Tarif de base'!D:E,2,FALSE)*F1917,\"\")","v":""},null,null,null,null,null,null,null,{"$f":"O1916","v":"non"}]
[null,null,null,null,null,null,{"$f":"IFERROR(VLOOKUP(E1918,'Tarif de base'!D:E,2,FALSE)*F1918,\"\")","v":""},null,null,null,null,null,null,null,"non"]
[null,null,null,null,null,null,{"$f":"IFERROR(VLOOKUP(E1919,'Tarif de base'!D:E,2,FALSE)*F1919,\"\")","v":""},null,null,null,null,null,null,null,"non"]
[null,null,null,null,null,null,{"$f":"IFERROR(VLOOKUP(E1920,'Tarif de base'!D:E,2,FALSE)*F1920,\"\")","v":""},null,null,null,null,null,null,null,"non"]
[null,null,null,null,null,null,{"$f":"SUM(G1915:G1920)","v":0},null,null,null,null,null,null,null,"non"]
[null,null,null,null,null,null,{"$f":"IFERROR(VLOOKUP(E1922,'Tarif de base'!D:E,2,FALSE)*F1922,\"\")","v":""},null,null,null,{"$f":"IFERROR(IF(G1928-H1922-I1922-J1922<>0,\"Attention il manque \"&G1928-H1922-I1922-J1922&\"€\",\"Règlement OK\"),\"Pas de règlement\")","v":"Règlement OK"},null,"non",274,{"$f":"M1922","v":"non"}]
[null,null,null,null,null,null,{"$f":"IFERROR(VLOOKUP(E1923,'Tarif de base'!D:E,2,FALSE)*F1923,\"\")","v":""},null,null,null,null,null,null,null,"non"]
[null,null,null,null,null,null,{"$f":"IFERROR(VLOOKUP(E1924,'Tarif de base'!D:E,2,FALSE)*F1924,\"\")","v":""},null,null,null,null,null,null,null,"non"]
[null,null,null,null,null,null,{"$f":"IFERROR(VLOOKUP(E1925,'Tarif de base'!D:E,2,FALSE)*F1925,\"\")","v":""},null,null,null,null,null,null,null,"non"]
[null,null,null,null,null,null,{"$f":"IFERROR(VLOOKUP(E1926,'Tarif de base'!D:E,2,FALSE)*F1926,\"\")","v":""},null,null,null,null,null,null,null,"non"]
[null,null,null,null,null,null,{"$f":"IFERROR(VLOOKUP(E1927,'Tarif de base'!D:E,2,FALSE)*F1927,\"\")","v":""},null,null,null,null,null,null,null,"non"]
[null,null,null,null,null,null,{"$f":"SUM(G1922:G1927)","v":0},null,null,null,null,null,null,null,"non"]
[null,null,null,null,null,null,{"$f":"IFERROR(VLOOKUP(E1929,'Tarif de base'!D:E,2,FALSE)*F1929,\"\")","v":""},null,null,null,{"$f":"IFERROR(IF(G1935-H1929-I1929-J1929<>0,\"Attention il manque \"&G1935-H1929-I1929-J1929&\"€\",\"Règlement OK\"),\"Pas de règlement\")","v":"Règlement OK"},null,"non",275,{"$f":"M1929","v":"non"}]
[null,null,null,null,null,null,{"$f":"IFERROR(VLOOKUP(E1930,'Tarif de base'!D:E,2,FALSE)*F1930,\"\")","v":""},null,null,null,null,null,null,null,"non"]
[null,null,null,null,null,null,{"$f":"IFERROR(VLOOKUP(E1931,'Tarif de base'!D:E,2,FALSE)*F1931,\"\")","v":""},null,null,null,null,null,null,null,"non"]
[null,null,null,null,null,null,{"$f":"IFERROR(VLOOKUP(E1932,'Tarif de base'!D:E,2,FALSE)*F1932,\"\")","v":""},null,null,null,null,null,null,null,"non"]
[null,null,null,null,null,null,{"$f":"IFERROR(VLOOKUP(E1933,'Tarif de base'!D:E,2,FALSE)*F1933,\"\")","v":""},null,null,null,null,null,null,null,"non"]
[null,null,null,null,null,null,{"$f":"IFERROR(VLOOKUP(E1934,'Tarif de base'!D:E,2,FALSE)*F1934,\"\")","v":""},null,null,null,null,null,null,null,"non"]
[null,null,null,null,null,null,{"$f":"SUM(G1929:G1934)","v":0},null,null,null,null,null,null,null,"non"]
[null,null,null,null,null,null,{"$f":"IFERROR(VLOOKUP(E1936,'Tarif de base'!D:E,2,FALSE)*F1936,\"\")","v":""},null,null,null,{"$f":"IFERROR(IF(G1942-H1936-I1936-J1936<>0,\"Attention il manque \"&G1942-H1936-I1936-J1936&\"€\",\"Règlement OK\"),\"Pas de règlement\")","v":"Règlement OK"},null,"non",276,{"$f":"M1936","v":"non"}]
[null,null,null,null,null,null,{"$f":"IFERROR(VLOOKUP(E1937,'Tarif de base'!D:E,2,FALSE)*F1937,\"\")","v":""},null,null,null,null,null,null,null,"non"]
[null,null,null,null,null,null,{"$f":"IFERROR(VLOOKUP(E1938,'Tarif de base'!D:E,2,FALSE)*F1938,\"\")","v":""},null,null,null,null,null,null,null,"non"]
[null,null,null,null,null,null,{"$f":"IFERROR(VLOOKUP(E1939,'Tarif de base'!D:E,2,FALSE)*F1939,\"\")","v":""},null,null,null,null,null,null,null,"non"]
[null,null,null,null,null,null,{"$f":"IFERROR(VLOOKUP(E1940,'Tarif de base'!D:E,2,FALSE)*F1940,\"\")","v":""},null,null,null,null,null,null,null,"non"]
[null,null,null,null,null,null,{"$f":"IFERROR(VLOOKUP(E1941,'Tarif de base'!D:E,2,FALSE)*F1941,\"\")","v":""},null,null,null,null,null,null,null,"non"]
[null,null,null,null,null,null,{"$f":"SUM(G1936:G1941)","v":0},null,null,null,null,null,null,null,"non"]
[null,null,null,null,null,null,{"$f":"IFERROR(VLOOKUP(E1943,'Tarif de base'!D:E,2,FALSE)*F1943,\"\")","v":""},null,null,null,{"$f":"IFERROR(IF(G1949-H1943-I1943-J1943<>0,\"Attention il manque \"&G1949-H1943-I1943-J1943&\"€\",\"Règlement OK\"),\"Pas de règlement\")","v":"Règlement OK"},null,"non",277,{"$f":"M1943","v":"non"}]
[null,null,null,null,null,null,{"$f":"IFERROR(VLOOKUP(E1944,'Tarif de base'!D:E,2,FALSE)*F1944,\"\")","v":""},null,null,null,null,null,null,null,"non"]
[null,null,null,null,null,null,{"$f":"IFERROR(VLOOKUP(E1945,'Tarif de base'!D:E,2,FALSE)*F1945,\"\")","v":""},null,null,null,null,null,null,null,"non"]
[null,null,null,null,null,null,{"$f":"IFERROR(VLOOKUP(E1946,'Tarif de base'!D:E,2,FALSE)*F1946,\"\")","v":""},null,null,null,null,null,null,null,"non"]
[null,null,null,null,null,null,{"$f":"IFERROR(VLOOKUP(E1947,'Tarif de base'!D:E,2,FALSE)*F1947,\"\")","v":""},null,null,null,null,null,null,null,"non"]
[null,null,null,null,null,null,{"$f":"IFERROR(VLOOKUP(E1948,'Tarif de base'!D:E,2,FALSE)*F1948,\"\")","v":""},null,null,null,null,null,null,null,"non"]
[null,null,null,null,null,null,{"$f":"SUM(G1943:G1948)","v":0},null,null,null,null,null,null,null,"non"]
[null,null,null,null,null,null,{"$f":"IFERROR(VLOOKUP(E1950,'Tarif de base'!D:E,2,FALSE)*F1950,\"\")","v":""},null,null,null,{"$f":"IFERROR(IF(G1956-H1950-I1950-J1950<>0,\"Attention il manque \"&G1956-H1950-I1950-J1950&\"€\",\"Règlement OK\"),\"Pas de règlement\")","v":"Règlement OK"},null,"non",278,{"$f":"M1950","v":"non"}]
[null,null,null,null,null,null,{"$f":"IFERROR(VLOOKUP(E1951,'Tarif de base'!D:E,2,FALSE)*F1951,\"\")","v":""},null,null,null,null,null,null,null,"non"]
[null,null,null,null,null,null,{"$f":"IFERROR(VLOOKUP(E1952,'Tarif de base'!D:E,2,FALSE)*F1952,\"\")","v":""},null,null,null,null,null,null,null,"non"]
[null,null,null,null,null,null,{"$f":"IFERROR(VLOOKUP(E1953,'Tarif de base'!D:E,2,FALSE)*F1953,\"\")","v":""},null,null,null,null,null,null,null,"non"]
[null,null,null,null,null,null,{"$f":"IFERROR(VLOOKUP(E1954,'Tarif de base'!D:E,2,FALSE)*F1954,\"\")","v":""},null,null,null,null,null,null,null,"non"]
[null,null,null,null,null,null,{"$f":"IFERROR(VLOOKUP(E1955,'Tarif de base'!D:E,2,FALSE)*F1955,\"\")","v":""},null,null,null,null,null,null,null,"non"]
[null,null,null,null,null,null,{"$f":"SUM(G1950:G1955)","v":0},null,null,null,null,null,null,null,"non"]
[null,null,null,null,null,null,{"$f":"IFERROR(VLOOKUP(E1957,'Tarif de base'!D:E,2,FALSE)*F1957,\"\")","v":""},null,null,null,{"$f":"IFERROR(IF(G1963-H1957-I1957-J1957<>0,\"Attention il manque \"&G1963-H1957-I1957-J1957&\"€\",\"Règlement OK\"),\"Pas de règlement\")","v":"Règlement OK"},null,"non",279,{"$f":"M1957","v":"non"}]
[null,null,null,null,null,null,{"$f":"IFERROR(VLOOKUP(E1958,'Tarif de base'!D:E,2,FALSE)*F1958,\"\")","v":""},null,null,null,null,null,null,null,"non"]
[null,null,null,null,null,null,{"$f":"IFERROR(VLOOKUP(E1959,'Tarif de base'!D:E,2,FALSE)*F1959,\"\")","v":""},null,null,null,null,null,null,null,"non"]
[null,null,null,null,null,null,{"$f":"IFERROR(VLOOKUP(E1960,'Tarif de base'!D:E,2,FALSE)*F1960,\"\")","v":""},null,null,null,null,null,null,null,"non"]
[null,null,null,null,null,null,{"$f":"IFERROR(VLOOKUP(E1961,'Tarif de base'!D:E,2,FALSE)*F1961,\"\")","v":""},null,null,null,null,null,null,null,"non"]
[null,null,null,null,null,null,{"$f":"IFERROR(VLOOKUP(E1962,'Tarif de base'!D:E,2,FALSE)*F1962,\"\")","v":""},null,null,null,null,null,null,null,"non"]
[null,null,null,null,null,null,{"$f":"SUM(G1957:G1962)","v":0},null,null,null,null,null,null,null,"non"]
[null,null,null,null,null,null,{"$f":"IFERROR(VLOOKUP(E1964,'Tarif de base'!D:E,2,FALSE)*F1964,\"\")","v":""},null,null,null,{"$f":"IFERROR(IF(G1970-H1964-I1964-J1964<>0,\"Attention il manque \"&G1970-H1964-I1964-J1964&\"€\",\"Règlement OK\"),\"Pas de règlement\")","v":"Règlement OK"},null,"non",280,{"$f":"M1964","v":"non"}]
[null,null,null,null,null,null,{"$f":"IFERROR(VLOOKUP(E1965,'Tarif de base'!D:E,2,FALSE)*F1965,\"\")","v":""},null,null,null,null,null,null,null,"non"]
[null,null,null,null,null,null,{"$f":"IFERROR(VLOOKUP(E1966,'Tarif de base'!D:E,2,FALSE)*F1966,\"\")","v":""},null,null,null,null,null,null,null,"non"]
[null,null,null,null,null,null,{"$f":"IFERROR(VLOOKUP(E1967,'Tarif de base'!D:E,2,FALSE)*F1967,\"\")","v":""},null,null,null,null,null,null,null,"non"]
[null,null,null,null,null,null,{"$f":"IFERROR(VLOOKUP(E1968,'Tarif de base'!D:E,2,FALSE)*F1968,\"\")","v":""},null,null,null,null,null,null,null,"non"]
[null,null,null,null,null,null,{"$f":"IFERROR(VLOOKUP(E1969,'Tarif de base'!D:E,2,FALSE)*F1969,\"\")","v":""},null,null,null,null,null,null,null,"non"]
[null,null,null,null,null,null,{"$f":"SUM(G1964:G1969)","v":0},null,null,null,null,null,null,null,"non"]
[null,null,null,null,null,null,{"$f":"IFERROR(VLOOKUP(E1971,'Tarif de base'!D:E,2,FALSE)*F1971,\"\")","v":""},null,null,null,{"$f":"IFERROR(IF(G1977-H1971-I1971-J1971<>0,\"Attention il manque \"&G1977-H1971-I1971-J1971&\"€\",\"Règlement OK\"),\"Pas de règlement\")","v":"Règlement OK"},null,"non",281,{"$f":"M1971","v":"non"}]
[null,null,null,null,null,null,{"$f":"IFERROR(VLOOKUP(E1972,'Tarif de base'!D:E,2,FALSE)*F1972,\"\")","v":""},null,null,null,null,null,null,null,"non"]
[null,null,null,null,null,null,{"$f":"IFERROR(VLOOKUP(E1973,'Tarif de base'!D:E,2,FALSE)*F1973,\"\")","v":""},null,null,null,null,null,null,null,"non"]
[null,null,null,null,null,null,{"$f":"IFERROR(VLOOKUP(E1974,'Tarif de base'!D:E,2,FALSE)*F1974,\"\")","v":""},null,null,null,null,null,null,null,"non"]
[null,null,null,null,null,null,{"$f":"IFERROR(VLOOKUP(E1975,'Tarif de base'!D:E,2,FALSE)*F1975,\"\")","v":""},null,null,null,null,null,null,null,"non"]
[null,null,null,null,null,null,{"$f":"IFERROR(VLOOKUP(E1976,'Tarif de base'!D:E,2,FALSE)*F1976,\"\")","v":""},null,null,null,null,null,null,null,"non"]
[null,null,null,null,null,null,{"$f":"SUM(G1971:G1976)","v":0},null,null,null,null,null,null,null,"non"]
[null,null,null,null,null,null,{"$f":"IFERROR(VLOOKUP(E1978,'Tarif de base'!D:E,2,FALSE)*F1978,\"\")","v":""},null,null,null,{"$f":"IFERROR(IF(G1984-H1978-I1978-J1978<>0,\"Attention il manque \"&G1984-H1978-I1978-J1978&\"€\",\"Règlement OK\"),\"Pas de règlement\")","v":"Règlement OK"},null,"non",282,{"$f":"M1978","v":"non"}]
[null,null,null,null,null,null,{"$f":"IFERROR(VLOOKUP(E1979,'Tarif de base'!D:E,2,FALSE)*F1979,\"\")","v":""},null,null,null,null,null,null,null,"non"]
[null,null,null,null,null,null,{"$f":"IFERROR(VLOOKUP(E1980,'Tarif de base'!D:E,2,FALSE)*F1980,\"\")","v":""},null,null,null,null,null,null,null,"non"]
[null,null,null,null,null,null,{"$f":"IFERROR(VLOOKUP(E1981,'Tarif de base'!D:E,2,FALSE)*F1981,\"\")","v":""},null,null,null,null,null,null,null,{"$f":"O1980","v":"non"}]
[null,null,null,null,null,null,{"$f":"IFERROR(VLOOKUP(E1982,'Tarif de base'!D:E,2,FALSE)*F1982,\"\")","v":""},null,null,null,null,null,null,null,"non"]
[null,null,null,null,null,null,{"$f":"IFERROR(VLOOKUP(E1983,'Tarif de base'!D:E,2,FALSE)*F1983,\"\")","v":""},null,null,null,null,null,null,null,"non"]
[null,null,null,null,null,null,{"$f":"SUM(G1978:G1983)","v":0},null,null,null,null,null,null,null,"non"]
[null,null,null,null,null,null,{"$f":"IFERROR(VLOOKUP(E1985,'Tarif de base'!D:E,2,FALSE)*F1985,\"\")","v":""},null,null,null,{"$f":"IFERROR(IF(G1991-H1985-I1985-J1985<>0,\"Attention il manque \"&G1991-H1985-I1985-J1985&\"€\",\"Règlement OK\"),\"Pas de règlement\")","v":"Règlement OK"},null,"non",283,{"$f":"M1985","v":"non"}]
[null,null,null,null,null,null,{"$f":"IFERROR(VLOOKUP(E1986,'Tarif de base'!D:E,2,FALSE)*F1986,\"\")","v":""},null,null,null,null,null,null,null,"non"]
[null,null,null,null,null,null,{"$f":"IFERROR(VLOOKUP(E1987,'Tarif de base'!D:E,2,FALSE)*F1987,\"\")","v":""},null,null,null,null,null,null,null,"non"]
[null,null,null,null,null,null,{"$f":"IFERROR(VLOOKUP(E1988,'Tarif de base'!D:E,2,FALSE)*F1988,\"\")","v":""},null,null,null,null,null,null,null,"non"]
[null,null,null,null,null,null,{"$f":"IFERROR(VLOOKUP(E1989,'Tarif de base'!D:E,2,FALSE)*F1989,\"\")","v":""},null,null,null,null,null,null,null,"non"]
[null,null,null,null,null,null,{"$f":"IFERROR(VLOOKUP(E1990,'Tarif de base'!D:E,2,FALSE)*F1990,\"\")","v":""},null,null,null,null,null,null,null,"non"]
[null,null,null,null,null,null,{"$f":"SUM(G1985:G1990)","v":0},null,null,null,null,null,null,null,"non"]
[null,null,null,null,null,null,{"$f":"IFERROR(VLOOKUP(E1992,'Tarif de base'!D:E,2,FALSE)*F1992,\"\")","v":""},null,null,null,{"$f":"IFERROR(IF(G1998-H1992-I1992-J1992<>0,\"Attention il manque \"&G1998-H1992-I1992-J1992&\"€\",\"Règlement OK\"),\"Pas de règlement\")","v":"Règlement OK"},null,"non",284,{"$f":"M1992","v":"non"}]
[null,null,null,null,null,null,{"$f":"IFERROR(VLOOKUP(E1993,'Tarif de base'!D:E,2,FALSE)*F1993,\"\")","v":""},null,null,null,null,null,null,null,"non"]
[null,null,null,null,null,null,{"$f":"IFERROR(VLOOKUP(E1994,'Tarif de base'!D:E,2,FALSE)*F1994,\"\")","v":""},null,null,null,null,null,null,null,"non"]
[null,null,null,null,null,null,{"$f":"IFERROR(VLOOKUP(E1995,'Tarif de base'!D:E,2,FALSE)*F1995,\"\")","v":""},null,null,null,null,null,null,null,"non"]
[null,null,null,null,null,null,{"$f":"IFERROR(VLOOKUP(E1996,'Tarif de base'!D:E,2,FALSE)*F1996,\"\")","v":""},null,null,null,null,null,null,null,"non"]
[null,null,null,null,null,null,{"$f":"IFERROR(VLOOKUP(E1997,'Tarif de base'!D:E,2,FALSE)*F1997,\"\")","v":""},null,null,null,null,null,null,null,"non"]
[null,null,null,null,null,null,{"$f":"SUM(G1992:G1997)","v":0},null,null,null,null,null,null,null,"non"]
[null,null,null,null,null,null,{"$f":"IFERROR(VLOOKUP(E1999,'Tarif de base'!D:E,2,FALSE)*F1999,\"\")","v":""},null,null,null,{"$f":"IFERROR(IF(G2005-H1999-I1999-J1999<>0,\"Attention il manque \"&G2005-H1999-I1999-J1999&\"€\",\"Règlement OK\"),\"Pas de règlement\")","v":"Règlement OK"},null,"non",285,{"$f":"M1999","v":"non"}]
[null,null,null,null,null,null,{"$f":"IFERROR(VLOOKUP(E2000,'Tarif de base'!D:E,2,FALSE)*F2000,\"\")","v":""},null,null,null,null,null,null,null,"non"]
[null,null,null,null,null,null,{"$f":"IFERROR(VLOOKUP(E2001,'Tarif de base'!D:E,2,FALSE)*F2001,\"\")","v":""},null,null,null,null,null,null,null,"non"]
[null,null,null,null,null,null,{"$f":"IFERROR(VLOOKUP(E2002,'Tarif de base'!D:E,2,FALSE)*F2002,\"\")","v":""},null,null,null,null,null,null,null,"non"]
[null,null,null,null,null,null,{"$f":"IFERROR(VLOOKUP(E2003,'Tarif de base'!D:E,2,FALSE)*F2003,\"\")","v":""},null,null,null,null,null,null,null,"non"]
[null,null,null,null,null,null,{"$f":"IFERROR(VLOOKUP(E2004,'Tarif de base'!D:E,2,FALSE)*F2004,\"\")","v":""},null,null,null,null,null,null,null,"non"]
[null,null,null,null,null,null,{"$f":"SUM(G1999:G2004)","v":0},null,null,null,null,null,null,null,"non"]
[null,null,null,null,null,null,{"$f":"IFERROR(VLOOKUP(E2006,'Tarif de base'!D:E,2,FALSE)*F2006,\"\")","v":""},null,null,null,{"$f":"IFERROR(IF(G2012-H2006-I2006-J2006<>0,\"Attention il manque \"&G2012-H2006-I2006-J2006&\"€\",\"Règlement OK\"),\"Pas de règlement\")","v":"Règlement OK"},null,"non",286,{"$f":"M2006","v":"non"}]
[null,null,null,null,null,null,{"$f":"IFERROR(VLOOKUP(E2007,'Tarif de base'!D:E,2,FALSE)*F2007,\"\")","v":""},null,null,null,null,null,null,null,{"$f":"O2006","v":"non"}]
[null,null,null,null,null,null,{"$f":"IFERROR(VLOOKUP(E2008,'Tarif de base'!D:E,2,FALSE)*F2008,\"\")","v":""},null,null,null,null,null,null,null,"non"]
[null,null,null,null,null,null,{"$f":"IFERROR(VLOOKUP(E2009,'Tarif de base'!D:E,2,FALSE)*F2009,\"\")","v":""},null,null,null,null,null,null,null,"non"]
[null,null,null,null,null,null,{"$f":"IFERROR(VLOOKUP(E2010,'Tarif de base'!D:E,2,FALSE)*F2010,\"\")","v":""},null,null,null,null,null,null,null,"non"]
[null,null,null,null,null,null,{"$f":"IFERROR(VLOOKUP(E2011,'Tarif de base'!D:E,2,FALSE)*F2011,\"\")","v":""},null,null,null,null,null,null,null,"non"]
[null,null,null,null,null,null,{"$f":"SUM(G2006:G2011)","v":0},null,null,null,null,null,null,null,"non"]
[null,null,null,null,null,null,{"$f":"IFERROR(VLOOKUP(E2013,'Tarif de base'!D:E,2,FALSE)*F2013,\"\")","v":""},null,null,null,{"$f":"IFERROR(IF(G2019-H2013-I2013-J2013<>0,\"Attention il manque \"&G2019-H2013-I2013-J2013&\"€\",\"Règlement OK\"),\"Pas de règlement\")","v":"Règlement OK"},null,"non",287,{"$f":"M2013","v":"non"}]
[null,null,null,null,null,null,{"$f":"IFERROR(VLOOKUP(E2014,'Tarif de base'!D:E,2,FALSE)*F2014,\"\")","v":""},null,null,null,null,null,null,null,"non"]
[null,null,null,null,null,null,{"$f":"IFERROR(VLOOKUP(E2015,'Tarif de base'!D:E,2,FALSE)*F2015,\"\")","v":""},null,null,null,null,null,null,null,"non"]
[null,null,null,null,null,null,{"$f":"IFERROR(VLOOKUP(E2016,'Tarif de base'!D:E,2,FALSE)*F2016,\"\")","v":""},null,null,null,null,null,null,null,"non"]
[null,null,null,null,null,null,{"$f":"IFERROR(VLOOKUP(E2017,'Tarif de base'!D:E,2,FALSE)*F2017,\"\")","v":""},null,null,null,null,null,null,null,"non"]
[null,null,null,null,null,null,{"$f":"IFERROR(VLOOKUP(E2018,'Tarif de base'!D:E,2,FALSE)*F2018,\"\")","v":""},null,null,null,null,null,null,null,"non"]
[null,null,null,null,null,null,{"$f":"SUM(G2013:G2018)","v":0},null,null,null,null,null,null,null,"non"]
[null,null,null,null,null,null,{"$f":"IFERROR(VLOOKUP(E2020,'Tarif de base'!D:E,2,FALSE)*F2020,\"\")","v":""},null,null,null,{"$f":"IFERROR(IF(G2026-H2020-I2020-J2020<>0,\"Attention il manque \"&G2026-H2020-I2020-J2020&\"€\",\"Règlement OK\"),\"Pas de règlement\")","v":"Règlement OK"},null,"non",288,{"$f":"M2020","v":"non"}]
[null,null,null,null,null,null,{"$f":"IFERROR(VLOOKUP(E2021,'Tarif de base'!D:E,2,FALSE)*F2021,\"\")","v":""},null,null,null,null,null,null,null,"non"]
[null,null,null,null,null,null,{"$f":"IFERROR(VLOOKUP(E2022,'Tarif de base'!D:E,2,FALSE)*F2022,\"\")","v":""},null,null,null,null,null,null,null,"non"]
[null,null,null,null,null,null,{"$f":"IFERROR(VLOOKUP(E2023,'Tarif de base'!D:E,2,FALSE)*F2023,\"\")","v":""},null,null,null,null,null,null,null,"non"]
[null,null,null,null,null,null,{"$f":"IFERROR(VLOOKUP(E2024,'Tarif de base'!D:E,2,FALSE)*F2024,\"\")","v":""},null,null,null,null,null,null,null,"non"]
[null,null,null,null,null,null,{"$f":"IFERROR(VLOOKUP(E2025,'Tarif de base'!D:E,2,FALSE)*F2025,\"\")","v":""},null,null,null,null,null,null,null,"non"]
[null,null,null,null,null,null,{"$f":"SUM(G2020:G2025)","v":0},null,null,null,null,null,null,null,"non"]
[null,null,null,null,null,null,{"$f":"IFERROR(VLOOKUP(E2027,'Tarif de base'!D:E,2,FALSE)*F2027,\"\")","v":""},null,null,null,{"$f":"IFERROR(IF(G2033-H2027-I2027-J2027<>0,\"Attention il manque \"&G2033-H2027-I2027-J2027&\"€\",\"Règlement OK\"),\"Pas de règlement\")","v":"Règlement OK"},null,"non",289,{"$f":"M2027","v":"non"}]
[null,null,null,null,null,null,{"$f":"IFERROR(VLOOKUP(E2028,'Tarif de base'!D:E,2,FALSE)*F2028,\"\")","v":""},null,null,null,null,null,null,null,"non"]
[null,null,null,null,null,null,{"$f":"IFERROR(VLOOKUP(E2029,'Tarif de base'!D:E,2,FALSE)*F2029,\"\")","v":""},null,null,null,null,null,null,null,"non"]
[null,null,null,null,null,null,{"$f":"IFERROR(VLOOKUP(E2030,'Tarif de base'!D:E,2,FALSE)*F2030,\"\")","v":""},null,null,null,null,null,null,null,"non"]
[null,null,null,null,null,null,{"$f":"IFERROR(VLOOKUP(E2031,'Tarif de base'!D:E,2,FALSE)*F2031,\"\")","v":""},null,null,null,null,null,null,null,"non"]
[null,null,null,null,null,null,{"$f":"IFERROR(VLOOKUP(E2032,'Tarif de base'!D:E,2,FALSE)*F2032,\"\")","v":""},null,null,null,null,null,null,null,"non"]
[null,null,null,null,null,null,{"$f":"SUM(G2027:G2032)","v":0},null,null,null,null,null,null,null,"non"]
[null,null,null,null,null,null,{"$f":"IFERROR(VLOOKUP(E2034,'Tarif de base'!D:E,2,FALSE)*F2034,\"\")","v":""},null,null,null,{"$f":"IFERROR(IF(G2040-H2034-I2034-J2034<>0,\"Attention il manque \"&G2040-H2034-I2034-J2034&\"€\",\"Règlement OK\"),\"Pas de règlement\")","v":"Règlement OK"},null,"non",290,{"$f":"M2034","v":"non"}]
[null,null,null,null,null,null,{"$f":"IFERROR(VLOOKUP(E2035,'Tarif de base'!D:E,2,FALSE)*F2035,\"\")","v":""},null,null,null,null,null,null,null,{"$f":"O2034","v":"non"}]
[null,null,null,null,null,null,{"$f":"IFERROR(VLOOKUP(E2036,'Tarif de base'!D:E,2,FALSE)*F2036,\"\")","v":""},null,null,null,null,null,null,null,{"$f":"O2035","v":"non"}]
[null,null,null,null,null,null,{"$f":"IFERROR(VLOOKUP(E2037,'Tarif de base'!D:E,2,FALSE)*F2037,\"\")","v":""},null,null,null,null,null,null,null,"non"]
[null,null,null,null,null,null,{"$f":"IFERROR(VLOOKUP(E2038,'Tarif de base'!D:E,2,FALSE)*F2038,\"\")","v":""},null,null,null,null,null,null,null,"non"]
[null,null,null,null,null,null,{"$f":"IFERROR(VLOOKUP(E2039,'Tarif de base'!D:E,2,FALSE)*F2039,\"\")","v":""},null,null,null,null,null,null,null,"non"]
[null,null,null,null,null,null,{"$f":"SUM(G2034:G2039)","v":0},null,null,null,null,null,null,null,"non"]
[null,null,null,null,null,null,{"$f":"IFERROR(VLOOKUP(E2041,'Tarif de base'!D:E,2,FALSE)*F2041,\"\")","v":""},null,null,null,{"$f":"IFERROR(IF(G2047-H2041-I2041-J2041<>0,\"Attention il manque \"&G2047-H2041-I2041-J2041&\"€\",\"Règlement OK\"),\"Pas de règlement\")","v":"Règlement OK"},null,"non",291,{"$f":"M2041","v":"non"}]
[null,null,null,null,null,null,{"$f":"IFERROR(VLOOKUP(E2042,'Tarif de base'!D:E,2,FALSE)*F2042,\"\")","v":""},null,null,null,null,null,null,null,{"$f":"O2041","v":"non"}]
[null,null,null,null,null,null,{"$f":"IFERROR(VLOOKUP(E2043,'Tarif de base'!D:E,2,FALSE)*F2043,\"\")","v":""},null,null,null,null,null,null,null,{"$f":"O2042","v":"non"}]
[null,null,null,null,null,null,{"$f":"IFERROR(VLOOKUP(E2044,'Tarif de base'!D:E,2,FALSE)*F2044,\"\")","v":""},null,null,null,null,null,null,null,"non"]
[null,null,null,null,null,null,{"$f":"IFERROR(VLOOKUP(E2045,'Tarif de base'!D:E,2,FALSE)*F2045,\"\")","v":""},null,null,null,null,null,null,null,"non"]
[null,null,null,null,null,null,{"$f":"IFERROR(VLOOKUP(E2046,'Tarif de base'!D:E,2,FALSE)*F2046,\"\")","v":""},null,null,null,null,null,null,null,"non"]
[null,null,null,null,null,null,{"$f":"SUM(G2041:G2046)","v":0},null,null,null,null,null,null,null,"non"]
[null,null,null,null,null,null,{"$f":"IFERROR(VLOOKUP(E2048,'Tarif de base'!D:E,2,FALSE)*F2048,\"\")","v":""},null,null,null,{"$f":"IFERROR(IF(G2054-H2048-I2048-J2048<>0,\"Attention il manque \"&G2054-H2048-I2048-J2048&\"€\",\"Règlement OK\"),\"Pas de règlement\")","v":"Règlement OK"},null,"non",292,{"$f":"M2048","v":"non"}]
[null,null,null,null,null,null,{"$f":"IFERROR(VLOOKUP(E2049,'Tarif de base'!D:E,2,FALSE)*F2049,\"\")","v":""},null,null,null,null,null,null,null,"non"]
[null,null,null,null,null,null,{"$f":"IFERROR(VLOOKUP(E2050,'Tarif de base'!D:E,2,FALSE)*F2050,\"\")","v":""},null,null,null,null,null,null,null,"non"]
[null,null,null,null,null,null,{"$f":"IFERROR(VLOOKUP(E2051,'Tarif de base'!D:E,2,FALSE)*F2051,\"\")","v":""},null,null,null,null,null,null,null,"non"]
[null,null,null,null,null,null,{"$f":"IFERROR(VLOOKUP(E2052,'Tarif de base'!D:E,2,FALSE)*F2052,\"\")","v":""},null,null,null,null,null,null,null,"non"]
[null,null,null,null,null,null,{"$f":"IFERROR(VLOOKUP(E2053,'Tarif de base'!D:E,2,FALSE)*F2053,\"\")","v":""},null,null,null,null,null,null,null,"non"]
[null,null,null,null,null,null,{"$f":"SUM(G2048:G2053)","v":0},null,null,null,null,null,null,null,"non"]
[null,null,null,null,null,null,{"$f":"IFERROR(VLOOKUP(E2055,'Tarif de base'!D:E,2,FALSE)*F2055,\"\")","v":""},null,null,null,{"$f":"IFERROR(IF(G2061-H2055-I2055-J2055<>0,\"Attention il manque \"&G2061-H2055-I2055-J2055&\"€\",\"Règlement OK\"),\"Pas de règlement\")","v":"Règlement OK"},null,"non",293,{"$f":"M2055","v":"non"}]
[null,null,null,null,null,null,{"$f":"IFERROR(VLOOKUP(E2056,'Tarif de base'!D:E,2,FALSE)*F2056,\"\")","v":""},null,null,null,null,null,null,null,"non"]
[null,null,null,null,null,null,{"$f":"IFERROR(VLOOKUP(E2057,'Tarif de base'!D:E,2,FALSE)*F2057,\"\")","v":""},null,null,null,null,null,null,null,"non"]
[null,null,null,null,null,null,{"$f":"IFERROR(VLOOKUP(E2058,'Tarif de base'!D:E,2,FALSE)*F2058,\"\")","v":""},null,null,null,null,null,null,null,"non"]
[null,null,null,null,null,null,{"$f":"IFERROR(VLOOKUP(E2059,'Tarif de base'!D:E,2,FALSE)*F2059,\"\")","v":""},null,null,null,null,null,null,null,"non"]
[null,null,null,null,null,null,{"$f":"IFERROR(VLOOKUP(E2060,'Tarif de base'!D:E,2,FALSE)*F2060,\"\")","v":""},null,null,null,null,null,null,null,"non"]
[null,null,null,null,null,null,{"$f":"SUM(G2055:G2060)","v":0},null,null,null,null,null,null,null,"non"]
[null,null,null,null,null,null,{"$f":"IFERROR(VLOOKUP(E2062,'Tarif de base'!D:E,2,FALSE)*F2062,\"\")","v":""},null,null,null,{"$f":"IFERROR(IF(G2068-H2062-I2062-J2062<>0,\"Attention il manque \"&G2068-H2062-I2062-J2062&\"€\",\"Règlement OK\"),\"Pas de règlement\")","v":"Règlement OK"},null,"non",294,{"$f":"M2062","v":"non"}]
[null,null,null,null,null,null,{"$f":"IFERROR(VLOOKUP(E2063,'Tarif de base'!D:E,2,FALSE)*F2063,\"\")","v":""},null,null,null,null,null,null,null,"non"]
[null,null,null,null,null,null,{"$f":"IFERROR(VLOOKUP(E2064,'Tarif de base'!D:E,2,FALSE)*F2064,\"\")","v":""},null,null,null,null,null,null,null,"non"]
[null,null,null,null,null,null,{"$f":"IFERROR(VLOOKUP(E2065,'Tarif de base'!D:E,2,FALSE)*F2065,\"\")","v":""},null,null,null,null,null,null,null,"non"]
[null,null,null,null,null,null,{"$f":"IFERROR(VLOOKUP(E2066,'Tarif de base'!D:E,2,FALSE)*F2066,\"\")","v":""},null,null,null,null,null,null,null,"non"]
[null,null,null,null,null,null,{"$f":"IFERROR(VLOOKUP(E2067,'Tarif de base'!D:E,2,FALSE)*F2067,\"\")","v":""},null,null,null,null,null,null,null,"non"]
[null,null,null,null,null,null,{"$f":"SUM(G2062:G2067)","v":0},null,null,null,null,null,null,null,"non"]
[null,null,null,null,null,null,{"$f":"IFERROR(VLOOKUP(E2069,'Tarif de base'!D:E,2,FALSE)*F2069,\"\")","v":""},null,null,null,{"$f":"IFERROR(IF(G2075-H2069-I2069-J2069<>0,\"Attention il manque \"&G2075-H2069-I2069-J2069&\"€\",\"Règlement OK\"),\"Pas de règlement\")","v":"Règlement OK"},null,"non",295,{"$f":"M2069","v":"non"}]
[null,null,null,null,null,null,{"$f":"IFERROR(VLOOKUP(E2070,'Tarif de base'!D:E,2,FALSE)*F2070,\"\")","v":""},null,null,null,null,null,null,null,"non"]
[null,null,null,null,null,null,{"$f":"IFERROR(VLOOKUP(E2071,'Tarif de base'!D:E,2,FALSE)*F2071,\"\")","v":""},null,null,null,null,null,null,null,"non"]
[null,null,null,null,null,null,{"$f":"IFERROR(VLOOKUP(E2072,'Tarif de base'!D:E,2,FALSE)*F2072,\"\")","v":""},null,null,null,null,null,null,null,"non"]
[null,null,null,null,null,null,{"$f":"IFERROR(VLOOKUP(E2073,'Tarif de base'!D:E,2,FALSE)*F2073,\"\")","v":""},null,null,null,null,null,null,null,"non"]
[null,null,null,null,null,null,{"$f":"IFERROR(VLOOKUP(E2074,'Tarif de base'!D:E,2,FALSE)*F2074,\"\")","v":""},null,null,null,null,null,null,null,"non"]
[null,null,null,null,null,null,{"$f":"SUM(G2069:G2074)","v":0},null,null,null,null,null,null,null,"non"]
[null,null,null,null,null,null,{"$f":"IFERROR(VLOOKUP(E2076,'Tarif de base'!D:E,2,FALSE)*F2076,\"\")","v":""},null,null,null,{"$f":"IFERROR(IF(G2082-H2076-I2076-J2076<>0,\"Attention il manque \"&G2082-H2076-I2076-J2076&\"€\",\"Règlement OK\"),\"Pas de règlement\")","v":"Règlement OK"},null,"non",296,{"$f":"M2076","v":"non"}]
[null,null,null,null,null,null,{"$f":"IFERROR(VLOOKUP(E2077,'Tarif de base'!D:E,2,FALSE)*F2077,\"\")","v":""},null,null,null,null,null,null,null,"non"]
[null,null,null,null,null,null,{"$f":"IFERROR(VLOOKUP(E2078,'Tarif de base'!D:E,2,FALSE)*F2078,\"\")","v":""},null,null,null,null,null,null,null,"non"]
[null,null,null,null,null,null,{"$f":"IFERROR(VLOOKUP(E2079,'Tarif de base'!D:E,2,FALSE)*F2079,\"\")","v":""},null,null,null,null,null,null,null,"non"]
[null,null,null,null,null,null,{"$f":"IFERROR(VLOOKUP(E2080,'Tarif de base'!D:E,2,FALSE)*F2080,\"\")","v":""},null,null,null,null,null,null,null,"non"]
[null,null,null,null,null,null,{"$f":"IFERROR(VLOOKUP(E2081,'Tarif de base'!D:E,2,FALSE)*F2081,\"\")","v":""},null,null,null,null,null,null,null,"non"]
[null,null,null,null,null,null,{"$f":"SUM(G2076:G2081)","v":0},null,null,null,null,null,null,null,"non"]
[null,null,null,null,null,null,{"$f":"IFERROR(VLOOKUP(E2083,'Tarif de base'!D:E,2,FALSE)*F2083,\"\")","v":""},null,null,null,{"$f":"IFERROR(IF(G2089-H2083-I2083-J2083<>0,\"Attention il manque \"&G2089-H2083-I2083-J2083&\"€\",\"Règlement OK\"),\"Pas de règlement\")","v":"Règlement OK"},null,"non",297,{"$f":"M2083","v":"non"}]
[null,null,null,null,null,null,{"$f":"IFERROR(VLOOKUP(E2084,'Tarif de base'!D:E,2,FALSE)*F2084,\"\")","v":""},null,null,null,null,null,null,null,"non"]
[null,null,null,null,null,null,{"$f":"IFERROR(VLOOKUP(E2085,'Tarif de base'!D:E,2,FALSE)*F2085,\"\")","v":""},null,null,null,null,null,null,null,"non"]
[null,null,null,null,null,null,{"$f":"IFERROR(VLOOKUP(E2086,'Tarif de base'!D:E,2,FALSE)*F2086,\"\")","v":""},null,null,null,null,null,null,null,"non"]
[null,null,null,null,null,null,{"$f":"IFERROR(VLOOKUP(E2087,'Tarif de base'!D:E,2,FALSE)*F2087,\"\")","v":""},null,null,null,null,null,null,null,"non"]
[null,null,null,null,null,null,{"$f":"IFERROR(VLOOKUP(E2088,'Tarif de base'!D:E,2,FALSE)*F2088,\"\")","v":""},null,null,null,null,null,null,null,"non"]
[null,null,null,null,null,null,{"$f":"SUM(G2083:G2088)","v":0},null,null,null,null,null,null,null,"non"]
[null,null,null,null,null,null,{"$f":"IFERROR(VLOOKUP(E2090,'Tarif de base'!D:E,2,FALSE)*F2090,\"\")","v":""},null,null,null,{"$f":"IFERROR(IF(G2096-H2090-I2090-J2090<>0,\"Attention il manque \"&G2096-H2090-I2090-J2090&\"€\",\"Règlement OK\"),\"Pas de règlement\")","v":"Règlement OK"},null,"non",298,{"$f":"M2090","v":"non"}]
[null,null,null,null,null,null,{"$f":"IFERROR(VLOOKUP(E2091,'Tarif de base'!D:E,2,FALSE)*F2091,\"\")","v":""},null,null,null,null,null,null,null,"non"]
[null,null,null,null,null,null,{"$f":"IFERROR(VLOOKUP(E2092,'Tarif de base'!D:E,2,FALSE)*F2092,\"\")","v":""},null,null,null,null,null,null,null,"non"]
[null,null,null,null,null,null,{"$f":"IFERROR(VLOOKUP(E2093,'Tarif de base'!D:E,2,FALSE)*F2093,\"\")","v":""},null,null,null,null,null,null,null,"non"]
[null,null,null,null,null,null,{"$f":"IFERROR(VLOOKUP(E2094,'Tarif de base'!D:E,2,FALSE)*F2094,\"\")","v":""},null,null,null,null,null,null,null,"non"]
[null,null,null,null,null,null,{"$f":"IFERROR(VLOOKUP(E2095,'Tarif de base'!D:E,2,FALSE)*F2095,\"\")","v":""},null,null,null,null,null,null,null,"non"]
[null,null,null,null,null,null,{"$f":"SUM(G2090:G2095)","v":0},null,null,null,null,null,null,null,"non"]
[null,null,null,null,null,null,{"$f":"IFERROR(VLOOKUP(E2097,'Tarif de base'!D:E,2,FALSE)*F2097,\"\")","v":""},null,null,null,{"$f":"IFERROR(IF(G2103-H2097-I2097-J2097<>0,\"Attention il manque \"&G2103-H2097-I2097-J2097&\"€\",\"Règlement OK\"),\"Pas de règlement\")","v":"Règlement OK"},null,"non",299,{"$f":"M2097","v":"non"}]
[null,null,null,null,null,null,{"$f":"IFERROR(VLOOKUP(E2098,'Tarif de base'!D:E,2,FALSE)*F2098,\"\")","v":""},null,null,null,null,null,null,null,"non"]
[null,null,null,null,null,null,{"$f":"IFERROR(VLOOKUP(E2099,'Tarif de base'!D:E,2,FALSE)*F2099,\"\")","v":""},null,null,null,null,null,null,null,"non"]
[null,null,null,null,null,null,{"$f":"IFERROR(VLOOKUP(E2100,'Tarif de base'!D:E,2,FALSE)*F2100,\"\")","v":""},null,null,null,null,null,null,null,"non"]
[null,null,null,null,null,null,{"$f":"IFERROR(VLOOKUP(E2101,'Tarif de base'!D:E,2,FALSE)*F2101,\"\")","v":""},null,null,null,null,null,null,null,"non"]
[null,null,null,null,null,null,{"$f":"IFERROR(VLOOKUP(E2102,'Tarif de base'!D:E,2,FALSE)*F2102,\"\")","v":""},null,null,null,null,null,null,null,"non"]
[null,null,null,null,null,null,{"$f":"SUM(G2097:G2102)","v":0},null,null,null,null,null,null,null,"non"]
[null,null,null,null,null,null,{"$f":"IFERROR(VLOOKUP(E2104,'Tarif de base'!D:E,2,FALSE)*F2104,\"\")","v":""},null,null,null,{"$f":"IFERROR(IF(G2110-H2104-I2104-J2104<>0,\"Attention il manque \"&G2110-H2104-I2104-J2104&\"€\",\"Règlement OK\"),\"Pas de règlement\")","v":"Règlement OK"},null,"non",300,{"$f":"M2104","v":"non"}]
[null,null,null,null,null,null,{"$f":"IFERROR(VLOOKUP(E2105,'Tarif de base'!D:E,2,FALSE)*F2105,\"\")","v":""},null,null,null,null,null,null,null,"non"]
[null,null,null,null,null,null,{"$f":"IFERROR(VLOOKUP(E2106,'Tarif de base'!D:E,2,FALSE)*F2106,\"\")","v":""},null,null,null,null,null,null,null,"non"]
[null,null,null,null,null,null,{"$f":"IFERROR(VLOOKUP(E2107,'Tarif de base'!D:E,2,FALSE)*F2107,\"\")","v":""},null,null,null,null,null,null,null,{"$f":"O2106","v":"non"}]
[null,null,null,null,null,null,{"$f":"IFERROR(VLOOKUP(E2108,'Tarif de base'!D:E,2,FALSE)*F2108,\"\")","v":""},null,null,null,null,null,null,null,"non"]
[null,null,null,null,null,null,{"$f":"IFERROR(VLOOKUP(E2109,'Tarif de base'!D:E,2,FALSE)*F2109,\"\")","v":""},null,null,null,null,null,null,null,"non"]
[null,null,null,null,null,null,{"$f":"SUM(G2104:G2109)","v":0},null,null,null,null,null,null,null,"non"]
[null,null,null,null,null,null,{"$f":"IFERROR(VLOOKUP(E2111,'Tarif de base'!D:E,2,FALSE)*F2111,\"\")","v":""},null,null,null,{"$f":"IFERROR(IF(G2117-H2111-I2111-J2111<>0,\"Attention il manque \"&G2117-H2111-I2111-J2111&\"€\",\"Règlement OK\"),\"Pas de règlement\")","v":"Règlement OK"},null,"non",301,{"$f":"M2111","v":"non"}]
[null,null,null,null,null,null,{"$f":"IFERROR(VLOOKUP(E2112,'Tarif de base'!D:E,2,FALSE)*F2112,\"\")","v":""},null,null,null,null,null,null,null,"non"]
[null,null,null,null,null,null,{"$f":"IFERROR(VLOOKUP(E2113,'Tarif de base'!D:E,2,FALSE)*F2113,\"\")","v":""},null,null,null,null,null,null,null,"non"]
[null,null,null,null,null,null,{"$f":"IFERROR(VLOOKUP(E2114,'Tarif de base'!D:E,2,FALSE)*F2114,\"\")","v":""},null,null,null,null,null,null,null,"non"]
[null,null,null,null,null,null,{"$f":"IFERROR(VLOOKUP(E2115,'Tarif de base'!D:E,2,FALSE)*F2115,\"\")","v":""},null,null,null,null,null,null,null,"non"]
[null,null,null,null,null,null,{"$f":"IFERROR(VLOOKUP(E2116,'Tarif de base'!D:E,2,FALSE)*F2116,\"\")","v":""},null,null,null,null,null,null,null,"non"]
[null,null,null,null,null,null,{"$f":"SUM(G2111:G2116)","v":0},null,null,null,null,null,null,null,"non"]
[null,null,null,null,null,null,{"$f":"IFERROR(VLOOKUP(E2118,'Tarif de base'!D:E,2,FALSE)*F2118,\"\")","v":""},null,null,null,{"$f":"IFERROR(IF(G2124-H2118-I2118-J2118<>0,\"Attention il manque \"&G2124-H2118-I2118-J2118&\"€\",\"Règlement OK\"),\"Pas de règlement\")","v":"Règlement OK"},null,"non",302,{"$f":"M2118","v":"non"}]
[null,null,null,null,null,null,{"$f":"IFERROR(VLOOKUP(E2119,'Tarif de base'!D:E,2,FALSE)*F2119,\"\")","v":""},null,null,null,null,null,null,null,"non"]
[null,null,null,null,null,null,{"$f":"IFERROR(VLOOKUP(E2120,'Tarif de base'!D:E,2,FALSE)*F2120,\"\")","v":""},null,null,null,null,null,null,null,"non"]
[null,null,null,null,null,null,{"$f":"IFERROR(VLOOKUP(E2121,'Tarif de base'!D:E,2,FALSE)*F2121,\"\")","v":""},null,null,null,null,null,null,null,"non"]
[null,null,null,null,null,null,{"$f":"IFERROR(VLOOKUP(E2122,'Tarif de base'!D:E,2,FALSE)*F2122,\"\")","v":""},null,null,null,null,null,null,null,"non"]
[null,null,null,null,null,null,{"$f":"IFERROR(VLOOKUP(E2123,'Tarif de base'!D:E,2,FALSE)*F2123,\"\")","v":""},null,null,null,null,null,null,null,"non"]
[null,null,null,null,null,null,{"$f":"SUM(G2118:G2123)","v":0},null,null,null,null,null,null,null,"non"]
[null,null,null,null,null,null,{"$f":"IFERROR(VLOOKUP(E2125,'Tarif de base'!D:E,2,FALSE)*F2125,\"\")","v":""},null,null,null,{"$f":"IFERROR(IF(G2131-H2125-I2125-J2125<>0,\"Attention il manque \"&G2131-H2125-I2125-J2125&\"€\",\"Règlement OK\"),\"Pas de règlement\")","v":"Règlement OK"},null,"non",303,{"$f":"M2125","v":"non"}]
[null,null,null,null,null,null,{"$f":"IFERROR(VLOOKUP(E2126,'Tarif de base'!D:E,2,FALSE)*F2126,\"\")","v":""},null,null,null,null,null,null,null,"non"]
[null,null,null,null,null,null,{"$f":"IFERROR(VLOOKUP(E2127,'Tarif de base'!D:E,2,FALSE)*F2127,\"\")","v":""},null,null,null,null,null,null,null,"non"]
[null,null,null,null,null,null,{"$f":"IFERROR(VLOOKUP(E2128,'Tarif de base'!D:E,2,FALSE)*F2128,\"\")","v":""},null,null,null,null,null,null,null,"non"]
[null,null,null,null,null,null,{"$f":"IFERROR(VLOOKUP(E2129,'Tarif de base'!D:E,2,FALSE)*F2129,\"\")","v":""},null,null,null,null,null,null,null,"non"]
[null,null,null,null,null,null,{"$f":"IFERROR(VLOOKUP(E2130,'Tarif de base'!D:E,2,FALSE)*F2130,\"\")","v":""},null,null,null,null,null,null,null,"non"]
[null,null,null,null,null,null,{"$f":"SUM(G2125:G2130)","v":0},null,null,null,null,null,null,null,"non"]
[null,null,null,null,null,null,{"$f":"IFERROR(VLOOKUP(E2132,'Tarif de base'!D:E,2,FALSE)*F2132,\"\")","v":""},null,null,null,{"$f":"IFERROR(IF(G2138-H2132-I2132-J2132<>0,\"Attention il manque \"&G2138-H2132-I2132-J2132&\"€\",\"Règlement OK\"),\"Pas de règlement\")","v":"Règlement OK"},null,"non",304,{"$f":"M2132","v":"non"}]
[null,null,null,null,null,null,{"$f":"IFERROR(VLOOKUP(E2133,'Tarif de base'!D:E,2,FALSE)*F2133,\"\")","v":""},null,null,null,null,null,null,null,{"$f":"O2132","v":"non"}]
[null,null,null,null,null,null,{"$f":"IFERROR(VLOOKUP(E2134,'Tarif de base'!D:E,2,FALSE)*F2134,\"\")","v":""},null,null,null,null,null,null,null,"non"]
[null,null,null,null,null,null,{"$f":"IFERROR(VLOOKUP(E2135,'Tarif de base'!D:E,2,FALSE)*F2135,\"\")","v":""},null,null,null,null,null,null,null,"non"]
[null,null,null,null,null,null,{"$f":"IFERROR(VLOOKUP(E2136,'Tarif de base'!D:E,2,FALSE)*F2136,\"\")","v":""},null,null,null,null,null,null,null,"non"]
[null,null,null,null,null,null,{"$f":"IFERROR(VLOOKUP(E2137,'Tarif de base'!D:E,2,FALSE)*F2137,\"\")","v":""},null,null,null,null,null,null,null,"non"]
[null,null,null,null,null,null,{"$f":"SUM(G2132:G2137)","v":0},null,null,null,null,null,null,null,"non"]
[null,null,null,null,null,null,{"$f":"IFERROR(VLOOKUP(E2139,'Tarif de base'!D:E,2,FALSE)*F2139,\"\")","v":""},null,null,null,{"$f":"IFERROR(IF(G2145-H2139-I2139-J2139<>0,\"Attention il manque \"&G2145-H2139-I2139-J2139&\"€\",\"Règlement OK\"),\"Pas de règlement\")","v":"Règlement OK"},null,"non",305,{"$f":"M2139","v":"non"}]
[null,null,null,null,null,null,{"$f":"IFERROR(VLOOKUP(E2140,'Tarif de base'!D:E,2,FALSE)*F2140,\"\")","v":""},null,null,null,null,null,null,null,"non"]
[null,null,null,null,null,null,{"$f":"IFERROR(VLOOKUP(E2141,'Tarif de base'!D:E,2,FALSE)*F2141,\"\")","v":""},null,null,null,null,null,null,null,"non"]
[null,null,null,null,null,null,{"$f":"IFERROR(VLOOKUP(E2142,'Tarif de base'!D:E,2,FALSE)*F2142,\"\")","v":""},null,null,null,null,null,null,null,"non"]
[null,null,null,null,null,null,{"$f":"IFERROR(VLOOKUP(E2143,'Tarif de base'!D:E,2,FALSE)*F2143,\"\")","v":""},null,null,null,null,null,null,null,"non"]
[null,null,null,null,null,null,{"$f":"IFERROR(VLOOKUP(E2144,'Tarif de base'!D:E,2,FALSE)*F2144,\"\")","v":""},null,null,null,null,null,null,null,"non"]
[null,null,null,null,null,null,{"$f":"SUM(G2139:G2144)","v":0},null,null,null,null,null,null,null,"non"]
[null,null,null,null,null,null,{"$f":"IFERROR(VLOOKUP(E2146,'Tarif de base'!D:E,2,FALSE)*F2146,\"\")","v":""},null,null,null,{"$f":"IFERROR(IF(G2152-H2146-I2146-J2146<>0,\"Attention il manque \"&G2152-H2146-I2146-J2146&\"€\",\"Règlement OK\"),\"Pas de règlement\")","v":"Règlement OK"},null,"non",306,{"$f":"M2146","v":"non"}]
[null,null,null,null,null,null,{"$f":"IFERROR(VLOOKUP(E2147,'Tarif de base'!D:E,2,FALSE)*F2147,\"\")","v":""},null,null,null,null,null,null,null,"non"]
[null,null,null,null,null,null,{"$f":"IFERROR(VLOOKUP(E2148,'Tarif de base'!D:E,2,FALSE)*F2148,\"\")","v":""},null,null,null,null,null,null,null,"non"]
[null,null,null,null,null,null,{"$f":"IFERROR(VLOOKUP(E2149,'Tarif de base'!D:E,2,FALSE)*F2149,\"\")","v":""},null,null,null,null,null,null,null,"non"]
[null,null,null,null,null,null,{"$f":"IFERROR(VLOOKUP(E2150,'Tarif de base'!D:E,2,FALSE)*F2150,\"\")","v":""},null,null,null,null,null,null,null,"non"]
[null,null,null,null,null,null,{"$f":"IFERROR(VLOOKUP(E2151,'Tarif de base'!D:E,2,FALSE)*F2151,\"\")","v":""},null,null,null,null,null,null,null,"non"]
[null,null,null,null,null,null,{"$f":"SUM(G2146:G2151)","v":0},null,null,null,null,null,null,null,"non"]
[null,null,null,null,null,null,{"$f":"IFERROR(VLOOKUP(E2153,'Tarif de base'!D:E,2,FALSE)*F2153,\"\")","v":""},null,null,null,{"$f":"IFERROR(IF(G2159-H2153-I2153-J2153<>0,\"Attention il manque \"&G2159-H2153-I2153-J2153&\"€\",\"Règlement OK\"),\"Pas de règlement\")","v":"Règlement OK"},null,"non",307,{"$f":"M2153","v":"non"}]
[null,null,null,null,null,null,{"$f":"IFERROR(VLOOKUP(E2154,'Tarif de base'!D:E,2,FALSE)*F2154,\"\")","v":""},null,null,null,null,null,null,null,"non"]
[null,null,null,null,null,null,{"$f":"IFERROR(VLOOKUP(E2155,'Tarif de base'!D:E,2,FALSE)*F2155,\"\")","v":""},null,null,null,null,null,null,null,"non"]
[null,null,null,null,null,null,{"$f":"IFERROR(VLOOKUP(E2156,'Tarif de base'!D:E,2,FALSE)*F2156,\"\")","v":""},null,null,null,null,null,null,null,"non"]
[null,null,null,null,null,null,{"$f":"IFERROR(VLOOKUP(E2157,'Tarif de base'!D:E,2,FALSE)*F2157,\"\")","v":""},null,null,null,null,null,null,null,"non"]
[null,null,null,null,null,null,{"$f":"IFERROR(VLOOKUP(E2158,'Tarif de base'!D:E,2,FALSE)*F2158,\"\")","v":""},null,null,null,null,null,null,null,"non"]
[null,null,null,null,null,null,{"$f":"SUM(G2153:G2158)","v":0},null,null,null,null,null,null,null,"non"]
[null,null,null,null,null,null,{"$f":"IFERROR(VLOOKUP(E2160,'Tarif de base'!D:E,2,FALSE)*F2160,\"\")","v":""},null,null,null,{"$f":"IFERROR(IF(G2166-H2160-I2160-J2160<>0,\"Attention il manque \"&G2166-H2160-I2160-J2160&\"€\",\"Règlement OK\"),\"Pas de règlement\")","v":"Règlement OK"},null,"non",308,{"$f":"M2160","v":"non"}]
[null,null,null,null,null,null,{"$f":"IFERROR(VLOOKUP(E2161,'Tarif de base'!D:E,2,FALSE)*F2161,\"\")","v":""},null,null,null,null,null,null,null,{"$f":"O2160","v":"non"}]
[null,null,null,null,null,null,{"$f":"IFERROR(VLOOKUP(E2162,'Tarif de base'!D:E,2,FALSE)*F2162,\"\")","v":""},null,null,null,null,null,null,null,{"$f":"O2161","v":"non"}]
[null,null,null,null,null,null,{"$f":"IFERROR(VLOOKUP(E2163,'Tarif de base'!D:E,2,FALSE)*F2163,\"\")","v":""},null,null,null,null,null,null,null,"non"]
[null,null,null,null,null,null,{"$f":"IFERROR(VLOOKUP(E2164,'Tarif de base'!D:E,2,FALSE)*F2164,\"\")","v":""},null,null,null,null,null,null,null,"non"]
[null,null,null,null,null,null,{"$f":"IFERROR(VLOOKUP(E2165,'Tarif de base'!D:E,2,FALSE)*F2165,\"\")","v":""},null,null,null,null,null,null,null,"non"]
[null,null,null,null,null,null,{"$f":"SUM(G2160:G2165)","v":0},null,null,null,null,null,null,null,"non"]
[null,null,null,null,null,null,{"$f":"IFERROR(VLOOKUP(E2167,'Tarif de base'!D:E,2,FALSE)*F2167,\"\")","v":""},null,null,null,{"$f":"IFERROR(IF(G2173-H2167-I2167-J2167<>0,\"Attention il manque \"&G2173-H2167-I2167-J2167&\"€\",\"Règlement OK\"),\"Pas de règlement\")","v":"Règlement OK"},null,"non",309,{"$f":"M2167","v":"non"}]
[null,null,null,null,null,null,{"$f":"IFERROR(VLOOKUP(E2168,'Tarif de base'!D:E,2,FALSE)*F2168,\"\")","v":""},null,null,null,null,null,null,null,{"$f":"O2167","v":"non"}]
[null,null,null,null,null,null,{"$f":"IFERROR(VLOOKUP(E2169,'Tarif de base'!D:E,2,FALSE)*F2169,\"\")","v":""},null,null,null,null,null,null,null,{"$f":"O2168","v":"non"}]
[null,null,null,null,null,null,{"$f":"IFERROR(VLOOKUP(E2170,'Tarif de base'!D:E,2,FALSE)*F2170,\"\")","v":""},null,null,null,null,null,null,null,"non"]
[null,null,null,null,null,null,{"$f":"IFERROR(VLOOKUP(E2171,'Tarif de base'!D:E,2,FALSE)*F2171,\"\")","v":""},null,null,null,null,null,null,null,"non"]
[null,null,null,null,null,null,{"$f":"IFERROR(VLOOKUP(E2172,'Tarif de base'!D:E,2,FALSE)*F2172,\"\")","v":""},null,null,null,null,null,null,null,"non"]
[null,null,null,null,null,null,{"$f":"SUM(G2167:G2172)","v":0},null,null,null,null,null,null,null,"non"]
[null,null,null,null,null,null,{"$f":"IFERROR(VLOOKUP(E2174,'Tarif de base'!D:E,2,FALSE)*F2174,\"\")","v":""},null,null,null,{"$f":"IFERROR(IF(G2180-H2174-I2174-J2174<>0,\"Attention il manque \"&G2180-H2174-I2174-J2174&\"€\",\"Règlement OK\"),\"Pas de règlement\")","v":"Règlement OK"},null,"non",310,{"$f":"M2174","v":"non"}]
[null,null,null,null,null,null,{"$f":"IFERROR(VLOOKUP(E2175,'Tarif de base'!D:E,2,FALSE)*F2175,\"\")","v":""},null,null,null,null,null,null,null,"non"]
[null,null,null,null,null,null,{"$f":"IFERROR(VLOOKUP(E2176,'Tarif de base'!D:E,2,FALSE)*F2176,\"\")","v":""},null,null,null,null,null,null,null,"non"]
[null,null,null,null,null,null,{"$f":"IFERROR(VLOOKUP(E2177,'Tarif de base'!D:E,2,FALSE)*F2177,\"\")","v":""},null,null,null,null,null,null,null,"non"]
[null,null,null,null,null,null,{"$f":"IFERROR(VLOOKUP(E2178,'Tarif de base'!D:E,2,FALSE)*F2178,\"\")","v":""},null,null,null,null,null,null,null,"non"]
[null,null,null,null,null,null,{"$f":"IFERROR(VLOOKUP(E2179,'Tarif de base'!D:E,2,FALSE)*F2179,\"\")","v":""},null,null,null,null,null,null,null,"non"]
[null,null,null,null,null,null,{"$f":"SUM(G2174:G2179)","v":0},null,null,null,null,null,null,null,"non"]
[null,null,null,null,null,null,{"$f":"IFERROR(VLOOKUP(E2181,'Tarif de base'!D:E,2,FALSE)*F2181,\"\")","v":""},null,null,null,{"$f":"IFERROR(IF(G2187-H2181-I2181-J2181<>0,\"Attention il manque \"&G2187-H2181-I2181-J2181&\"€\",\"Règlement OK\"),\"Pas de règlement\")","v":"Règlement OK"},null,"non",311,{"$f":"M2181","v":"non"}]
[null,null,null,null,null,null,{"$f":"IFERROR(VLOOKUP(E2182,'Tarif de base'!D:E,2,FALSE)*F2182,\"\")","v":""},null,null,null,null,null,null,null,"non"]
[null,null,null,null,null,null,{"$f":"IFERROR(VLOOKUP(E2183,'Tarif de base'!D:E,2,FALSE)*F2183,\"\")","v":""},null,null,null,null,null,null,null,"non"]
[null,null,null,null,null,null,{"$f":"IFERROR(VLOOKUP(E2184,'Tarif de base'!D:E,2,FALSE)*F2184,\"\")","v":""},null,null,null,null,null,null,null,"non"]
[null,null,null,null,null,null,{"$f":"IFERROR(VLOOKUP(E2185,'Tarif de base'!D:E,2,FALSE)*F2185,\"\")","v":""},null,null,null,null,null,null,null,"non"]
[null,null,null,null,null,null,{"$f":"IFERROR(VLOOKUP(E2186,'Tarif de base'!D:E,2,FALSE)*F2186,\"\")","v":""},null,null,null,null,null,null,null,"non"]
[null,null,null,null,null,null,{"$f":"SUM(G2181:G2186)","v":0},null,null,null,null,null,null,null,"non"]
[null,null,null,null,null,null,{"$f":"IFERROR(VLOOKUP(E2188,'Tarif de base'!D:E,2,FALSE)*F2188,\"\")","v":""},null,null,null,{"$f":"IFERROR(IF(G2194-H2188-I2188-J2188<>0,\"Attention il manque \"&G2194-H2188-I2188-J2188&\"€\",\"Règlement OK\"),\"Pas de règlement\")","v":"Règlement OK"},null,"non",312,{"$f":"M2188","v":"non"}]
[null,null,null,null,null,null,{"$f":"IFERROR(VLOOKUP(E2189,'Tarif de base'!D:E,2,FALSE)*F2189,\"\")","v":""},null,null,null,null,null,null,null,"non"]
[null,null,null,null,null,null,{"$f":"IFERROR(VLOOKUP(E2190,'Tarif de base'!D:E,2,FALSE)*F2190,\"\")","v":""},null,null,null,null,null,null,null,"non"]
[null,null,null,null,null,null,{"$f":"IFERROR(VLOOKUP(E2191,'Tarif de base'!D:E,2,FALSE)*F2191,\"\")","v":""},null,null,null,null,null,null,null,"non"]
[null,null,null,null,null,null,{"$f":"IFERROR(VLOOKUP(E2192,'Tarif de base'!D:E,2,FALSE)*F2192,\"\")","v":""},null,null,null,null,null,null,null,"non"]
[null,null,null,null,null,null,{"$f":"IFERROR(VLOOKUP(E2193,'Tarif de base'!D:E,2,FALSE)*F2193,\"\")","v":""},null,null,null,null,null,null,null,"non"]
[null,null,null,null,null,null,{"$f":"SUM(G2188:G2193)","v":0},null,null,null,null,null,null,null,"non"]
[null,null,null,null,null,null,{"$f":"IFERROR(VLOOKUP(E2195,'Tarif de base'!D:E,2,FALSE)*F2195,\"\")","v":""},null,null,null,{"$f":"IFERROR(IF(G2201-H2195-I2195-J2195<>0,\"Attention il manque \"&G2201-H2195-I2195-J2195&\"€\",\"Règlement OK\"),\"Pas de règlement\")","v":"Règlement OK"},null,"non",313,{"$f":"M2195","v":"non"}]
[null,null,null,null,null,null,{"$f":"IFERROR(VLOOKUP(E2196,'Tarif de base'!D:E,2,FALSE)*F2196,\"\")","v":""},null,null,null,null,null,null,null,"non"]
[null,null,null,null,null,null,{"$f":"IFERROR(VLOOKUP(E2197,'Tarif de base'!D:E,2,FALSE)*F2197,\"\")","v":""},null,null,null,null,null,null,null,"non"]
[null,null,null,null,null,null,{"$f":"IFERROR(VLOOKUP(E2198,'Tarif de base'!D:E,2,FALSE)*F2198,\"\")","v":""},null,null,null,null,null,null,null,"non"]
[null,null,null,null,null,null,{"$f":"IFERROR(VLOOKUP(E2199,'Tarif de base'!D:E,2,FALSE)*F2199,\"\")","v":""},null,null,null,null,null,null,null,"non"]
[null,null,null,null,null,null,{"$f":"IFERROR(VLOOKUP(E2200,'Tarif de base'!D:E,2,FALSE)*F2200,\"\")","v":""},null,null,null,null,null,null,null,"non"]
[null,null,null,null,null,null,{"$f":"SUM(G2195:G2200)","v":0},null,null,null,null,null,null,null,"non"]
[null,null,null,null,null,null,{"$f":"IFERROR(VLOOKUP(E2202,'Tarif de base'!D:E,2,FALSE)*F2202,\"\")","v":""},null,null,null,{"$f":"IFERROR(IF(G2208-H2202-I2202-J2202<>0,\"Attention il manque \"&G2208-H2202-I2202-J2202&\"€\",\"Règlement OK\"),\"Pas de règlement\")","v":"Règlement OK"},null,"non",314,{"$f":"M2202","v":"non"}]
[null,null,null,null,null,null,{"$f":"IFERROR(VLOOKUP(E2203,'Tarif de base'!D:E,2,FALSE)*F2203,\"\")","v":""},null,null,null,null,null,null,null,"non"]
[null,null,null,null,null,null,{"$f":"IFERROR(VLOOKUP(E2204,'Tarif de base'!D:E,2,FALSE)*F2204,\"\")","v":""},null,null,null,null,null,null,null,"non"]
[null,null,null,null,null,null,{"$f":"IFERROR(VLOOKUP(E2205,'Tarif de base'!D:E,2,FALSE)*F2205,\"\")","v":""},null,null,null,null,null,null,null,"non"]
[null,null,null,null,null,null,{"$f":"IFERROR(VLOOKUP(E2206,'Tarif de base'!D:E,2,FALSE)*F2206,\"\")","v":""},null,null,null,null,null,null,null,"non"]
[null,null,null,null,null,null,{"$f":"IFERROR(VLOOKUP(E2207,'Tarif de base'!D:E,2,FALSE)*F2207,\"\")","v":""},null,null,null,null,null,null,null,"non"]
[null,null,null,null,null,null,{"$f":"SUM(G2202:G2207)","v":0},null,null,null,null,null,null,null,"non"]
[null,null,null,null,null,null,{"$f":"IFERROR(VLOOKUP(E2209,'Tarif de base'!D:E,2,FALSE)*F2209,\"\")","v":""},null,null,null,{"$f":"IFERROR(IF(G2215-H2209-I2209-J2209<>0,\"Attention il manque \"&G2215-H2209-I2209-J2209&\"€\",\"Règlement OK\"),\"Pas de règlement\")","v":"Règlement OK"},null,"non",315,{"$f":"M2209","v":"non"}]
[null,null,null,null,null,null,{"$f":"IFERROR(VLOOKUP(E2210,'Tarif de base'!D:E,2,FALSE)*F2210,\"\")","v":""},null,null,null,null,null,null,null,"non"]
[null,null,null,null,null,null,{"$f":"IFERROR(VLOOKUP(E2211,'Tarif de base'!D:E,2,FALSE)*F2211,\"\")","v":""},null,null,null,null,null,null,null,"non"]
[null,null,null,null,null,null,{"$f":"IFERROR(VLOOKUP(E2212,'Tarif de base'!D:E,2,FALSE)*F2212,\"\")","v":""},null,null,null,null,null,null,null,"non"]
[null,null,null,null,null,null,{"$f":"IFERROR(VLOOKUP(E2213,'Tarif de base'!D:E,2,FALSE)*F2213,\"\")","v":""},null,null,null,null,null,null,null,"non"]
[null,null,null,null,null,null,{"$f":"IFERROR(VLOOKUP(E2214,'Tarif de base'!D:E,2,FALSE)*F2214,\"\")","v":""},null,null,null,null,null,null,null,"non"]
[null,null,null,null,null,null,{"$f":"SUM(G2209:G2214)","v":0},null,null,null,null,null,null,null,"non"]
[null,null,null,null,null,null,{"$f":"IFERROR(VLOOKUP(E2216,'Tarif de base'!D:E,2,FALSE)*F2216,\"\")","v":""},null,null,null,{"$f":"IFERROR(IF(G2222-H2216-I2216-J2216<>0,\"Attention il manque \"&G2222-H2216-I2216-J2216&\"€\",\"Règlement OK\"),\"Pas de règlement\")","v":"Règlement OK"},null,"non",316,{"$f":"M2216","v":"non"}]
[null,null,null,null,null,null,{"$f":"IFERROR(VLOOKUP(E2217,'Tarif de base'!D:E,2,FALSE)*F2217,\"\")","v":""},null,null,null,null,null,null,null,"non"]
[null,null,null,null,null,null,{"$f":"IFERROR(VLOOKUP(E2218,'Tarif de base'!D:E,2,FALSE)*F2218,\"\")","v":""},null,null,null,null,null,null,null,"non"]
[null,null,null,null,null,null,{"$f":"IFERROR(VLOOKUP(E2219,'Tarif de base'!D:E,2,FALSE)*F2219,\"\")","v":""},null,null,null,null,null,null,null,"non"]
[null,null,null,null,null,null,{"$f":"IFERROR(VLOOKUP(E2220,'Tarif de base'!D:E,2,FALSE)*F2220,\"\")","v":""},null,null,null,null,null,null,null,"non"]
[null,null,null,null,null,null,{"$f":"IFERROR(VLOOKUP(E2221,'Tarif de base'!D:E,2,FALSE)*F2221,\"\")","v":""},null,null,null,null,null,null,null,"non"]
[null,null,null,null,null,null,{"$f":"SUM(G2216:G2221)","v":0},null,null,null,null,null,null,null,"non"]
[null,null,null,null,null,null,{"$f":"IFERROR(VLOOKUP(E2223,'Tarif de base'!D:E,2,FALSE)*F2223,\"\")","v":""},null,null,null,{"$f":"IFERROR(IF(G2229-H2223-I2223-J2223<>0,\"Attention il manque \"&G2229-H2223-I2223-J2223&\"€\",\"Règlement OK\"),\"Pas de règlement\")","v":"Règlement OK"},null,"non",317,{"$f":"M2223","v":"non"}]
[null,null,null,null,null,null,{"$f":"IFERROR(VLOOKUP(E2224,'Tarif de base'!D:E,2,FALSE)*F2224,\"\")","v":""},null,null,null,null,null,null,null,"non"]
[null,null,null,null,null,null,{"$f":"IFERROR(VLOOKUP(E2225,'Tarif de base'!D:E,2,FALSE)*F2225,\"\")","v":""},null,null,null,null,null,null,null,"non"]
[null,null,null,null,null,null,{"$f":"IFERROR(VLOOKUP(E2226,'Tarif de base'!D:E,2,FALSE)*F2226,\"\")","v":""},null,null,null,null,null,null,null,"non"]
[null,null,null,null,null,null,{"$f":"IFERROR(VLOOKUP(E2227,'Tarif de base'!D:E,2,FALSE)*F2227,\"\")","v":""},null,null,null,null,null,null,null,"non"]
[null,null,null,null,null,null,{"$f":"IFERROR(VLOOKUP(E2228,'Tarif de base'!D:E,2,FALSE)*F2228,\"\")","v":""},null,null,null,null,null,null,null,"non"]
[null,null,null,null,null,null,{"$f":"SUM(G2223:G2228)","v":0},null,null,null,null,null,null,null,"non"]
[null,null,null,null,null,null,{"$f":"IFERROR(VLOOKUP(E2230,'Tarif de base'!D:E,2,FALSE)*F2230,\"\")","v":""},null,null,null,{"$f":"IFERROR(IF(G2236-H2230-I2230-J2230<>0,\"Attention il manque \"&G2236-H2230-I2230-J2230&\"€\",\"Règlement OK\"),\"Pas de règlement\")","v":"Règlement OK"},null,"non",318,{"$f":"M2230","v":"non"}]
[null,null,null,null,null,null,{"$f":"IFERROR(VLOOKUP(E2231,'Tarif de base'!D:E,2,FALSE)*F2231,\"\")","v":""},null,null,null,null,null,null,null,"non"]
[null,null,null,null,null,null,{"$f":"IFERROR(VLOOKUP(E2232,'Tarif de base'!D:E,2,FALSE)*F2232,\"\")","v":""},null,null,null,null,null,null,null,"non"]
[null,null,null,null,null,null,{"$f":"IFERROR(VLOOKUP(E2233,'Tarif de base'!D:E,2,FALSE)*F2233,\"\")","v":""},null,null,null,null,null,null,null,{"$f":"O2232","v":"non"}]
[null,null,null,null,null,null,{"$f":"IFERROR(VLOOKUP(E2234,'Tarif de base'!D:E,2,FALSE)*F2234,\"\")","v":""},null,null,null,null,null,null,null,"non"]
[null,null,null,null,null,null,{"$f":"IFERROR(VLOOKUP(E2235,'Tarif de base'!D:E,2,FALSE)*F2235,\"\")","v":""},null,null,null,null,null,null,null,"non"]
[null,null,null,null,null,null,{"$f":"SUM(G2230:G2235)","v":0},null,null,null,null,null,null,null,"non"]
[null,null,null,null,null,null,{"$f":"IFERROR(VLOOKUP(E2237,'Tarif de base'!D:E,2,FALSE)*F2237,\"\")","v":""},null,null,null,{"$f":"IFERROR(IF(G2243-H2237-I2237-J2237<>0,\"Attention il manque \"&G2243-H2237-I2237-J2237&\"€\",\"Règlement OK\"),\"Pas de règlement\")","v":"Règlement OK"},null,"non",319,{"$f":"M2237","v":"non"}]
[null,null,null,null,null,null,{"$f":"IFERROR(VLOOKUP(E2238,'Tarif de base'!D:E,2,FALSE)*F2238,\"\")","v":""},null,null,null,null,null,null,null,"non"]
[null,null,null,null,null,null,{"$f":"IFERROR(VLOOKUP(E2239,'Tarif de base'!D:E,2,FALSE)*F2239,\"\")","v":""},null,null,null,null,null,null,null,"non"]
[null,null,null,null,null,null,{"$f":"IFERROR(VLOOKUP(E2240,'Tarif de base'!D:E,2,FALSE)*F2240,\"\")","v":""},null,null,null,null,null,null,null,"non"]
[null,null,null,null,null,null,{"$f":"IFERROR(VLOOKUP(E2241,'Tarif de base'!D:E,2,FALSE)*F2241,\"\")","v":""},null,null,null,null,null,null,null,"non"]
[null,null,null,null,null,null,{"$f":"IFERROR(VLOOKUP(E2242,'Tarif de base'!D:E,2,FALSE)*F2242,\"\")","v":""},null,null,null,null,null,null,null,"non"]
[null,null,null,null,null,null,{"$f":"SUM(G2237:G2242)","v":0},null,null,null,null,null,null,null,"non"]
[null,null,null,null,null,null,{"$f":"IFERROR(VLOOKUP(E2244,'Tarif de base'!D:E,2,FALSE)*F2244,\"\")","v":""},null,null,null,{"$f":"IFERROR(IF(G2250-H2244-I2244-J2244<>0,\"Attention il manque \"&G2250-H2244-I2244-J2244&\"€\",\"Règlement OK\"),\"Pas de règlement\")","v":"Règlement OK"},null,"non",320,{"$f":"M2244","v":"non"}]
[null,null,null,null,null,null,{"$f":"IFERROR(VLOOKUP(E2245,'Tarif de base'!D:E,2,FALSE)*F2245,\"\")","v":""},null,null,null,null,null,null,null,"non"]
[null,null,null,null,null,null,{"$f":"IFERROR(VLOOKUP(E2246,'Tarif de base'!D:E,2,FALSE)*F2246,\"\")","v":""},null,null,null,null,null,null,null,"non"]
[null,null,null,null,null,null,{"$f":"IFERROR(VLOOKUP(E2247,'Tarif de base'!D:E,2,FALSE)*F2247,\"\")","v":""},null,null,null,null,null,null,null,"non"]
[null,null,null,null,null,null,{"$f":"IFERROR(VLOOKUP(E2248,'Tarif de base'!D:E,2,FALSE)*F2248,\"\")","v":""},null,null,null,null,null,null,null,"non"]
[null,null,null,null,null,null,{"$f":"IFERROR(VLOOKUP(E2249,'Tarif de base'!D:E,2,FALSE)*F2249,\"\")","v":""},null,null,null,null,null,null,null,"non"]
[null,null,null,null,null,null,{"$f":"SUM(G2244:G2249)","v":0},null,null,null,null,null,null,null,"non"]

{"sheet":"Dégustation Cadeau Casse Perso","index":1,"n_rows":875,"n_cols":9,"rows_kept":875,"cut":false,"hidden":false,"merged":[[2,2,2,8]]}
[]
[]
[null,null,"Information Stock"]
[]
[]
[null,null,"Date","Mois","Action","Client","Désignation","Quantité","Comptabilisé ?"]
[null,null,null,null,null,null,null,null,"non"]
[null,null,null,null,null,null,null,null,"non"]
[null,null,null,null,null,null,null,null,"non"]
[null,null,null,"",null,null,null,null,"non"]
[null,null,null,"",null,null,null,null,"non"]
[null,null,null,"",null,null,null,null,"non"]
[null,null,null,"",null,null,null,null,"non"]
[null,null,null,"",null,null,null,null,"non"]
[null,null,null,"",null,null,null,null,"non"]
[null,null,null,"",null,null,null,null,"non"]
[null,null,null,"",null,null,null,null,"non"]
[null,null,null,"",null,null,null,null,"non"]
[null,null,null,"",null,null,null,null,"non"]
[null,null,null,"",null,null,null,null,"non"]
[null,null,null,"",null,null,null,null,"non"]
[null,null,null,"",null,null,null,null,"non"]
[null,null,null,"",null,null,null,null,"non"]
[null,null,null,"",null,null,null,null,"non"]
[null,null,null,"",null,null,null,null,"non"]
[null,null,null,"",null,null,null,null,"non"]
[null,null,null,"",null,null,null,null,"non"]
[null,null,null,"",null,null,null,null,"non"]
[null,null,null,"",null,null,null,null,"non"]
[null,null,null,"",null,null,null,null,"non"]
[null,null,null,"",null,null,null,null,"non"]
[null,null,null,"",null,null,null,null,"non"]
[null,null,null,"",null,null,null,null,"non"]
[null,null,null,"",null,null,null,null,"non"]
[null,null,null,"",null,null,null,null,"non"]
[null,null,null,"",null,null,null,null,"non"]
[null,null,null,"",null,null,null,null,"non"]
[null,null,null,"",null,null,null,null,"non"]
[null,null,null,"",null,null,null,null,"non"]
[null,null,null,"",null,null,null,null,"non"]
[null,null,null,"",null,null,null,null,"non"]
[null,null,null,"",null,null,null,null,"non"]
[null,null,null,"",null,null,null,null,"non"]
[null,null,null,"",null,null,null,null,"non"]
[null,null,null,"",null,null,null,null,"non"]
[null,null,null,"",null,null,null,null,"non"]
[null,null,null,"",null,null,null,null,"non"]
[null,null,null,"",null,null,null,null,"non"]
[null,null,null,"",null,null,null,null,"non"]
[null,null,null,"",null,null,null,null,"non"]
[null,null,null,"",null,null,null,null,"non"]
[null,null,null,"",null,null,null,null,"non"]
[null,null,null,"",null,null,null,null,"non"]
[null,null,null,"",null,null,null,null,"non"]
[null,null,null,"",null,null,null,null,"non"]
[null,null,null,"",null,null,null,null,"non"]
[null,null,null,"",null,null,null,null,"non"]
[null,null,null,"",null,null,null,null,"non"]
[null,null,null,"",null,null,null,null,"non"]
[null,null,null,"",null,null,null,null,"non"]
[null,null,null,"",null,null,null,null,"non"]
[null,null,null,"",null,null,null,null,"non"]
[null,null,null,"",null,null,null,null,"non"]
[null,null,null,"",null,null,null,null,"non"]
[null,null,null,"",null,null,null,null,"non"]
[null,null,null,"",null,null,null,null,"non"]
[null,null,null,"",null,null,null,null,"non"]
[null,null,null,"",null,null,null,null,"non"]
[null,null,null,"",null,null,null,null,"non"]
[null,null,null,"",null,null,null,null,"non"]
[null,null,null,"",null,null,null,null,"non"]
[null,null,null,"",null,null,null,null,"non"]
[null,null,null,"",null,null,null,null,"non"]
[null,null,null,"",null,null,null,null,"non"]
[null,null,null,"",null,null,null,null,"non"]
[null,null,null,"",null,null,null,null,"non"]
[null,null,null,"",null,null,null,null,"non"]
[null,null,null,"",null,null,null,null,"non"]
[null,null,null,"",null,null,null,null,"non"]
[null,null,null,"",null,null,null,null,"non"]
[null,null,null,"",null,null,null,null,"non"]
[null,null,null,"",null,null,null,null,"non"]
[null,null,null,"",null,null,null,null,"non"]
[null,null,null,"",null,null,null,null,"non"]
[null,null,null,"",null,null,null,null,"non"]
[null,null,null,"",null,null,null,null,"non"]
[null,null,null,"",null,null,null,null,"non"]
[null,null,null,"",null,null,null,null,"non"]
[null,null,null,"",null,null,null,null,"non"]
[null,null,null,"",null,null,null,null,"non"]
[null,null,null,"",null,null,null,null,"non"]
[null,null,null,"",null,null,null,null,"non"]
[null,null,null,"",null,null,null,null,"non"]
[null,null,null,"",null,null,null,null,"non"]
[null,null,null,"",null,null,null,null,"non"]
[null,null,null,"",null,null,null,null,"non"]
[null,null,null,"",null,null,null,null,"non"]
[null,null,null,"",null,null,null,null,"non"]
[null,null,null,"",null,null,null,null,"non"]
[null,null,null,"",null,null,null,null,"non"]
[null,null,null,"",null,null,null,null,"non"]
[null,null,null,"",null,null,null,null,"non"]
[null,null,null,"",null,null,null,null,"non"]
[null,null,null,"",null,null,null,null,"non"]
[null,null,null,"",null,null,null,null,"non"]
[null,null,null,"",null,null,null,null,"non"]
[null,null,null,"",null,null,null,null,"non"]
[null,null,null,"",null,null,null,null,"non"]
[null,null,null,"",null,null,null,null,"non"]
[null,null,null,"",null,null,null,null,"non"]
[null,null,null,"",null,null,null,null,"non"]
[null,null,null,"",null,null,null,null,"non"]
[null,null,null,"",null,null,null,null,"non"]
[null,null,null,"",null,null,null,null,"non"]
[null,null,null,"",null,null,null,null,"non"]
[null,null,null,"",null,null,null,null,"non"]
[null,null,null,"",null,null,null,null,"non"]
[null,null,null,"",null,null,null,null,"non"]
[null,null,null,"",null,null,null,null,"non"]
[null,null,null,"",null,null,null,null,"non"]
[null,null,null,"",null,null,null,null,"non"]
[null,null,null,"",null,null,null,null,"non"]
[null,null,null,"",null,null,null,null,"non"]
[null,null,null,"",null,null,null,null,"non"]
[null,null,null,"",null,null,null,null,"non"]
[null,null,null,"",null,null,null,null,"non"]
[null,null,null,"",null,null,null,null,"non"]
[null,null,null,"",null,null,null,null,"non"]
[null,null,null,"",null,null,null,null,"non"]
[null,null,null,"",null,null,null,null,"non"]
[null,null,null,"",null,null,null,null,"non"]
[null,null,null,"",null,null,null,null,"non"]
[null,null,null,"",null,null,null,null,"non"]
[null,null,null,"",null,null,null,null,"non"]
[null,null,null,"",null,null,null,null,"non"]
[null,null,null,"",null,null,null,null,"non"]
[null,null,null,"",null,null,null,null,"non"]
[null,null,null,"",null,null,null,null,"non"]
[null,null,null,"",null,null,null,null,"non"]
[null,null,null,"",null,null,null,null,"non"]
[null,null,null,"",null,null,null,null,"non"]
[null,null,null,"",null,null,null,null,"non"]
[null,null,null,"",null,null,null,null,"non"]
[null,null,null,"",null,null,null,null,"non"]
[null,null,null,"",null,null,null,null,"non"]
[null,null,null,"",null,null,null,null,"non"]
[null,null,null,"",null,null,null,null,"non"]
[null,null,null,"",null,null,null,null,"non"]
[null,null,null,"",null,null,null,null,"non"]
[null,null,null,"",null,null,null,null,"non"]
[null,null,null,"",null,null,null,null,"non"]
[null,null,null,"",null,null,null,null,"non"]
[null,null,null,"",null,null,null,null,"non"]
[null,null,null,"",null,null,null,null,"non"]
[null,null,null,"",null,null,null,null,"non"]
[null,null,null,"",null,null,null,null,"non"]
[null,null,null,"",null,null,null,null,"non"]
[null,null,null,"",null,null,null,null,"non"]
[null,null,null,"",null,null,null,null,"non"]
[null,null,null,"",null,null,null,null,"non"]
[null,null,null,"",null,null,null,null,"non"]
[null,null,null,"",null,null,null,null,"non"]
[null,null,null,"",null,null,null,null,"non"]
[null,null,null,"",null,null,null,null,"non"]
[null,null,null,"",null,null,null,null,"non"]
[null,null,null,"",null,null,null,null,"non"]
[null,null,null,"",null,null,null,null,"non"]
[null,null,null,"",null,null,null,null,"non"]
[null,null,null,"",null,null,null,null,"non"]
[null,null,null,"",null,null,null,null,"non"]
[null,null,null,"",null,null,null,null,"non"]
[null,null,null,"",null,null,null,null,"non"]
[null,null,null,"",null,null,null,null,"non"]
[null,null,null,"",null,null,null,null,"non"]
[null,null,null,"",null,null,null,null,"non"]
[null,null,null,"",null,null,null,null,"non"]
[null,null,null,"",null,null,null,null,"non"]
[null,null,null,"",null,null,null,null,"non"]
[null,null,null,"",null,null,null,null,"non"]
[null,null,null,"",null,null,null,null,"non"]
[null,null,null,"",null,null,null,null,"non"]
[null,null,null,"",null,null,null,null,"non"]
[null,null,null,"",null,null,null,null,"non"]
[null,null,null,"",null,null,null,null,"non"]
[null,null,null,"",null,null,null,null,"non"]
[null,null,null,"",null,null,null,null,"non"]
[null,null,null,"",null,null,null,null,"non"]
[null,null,null,"",null,null,null,null,"non"]
[null,null,null,"",null,null,null,null,"non"]
[null,null,null,"",null,null,null,null,"non"]
[null,null,null,"",null,null,null,null,"non"]
[null,null,null,"",null,null,null,null,"non"]
[null,null,null,"",null,null,null,null,"non"]
[null,null,null,"",null,null,null,null,"non"]
[null,null,null,"",null,null,null,null,"non"]
[null,null,null,"",null,null,null,null,"non"]
[null,null,null,"",null,null,null,null,"non"]
[null,null,null,"",null,null,null,null,"non"]
[null,null,null,"",null,null,null,null,"non"]
[null,null,null,"",null,null,null,null,"non"]
[null,null,null,"",null,null,null,null,"non"]
[null,null,null,"",null,null,null,null,"non"]
[null,null,null,"",null,null,null,null,"non"]
[null,null,null,"",null,null,null,null,"non"]
[null,null,null,"",null,null,null,null,"non"]
[null,null,null,"",null,null,null,null,"non"]
[null,null,null,"",null,null,null,null,"non"]
[null,null,null,"",null,null,null,null,"non"]
[null,null,null,"",null,null,null,null,"non"]
[null,null,null,"",null,null,null,null,"non"]
[null,null,null,"",null,null,null,null,"non"]
[null,null,null,"",null,null,null,null,"non"]
[null,null,null,"",null,null,null,null,"non"]
[null,null,null,"",null,null,null,null,"non"]
[null,null,null,"",null,null,null,null,"non"]
[null,null,null,"",null,null,null,null,"non"]
[null,null,null,"",null,null,null,null,"non"]
[null,null,null,"",null,null,null,null,"non"]
[null,null,null,"",null,null,null,null,"non"]
[null,null,null,"",null,null,null,null,"non"]
[null,null,null,"",null,null,null,null,"non"]
[null,null,null,"",null,null,null,null,"non"]
[null,null,null,"",null,null,null,null,"non"]
[null,null,null,"",null,null,null,null,"non"]
[null,null,null,"",null,null,null,null,"non"]
[null,null,null,"",null,null,null,null,"non"]
[null,null,null,"",null,null,null,null,"non"]
[null,null,null,"",null,null,null,null,"non"]
[null,null,null,"",null,null,null,null,"non"]
[null,null,null,"",null,null,null,null,"non"]
[null,null,null,"",null,null,null,null,"non"]
[null,null,null,"",null,null,null,null,"non"]
[null,null,null,"",null,null,null,null,"non"]
[null,null,null,"",null,null,null,null,"non"]
[null,null,null,"",null,null,null,null,"non"]
[null,null,null,"",null,null,null,null,"non"]
[null,null,null,"",null,null,null,null,"non"]
[null,null,null,"",null,null,null,null,"non"]
[null,null,null,"",null,null,null,null,"non"]
[null,null,null,"",null,null,null,null,"non"]
[null,null,null,"",null,null,null,null,"non"]
[null,null,null,"",null,null,null,null,"non"]
[null,null,null,"",null,null,null,null,"non"]
[null,null,null,"",null,null,null,null,"non"]
[null,null,null,"",null,null,null,null,"non"]
[null,null,null,"",null,null,null,null,"non"]
[null,null,null,"",null,null,null,null,"non"]
[null,null,null,"",null,null,null,null,"non"]
[null,null,null,"",null,null,null,null,"non"]
[null,null,null,"",null,null,null,null,"non"]
[null,null,null,"",null,null,null,null,"non"]
[null,null,null,"",null,null,null,null,"non"]
[null,null,null,"",null,null,null,null,"non"]
[null,null,null,"",null,null,null,null,"non"]
[null,null,null,"",null,null,null,null,"non"]
[null,null,null,"",null,null,null,null,"non"]
[null,null,null,"",null,null,null,null,"non"]
[null,null,null,"",null,null,null,null,"non"]
[null,null,null,"",null,null,null,null,"non"]
[null,null,null,"",null,null,null,null,"non"]
[null,null,null,"",null,null,null,null,"non"]
[null,null,null,"",null,null,null,null,"non"]
[null,null,null,"",null,null,null,null,"non"]
[null,null,null,"",null,null,null,null,"non"]
[null,null,null,"",null,null,null,null,"non"]
[null,null,null,"",null,null,null,null,"non"]
[null,null,null,"",null,null,null,null,"non"]
[null,null,null,"",null,null,null,null,"non"]
[null,null,null,"",null,null,null,null,"non"]
[null,null,null,"",null,null,null,null,"non"]
[null,null,null,"",null,null,null,null,"non"]
[null,null,null,"",null,null,null,null,"non"]
[null,null,null,"",null,null,null,null,"non"]
[null,null,null,"",null,null,null,null,"non"]
[null,null,null,"",null,null,null,null,"non"]
[null,null,null,"",null,null,null,null,"non"]
[null,null,null,"",null,null,null,null,"non"]
[null,null,null,"",null,null,null,null,"non"]
[null,null,null,"",null,null,null,null,"non"]
[null,null,null,"",null,null,null,null,"non"]
[null,null,null,"",null,null,null,null,"non"]
[null,null,null,"",null,null,null,null,"non"]
[null,null,null,"",null,null,null,null,"non"]
[null,null,null,"",null,null,null,null,"non"]
[null,null,null,"",null,null,null,null,"non"]
[null,null,null,"",null,null,null,null,"non"]
[null,null,null,"",null,null,null,null,"non"]
[null,null,null,"",null,null,null,null,"non"]
[null,null,null,"",null,null,null,null,"non"]
[null,null,null,"",null,null,null,null,"non"]
[null,null,null,"",null,null,null,null,"non"]
[null,null,null,"",null,null,null,null,"non"]
[null,null,null,"",null,null,null,null,"non"]
[null,null,null,"",null,null,null,null,"non"]
[null,null,null,"",null,null,null,null,"non"]
[null,null,null,"",null,null,null,null,"non"]
[null,null,null,"",null,null,null,null,"non"]
[null,null,null,"",null,null,null,null,"non"]
[null,null,null,"",null,null,null,null,"non"]
[null,null,null,"",null,null,null,null,"non"]
[null,null,null,"",null,null,null,null,"non"]
[null,null,null,"",null,null,null,null,"non"]
[null,null,null,"",null,null,null,null,"non"]
[null,null,null,"",null,null,null,null,"non"]
[null,null,null,"",null,null,null,null,"non"]
[null,null,null,"",null,null,null,null,"non"]
[null,null,null,"",null,null,null,null,"non"]
[null,null,null,"",null,null,null,null,"non"]
[null,null,null,"",null,null,null,null,"non"]
[null,null,null,"",null,null,null,null,"non"]
[null,null,null,"",null,null,null,null,"non"]
[null,null,null,"",null,null,null,null,"non"]
[null,null,null,"",null,null,null,null,"non"]
[null,null,null,"",null,null,null,null,"non"]
[null,null,null,"",null,null,null,null,"non"]
[null,null,null,"",null,null,null,null,"non"]
[null,null,null,"",null,null,null,null,"non"]
[null,null,null,"",null,null,null,null,"non"]
[null,null,null,"",null,null,null,null,"non"]
[null,null,null,"",null,null,null,null,"non"]
[null,null,null,"",null,null,null,null,"non"]
[null,null,null,"",null,null,null,null,"non"]
[null,null,null,"",null,null,null,null,"non"]
[null,null,null,"",null,null,null,null,"non"]
[null,null,null,"",null,null,null,null,"non"]
[null,null,null,"",null,null,null,null,"non"]
[null,null,null,"",null,null,null,null,"non"]
[null,null,null,"",null,null,null,null,"non"]
[null,null,null,"",null,null,null,null,"non"]
[null,null,null,"",null,null,null,null,"non"]
[null,null,null,"",null,null,null,null,"non"]
[null,null,null,"",null,null,null,null,"non"]
[null,null,null,"",null,null,null,null,"non"]
[null,null,null,"",null,null,null,null,"non"]
[null,null,null,"",null,null,null,null,"non"]
[null,null,null,"",null,null,null,null,"non"]
[null,null,null,"",null,null,null,null,"non"]
[null,null,null,"",null,null,null,null,"non"]
[null,null,null,"",null,null,null,null,"non"]
[null,null,null,"",null,null,null,null,"non"]
[null,null,null,"",null,null,null,null,"non"]
[null,null,null,"",null,null,null,null,"non"]
[null,null,null,"",null,null,null,null,"non"]
[null,null,null,"",null,null,null,null,"non"]
[null,null,null,"",null,null,null,null,"non"]
[null,null,null,"",null,null,null,null,"non"]
[null,null,null,"",null,null,null,null,"non"]
[null,null,null,"",null,null,null,null,"non"]
[null,null,null,"",null,null,null,null,"non"]
[null,null,null,"",null,null,null,null,"non"]
[null,null,null,"",null,null,null,null,"non"]
[null,null,null,"",null,null,null,null,"non"]
[null,null,null,"",null,null,null,null,"non"]
[null,null,null,"",null,null,null,null,"non"]
[null,null,null,"",null,null,null,null,"non"]
[null,null,null,"",null,null,null,null,"non"]
[null,null,null,"",null,null,null,null,"non"]
[null,null,null,"",null,null,null,null,"non"]
[null,null,null,"",null,null,null,null,"non"]
[null,null,null,"",null,null,null,null,"non"]
[null,null,null,"",null,null,null,null,"non"]
[null,null,null,"",null,null,null,null,"non"]
[null,null,null,"",null,null,null,null,"non"]
[null,null,null,"",null,null,null,null,"non"]
[null,null,null,"",null,null,null,null,"non"]
[null,null,null,"",null,null,null,null,"non"]
[null,null,null,"",null,null,null,null,"non"]
[null,null,null,"",null,null,null,null,"non"]
[null,null,null,"",null,null,null,null,"non"]
[null,null,null,"",null,null,null,null,"non"]
[null,null,null,"",null,null,null,null,"non"]
[null,null,null,"",null,null,null,null,"non"]
[null,null,null,"",null,null,null,null,"non"]
[null,null,null,"",null,null,null,null,"non"]
[null,null,null,"",null,null,null,null,"non"]
[null,null,null,"",null,null,null,null,"non"]
[null,null,null,"",null,null,null,null,"non"]
[null,null,null,"",null,null,null,null,"non"]
[null,null,null,"",null,null,null,null,"non"]
[null,null,null,"",null,null,null,null,"non"]
[null,null,null,"",null,null,null,null,"non"]
[null,null,null,"",null,null,null,null,"non"]
[null,null,null,"",null,null,null,null,"non"]
[null,null,null,"",null,null,null,null,"non"]
[null,null,null,"",null,null,null,null,"non"]
[null,null,null,"",null,null,null,null,"non"]
[null,null,null,"",null,null,null,null,"non"]
[null,null,null,"",null,null,null,null,"non"]
[null,null,null,"",null,null,null,null,"non"]
[null,null,null,"",null,null,null,null,"non"]
[null,null,null,"",null,null,null,null,"non"]
[null,null,null,"",null,null,null,null,"non"]
[null,null,null,"",null,null,null,null,"non"]
[null,null,null,"",null,null,null,null,"non"]
[null,null,null,"",null,null,null,null,"non"]
[null,null,null,"",null,null,null,null,"non"]
[null,null,null,"",null,null,null,null,"non"]
[null,null,null,"",null,null,null,null,"non"]
[null,null,null,"",null,null,null,null,"non"]
[null,null,null,"",null,null,null,null,"non"]
[null,null,null,"",null,null,null,null,"non"]
[null,null,null,"",null,null,null,null,"non"]
[null,null,null,"",null,null,null,null,"non"]
[null,null,null,"",null,null,null,null,"non"]
[null,null,null,"",null,null,null,null,"non"]
[null,null,null,"",null,null,null,null,"non"]
[null,null,null,"",null,null,null,null,"non"]
[null,null,null,"",null,null,null,null,"non"]
[null,null,null,"",null,null,null,null,"non"]
[null,null,null,"",null,null,null,null,"non"]
[null,null,null,"",null,null,null,null,"non"]
[null,null,null,"",null,null,null,null,"non"]
[null,null,null,"",null,null,null,null,"non"]
[null,null,null,"",null,null,null,null,"non"]
[null,null,null,"",null,null,null,null,"non"]
[null,null,null,"",null,null,null,null,"non"]
[null,null,null,"",null,null,null,null,"non"]
[null,null,null,"",null,null,null,null,"non"]
[null,null,null,"",null,null,null,null,"non"]
[null,null,null,"",null,null,null,null,"non"]
[null,null,null,"",null,null,null,null,"non"]
[null,null,null,"",null,null,null,null,"non"]
[null,null,null,"",null,null,null,null,"non"]
[null,null,null,"",null,null,null,null,"non"]
[null,null,null,"",null,null,null,null,"non"]
[null,null,null,"",null,null,null,null,"non"]
[null,null,null,"",null,null,null,null,"non"]
[null,null,null,"",null,null,null,null,"non"]
[null,null,null,"",null,null,null,null,"non"]
[null,null,null,"",null,null,null,null,"non"]
[null,null,null,"",null,null,null,null,"non"]
[null,null,null,"",null,null,null,null,"non"]
[null,null,null,"",null,null,null,null,"non"]
[null,null,null,"",null,null,null,null,"non"]
[null,null,null,"",null,null,null,null,"non"]
[null,null,null,"",null,null,null,null,"non"]
[null,null,null,"",null,null,null,null,"non"]
[null,null,null,"",null,null,null,null,"non"]
[null,null,null,"",null,null,null,null,"non"]
[null,null,null,"",null,null,null,null,"non"]
[null,null,null,"",null,null,null,null,"non"]
[null,null,null,"",null,null,null,null,"non"]
[null,null,null,"",null,null,null,null,"non"]
[null,null,null,"",null,null,null,null,"non"]
[null,null,null,"",null,null,null,null,"non"]
[null,null,null,"",null,null,null,null,"non"]
[null,null,null,"",null,null,null,null,"non"]
[null,null,null,"",null,null,null,null,"non"]
[null,null,null,"",null,null,null,null,"non"]
[null,null,null,"",null,null,null,null,"non"]
[null,null,null,"",null,null,null,null,"non"]
[null,null,null,"",null,null,null,null,"non"]
[null,null,null,"",null,null,null,null,"non"]
[null,null,null,"",null,null,null,null,"non"]
[null,null,null,"",null,null,null,null,"non"]
[null,null,null,"",null,null,null,null,"non"]
[null,null,null,"",null,null,null,null,"non"]
[null,null,null,"",null,null,null,null,"non"]
[null,null,null,"",null,null,null,null,"non"]
[null,null,null,"",null,null,null,null,"non"]
[null,null,null,"",null,null,null,null,"non"]
[null,null,null,"",null,null,null,null,"non"]
[null,null,null,"",null,null,null,null,"non"]
[null,null,null,"",null,null,null,null,"non"]
[null,null,null,"",null,null,null,null,"non"]
[null,null,null,"",null,null,null,null,"non"]
[null,null,null,"",null,null,null,null,"non"]
[null,null,null,"",null,null,null,null,"non"]
[null,null,null,"",null,null,null,null,"non"]
[null,null,null,"",null,null,null,null,"non"]
[null,null,null,"",null,null,null,null,"non"]
[null,null,null,"",null,null,null,null,"non"]
[null,null,null,"",null,null,null,null,"non"]
[null,null,null,"",null,null,null,null,"non"]
[null,null,null,"",null,null,null,null,"non"]
[null,null,null,"",null,null,null,null,"non"]
[null,null,null,"",null,null,null,null,"non"]
[null,null,null,"",null,null,null,null,"non"]
[null,null,null,"",null,null,null,null,"non"]
[null,null,null,"",null,null,null,null,"non"]
[null,null,null,"",null,null,null,null,"non"]
[null,null,null,"",null,null,null,null,"non"]
[null,null,null,"",null,null,null,null,"non"]
[null,null,null,"",null,null,null,null,"non"]
[null,null,null,"",null,null,null,null,"non"]
[null,null,null,"",null,null,null,null,"non"]
[null,null,null,"",null,null,null,null,"non"]
[null,null,null,"",null,null,null,null,"non"]
[null,null,null,"",null,null,null,null,"non"]
[null,null,null,"",null,null,null,null,"non"]
[null,null,null,"",null,null,null,null,"non"]
[null,null,null,"",null,null,null,null,"non"]
[null,null,null,"",null,null,null,null,"non"]
[null,null,null,"",null,null,null,null,"non"]
[null,null,null,"",null,null,null,null,"non"]
[null,null,null,"",null,null,null,null,"non"]
[null,null,null,"",null,null,null,null,"non"]
[null,null,null,"",null,null,null,null,"non"]
[null,null,null,"",null,null,null,null,"non"]
[null,null,null,"",null,null,null,null,"non"]
[null,null,null,"",null,null,null,null,"non"]
[null,null,null,"",null,null,null,null,"non"]
[null,null,null,"",null,null,null,null,"non"]
[null,null,null,"",null,null,null,null,"non"]
[null,null,null,"",null,null,null,null,"non"]
[null,null,null,"",null,null,null,null,"non"]
[null,null,null,"",null,null,null,null,"non"]
[null,null,null,"",null,null,null,null,"non"]
[null,null,null,"",null,null,null,null,"non"]
[null,null,null,"",null,null,null,null,"non"]
[null,null,null,"",null,null,null,null,"non"]
[null,null,null,"",null,null,null,null,"non"]
[null,null,null,"",null,null,null,null,"non"]
[null,null,null,"",null,null,null,null,"non"]
[null,null,null,"",null,null,null,null,"non"]
[null,null,null,"",null,null,null,null,"non"]
[null,null,null,"",null,null,null,null,"non"]
[null,null,null,"",null,null,null,null,"non"]
[null,null,null,"",null,null,null,null,"non"]
[null,null,null,"",null,null,null,null,"non"]
[null,null,null,"",null,null,null,null,"non"]
[null,null,null,"",null,null,null,null,"non"]
[null,null,null,"",null,null,null,null,"non"]
[null,null,null,"",null,null,null,null,"non"]
[null,null,null,"",null,null,null,null,"non"]
[null,null,null,"",null,null,null,null,"non"]
[null,null,null,"",null,null,null,null,"non"]
[null,null,null,"",null,null,null,null,"non"]
[null,null,null,"",null,null,null,null,"non"]
[null,null,null,"",null,null,null,null,"non"]
[null,null,null,"",null,null,null,null,"non"]
[null,null,null,"",null,null,null,null,"non"]
[null,null,null,"",null,null,null,null,"non"]
[null,null,null,"",null,null,null,null,"non"]
[null,null,null,"",null,null,null,null,"non"]
[null,null,null,"",null,null,null,null,"non"]
[null,null,null,"",null,null,null,null,"non"]
[null,null,null,"",null,null,null,null,"non"]
[null,null,null,"",null,null,null,null,"non"]
[null,null,null,"",null,null,null,null,"non"]
[null,null,null,"",null,null,null,null,"non"]
[null,null,null,"",null,null,null,null,"non"]
[null,null,null,"",null,null,null,null,"non"]
[null,null,null,"",null,null,null,null,"non"]
[null,null,null,"",null,null,null,null,"non"]
[null,null,null,"",null,null,null,null,"non"]
[null,null,null,"",null,null,null,null,"non"]
[null,null,null,"",null,null,null,null,"non"]
[null,null,null,"",null,null,null,null,"non"]
[null,null,null,"",null,null,null,null,"non"]
[null,null,null,"",null,null,null,null,"non"]
[null,null,null,"",null,null,null,null,"non"]
[null,null,null,"",null,null,null,null,"non"]
[null,null,null,"",null,null,null,null,"non"]
[null,null,null,"",null,null,null,null,"non"]
[null,null,null,"",null,null,null,null,"non"]
[null,null,null,"",null,null,null,null,"non"]
[null,null,null,"",null,null,null,null,"non"]
[null,null,null,"",null,null,null,null,"non"]
[null,null,null,"",null,null,null,null,"non"]
[null,null,null,"",null,null,null,null,"non"]
[null,null,null,"",null,null,null,null,"non"]
[null,null,null,"",null,null,null,null,"non"]
[null,null,null,"",null,null,null,null,"non"]
[null,null,null,"",null,null,null,null,"non"]
[null,null,null,"",null,null,null,null,"non"]
[null,null,null,"",null,null,null,null,"non"]
[null,null,null,"",null,null,null,null,"non"]
[null,null,null,"",null,null,null,null,"non"]
[null,null,null,"",null,null,null,null,"non"]
[null,null,null,"",null,null,null,null,"non"]
[null,null,null,"",null,null,null,null,"non"]
[null,null,null,"",null,null,null,null,"non"]
[null,null,null,"",null,null,null,null,"non"]
[null,null,null,"",null,null,null,null,"non"]
[null,null,null,"",null,null,null,null,"non"]
[null,null,null,"",null,null,null,null,"non"]
[null,null,null,"",null,null,null,null,"non"]
[null,null,null,"",null,null,null,null,"non"]
[null,null,null,"",null,null,null,null,"non"]
[null,null,null,"",null,null,null,null,"non"]
[null,null,null,"",null,null,null,null,"non"]
[null,null,null,"",null,null,null,null,"non"]
[null,null,null,"",null,null,null,null,"non"]
[null,null,null,"",null,null,null,null,"non"]
[null,null,null,"",null,null,null,null,"non"]
[null,null,null,"",null,null,null,null,"non"]
[null,null,null,"",null,null,null,null,"non"]
[null,null,null,"",null,null,null,null,"non"]
[null,null,null,"",null,null,null,null,"non"]
[null,null,null,"",null,null,null,null,"non"]
[null,null,null,"",null,null,null,null,"non"]
[null,null,null,"",null,null,null,null,"non"]
[null,null,null,"",null,null,null,null,"non"]
[null,null,null,"",null,null,null,null,"non"]
[null,null,null,"",null,null,null,null,"non"]
[null,null,null,"",null,null,null,null,"non"]
[null,null,null,"",null,null,null,null,"non"]
[null,null,null,"",null,null,null,null,"non"]
[null,null,null,"",null,null,null,null,"non"]
[null,null,null,"",null,null,null,null,"non"]
[null,null,null,"",null,null,null,null,"non"]
[null,null,null,"",null,null,null,null,"non"]
[null,null,null,"",null,null,null,null,"non"]
[null,null,null,"",null,null,null,null,"non"]
[null,null,null,"",null,null,null,null,"non"]
[null,null,null,"",null,null,null,null,"non"]
[null,null,null,"",null,null,null,null,"non"]
[null,null,null,"",null,null,null,null,"non"]
[null,null,null,"",null,null,null,null,"non"]
[null,null,null,"",null,null,null,null,"non"]
[null,null,null,"",null,null,null,null,"non"]
[null,null,null,"",null,null,null,null,"non"]
[null,null,null,"",null,null,null,null,"non"]
[null,null,null,"",null,null,null,null,"non"]
[null,null,null,"",null,null,null,null,"non"]
[null,null,null,"",null,null,null,null,"non"]
[null,null,null,"",null,null,null,null,"non"]
[null,null,null,"",null,null,null,null,"non"]
[null,null,null,"",null,null,null,null,"non"]
[null,null,null,"",null,null,null,null,"non"]
[null,null,null,"",null,null,null,null,"non"]
[null,null,null,"",null,null,null,null,"non"]
[null,null,null,"",null,null,null,null,"non"]
[null,null,null,"",null,null,null,null,"non"]
[null,null,null,"",null,null,null,null,"non"]
[null,null,null,"",null,null,null,null,"non"]
[null,null,null,"",null,null,null,null,"non"]
[null,null,null,"",null,null,null,null,"non"]
[null,null,null,"",null,null,null,null,"non"]
[null,null,null,"",null,null,null,null,"non"]
[null,null,null,"",null,null,null,null,"non"]
[null,null,null,"",null,null,null,null,"non"]
[null,null,null,"",null,null,null,null,"non"]
[null,null,null,"",null,null,null,null,"non"]
[null,null,null,"",null,null,null,null,"non"]
[null,null,null,"",null,null,null,null,"non"]
[null,null,null,"",null,null,null,null,"non"]
[null,null,null,"",null,null,null,null,"non"]
[null,null,null,"",null,null,null,null,"non"]
[null,null,null,"",null,null,null,null,"non"]
[null,null,null,"",null,null,null,null,"non"]
[null,null,null,"",null,null,null,null,"non"]
[null,null,null,"",null,null,null,null,"non"]
[null,null,null,"",null,null,null,null,"non"]
[null,null,null,"",null,null,null,null,"non"]
[null,null,null,"",null,null,null,null,"non"]
[null,null,null,"",null,null,null,null,"non"]
[null,null,null,"",null,null,null,null,"non"]
[null,null,null,"",null,null,null,null,"non"]
[null,null,null,"",null,null,null,null,"non"]
[null,null,null,"",null,null,null,null,"non"]
[null,null,null,"",null,null,null,null,"non"]
[null,null,null,"",null,null,null,null,"non"]
[null,null,null,"",null,null,null,null,"non"]
[null,null,null,"",null,null,null,null,"non"]
[null,null,null,"",null,null,null,null,"non"]
[null,null,null,"",null,null,null,null,"non"]
[null,null,null,"",null,null,null,null,"non"]
[null,null,null,"",null,null,null,null,"non"]
[null,null,null,"",null,null,null,null,"non"]
[null,null,null,"",null,null,null,null,"non"]
[null,null,null,"",null,null,null,null,"non"]
[null,null,null,"",null,null,null,null,"non"]
[null,null,null,"",null,null,null,null,"non"]
[null,null,null,"",null,null,null,null,"non"]
[null,null,null,"",null,null,null,null,"non"]
[null,null,null,"",null,null,null,null,"non"]
[null,null,null,"",null,null,null,null,"non"]
[null,null,null,"",null,null,null,null,"non"]
[null,null,null,"",null,null,null,null,"non"]
[null,null,null,"",null,null,null,null,"non"]
[null,null,null,"",null,null,null,null,"non"]
[null,null,null,"",null,null,null,null,"non"]
[null,null,null,"",null,null,null,null,"non"]
[null,null,null,"",null,null,null,null,"non"]
[null,null,null,"",null,null,null,null,"non"]
[null,null,null,"",null,null,null,null,"non"]
[null,null,null,"",null,null,null,null,"non"]
[null,null,null,"",null,null,null,null,"non"]
[null,null,null,"",null,null,null,null,"non"]
[null,null,null,"",null,null,null,null,"non"]
[null,null,null,"",null,null,null,null,"non"]
[null,null,null,"",null,null,null,null,"non"]
[null,null,null,"",null,null,null,null,"non"]
[null,null,null,"",null,null,null,null,"non"]
[null,null,null,"",null,null,null,null,"non"]
[null,null,null,"",null,null,null,null,"non"]
[null,null,null,"",null,null,null,null,"non"]
[null,null,null,"",null,null,null,null,"non"]
[null,null,null,"",null,null,null,null,"non"]
[null,null,null,"",null,null,null,null,"non"]
[null,null,null,"",null,null,null,null,"non"]
[null,null,null,"",null,null,null,null,"non"]
[null,null,null,"",null,null,null,null,"non"]
[null,null,null,"",null,null,null,null,"non"]
[null,null,null,"",null,null,null,null,"non"]
[null,null,null,"",null,null,null,null,"non"]
[null,null,null,"",null,null,null,null,"non"]
[null,null,null,"",null,null,null,null,"non"]
[null,null,null,"",null,null,null,null,"non"]
[null,null,null,"",null,null,null,null,"non"]
[null,null,null,"",null,null,null,null,"non"]
[null,null,null,"",null,null,null,null,"non"]
[null,null,null,"",null,null,null,null,"non"]
[null,null,null,"",null,null,null,null,"non"]
[null,null,null,"",null,null,null,null,"non"]
[null,null,null,"",null,null,null,null,"non"]
[null,null,null,"",null,null,null,null,"non"]
[null,null,null,"",null,null,null,null,"non"]
[null,null,null,"",null,null,null,null,"non"]
[null,null,null,"",null,null,null,null,"non"]
[null,null,null,"",null,null,null,null,"non"]
[null,null,null,"",null,null,null,null,"non"]
[null,null,null,"",null,null,null,null,"non"]
[null,null,null,"",null,null,null,null,"non"]
[null,null,null,"",null,null,null,null,"non"]
[null,null,null,"",null,null,null,null,"non"]
[null,null,null,"",null,null,null,null,"non"]
[null,null,null,"",null,null,null,null,"non"]
[null,null,null,"",null,null,null,null,"non"]
[null,null,null,"",null,null,null,null,"non"]
[null,null,null,"",null,null,null,null,"non"]
[null,null,null,"",null,null,null,null,"non"]
[null,null,null,"",null,null,null,null,"non"]
[null,null,null,"",null,null,null,null,"non"]
[null,null,null,"",null,null,null,null,"non"]
[null,null,null,"",null,null,null,null,"non"]
[null,null,null,"",null,null,null,null,"non"]
[null,null,null,"",null,null,null,null,"non"]
[null,null,null,"",null,null,null,null,"non"]
[null,null,null,"",null,null,null,null,"non"]
[null,null,null,"",null,null,null,null,"non"]
[null,null,null,"",null,null,null,null,"non"]
[null,null,null,"",null,null,null,null,"non"]
[null,null,null,"",null,null,null,null,"non"]
[null,null,null,"",null,null,null,null,"non"]
[null,null,null,"",null,null,null,null,"non"]
[null,null,null,"",null,null,null,null,"non"]
[null,null,null,"",null,null,null,null,"non"]
[null,null,null,"",null,null,null,null,"non"]
[null,null,null,"",null,null,null,null,"non"]
[null,null,null,"",null,null,null,null,"non"]
[null,null,null,"",null,null,null,null,"non"]
[null,null,null,"",null,null,null,null,"non"]
[null,null,null,"",null,null,null,null,"non"]
[null,null,null,"",null,null,null,null,"non"]
[null,null,null,"",null,null,null,null,"non"]
[null,null,null,"",null,null,null,null,"non"]
[null,null,null,"",null,null,null,null,"non"]
[null,null,null,"",null,null,null,null,"non"]
[null,null,null,"",null,null,null,null,"non"]
[null,null,null,"",null,null,null,null,"non"]
[null,null,null,"",null,null,null,null,"non"]
[null,null,null,"",null,null,null,null,"non"]
[null,null,null,"",null,null,null,null,"non"]
[null,null,null,"",null,null,null,null,"non"]
[null,null,null,"",null,null,null,null,"non"]
[null,null,null,"",null,null,null,null,"non"]
[null,null,null,"",null,null,null,null,"non"]
[null,null,null,"",null,null,null,null,"non"]
[null,null,null,"",null,null,null,null,"non"]
[null,null,null,"",null,null,null,null,"non"]
[null,null,null,"",null,null,null,null,"non"]
[null,null,null,"",null,null,null,null,"non"]
[null,null,null,"",null,null,null,null,"non"]
[null,null,null,"",null,null,null,null,"non"]
[null,null,null,"",null,null,null,null,"non"]
[null,null,null,"",null,null,null,null,"non"]
[null,null,null,"",null,null,null,null,"non"]
[null,null,null,"",null,null,null,null,"non"]
[null,null,null,"",null,null,null,null,"non"]
[null,null,null,"",null,null,null,null,"non"]
[null,null,null,"",null,null,null,null,"non"]
[null,null,null,"",null,null,null,null,"non"]
[null,null,null,"",null,null,null,null,"non"]
[null,null,null,"",null,null,null,null,"non"]
[null,null,null,"",null,null,null,null,"non"]
[null,null,null,"",null,null,null,null,"non"]
[null,null,null,"",null,null,null,null,"non"]
[null,null,null,"",null,null,null,null,"non"]
[null,null,null,"",null,null,null,null,"non"]
[null,null,null,"",null,null,null,null,"non"]
[null,null,null,"",null,null,null,null,"non"]
[null,null,null,"",null,null,null,null,"non"]
[null,null,null,"",null,null,null,null,"non"]
[null,null,null,"",null,null,null,null,"non"]
[null,null,null,"",null,null,null,null,"non"]
[null,null,null,"",null,null,null,null,"non"]
[null,null,null,"",null,null,null,null,"non"]
[null,null,null,"",null,null,null,null,"non"]
[null,null,null,"",null,null,null,null,"non"]
[null,null,null,"",null,null,null,null,"non"]
[null,null,null,"",null,null,null,null,"non"]
[null,null,null,"",null,null,null,null,"non"]
[null,null,null,"",null,null,null,null,"non"]
[null,null,null,"",null,null,null,null,"non"]
[null,null,null,"",null,null,null,null,"non"]
[null,null,null,"",null,null,null,null,"non"]
[null,null,null,"",null,null,null,null,"non"]
[null,null,null,"",null,null,null,null,"non"]
[null,null,null,"",null,null,null,null,"non"]
[null,null,null,"",null,null,null,null,"non"]
[null,null,null,"",null,null,null,null,"non"]
[null,null,null,"",null,null,null,null,"non"]
[null,null,null,"",null,null,null,null,"non"]
[null,null,null,"",null,null,null,null,"non"]
[null,null,null,"",null,null,null,null,"non"]
[null,null,null,"",null,null,null,null,"non"]
[null,null,null,"",null,null,null,null,"non"]
[null,null,null,"",null,null,null,null,"non"]
[null,null,null,"",null,null,null,null,"non"]
[null,null,null,"",null,null,null,null,"non"]
[null,null,null,"",null,null,null,null,"non"]
[null,null,null,"",null,null,null,null,"non"]
[null,null,null,"",null,null,null,null,"non"]
[null,null,null,"",null,null,null,null,"non"]
[null,null,null,"",null,null,null,null,"non"]
[null,null,null,"",null,null,null,null,"non"]
[null,null,null,"",null,null,null,null,"non"]
[null,null,null,"",null,null,null,null,"non"]
[null,null,null,"",null,null,null,null,"non"]
[null,null,null,"",null,null,null,null,"non"]
[null,null,null,"",null,null,null,null,"non"]
[null,null,null,"",null,null,null,null,"non"]
[null,null,null,"",null,null,null,null,"non"]
[null,null,null,"",null,null,null,null,"non"]
[null,null,null,"",null,null,null,null,"non"]
[null,null,null,"",null,null,null,null,"non"]
[null,null,null,"",null,null,null,null,"non"]
[null,null,null,"",null,null,null,null,"non"]
[null,null,null,"",null,null,null,null,"non"]
[null,null,null,"",null,null,null,null,"non"]
[null,null,null,"",null,null,null,null,"non"]
[null,null,null,"",null,null,null,null,"non"]
[null,null,null,"",null,null,null,null,"non"]
[null,null,null,"",null,null,null,null,"non"]
[null,null,null,"",null,null,null,null,"non"]
[null,null,null,"",null,null,null,null,"non"]
[null,null,null,"",null,null,null,null,"non"]
[null,null,null,"",null,null,null,null,"non"]
[null,null,null,"",null,null,null,null,"non"]
[null,null,null,"",null,null,null,null,"non"]
[null,null,null,"",null,null,null,null,"non"]
[null,null,null,"",null,null,null,null,"non"]
[null,null,null,"",null,null,null,null,"non"]
[null,null,null,"",null,null,null,null,"non"]
[null,null,null,"",null,null,null,null,"non"]
[null,null,null,"",null,null,null,null,"non"]
[null,null,null,"",null,null,null,null,"non"]
[null,null,null,"",null,null,null,null,"non"]
[null,null,null,"",null,null,null,null,"non"]
[null,null,null,"",null,null,null,null,"non"]
[null,null,null,"",null,null,null,null,"non"]
[null,null,null,"",null,null,null,null,"non"]
[null,null,null,"",null,null,null,null,"non"]
[null,null,null,"",null,null,null,null,"non"]
[null,null,null,"",null,null,null,null,"non"]
[null,null,null,"",null,null,null,null,"non"]
[null,null,null,"",null,null,null,null,"non"]
[null,null,null,"",null,null,null,null,"non"]
[null,null,null,"",null,null,null,null,"non"]
[null,null,null,"",null,null,null,null,"non"]
[null,null,null,"",null,null,null,null,"non"]
[null,null,null,"",null,null,null,null,"non"]
[null,null,null,"",null,null,null,null,"non"]
[null,null,null,"",null,null,null,null,"non"]
[null,null,null,"",null,null,null,null,"non"]
[null,null,null,"",null,null,null,null,"non"]
[null,null,null,"",null,null,null,null,"non"]
[null,null,null,"",null,null,null,null,"non"]
[null,null,null,"",null,null,null,null,"non"]
[null,null,null,"",null,null,null,null,"non"]
[null,null,null,"",null,null,null,null,"non"]
[null,null,null,"",null,null,null,null,"non"]

{"sheet":"Tarif de base","index":2,"n_rows":16,"n_cols":5,"rows_kept":16,"cut":false,"hidden":true,"merged":[]}
["Tarif de base",null,null,"Désignation avec tarif"]
[]
["Produit","Tarif",null,"Tarifs","Colonne1"]
["A.O.C. Côtes de Bourg Rouge 1995",25,null,{"$f":"A4&\" à \"&B4&\" € \"","v":"A.O.C. Côtes de Bourg Rouge 1995 à 25 € "},{"$f":"Tarif[[#This Row],[Tarif]]","v":25}]
["Rouge BP 2003(Fût de Chêne)",6,null,"Rouge BP 2003(Fût de Chêne) à 6 € ",{"$f":"Tarif[[#This Row],[Tarif]]","v":6}]
["Rouge BP 2005",5,null,"Rouge BP 2005 à 5 € ",{"$f":"Tarif[[#This Row],[Tarif]]","v":5}]
["Rouge BP  2005(Fût de Chêne)",6,null,"Rouge BP  2005(Fût de Chêne) à 6 € ",{"$f":"Tarif[[#This Row],[Tarif]]","v":6}]
["A.O.C. Côtes de Bourg Rouge 2007",5,null,"A.O.C. Côtes de Bourg Rouge 2007 à 5 € ",{"$f":"Tarif[[#This Row],[Tarif]]","v":5}]
["A.O.C. Côtes de Bourg Rouge 2012",7,null,"A.O.C. Côtes de Bourg Rouge 2012 à 7 € ",{"$f":"Tarif[[#This Row],[Tarif]]","v":7}]
["A.O.C  Côtes de Bourg Rouge 2014",7,null,"A.O.C  Côtes de Bourg Rouge 2014 à 7 € ",{"$f":"Tarif[[#This Row],[Tarif]]","v":7}]
["Bordeaux Blanc 2015",4,null,"Bordeaux Blanc 2015 à 4 € ",{"$f":"Tarif[[#This Row],[Tarif]]","v":4}]
["Bordeaux Blanc 2016",4,null,"Bordeaux Blanc 2016 à 4 € ",{"$f":"Tarif[[#This Row],[Tarif]]","v":4}]
["Bordeaux Rosé 2015",5,null,"Bordeaux Rosé 2015 à 5 € ",{"$f":"Tarif[[#This Row],[Tarif]]","v":5}]
["Bordeaux Rosé 2017",5,null,"Bordeaux Rosé 2017 à 5 € ",{"$f":"Tarif[[#This Row],[Tarif]]","v":5}]
["Clos Maine G Rouge 2014",4,null,"Clos Maine G Rouge 2014 à 4 € ",{"$f":"Tarif[[#This Row],[Tarif]]","v":4}]
["Bag in Box Bordeaux 5L  Rouge 2016 ",20,null,"Bag in Box Bordeaux 5L  Rouge 2016  à 20 € ",{"$f":"Tarif[[#This Row],[Tarif]]","v":20}]

{"sheet":"formulaire","index":3,"n_rows":8,"n_cols":1,"rows_kept":8,"cut":false,"hidden":true,"merged":[]}
[]
["Action"]
[]
["Dégustation"]
["Cadeau"]
["Vente"]
["Casse"]
["Vol"]