{"text_format":"1","workbook":"xlsx","n_sheets":4,"sheets":["Application","Dégustation Cadeau Casse Perso","Tarif de base","formulaire"],"not_rendered":{"charts":0,"images":0,"macros":1,"external_links":0,"defined_names":5,"comments":0,"pivot_tables":0},"unopened":[],"bounds":{"document_bytes":16777216,"sheet_cells":100000,"rows_first":2000,"rows_last":500,"rows_between":2000,"halvings":0,"cell_chars":16384,"cell_head_chars":4096},"cells_cut":0,"cells_raw":0,"read":"whole","date_system":"1900"}

{"sheet":"Application","index":0,"n_rows":2250,"n_cols":15,"rows_kept":2250,"cut":false,"hidden":false,"merged":[[17,9,23,9],[17,10,23,10],[17,11,23,11],[17,12,23,12],[18,13,23,13],[17,0,23,0],[17,2,23,2],[17,3,23,3],[17,7,23,7],[17,8,23,8],[10,8,16,8],[10,9,16,9],[10,10,16,10],[10,11,16,11],[11,13,16,13],[7,0,7,2],[10,0,16,0],[10,2,16,2],[10,3,16,3],[10,7,16,7],[10,12,16,12],[31,9,37,9],[31,10,37,10],[31,11,37,11],[31,12,37,12],[32,13,37,13],[31,0,37,0],[31,2,37,2],[31,3,37,3],[31,7,37,7],[31,8,37,8],[24,9,30,9],[24,10,30,10],[24,11,30,11],[24,12,30,12],[24,0,30,0],[24,2,30,2],[24,3,30,3],[24,7,30,7],[24,8,30,8],[25,13,30,13],[45,9,51,9],[45,10,51,10],[45,11,51,11],[45,12,51,12],[46,13,51,13],[45,0,51,0],[45,2,51,2],[45,3,51,3],[45,7,51,7],[45,8,51,8],[38,9,44,9],[38,10,44,10],[38,11,44,11],[38,12,44,12],[39,13,44,13],[38,0,44,0],[38,2,44,2],[38,3,44,3],[38,7,44,7],[38,8,44,8],[59,9,65,9],[59,10,65,10],[59,11,65,11],[59,12,65,12],[60,13,65,13],[59,0,65,0],[59,2,65,2],[59,3,65,3],[59,7,65,7],[59,8,65,8],[52,9,58,9],[52,10,58,10],[52,11,58,11],[52,12,58,12],[53,13,58,13],[52,0,58,0],[52,2,58,2],[52,3,58,3],[52,7,58,7],[52,8,58,8],[73,9,79,9],[73,10,79,10],[73,11,79,11],[73,12,79,12],[74,13,79,13],[73,0,79,0],[73,2,79,2],[73,3,79,3],[73,7,79,7],[73,8,79,8],[66,9,72,9],[66,10,72,10],[66,11,72,11],[66,12,72,12],[67,13,72,13],[66,0,72,0],[66,2,72,2],[66,3,72,3],[66,7,72,7],[66,8,72,8],[87,9,93,9],[87,10,93,10],[87,11,93,11],[87,12,93,12],[88,13,93,13],[87,0,93,0],[87,2,93,2],[87,3,93,3],[87,7,93,7],[87,8,93,8],[80,9,86,9],[80,10,86,10],[80,11,86,11],[80,12,86,12],[81,13,86,13],[80,0,86,0],[80,2,86,2],[80,3,86,3],[80,7,86,7],[80,8,86,8],[101,9,107,9],[101,10,107,10],[101,11,107,11],[101,12,107,12],[102,13,107,13],[101,0,107,0],[101,2,107,2],[101,3,107,3],[101,7,107,7],[101,8,107,8],[94,9,100,9],[94,10,100,10],[94,11,100,11],[94,12,100,12],[95,13,100,13],[94,0,100,0],[94,2,100,2],[94,3,100,3],[94,7,100,7],[94,8,100,8],[115,9,121,9],[115,10,121,10],[115,11,121,11],[115,12,121,12],[116,13,121,13],[115,0,121,0],[115,2,121,2],[115,3,121,3],[115,7,121,7],[115,8,121,8],[108,9,114,9],[108,10,114,10],[108,11,114,11],[108,12,114,12],[109,13,114,13],[108,0,114,0],[108,2,114,2],[108,3,114,3],[108,7,114,7],[108,8,114,8],[129,9,135,9],[129,10,135,10],[129,11,135,11],[129,12,135,12],[130,13,135,13],[129,0,135,0],[129,2,135,2],[129,3,135,3],[129,7,135,7],[129,8,135,8],[122,9,128,9],[122,10,128,10],[122,11,128,11],[122,12,128,12],[123,13,128,13],[122,0,128,0],[122,2,128,2],[122,3,128,3],[122,7,128,7],[122,8,128,8],[143,9,149,9],[143,10,149,10],[143,11,149,11],[143,12,149,12],[143,0,149,0],[143,2,149,2],[143,3,149,3],[143,7,149,7],[143,8,149,8],[136,9,142,9],[136,10,142,10],[136,11,142,11],[136,12,142,12],[137,13,142,13],[136,0,142,0],[136,2,142,2],[136,3,142,3],[136,7,142,7],[136,8,142,8],[144,13,149,13],[164,2,170,2],[164,3,170,3],[164,7,170,7],[164,8,170,8],[165,13,170,13],[172,13,177,13],[157,9,163,9],[157,10,163,10],[157,11,163,11],[157,12,163,12],[157,0,163,0],[157,2,163,2],[157,3,163,3],[157,7,163,7],[157,8,163,8],[150,9,156,9],[150,10,156,10],[150,11,156,11],[150,12,156,12],[150,0,156,0],[150,2,156,2],[150,3,156,3],[150,7,156,7],[150,8,156,8],[185,11,191,11],[185,12,191,12],[185,0,191,0],[185,2,191,2],[185,3,191,3],[185,7,191,7],[185,8,191,8],[178,9,184,9],[178,10,184,10],[178,11,184,11],[178,12,184,12],[178,0,184,0],[178,2,184,2],[178,3,184,3],[178,7,184,7],[178,8,184,8],[151,13,156,13],[158,13,163,13],[171,9,177,9],[171,10,177,10],[171,11,177,11],[171,12,177,12],[171,0,177,0],[171,2,177,2],[171,3,177,3],[171,7,177,7],[171,8,177,8],[164,9,170,9],[164,10,170,10],[164,11,170,11],[164,12,170,12],[164,0,170,0],[206,10,212,10],[206,11,212,11],[206,12,212,12],[206,0,212,0],[206,2,212,2],[206,3,212,3],[206,7,212,7],[206,8,212,8],[179,13,184,13],[186,13,191,13],[199,9,205,9],[199,10,205,10],[199,11,205,11],[199,12,205,12],[199,0,205,0],[199,2,205,2],[199,3,205,3],[199,7,205,7],[199,8,205,8],[192,9,198,9],[192,10,198,10],[192,11,198,11],[192,12,198,12],[192,0,198,0],[192,2,198,2],[192,3,198,3],[192,7,198,7],[192,8,198,8],[193,13,198,13],[200,13,205,13],[185,9,191,9],[185,10,191,10],[207,13,212,13],[214,13,219,13],[227,9,233,9],[227,10,233,10],[227,11,233,11],[227,12,233,12],[227,0,233,0],[227,2,233,2],[227,3,233,3],[227,7,233,7],[227,8,233,8],[220,9,226,9],[220,10,226,10],[220,11,226,11],[220,12,226,12],[220,0,226,0],[220,2,226,2],[220,3,226,3],[220,7,226,7],[220,8,226,8],[221,13,226,13],[228,13,233,13],[213,9,219,9],[213,10,219,10],[213,11,219,11],[213,12,219,12],[213,0,219,0],[213,2,219,2],[213,3,219,3],[213,7,219,7],[213,8,219,8],[206,9,212,9],[248,2,254,2],[248,3,254,3],[248,7,254,7],[248,8,254,8],[249,13,254,13],[256,13,261,13],[241,9,247,9],[241,10,247,10],[241,11,247,11],[241,12,247,12],[241,0,247,0],[241,2,247,2],[241,3,247,3],[241,7,247,7],[241,8,247,8],[234,9,240,9],[234,10,240,10],[234,11,240,11],[234,12,240,12],[234,0,240,0],[234,2,240,2],[234,3,240,3],[234,7,240,7],[234,8,240,8],[269,11,275,11],[269,12,275,12],[269,0,275,0],[269,2,275,2],[269,3,275,3],[269,7,275,7],[269,8,275,8],[262,9,268,9],[262,10,268,10],[262,11,268,11],[262,12,268,12],[262,0,268,0],[262,2,268,2],[262,3,268,3],[262,7,268,7],[262,8,268,8],[235,13,240,13],[242,13,247,13],[255,9,261,9],[255,10,261,10],[255,11,261,11],[255,12,261,12],[255,0,261,0],[255,2,261,2],[255,3,261,3],[255,7,261,7],[255,8,261,8],[248,9,254,9],[248,10,254,10],[248,11,254,11],[248,12,254,12],[248,0,254,0],[290,10,296,10],[290,11,296,11],[290,12,296,12],[290,0,296,0],[290,2,296,2],[290,3,296,3],[290,7,296,7],[290,8,296,8],[263,13,268,13],[270,13,275,13],[283,9,289,9],[283,10,289,10],[283,11,289,11],[283,12,289,12],[283,0,289,0],[283,2,289,2],[283,3,289,3],[283,7,289,7],[283,8,289,8],[276,9,282,9],[276,10,282,10],[276,11,282,11],[276,12,282,12],[276,0,282,0],[276,2,282,2],[276,3,282,3],[276,7,282,7],[276,8,282,8],[277,13,282,13],[284,13,289,13],[269,9,275,9],[269,10,275,10],[291,13,296,13],[298,13,303,13],[311,9,317,9],[311,10,317,10],[311,11,317,11],[311,12,317,12],[311,0,317,0],[311,2,317,2],[311,3,317,3],[311,7,317,7],[311,8,317,8],[304,9,310,9],[304,10,310,10],[304,11,310,11],[304,12,310,12],[304,0,310,0],[304,2,310,2],[304,3,310,3],[304,7,310,7],[304,8,310,8],[305,13,310,13],[312,13,317,13],[297,9,303,9],[297,10,303,10],[297,11,303,11],[297,12,303,12],[297,0,303,0],[297,2,303,2],[297,3,303,3],[297,7,303,7],[297,8,303,8],[290,9,296,9],[332,2,338,2],[332,3,338,3],[332,7,338,7],[332,8,338,8],[333,13,338,13],[340,13,345,13],[325,9,331,9],[325,10,331,10],[325,11,331,11],[325,12,331,12],[325,0,331,0],[325,2,331,2],[325,3,331,3],[325,7,331,7],[325,8,331,8],[318,9,324,9],[318,10,324,10],[318,11,324,11],[318,12,324,12],[318,0,324,0],[318,2,324,2],[318,3,324,3],[318,7,324,7],[318,8,324,8],[353,11,359,11],[353,12,359,12],[353,0,359,0],[353,2,359,2],[353,3,359,3],[353,7,359,7],[353,8,359,8],[346,9,352,9],[346,10,352,10],[346,11,352,11],[346,12,352,12],[346,0,352,0],[346,2,352,2],[346,3,352,3],[346,7,352,7],[346,8,352,8],[319,13,324,13],[326,13,331,13],[339,9,345,9],[339,10,345,10],[339,11,345,11],[339,12,345,12],[339,0,345,0],[339,2,345,2],[339,3,345,3],[339,7,345,7],[339,8,345,8],[332,9,338,9],[332,10,338,10],[332,11,338,11],[332,12,338,12],[332,0,338,0],[374,10,380,10],[374,11,380,11],[374,12,380,12],[374,0,380,0],[374,2,380,2],[374,3,380,3],[374,7,380,7],[374,8,380,8],[347,13,352,13],[354,13,359,13],[367,9,373,9],[367,10,373,10],[367,11,373,11],[367,12,373,12],[367,0,373,0],[367,2,373,2],[367,3,373,3],[367,7,373,7],[367,8,373,8],[360,9,366,9],[360,10,366,10],[360,11,366,11],[360,12,366,12],[360,0,366,0],[360,2,366,2],[360,3,366,3],[360,7,366,7],[360,8,366,8],[361,13,366,13],[368,13,373,13],[353,9,359,9],[353,10,359,10],[375,13,380,13],[382,13,387,13],[395,9,401,9],[395,10,401,10],[395,11,401,11],[395,12,401,12],[395,0,401,0],[395,2,401,2],[395,3,401,3],[395,7,401,7],[395,8,401,8],[388,9,394,9],[388,10,394,10],[388,11,394,11],[388,12,394,12],[388,0,394,0],[388,2,394,2],[388,3,394,3],[388,7,394,7],[388,8,394,8],[389,13,394,13],[396,13,401,13],[381,9,387,9],[381,10,387,10],[381,11,387,11],[381,12,387,12],[381,0,387,0],[381,2,387,2],[381,3,387,3],[381,7,387,7],[381,8,387,8],[374,9,380,9],[416,2,422,2],[416,3,422,3],[416,7,422,7],[416,8,422,8],[417,13,422,13],[424,13,429,13],[409,9,415,9],[409,10,415,10],[409,11,415,11],[409,12,415,12],[409,0,415,0],[409,2,415,2],[409,3,415,3],[409,7,415,7],[409,8,415,8],[402,9,408,9],[402,10,408,10],[402,11,408,11],[402,12,408,12],[402,0,408,0],[402,2,408,2],[402,3,408,3],[402,7,408,7],[402,8,408,8],[437,11,443,11],[437,12,443,12],[437,0,443,0],[437,2,443,2],[437,3,443,3],[437,7,443,7],[437,8,443,8],[430,9,436,9],[430,10,436,10],[430,11,436,11],[430,12,436,12],[430,0,436,0],[430,2,436,2],[430,3,436,3],[430,7,436,7],[430,8,436,8],[403,13,408,13],[410,13,415,13],[423,9,429,9],[423,10,429,10],[423,11,429,11],[423,12,429,12],[423,0,429,0],[423,2,429,2],[423,3,429,3],[423,7,429,7],[423,8,429,8],[416,9,422,9],[416,10,422,10],[416,11,422,11],[416,12,422,12],[416,0,422,0],[458,10,464,10],[458,11,464,11],[458,12,464,12],[458,0,464,0],[458,2,464,2],[458,3,464,3],[458,7,464,7],[458,8,464,8],[431,13,436,13],[438,13,443,13],[451,9,457,9],[451,10,457,10],[451,11,457,11],[451,12,457,12],[451,0,457,0],[451,2,457,2],[451,3,457,3],[451,7,457,7],[451,8,457,8],[444,9,450,9],[444,10,450,10],[444,11,450,11],[444,12,450,12],[444,0,450,0],[444,2,450,2],[444,3,450,3],[444,7,450,7],[444,8,450,8],[445,13,450,13],[452,13,457,13],[437,9,443,9],[437,10,443,10],[459,13,464,13],[466,13,471,13],[479,9,485,9],[479,10,485,10],[479,11,485,11],[479,12,485,12],[479,0,485,0],[479,2,485,2],[479,3,485,3],[479,7,485,7],[479,8,485,8],[472,9,478,9],[472,10,478,10],[472,11,478,11],[472,12,478,12],[472,0,478,0],[472,2,478,2],[472,3,478,3],[472,7,478,7],[472,8,478,8],[473,13,478,13],[480,13,485,13],[465,9,471,9],[465,10,471,10],[465,11,471,11],[465,12,471,12],[465,0,471,0],[465,2,471,2],[465,3,471,3],[465,7,471,7],[465,8,471,8],[458,9,464,9],[500,2,506,2],[500,3,506,3],[500,7,506,7],[500,8,506,8],[501,13,506,13],[508,13,513,13],[493,9,499,9],[493,10,499,10],[493,11,499,11],[493,12,499,12],[493,0,499,0],[493,2,499,2],[493,3,499,3],[493,7,499,7],[493,8,499,8],[486,9,492,9],[486,10,492,10],[486,11,492,11],[486,12,492,12],[486,0,492,0],[486,2,492,2],[486,3,492,3],[486,7,492,7],[486,8,492,8],[521,11,527,11],[521,12,527,12],[521,0,527,0],[521,2,527,2],[521,3,527,3],[521,7,527,7],[521,8,527,8],[514,9,520,9],[514,10,520,10],[514,11,520,11],[514,12,520,12],[514,0,520,0],[514,2,520,2],[514,3,520,3],[514,7,520,7],[514,8,520,8],[487,13,492,13],[494,13,499,13],[507,9,513,9],[507,10,513,10],[507,11,513,11],[507,12,513,12],[507,0,513,0],[507,2,513,2],[507,3,513,3],[507,7,513,7],[507,8,513,8],[500,9,506,9],[500,10,506,10],[500,11,506,11],[500,12,506,12],[500,0,506,0],[542,10,548,10],[542,11,548,11],[542,12,548,12],[542,0,548,0],[542,2,548,2],[542,3,548,3],[542,7,548,7],[542,8,548,8],[515,13,520,13],[522,13,527,13],[535,9,541,9],[535,10,541,10],[535,11,541,11],[535,12,541,12],[535,0,541,0],[535,2,541,2],[535,3,541,3],[535,7,541,7],[535,8,541,8],[528,9,534,9],[528,10,534,10],[528,11,534,11],[528,12,534,12],[528,0,534,0],[528,2,534,2],[528,3,534,3],[528,7,534,7],[528,8,534,8],[529,13,534,13],[536,13,541,13],[521,9,527,9],[521,10,527,10],[543,13,548,13],[550,13,555,13],[563,9,569,9],[563,10,569,10],[563,11,569,11],[563,12,569,12],[563,0,569,0],[563,2,569,2],[563,3,569,3],[563,7,569,7],[563,8,569,8],[556,9,562,9],[556,10,562,10],[556,11,562,11],[556,12,562,12],[556,0,562,0],[556,2,562,2],[556,3,562,3],[556,7,562,7],[556,8,562,8],[557,13,562,13],[564,13,569,13],[549,9,555,9],[549,10,555,10],[549,11,555,11],[549,12,555,12],[549,0,555,0],[549,2,555,2],[549,3,555,3],[549,7,555,7],[549,8,555,8],[542,9,548,9],[584,2,590,2],[584,3,590,3],[584,7,590,7],[584,8,590,8],[585,13,590,13],[592,13,597,13],[577,9,583,9],[577,10,583,10],[577,11,583,11],[577,12,583,12],[577,0,583,0],[577,2,583,2],[577,3,583,3],[577,7,583,7],[577,8,583,8],[570,9,576,9],[570,10,576,10],[570,11,576,11],[570,12,576,12],[570,0,576,0],[570,2,576,2],[570,3,576,3],[570,7,576,7],[570,8,576,8],[605,11,611,11],[605,12,611,12],[605,0,611,0],[605,2,611,2],[605,3,611,3],[605,7,611,7],[605,8,611,8],[598,9,604,9],[598,10,604,10],[598,11,604,11],[598,12,604,12],[598,0,604,0],[598,2,604,2],[598,3,604,3],[598,7,604,7],[598,8,604,8],[571,13,576,13],[578,13,583,13],[591,9,597,9],[591,10,597,10],[591,11,597,11],[591,12,597,12],[591,0,597,0],[591,2,597,2],[591,3,597,3],[591,7,597,7],[591,8,597,8],[584,9,590,9],[584,10,590,10],[584,11,590,11],[584,12,590,12],[584,0,590,0],[626,10,632,10],[626,11,632,11],[626,12,632,12],[626,0,632,0],[626,2,632,2],[626,3,632,3],[626,7,632,7],[626,8,632,8],[599,13,604,13],[606,13,611,13],[619,9,625,9],[619,10,625,10],[619,11,625,11],[619,12,625,12],[619,0,625,0],[619,2,625,2],[619,3,625,3],[619,7,625,7],[619,8,625,8],[612,9,618,9],[612,10,618,10],[612,11,618,11],[612,12,618,12],[612,0,618,0],[612,2,618,2],[612,3,618,3],[612,7,618,7],[612,8,618,8],[613,13,618,13],[620,13,625,13],[605,9,611,9],[605,10,611,10],[627,13,632,13],[634,13,639,13],[647,9,653,9],[647,10,653,10],[647,11,653,11],[647,12,653,12],[647,0,653,0],[647,2,653,2],[647,3,653,3],[647,7,653,7],[647,8,653,8],[640,9,646,9],[640,10,646,10],[640,11,646,11],[640,12,646,12],[640,0,646,0],[640,2,646,2],[640,3,646,3],[640,7,646,7],[640,8,646,8],[641,13,646,13],[648,13,653,13],[633,9,639,9],[633,10,639,10],[633,11,639,11],[633,12,639,12],[633,0,639,0],[633,2,639,2],[633,3,639,3],[633,7,639,7],[633,8,639,8],[626,9,632,9],[668,2,674,2],[668,3,674,3],[668,7,674,7],[668,8,674,8],[669,13,674,13],[676,13,681,13],[661,9,667,9],[661,10,667,10],[661,11,667,11],[661,12,667,12],[661,0,667,0],[661,2,667,2],[661,3,667,3],[661,7,667,7],[661,8,667,8],[654,9,660,9],[654,10,660,10],[654,11,660,11],[654,12,660,12],[654,0,660,0],[654,2,660,2],[654,3,660,3],[654,7,660,7],[654,8,660,8],[689,11,695,11],[689,12,695,12],[689,0,695,0],[689,2,695,2],[689,3,695,3],[689,7,695,7],[689,8,695,8],[682,9,688,9],[682,10,688,10],[682,11,688,11],[682,12,688,12],[682,0,688,0],[682,2,688,2],[682,3,688,3],[682,7,688,7],[682,8,688,8],[655,13,660,13],[662,13,667,13],[675,9,681,9],[675,10,681,10],[675,11,681,11],[675,12,681,12],[675,0,681,0],[675,2,681,2],[675,3,681,3],[675,7,681,7],[675,8,681,8],[668,9,674,9],[668,10,674,10],[668,11,674,11],[668,12,674,12],[668,0,674,0],[710,10,716,10],[710,11,716,11],[710,12,716,12],[710,0,716,0],[710,2,716,2],[710,3,716,3],[710,7,716,7],[710,8,716,8],[683,13,688,13],[690,13,695,13],[703,9,709,9],[703,10,709,10],[703,11,709,11],[703,12,709,12],[703,0,709,0],[703,2,709,2],[703,3,709,3],[703,7,709,7],[703,8,709,8],[696,9,702,9],[696,10,702,10],[696,11,702,11],[696,12,702,12]],"merged_total":3201,"flags":["merged_cut"]}
[]
[]
[]
[]
[]
[]
[]
[]
[]
["Action","Mois","Date","Client","Produits ","Qté de bouteille ou litre","Montant","Somme reçue en CB","Somme reçue en chèque","Somme reçue en espèces","Contrôle","Observations","Comptabilisé\noui/non","n°action","comptabilisé ?"]
[null,null,null,null,null,null,{"$f":"IFERROR(VLOOKUP(E11,'Tarif de base'!D:E,2,FALSE)*F11,\"\")","v":""},null,null,null,{"$f":"IFERROR(IF(G17-H11-I11-J11<>0,\"Attention il manque \"&G17-H11-I11-J11&\"€\",\"Règlement OK\"),\"Pas de règlement\")","v":"Règlement OK"},null,"non",1,{"$f":"M11","v":"non"}]
[null,null,null,null,null,null,{"$f":"IFERROR(VLOOKUP(E12,'Tarif de base'!D:E,2,FALSE)*F12,\"\")","v":""},null,null,null,null,null,null,"Double cliquer sur le chiffre  au dessus pour masquer l'onglet correspondant",{"$f":"O11","v":"non"}]
[null,null,null,null,null,null,{"$f":"IFERROR(VLOOKUP(E13,'Tarif de base'!D:E,2,FALSE)*F13,\"\")","v":""},null,null,null,null,null,null,null,{"$f":"O12","v":"non"}]
[null,null,null,null,null,null,{"$f":"IFERROR(VLOOKUP(E14,'Tarif de base'!D:E,2,FALSE)*F14,\"\")","v":""},null,null,null,null,null,null,null,"non"]
[null,null,null,null,null,null,{"$f":"IFERROR(VLOOKUP(E15,'Tarif de base'!D:E,2,FALSE)*F15,\"\")","v":""},null,null,null,null,null,null,null,"non"]
[null,null,null,null,null,null,{"$f":"IFERROR(VLOOKUP(E16,'Tarif de base'!D:E,2,FALSE)*F16,\"\")","v":""},null,null,null,null,null,null,null,"non"]
[null,null,null,null,null,null,{"$f":"SUM(G11:G16)","v":0},null,null,null,null,null,null,null,"non"]
[null,null,null,null,null,null,{"$f":"IFERROR(VLOOKUP(E18,'Tarif de base'!D:E,2,FALSE)*F18,\"\")","v":""},null,null,null,{"$f":"IFERROR(IF(G24-H18-I18-J18<>0,\"Attention il manque \"&G24-H18-I18-J18&\"€\",\"Règlement OK\"),\"Pas de règlement\")","v":"Règlement OK"},null,"non",2,{"$f":"M18","v":"non"}]
[null,null,null,null,null,null,{"$f":"IFERROR(VLOOKUP(E19,'Tarif de base'!D:E,2,FALSE)*F19,\"\")","v":""},null,null,null,null,null,null,null,{"$f":"O18","v":"non"}]
[null,null,null,null,null,null,{"$f":"IFERROR(VLOOKUP(E20,'Tarif de base'!D:E,2,FALSE)*F20,\"\")","v":""},null,null,null,null,null,null,null,{"$f":"O19","v":"non"}]
[null,null,null,null,null,null,{"$f":"IFERROR(VLOOKUP(E21,'Tarif de base'!D:E,2,FALSE)*F21,\"\")","v":""},null,null,null,null,null,null,null,"non"]
[null,null,null,null,null,null,{"$f":"IFERROR(VLOOKUP(E22,'Tarif de base'!D:E,2,FALSE)*F22,\"\")","v":""},null,null,null,null,null,null,null,"non"]
[null,null,null,null,null,null,{"$f":"IFERROR(VLOOKUP(E23,'Tarif de base'!D:E,2,FALSE)*F23,\"\")","v":""},null,null,null,null,null,null,null,"non"]
[null,null,null,null,null,null,{"$f":"SUM(G18:G23)","v":0},null,null,null,null,null,null,null,"non"]
[null,null,null,null,null,null,{"$f":"IFERROR(VLOOKUP(E25,'Tarif de base'!D:E,2,FALSE)*F25,\"\")","v":""},null,null,null,{"$f":"IFERROR(IF(G31-H25-I25-J25<>0,\"Attention il manque \"&G31-H25-I25-J25&\"€\",\"Règlement OK\"),\"Pas de règlement\")","v":"Règlement OK"},null,"non",3,{"$f":"M25","v":"non"}]
[null,null,null,null,null,null,{"$f":"IFERROR(VLOOKUP(E26,'Tarif de base'!D:E,2,FALSE)*F26,\"\")","v":""},null,null,null,null,null,null,null,{"$f":"O25","v":"non"}]
[null,null,null,null,null,null,{"$f":"IFERROR(VLOOKUP(E27,'Tarif de base'!D:E,2,FALSE)*F27,\"\")","v":""},null,null,null,null,null,null,null,{"$f":"O26","v":"non"}]
[null,null,null,null,null,null,{"$f":"IFERROR(VLOOKUP(E28,'Tarif de base'!D:E,2,FALSE)*F28,\"\")","v":""},null,null,null,null,null,null,null,"non"]
[null,null,null,null,null,null,{"$f":"IFERROR(VLOOKUP(E29,'Tarif de base'!D:E,2,FALSE)*F29,\"\")","v":""},null,null,null,null,null,null,null,"non"]
[null,null,null,null,null,null,{"$f":"IFERROR(VLOOKUP(E30,'Tarif de base'!D:E,2,FALSE)*F30,\"\")","v":""},null,null,null,null,null,null,null,"non"]
[null,null,null,null,null,null,{"$f":"SUM(G25:G30)","v":0},null,null,null,null,null,null,null,"non"]
[null,null,null,null,null,null,{"$f":"IFERROR(VLOOKUP(E32,'Tarif de base'!D:E,2,FALSE)*F32,\"\")","v":""},null,null,null,{"$f":"IFERROR(IF(G38-H32-I32-J32<>0,\"Attention il manque \"&G38-H32-I32-J32&\"€\",\"Règlement OK\"),\"Pas de règlement\")","v":"Règlement OK"},null,"non",4,{"$f":"M32","v":"non"}]
[null,null,null,null,null,null,{"$f":"IFERROR(VLOOKUP(E33,'Tarif de base'!D:E,2,FALSE)*F33,\"\")","v":""},null,null,null,null,null,null,null,"non"]
[null,null,null,null,null,null,{"$f":"IFERROR(VLOOKUP(E34,'Tarif de base'!D:E,2,FALSE)*F34,\"\")","v":""},null,null,null,null,null,null,null,"non"]
[null,null,null,null,null,null,{"$f":"IFERROR(VLOOKUP(E35,'Tarif de base'!D:E,2,FALSE)*F35,\"\")","v":""},null,null,null,null,null,null,null,"non"]
[null,null,null,null,null,null,{"$f":"IFERROR(VLOOKUP(E36,'Tarif de base'!D:E,2,FALSE)*F36,\"\")","v":""},null,null,null,null,null,null,null,"non"]
[null,null,null,null,null,null,{"$f":"IFERROR(VLOOKUP(E37,'Tarif de base'!D:E,2,FALSE)*F37,\"\")","v":""},null,null,null,null,null,null,null,"non"]
[null,null,null,null,null,null,{"$f":"SUM(G32:G37)","v":0},null,null,null,null,null,null,null,"non"]
[null,null,null,null,null,null,{"$f":"IFERROR(VLOOKUP(E39,'Tarif de base'!D:E,2,FALSE)*F39,\"\")","v":""},null,null,null,{"$f":"IFERROR(IF(G45-H39-I39-J39<>0,\"Attention il manque \"&G45-H39-I39-J39&\"€\",\"Règlement OK\"),\"Pas de règlement\")","v":"Règlement OK"},null,"non",5,{"$f":"M39","v":"non"}]
[null,null,null,null,null,null,{"$f":"IFERROR(VLOOKUP(E40,'Tarif de base'!D:E,2,FALSE)*F40,\"\")","v":""},null,null,null,null,null,null,null,"non"]
{"$rows_left_out":2211}
{"sheet":"Dégustation Cadeau Casse Perso","index":1,"n_rows":875,"n_cols":9,"rows_kept":875,"cut":false,"hidden":false,"merged":[[2,2,2,8]]}
[]
[]
[null,null,"Information Stock"]
[]
[]
[null,null,"Date","Mois","Action","Client","Désignation","Quantité","Comptabilisé ?"]
[null,null,null,null,null,null,null,null,"non"]
[null,null,null,null,null,null,null,null,"non"]
[null,null,null,null,null,null,null,null,"non"]
[null,null,null,"",null,null,null,null,"non"]
[null,null,null,"",null,null,null,null,"non"]
[null,null,null,"",null,null,null,null,"non"]
[null,null,null,"",null,null,null,null,"non"]
[null,null,null,"",null,null,null,null,"non"]
[null,null,null,"",null,null,null,null,"non"]
[null,null,null,"",null,null,null,null,"non"]
[null,null,null,"",null,null,null,null,"non"]
[null,null,null,"",null,null,null,null,"non"]
[null,null,null,"",null,null,null,null,"non"]
[null,null,null,"",null,null,null,null,"non"]
[null,null,null,"",null,null,null,null,"non"]
[null,null,null,"",null,null,null,null,"non"]
[null,null,null,"",null,null,null,null,"non"]
[null,null,null,"",null,null,null,null,"non"]
[null,null,null,"",null,null,null,null,"non"]
[null,null,null,"",null,null,null,null,"non"]
[null,null,null,"",null,null,null,null,"non"]
[null,null,null,"",null,null,null,null,"non"]
[null,null,null,"",null,null,null,null,"non"]
[null,null,null,"",null,null,null,null,"non"]
[null,null,null,"",null,null,null,null,"non"]
[null,null,null,"",null,null,null,null,"non"]
[null,null,null,"",null,null,null,null,"non"]
[null,null,null,"",null,null,null,null,"non"]
[null,null,null,"",null,null,null,null,"non"]
[null,null,null,"",null,null,null,null,"non"]
[null,null,null,"",null,null,null,null,"non"]
[null,null,null,"",null,null,null,null,"non"]
[null,null,null,"",null,null,null,null,"non"]
[null,null,null,"",null,null,null,null,"non"]
{"$rows_left_out":836}
{"sheet":"Tarif de base","index":2,"n_rows":16,"n_cols":5,"rows_kept":16,"cut":false,"hidden":true,"merged":[]}
["Tarif de base",null,null,"Désignation avec tarif"]
[]
["Produit","Tarif",null,"Tarifs","Colonne1"]
["A.O.C. Côtes de Bourg Rouge 1995",25,null,{"$f":"A4&\" à \"&B4&\" € \"","v":"A.O.C. Côtes de Bourg Rouge 1995 à 25 € "},{"$f":"Tarif[[#This Row],[Tarif]]","v":25}]
["Rouge BP 2003(Fût de Chêne)",6,null,"Rouge BP 2003(Fût de Chêne) à 6 € ",{"$f":"Tarif[[#This Row],[Tarif]]","v":6}]
["Rouge BP 2005",5,null,"Rouge BP 2005 à 5 € ",{"$f":"Tarif[[#This Row],[Tarif]]","v":5}]
["Rouge BP  2005(Fût de Chêne)",6,null,"Rouge BP  2005(Fût de Chêne) à 6 € ",{"$f":"Tarif[[#This Row],[Tarif]]","v":6}]
["A.O.C. Côtes de Bourg Rouge 2007",5,null,"A.O.C. Côtes de Bourg Rouge 2007 à 5 € ",{"$f":"Tarif[[#This Row],[Tarif]]","v":5}]
["A.O.C. Côtes de Bourg Rouge 2012",7,null,"A.O.C. Côtes de Bourg Rouge 2012 à 7 € ",{"$f":"Tarif[[#This Row],[Tarif]]","v":7}]
["A.O.C  Côtes de Bourg Rouge 2014",7,null,"A.O.C  Côtes de Bourg Rouge 2014 à 7 € ",{"$f":"Tarif[[#This Row],[Tarif]]","v":7}]
["Bordeaux Blanc 2015",4,null,"Bordeaux Blanc 2015 à 4 € ",{"$f":"Tarif[[#This Row],[Tarif]]","v":4}]
["Bordeaux Blanc 2016",4,null,"Bordeaux Blanc 2016 à 4 € ",{"$f":"Tarif[[#This Row],[Tarif]]","v":4}]
["Bordeaux Rosé 2015",5,null,"Bordeaux Rosé 2015 à 5 € ",{"$f":"Tarif[[#This Row],[Tarif]]","v":5}]
["Bordeaux Rosé 2017",5,null,"Bordeaux Rosé 2017 à 5 € ",{"$f":"Tarif[[#This Row],[Tarif]]","v":5}]
["Clos Maine G Rouge 2014",4,null,"Clos Maine G Rouge 2014 à 4 € ",{"$f":"Tarif[[#This Row],[Tarif]]","v":4}]
["Bag in Box Bordeaux 5L  Rouge 2016 ",20,null,"Bag in Box Bordeaux 5L  Rouge 2016  à 20 € ",{"$f":"Tarif[[#This Row],[Tarif]]","v":20}]

{"sheet":"formulaire","index":3,"n_rows":8,"n_cols":1,"rows_kept":8,"cut":false,"hidden":true,"merged":[]}
[]
["Action"]
[]
["Dégustation"]
["Cadeau"]
["Vente"]
["Casse"]
["Vol"]