{"text_format":"1","workbook":"xlsx","n_sheets":25,"sheets":["Accueil","BD","PREVI","ABSENCE","HEURE SUP","PRIME","01","02","03","04","05","06","07","08","09","10","11","12","SYNTHESE","INDIVIDUEL","SUVI ACOMPTES","SUIVI ATD","SUIVI TENUES","NOMENCLATURE","CALCUL IJSS"],"not_rendered":{"charts":0,"images":1,"macros":1,"external_links":0,"defined_names":0,"comments":0,"pivot_tables":0},"unopened":[],"bounds":{"document_bytes":16777216,"sheet_cells":100000,"rows_first":2000,"rows_last":500,"rows_between":2000,"halvings":0,"cell_chars":16384,"cell_head_chars":4096},"cells_cut":0,"cells_raw":0,"read":"whole","date_system":"1900"}

{"sheet":"Accueil","index":0,"n_rows":92,"n_cols":3,"rows_kept":92,"cut":false,"hidden":false,"merged":[]}
[null,null,1]
[]
[]
[]
[]
[]
{"$rows_left_out":87}
{"sheet":"BD","index":1,"n_rows":1000,"n_cols":19,"rows_kept":1000,"cut":false,"hidden":false,"merged":[]}
["NOM & PRENOM","SERVICE","CONTRAT","ENTREE","SORTIE","HEURES TRAVAILLEES","HEURES PAYEES","TAUX D'ACTIVITE","PESEE","SALAIRE BRUT","RIS EN %","INDEM TECHNICITE","INDEM PASSAGE","ASSIDUITE","PRIME VOLANTE","MUTUELLE ","PRECARITE","INDEM C.P.","STC"]
["SALARIE 1",1,"CDI",42736,43190,39,35,null,293,{"$f":"IF(Tableau1[[#This Row],[NOM & PRENOM]]=\"\",\"\",VLOOKUP(I2,NOMENCLATURE!$J$6:$L$515,3))","v":1509.75},0.02]
["SALARIE 2",2,"CDD",43374,43404,35,35,null,350,{"$f":"IF(Tableau1[[#This Row],[NOM & PRENOM]]=\"\",\"\",VLOOKUP(I3,NOMENCLATURE!$J$6:$L$515,3))","v":1581},1.4999999999999999E-2]
["SALARIE 3",3,"CDI",42767,null,37,35,null,401,{"$f":"IF(Tableau1[[#This Row],[NOM & PRENOM]]=\"\",\"\",VLOOKUP(I4,NOMENCLATURE!$J$6:$L$515,3))","v":1806.17},0.02]
["SALARIE 4",1,"CDD",43344,43388,35,35,null,530,{"$f":"IF(Tableau1[[#This Row],[NOM & PRENOM]]=\"\",\"\",VLOOKUP(I5,NOMENCLATURE!$J$6:$L$515,3))","v":2387.21},5.0000000000000001E-3]
["SALARIE 5",2,"CDI",42736,null,39,35,null,400,{"$f":"IF(Tableau1[[#This Row],[NOM & PRENOM]]=\"\",\"\",VLOOKUP(I6,NOMENCLATURE!$J$6:$L$515,3))","v":1801.67},0.01]
{"$rows_left_out":995}
{"sheet":"PREVI","index":2,"n_rows":10,"n_cols":431,"rows_kept":10,"cut":false,"hidden":false,"merged":[[6,155,6,185],[6,186,6,215],[6,216,6,246],[6,247,6,277],[6,4,6,34],[6,35,6,65],[6,66,6,93],[6,94,6,124],[6,125,6,154],[6,278,6,307],[6,308,6,338],[6,339,6,368],[6,369,6,399],[6,400,6,430]]}
[{"$f":"DATE(Accueil!C1+2017,1,1)","v":"2018-01-01"}]
[]
[]
[]
[]
[]
{"$rows_left_out":5}
{"sheet":"ABSENCE","index":3,"n_rows":14,"n_cols":431,"rows_kept":14,"cut":false,"hidden":false,"merged":[[9,369,9,399],[9,400,9,430],[9,186,9,215],[9,216,9,246],[9,247,9,277],[9,278,9,307],[9,308,9,338],[9,339,9,368],[9,155,9,185],[9,4,9,34],[9,35,9,65],[9,66,9,93],[9,94,9,124],[9,125,9,154]]}
[{"$f":"DATE(Accueil!C1+2017,1,1)","v":"2018-01-01"}]
[]
[]
[]
["DATE DE RECHERCHE",43194]
[]
{"$rows_left_out":9}
{"sheet":"HEURE SUP","index":4,"n_rows":10,"n_cols":431,"rows_kept":10,"cut":false,"hidden":false,"merged":[[6,369,6,399],[6,400,6,430],[6,186,6,215],[6,216,6,246],[6,247,6,277],[6,278,6,307],[6,308,6,338],[6,339,6,368],[6,155,6,185],[6,4,6,34],[6,35,6,65],[6,66,6,93],[6,94,6,124],[6,125,6,154]]}
[{"$f":"DATE(Accueil!C1+2017,1,1)","v":"2018-01-01"}]
[]
[]
[]
[]
[]
{"$rows_left_out":5}
{"sheet":"PRIME","index":5,"n_rows":10,"n_cols":431,"rows_kept":10,"cut":false,"hidden":false,"merged":[[6,369,6,399],[6,400,6,430],[6,186,6,215],[6,216,6,246],[6,247,6,277],[6,278,6,307],[6,308,6,338],[6,339,6,368],[6,155,6,185],[6,4,6,34],[6,35,6,65],[6,66,6,93],[6,94,6,124],[6,125,6,154]]}
[{"$f":"DATE(Accueil!C1+2017,1,1)","v":"2018-01-01"}]
[]
[]
[]
[]
[]
{"$rows_left_out":5}
{"sheet":"01","index":6,"n_rows":1004,"n_cols":40,"rows_kept":1004,"cut":false,"hidden":false,"merged":[[1,1,2,1],[1,2,2,2],[0,3,2,40]]}
["JANVIER",null,null,{"$f":"\"Période du \"&TEXT(NOMENCLATURE!$E$4,\"jj mmmm aaaa\")&\" au \"&TEXT(NOMENCLATURE!$E$5,\"jj mmmm aaaa\")","v":"Période du 18 décembre 2017 au 21 janvier 2018"}]
[null,"STC",{"$f":"COUNTIF(JANVIER[STC],\"OUI\")","v":0}]
[]
[]
["NOM & PRENOM","SERVICE","CONTRAT","ENTREE","SORTIE","HEURES CONTRAT","SALAIRE DE BASE","R.I.S.","MALADIE","AT  TRAVAIL","AT  TRAJET","ENFANT MALADE","ABSENCE INJUSTIFIEE","C.S.S.","MATERNITE","CONGE PARENTAL","PRIME VOLANTE","INDEMNITE PASSAGE","PRIME CUISINE","PRIME TECHNICITE","PRIME ASSIDUITE","MAINTIENT SALAIRE","PRECARITE","INDEMNITE CP","BRUT","RTT","1/2 RTT","CC","CP","RECUP.","EVENEMENT","FORMATION","MUTUELLE","RTM","IJSS","ACOMPTE","AVANCE","TENUE","STC","NET"]
[null,null,null,null,null,null,{"$f":"VLOOKUP(JANVIER[[#This Row],[NOM & PRENOM]],Tableau1[],10)","v":{"$error":"#N/A"}},{"$f":"VLOOKUP(JANVIER[[#This Row],[NOM & PRENOM]],Tableau1[],11)","v":{"$error":"#N/A"}}]
{"$rows_left_out":999}
{"sheet":"02","index":7,"n_rows":5,"n_cols":40,"rows_kept":5,"cut":false,"hidden":false,"merged":[[0,3,2,40],[1,1,2,1],[1,2,2,2]]}
["FEVRIER",null,null,{"$f":"\"Période du \"&TEXT(NOMENCLATURE!$E$8,\"jj mmmm aaaa\")&\" au \"&TEXT(NOMENCLATURE!$E$9,\"jj mmmm aaaa\")","v":"Période du 22 janvier 2018 au 18 février 2018"}]
[null,"STC",{"$f":"COUNTIF(FEVRIER[STC],\"OUI\")","v":0}]
[]
[]
["NOM & PRENOM","SERVICE","CONTRAT","ENTREE","SORTIE","HEURES CONTRAT","SALAIRE DE BASE","R.I.S.","MALADIE","AT  TRAVAIL","AT  TRAJET","ENFANT MALADE","ABSENCE INJUSTIFIEE","C.S.S.","MATERNITE","CONGE PARENTAL","PRIME VOLANTE","INDEMNITE PASSAGE","PRIME CUISINE","PRIME TECHNICITE","PRIME ASSIDUITE","MAINTIENT SALAIRE","PRECARITE","INDEMNITE CP","BRUT","RTT","1/2 RTT","CC","CP","RECUP.","EVENEMENT","FORMATION","MUTUELLE","RTM","IJSS","ACOMPTE","AVANCE","TENUE","STC","NET"]

{"sheet":"03","index":8,"n_rows":5,"n_cols":40,"rows_kept":5,"cut":false,"hidden":false,"merged":[[0,3,3,40],[1,1,2,1],[1,2,2,2]]}
["MARS",null,null,{"$f":"\"Période du \"&TEXT(NOMENCLATURE!$E$12,\"jj mmmm aaaa\")&\" au \"&TEXT(NOMENCLATURE!$E$13,\"jj mmmm aaaa\")","v":"Période du 19 février 2018 au 25 mars 2018"}]
[null,"STC",{"$f":"COUNTIF(MARS[STC],\"OUI\")","v":0}]
[]
[]
["NOM & PRENOM","SERVICE","CONTRAT","ENTREE","SORTIE","HEURES CONTRAT","SALAIRE DE BASE","R.I.S.","MALADIE","AT  TRAVAIL","AT  TRAJET","ENFANT MALADE","ABSENCE INJUSTIFIEE","C.S.S.","MATERNITE","CONGE PARENTAL","PRIME VOLANTE","INDEMNITE PASSAGE","PRIME CUISINE","PRIME TECHNICITE","PRIME ASSIDUITE","MAINTIENT SALAIRE","PRECARITE","INDEMNITE CP","BRUT","RTT","1/2 RTT","CC","CP","RECUP.","EVENEMENT","FORMATION","MUTUELLE","RTM","IJSS","ACOMPTE","AVANCE","TENUE","STC","NET"]

{"sheet":"04","index":9,"n_rows":7,"n_cols":40,"rows_kept":7,"cut":false,"hidden":false,"merged":[[0,3,2,40],[1,1,2,1],[1,2,2,2]]}
["AVRIL",null,null,{"$f":"\"Période du \"&TEXT(NOMENCLATURE!$E$16,\"jj mmmm aaaa\")&\" au \"&TEXT(NOMENCLATURE!$E$17,\"jj mmmm aaaa\")","v":"Période du 26 mars 2018 au 22 avril 2018"}]
[null,"STC",{"$f":"COUNTIF(AVRIL[STC],\"OUI\")","v":0}]
[]
[]
["NOM & PRENOM","SERVICE","CONTRAT","ENTREE","SORTIE","HEURES CONTRAT","SALAIRE DE BASE","R.I.S.","MALADIE","AT  TRAVAIL","AT  TRAJET","ENFANT MALADE","ABSENCE INJUSTIFIEE","C.S.S.","MATERNITE","CONGE PARENTAL","PRIME VOLANTE","INDEMNITE PASSAGE","PRIME CUISINE","PRIME TECHNICITE","PRIME ASSIDUITE","MAINTIENT SALAIRE","PRECARITE","INDEMNITE CP","BRUT","RTT","1/2 RTT","CC","CP","RECUP.","EVENEMENT","FORMATION","MUTUELLE","RTM","IJSS","ACOMPTE","AVANCE","TENUE","STC","NET"]
[]
{"$rows_left_out":2}
{"sheet":"05","index":10,"n_rows":7,"n_cols":40,"rows_kept":7,"cut":false,"hidden":false,"merged":[[0,3,2,40],[1,1,2,1],[1,2,2,2]]}
["MAI",null,null,{"$f":"\"Période du \"&TEXT(NOMENCLATURE!$E$20,\"jj mmmm aaaa\")&\" au \"&TEXT(NOMENCLATURE!$E$21,\"jj mmmm aaaa\")","v":"Période du 23 avril 2018 au 20 mai 2018"}]
[null,"STC",{"$f":"COUNTIF(MAI[STC],\"OUI\")","v":0}]
[]
[]
["NOM & PRENOM","SERVICE","CONTRAT","ENTREE","SORTIE","HEURES CONTRAT","SALAIRE DE BASE","R.I.S.","MALADIE","AT  TRAVAIL","AT  TRAJET","ENFANT MALADE","ABSENCE INJUSTIFIEE","C.S.S.","MATERNITE","CONGE PARENTAL","PRIME VOLANTE","INDEMNITE PASSAGE","PRIME CUISINE","PRIME TECHNICITE","PRIME ASSIDUITE","MAINTIENT SALAIRE","PRECARITE","INDEMNITE CP","BRUT","RTT","1/2 RTT","CC","CP","RECUP.","EVENEMENT","FORMATION","MUTUELLE","RTM","IJSS","ACOMPTE","AVANCE","TENUE","STC","NET"]
[]
{"$rows_left_out":2}
{"sheet":"06","index":11,"n_rows":7,"n_cols":40,"rows_kept":7,"cut":false,"hidden":false,"merged":[[0,3,2,40],[1,1,2,1],[1,2,2,2]]}
["JUIN",null,null,{"$f":"\"Période du \"&TEXT(NOMENCLATURE!$E$24,\"jj mmmm aaaa\")&\" au \"&TEXT(NOMENCLATURE!$E$25,\"jj mmmm aaaa\")","v":"Période du 21 mai 2018 au 24 juin 2018"}]
[null,"STC",{"$f":"COUNTIF(JUIN[STC],\"OUI\")","v":0}]
[]
[]
["NOM & PRENOM","SERVICE","CONTRAT","ENTREE","SORTIE","HEURES CONTRAT","SALAIRE DE BASE","R.I.S.","MALADIE","AT  TRAVAIL","AT  TRAJET","ENFANT MALADE","ABSENCE INJUSTIFIEE","C.S.S.","MATERNITE","CONGE PARENTAL","PRIME VOLANTE","INDEMNITE PASSAGE","PRIME CUISINE","PRIME TECHNICITE","PRIME ASSIDUITE","MAINTIENT SALAIRE","PRECARITE","INDEMNITE CP","BRUT","RTT","1/2 RTT","CC","CP","RECUP.","EVENEMENT","FORMATION","MUTUELLE","RTM","IJSS","ACOMPTE","AVANCE","TENUE","STC","NET"]
[]
{"$rows_left_out":2}
{"sheet":"07","index":12,"n_rows":7,"n_cols":40,"rows_kept":7,"cut":false,"hidden":false,"merged":[[0,3,2,40],[1,1,2,1],[1,2,2,2]]}
["JUILLET",null,null,{"$f":"\"Période du \"&TEXT(NOMENCLATURE!$H$4,\"jj mmmm aaaa\")&\" au \"&TEXT(NOMENCLATURE!$H$5,\"jj mmmm aaaa\")","v":"Période du 25 juin 2018 au 22 juillet 2018"}]
[null,"STC",{"$f":"COUNTIF(JUILLET[STC],\"OUI\")","v":0}]
[]
[]
["NOM & PRENOM","SERVICE","CONTRAT","ENTREE","SORTIE","HEURES CONTRAT","SALAIRE DE BASE","R.I.S.","MALADIE","AT  TRAVAIL","AT  TRAJET","ENFANT MALADE","ABSENCE INJUSTIFIEE","C.S.S.","MATERNITE","CONGE PARENTAL","PRIME VOLANTE","INDEMNITE PASSAGE","PRIME CUISINE","PRIME TECHNICITE","PRIME ASSIDUITE","MAINTIENT SALAIRE","PRECARITE","INDEMNITE CP","BRUT","RTT","1/2 RTT","CC","CP","RECUP.","EVENEMENT","FORMATION","MUTUELLE","RTM","IJSS","ACOMPTE","AVANCE","TENUE","STC","NET"]
[]
{"$rows_left_out":2}
{"sheet":"08","index":13,"n_rows":7,"n_cols":40,"rows_kept":7,"cut":false,"hidden":false,"merged":[[0,3,2,40],[1,1,2,1],[1,2,2,2]]}
["AOUT",null,null,{"$f":"\"Période du \"&TEXT(NOMENCLATURE!$H$8,\"jj mmmm aaaa\")&\" au \"&TEXT(NOMENCLATURE!$H$9,\"jj mmmm aaaa\")","v":"Période du 23 juillet 2018 au 26 août 2018"}]
[null,"STC",{"$f":"COUNTIF(AOUT[STC],\"OUI\")","v":0}]
[]
[]
["NOM & PRENOM","SERVICE","CONTRAT","ENTREE","SORTIE","HEURES CONTRAT","SALAIRE DE BASE","R.I.S.","MALADIE","AT  TRAVAIL","AT  TRAJET","ENFANT MALADE","ABSENCE INJUSTIFIEE","C.S.S.","MATERNITE","CONGE PARENTAL","PRIME VOLANTE","INDEMNITE PASSAGE","PRIME CUISINE","PRIME TECHNICITE","PRIME ASSIDUITE","MAINTIENT SALAIRE","PRECARITE","INDEMNITE CP","BRUT","RTT","1/2 RTT","CC","CP","RECUP.","EVENEMENT","FORMATION","MUTUELLE","RTM","IJSS","ACOMPTE","AVANCE","TENUE","STC","NET"]
[]
{"$rows_left_out":2}
{"sheet":"09","index":14,"n_rows":7,"n_cols":40,"rows_kept":7,"cut":false,"hidden":false,"merged":[[0,3,2,40],[1,1,2,1],[1,2,2,2]]}
["SEPTEMBRE",null,null,{"$f":"\"Période du \"&TEXT(NOMENCLATURE!$H$12,\"jj mmmm aaaa\")&\" au \"&TEXT(NOMENCLATURE!$H$13,\"jj mmmm aaaa\")","v":"Période du 27 août 2018 au 23 septembre 2018"}]
[null,"STC",{"$f":"COUNTIF(SEPTEMBRE[STC],\"OUI\")","v":0}]
[]
[]
["NOM & PRENOM","SERVICE","CONTRAT","ENTREE","SORTIE","HEURES CONTRAT","SALAIRE DE BASE","R.I.S.","MALADIE","AT  TRAVAIL","AT  TRAJET","ENFANT MALADE","ABSENCE INJUSTIFIEE","C.S.S.","MATERNITE","CONGE PARENTAL","PRIME VOLANTE","INDEMNITE PASSAGE","PRIME CUISINE","PRIME TECHNICITE","PRIME ASSIDUITE","MAINTIENT SALAIRE","PRECARITE","INDEMNITE CP","BRUT","RTT","1/2 RTT","CC","CP","RECUP.","EVENEMENT","FORMATION","MUTUELLE","RTM","IJSS","ACOMPTE","AVANCE","TENUE","STC","NET"]
[]
{"$rows_left_out":2}
{"sheet":"10","index":15,"n_rows":7,"n_cols":40,"rows_kept":7,"cut":false,"hidden":false,"merged":[[0,3,2,40],[1,1,2,1],[1,2,2,2]]}
["OCTOBRE",null,null,{"$f":"\"Période du \"&TEXT(NOMENCLATURE!$H$16,\"jj mmmm aaaa\")&\" au \"&TEXT(NOMENCLATURE!$H$17,\"jj mmmm aaaa\")","v":"Période du 24 septembre 2018 au 21 octobre 2018"}]
[null,"STC",{"$f":"COUNTIF(OCTOBRE[STC],\"OUI\")","v":0}]
[]
[]
["NOM & PRENOM","SERVICE","CONTRAT","ENTREE","SORTIE","HEURES CONTRAT","SALAIRE DE BASE","R.I.S.","MALADIE","AT  TRAVAIL","AT  TRAJET","ENFANT MALADE","ABSENCE INJUSTIFIEE","C.S.S.","MATERNITE","CONGE PARENTAL","PRIME VOLANTE","INDEMNITE PASSAGE","PRIME CUISINE","PRIME TECHNICITE","PRIME ASSIDUITE","MAINTIENT SALAIRE","PRECARITE","INDEMNITE CP","BRUT","RTT","1/2 RTT","CC","CP","RECUP.","EVENEMENT","FORMATION","MUTUELLE","RTM","IJSS","ACOMPTE","AVANCE","TENUE","STC","NET"]
[]
{"$rows_left_out":2}
{"sheet":"11","index":16,"n_rows":7,"n_cols":40,"rows_kept":7,"cut":false,"hidden":false,"merged":[[0,3,2,40],[1,1,2,1],[1,2,2,2]]}
["NOVEMBRE",null,null,{"$f":"\"Période du \"&TEXT(NOMENCLATURE!$H$20,\"jj mmmm aaaa\")&\" au \"&TEXT(NOMENCLATURE!$H$21,\"jj mmmm aaaa\")","v":"Période du 22 octobre 2018 au 18 novembre 2018"}]
[null,"STC",{"$f":"COUNTIF(NOVEMBRE[STC],\"OUI\")","v":0}]
[]
[]
["NOM & PRENOM","SERVICE","CONTRAT","ENTREE","SORTIE","HEURES CONTRAT","SALAIRE DE BASE","R.I.S.","MALADIE","AT  TRAVAIL","AT  TRAJET","ENFANT MALADE","ABSENCE INJUSTIFIEE","C.S.S.","MATERNITE","CONGE PARENTAL","PRIME VOLANTE","INDEMNITE PASSAGE","PRIME CUISINE","PRIME TECHNICITE","PRIME ASSIDUITE","MAINTIENT SALAIRE","PRECARITE","INDEMNITE CP","BRUT","RTT","1/2 RTT","CC","CP","RECUP.","EVENEMENT","FORMATION","MUTUELLE","RTM","IJSS","ACOMPTE","AVANCE","TENUE","STC","NET"]
[]
{"$rows_left_out":2}
{"sheet":"12","index":17,"n_rows":7,"n_cols":40,"rows_kept":7,"cut":false,"hidden":false,"merged":[[0,3,2,40],[1,1,2,1],[1,2,2,2]]}
["DECEMBRE",null,null,{"$f":"\"Période du \"&TEXT(NOMENCLATURE!$H$24,\"jj mmmm aaaa\")&\" au \"&TEXT(NOMENCLATURE!$H$25,\"jj mmmm aaaa\")","v":"Période du 19 novembre 2018 au 16 décembre 2018"}]
[null,"STC",{"$f":"COUNTIF(DECEMBRE[STC],\"OUI\")","v":0}]
[]
[]
["NOM & PRENOM","SERVICE","CONTRAT","ENTREE","SORTIE","HEURES CONTRAT","SALAIRE DE BASE","R.I.S.","MALADIE","AT  TRAVAIL","AT  TRAJET","ENFANT MALADE","ABSENCE INJUSTIFIEE","C.S.S.","MATERNITE","CONGE PARENTAL","PRIME VOLANTE","INDEMNITE PASSAGE","PRIME CUISINE","PRIME TECHNICITE","PRIME ASSIDUITE","MAINTIENT SALAIRE","PRECARITE","INDEMNITE CP","BRUT","RTT","1/2 RTT","CC","CP","RECUP.","EVENEMENT","FORMATION","MUTUELLE","RTM","IJSS","ACOMPTE","AVANCE","TENUE","STC","NET"]
[]
{"$rows_left_out":2}
{"sheet":"SYNTHESE","index":18,"n_rows":6,"n_cols":25,"rows_kept":6,"cut":false,"hidden":false,"merged":[[0,1,2,24],[4,18,4,24],[4,1,4,4],[4,13,4,15],[4,5,4,8],[4,9,4,12]]}
[null,"SYNTHESE ANNUELLE "]
[]
[]
[]
[null,"Informations salariés",null,null,null,"RTT",null,null,null,"CC",null,null,null,"Congés payés",null,null,"Récupération","Congés sans solde ou\nAbs. Conv. Perso","Absences diverses"]
["Colonne1","Nom prénom","Service","Date entrée","Date Sortie","Acquis","Travaillé","Pris","Restants","Acquis2","Travaillé3","Pris4","Restants5","Acquis6","Pris7","Restants\nau 31/05","Pris8","Nb de jours","Maladie","AT Travail","AT trajet","Mater / Pater","Parental","Autre absence","Formation"]
{"$rows_left_out":1}
{"sheet":"INDIVIDUEL","index":19,"n_rows":54,"n_cols":23,"rows_kept":54,"cut":false,"hidden":false,"merged":[[11,7,11,17],[12,7,12,10],[12,11,12,14],[12,15,12,17],[0,4,1,23],[6,5,6,23],[22,0,22,1],[22,18,22,19],[22,20,22,21],[22,22,22,23],[20,0,20,23],[22,2,22,3],[22,4,22,5],[22,14,22,15],[22,16,22,17],[22,6,22,7],[22,8,22,9],[22,10,22,11],[22,12,22,13]]}
[null,null,null,null,"SYNTHESE INDIVIDUELLE - RTT / CC / CP "]
[]
[]
[]
[]
[]
{"$rows_left_out":49}
{"sheet":"SUVI ACOMPTES","index":20,"n_rows":4,"n_cols":14,"rows_kept":4,"cut":false,"hidden":false,"merged":[]}
[]
[null,null,{"$f":"+COUNTIF(ACOMPTE[JANVIER],\">0\")","v":0},{"$f":"+COUNTIF(ACOMPTE[FEVRIER],\">0\")","v":0},{"$f":"+COUNTIF(ACOMPTE[MARS],\">0\")","v":0},{"$f":"+COUNTIF(ACOMPTE[AVRIL],\">0\")","v":0},{"$f":"+COUNTIF(ACOMPTE[MAI],\">0\")","v":0},{"$f":"+COUNTIF(ACOMPTE[JUIN],\">0\")","v":0},{"$f":"+COUNTIF(ACOMPTE[JUILLET],\">0\")","v":0},{"$f":"+COUNTIF(ACOMPTE[AOUT],\">0\")","v":0},{"$f":"+COUNTIF(ACOMPTE[SEPTEMBRE],\">0\")","v":0},{"$f":"+COUNTIF(ACOMPTE[OCTOBRE],\">0\")","v":0},{"$f":"+COUNTIF(ACOMPTE[NOVEMBRE],\">0\")","v":0},{"$f":"+COUNTIF(ACOMPTE[DECEMBRE],\">0\")","v":0}]
[]
["SALARIES","SERVICE","JANVIER","FEVRIER","MARS","AVRIL","MAI","JUIN","JUILLET","AOUT","SEPTEMBRE","OCTOBRE","NOVEMBRE","DECEMBRE"]

{"sheet":"SUIVI ATD","index":21,"n_rows":4,"n_cols":16,"rows_kept":4,"cut":false,"hidden":false,"merged":[]}
[]
[null,null,null,null,{"$f":"+COUNTIF(ATD[JANVIER],\">0\")","v":0},{"$f":"+COUNTIF(ATD[FEVRIER],\">0\")","v":0},{"$f":"+COUNTIF(ATD[MARS],\">0\")","v":0},{"$f":"+COUNTIF(ATD[AVRIL],\">0\")","v":0},{"$f":"+COUNTIF(ATD[MAI],\">0\")","v":0},{"$f":"+COUNTIF(ATD[JUIN],\">0\")","v":0},{"$f":"+COUNTIF(ATD[JUILLET],\">0\")","v":0},{"$f":"+COUNTIF(ATD[AOUT],\">0\")","v":0},{"$f":"+COUNTIF(ATD[SEPTEMBRE],\">0\")","v":0},{"$f":"+COUNTIF(ATD[OCTOBRE],\">0\")","v":0},{"$f":"+COUNTIF(ATD[NOVEMBRE],\">0\")","v":0},{"$f":"+COUNTIF(ATD[DECEMBRE],\">0\")","v":0}]
[]
["SALARIES","SERVICE","debut","fin","JANVIER","FEVRIER","MARS","AVRIL","MAI","JUIN","JUILLET","AOUT","SEPTEMBRE","OCTOBRE","NOVEMBRE","DECEMBRE"]

{"sheet":"SUIVI TENUES","index":22,"n_rows":5,"n_cols":6,"rows_kept":5,"cut":false,"hidden":false,"merged":[]}
[]
[]
[null,null,{"$f":"+COUNTIF(TENUE[SEPTEMBRE],\">0\")","v":0},{"$f":"+COUNTIF(TENUE[OCTOBRE],\">0\")","v":0},{"$f":"+COUNTIF(TENUE[NOVEMBRE],\">0\")","v":0},{"$f":"+COUNTIF(TENUE[DECEMBRE],\">0\")","v":0}]
[]
["SALARIES","SERVICE","SEPTEMBRE","OCTOBRE","NOVEMBRE","DECEMBRE"]

{"sheet":"NOMENCLATURE","index":23,"n_rows":515,"n_cols":16,"rows_kept":515,"cut":false,"hidden":false,"merged":[[10,13,10,14],[4,13,4,15],[5,13,5,14],[6,13,6,14],[7,13,7,14],[8,13,8,14],[3,9,3,10],[0,13,0,14],[0,3,0,7],[22,3,22,4],[2,6,2,7],[6,6,6,7],[10,6,10,7],[14,6,14,7],[18,6,18,7],[22,6,22,7],[2,3,2,4],[6,3,6,4],[10,3,10,4],[14,3,14,4],[18,3,18,4],[9,13,9,14]]}
["Année",{"$f":"Accueil!$C$1+2017","v":2018},null,"PERIODE",null,null,null,null,null,"REVENUE MINIMUM DE BRANCHE",null,null,null,"SMIC",null,1498.5]
[]
["1er Janvier",{"$f":"DATE($B$1,1,1)","v":"2018-01-01"},null,"JANVIER",null,null,"JUILLET",null,null,null,null,null,null,null,null,{"$f":"+P1/151.67","v":9.8800000000000008}]
["Pâques",{"$f":"ROUND(DATE($B$1,4,MOD(234-11*MOD($B$1,19),30))/7,)*7-6","v":"2018-04-01"},null,"DU",43087,null,"DU",{"$f":"$E$25+1","v":43276},null,"VALEUR DU POINT",null,54.05]
["Lundi de Pâques",{"$f":"B4+1","v":"2018-04-02"},null,"AU",43121,null,"AU",43303,null,null,null,null,null,"PLAFOND S.S."]
["1er Mai",{"$f":"DATE($B$1,5,1)","v":"2018-05-01"},null,null,null,null,null,null,null,"COEF","SALAIRE ANNUEL","SALAIRE MENSUEL",null,"ANNEE",null,39732]
{"$rows_left_out":510}
{"sheet":"CALCUL IJSS","index":24,"n_rows":22,"n_cols":11,"rows_kept":22,"cut":false,"hidden":false,"merged":[[21,1,21,3],[27,1,27,3],[28,1,28,3],[13,1,13,3],[14,1,14,3],[16,1,16,3],[19,1,19,3],[17,1,17,3],[18,1,18,3],[20,1,20,3],[12,1,12,3],[15,1,15,3],[4,1,4,4],[9,1,9,3],[10,1,10,3],[11,1,11,3],[8,1,8,2],[18,6,18,7],[19,6,19,7],[20,6,20,7],[4,6,4,9],[9,6,9,7],[10,6,10,7],[16,6,16,7],[17,6,17,7],[15,6,15,7],[11,6,11,7],[12,6,12,7],[13,6,13,7],[14,6,14,7],[8,6,8,7]]}
[]
["SMIC",{"$f":"+NOMENCLATURE!P1","v":1498.5},{"$f":"+NOMENCLATURE!P3","v":9.8800000000000008},null,null,null,"PLAFOND ACCIDENT TRAVAIL","< 29 JOURS",198.81,">  28 JOURS",265.08999999999997]
[]
[]
[null,"MALADIE",null,null,null,null,"ACCIDENT TRAVAIL"]
[]
{"$rows_left_out":16}