{"text_format":"1","workbook":"xlsx","n_sheets":3,"sheets":["Application","Tarif de base","formulaire"],"not_rendered":{"charts":0,"images":1,"macros":1,"external_links":1,"defined_names":2,"comments":0,"pivot_tables":0},"unopened":[],"bounds":{"document_bytes":16777216,"sheet_cells":100000,"rows_first":2000,"rows_last":500,"rows_between":2000,"halvings":0,"cell_chars":16384,"cell_head_chars":4096},"cells_cut":0,"cells_raw":0,"read":"whole","date_system":"1900"}

{"sheet":"Application","index":0,"n_rows":2250,"n_cols":14,"rows_kept":2250,"cut":false,"hidden":false,"merged":[[2243,9,2249,9],[2243,10,2249,10],[2243,11,2249,11],[2243,12,2249,12],[2243,13,2249,13],[2243,0,2249,0],[2243,2,2249,2],[2243,3,2249,3],[2243,7,2249,7],[2243,8,2249,8],[2236,9,2242,9],[2236,10,2242,10],[2236,11,2242,11],[2236,12,2242,12],[2236,13,2242,13],[2236,0,2242,0],[2236,2,2242,2],[2236,3,2242,3],[2236,7,2242,7],[2236,8,2242,8],[2229,9,2235,9],[2229,10,2235,10],[2229,11,2235,11],[2229,12,2235,12],[2229,13,2235,13],[2229,0,2235,0],[2229,2,2235,2],[2229,3,2235,3],[2229,7,2235,7],[2229,8,2235,8],[2222,9,2228,9],[2222,10,2228,10],[2222,11,2228,11],[2222,12,2228,12],[2222,13,2228,13],[2222,0,2228,0],[2222,2,2228,2],[2222,3,2228,3],[2222,7,2228,7],[2222,8,2228,8],[2215,9,2221,9],[2215,10,2221,10],[2215,11,2221,11],[2215,12,2221,12],[2215,13,2221,13],[2215,0,2221,0],[2215,2,2221,2],[2215,3,2221,3],[2215,7,2221,7],[2215,8,2221,8],[2208,9,2214,9],[2208,10,2214,10],[2208,11,2214,11],[2208,12,2214,12],[2208,13,2214,13],[2208,0,2214,0],[2208,2,2214,2],[2208,3,2214,3],[2208,7,2214,7],[2208,8,2214,8],[2201,9,2207,9],[2201,10,2207,10],[2201,11,2207,11],[2201,12,2207,12],[2201,13,2207,13],[2201,0,2207,0],[2201,2,2207,2],[2201,3,2207,3],[2201,7,2207,7],[2201,8,2207,8],[2194,9,2200,9],[2194,10,2200,10],[2194,11,2200,11],[2194,12,2200,12],[2194,13,2200,13],[2194,0,2200,0],[2194,2,2200,2],[2194,3,2200,3],[2194,7,2200,7],[2194,8,2200,8],[2187,9,2193,9],[2187,10,2193,10],[2187,11,2193,11],[2187,12,2193,12],[2187,13,2193,13],[2187,0,2193,0],[2187,2,2193,2],[2187,3,2193,3],[2187,7,2193,7],[2187,8,2193,8],[2180,9,2186,9],[2180,10,2186,10],[2180,11,2186,11],[2180,12,2186,12],[2180,13,2186,13],[2180,0,2186,0],[2180,2,2186,2],[2180,3,2186,3],[2180,7,2186,7],[2180,8,2186,8],[2173,9,2179,9],[2173,10,2179,10],[2173,11,2179,11],[2173,12,2179,12],[2173,13,2179,13],[2173,0,2179,0],[2173,2,2179,2],[2173,3,2179,3],[2173,7,2179,7],[2173,8,2179,8],[2166,9,2172,9],[2166,10,2172,10],[2166,11,2172,11],[2166,12,2172,12],[2166,13,2172,13],[2166,0,2172,0],[2166,2,2172,2],[2166,3,2172,3],[2166,7,2172,7],[2166,8,2172,8],[2159,9,2165,9],[2159,10,2165,10],[2159,11,2165,11],[2159,12,2165,12],[2159,13,2165,13],[2159,0,2165,0],[2159,2,2165,2],[2159,3,2165,3],[2159,7,2165,7],[2159,8,2165,8],[2152,9,2158,9],[2152,10,2158,10],[2152,11,2158,11],[2152,12,2158,12],[2152,13,2158,13],[2152,0,2158,0],[2152,2,2158,2],[2152,3,2158,3],[2152,7,2158,7],[2152,8,2158,8],[2145,9,2151,9],[2145,10,2151,10],[2145,11,2151,11],[2145,12,2151,12],[2145,13,2151,13],[2145,0,2151,0],[2145,2,2151,2],[2145,3,2151,3],[2145,7,2151,7],[2145,8,2151,8],[2138,9,2144,9],[2138,10,2144,10],[2138,11,2144,11],[2138,12,2144,12],[2138,13,2144,13],[2138,0,2144,0],[2138,2,2144,2],[2138,3,2144,3],[2138,7,2144,7],[2138,8,2144,8],[2131,9,2137,9],[2131,10,2137,10],[2131,11,2137,11],[2131,12,2137,12],[2131,13,2137,13],[2131,0,2137,0],[2131,2,2137,2],[2131,3,2137,3],[2131,7,2137,7],[2131,8,2137,8],[2124,9,2130,9],[2124,10,2130,10],[2124,11,2130,11],[2124,12,2130,12],[2124,13,2130,13],[2124,0,2130,0],[2124,2,2130,2],[2124,3,2130,3],[2124,7,2130,7],[2124,8,2130,8],[2117,9,2123,9],[2117,10,2123,10],[2117,11,2123,11],[2117,12,2123,12],[2117,13,2123,13],[2117,0,2123,0],[2117,2,2123,2],[2117,3,2123,3],[2117,7,2123,7],[2117,8,2123,8],[2110,9,2116,9],[2110,10,2116,10],[2110,11,2116,11],[2110,12,2116,12],[2110,13,2116,13],[2110,0,2116,0],[2110,2,2116,2],[2110,3,2116,3],[2110,7,2116,7],[2110,8,2116,8],[2103,9,2109,9],[2103,10,2109,10],[2103,11,2109,11],[2103,12,2109,12],[2103,13,2109,13],[2103,0,2109,0],[2103,2,2109,2],[2103,3,2109,3],[2103,7,2109,7],[2103,8,2109,8],[2096,9,2102,9],[2096,10,2102,10],[2096,11,2102,11],[2096,12,2102,12],[2096,13,2102,13],[2096,0,2102,0],[2096,2,2102,2],[2096,3,2102,3],[2096,7,2102,7],[2096,8,2102,8],[2089,9,2095,9],[2089,10,2095,10],[2089,11,2095,11],[2089,12,2095,12],[2089,13,2095,13],[2089,0,2095,0],[2089,2,2095,2],[2089,3,2095,3],[2089,7,2095,7],[2089,8,2095,8],[2082,9,2088,9],[2082,10,2088,10],[2082,11,2088,11],[2082,12,2088,12],[2082,13,2088,13],[2082,0,2088,0],[2082,2,2088,2],[2082,3,2088,3],[2082,7,2088,7],[2082,8,2088,8],[2075,9,2081,9],[2075,10,2081,10],[2075,11,2081,11],[2075,12,2081,12],[2075,13,2081,13],[2075,0,2081,0],[2075,2,2081,2],[2075,3,2081,3],[2075,7,2081,7],[2075,8,2081,8],[2068,9,2074,9],[2068,10,2074,10],[2068,11,2074,11],[2068,12,2074,12],[2068,13,2074,13],[2068,0,2074,0],[2068,2,2074,2],[2068,3,2074,3],[2068,7,2074,7],[2068,8,2074,8],[2061,9,2067,9],[2061,10,2067,10],[2061,11,2067,11],[2061,12,2067,12],[2061,13,2067,13],[2061,0,2067,0],[2061,2,2067,2],[2061,3,2067,3],[2061,7,2067,7],[2061,8,2067,8],[2054,9,2060,9],[2054,10,2060,10],[2054,11,2060,11],[2054,12,2060,12],[2054,13,2060,13],[2054,0,2060,0],[2054,2,2060,2],[2054,3,2060,3],[2054,7,2060,7],[2054,8,2060,8],[2047,9,2053,9],[2047,10,2053,10],[2047,11,2053,11],[2047,12,2053,12],[2047,13,2053,13],[2047,0,2053,0],[2047,2,2053,2],[2047,3,2053,3],[2047,7,2053,7],[2047,8,2053,8],[2040,9,2046,9],[2040,10,2046,10],[2040,11,2046,11],[2040,12,2046,12],[2040,13,2046,13],[2040,0,2046,0],[2040,2,2046,2],[2040,3,2046,3],[2040,7,2046,7],[2040,8,2046,8],[2033,9,2039,9],[2033,10,2039,10],[2033,11,2039,11],[2033,12,2039,12],[2033,13,2039,13],[2033,0,2039,0],[2033,2,2039,2],[2033,3,2039,3],[2033,7,2039,7],[2033,8,2039,8],[2026,9,2032,9],[2026,10,2032,10],[2026,11,2032,11],[2026,12,2032,12],[2026,13,2032,13],[2026,0,2032,0],[2026,2,2032,2],[2026,3,2032,3],[2026,7,2032,7],[2026,8,2032,8],[2019,9,2025,9],[2019,10,2025,10],[2019,11,2025,11],[2019,12,2025,12],[2019,13,2025,13],[2019,0,2025,0],[2019,2,2025,2],[2019,3,2025,3],[2019,7,2025,7],[2019,8,2025,8],[2012,9,2018,9],[2012,10,2018,10],[2012,11,2018,11],[2012,12,2018,12],[2012,13,2018,13],[2012,0,2018,0],[2012,2,2018,2],[2012,3,2018,3],[2012,7,2018,7],[2012,8,2018,8],[2005,9,2011,9],[2005,10,2011,10],[2005,11,2011,11],[2005,12,2011,12],[2005,13,2011,13],[2005,0,2011,0],[2005,2,2011,2],[2005,3,2011,3],[2005,7,2011,7],[2005,8,2011,8],[1998,9,2004,9],[1998,10,2004,10],[1998,11,2004,11],[1998,12,2004,12],[1998,13,2004,13],[1998,0,2004,0],[1998,2,2004,2],[1998,3,2004,3],[1998,7,2004,7],[1998,8,2004,8],[1991,9,1997,9],[1991,10,1997,10],[1991,11,1997,11],[1991,12,1997,12],[1991,13,1997,13],[1991,0,1997,0],[1991,2,1997,2],[1991,3,1997,3],[1991,7,1997,7],[1991,8,1997,8],[1984,9,1990,9],[1984,10,1990,10],[1984,11,1990,11],[1984,12,1990,12],[1984,13,1990,13],[1984,0,1990,0],[1984,2,1990,2],[1984,3,1990,3],[1984,7,1990,7],[1984,8,1990,8],[1977,9,1983,9],[1977,10,1983,10],[1977,11,1983,11],[1977,12,1983,12],[1977,13,1983,13],[1977,0,1983,0],[1977,2,1983,2],[1977,3,1983,3],[1977,7,1983,7],[1977,8,1983,8],[1970,9,1976,9],[1970,10,1976,10],[1970,11,1976,11],[1970,12,1976,12],[1970,13,1976,13],[1970,0,1976,0],[1970,2,1976,2],[1970,3,1976,3],[1970,7,1976,7],[1970,8,1976,8],[1963,9,1969,9],[1963,10,1969,10],[1963,11,1969,11],[1963,12,1969,12],[1963,13,1969,13],[1963,0,1969,0],[1963,2,1969,2],[1963,3,1969,3],[1963,7,1969,7],[1963,8,1969,8],[1956,9,1962,9],[1956,10,1962,10],[1956,11,1962,11],[1956,12,1962,12],[1956,13,1962,13],[1956,0,1962,0],[1956,2,1962,2],[1956,3,1962,3],[1956,7,1962,7],[1956,8,1962,8],[1949,9,1955,9],[1949,10,1955,10],[1949,11,1955,11],[1949,12,1955,12],[1949,13,1955,13],[1949,0,1955,0],[1949,2,1955,2],[1949,3,1955,3],[1949,7,1955,7],[1949,8,1955,8],[1942,9,1948,9],[1942,10,1948,10],[1942,11,1948,11],[1942,12,1948,12],[1942,13,1948,13],[1942,0,1948,0],[1942,2,1948,2],[1942,3,1948,3],[1942,7,1948,7],[1942,8,1948,8],[1935,9,1941,9],[1935,10,1941,10],[1935,11,1941,11],[1935,12,1941,12],[1935,13,1941,13],[1935,0,1941,0],[1935,2,1941,2],[1935,3,1941,3],[1935,7,1941,7],[1935,8,1941,8],[1928,9,1934,9],[1928,10,1934,10],[1928,11,1934,11],[1928,12,1934,12],[1928,13,1934,13],[1928,0,1934,0],[1928,2,1934,2],[1928,3,1934,3],[1928,7,1934,7],[1928,8,1934,8],[1921,9,1927,9],[1921,10,1927,10],[1921,11,1927,11],[1921,12,1927,12],[1921,13,1927,13],[1921,0,1927,0],[1921,2,1927,2],[1921,3,1927,3],[1921,7,1927,7],[1921,8,1927,8],[1914,9,1920,9],[1914,10,1920,10],[1914,11,1920,11],[1914,12,1920,12],[1914,13,1920,13],[1914,0,1920,0],[1914,2,1920,2],[1914,3,1920,3],[1914,7,1920,7],[1914,8,1920,8],[1907,9,1913,9],[1907,10,1913,10],[1907,11,1913,11],[1907,12,1913,12],[1907,13,1913,13],[1907,0,1913,0],[1907,2,1913,2],[1907,3,1913,3],[1907,7,1913,7],[1907,8,1913,8],[1900,9,1906,9],[1900,10,1906,10],[1900,11,1906,11],[1900,12,1906,12],[1900,13,1906,13],[1900,0,1906,0],[1900,2,1906,2],[1900,3,1906,3],[1900,7,1906,7],[1900,8,1906,8],[1893,9,1899,9],[1893,10,1899,10],[1893,11,1899,11],[1893,12,1899,12],[1893,13,1899,13],[1893,0,1899,0],[1893,2,1899,2],[1893,3,1899,3],[1893,7,1899,7],[1893,8,1899,8],[1886,9,1892,9],[1886,10,1892,10],[1886,11,1892,11],[1886,12,1892,12],[1886,13,1892,13],[1886,0,1892,0],[1886,2,1892,2],[1886,3,1892,3],[1886,7,1892,7],[1886,8,1892,8],[1879,9,1885,9],[1879,10,1885,10],[1879,11,1885,11],[1879,12,1885,12],[1879,13,1885,13],[1879,0,1885,0],[1879,2,1885,2],[1879,3,1885,3],[1879,7,1885,7],[1879,8,1885,8],[1872,9,1878,9],[1872,10,1878,10],[1872,11,1878,11],[1872,12,1878,12],[1872,13,1878,13],[1872,0,1878,0],[1872,2,1878,2],[1872,3,1878,3],[1872,7,1878,7],[1872,8,1878,8],[1865,9,1871,9],[1865,10,1871,10],[1865,11,1871,11],[1865,12,1871,12],[1865,13,1871,13],[1865,0,1871,0],[1865,2,1871,2],[1865,3,1871,3],[1865,7,1871,7],[1865,8,1871,8],[1858,9,1864,9],[1858,10,1864,10],[1858,11,1864,11],[1858,12,1864,12],[1858,13,1864,13],[1858,0,1864,0],[1858,2,1864,2],[1858,3,1864,3],[1858,7,1864,7],[1858,8,1864,8],[1851,9,1857,9],[1851,10,1857,10],[1851,11,1857,11],[1851,12,1857,12],[1851,13,1857,13],[1851,0,1857,0],[1851,2,1857,2],[1851,3,1857,3],[1851,7,1857,7],[1851,8,1857,8],[1844,9,1850,9],[1844,10,1850,10],[1844,11,1850,11],[1844,12,1850,12],[1844,13,1850,13],[1844,0,1850,0],[1844,2,1850,2],[1844,3,1850,3],[1844,7,1850,7],[1844,8,1850,8],[1837,9,1843,9],[1837,10,1843,10],[1837,11,1843,11],[1837,12,1843,12],[1837,13,1843,13],[1837,0,1843,0],[1837,2,1843,2],[1837,3,1843,3],[1837,7,1843,7],[1837,8,1843,8],[1830,9,1836,9],[1830,10,1836,10],[1830,11,1836,11],[1830,12,1836,12],[1830,13,1836,13],[1830,0,1836,0],[1830,2,1836,2],[1830,3,1836,3],[1830,7,1836,7],[1830,8,1836,8],[1823,9,1829,9],[1823,10,1829,10],[1823,11,1829,11],[1823,12,1829,12],[1823,13,1829,13],[1823,0,1829,0],[1823,2,1829,2],[1823,3,1829,3],[1823,7,1829,7],[1823,8,1829,8],[1816,9,1822,9],[1816,10,1822,10],[1816,11,1822,11],[1816,12,1822,12],[1816,13,1822,13],[1816,0,1822,0],[1816,2,1822,2],[1816,3,1822,3],[1816,7,1822,7],[1816,8,1822,8],[1809,9,1815,9],[1809,10,1815,10],[1809,11,1815,11],[1809,12,1815,12],[1809,13,1815,13],[1809,0,1815,0],[1809,2,1815,2],[1809,3,1815,3],[1809,7,1815,7],[1809,8,1815,8],[1802,9,1808,9],[1802,10,1808,10],[1802,11,1808,11],[1802,12,1808,12],[1802,13,1808,13],[1802,0,1808,0],[1802,2,1808,2],[1802,3,1808,3],[1802,7,1808,7],[1802,8,1808,8],[1795,9,1801,9],[1795,10,1801,10],[1795,11,1801,11],[1795,12,1801,12],[1795,13,1801,13],[1795,0,1801,0],[1795,2,1801,2],[1795,3,1801,3],[1795,7,1801,7],[1795,8,1801,8],[1788,9,1794,9],[1788,10,1794,10],[1788,11,1794,11],[1788,12,1794,12],[1788,13,1794,13],[1788,0,1794,0],[1788,2,1794,2],[1788,3,1794,3],[1788,7,1794,7],[1788,8,1794,8],[1781,9,1787,9],[1781,10,1787,10],[1781,11,1787,11],[1781,12,1787,12],[1781,13,1787,13],[1781,0,1787,0],[1781,2,1787,2],[1781,3,1787,3],[1781,7,1787,7],[1781,8,1787,8],[1774,9,1780,9],[1774,10,1780,10],[1774,11,1780,11],[1774,12,1780,12],[1774,13,1780,13],[1774,0,1780,0],[1774,2,1780,2],[1774,3,1780,3],[1774,7,1780,7],[1774,8,1780,8],[1767,9,1773,9],[1767,10,1773,10],[1767,11,1773,11],[1767,12,1773,12],[1767,13,1773,13],[1767,0,1773,0],[1767,2,1773,2],[1767,3,1773,3],[1767,7,1773,7],[1767,8,1773,8],[1760,9,1766,9],[1760,10,1766,10],[1760,11,1766,11],[1760,12,1766,12],[1760,13,1766,13],[1760,0,1766,0],[1760,2,1766,2],[1760,3,1766,3],[1760,7,1766,7],[1760,8,1766,8],[1753,9,1759,9],[1753,10,1759,10],[1753,11,1759,11],[1753,12,1759,12],[1753,13,1759,13],[1753,0,1759,0],[1753,2,1759,2],[1753,3,1759,3],[1753,7,1759,7],[1753,8,1759,8],[1746,9,1752,9],[1746,10,1752,10],[1746,11,1752,11],[1746,12,1752,12],[1746,13,1752,13],[1746,0,1752,0],[1746,2,1752,2],[1746,3,1752,3],[1746,7,1752,7],[1746,8,1752,8],[1739,9,1745,9],[1739,10,1745,10],[1739,11,1745,11],[1739,12,1745,12],[1739,13,1745,13],[1739,0,1745,0],[1739,2,1745,2],[1739,3,1745,3],[1739,7,1745,7],[1739,8,1745,8],[1732,9,1738,9],[1732,10,1738,10],[1732,11,1738,11],[1732,12,1738,12],[1732,13,1738,13],[1732,0,1738,0],[1732,2,1738,2],[1732,3,1738,3],[1732,7,1738,7],[1732,8,1738,8],[1725,9,1731,9],[1725,10,1731,10],[1725,11,1731,11],[1725,12,1731,12],[1725,13,1731,13],[1725,0,1731,0],[1725,2,1731,2],[1725,3,1731,3],[1725,7,1731,7],[1725,8,1731,8],[1718,9,1724,9],[1718,10,1724,10],[1718,11,1724,11],[1718,12,1724,12],[1718,13,1724,13],[1718,0,1724,0],[1718,2,1724,2],[1718,3,1724,3],[1718,7,1724,7],[1718,8,1724,8],[1711,9,1717,9],[1711,10,1717,10],[1711,11,1717,11],[1711,12,1717,12],[1711,13,1717,13],[1711,0,1717,0],[1711,2,1717,2],[1711,3,1717,3],[1711,7,1717,7],[1711,8,1717,8],[1704,9,1710,9],[1704,10,1710,10],[1704,11,1710,11],[1704,12,1710,12],[1704,13,1710,13],[1704,0,1710,0],[1704,2,1710,2],[1704,3,1710,3],[1704,7,1710,7],[1704,8,1710,8],[1697,9,1703,9],[1697,10,1703,10],[1697,11,1703,11],[1697,12,1703,12],[1697,13,1703,13],[1697,0,1703,0],[1697,2,1703,2],[1697,3,1703,3],[1697,7,1703,7],[1697,8,1703,8],[1690,9,1696,9],[1690,10,1696,10],[1690,11,1696,11],[1690,12,1696,12],[1690,13,1696,13],[1690,0,1696,0],[1690,2,1696,2],[1690,3,1696,3],[1690,7,1696,7],[1690,8,1696,8],[1683,9,1689,9],[1683,10,1689,10],[1683,11,1689,11],[1683,12,1689,12],[1683,13,1689,13],[1683,0,1689,0],[1683,2,1689,2],[1683,3,1689,3],[1683,7,1689,7],[1683,8,1689,8],[1676,9,1682,9],[1676,10,1682,10],[1676,11,1682,11],[1676,12,1682,12],[1676,13,1682,13],[1676,0,1682,0],[1676,2,1682,2],[1676,3,1682,3],[1676,7,1682,7],[1676,8,1682,8],[1669,9,1675,9],[1669,10,1675,10],[1669,11,1675,11],[1669,12,1675,12],[1669,13,1675,13],[1669,0,1675,0],[1669,2,1675,2],[1669,3,1675,3],[1669,7,1675,7],[1669,8,1675,8],[1662,9,1668,9],[1662,10,1668,10],[1662,11,1668,11],[1662,12,1668,12],[1662,13,1668,13],[1662,0,1668,0],[1662,2,1668,2],[1662,3,1668,3],[1662,7,1668,7],[1662,8,1668,8],[1655,9,1661,9],[1655,10,1661,10],[1655,11,1661,11],[1655,12,1661,12],[1655,13,1661,13],[1655,0,1661,0],[1655,2,1661,2],[1655,3,1661,3],[1655,7,1661,7],[1655,8,1661,8],[1648,9,1654,9],[1648,10,1654,10],[1648,11,1654,11],[1648,12,1654,12],[1648,13,1654,13],[1648,0,1654,0],[1648,2,1654,2],[1648,3,1654,3],[1648,7,1654,7],[1648,8,1654,8],[1641,9,1647,9],[1641,10,1647,10],[1641,11,1647,11],[1641,12,1647,12],[1641,13,1647,13],[1641,0,1647,0],[1641,2,1647,2],[1641,3,1647,3],[1641,7,1647,7],[1641,8,1647,8],[1634,9,1640,9],[1634,10,1640,10],[1634,11,1640,11],[1634,12,1640,12],[1634,13,1640,13],[1634,0,1640,0],[1634,2,1640,2],[1634,3,1640,3],[1634,7,1640,7],[1634,8,1640,8],[1627,9,1633,9],[1627,10,1633,10],[1627,11,1633,11],[1627,12,1633,12],[1627,13,1633,13],[1627,0,1633,0],[1627,2,1633,2],[1627,3,1633,3],[1627,7,1633,7],[1627,8,1633,8],[1620,9,1626,9],[1620,10,1626,10],[1620,11,1626,11],[1620,12,1626,12],[1620,13,1626,13],[1620,0,1626,0],[1620,2,1626,2],[1620,3,1626,3],[1620,7,1626,7],[1620,8,1626,8],[1613,9,1619,9],[1613,10,1619,10],[1613,11,1619,11],[1613,12,1619,12],[1613,13,1619,13],[1613,0,1619,0],[1613,2,1619,2],[1613,3,1619,3],[1613,7,1619,7],[1613,8,1619,8],[1606,9,1612,9],[1606,10,1612,10],[1606,11,1612,11],[1606,12,1612,12],[1606,13,1612,13],[1606,0,1612,0],[1606,2,1612,2],[1606,3,1612,3],[1606,7,1612,7],[1606,8,1612,8],[1599,9,1605,9],[1599,10,1605,10],[1599,11,1605,11],[1599,12,1605,12],[1599,13,1605,13],[1599,0,1605,0],[1599,2,1605,2],[1599,3,1605,3],[1599,7,1605,7],[1599,8,1605,8],[1592,9,1598,9],[1592,10,1598,10],[1592,11,1598,11],[1592,12,1598,12],[1592,13,1598,13],[1592,0,1598,0],[1592,2,1598,2],[1592,3,1598,3],[1592,7,1598,7],[1592,8,1598,8],[1585,9,1591,9],[1585,10,1591,10],[1585,11,1591,11],[1585,12,1591,12],[1585,13,1591,13],[1585,0,1591,0],[1585,2,1591,2],[1585,3,1591,3],[1585,7,1591,7],[1585,8,1591,8],[1578,9,1584,9],[1578,10,1584,10],[1578,11,1584,11],[1578,12,1584,12],[1578,13,1584,13],[1578,0,1584,0],[1578,2,1584,2],[1578,3,1584,3],[1578,7,1584,7],[1578,8,1584,8],[1571,9,1577,9],[1571,10,1577,10],[1571,11,1577,11],[1571,12,1577,12],[1571,13,1577,13],[1571,0,1577,0],[1571,2,1577,2],[1571,3,1577,3],[1571,7,1577,7],[1571,8,1577,8],[1564,9,1570,9],[1564,10,1570,10],[1564,11,1570,11],[1564,12,1570,12],[1564,13,1570,13],[1564,0,1570,0],[1564,2,1570,2],[1564,3,1570,3],[1564,7,1570,7],[1564,8,1570,8],[1557,9,1563,9],[1557,10,1563,10],[1557,11,1563,11],[1557,12,1563,12],[1557,13,1563,13],[1557,0,1563,0],[1557,2,1563,2],[1557,3,1563,3],[1557,7,1563,7],[1557,8,1563,8],[1550,9,1556,9],[1550,10,1556,10],[1550,11,1556,11],[1550,12,1556,12],[1550,13,1556,13],[1550,0,1556,0],[1550,2,1556,2],[1550,3,1556,3],[1550,7,1556,7],[1550,8,1556,8]],"merged_total":3201,"flags":["merged_cut"]}
[]
[]
[]
[]
[]
[]
[]
[]
[]
["Action","Mois","Date","Client","Produits ","Qté de bouteille ou litre","Montant","Somme reçue en CB","Somme reçue en chèque","Somme reçue en espèces","Contrôle","Observations","Comptabilisé\noui/non","n°action"]
[{"$f":"IFERROR(INDIRECT(\"'C:\\Users\\Moi\\OneDrive\\Documents\\[Formulaires Gravereau.xlsx]Action\"&$N11&\"'!$D$6\"),\"\")","v":""},{"$f":"IF(C11<>\"\",C11,\"\")","v":""},{"$f":"IFERROR(INDIRECT(\"'C:\\Users\\Moi\\OneDrive\\Documents\\[Formulaires G.xlsx]Action\"&ROW()-10&\"'!$D$4\"),\"\")","v":""},{"$f":"IFERROR(INDIRECT(\"'C:\\Users\\Moi\\OneDrive\\Documents\\[Formulaires G.xlsx]Action\"&ROW()-10&\"'!$h$4\"),\"\")","v":""},{"$f":"IFERROR(INDIRECT(\"https://d.docs.live.net/169216252f734be3/Documents/Formulaires G.xlsx/Action\"&ROW()-10&\"'!$D$9\"),\"\")","v":""},{"$f":"IFERROR(INDIRECT(\"'C:\\Users\\Moi\\OneDrive\\Documents\\[Formulaires G.xlsx]Action\"&ROW()-10&\"'!$h$9\"),\"\")","v":""},{"$f":"IFERROR(VLOOKUP(E11,'Tarif de base'!D:E,2,FALSE)*F11,\"\")","v":""},{"$f":"IFERROR(INDIRECT(\"'C:\\Users\\Moi\\OneDrive\\Documents\\[Formulaires G.xlsx]Action\"&ROW()-10&\"'!$d$26\"),\"\")","v":""},{"$f":"IFERROR(INDIRECT(\"'C:\\Users\\Moi\\OneDrive\\Documents\\[Formulaires G.xlsx]Action\"&ROW()-10&\"'!$d$28\"),\"\")","v":""},{"$f":"IFERROR(INDIRECT(\"'C:\\Users\\Moi\\OneDrive\\Documents\\[Formulaires G.xlsx]Action\"&ROW()-10&\"'!$h$26\"),\"\")","v":""},{"$f":"IFERROR(IF(G17-H11-I11-J11<>0,\"Attention il manque \"&G17-H11-I11-J11&\"€\",\"Règlement OK\"),\"Pas de règlement\")","v":"Pas de règlement"},{"$f":"IFERROR(INDIRECT(\"'C:\\Users\\Moi\\OneDrive\\Documents\\[Formulaires G.xlsx]Action\"&ROW()-10&\"'!$d$30\"),\"\")","v":""},null,1]
[null,{"$f":"B11","v":""},null,null,{"$f":"IFERROR(INDIRECT(\"'C:\\Users\\Moi\\OneDrive\\Documents\\[Formulaires G.xlsx]Action\"&ROW()-11&\"'!$D$13\"),\"\")","v":""},{"$f":"IFERROR(INDIRECT(\"'C:\\Users\\Moi\\OneDrive\\Documents\\[Formulaires G.xlsx]Action\"&ROW()-11&\"'!$h$11\"),\"\")","v":""},{"$f":"IFERROR(VLOOKUP(E12,'Tarif de base'!D:E,2,FALSE)*F12,\"\")","v":""}]
[null,"",null,null,{"$f":"IFERROR(INDIRECT(\"'C:\\Users\\Moi\\OneDrive\\Documents\\[Formulaires G.xlsx]Action\"&ROW()-12&\"'!$D$11\"),\"\")","v":""},{"$f":"IFERROR(INDIRECT(\"'C:\\Users\\Moi\\OneDrive\\Documents\\[Formulaires G.xlsx]Action\"&ROW()-12&\"'!$h$13\"),\"\")","v":""},{"$f":"IFERROR(VLOOKUP(E13,'Tarif de base'!D:E,2,FALSE)*F13,\"\")","v":""}]
[null,"",null,null,{"$f":"IFERROR(INDIRECT(\"'C:\\Users\\Moi\\OneDrive\\Documents\\[Formulaires G.xlsx]Action\"&ROW()-13&\"'!$D$15\"),\"\")","v":""},{"$f":"IFERROR(INDIRECT(\"'C:\\Users\\Moi\\OneDrive\\Documents\\[Formulaires G.xlsx]Action\"&ROW()-13&\"'!$h$15\"),\"\")","v":""},{"$f":"IFERROR(VLOOKUP(E14,'Tarif de base'!D:E,2,FALSE)*F14,\"\")","v":""}]
[null,"",null,null,{"$f":"IFERROR(INDIRECT(\"'C:\\Users\\Moi\\OneDrive\\Documents\\[Formulaires G.xlsx]Action\"&ROW()-14&\"'!$D$17\"),\"\")","v":""},{"$f":"IFERROR(INDIRECT(\"'C:\\Users\\Moi\\OneDrive\\Documents\\[Formulaires G.xlsx]Action\"&ROW()-14&\"'!$h$17\"),\"\")","v":""},{"$f":"IFERROR(VLOOKUP(E15,'Tarif de base'!D:E,2,FALSE)*F15,\"\")","v":""}]
[null,"",null,null,{"$f":"IFERROR(INDIRECT(\"'C:\\Users\\Moi\\OneDrive\\Documents\\[Formulaires G.xlsx]Action\"&ROW()-15&\"'!$D$19\"),\"\")","v":""},{"$f":"IFERROR(INDIRECT(\"'C:\\Users\\Moi\\OneDrive\\Documents\\[Formulaires G.xlsx]Action\"&ROW()-15&\"'!$h$19\"),\"\")","v":""},{"$f":"IFERROR(VLOOKUP(E16,'Tarif de base'!D:E,2,FALSE)*F16,\"\")","v":""}]
[null,"",null,null,"Total",{"$f":"SUM(F11:F16)","v":0},{"$f":"SUM(G11:G16)","v":0}]
["=SIERREUR(INDIRECT(\"'C:\\Users\\Moi\\OneDrive\\Documents\\[Formulaires G.xlsx]Action\"&$N18&\"'!$D$6\");\"\")",{"$f":"IF(C18<>\"\",C18,\"\")","v":""},{"$f":"IFERROR(INDIRECT(\"'C:\\Users\\Moi\\OneDrive\\Documents\\[Formulaires G.xlsx]Action\"&$N18&\"'!$D$4\"),\"\")","v":""},{"$f":"IFERROR(INDIRECT(\"'C:\\Users\\Moi\\OneDrive\\Documents\\[Formulaires G.xlsx]Action\"&$N18&\"'!$h$4\"),\"\")","v":""},{"$f":"IFERROR(INDIRECT(\"'C:\\Users\\Moi\\OneDrive\\Documents\\[Formulaires G.xlsx]Action\"&$N18&\"'!$D$9\"),\"\")","v":""},{"$f":"IFERROR(INDIRECT(\"'C:\\Users\\Moi\\OneDrive\\Documents\\[Formulaires G.xlsx]Action\"&$N18&\"'!$h$9\"),\"\")","v":""},{"$f":"IFERROR(VLOOKUP(E18,'Tarif de base'!D:E,2,FALSE)*F18,\"\")","v":""},{"$f":"IFERROR(INDIRECT(\"'C:\\Users\\Moi\\OneDrive\\Documents\\[Formulaires G.xlsx]Action\"&$N18&\"'!$d$26\"),\"\")","v":""},{"$f":"IFERROR(INDIRECT(\"'C:\\Users\\Moi\\OneDrive\\Documents\\[Formulaires G.xlsx]Action\"&$N18&\"'!$d$28\"),\"\")","v":""},{"$f":"IFERROR(INDIRECT(\"'C:\\Users\\Moi\\OneDrive\\Documents\\[Formulaires G.xlsx]Action\"&$N18&\"'!$h$26\"),\"\")","v":""},{"$f":"IFERROR(IF(G24-H18-I18-J18<>0,\"Attention il manque \"&G24-H18-I18-J18&\"€\",\"Règlement OK\"),\"Pas de règlement\")","v":"Pas de règlement"},{"$f":"IFERROR(INDIRECT(\"'C:\\Users\\Moi\\OneDrive\\Documents\\[Formulaires G.xlsx]Action\"&$N18&\"'!$d$30\"),\"\")","v":""},null,2]
[null,"",null,null,{"$f":"IFERROR(INDIRECT(\"'C:\\Users\\Moi\\OneDrive\\Documents\\[Formulaires G.xlsx]Action\"&$N18&\"'!$D$11\"),\"\")","v":""},{"$f":"IFERROR(INDIRECT(\"'C:\\Users\\Moi\\OneDrive\\Documents\\[Formulaires G.xlsx]Action\"&$N18&\"'!$h$11\"),\"\")","v":""},{"$f":"IFERROR(VLOOKUP(E19,'Tarif de base'!D:E,2,FALSE)*F19,\"\")","v":""}]
[null,"",null,null,{"$f":"IFERROR(INDIRECT(\"'C:\\Users\\Moi\\OneDrive\\Documents\\[Formulaires G.xlsx]Action\"&$N18&\"'!$D$13\"),\"\")","v":""},{"$f":"IFERROR(INDIRECT(\"'C:\\Users\\Moi\\OneDrive\\Documents\\[Formulaires G.xlsx]Action\"&$N18&\"'!$h$13\"),\"\")","v":""},{"$f":"IFERROR(VLOOKUP(E20,'Tarif de base'!D:E,2,FALSE)*F20,\"\")","v":""}]
[null,"",null,null,{"$f":"IFERROR(INDIRECT(\"'C:\\Users\\Moi\\OneDrive\\Documents\\[Formulaires G.xlsx]Action\"&$N18&\"'!$D$15\"),\"\")","v":""},{"$f":"IFERROR(INDIRECT(\"'C:\\Users\\Moi\\OneDrive\\Documents\\[Formulaires G.xlsx]Action\"&$N18&\"'!$h$15\"),\"\")","v":""},{"$f":"IFERROR(VLOOKUP(E21,'Tarif de base'!D:E,2,FALSE)*F21,\"\")","v":""}]
[null,"",null,null,{"$f":"IFERROR(INDIRECT(\"'C:\\Users\\Moi\\OneDrive\\Documents\\[Formulaires G.xlsx]Action\"&$N18&\"'!$D$17\"),\"\")","v":""},{"$f":"IFERROR(INDIRECT(\"'C:\\Users\\Moi\\OneDrive\\Documents\\[Formulaires G.xlsx]Action\"&$N18&\"'!$h$17\"),\"\")","v":""},{"$f":"IFERROR(VLOOKUP(E22,'Tarif de base'!D:E,2,FALSE)*F22,\"\")","v":""}]
[null,"",null,null,{"$f":"IFERROR(INDIRECT(\"'C:\\Users\\Moi\\OneDrive\\Documents\\[Formulaires G.xlsx]Action\"&$N18&\"'!$D$19\"),\"\")","v":""},{"$f":"IFERROR(INDIRECT(\"'C:\\Users\\Moi\\OneDrive\\Documents\\[Formulaires G.xlsx]Action\"&$N18&\"'!$h$19\"),\"\")","v":""},{"$f":"IFERROR(VLOOKUP(E23,'Tarif de base'!D:E,2,FALSE)*F23,\"\")","v":""}]
[null,"",null,null,"Total",{"$f":"SUM(F18:F23)","v":0},{"$f":"SUM(G18:G23)","v":0}]
[null,null,null,null,{"$f":"IFERROR(INDIRECT(\"'C:\\Users\\Moi\\OneDrive\\Documents\\[Formulaires G.xlsx]Action\"&$N25&\"'!$D$9\"),\"\")","v":""},{"$f":"IFERROR(INDIRECT(\"'C:\\Users\\Moi\\OneDrive\\Documents\\[Formulaires G.xlsx]Action\"&$N25&\"'!$h$9\"),\"\")","v":""},{"$f":"IFERROR(VLOOKUP(E25,'Tarif de base'!D:E,2,FALSE)*F25,\"\")","v":""},{"$f":"IFERROR(INDIRECT(\"'C:\\Users\\Moi\\OneDrive\\Documents\\[Formulaires G.xlsx]Action\"&$N25&\"'!$d$26\"),\"\")","v":""},{"$f":"IFERROR(INDIRECT(\"'C:\\Users\\Moi\\OneDrive\\Documents\\[Formulaires G.xlsx]Action\"&$N25&\"'!$d$28\"),\"\")","v":""},{"$f":"IFERROR(INDIRECT(\"'C:\\Users\\Moi\\OneDrive\\Documents\\[Formulaires G.xlsx]Action\"&$N25&\"'!$h$26\"),\"\")","v":""},{"$f":"IFERROR(IF(G31-H25-I25-J25<>0,\"Attention il manque \"&G31-H25-I25-J25&\"€\",\"Règlement OK\"),\"Pas de règlement\")","v":"Pas de règlement"},{"$f":"IFERROR(INDIRECT(\"'C:\\Users\\Moi\\OneDrive\\Documents\\[Formulaires G.xlsx]Action\"&$N25&\"'!$d$30\"),\"\")","v":""},null,3]
[null,null,null,null,{"$f":"IFERROR(INDIRECT(\"'C:\\Users\\Moi\\OneDrive\\Documents\\[Formulaires G.xlsx]Action\"&$N25&\"'!$D$11\"),\"\")","v":""},{"$f":"IFERROR(INDIRECT(\"'C:\\Users\\Moi\\OneDrive\\Documents\\[Formulaires G.xlsx]Action\"&$N25&\"'!$h$11\"),\"\")","v":""},{"$f":"IFERROR(VLOOKUP(E26,'Tarif de base'!D:E,2,FALSE)*F26,\"\")","v":""}]
[null,null,null,null,{"$f":"IFERROR(INDIRECT(\"'C:\\Users\\Moi\\OneDrive\\Documents\\[Formulaires G.xlsx]Action\"&$N25&\"'!$D$13\"),\"\")","v":""},{"$f":"IFERROR(INDIRECT(\"'C:\\Users\\Moi\\OneDrive\\Documents\\[Formulaires G.xlsx]Action\"&$N25&\"'!$h$13\"),\"\")","v":""},{"$f":"IFERROR(VLOOKUP(E27,'Tarif de base'!D:E,2,FALSE)*F27,\"\")","v":""}]
[null,null,null,null,{"$f":"IFERROR(INDIRECT(\"'C:\\Users\\Moi\\OneDrive\\Documents\\[Formulaires G.xlsx]Action\"&$N25&\"'!$D$15\"),\"\")","v":""},{"$f":"IFERROR(INDIRECT(\"'C:\\Users\\Moi\\OneDrive\\Documents\\[Formulaires G.xlsx]Action\"&$N25&\"'!$h$15\"),\"\")","v":""},{"$f":"IFERROR(VLOOKUP(E28,'Tarif de base'!D:E,2,FALSE)*F28,\"\")","v":""}]
[null,null,null,null,{"$f":"IFERROR(INDIRECT(\"'C:\\Users\\Moi\\OneDrive\\Documents\\[Formulaires G.xlsx]Action\"&$N25&\"'!$D$17\"),\"\")","v":""},{"$f":"IFERROR(INDIRECT(\"'C:\\Users\\Moi\\OneDrive\\Documents\\[Formulaires G.xlsx]Action\"&$N25&\"'!$h$17\"),\"\")","v":""},{"$f":"IFERROR(VLOOKUP(E29,'Tarif de base'!D:E,2,FALSE)*F29,\"\")","v":""}]
[null,null,null,null,{"$f":"IFERROR(INDIRECT(\"'C:\\Users\\Moi\\OneDrive\\Documents\\[Formulaires G.xlsx]Action\"&$N25&\"'!$D$19\"),\"\")","v":""},{"$f":"IFERROR(INDIRECT(\"'C:\\Users\\Moi\\OneDrive\\Documents\\[Formulaires G.xlsx]Action\"&$N25&\"'!$h$19\"),\"\")","v":""},{"$f":"IFERROR(VLOOKUP(E30,'Tarif de base'!D:E,2,FALSE)*F30,\"\")","v":""}]
[null,null,null,null,"Total",{"$f":"SUM(F25:F30)","v":0},{"$f":"SUM(G25:G30)","v":0}]
[null,null,null,null,{"$f":"IFERROR(INDIRECT(\"'C:\\Users\\Moi\\OneDrive\\Documents\\[Formulaires G.xlsx]Action\"&$N32&\"'!$D$9\"),\"\")","v":""},{"$f":"IFERROR(INDIRECT(\"'C:\\Users\\Moi\\OneDrive\\Documents\\[Formulaires G.xlsx]Action\"&$N32&\"'!$h$9\"),\"\")","v":""},{"$f":"IFERROR(VLOOKUP(E32,'[1]Tarif de base'!D:E,2,FALSE)*F32,\"\")","v":""},{"$f":"IFERROR(INDIRECT(\"'C:\\Users\\Moi\\OneDrive\\Documents\\[Formulaires G.xlsx]Action\"&$N32&\"'!$d$26\"),\"\")","v":""},{"$f":"IFERROR(INDIRECT(\"'C:\\Users\\Moi\\OneDrive\\Documents\\[Formulaires G.xlsx]Action\"&$N32&\"'!$d$28\"),\"\")","v":""},{"$f":"IFERROR(INDIRECT(\"'C:\\Users\\Moi\\OneDrive\\Documents\\[Formulaires G.xlsx]Action\"&$N32&\"'!$h$26\"),\"\")","v":""},{"$f":"IFERROR(IF(G38-H32-I32-J32<>0,\"Attention il manque \"&G38-H32-I32-J32&\"€\",\"Règlement OK\"),\"Pas de règlement\")","v":"Pas de règlement"},{"$f":"IFERROR(INDIRECT(\"'C:\\Users\\Moi\\OneDrive\\Documents\\[Formulaires G.xlsx]Action\"&$N32&\"'!$d$30\"),\"\")","v":""},null,4]
[null,null,null,null,{"$f":"IFERROR(INDIRECT(\"'C:\\Users\\Moi\\OneDrive\\Documents\\[Formulaires G.xlsx]Action\"&$N32&\"'!$D$11\"),\"\")","v":""},{"$f":"IFERROR(INDIRECT(\"'C:\\Users\\Moi\\OneDrive\\Documents\\[Formulaires G.xlsx]Action\"&$N32&\"'!$h$11\"),\"\")","v":""},{"$f":"IFERROR(VLOOKUP(E33,'[1]Tarif de base'!D:E,2,FALSE)*F33,\"\")","v":""}]
[null,null,null,null,{"$f":"IFERROR(INDIRECT(\"'C:\\Users\\Moi\\OneDrive\\Documents\\[Formulaires G.xlsx]Action\"&$N32&\"'!$D$13\"),\"\")","v":""},{"$f":"IFERROR(INDIRECT(\"'C:\\Users\\Moi\\OneDrive\\Documents\\[Formulaires G.xlsx]Action\"&$N32&\"'!$h$13\"),\"\")","v":""},{"$f":"IFERROR(VLOOKUP(E34,'[1]Tarif de base'!D:E,2,FALSE)*F34,\"\")","v":""}]
[null,null,null,null,{"$f":"IFERROR(INDIRECT(\"'C:\\Users\\Moi\\OneDrive\\Documents\\[Formulaires G.xlsx]Action\"&$N32&\"'!$D$15\"),\"\")","v":""},{"$f":"IFERROR(INDIRECT(\"'C:\\Users\\Moi\\OneDrive\\Documents\\[Formulaires G.xlsx]Action\"&$N32&\"'!$h$15\"),\"\")","v":""},{"$f":"IFERROR(VLOOKUP(E35,'[1]Tarif de base'!D:E,2,FALSE)*F35,\"\")","v":""}]
[null,null,null,null,{"$f":"IFERROR(INDIRECT(\"'C:\\Users\\Moi\\OneDrive\\Documents\\[Formulaires G.xlsx]Action\"&$N32&\"'!$D$17\"),\"\")","v":""},{"$f":"IFERROR(INDIRECT(\"'C:\\Users\\Moi\\OneDrive\\Documents\\[Formulaires G.xlsx]Action\"&$N32&\"'!$h$17\"),\"\")","v":""},{"$f":"IFERROR(VLOOKUP(E36,'[1]Tarif de base'!D:E,2,FALSE)*F36,\"\")","v":""}]
[null,null,null,null,{"$f":"IFERROR(INDIRECT(\"'C:\\Users\\Moi\\OneDrive\\Documents\\[Formulaires G.xlsx]Action\"&$N32&\"'!$D$19\"),\"\")","v":""},{"$f":"IFERROR(INDIRECT(\"'C:\\Users\\Moi\\OneDrive\\Documents\\[Formulaires G.xlsx]Action\"&$N32&\"'!$h$19\"),\"\")","v":""},{"$f":"IFERROR(VLOOKUP(E37,'[1]Tarif de base'!D:E,2,FALSE)*F37,\"\")","v":""}]
[null,null,null,null,"Total",{"$f":"SUM(F32:F37)","v":0},{"$f":"SUM(G32:G37)","v":0}]
[null,null,null,null,{"$f":"IFERROR(INDIRECT(\"'C:\\Users\\Moi\\OneDrive\\Documents\\[Formulaires Gravereau.xlsx]Action\"&$N39&\"'!$D$9\"),\"\")","v":""},{"$f":"IFERROR(INDIRECT(\"'C:\\Users\\Moi\\OneDrive\\Documents\\[Formulaires Gravereau.xlsx]Action\"&$N39&\"'!$h$9\"),\"\")","v":""},{"$f":"IFERROR(VLOOKUP(E39,'[1]Tarif de base'!D:E,2,FALSE)*F39,\"\")","v":""},{"$f":"IFERROR(INDIRECT(\"'C:\\Users\\Moi\\OneDrive\\Documents\\[Formulaires Gravereau.xlsx]Action\"&$N39&\"'!$d$26\"),\"\")","v":""},{"$f":"IFERROR(INDIRECT(\"'C:\\Users\\Moi\\OneDrive\\Documents\\[Formulaires Gravereau.xlsx]Action\"&$N39&\"'!$d$28\"),\"\")","v":""},{"$f":"IFERROR(INDIRECT(\"'C:\\Users\\Moi\\OneDrive\\Documents\\[Formulaires Gravereau.xlsx]Action\"&$N39&\"'!$h$26\"),\"\")","v":""},{"$f":"IFERROR(IF(G45-H39-I39-J39<>0,\"Attention il manque \"&G45-H39-I39-J39&\"€\",\"Règlement OK\"),\"Pas de règlement\")","v":"Pas de règlement"},{"$f":"IFERROR(INDIRECT(\"'C:\\Users\\Moi\\OneDrive\\Documents\\[Formulaires Gravereau.xlsx]Action\"&$N39&\"'!$d$30\"),\"\")","v":""},null,5]
[null,null,null,null,{"$f":"IFERROR(INDIRECT(\"'C:\\Users\\Moi\\OneDrive\\Documents\\[Formulaires Gravereau.xlsx]Action\"&$N39&\"'!$D$11\"),\"\")","v":""},{"$f":"IFERROR(INDIRECT(\"'C:\\Users\\Moi\\OneDrive\\Documents\\[Formulaires Gravereau.xlsx]Action\"&$N39&\"'!$h$11\"),\"\")","v":""},{"$f":"IFERROR(VLOOKUP(E40,'[1]Tarif de base'!D:E,2,FALSE)*F40,\"\")","v":""}]
[null,null,null,null,{"$f":"IFERROR(INDIRECT(\"'C:\\Users\\Moi\\OneDrive\\Documents\\[Formulaires Gravereau.xlsx]Action\"&$N39&\"'!$D$13\"),\"\")","v":""},{"$f":"IFERROR(INDIRECT(\"'C:\\Users\\Moi\\OneDrive\\Documents\\[Formulaires Gravereau.xlsx]Action\"&$N39&\"'!$h$13\"),\"\")","v":""},{"$f":"IFERROR(VLOOKUP(E41,'[1]Tarif de base'!D:E,2,FALSE)*F41,\"\")","v":""}]
[null,null,null,null,{"$f":"IFERROR(INDIRECT(\"'C:\\Users\\Moi\\OneDrive\\Documents\\[Formulaires Gravereau.xlsx]Action\"&$N39&\"'!$D$15\"),\"\")","v":""},{"$f":"IFERROR(INDIRECT(\"'C:\\Users\\Moi\\OneDrive\\Documents\\[Formulaires Gravereau.xlsx]Action\"&$N39&\"'!$h$15\"),\"\")","v":""},{"$f":"IFERROR(VLOOKUP(E42,'[1]Tarif de base'!D:E,2,FALSE)*F42,\"\")","v":""}]
[null,null,null,null,{"$f":"IFERROR(INDIRECT(\"'C:\\Users\\Moi\\OneDrive\\Documents\\[Formulaires Gravereau.xlsx]Action\"&$N39&\"'!$D$17\"),\"\")","v":""},{"$f":"IFERROR(INDIRECT(\"'C:\\Users\\Moi\\OneDrive\\Documents\\[Formulaires Gravereau.xlsx]Action\"&$N39&\"'!$h$17\"),\"\")","v":""},{"$f":"IFERROR(VLOOKUP(E43,'[1]Tarif de base'!D:E,2,FALSE)*F43,\"\")","v":""}]
[null,null,null,null,{"$f":"IFERROR(INDIRECT(\"'C:\\Users\\Moi\\OneDrive\\Documents\\[Formulaires Gravereau.xlsx]Action\"&$N39&\"'!$D$19\"),\"\")","v":""},{"$f":"IFERROR(INDIRECT(\"'C:\\Users\\Moi\\OneDrive\\Documents\\[Formulaires Gravereau.xlsx]Action\"&$N39&\"'!$h$19\"),\"\")","v":""},{"$f":"IFERROR(VLOOKUP(E44,'[1]Tarif de base'!D:E,2,FALSE)*F44,\"\")","v":""}]
[null,null,null,null,"Total",{"$f":"SUM(F39:F44)","v":0},{"$f":"SUM(G39:G44)","v":0}]
[null,null,null,null,{"$f":"IFERROR(INDIRECT(\"'C:\\Users\\Moi\\OneDrive\\Documents\\[Formulaires Gravereau.xlsx]Action\"&$N46&\"'!$D$9\"),\"\")","v":""},{"$f":"IFERROR(INDIRECT(\"'C:\\Users\\Moi\\OneDrive\\Documents\\[Formulaires Gravereau.xlsx]Action\"&$N46&\"'!$h$9\"),\"\")","v":""},{"$f":"IFERROR(VLOOKUP(E46,'[1]Tarif de base'!D:E,2,FALSE)*F46,\"\")","v":""},{"$f":"IFERROR(INDIRECT(\"'C:\\Users\\Moi\\OneDrive\\Documents\\[Formulaires Gravereau.xlsx]Action\"&$N46&\"'!$d$26\"),\"\")","v":""},{"$f":"IFERROR(INDIRECT(\"'C:\\Users\\Moi\\OneDrive\\Documents\\[Formulaires Gravereau.xlsx]Action\"&$N46&\"'!$d$28\"),\"\")","v":""},{"$f":"IFERROR(INDIRECT(\"'C:\\Users\\Moi\\OneDrive\\Documents\\[Formulaires Gravereau.xlsx]Action\"&$N46&\"'!$h$26\"),\"\")","v":""},{"$f":"IFERROR(IF(G52-H46-I46-J46<>0,\"Attention il manque \"&G52-H46-I46-J46&\"€\",\"Règlement OK\"),\"Pas de règlement\")","v":"Pas de règlement"},{"$f":"IFERROR(INDIRECT(\"'C:\\Users\\Moi\\OneDrive\\Documents\\[Formulaires Gravereau.xlsx]Action\"&$N46&\"'!$d$30\"),\"\")","v":""},null,6]
[null,null,null,null,{"$f":"IFERROR(INDIRECT(\"'C:\\Users\\Moi\\OneDrive\\Documents\\[Formulaires Gravereau.xlsx]Action\"&$N46&\"'!$D$11\"),\"\")","v":""},{"$f":"IFERROR(INDIRECT(\"'C:\\Users\\Moi\\OneDrive\\Documents\\[Formulaires Gravereau.xlsx]Action\"&$N46&\"'!$h$11\"),\"\")","v":""},{"$f":"IFERROR(VLOOKUP(E47,'[1]Tarif de base'!D:E,2,FALSE)*F47,\"\")","v":""}]
[null,null,null,null,{"$f":"IFERROR(INDIRECT(\"'C:\\Users\\Moi\\OneDrive\\Documents\\[Formulaires Gravereau.xlsx]Action\"&$N46&\"'!$D$13\"),\"\")","v":""},{"$f":"IFERROR(INDIRECT(\"'C:\\Users\\Moi\\OneDrive\\Documents\\[Formulaires Gravereau.xlsx]Action\"&$N46&\"'!$h$13\"),\"\")","v":""},{"$f":"IFERROR(VLOOKUP(E48,'[1]Tarif de base'!D:E,2,FALSE)*F48,\"\")","v":""}]
[null,null,null,null,{"$f":"IFERROR(INDIRECT(\"'C:\\Users\\Moi\\OneDrive\\Documents\\[Formulaires Gravereau.xlsx]Action\"&$N46&\"'!$D$15\"),\"\")","v":""},{"$f":"IFERROR(INDIRECT(\"'C:\\Users\\Moi\\OneDrive\\Documents\\[Formulaires Gravereau.xlsx]Action\"&$N46&\"'!$h$15\"),\"\")","v":""},{"$f":"IFERROR(VLOOKUP(E49,'[1]Tarif de base'!D:E,2,FALSE)*F49,\"\")","v":""}]
[null,null,null,null,{"$f":"IFERROR(INDIRECT(\"'C:\\Users\\Moi\\OneDrive\\Documents\\[Formulaires Gravereau.xlsx]Action\"&$N46&\"'!$D$17\"),\"\")","v":""},{"$f":"IFERROR(INDIRECT(\"'C:\\Users\\Moi\\OneDrive\\Documents\\[Formulaires Gravereau.xlsx]Action\"&$N46&\"'!$h$17\"),\"\")","v":""},{"$f":"IFERROR(VLOOKUP(E50,'[1]Tarif de base'!D:E,2,FALSE)*F50,\"\")","v":""}]
[null,null,null,null,{"$f":"IFERROR(INDIRECT(\"'C:\\Users\\Moi\\OneDrive\\Documents\\[Formulaires Gravereau.xlsx]Action\"&$N46&\"'!$D$19\"),\"\")","v":""},{"$f":"IFERROR(INDIRECT(\"'C:\\Users\\Moi\\OneDrive\\Documents\\[Formulaires Gravereau.xlsx]Action\"&$N46&\"'!$h$19\"),\"\")","v":""},{"$f":"IFERROR(VLOOKUP(E51,'[1]Tarif de base'!D:E,2,FALSE)*F51,\"\")","v":""}]
[null,null,null,null,"Total",{"$f":"SUM(F46:F51)","v":0},{"$f":"SUM(G46:G51)","v":0}]
[null,null,null,null,{"$f":"IFERROR(INDIRECT(\"'C:\\Users\\Moi\\OneDrive\\Documents\\[Formulaires Gravereau.xlsx]Action\"&$N53&\"'!$D$9\"),\"\")","v":""},{"$f":"IFERROR(INDIRECT(\"'C:\\Users\\Moi\\OneDrive\\Documents\\[Formulaires Gravereau.xlsx]Action\"&$N53&\"'!$h$9\"),\"\")","v":""},{"$f":"IFERROR(VLOOKUP(E53,'[1]Tarif de base'!D:E,2,FALSE)*F53,\"\")","v":""},{"$f":"IFERROR(INDIRECT(\"'C:\\Users\\Moi\\OneDrive\\Documents\\[Formulaires Gravereau.xlsx]Action\"&$N53&\"'!$d$26\"),\"\")","v":""},{"$f":"IFERROR(INDIRECT(\"'C:\\Users\\Moi\\OneDrive\\Documents\\[Formulaires Gravereau.xlsx]Action\"&$N53&\"'!$d$28\"),\"\")","v":""},{"$f":"IFERROR(INDIRECT(\"'C:\\Users\\Moi\\OneDrive\\Documents\\[Formulaires Gravereau.xlsx]Action\"&$N53&\"'!$h$26\"),\"\")","v":""},{"$f":"IFERROR(IF(G59-H53-I53-J53<>0,\"Attention il manque \"&G59-H53-I53-J53&\"€\",\"Règlement OK\"),\"Pas de règlement\")","v":"Pas de règlement"},{"$f":"IFERROR(INDIRECT(\"'C:\\Users\\Moi\\OneDrive\\Documents\\[Formulaires Gravereau.xlsx]Action\"&$N53&\"'!$d$30\"),\"\")","v":""},null,7]
[null,null,null,null,{"$f":"IFERROR(INDIRECT(\"'C:\\Users\\Moi\\OneDrive\\Documents\\[Formulaires Gravereau.xlsx]Action\"&$N53&\"'!$D$11\"),\"\")","v":""},{"$f":"IFERROR(INDIRECT(\"'C:\\Users\\Moi\\OneDrive\\Documents\\[Formulaires Gravereau.xlsx]Action\"&$N53&\"'!$h$11\"),\"\")","v":""},{"$f":"IFERROR(VLOOKUP(E54,'[1]Tarif de base'!D:E,2,FALSE)*F54,\"\")","v":""}]
[null,null,null,null,{"$f":"IFERROR(INDIRECT(\"'C:\\Users\\Moi\\OneDrive\\Documents\\[Formulaires Gravereau.xlsx]Action\"&$N53&\"'!$D$13\"),\"\")","v":""},{"$f":"IFERROR(INDIRECT(\"'C:\\Users\\Moi\\OneDrive\\Documents\\[Formulaires Gravereau.xlsx]Action\"&$N53&\"'!$h$13\"),\"\")","v":""},{"$f":"IFERROR(VLOOKUP(E55,'[1]Tarif de base'!D:E,2,FALSE)*F55,\"\")","v":""}]
[null,null,null,null,{"$f":"IFERROR(INDIRECT(\"'C:\\Users\\Moi\\OneDrive\\Documents\\[Formulaires Gravereau.xlsx]Action\"&$N53&\"'!$D$15\"),\"\")","v":""},{"$f":"IFERROR(INDIRECT(\"'C:\\Users\\Moi\\OneDrive\\Documents\\[Formulaires Gravereau.xlsx]Action\"&$N53&\"'!$h$15\"),\"\")","v":""},{"$f":"IFERROR(VLOOKUP(E56,'[1]Tarif de base'!D:E,2,FALSE)*F56,\"\")","v":""}]
[null,null,null,null,{"$f":"IFERROR(INDIRECT(\"'C:\\Users\\Moi\\OneDrive\\Documents\\[Formulaires Gravereau.xlsx]Action\"&$N53&\"'!$D$17\"),\"\")","v":""},{"$f":"IFERROR(INDIRECT(\"'C:\\Users\\Moi\\OneDrive\\Documents\\[Formulaires Gravereau.xlsx]Action\"&$N53&\"'!$h$17\"),\"\")","v":""},{"$f":"IFERROR(VLOOKUP(E57,'[1]Tarif de base'!D:E,2,FALSE)*F57,\"\")","v":""}]
[null,null,null,null,{"$f":"IFERROR(INDIRECT(\"'C:\\Users\\Moi\\OneDrive\\Documents\\[Formulaires Gravereau.xlsx]Action\"&$N53&\"'!$D$19\"),\"\")","v":""},{"$f":"IFERROR(INDIRECT(\"'C:\\Users\\Moi\\OneDrive\\Documents\\[Formulaires Gravereau.xlsx]Action\"&$N53&\"'!$h$19\"),\"\")","v":""},{"$f":"IFERROR(VLOOKUP(E58,'[1]Tarif de base'!D:E,2,FALSE)*F58,\"\")","v":""}]
[null,null,null,null,"Total",{"$f":"SUM(F53:F58)","v":0},{"$f":"SUM(G53:G58)","v":0}]
[null,null,null,null,{"$f":"IFERROR(INDIRECT(\"'C:\\Users\\Moi\\OneDrive\\Documents\\[Formulaires Gravereau.xlsx]Action\"&$N60&\"'!$D$9\"),\"\")","v":""},{"$f":"IFERROR(INDIRECT(\"'C:\\Users\\Moi\\OneDrive\\Documents\\[Formulaires Gravereau.xlsx]Action\"&$N60&\"'!$h$9\"),\"\")","v":""},{"$f":"IFERROR(VLOOKUP(E60,'[1]Tarif de base'!D:E,2,FALSE)*F60,\"\")","v":""},{"$f":"IFERROR(INDIRECT(\"'C:\\Users\\Moi\\OneDrive\\Documents\\[Formulaires Gravereau.xlsx]Action\"&$N60&\"'!$d$26\"),\"\")","v":""},{"$f":"IFERROR(INDIRECT(\"'C:\\Users\\Moi\\OneDrive\\Documents\\[Formulaires Gravereau.xlsx]Action\"&$N60&\"'!$d$28\"),\"\")","v":""},{"$f":"IFERROR(INDIRECT(\"'C:\\Users\\Moi\\OneDrive\\Documents\\[Formulaires Gravereau.xlsx]Action\"&$N60&\"'!$h$26\"),\"\")","v":""},{"$f":"IFERROR(IF(G66-H60-I60-J60<>0,\"Attention il manque \"&G66-H60-I60-J60&\"€\",\"Règlement OK\"),\"Pas de règlement\")","v":"Pas de règlement"},{"$f":"IFERROR(INDIRECT(\"'C:\\Users\\Moi\\OneDrive\\Documents\\[Formulaires Gravereau.xlsx]Action\"&$N60&\"'!$d$30\"),\"\")","v":""},null,8]
[null,null,null,null,{"$f":"IFERROR(INDIRECT(\"'C:\\Users\\Moi\\OneDrive\\Documents\\[Formulaires Gravereau.xlsx]Action\"&$N60&\"'!$D$11\"),\"\")","v":""},{"$f":"IFERROR(INDIRECT(\"'C:\\Users\\Moi\\OneDrive\\Documents\\[Formulaires Gravereau.xlsx]Action\"&$N60&\"'!$h$11\"),\"\")","v":""},{"$f":"IFERROR(VLOOKUP(E61,'[1]Tarif de base'!D:E,2,FALSE)*F61,\"\")","v":""}]
[null,null,null,null,{"$f":"IFERROR(INDIRECT(\"'C:\\Users\\Moi\\OneDrive\\Documents\\[Formulaires Gravereau.xlsx]Action\"&$N60&\"'!$D$13\"),\"\")","v":""},{"$f":"IFERROR(INDIRECT(\"'C:\\Users\\Moi\\OneDrive\\Documents\\[Formulaires Gravereau.xlsx]Action\"&$N60&\"'!$h$13\"),\"\")","v":""},{"$f":"IFERROR(VLOOKUP(E62,'[1]Tarif de base'!D:E,2,FALSE)*F62,\"\")","v":""}]
[null,null,null,null,{"$f":"IFERROR(INDIRECT(\"'C:\\Users\\Moi\\OneDrive\\Documents\\[Formulaires Gravereau.xlsx]Action\"&$N60&\"'!$D$15\"),\"\")","v":""},{"$f":"IFERROR(INDIRECT(\"'C:\\Users\\Moi\\OneDrive\\Documents\\[Formulaires Gravereau.xlsx]Action\"&$N60&\"'!$h$15\"),\"\")","v":""},{"$f":"IFERROR(VLOOKUP(E63,'[1]Tarif de base'!D:E,2,FALSE)*F63,\"\")","v":""}]
[null,null,null,null,{"$f":"IFERROR(INDIRECT(\"'C:\\Users\\Moi\\OneDrive\\Documents\\[Formulaires Gravereau.xlsx]Action\"&$N60&\"'!$D$17\"),\"\")","v":""},{"$f":"IFERROR(INDIRECT(\"'C:\\Users\\Moi\\OneDrive\\Documents\\[Formulaires Gravereau.xlsx]Action\"&$N60&\"'!$h$17\"),\"\")","v":""},{"$f":"IFERROR(VLOOKUP(E64,'[1]Tarif de base'!D:E,2,FALSE)*F64,\"\")","v":""}]
[null,null,null,null,{"$f":"IFERROR(INDIRECT(\"'C:\\Users\\Moi\\OneDrive\\Documents\\[Formulaires Gravereau.xlsx]Action\"&$N60&\"'!$D$19\"),\"\")","v":""},{"$f":"IFERROR(INDIRECT(\"'C:\\Users\\Moi\\OneDrive\\Documents\\[Formulaires Gravereau.xlsx]Action\"&$N60&\"'!$h$19\"),\"\")","v":""},{"$f":"IFERROR(VLOOKUP(E65,'[1]Tarif de base'!D:E,2,FALSE)*F65,\"\")","v":""}]
[null,null,null,null,"Total",{"$f":"SUM(F60:F65)","v":0},0]
[null,null,null,null,{"$f":"IFERROR(INDIRECT(\"'C:\\Users\\Moi\\OneDrive\\Documents\\[Formulaires Gravereau.xlsx]Action\"&$N67&\"'!$D$9\"),\"\")","v":""},{"$f":"IFERROR(INDIRECT(\"'C:\\Users\\Moi\\OneDrive\\Documents\\[Formulaires Gravereau.xlsx]Action\"&$N67&\"'!$h$9\"),\"\")","v":""},{"$f":"IFERROR(VLOOKUP(E67,'[1]Tarif de base'!D:E,2,FALSE)*F67,\"\")","v":""},{"$f":"IFERROR(INDIRECT(\"'C:\\Users\\Moi\\OneDrive\\Documents\\[Formulaires Gravereau.xlsx]Action\"&$N67&\"'!$d$26\"),\"\")","v":""},{"$f":"IFERROR(INDIRECT(\"'C:\\Users\\Moi\\OneDrive\\Documents\\[Formulaires Gravereau.xlsx]Action\"&$N67&\"'!$d$28\"),\"\")","v":""},{"$f":"IFERROR(INDIRECT(\"'C:\\Users\\Moi\\OneDrive\\Documents\\[Formulaires Gravereau.xlsx]Action\"&$N67&\"'!$h$26\"),\"\")","v":""},{"$f":"IFERROR(IF(G73-H67-I67-J67<>0,\"Attention il manque \"&G73-H67-I67-J67&\"€\",\"Règlement OK\"),\"Pas de règlement\")","v":"Pas de règlement"},{"$f":"IFERROR(INDIRECT(\"'C:\\Users\\Moi\\OneDrive\\Documents\\[Formulaires Gravereau.xlsx]Action\"&$N67&\"'!$d$30\"),\"\")","v":""},null,9]
[null,null,null,null,{"$f":"IFERROR(INDIRECT(\"'C:\\Users\\Moi\\OneDrive\\Documents\\[Formulaires Gravereau.xlsx]Action\"&$N67&\"'!$D$11\"),\"\")","v":""},{"$f":"IFERROR(INDIRECT(\"'C:\\Users\\Moi\\OneDrive\\Documents\\[Formulaires Gravereau.xlsx]Action\"&$N67&\"'!$h$11\"),\"\")","v":""},{"$f":"IFERROR(VLOOKUP(E68,'[1]Tarif de base'!D:E,2,FALSE)*F68,\"\")","v":""}]
[null,null,null,null,{"$f":"IFERROR(INDIRECT(\"'C:\\Users\\Moi\\OneDrive\\Documents\\[Formulaires Gravereau.xlsx]Action\"&$N67&\"'!$D$13\"),\"\")","v":""},{"$f":"IFERROR(INDIRECT(\"'C:\\Users\\Moi\\OneDrive\\Documents\\[Formulaires Gravereau.xlsx]Action\"&$N67&\"'!$h$13\"),\"\")","v":""},{"$f":"IFERROR(VLOOKUP(E69,'[1]Tarif de base'!D:E,2,FALSE)*F69,\"\")","v":""}]
[null,null,null,null,{"$f":"IFERROR(INDIRECT(\"'C:\\Users\\Moi\\OneDrive\\Documents\\[Formulaires Gravereau.xlsx]Action\"&$N67&\"'!$D$15\"),\"\")","v":""},{"$f":"IFERROR(INDIRECT(\"'C:\\Users\\Moi\\OneDrive\\Documents\\[Formulaires Gravereau.xlsx]Action\"&$N67&\"'!$h$15\"),\"\")","v":""},{"$f":"IFERROR(VLOOKUP(E70,'[1]Tarif de base'!D:E,2,FALSE)*F70,\"\")","v":""}]
[null,null,null,null,{"$f":"IFERROR(INDIRECT(\"'C:\\Users\\Moi\\OneDrive\\Documents\\[Formulaires Gravereau.xlsx]Action\"&$N67&\"'!$D$17\"),\"\")","v":""},{"$f":"IFERROR(INDIRECT(\"'C:\\Users\\Moi\\OneDrive\\Documents\\[Formulaires Gravereau.xlsx]Action\"&$N67&\"'!$h$17\"),\"\")","v":""},{"$f":"IFERROR(VLOOKUP(E71,'[1]Tarif de base'!D:E,2,FALSE)*F71,\"\")","v":""}]
[null,null,null,null,{"$f":"IFERROR(INDIRECT(\"'C:\\Users\\Moi\\OneDrive\\Documents\\[Formulaires Gravereau.xlsx]Action\"&$N67&\"'!$D$19\"),\"\")","v":""},{"$f":"IFERROR(INDIRECT(\"'C:\\Users\\Moi\\OneDrive\\Documents\\[Formulaires Gravereau.xlsx]Action\"&$N67&\"'!$h$19\"),\"\")","v":""},{"$f":"IFERROR(VLOOKUP(E72,'[1]Tarif de base'!D:E,2,FALSE)*F72,\"\")","v":""}]
[null,null,null,null,"Total",{"$f":"SUM(F67:F72)","v":0},0]
[{"$f":"IFERROR(INDIRECT(\"'C:\\Users\\Moi\\OneDrive\\Documents\\[Formulaires Gravereau.xlsx]Action\"&$N74&\"'!$D$6\"),\"\")","v":""},{"$f":"IF(C74<>\"\",C74,\"\")","v":""},{"$f":"IFERROR(INDIRECT(\"'C:\\Users\\Moi\\OneDrive\\Documents\\[Formulaires Gravereau.xlsx]Action\"&$N74&\"'!$D$4\"),\"\")","v":""},{"$f":"IFERROR(INDIRECT(\"'C:\\Users\\Moi\\OneDrive\\Documents\\[Formulaires Gravereau.xlsx]Action\"&$N74&\"'!$h$4\"),\"\")","v":""},"","",{"$f":"IFERROR(VLOOKUP(E74,'[1]Tarif de base'!D:E,2,FALSE)*F74,\"\")","v":""},"","","",{"$f":"IFERROR(IF(G80-H74-I74-J74<>0,\"Attention il manque \"&G80-H74-I74-J74&\"€\",\"Règlement OK\"),\"Pas de règlement\")","v":"Pas de règlement"},"",null,10]
[null,"",null,null,{"$f":"IFERROR(INDIRECT(\"'C:\\Users\\Moi\\OneDrive\\Documents\\[Formulaires Gravereau.xlsx]Action\"&$N74&\"'!$D$11\"),\"\")","v":""},{"$f":"IFERROR(INDIRECT(\"'C:\\Users\\Moi\\OneDrive\\Documents\\[Formulaires Gravereau.xlsx]Action\"&$N74&\"'!$h$11\"),\"\")","v":""},{"$f":"IFERROR(VLOOKUP(E75,'[1]Tarif de base'!D:E,2,FALSE)*F75,\"\")","v":""}]
[null,{"$f":"B75","v":""},null,null,{"$f":"IFERROR(INDIRECT(\"'C:\\Users\\Moi\\OneDrive\\Documents\\[Formulaires Gravereau.xlsx]Action\"&$N74&\"'!$D$13\"),\"\")","v":""},{"$f":"IFERROR(INDIRECT(\"'C:\\Users\\Moi\\OneDrive\\Documents\\[Formulaires Gravereau.xlsx]Action\"&$N74&\"'!$h$13\"),\"\")","v":""},{"$f":"IFERROR(VLOOKUP(E76,'[1]Tarif de base'!D:E,2,FALSE)*F76,\"\")","v":""}]
[null,"",null,null,{"$f":"IFERROR(INDIRECT(\"'C:\\Users\\Moi\\OneDrive\\Documents\\[Formulaires Gravereau.xlsx]Action\"&$N74&\"'!$D$15\"),\"\")","v":""},{"$f":"IFERROR(INDIRECT(\"'C:\\Users\\Moi\\OneDrive\\Documents\\[Formulaires Gravereau.xlsx]Action\"&$N74&\"'!$h$15\"),\"\")","v":""},{"$f":"IFERROR(VLOOKUP(E77,'[1]Tarif de base'!D:E,2,FALSE)*F77,\"\")","v":""}]
[null,"",null,null,{"$f":"IFERROR(INDIRECT(\"'C:\\Users\\Moi\\OneDrive\\Documents\\[Formulaires Gravereau.xlsx]Action\"&$N74&\"'!$D$17\"),\"\")","v":""},{"$f":"IFERROR(INDIRECT(\"'C:\\Users\\Moi\\OneDrive\\Documents\\[Formulaires Gravereau.xlsx]Action\"&$N74&\"'!$h$17\"),\"\")","v":""},{"$f":"IFERROR(VLOOKUP(E78,'[1]Tarif de base'!D:E,2,FALSE)*F78,\"\")","v":""}]
[null,"",null,null,{"$f":"IFERROR(INDIRECT(\"'C:\\Users\\Moi\\OneDrive\\Documents\\[Formulaires Gravereau.xlsx]Action\"&$N74&\"'!$D$19\"),\"\")","v":""},{"$f":"IFERROR(INDIRECT(\"'C:\\Users\\Moi\\OneDrive\\Documents\\[Formulaires Gravereau.xlsx]Action\"&$N74&\"'!$h$19\"),\"\")","v":""},{"$f":"IFERROR(VLOOKUP(E79,'[1]Tarif de base'!D:E,2,FALSE)*F79,\"\")","v":""}]
[null,"",null,null,"Total",{"$f":"SUM(F74:F79)","v":0},{"$f":"SUM(G74:G79)","v":0}]
[{"$f":"IFERROR(INDIRECT(\"'C:\\Users\\Moi\\OneDrive\\Documents\\[Formulaires Gravereau.xlsx]Action\"&$N81&\"'!$D$6\"),\"\")","v":""},{"$f":"IF(C81<>\"\",C81,\"\")","v":""},{"$f":"IFERROR(INDIRECT(\"'C:\\Users\\Moi\\OneDrive\\Documents\\[Formulaires Gravereau.xlsx]Action\"&$N81&\"'!$D$4\"),\"\")","v":""},{"$f":"IFERROR(INDIRECT(\"'C:\\Users\\Moi\\OneDrive\\Documents\\[Formulaires Gravereau.xlsx]Action\"&$N81&\"'!$h$4\"),\"\")","v":""},{"$f":"IFERROR(INDIRECT(\"'C:\\Users\\Moi\\OneDrive\\Documents\\[Formulaires Gravereau.xlsx]Action\"&$N81&\"'!$D$9\"),\"\")","v":""},{"$f":"IFERROR(INDIRECT(\"'C:\\Users\\Moi\\OneDrive\\Documents\\[Formulaires Gravereau.xlsx]Action\"&$N81&\"'!$h$9\"),\"\")","v":""},{"$f":"IFERROR(VLOOKUP(E81,'[1]Tarif de base'!D:E,2,FALSE)*F81,\"\")","v":""},{"$f":"IFERROR(INDIRECT(\"'C:\\Users\\Moi\\OneDrive\\Documents\\[Formulaires Gravereau.xlsx]Action\"&$N81&\"'!$d$26\"),\"\")","v":""},{"$f":"IFERROR(INDIRECT(\"'C:\\Users\\Moi\\OneDrive\\Documents\\[Formulaires Gravereau.xlsx]Action\"&$N81&\"'!$d$28\"),\"\")","v":""},{"$f":"IFERROR(INDIRECT(\"'C:\\Users\\Moi\\OneDrive\\Documents\\[Formulaires Gravereau.xlsx]Action\"&$N81&\"'!$h$26\"),\"\")","v":""},{"$f":"IFERROR(IF(G87-H81-I81-J81<>0,\"Attention il manque \"&G87-H81-I81-J81&\"€\",\"Règlement OK\"),\"Pas de règlement\")","v":"Pas de règlement"},{"$f":"IFERROR(INDIRECT(\"'C:\\Users\\Moi\\OneDrive\\Documents\\[Formulaires Gravereau.xlsx]Action\"&$N81&\"'!$d$30\"),\"\")","v":""},null,11]
[null,{"$f":"B81","v":""},null,null,{"$f":"IFERROR(INDIRECT(\"'C:\\Users\\Moi\\OneDrive\\Documents\\[Formulaires Gravereau.xlsx]Action\"&$N81&\"'!$D$11\"),\"\")","v":""},{"$f":"IFERROR(INDIRECT(\"'C:\\Users\\Moi\\OneDrive\\Documents\\[Formulaires Gravereau.xlsx]Action\"&$N81&\"'!$h$11\"),\"\")","v":""},{"$f":"IFERROR(VLOOKUP(E82,'[1]Tarif de base'!D:E,2,FALSE)*F82,\"\")","v":""}]
[null,"",null,null,{"$f":"IFERROR(INDIRECT(\"'C:\\Users\\Moi\\OneDrive\\Documents\\[Formulaires Gravereau.xlsx]Action\"&$N81&\"'!$D$13\"),\"\")","v":""},{"$f":"IFERROR(INDIRECT(\"'C:\\Users\\Moi\\OneDrive\\Documents\\[Formulaires Gravereau.xlsx]Action\"&$N81&\"'!$h$13\"),\"\")","v":""},{"$f":"IFERROR(VLOOKUP(E83,'[1]Tarif de base'!D:E,2,FALSE)*F83,\"\")","v":""}]
[null,"",null,null,{"$f":"IFERROR(INDIRECT(\"'C:\\Users\\Moi\\OneDrive\\Documents\\[Formulaires Gravereau.xlsx]Action\"&$N81&\"'!$D$15\"),\"\")","v":""},{"$f":"IFERROR(INDIRECT(\"'C:\\Users\\Moi\\OneDrive\\Documents\\[Formulaires Gravereau.xlsx]Action\"&$N81&\"'!$h$15\"),\"\")","v":""},{"$f":"IFERROR(VLOOKUP(E84,'[1]Tarif de base'!D:E,2,FALSE)*F84,\"\")","v":""}]
[null,"",null,null,{"$f":"IFERROR(INDIRECT(\"'C:\\Users\\Moi\\OneDrive\\Documents\\[Formulaires Gravereau.xlsx]Action\"&$N81&\"'!$D$17\"),\"\")","v":""},{"$f":"IFERROR(INDIRECT(\"'C:\\Users\\Moi\\OneDrive\\Documents\\[Formulaires Gravereau.xlsx]Action\"&$N81&\"'!$h$17\"),\"\")","v":""},{"$f":"IFERROR(VLOOKUP(E85,'[1]Tarif de base'!D:E,2,FALSE)*F85,\"\")","v":""}]
[null,"",null,null,{"$f":"IFERROR(INDIRECT(\"'C:\\Users\\Moi\\OneDrive\\Documents\\[Formulaires Gravereau.xlsx]Action\"&$N81&\"'!$D$19\"),\"\")","v":""},{"$f":"IFERROR(INDIRECT(\"'C:\\Users\\Moi\\OneDrive\\Documents\\[Formulaires Gravereau.xlsx]Action\"&$N81&\"'!$h$19\"),\"\")","v":""},{"$f":"IFERROR(VLOOKUP(E86,'[1]Tarif de base'!D:E,2,FALSE)*F86,\"\")","v":""}]
[null,"",null,null,"Total",{"$f":"SUM(F81:F86)","v":0},{"$f":"SUM(G81:G86)","v":0}]
["",{"$f":"IF(C88<>\"\",C88,\"\")","v":""},"","","","",{"$f":"IFERROR(VLOOKUP(E88,'[1]Tarif de base'!D:E,2,FALSE)*F88,\"\")","v":""},"","","",{"$f":"IFERROR(IF(G94-H88-I88-J88<>0,\"Attention il manque \"&G94-H88-I88-J88&\"€\",\"Règlement OK\"),\"Pas de règlement\")","v":"Pas de règlement"},"",null,12]
[null,"",null,null,null,{"$f":"IFERROR(INDIRECT(\"'C:\\Users\\Moi\\OneDrive\\Documents\\[Formulaires Gravereau.xlsx]Action\"&$N88&\"'!$h$11\"),\"\")","v":""},{"$f":"IFERROR(VLOOKUP(E89,'[1]Tarif de base'!D:E,2,FALSE)*F89,\"\")","v":""}]
[null,"",null,null,{"$f":"IFERROR(INDIRECT(\"'C:\\Users\\Moi\\OneDrive\\Documents\\[Formulaires Gravereau.xlsx]Action\"&$N88&\"'!$D$13\"),\"\")","v":""},{"$f":"IFERROR(INDIRECT(\"'C:\\Users\\Moi\\OneDrive\\Documents\\[Formulaires Gravereau.xlsx]Action\"&$N88&\"'!$h$13\"),\"\")","v":""},{"$f":"IFERROR(VLOOKUP(E90,'[1]Tarif de base'!D:E,2,FALSE)*F90,\"\")","v":""}]
[null,"",null,null,{"$f":"IFERROR(INDIRECT(\"'C:\\Users\\Moi\\OneDrive\\Documents\\[Formulaires Gravereau.xlsx]Action\"&$N88&\"'!$D$15\"),\"\")","v":""},{"$f":"IFERROR(INDIRECT(\"'C:\\Users\\Moi\\OneDrive\\Documents\\[Formulaires Gravereau.xlsx]Action\"&$N88&\"'!$h$15\"),\"\")","v":""},{"$f":"IFERROR(VLOOKUP(E91,'[1]Tarif de base'!D:E,2,FALSE)*F91,\"\")","v":""}]
[null,"",null,null,{"$f":"IFERROR(INDIRECT(\"'C:\\Users\\Moi\\OneDrive\\Documents\\[Formulaires Gravereau.xlsx]Action\"&$N88&\"'!$D$17\"),\"\")","v":""},{"$f":"IFERROR(INDIRECT(\"'C:\\Users\\Moi\\OneDrive\\Documents\\[Formulaires Gravereau.xlsx]Action\"&$N88&\"'!$h$17\"),\"\")","v":""},{"$f":"IFERROR(VLOOKUP(E92,'[1]Tarif de base'!D:E,2,FALSE)*F92,\"\")","v":""}]
[null,"",null,null,{"$f":"IFERROR(INDIRECT(\"'C:\\Users\\Moi\\OneDrive\\Documents\\[Formulaires Gravereau.xlsx]Action\"&$N88&\"'!$D$19\"),\"\")","v":""},{"$f":"IFERROR(INDIRECT(\"'C:\\Users\\Moi\\OneDrive\\Documents\\[Formulaires Gravereau.xlsx]Action\"&$N88&\"'!$h$19\"),\"\")","v":""},{"$f":"IFERROR(VLOOKUP(E93,'[1]Tarif de base'!D:E,2,FALSE)*F93,\"\")","v":""}]
[null,"",null,null,"Total",{"$f":"SUM(F88:F93)","v":0},{"$f":"SUM(G88:G93)","v":0}]
["","","","","","",{"$f":"IFERROR(VLOOKUP(E95,'[1]Tarif de base'!D:E,2,FALSE)*F95,\"\")","v":""},"","","",{"$f":"IFERROR(IF(G101-H95-I95-J95<>0,\"Attention il manque \"&G101-H95-I95-J95&\"€\",\"Règlement OK\"),\"Pas de règlement\")","v":"Pas de règlement"},"",null,13]
[null,"",null,null,{"$f":"IFERROR(INDIRECT(\"'C:\\Users\\Moi\\OneDrive\\Documents\\[Formulaires Gravereau.xlsx]Action\"&$N95&\"'!$D$11\"),\"\")","v":""},{"$f":"IFERROR(INDIRECT(\"'C:\\Users\\Moi\\OneDrive\\Documents\\[Formulaires Gravereau.xlsx]Action\"&$N95&\"'!$h$11\"),\"\")","v":""},{"$f":"IFERROR(VLOOKUP(E96,'[1]Tarif de base'!D:E,2,FALSE)*F96,\"\")","v":""}]
[null,"",null,null,"","",{"$f":"IFERROR(VLOOKUP(E97,'[1]Tarif de base'!D:E,2,FALSE)*F97,\"\")","v":""}]
[null,"",null,null,"","",{"$f":"IFERROR(VLOOKUP(E98,'[1]Tarif de base'!D:E,2,FALSE)*F98,\"\")","v":""}]
[null,"",null,null,"","",{"$f":"IFERROR(VLOOKUP(E99,'[1]Tarif de base'!D:E,2,FALSE)*F99,\"\")","v":""}]
[null,"",null,null,"","",{"$f":"IFERROR(VLOOKUP(E100,'[1]Tarif de base'!D:E,2,FALSE)*F100,\"\")","v":""}]
[null,"",null,null,"Total",{"$f":"SUM(F95:F100)","v":0},{"$f":"SUM(G95:G100)","v":0}]
[{"$f":"IFERROR(INDIRECT(\"'C:\\Users\\Moi\\OneDrive\\Documents\\[Formulaires Gravereau.xlsx]Action\"&$N102&\"'!$D$6\"),\"\")","v":""},{"$f":"IF(C102<>\"\",C102,\"\")","v":""},{"$f":"IFERROR(INDIRECT(\"'C:\\Users\\Moi\\OneDrive\\Documents\\[Formulaires Gravereau.xlsx]Action\"&$N102&\"'!$D$4\"),\"\")","v":""},{"$f":"IFERROR(INDIRECT(\"'C:\\Users\\Moi\\OneDrive\\Documents\\[Formulaires Gravereau.xlsx]Action\"&$N102&\"'!$h$4\"),\"\")","v":""},{"$f":"IFERROR(INDIRECT(\"'C:\\Users\\Moi\\OneDrive\\Documents\\[Formulaires Gravereau.xlsx]Action\"&$N102&\"'!$D$9\"),\"\")","v":""},{"$f":"IFERROR(INDIRECT(\"'C:\\Users\\Moi\\OneDrive\\Documents\\[Formulaires Gravereau.xlsx]Action\"&$N102&\"'!$h$9\"),\"\")","v":""},{"$f":"IFERROR(VLOOKUP(E102,'[1]Tarif de base'!D:E,2,FALSE)*F102,\"\")","v":""},{"$f":"IFERROR(INDIRECT(\"'C:\\Users\\Moi\\OneDrive\\Documents\\[Formulaires Gravereau.xlsx]Action\"&$N102&\"'!$d$26\"),\"\")","v":""},{"$f":"IFERROR(INDIRECT(\"'C:\\Users\\Moi\\OneDrive\\Documents\\[Formulaires Gravereau.xlsx]Action\"&$N102&\"'!$d$28\"),\"\")","v":""},{"$f":"IFERROR(INDIRECT(\"'C:\\Users\\Moi\\OneDrive\\Documents\\[Formulaires Gravereau.xlsx]Action\"&$N102&\"'!$h$26\"),\"\")","v":""},{"$f":"IFERROR(IF(G108-H102-I102-J102<>0,\"Attention il manque \"&G108-H102-I102-J102&\"€\",\"Règlement OK\"),\"Pas de règlement\")","v":"Pas de règlement"},{"$f":"IFERROR(INDIRECT(\"'C:\\Users\\Moi\\OneDrive\\Documents\\[Formulaires Gravereau.xlsx]Action\"&$N102&\"'!$d$30\"),\"\")","v":""},null,14]
[null,"",null,null,{"$f":"IFERROR(INDIRECT(\"'C:\\Users\\Moi\\OneDrive\\Documents\\[Formulaires Gravereau.xlsx]Action\"&$N102&\"'!$D$11\"),\"\")","v":""},{"$f":"IFERROR(INDIRECT(\"'C:\\Users\\Moi\\OneDrive\\Documents\\[Formulaires Gravereau.xlsx]Action\"&$N102&\"'!$h$11\"),\"\")","v":""},{"$f":"IFERROR(VLOOKUP(E103,'[1]Tarif de base'!D:E,2,FALSE)*F103,\"\")","v":""}]
[null,"",null,null,{"$f":"IFERROR(INDIRECT(\"'C:\\Users\\Moi\\OneDrive\\Documents\\[Formulaires Gravereau.xlsx]Action\"&$N102&\"'!$D$13\"),\"\")","v":""},{"$f":"IFERROR(INDIRECT(\"'C:\\Users\\Moi\\OneDrive\\Documents\\[Formulaires Gravereau.xlsx]Action\"&$N102&\"'!$h$13\"),\"\")","v":""},{"$f":"IFERROR(VLOOKUP(E104,'[1]Tarif de base'!D:E,2,FALSE)*F104,\"\")","v":""}]
[null,"",null,null,{"$f":"IFERROR(INDIRECT(\"'C:\\Users\\Moi\\OneDrive\\Documents\\[Formulaires Gravereau.xlsx]Action\"&$N102&\"'!$D$15\"),\"\")","v":""},{"$f":"IFERROR(INDIRECT(\"'C:\\Users\\Moi\\OneDrive\\Documents\\[Formulaires Gravereau.xlsx]Action\"&$N102&\"'!$h$15\"),\"\")","v":""},{"$f":"IFERROR(VLOOKUP(E105,'[1]Tarif de base'!D:E,2,FALSE)*F105,\"\")","v":""}]
[null,"",null,null,{"$f":"IFERROR(INDIRECT(\"'C:\\Users\\Moi\\OneDrive\\Documents\\[Formulaires Gravereau.xlsx]Action\"&$N102&\"'!$D$17\"),\"\")","v":""},{"$f":"IFERROR(INDIRECT(\"'C:\\Users\\Moi\\OneDrive\\Documents\\[Formulaires Gravereau.xlsx]Action\"&$N102&\"'!$h$17\"),\"\")","v":""},{"$f":"IFERROR(VLOOKUP(E106,'[1]Tarif de base'!D:E,2,FALSE)*F106,\"\")","v":""}]
[null,"",null,null,{"$f":"IFERROR(INDIRECT(\"'C:\\Users\\Moi\\OneDrive\\Documents\\[Formulaires Gravereau.xlsx]Action\"&$N102&\"'!$D$19\"),\"\")","v":""},{"$f":"IFERROR(INDIRECT(\"'C:\\Users\\Moi\\OneDrive\\Documents\\[Formulaires Gravereau.xlsx]Action\"&$N102&\"'!$h$19\"),\"\")","v":""},{"$f":"IFERROR(VLOOKUP(E107,'[1]Tarif de base'!D:E,2,FALSE)*F107,\"\")","v":""}]
[null,"",null,null,"Total",{"$f":"SUM(F102:F107)","v":0},{"$f":"SUM(G102:G107)","v":0}]
["","","","","","",{"$f":"IFERROR(VLOOKUP(E109,'[1]Tarif de base'!D:E,2,FALSE)*F109,\"\")","v":""},"","","",{"$f":"IFERROR(IF(G115-H109-I109-J109<>0,\"Attention il manque \"&G115-H109-I109-J109&\"€\",\"Règlement OK\"),\"Pas de règlement\")","v":"Pas de règlement"},"",null,15]
[null,"",null,null,{"$f":"IFERROR(INDIRECT(\"'C:\\Users\\Moi\\OneDrive\\Documents\\[Formulaires Gravereau.xlsx]Action\"&$N109&\"'!$D$11\"),\"\")","v":""},{"$f":"IFERROR(INDIRECT(\"'C:\\Users\\Moi\\OneDrive\\Documents\\[Formulaires Gravereau.xlsx]Action\"&$N109&\"'!$h$11\"),\"\")","v":""},{"$f":"IFERROR(VLOOKUP(E110,'[1]Tarif de base'!D:E,2,FALSE)*F110,\"\")","v":""}]
[null,"",null,null,"","",{"$f":"IFERROR(VLOOKUP(E111,'[1]Tarif de base'!D:E,2,FALSE)*F111,\"\")","v":""}]
[null,"",null,null,"","",{"$f":"IFERROR(VLOOKUP(E112,'[1]Tarif de base'!D:E,2,FALSE)*F112,\"\")","v":""}]
[null,"",null,null,"","",{"$f":"IFERROR(VLOOKUP(E113,'[1]Tarif de base'!D:E,2,FALSE)*F113,\"\")","v":""}]
[null,"",null,null,"","",{"$f":"IFERROR(VLOOKUP(E114,'[1]Tarif de base'!D:E,2,FALSE)*F114,\"\")","v":""}]
[null,"",null,null,"Total",{"$f":"SUM(F109:F114)","v":0},{"$f":"SUM(G109:G114)","v":0}]
["","","","","","",{"$f":"IFERROR(VLOOKUP(E116,'[1]Tarif de base'!D:E,2,FALSE)*F116,\"\")","v":""},"","","",{"$f":"IFERROR(IF(G122-H116-I116-J116<>0,\"Attention il manque \"&G122-H116-I116-J116&\"€\",\"Règlement OK\"),\"Pas de règlement\")","v":"Pas de règlement"},"",null,16]
[null,"",null,null,{"$f":"IFERROR(INDIRECT(\"'C:\\Users\\Moi\\OneDrive\\Documents\\[Formulaires Gravereau.xlsx]Action\"&$N116&\"'!$D$11\"),\"\")","v":""},{"$f":"IFERROR(INDIRECT(\"'C:\\Users\\Moi\\OneDrive\\Documents\\[Formulaires Gravereau.xlsx]Action\"&$N116&\"'!$h$11\"),\"\")","v":""},{"$f":"IFERROR(VLOOKUP(E117,'[1]Tarif de base'!D:E,2,FALSE)*F117,\"\")","v":""}]
[null,"",null,null,"","",{"$f":"IFERROR(VLOOKUP(E118,'[1]Tarif de base'!D:E,2,FALSE)*F118,\"\")","v":""}]
[null,"",null,null,"","",{"$f":"IFERROR(VLOOKUP(E119,'[1]Tarif de base'!D:E,2,FALSE)*F119,\"\")","v":""}]
[null,"",null,null,"","",{"$f":"IFERROR(VLOOKUP(E120,'[1]Tarif de base'!D:E,2,FALSE)*F120,\"\")","v":""}]
[null,"",null,null,"","",{"$f":"IFERROR(VLOOKUP(E121,'[1]Tarif de base'!D:E,2,FALSE)*F121,\"\")","v":""}]
[null,"",null,null,"Total",{"$f":"SUM(F116:F121)","v":0},{"$f":"SUM(G116:G121)","v":0}]
["","","","","","",{"$f":"IFERROR(VLOOKUP(E123,'[1]Tarif de base'!D:E,2,FALSE)*F123,\"\")","v":""},"","","",{"$f":"IFERROR(IF(G129-H123-I123-J123<>0,\"Attention il manque \"&G129-H123-I123-J123&\"€\",\"Règlement OK\"),\"Pas de règlement\")","v":"Pas de règlement"},"",null,17]
[null,"",null,null,{"$f":"IFERROR(INDIRECT(\"'C:\\Users\\Moi\\OneDrive\\Documents\\[Formulaires Gravereau.xlsx]Action\"&$N123&\"'!$D$11\"),\"\")","v":""},{"$f":"IFERROR(INDIRECT(\"'C:\\Users\\Moi\\OneDrive\\Documents\\[Formulaires Gravereau.xlsx]Action\"&$N123&\"'!$h$11\"),\"\")","v":""},{"$f":"IFERROR(VLOOKUP(E124,'[1]Tarif de base'!D:E,2,FALSE)*F124,\"\")","v":""}]
[null,"",null,null,"","",{"$f":"IFERROR(VLOOKUP(E125,'[1]Tarif de base'!D:E,2,FALSE)*F125,\"\")","v":""}]
[null,"",null,null,"","",{"$f":"IFERROR(VLOOKUP(E126,'[1]Tarif de base'!D:E,2,FALSE)*F126,\"\")","v":""}]
[null,"",null,null,"","",{"$f":"IFERROR(VLOOKUP(E127,'[1]Tarif de base'!D:E,2,FALSE)*F127,\"\")","v":""}]
[null,"",null,null,"","",{"$f":"IFERROR(VLOOKUP(E128,'[1]Tarif de base'!D:E,2,FALSE)*F128,\"\")","v":""}]
[null,"",null,null,"Total",{"$f":"SUM(F123:F128)","v":0},{"$f":"SUM(G123:G128)","v":0}]
["","","","","","",{"$f":"IFERROR(VLOOKUP(E130,'[1]Tarif de base'!D:E,2,FALSE)*F130,\"\")","v":""},"","","",{"$f":"IFERROR(IF(G136-H130-I130-J130<>0,\"Attention il manque \"&G136-H130-I130-J130&\"€\",\"Règlement OK\"),\"Pas de règlement\")","v":"Pas de règlement"},"",null,18]
[null,"",null,null,{"$f":"IFERROR(INDIRECT(\"'C:\\Users\\Moi\\OneDrive\\Documents\\[Formulaires Gravereau.xlsx]Action\"&$N130&\"'!$D$11\"),\"\")","v":""},{"$f":"IFERROR(INDIRECT(\"'C:\\Users\\Moi\\OneDrive\\Documents\\[Formulaires Gravereau.xlsx]Action\"&$N130&\"'!$h$11\"),\"\")","v":""},{"$f":"IFERROR(VLOOKUP(E131,'[1]Tarif de base'!D:E,2,FALSE)*F131,\"\")","v":""}]
[null,"",null,null,"","",{"$f":"IFERROR(VLOOKUP(E132,'[1]Tarif de base'!D:E,2,FALSE)*F132,\"\")","v":""}]
[null,"",null,null,"","",{"$f":"IFERROR(VLOOKUP(E133,'[1]Tarif de base'!D:E,2,FALSE)*F133,\"\")","v":""}]
[null,"",null,null,"","",{"$f":"IFERROR(VLOOKUP(E134,'[1]Tarif de base'!D:E,2,FALSE)*F134,\"\")","v":""}]
[null,"",null,null,"","",{"$f":"IFERROR(VLOOKUP(E135,'[1]Tarif de base'!D:E,2,FALSE)*F135,\"\")","v":""}]
[null,"",null,null,"Total",{"$f":"SUM(F130:F135)","v":0},{"$f":"SUM(G130:G135)","v":0}]
["","","","","","",{"$f":"IFERROR(VLOOKUP(E137,'[1]Tarif de base'!D:E,2,FALSE)*F137,\"\")","v":""},"","","",{"$f":"IFERROR(IF(G143-H137-I137-J137<>0,\"Attention il manque \"&G143-H137-I137-J137&\"€\",\"Règlement OK\"),\"Pas de règlement\")","v":"Pas de règlement"},"",null,19]
[null,"",null,null,{"$f":"IFERROR(INDIRECT(\"'C:\\Users\\Moi\\OneDrive\\Documents\\[Formulaires Gravereau.xlsx]Action\"&$N137&\"'!$D$11\"),\"\")","v":""},{"$f":"IFERROR(INDIRECT(\"'C:\\Users\\Moi\\OneDrive\\Documents\\[Formulaires Gravereau.xlsx]Action\"&$N137&\"'!$h$11\"),\"\")","v":""},{"$f":"IFERROR(VLOOKUP(E138,'[1]Tarif de base'!D:E,2,FALSE)*F138,\"\")","v":""}]
[null,"",null,null,"","",{"$f":"IFERROR(VLOOKUP(E139,'[1]Tarif de base'!D:E,2,FALSE)*F139,\"\")","v":""}]
[null,"",null,null,"","",{"$f":"IFERROR(VLOOKUP(E140,'[1]Tarif de base'!D:E,2,FALSE)*F140,\"\")","v":""}]
[null,"",null,null,"","",{"$f":"IFERROR(VLOOKUP(E141,'[1]Tarif de base'!D:E,2,FALSE)*F141,\"\")","v":""}]
[null,"",null,null,"","",{"$f":"IFERROR(VLOOKUP(E142,'[1]Tarif de base'!D:E,2,FALSE)*F142,\"\")","v":""}]
[null,"",null,null,"Total",{"$f":"SUM(F137:F142)","v":0},{"$f":"SUM(G137:G142)","v":0}]
["","","","","","",{"$f":"IFERROR(VLOOKUP(E144,'[1]Tarif de base'!D:E,2,FALSE)*F144,\"\")","v":""},"","","",{"$f":"IFERROR(IF(G150-H144-I144-J144<>0,\"Attention il manque \"&G150-H144-I144-J144&\"€\",\"Règlement OK\"),\"Pas de règlement\")","v":"Pas de règlement"},"",null,20]
[null,"",null,null,{"$f":"IFERROR(INDIRECT(\"'C:\\Users\\Moi\\OneDrive\\Documents\\[Formulaires Gravereau.xlsx]Action\"&$N144&\"'!$D$11\"),\"\")","v":""},{"$f":"IFERROR(INDIRECT(\"'C:\\Users\\Moi\\OneDrive\\Documents\\[Formulaires Gravereau.xlsx]Action\"&$N144&\"'!$h$11\"),\"\")","v":""},{"$f":"IFERROR(VLOOKUP(E145,'[1]Tarif de base'!D:E,2,FALSE)*F145,\"\")","v":""}]
[null,{"$f":"B145","v":""},null,null,"","",{"$f":"IFERROR(VLOOKUP(E146,'[1]Tarif de base'!D:E,2,FALSE)*F146,\"\")","v":""}]
[null,"",null,null,"","",{"$f":"IFERROR(VLOOKUP(E147,'[1]Tarif de base'!D:E,2,FALSE)*F147,\"\")","v":""}]
[null,"",null,null,"","",{"$f":"IFERROR(VLOOKUP(E148,'[1]Tarif de base'!D:E,2,FALSE)*F148,\"\")","v":""}]
[null,"",null,null,"","",{"$f":"IFERROR(VLOOKUP(E149,'[1]Tarif de base'!D:E,2,FALSE)*F149,\"\")","v":""}]
[null,"",null,null,"Total",{"$f":"SUM(F144:F149)","v":0},{"$f":"SUM(G144:G149)","v":0}]
["","","","","","",{"$f":"IFERROR(VLOOKUP(E151,'[1]Tarif de base'!D:E,2,FALSE)*F151,\"\")","v":""},"","","",{"$f":"IFERROR(IF(G157-H151-I151-J151<>0,\"Attention il manque \"&G157-H151-I151-J151&\"€\",\"Règlement OK\"),\"Pas de règlement\")","v":"Pas de règlement"},"",null,21]
[null,"",null,null,{"$f":"IFERROR(INDIRECT(\"'C:\\Users\\Moi\\OneDrive\\Documents\\[Formulaires Gravereau.xlsx]Action\"&$N151&\"'!$D$11\"),\"\")","v":""},{"$f":"IFERROR(INDIRECT(\"'C:\\Users\\Moi\\OneDrive\\Documents\\[Formulaires Gravereau.xlsx]Action\"&$N151&\"'!$h$11\"),\"\")","v":""},{"$f":"IFERROR(VLOOKUP(E152,'[1]Tarif de base'!D:E,2,FALSE)*F152,\"\")","v":""}]
[null,"",null,null,"","",{"$f":"IFERROR(VLOOKUP(E153,'[1]Tarif de base'!D:E,2,FALSE)*F153,\"\")","v":""}]
[null,"",null,null,"","",{"$f":"IFERROR(VLOOKUP(E154,'[1]Tarif de base'!D:E,2,FALSE)*F154,\"\")","v":""}]
[null,"",null,null,"","",{"$f":"IFERROR(VLOOKUP(E155,'[1]Tarif de base'!D:E,2,FALSE)*F155,\"\")","v":""}]
[null,"",null,null,"","",{"$f":"IFERROR(VLOOKUP(E156,'[1]Tarif de base'!D:E,2,FALSE)*F156,\"\")","v":""}]
[null,"",null,null,"Total",{"$f":"SUM(F151:F156)","v":0},{"$f":"SUM(G151:G156)","v":0}]
["","","","","","",{"$f":"IFERROR(VLOOKUP(E158,'[1]Tarif de base'!D:E,2,FALSE)*F158,\"\")","v":""},"","","",{"$f":"IFERROR(IF(G164-H158-I158-J158<>0,\"Attention il manque \"&G164-H158-I158-J158&\"€\",\"Règlement OK\"),\"Pas de règlement\")","v":"Pas de règlement"},"",null,22]
[null,"",null,null,{"$f":"IFERROR(INDIRECT(\"'C:\\Users\\Moi\\OneDrive\\Documents\\[Formulaires Gravereau.xlsx]Action\"&$N158&\"'!$D$11\"),\"\")","v":""},{"$f":"IFERROR(INDIRECT(\"'C:\\Users\\Moi\\OneDrive\\Documents\\[Formulaires Gravereau.xlsx]Action\"&$N158&\"'!$h$11\"),\"\")","v":""},{"$f":"IFERROR(VLOOKUP(E159,'[1]Tarif de base'!D:E,2,FALSE)*F159,\"\")","v":""}]
[null,"",null,null,"","",{"$f":"IFERROR(VLOOKUP(E160,'[1]Tarif de base'!D:E,2,FALSE)*F160,\"\")","v":""}]
[null,"",null,null,"","",{"$f":"IFERROR(VLOOKUP(E161,'[1]Tarif de base'!D:E,2,FALSE)*F161,\"\")","v":""}]
[null,"",null,null,"","",{"$f":"IFERROR(VLOOKUP(E162,'[1]Tarif de base'!D:E,2,FALSE)*F162,\"\")","v":""}]
[null,"",null,null,"","",{"$f":"IFERROR(VLOOKUP(E163,'[1]Tarif de base'!D:E,2,FALSE)*F163,\"\")","v":""}]
[null,"",null,null,"Total",{"$f":"SUM(F158:F163)","v":0},{"$f":"SUM(G158:G163)","v":0}]
["","","","","","",{"$f":"IFERROR(VLOOKUP(E165,'[1]Tarif de base'!D:E,2,FALSE)*F165,\"\")","v":""},"","","",{"$f":"IFERROR(IF(G171-H165-I165-J165<>0,\"Attention il manque \"&G171-H165-I165-J165&\"€\",\"Règlement OK\"),\"Pas de règlement\")","v":"Pas de règlement"},"",null,23]
[null,"",null,null,{"$f":"IFERROR(INDIRECT(\"'C:\\Users\\Moi\\OneDrive\\Documents\\[Formulaires Gravereau.xlsx]Action\"&$N165&\"'!$D$11\"),\"\")","v":""},{"$f":"IFERROR(INDIRECT(\"'C:\\Users\\Moi\\OneDrive\\Documents\\[Formulaires Gravereau.xlsx]Action\"&$N165&\"'!$h$11\"),\"\")","v":""},{"$f":"IFERROR(VLOOKUP(E166,'[1]Tarif de base'!D:E,2,FALSE)*F166,\"\")","v":""}]
[null,"",null,null,"","",{"$f":"IFERROR(VLOOKUP(E167,'[1]Tarif de base'!D:E,2,FALSE)*F167,\"\")","v":""}]
[null,"",null,null,"","",{"$f":"IFERROR(VLOOKUP(E168,'[1]Tarif de base'!D:E,2,FALSE)*F168,\"\")","v":""}]
[null,"",null,null,"","",{"$f":"IFERROR(VLOOKUP(E169,'[1]Tarif de base'!D:E,2,FALSE)*F169,\"\")","v":""}]
[null,"",null,null,"","",{"$f":"IFERROR(VLOOKUP(E170,'[1]Tarif de base'!D:E,2,FALSE)*F170,\"\")","v":""}]
[null,"",null,null,"Total",{"$f":"SUM(F165:F170)","v":0},{"$f":"SUM(G165:G170)","v":0}]
[{"$f":"IFERROR(INDIRECT(\"'C:\\Users\\Moi\\OneDrive\\Documents\\[Formulaires Gravereau.xlsx]Action\"&$N172&\"'!$D$6\"),\"\")","v":""},{"$f":"IF(C172<>\"\",C172,\"\")","v":""},{"$f":"IFERROR(INDIRECT(\"'C:\\Users\\Moi\\OneDrive\\Documents\\[Formulaires Gravereau.xlsx]Action\"&$N172&\"'!$D$4\"),\"\")","v":""},{"$f":"IFERROR(INDIRECT(\"'C:\\Users\\Moi\\OneDrive\\Documents\\[Formulaires Gravereau.xlsx]Action\"&$N172&\"'!$h$4\"),\"\")","v":""},{"$f":"IFERROR(INDIRECT(\"'C:\\Users\\Moi\\OneDrive\\Documents\\[Formulaires Gravereau.xlsx]Action\"&$N172&\"'!$D$9\"),\"\")","v":""},{"$f":"IFERROR(INDIRECT(\"'C:\\Users\\Moi\\OneDrive\\Documents\\[Formulaires Gravereau.xlsx]Action\"&$N172&\"'!$h$9\"),\"\")","v":""},{"$f":"IFERROR(VLOOKUP(E172,'[1]Tarif de base'!D:E,2,FALSE)*F172,\"\")","v":""},{"$f":"IFERROR(INDIRECT(\"'C:\\Users\\Moi\\OneDrive\\Documents\\[Formulaires Gravereau.xlsx]Action\"&$N172&\"'!$d$26\"),\"\")","v":""},{"$f":"IFERROR(INDIRECT(\"'C:\\Users\\Moi\\OneDrive\\Documents\\[Formulaires Gravereau.xlsx]Action\"&$N172&\"'!$d$28\"),\"\")","v":""},{"$f":"IFERROR(INDIRECT(\"'C:\\Users\\Moi\\OneDrive\\Documents\\[Formulaires Gravereau.xlsx]Action\"&$N172&\"'!$h$26\"),\"\")","v":""},{"$f":"IFERROR(IF(G178-H172-I172-J172<>0,\"Attention il manque \"&G178-H172-I172-J172&\"€\",\"Règlement OK\"),\"Pas de règlement\")","v":"Pas de règlement"},{"$f":"IFERROR(INDIRECT(\"'C:\\Users\\Moi\\OneDrive\\Documents\\[Formulaires Gravereau.xlsx]Action\"&$N172&\"'!$d$30\"),\"\")","v":""},null,24]
[null,"",null,null,{"$f":"IFERROR(INDIRECT(\"'C:\\Users\\Moi\\OneDrive\\Documents\\[Formulaires Gravereau.xlsx]Action\"&$N172&\"'!$D$11\"),\"\")","v":""},{"$f":"IFERROR(INDIRECT(\"'C:\\Users\\Moi\\OneDrive\\Documents\\[Formulaires Gravereau.xlsx]Action\"&$N172&\"'!$h$11\"),\"\")","v":""},{"$f":"IFERROR(VLOOKUP(E173,'[1]Tarif de base'!D:E,2,FALSE)*F173,\"\")","v":""}]
[null,"",null,null,{"$f":"IFERROR(INDIRECT(\"'C:\\Users\\Moi\\OneDrive\\Documents\\[Formulaires Gravereau.xlsx]Action\"&$N172&\"'!$D$13\"),\"\")","v":""},{"$f":"IFERROR(INDIRECT(\"'C:\\Users\\Moi\\OneDrive\\Documents\\[Formulaires Gravereau.xlsx]Action\"&$N172&\"'!$h$13\"),\"\")","v":""},{"$f":"IFERROR(VLOOKUP(E174,'[1]Tarif de base'!D:E,2,FALSE)*F174,\"\")","v":""}]
[null,"",null,null,{"$f":"IFERROR(INDIRECT(\"'C:\\Users\\Moi\\OneDrive\\Documents\\[Formulaires Gravereau.xlsx]Action\"&$N172&\"'!$D$15\"),\"\")","v":""},{"$f":"IFERROR(INDIRECT(\"'C:\\Users\\Moi\\OneDrive\\Documents\\[Formulaires Gravereau.xlsx]Action\"&$N172&\"'!$h$15\"),\"\")","v":""},{"$f":"IFERROR(VLOOKUP(E175,'[1]Tarif de base'!D:E,2,FALSE)*F175,\"\")","v":""}]
[null,"",null,null,{"$f":"IFERROR(INDIRECT(\"'C:\\Users\\Moi\\OneDrive\\Documents\\[Formulaires Gravereau.xlsx]Action\"&$N172&\"'!$D$17\"),\"\")","v":""},{"$f":"IFERROR(INDIRECT(\"'C:\\Users\\Moi\\OneDrive\\Documents\\[Formulaires Gravereau.xlsx]Action\"&$N172&\"'!$h$17\"),\"\")","v":""},{"$f":"IFERROR(VLOOKUP(E176,'[1]Tarif de base'!D:E,2,FALSE)*F176,\"\")","v":""}]
[null,"",null,null,{"$f":"IFERROR(INDIRECT(\"'C:\\Users\\Moi\\OneDrive\\Documents\\[Formulaires Gravereau.xlsx]Action\"&$N172&\"'!$D$19\"),\"\")","v":""},{"$f":"IFERROR(INDIRECT(\"'C:\\Users\\Moi\\OneDrive\\Documents\\[Formulaires Gravereau.xlsx]Action\"&$N172&\"'!$h$19\"),\"\")","v":""},{"$f":"IFERROR(VLOOKUP(E177,'[1]Tarif de base'!D:E,2,FALSE)*F177,\"\")","v":""}]
[null,"",null,null,"Total",{"$f":"SUM(F172:F177)","v":0},{"$f":"SUM(G172:G177)","v":0}]
["","","","","","",{"$f":"IFERROR(VLOOKUP(E179,'[1]Tarif de base'!D:E,2,FALSE)*F179,\"\")","v":""},"","","",{"$f":"IFERROR(IF(G185-H179-I179-J179<>0,\"Attention il manque \"&G185-H179-I179-J179&\"€\",\"Règlement OK\"),\"Pas de règlement\")","v":"Pas de règlement"},"",null,25]
[null,"",null,null,{"$f":"IFERROR(INDIRECT(\"'C:\\Users\\Moi\\OneDrive\\Documents\\[Formulaires Gravereau.xlsx]Action\"&$N179&\"'!$D$11\"),\"\")","v":""},{"$f":"IFERROR(INDIRECT(\"'C:\\Users\\Moi\\OneDrive\\Documents\\[Formulaires Gravereau.xlsx]Action\"&$N179&\"'!$h$11\"),\"\")","v":""},{"$f":"IFERROR(VLOOKUP(E180,'[1]Tarif de base'!D:E,2,FALSE)*F180,\"\")","v":""}]
[null,"",null,null,"","",{"$f":"IFERROR(VLOOKUP(E181,'[1]Tarif de base'!D:E,2,FALSE)*F181,\"\")","v":""}]
[null,"",null,null,"","",{"$f":"IFERROR(VLOOKUP(E182,'[1]Tarif de base'!D:E,2,FALSE)*F182,\"\")","v":""}]
[null,"",null,null,"","",{"$f":"IFERROR(VLOOKUP(E183,'[1]Tarif de base'!D:E,2,FALSE)*F183,\"\")","v":""}]
[null,"",null,null,"","",{"$f":"IFERROR(VLOOKUP(E184,'[1]Tarif de base'!D:E,2,FALSE)*F184,\"\")","v":""}]
[null,"",null,null,"Total",{"$f":"SUM(F179:F184)","v":0},{"$f":"SUM(G179:G184)","v":0}]
["","","","","","",{"$f":"IFERROR(VLOOKUP(E186,'[1]Tarif de base'!D:E,2,FALSE)*F186,\"\")","v":""},"","","",{"$f":"IFERROR(IF(G192-H186-I186-J186<>0,\"Attention il manque \"&G192-H186-I186-J186&\"€\",\"Règlement OK\"),\"Pas de règlement\")","v":"Pas de règlement"},"",null,26]
[null,"",null,null,{"$f":"IFERROR(INDIRECT(\"'C:\\Users\\Moi\\OneDrive\\Documents\\[Formulaires Gravereau.xlsx]Action\"&$N186&\"'!$D$11\"),\"\")","v":""},{"$f":"IFERROR(INDIRECT(\"'C:\\Users\\Moi\\OneDrive\\Documents\\[Formulaires Gravereau.xlsx]Action\"&$N186&\"'!$h$11\"),\"\")","v":""},{"$f":"IFERROR(VLOOKUP(E187,'[1]Tarif de base'!D:E,2,FALSE)*F187,\"\")","v":""}]
[null,"",null,null,"","",{"$f":"IFERROR(VLOOKUP(E188,'[1]Tarif de base'!D:E,2,FALSE)*F188,\"\")","v":""}]
[null,"",null,null,"","",{"$f":"IFERROR(VLOOKUP(E189,'[1]Tarif de base'!D:E,2,FALSE)*F189,\"\")","v":""}]
[null,"",null,null,"","",{"$f":"IFERROR(VLOOKUP(E190,'[1]Tarif de base'!D:E,2,FALSE)*F190,\"\")","v":""}]
[null,"",null,null,"","",{"$f":"IFERROR(VLOOKUP(E191,'[1]Tarif de base'!D:E,2,FALSE)*F191,\"\")","v":""}]
[null,"",null,null,"Total",{"$f":"SUM(F186:F191)","v":0},{"$f":"SUM(G186:G191)","v":0}]
["","","","","","",{"$f":"IFERROR(VLOOKUP(E193,'[1]Tarif de base'!D:E,2,FALSE)*F193,\"\")","v":""},"","","",{"$f":"IFERROR(IF(G199-H193-I193-J193<>0,\"Attention il manque \"&G199-H193-I193-J193&\"€\",\"Règlement OK\"),\"Pas de règlement\")","v":"Pas de règlement"},"",null,27]
[null,"",null,null,{"$f":"IFERROR(INDIRECT(\"'C:\\Users\\Moi\\OneDrive\\Documents\\[Formulaires Gravereau.xlsx]Action\"&$N193&\"'!$D$11\"),\"\")","v":""},{"$f":"IFERROR(INDIRECT(\"'C:\\Users\\Moi\\OneDrive\\Documents\\[Formulaires Gravereau.xlsx]Action\"&$N193&\"'!$h$11\"),\"\")","v":""},{"$f":"IFERROR(VLOOKUP(E194,'[1]Tarif de base'!D:E,2,FALSE)*F194,\"\")","v":""}]
[null,"",null,null,"","",{"$f":"IFERROR(VLOOKUP(E195,'[1]Tarif de base'!D:E,2,FALSE)*F195,\"\")","v":""}]
[null,"",null,null,"","",{"$f":"IFERROR(VLOOKUP(E196,'[1]Tarif de base'!D:E,2,FALSE)*F196,\"\")","v":""}]
[null,"",null,null,"","",{"$f":"IFERROR(VLOOKUP(E197,'[1]Tarif de base'!D:E,2,FALSE)*F197,\"\")","v":""}]
[null,"",null,null,"","",{"$f":"IFERROR(VLOOKUP(E198,'[1]Tarif de base'!D:E,2,FALSE)*F198,\"\")","v":""}]
[null,"",null,null,"Total",{"$f":"SUM(F193:F198)","v":0},{"$f":"SUM(G193:G198)","v":0}]
["","","","","","",{"$f":"IFERROR(VLOOKUP(E200,'[1]Tarif de base'!D:E,2,FALSE)*F200,\"\")","v":""},"","","",{"$f":"IFERROR(IF(G206-H200-I200-J200<>0,\"Attention il manque \"&G206-H200-I200-J200&\"€\",\"Règlement OK\"),\"Pas de règlement\")","v":"Pas de règlement"},"",null,28]
[null,"",null,null,{"$f":"IFERROR(INDIRECT(\"'C:\\Users\\Moi\\OneDrive\\Documents\\[Formulaires Gravereau.xlsx]Action\"&$N200&\"'!$D$11\"),\"\")","v":""},{"$f":"IFERROR(INDIRECT(\"'C:\\Users\\Moi\\OneDrive\\Documents\\[Formulaires Gravereau.xlsx]Action\"&$N200&\"'!$h$11\"),\"\")","v":""},{"$f":"IFERROR(VLOOKUP(E201,'[1]Tarif de base'!D:E,2,FALSE)*F201,\"\")","v":""}]
[null,"",null,null,"","",{"$f":"IFERROR(VLOOKUP(E202,'[1]Tarif de base'!D:E,2,FALSE)*F202,\"\")","v":""}]
[null,"",null,null,"","",{"$f":"IFERROR(VLOOKUP(E203,'[1]Tarif de base'!D:E,2,FALSE)*F203,\"\")","v":""}]
[null,"",null,null,"","",{"$f":"IFERROR(VLOOKUP(E204,'[1]Tarif de base'!D:E,2,FALSE)*F204,\"\")","v":""}]
[null,"",null,null,"","",{"$f":"IFERROR(VLOOKUP(E205,'[1]Tarif de base'!D:E,2,FALSE)*F205,\"\")","v":""}]
[null,"",null,null,"Total",{"$f":"SUM(F200:F205)","v":0},{"$f":"SUM(G200:G205)","v":0}]
["","","","","","",{"$f":"IFERROR(VLOOKUP(E207,'[1]Tarif de base'!D:E,2,FALSE)*F207,\"\")","v":""},"","","",{"$f":"IFERROR(IF(G213-H207-I207-J207<>0,\"Attention il manque \"&G213-H207-I207-J207&\"€\",\"Règlement OK\"),\"Pas de règlement\")","v":"Pas de règlement"},"",null,29]
[null,"",null,null,{"$f":"IFERROR(INDIRECT(\"'C:\\Users\\Moi\\OneDrive\\Documents\\[Formulaires Gravereau.xlsx]Action\"&$N207&\"'!$D$11\"),\"\")","v":""},{"$f":"IFERROR(INDIRECT(\"'C:\\Users\\Moi\\OneDrive\\Documents\\[Formulaires Gravereau.xlsx]Action\"&$N207&\"'!$h$11\"),\"\")","v":""},{"$f":"IFERROR(VLOOKUP(E208,'[1]Tarif de base'!D:E,2,FALSE)*F208,\"\")","v":""}]
[null,"",null,null,"","",{"$f":"IFERROR(VLOOKUP(E209,'[1]Tarif de base'!D:E,2,FALSE)*F209,\"\")","v":""}]
[null,{"$f":"B209","v":""},null,null,"","",{"$f":"IFERROR(VLOOKUP(E210,'[1]Tarif de base'!D:E,2,FALSE)*F210,\"\")","v":""}]
[null,"",null,null,"","",{"$f":"IFERROR(VLOOKUP(E211,'[1]Tarif de base'!D:E,2,FALSE)*F211,\"\")","v":""}]
[null,"",null,null,"","",{"$f":"IFERROR(VLOOKUP(E212,'[1]Tarif de base'!D:E,2,FALSE)*F212,\"\")","v":""}]
[null,"",null,null,"Total",{"$f":"SUM(F207:F212)","v":0},{"$f":"SUM(G207:G212)","v":0}]
["","","","","","",{"$f":"IFERROR(VLOOKUP(E214,'[1]Tarif de base'!D:E,2,FALSE)*F214,\"\")","v":""},"","","",{"$f":"IFERROR(IF(G220-H214-I214-J214<>0,\"Attention il manque \"&G220-H214-I214-J214&\"€\",\"Règlement OK\"),\"Pas de règlement\")","v":"Pas de règlement"},"",null,30]
[null,"",null,null,{"$f":"IFERROR(INDIRECT(\"'C:\\Users\\Moi\\OneDrive\\Documents\\[Formulaires Gravereau.xlsx]Action\"&$N214&\"'!$D$11\"),\"\")","v":""},{"$f":"IFERROR(INDIRECT(\"'C:\\Users\\Moi\\OneDrive\\Documents\\[Formulaires Gravereau.xlsx]Action\"&$N214&\"'!$h$11\"),\"\")","v":""},{"$f":"IFERROR(VLOOKUP(E215,'[1]Tarif de base'!D:E,2,FALSE)*F215,\"\")","v":""}]
[null,"",null,null,"","",{"$f":"IFERROR(VLOOKUP(E216,'[1]Tarif de base'!D:E,2,FALSE)*F216,\"\")","v":""}]
[null,"",null,null,"","",{"$f":"IFERROR(VLOOKUP(E217,'[1]Tarif de base'!D:E,2,FALSE)*F217,\"\")","v":""}]
[null,"",null,null,"","",{"$f":"IFERROR(VLOOKUP(E218,'[1]Tarif de base'!D:E,2,FALSE)*F218,\"\")","v":""}]
[null,"",null,null,"","",{"$f":"IFERROR(VLOOKUP(E219,'[1]Tarif de base'!D:E,2,FALSE)*F219,\"\")","v":""}]
[null,"",null,null,"Total",{"$f":"SUM(F214:F219)","v":0},{"$f":"SUM(G214:G219)","v":0}]
["","","","","","",{"$f":"IFERROR(VLOOKUP(E221,'[1]Tarif de base'!D:E,2,FALSE)*F221,\"\")","v":""},"","","",{"$f":"IFERROR(IF(G227-H221-I221-J221<>0,\"Attention il manque \"&G227-H221-I221-J221&\"€\",\"Règlement OK\"),\"Pas de règlement\")","v":"Pas de règlement"},"",null,31]
[null,"",null,null,{"$f":"IFERROR(INDIRECT(\"'C:\\Users\\Moi\\OneDrive\\Documents\\[Formulaires Gravereau.xlsx]Action\"&$N221&\"'!$D$11\"),\"\")","v":""},{"$f":"IFERROR(INDIRECT(\"'C:\\Users\\Moi\\OneDrive\\Documents\\[Formulaires Gravereau.xlsx]Action\"&$N221&\"'!$h$11\"),\"\")","v":""},{"$f":"IFERROR(VLOOKUP(E222,'[1]Tarif de base'!D:E,2,FALSE)*F222,\"\")","v":""}]
[null,"",null,null,"","",{"$f":"IFERROR(VLOOKUP(E223,'[1]Tarif de base'!D:E,2,FALSE)*F223,\"\")","v":""}]
[null,"",null,null,"","",{"$f":"IFERROR(VLOOKUP(E224,'[1]Tarif de base'!D:E,2,FALSE)*F224,\"\")","v":""}]
[null,"",null,null,"","",{"$f":"IFERROR(VLOOKUP(E225,'[1]Tarif de base'!D:E,2,FALSE)*F225,\"\")","v":""}]
[null,"",null,null,"","",{"$f":"IFERROR(VLOOKUP(E226,'[1]Tarif de base'!D:E,2,FALSE)*F226,\"\")","v":""}]
[null,"",null,null,"Total",{"$f":"SUM(F221:F226)","v":0},{"$f":"SUM(G221:G226)","v":0}]
["","","","","","",{"$f":"IFERROR(VLOOKUP(E228,'[1]Tarif de base'!D:E,2,FALSE)*F228,\"\")","v":""},"","","",{"$f":"IFERROR(IF(G234-H228-I228-J228<>0,\"Attention il manque \"&G234-H228-I228-J228&\"€\",\"Règlement OK\"),\"Pas de règlement\")","v":"Pas de règlement"},"",null,32]
[null,"",null,null,{"$f":"IFERROR(INDIRECT(\"'C:\\Users\\Moi\\OneDrive\\Documents\\[Formulaires Gravereau.xlsx]Action\"&$N228&\"'!$D$11\"),\"\")","v":""},{"$f":"IFERROR(INDIRECT(\"'C:\\Users\\Moi\\OneDrive\\Documents\\[Formulaires Gravereau.xlsx]Action\"&$N228&\"'!$h$11\"),\"\")","v":""},{"$f":"IFERROR(VLOOKUP(E229,'[1]Tarif de base'!D:E,2,FALSE)*F229,\"\")","v":""}]
[null,"",null,null,"","",{"$f":"IFERROR(VLOOKUP(E230,'[1]Tarif de base'!D:E,2,FALSE)*F230,\"\")","v":""}]
[null,"",null,null,"","",{"$f":"IFERROR(VLOOKUP(E231,'[1]Tarif de base'!D:E,2,FALSE)*F231,\"\")","v":""}]
[null,"",null,null,"","",{"$f":"IFERROR(VLOOKUP(E232,'[1]Tarif de base'!D:E,2,FALSE)*F232,\"\")","v":""}]
[null,"",null,null,"","",{"$f":"IFERROR(VLOOKUP(E233,'[1]Tarif de base'!D:E,2,FALSE)*F233,\"\")","v":""}]
[null,"",null,null,"Total",{"$f":"SUM(F228:F233)","v":0},{"$f":"SUM(G228:G233)","v":0}]
["","","","","","",{"$f":"IFERROR(VLOOKUP(E235,'[1]Tarif de base'!D:E,2,FALSE)*F235,\"\")","v":""},"","","",{"$f":"IFERROR(IF(G241-H235-I235-J235<>0,\"Attention il manque \"&G241-H235-I235-J235&\"€\",\"Règlement OK\"),\"Pas de règlement\")","v":"Pas de règlement"},"",null,33]
[null,"",null,null,{"$f":"IFERROR(INDIRECT(\"'C:\\Users\\Moi\\OneDrive\\Documents\\[Formulaires Gravereau.xlsx]Action\"&$N235&\"'!$D$11\"),\"\")","v":""},{"$f":"IFERROR(INDIRECT(\"'C:\\Users\\Moi\\OneDrive\\Documents\\[Formulaires Gravereau.xlsx]Action\"&$N235&\"'!$h$11\"),\"\")","v":""},{"$f":"IFERROR(VLOOKUP(E236,'[1]Tarif de base'!D:E,2,FALSE)*F236,\"\")","v":""}]
[null,"",null,null,"","",{"$f":"IFERROR(VLOOKUP(E237,'[1]Tarif de base'!D:E,2,FALSE)*F237,\"\")","v":""}]
[null,"",null,null,"","",{"$f":"IFERROR(VLOOKUP(E238,'[1]Tarif de base'!D:E,2,FALSE)*F238,\"\")","v":""}]
[null,"",null,null,"","",{"$f":"IFERROR(VLOOKUP(E239,'[1]Tarif de base'!D:E,2,FALSE)*F239,\"\")","v":""}]
[null,"",null,null,"","",{"$f":"IFERROR(VLOOKUP(E240,'[1]Tarif de base'!D:E,2,FALSE)*F240,\"\")","v":""}]
[null,"",null,null,"Total",{"$f":"SUM(F235:F240)","v":0},{"$f":"SUM(G235:G240)","v":0}]
[{"$f":"IFERROR(INDIRECT(\"'C:\\Users\\Moi\\OneDrive\\Documents\\[Formulaires Gravereau.xlsx]Action\"&$N242&\"'!$D$6\"),\"\")","v":""},{"$f":"IF(C242<>\"\",C242,\"\")","v":""},{"$f":"IFERROR(INDIRECT(\"'C:\\Users\\Moi\\OneDrive\\Documents\\[Formulaires Gravereau.xlsx]Action\"&$N242&\"'!$D$4\"),\"\")","v":""},{"$f":"IFERROR(INDIRECT(\"'C:\\Users\\Moi\\OneDrive\\Documents\\[Formulaires Gravereau.xlsx]Action\"&$N242&\"'!$h$4\"),\"\")","v":""},{"$f":"IFERROR(INDIRECT(\"'C:\\Users\\Moi\\OneDrive\\Documents\\[Formulaires Gravereau.xlsx]Action\"&$N242&\"'!$D$9\"),\"\")","v":""},{"$f":"IFERROR(INDIRECT(\"'C:\\Users\\Moi\\OneDrive\\Documents\\[Formulaires Gravereau.xlsx]Action\"&$N242&\"'!$h$9\"),\"\")","v":""},{"$f":"IFERROR(VLOOKUP(E242,'[1]Tarif de base'!D:E,2,FALSE)*F242,\"\")","v":""},{"$f":"IFERROR(INDIRECT(\"'C:\\Users\\Moi\\OneDrive\\Documents\\[Formulaires Gravereau.xlsx]Action\"&$N242&\"'!$d$26\"),\"\")","v":""},{"$f":"IFERROR(INDIRECT(\"'C:\\Users\\Moi\\OneDrive\\Documents\\[Formulaires Gravereau.xlsx]Action\"&$N242&\"'!$d$28\"),\"\")","v":""},{"$f":"IFERROR(INDIRECT(\"'C:\\Users\\Moi\\OneDrive\\Documents\\[Formulaires Gravereau.xlsx]Action\"&$N242&\"'!$h$26\"),\"\")","v":""},{"$f":"IFERROR(IF(G248-H242-I242-J242<>0,\"Attention il manque \"&G248-H242-I242-J242&\"€\",\"Règlement OK\"),\"Pas de règlement\")","v":"Pas de règlement"},{"$f":"IFERROR(INDIRECT(\"'C:\\Users\\Moi\\OneDrive\\Documents\\[Formulaires Gravereau.xlsx]Action\"&$N242&\"'!$d$30\"),\"\")","v":""},null,34]
[null,"",null,null,{"$f":"IFERROR(INDIRECT(\"'C:\\Users\\Moi\\OneDrive\\Documents\\[Formulaires Gravereau.xlsx]Action\"&$N242&\"'!$D$11\"),\"\")","v":""},{"$f":"IFERROR(INDIRECT(\"'C:\\Users\\Moi\\OneDrive\\Documents\\[Formulaires Gravereau.xlsx]Action\"&$N242&\"'!$h$11\"),\"\")","v":""},{"$f":"IFERROR(VLOOKUP(E243,'[1]Tarif de base'!D:E,2,FALSE)*F243,\"\")","v":""}]
[null,"",null,null,{"$f":"IFERROR(INDIRECT(\"'C:\\Users\\Moi\\OneDrive\\Documents\\[Formulaires Gravereau.xlsx]Action\"&$N242&\"'!$D$13\"),\"\")","v":""},{"$f":"IFERROR(INDIRECT(\"'C:\\Users\\Moi\\OneDrive\\Documents\\[Formulaires Gravereau.xlsx]Action\"&$N242&\"'!$h$13\"),\"\")","v":""},{"$f":"IFERROR(VLOOKUP(E244,'[1]Tarif de base'!D:E,2,FALSE)*F244,\"\")","v":""}]
[null,"",null,null,{"$f":"IFERROR(INDIRECT(\"'C:\\Users\\Moi\\OneDrive\\Documents\\[Formulaires Gravereau.xlsx]Action\"&$N242&\"'!$D$15\"),\"\")","v":""},{"$f":"IFERROR(INDIRECT(\"'C:\\Users\\Moi\\OneDrive\\Documents\\[Formulaires Gravereau.xlsx]Action\"&$N242&\"'!$h$15\"),\"\")","v":""},{"$f":"IFERROR(VLOOKUP(E245,'[1]Tarif de base'!D:E,2,FALSE)*F245,\"\")","v":""}]
[null,"",null,null,{"$f":"IFERROR(INDIRECT(\"'C:\\Users\\Moi\\OneDrive\\Documents\\[Formulaires Gravereau.xlsx]Action\"&$N242&\"'!$D$17\"),\"\")","v":""},{"$f":"IFERROR(INDIRECT(\"'C:\\Users\\Moi\\OneDrive\\Documents\\[Formulaires Gravereau.xlsx]Action\"&$N242&\"'!$h$17\"),\"\")","v":""},{"$f":"IFERROR(VLOOKUP(E246,'[1]Tarif de base'!D:E,2,FALSE)*F246,\"\")","v":""}]
[null,"",null,null,{"$f":"IFERROR(INDIRECT(\"'C:\\Users\\Moi\\OneDrive\\Documents\\[Formulaires Gravereau.xlsx]Action\"&$N242&\"'!$D$19\"),\"\")","v":""},{"$f":"IFERROR(INDIRECT(\"'C:\\Users\\Moi\\OneDrive\\Documents\\[Formulaires Gravereau.xlsx]Action\"&$N242&\"'!$h$19\"),\"\")","v":""},{"$f":"IFERROR(VLOOKUP(E247,'[1]Tarif de base'!D:E,2,FALSE)*F247,\"\")","v":""}]
[null,"",null,null,"Total",{"$f":"SUM(F242:F247)","v":0},{"$f":"SUM(G242:G247)","v":0}]
["","","","","","",{"$f":"IFERROR(VLOOKUP(E249,'[1]Tarif de base'!D:E,2,FALSE)*F249,\"\")","v":""},"","","",{"$f":"IFERROR(IF(G255-H249-I249-J249<>0,\"Attention il manque \"&G255-H249-I249-J249&\"€\",\"Règlement OK\"),\"Pas de règlement\")","v":"Pas de règlement"},"",null,35]
[null,"",null,null,{"$f":"IFERROR(INDIRECT(\"'C:\\Users\\Moi\\OneDrive\\Documents\\[Formulaires Gravereau.xlsx]Action\"&$N249&\"'!$D$11\"),\"\")","v":""},{"$f":"IFERROR(INDIRECT(\"'C:\\Users\\Moi\\OneDrive\\Documents\\[Formulaires Gravereau.xlsx]Action\"&$N249&\"'!$h$11\"),\"\")","v":""},{"$f":"IFERROR(VLOOKUP(E250,'[1]Tarif de base'!D:E,2,FALSE)*F250,\"\")","v":""}]
[null,"",null,null,"","",{"$f":"IFERROR(VLOOKUP(E251,'[1]Tarif de base'!D:E,2,FALSE)*F251,\"\")","v":""}]
[null,"",null,null,"","",{"$f":"IFERROR(VLOOKUP(E252,'[1]Tarif de base'!D:E,2,FALSE)*F252,\"\")","v":""}]
[null,"",null,null,"","",{"$f":"IFERROR(VLOOKUP(E253,'[1]Tarif de base'!D:E,2,FALSE)*F253,\"\")","v":""}]
[null,"",null,null,"","",{"$f":"IFERROR(VLOOKUP(E254,'[1]Tarif de base'!D:E,2,FALSE)*F254,\"\")","v":""}]
[null,"",null,null,"Total",{"$f":"SUM(F249:F254)","v":0},{"$f":"SUM(G249:G254)","v":0}]
["","","","","","",{"$f":"IFERROR(VLOOKUP(E256,'[1]Tarif de base'!D:E,2,FALSE)*F256,\"\")","v":""},"","","",{"$f":"IFERROR(IF(G262-H256-I256-J256<>0,\"Attention il manque \"&G262-H256-I256-J256&\"€\",\"Règlement OK\"),\"Pas de règlement\")","v":"Pas de règlement"},"",null,36]
[null,"",null,null,{"$f":"IFERROR(INDIRECT(\"'C:\\Users\\Moi\\OneDrive\\Documents\\[Formulaires Gravereau.xlsx]Action\"&$N256&\"'!$D$11\"),\"\")","v":""},{"$f":"IFERROR(INDIRECT(\"'C:\\Users\\Moi\\OneDrive\\Documents\\[Formulaires Gravereau.xlsx]Action\"&$N256&\"'!$h$11\"),\"\")","v":""},{"$f":"IFERROR(VLOOKUP(E257,'[1]Tarif de base'!D:E,2,FALSE)*F257,\"\")","v":""}]
[null,"",null,null,"","",{"$f":"IFERROR(VLOOKUP(E258,'[1]Tarif de base'!D:E,2,FALSE)*F258,\"\")","v":""}]
[null,"",null,null,"","",{"$f":"IFERROR(VLOOKUP(E259,'[1]Tarif de base'!D:E,2,FALSE)*F259,\"\")","v":""}]
[null,"",null,null,"","",{"$f":"IFERROR(VLOOKUP(E260,'[1]Tarif de base'!D:E,2,FALSE)*F260,\"\")","v":""}]
[null,"",null,null,"","",{"$f":"IFERROR(VLOOKUP(E261,'[1]Tarif de base'!D:E,2,FALSE)*F261,\"\")","v":""}]
[null,"",null,null,"Total",{"$f":"SUM(F256:F261)","v":0},{"$f":"SUM(G256:G261)","v":0}]
["","","","","","",{"$f":"IFERROR(VLOOKUP(E263,'[1]Tarif de base'!D:E,2,FALSE)*F263,\"\")","v":""},"","","",{"$f":"IFERROR(IF(G269-H263-I263-J263<>0,\"Attention il manque \"&G269-H263-I263-J263&\"€\",\"Règlement OK\"),\"Pas de règlement\")","v":"Pas de règlement"},"",null,37]
[null,"",null,null,{"$f":"IFERROR(INDIRECT(\"'C:\\Users\\Moi\\OneDrive\\Documents\\[Formulaires Gravereau.xlsx]Action\"&$N263&\"'!$D$11\"),\"\")","v":""},{"$f":"IFERROR(INDIRECT(\"'C:\\Users\\Moi\\OneDrive\\Documents\\[Formulaires Gravereau.xlsx]Action\"&$N263&\"'!$h$11\"),\"\")","v":""},{"$f":"IFERROR(VLOOKUP(E264,'[1]Tarif de base'!D:E,2,FALSE)*F264,\"\")","v":""}]
[null,"",null,null,"","",{"$f":"IFERROR(VLOOKUP(E265,'[1]Tarif de base'!D:E,2,FALSE)*F265,\"\")","v":""}]
[null,"",null,null,"","",{"$f":"IFERROR(VLOOKUP(E266,'[1]Tarif de base'!D:E,2,FALSE)*F266,\"\")","v":""}]
[null,"",null,null,"","",{"$f":"IFERROR(VLOOKUP(E267,'[1]Tarif de base'!D:E,2,FALSE)*F267,\"\")","v":""}]
[null,"",null,null,"","",{"$f":"IFERROR(VLOOKUP(E268,'[1]Tarif de base'!D:E,2,FALSE)*F268,\"\")","v":""}]
[null,"",null,null,"Total",{"$f":"SUM(F263:F268)","v":0},{"$f":"SUM(G263:G268)","v":0}]
["","","","","","",{"$f":"IFERROR(VLOOKUP(E270,'[1]Tarif de base'!D:E,2,FALSE)*F270,\"\")","v":""},"","","",{"$f":"IFERROR(IF(G276-H270-I270-J270<>0,\"Attention il manque \"&G276-H270-I270-J270&\"€\",\"Règlement OK\"),\"Pas de règlement\")","v":"Pas de règlement"},"",null,38]
[null,"",null,null,{"$f":"IFERROR(INDIRECT(\"'C:\\Users\\Moi\\OneDrive\\Documents\\[Formulaires Gravereau.xlsx]Action\"&$N270&\"'!$D$11\"),\"\")","v":""},{"$f":"IFERROR(INDIRECT(\"'C:\\Users\\Moi\\OneDrive\\Documents\\[Formulaires Gravereau.xlsx]Action\"&$N270&\"'!$h$11\"),\"\")","v":""},{"$f":"IFERROR(VLOOKUP(E271,'[1]Tarif de base'!D:E,2,FALSE)*F271,\"\")","v":""}]
[null,"",null,null,"","",{"$f":"IFERROR(VLOOKUP(E272,'[1]Tarif de base'!D:E,2,FALSE)*F272,\"\")","v":""}]
[null,"",null,null,"","",{"$f":"IFERROR(VLOOKUP(E273,'[1]Tarif de base'!D:E,2,FALSE)*F273,\"\")","v":""}]
[null,{"$f":"B273","v":""},null,null,"","",{"$f":"IFERROR(VLOOKUP(E274,'[1]Tarif de base'!D:E,2,FALSE)*F274,\"\")","v":""}]
[null,"",null,null,"","",{"$f":"IFERROR(VLOOKUP(E275,'[1]Tarif de base'!D:E,2,FALSE)*F275,\"\")","v":""}]
[null,"",null,null,"Total",{"$f":"SUM(F270:F275)","v":0},{"$f":"SUM(G270:G275)","v":0}]
["","","","","","",{"$f":"IFERROR(VLOOKUP(E277,'[1]Tarif de base'!D:E,2,FALSE)*F277,\"\")","v":""},"","","",{"$f":"IFERROR(IF(G283-H277-I277-J277<>0,\"Attention il manque \"&G283-H277-I277-J277&\"€\",\"Règlement OK\"),\"Pas de règlement\")","v":"Pas de règlement"},"",null,39]
[null,"",null,null,{"$f":"IFERROR(INDIRECT(\"'C:\\Users\\Moi\\OneDrive\\Documents\\[Formulaires Gravereau.xlsx]Action\"&$N277&\"'!$D$11\"),\"\")","v":""},{"$f":"IFERROR(INDIRECT(\"'C:\\Users\\Moi\\OneDrive\\Documents\\[Formulaires Gravereau.xlsx]Action\"&$N277&\"'!$h$11\"),\"\")","v":""},{"$f":"IFERROR(VLOOKUP(E278,'[1]Tarif de base'!D:E,2,FALSE)*F278,\"\")","v":""}]
[null,"",null,null,"","",{"$f":"IFERROR(VLOOKUP(E279,'[1]Tarif de base'!D:E,2,FALSE)*F279,\"\")","v":""}]
[null,"",null,null,"","",{"$f":"IFERROR(VLOOKUP(E280,'[1]Tarif de base'!D:E,2,FALSE)*F280,\"\")","v":""}]
[null,"",null,null,"","",{"$f":"IFERROR(VLOOKUP(E281,'[1]Tarif de base'!D:E,2,FALSE)*F281,\"\")","v":""}]
[null,"",null,null,"","",{"$f":"IFERROR(VLOOKUP(E282,'[1]Tarif de base'!D:E,2,FALSE)*F282,\"\")","v":""}]
[null,"",null,null,"Total",{"$f":"SUM(F277:F282)","v":0},{"$f":"SUM(G277:G282)","v":0}]
["","","","","","",{"$f":"IFERROR(VLOOKUP(E284,'[1]Tarif de base'!D:E,2,FALSE)*F284,\"\")","v":""},"","","",{"$f":"IFERROR(IF(G290-H284-I284-J284<>0,\"Attention il manque \"&G290-H284-I284-J284&\"€\",\"Règlement OK\"),\"Pas de règlement\")","v":"Pas de règlement"},"",null,40]
[null,"",null,null,{"$f":"IFERROR(INDIRECT(\"'C:\\Users\\Moi\\OneDrive\\Documents\\[Formulaires Gravereau.xlsx]Action\"&$N284&\"'!$D$11\"),\"\")","v":""},{"$f":"IFERROR(INDIRECT(\"'C:\\Users\\Moi\\OneDrive\\Documents\\[Formulaires Gravereau.xlsx]Action\"&$N284&\"'!$h$11\"),\"\")","v":""},{"$f":"IFERROR(VLOOKUP(E285,'[1]Tarif de base'!D:E,2,FALSE)*F285,\"\")","v":""}]
[null,"",null,null,"","",{"$f":"IFERROR(VLOOKUP(E286,'[1]Tarif de base'!D:E,2,FALSE)*F286,\"\")","v":""}]
[null,"",null,null,"","",{"$f":"IFERROR(VLOOKUP(E287,'[1]Tarif de base'!D:E,2,FALSE)*F287,\"\")","v":""}]
[null,"",null,null,"","",{"$f":"IFERROR(VLOOKUP(E288,'[1]Tarif de base'!D:E,2,FALSE)*F288,\"\")","v":""}]
[null,"",null,null,"","",{"$f":"IFERROR(VLOOKUP(E289,'[1]Tarif de base'!D:E,2,FALSE)*F289,\"\")","v":""}]
[null,"",null,null,"Total",{"$f":"SUM(F284:F289)","v":0},{"$f":"SUM(G284:G289)","v":0}]
["","","","","","",{"$f":"IFERROR(VLOOKUP(E291,'[1]Tarif de base'!D:E,2,FALSE)*F291,\"\")","v":""},"","","",{"$f":"IFERROR(IF(G297-H291-I291-J291<>0,\"Attention il manque \"&G297-H291-I291-J291&\"€\",\"Règlement OK\"),\"Pas de règlement\")","v":"Pas de règlement"},"",null,41]
[null,"",null,null,{"$f":"IFERROR(INDIRECT(\"'C:\\Users\\Moi\\OneDrive\\Documents\\[Formulaires Gravereau.xlsx]Action\"&$N291&\"'!$D$11\"),\"\")","v":""},{"$f":"IFERROR(INDIRECT(\"'C:\\Users\\Moi\\OneDrive\\Documents\\[Formulaires Gravereau.xlsx]Action\"&$N291&\"'!$h$11\"),\"\")","v":""},{"$f":"IFERROR(VLOOKUP(E292,'[1]Tarif de base'!D:E,2,FALSE)*F292,\"\")","v":""}]
[null,"",null,null,"","",{"$f":"IFERROR(VLOOKUP(E293,'[1]Tarif de base'!D:E,2,FALSE)*F293,\"\")","v":""}]
[null,"",null,null,"","",{"$f":"IFERROR(VLOOKUP(E294,'[1]Tarif de base'!D:E,2,FALSE)*F294,\"\")","v":""}]
[null,"",null,null,"","",{"$f":"IFERROR(VLOOKUP(E295,'[1]Tarif de base'!D:E,2,FALSE)*F295,\"\")","v":""}]
[null,"",null,null,"","",{"$f":"IFERROR(VLOOKUP(E296,'[1]Tarif de base'!D:E,2,FALSE)*F296,\"\")","v":""}]
[null,"",null,null,"Total",{"$f":"SUM(F291:F296)","v":0},{"$f":"SUM(G291:G296)","v":0}]
["","","","","","",{"$f":"IFERROR(VLOOKUP(E298,'[1]Tarif de base'!D:E,2,FALSE)*F298,\"\")","v":""},"","","",{"$f":"IFERROR(IF(G304-H298-I298-J298<>0,\"Attention il manque \"&G304-H298-I298-J298&\"€\",\"Règlement OK\"),\"Pas de règlement\")","v":"Pas de règlement"},"",null,42]
[null,"",null,null,{"$f":"IFERROR(INDIRECT(\"'C:\\Users\\Moi\\OneDrive\\Documents\\[Formulaires Gravereau.xlsx]Action\"&$N298&\"'!$D$11\"),\"\")","v":""},{"$f":"IFERROR(INDIRECT(\"'C:\\Users\\Moi\\OneDrive\\Documents\\[Formulaires Gravereau.xlsx]Action\"&$N298&\"'!$h$11\"),\"\")","v":""},{"$f":"IFERROR(VLOOKUP(E299,'[1]Tarif de base'!D:E,2,FALSE)*F299,\"\")","v":""}]
[null,"",null,null,"","",{"$f":"IFERROR(VLOOKUP(E300,'[1]Tarif de base'!D:E,2,FALSE)*F300,\"\")","v":""}]
[null,"",null,null,"","",{"$f":"IFERROR(VLOOKUP(E301,'[1]Tarif de base'!D:E,2,FALSE)*F301,\"\")","v":""}]
[null,"",null,null,"","",{"$f":"IFERROR(VLOOKUP(E302,'[1]Tarif de base'!D:E,2,FALSE)*F302,\"\")","v":""}]
[null,"",null,null,"","",{"$f":"IFERROR(VLOOKUP(E303,'[1]Tarif de base'!D:E,2,FALSE)*F303,\"\")","v":""}]
[null,"",null,null,"Total",{"$f":"SUM(F298:F303)","v":0},{"$f":"SUM(G298:G303)","v":0}]
["","","","","","",{"$f":"IFERROR(VLOOKUP(E305,'[1]Tarif de base'!D:E,2,FALSE)*F305,\"\")","v":""},"","","",{"$f":"IFERROR(IF(G311-H305-I305-J305<>0,\"Attention il manque \"&G311-H305-I305-J305&\"€\",\"Règlement OK\"),\"Pas de règlement\")","v":"Pas de règlement"},"",null,43]
[null,"",null,null,{"$f":"IFERROR(INDIRECT(\"'C:\\Users\\Moi\\OneDrive\\Documents\\[Formulaires Gravereau.xlsx]Action\"&$N305&\"'!$D$11\"),\"\")","v":""},{"$f":"IFERROR(INDIRECT(\"'C:\\Users\\Moi\\OneDrive\\Documents\\[Formulaires Gravereau.xlsx]Action\"&$N305&\"'!$h$11\"),\"\")","v":""},{"$f":"IFERROR(VLOOKUP(E306,'[1]Tarif de base'!D:E,2,FALSE)*F306,\"\")","v":""}]
[null,"",null,null,"","",{"$f":"IFERROR(VLOOKUP(E307,'[1]Tarif de base'!D:E,2,FALSE)*F307,\"\")","v":""}]
[null,"",null,null,"","",{"$f":"IFERROR(VLOOKUP(E308,'[1]Tarif de base'!D:E,2,FALSE)*F308,\"\")","v":""}]
[null,"",null,null,"","",{"$f":"IFERROR(VLOOKUP(E309,'[1]Tarif de base'!D:E,2,FALSE)*F309,\"\")","v":""}]
[null,"",null,null,"","",{"$f":"IFERROR(VLOOKUP(E310,'[1]Tarif de base'!D:E,2,FALSE)*F310,\"\")","v":""}]
[null,"",null,null,"Total",{"$f":"SUM(F305:F310)","v":0},{"$f":"SUM(G305:G310)","v":0}]
[{"$f":"IFERROR(INDIRECT(\"'C:\\Users\\Moi\\OneDrive\\Documents\\[Formulaires Gravereau.xlsx]Action\"&$N312&\"'!$D$6\"),\"\")","v":""},{"$f":"IF(C312<>\"\",C312,\"\")","v":""},{"$f":"IFERROR(INDIRECT(\"'C:\\Users\\Moi\\OneDrive\\Documents\\[Formulaires Gravereau.xlsx]Action\"&$N312&\"'!$D$4\"),\"\")","v":""},{"$f":"IFERROR(INDIRECT(\"'C:\\Users\\Moi\\OneDrive\\Documents\\[Formulaires Gravereau.xlsx]Action\"&$N312&\"'!$h$4\"),\"\")","v":""},{"$f":"IFERROR(INDIRECT(\"'C:\\Users\\Moi\\OneDrive\\Documents\\[Formulaires Gravereau.xlsx]Action\"&$N312&\"'!$D$9\"),\"\")","v":""},{"$f":"IFERROR(INDIRECT(\"'C:\\Users\\Moi\\OneDrive\\Documents\\[Formulaires Gravereau.xlsx]Action\"&$N312&\"'!$h$9\"),\"\")","v":""},{"$f":"IFERROR(VLOOKUP(E312,'[1]Tarif de base'!D:E,2,FALSE)*F312,\"\")","v":""},{"$f":"IFERROR(INDIRECT(\"'C:\\Users\\Moi\\OneDrive\\Documents\\[Formulaires Gravereau.xlsx]Action\"&$N312&\"'!$d$26\"),\"\")","v":""},{"$f":"IFERROR(INDIRECT(\"'C:\\Users\\Moi\\OneDrive\\Documents\\[Formulaires Gravereau.xlsx]Action\"&$N312&\"'!$d$28\"),\"\")","v":""},{"$f":"IFERROR(INDIRECT(\"'C:\\Users\\Moi\\OneDrive\\Documents\\[Formulaires Gravereau.xlsx]Action\"&$N312&\"'!$h$26\"),\"\")","v":""},{"$f":"IFERROR(IF(G318-H312-I312-J312<>0,\"Attention il manque \"&G318-H312-I312-J312&\"€\",\"Règlement OK\"),\"Pas de règlement\")","v":"Pas de règlement"},{"$f":"IFERROR(INDIRECT(\"'C:\\Users\\Moi\\OneDrive\\Documents\\[Formulaires Gravereau.xlsx]Action\"&$N312&\"'!$d$30\"),\"\")","v":""},null,44]
[null,"",null,null,{"$f":"IFERROR(INDIRECT(\"'C:\\Users\\Moi\\OneDrive\\Documents\\[Formulaires Gravereau.xlsx]Action\"&$N312&\"'!$D$11\"),\"\")","v":""},{"$f":"IFERROR(INDIRECT(\"'C:\\Users\\Moi\\OneDrive\\Documents\\[Formulaires Gravereau.xlsx]Action\"&$N312&\"'!$h$11\"),\"\")","v":""},{"$f":"IFERROR(VLOOKUP(E313,'[1]Tarif de base'!D:E,2,FALSE)*F313,\"\")","v":""}]
[null,"",null,null,{"$f":"IFERROR(INDIRECT(\"'C:\\Users\\Moi\\OneDrive\\Documents\\[Formulaires Gravereau.xlsx]Action\"&$N312&\"'!$D$13\"),\"\")","v":""},{"$f":"IFERROR(INDIRECT(\"'C:\\Users\\Moi\\OneDrive\\Documents\\[Formulaires Gravereau.xlsx]Action\"&$N312&\"'!$h$13\"),\"\")","v":""},{"$f":"IFERROR(VLOOKUP(E314,'[1]Tarif de base'!D:E,2,FALSE)*F314,\"\")","v":""}]
[null,"",null,null,{"$f":"IFERROR(INDIRECT(\"'C:\\Users\\Moi\\OneDrive\\Documents\\[Formulaires Gravereau.xlsx]Action\"&$N312&\"'!$D$15\"),\"\")","v":""},{"$f":"IFERROR(INDIRECT(\"'C:\\Users\\Moi\\OneDrive\\Documents\\[Formulaires Gravereau.xlsx]Action\"&$N312&\"'!$h$15\"),\"\")","v":""},{"$f":"IFERROR(VLOOKUP(E315,'[1]Tarif de base'!D:E,2,FALSE)*F315,\"\")","v":""}]
[null,"",null,null,{"$f":"IFERROR(INDIRECT(\"'C:\\Users\\Moi\\OneDrive\\Documents\\[Formulaires Gravereau.xlsx]Action\"&$N312&\"'!$D$17\"),\"\")","v":""},{"$f":"IFERROR(INDIRECT(\"'C:\\Users\\Moi\\OneDrive\\Documents\\[Formulaires Gravereau.xlsx]Action\"&$N312&\"'!$h$17\"),\"\")","v":""},{"$f":"IFERROR(VLOOKUP(E316,'[1]Tarif de base'!D:E,2,FALSE)*F316,\"\")","v":""}]
[null,"",null,null,{"$f":"IFERROR(INDIRECT(\"'C:\\Users\\Moi\\OneDrive\\Documents\\[Formulaires Gravereau.xlsx]Action\"&$N312&\"'!$D$19\"),\"\")","v":""},{"$f":"IFERROR(INDIRECT(\"'C:\\Users\\Moi\\OneDrive\\Documents\\[Formulaires Gravereau.xlsx]Action\"&$N312&\"'!$h$19\"),\"\")","v":""},{"$f":"IFERROR(VLOOKUP(E317,'[1]Tarif de base'!D:E,2,FALSE)*F317,\"\")","v":""}]
[null,"",null,null,"Total",{"$f":"SUM(F312:F317)","v":0},{"$f":"SUM(G312:G317)","v":0}]
["","","","","","",{"$f":"IFERROR(VLOOKUP(E319,'[1]Tarif de base'!D:E,2,FALSE)*F319,\"\")","v":""},"","","",{"$f":"IFERROR(IF(G325-H319-I319-J319<>0,\"Attention il manque \"&G325-H319-I319-J319&\"€\",\"Règlement OK\"),\"Pas de règlement\")","v":"Pas de règlement"},"",null,45]
[null,"",null,null,{"$f":"IFERROR(INDIRECT(\"'C:\\Users\\Moi\\OneDrive\\Documents\\[Formulaires Gravereau.xlsx]Action\"&$N319&\"'!$D$11\"),\"\")","v":""},{"$f":"IFERROR(INDIRECT(\"'C:\\Users\\Moi\\OneDrive\\Documents\\[Formulaires Gravereau.xlsx]Action\"&$N319&\"'!$h$11\"),\"\")","v":""},{"$f":"IFERROR(VLOOKUP(E320,'[1]Tarif de base'!D:E,2,FALSE)*F320,\"\")","v":""}]
[null,"",null,null,"","",{"$f":"IFERROR(VLOOKUP(E321,'[1]Tarif de base'!D:E,2,FALSE)*F321,\"\")","v":""}]
[null,"",null,null,"","",{"$f":"IFERROR(VLOOKUP(E322,'[1]Tarif de base'!D:E,2,FALSE)*F322,\"\")","v":""}]
[null,"",null,null,"","",{"$f":"IFERROR(VLOOKUP(E323,'[1]Tarif de base'!D:E,2,FALSE)*F323,\"\")","v":""}]
[null,"",null,null,"","",{"$f":"IFERROR(VLOOKUP(E324,'[1]Tarif de base'!D:E,2,FALSE)*F324,\"\")","v":""}]
[null,"",null,null,"Total",{"$f":"SUM(F319:F324)","v":0},{"$f":"SUM(G319:G324)","v":0}]
["","","","","","",{"$f":"IFERROR(VLOOKUP(E326,'[1]Tarif de base'!D:E,2,FALSE)*F326,\"\")","v":""},"","","",{"$f":"IFERROR(IF(G332-H326-I326-J326<>0,\"Attention il manque \"&G332-H326-I326-J326&\"€\",\"Règlement OK\"),\"Pas de règlement\")","v":"Pas de règlement"},"",null,46]
[null,"",null,null,{"$f":"IFERROR(INDIRECT(\"'C:\\Users\\Moi\\OneDrive\\Documents\\[Formulaires Gravereau.xlsx]Action\"&$N326&\"'!$D$11\"),\"\")","v":""},{"$f":"IFERROR(INDIRECT(\"'C:\\Users\\Moi\\OneDrive\\Documents\\[Formulaires Gravereau.xlsx]Action\"&$N326&\"'!$h$11\"),\"\")","v":""},{"$f":"IFERROR(VLOOKUP(E327,'[1]Tarif de base'!D:E,2,FALSE)*F327,\"\")","v":""}]
[null,"",null,null,"","",{"$f":"IFERROR(VLOOKUP(E328,'[1]Tarif de base'!D:E,2,FALSE)*F328,\"\")","v":""}]
[null,"",null,null,"","",{"$f":"IFERROR(VLOOKUP(E329,'[1]Tarif de base'!D:E,2,FALSE)*F329,\"\")","v":""}]
[null,"",null,null,"","",{"$f":"IFERROR(VLOOKUP(E330,'[1]Tarif de base'!D:E,2,FALSE)*F330,\"\")","v":""}]
[null,"",null,null,"","",{"$f":"IFERROR(VLOOKUP(E331,'[1]Tarif de base'!D:E,2,FALSE)*F331,\"\")","v":""}]
[null,"",null,null,"Total",{"$f":"SUM(F326:F331)","v":0},{"$f":"SUM(G326:G331)","v":0}]
["","","","","","",{"$f":"IFERROR(VLOOKUP(E333,'[1]Tarif de base'!D:E,2,FALSE)*F333,\"\")","v":""},"","","",{"$f":"IFERROR(IF(G339-H333-I333-J333<>0,\"Attention il manque \"&G339-H333-I333-J333&\"€\",\"Règlement OK\"),\"Pas de règlement\")","v":"Pas de règlement"},"",null,47]
[null,"",null,null,{"$f":"IFERROR(INDIRECT(\"'C:\\Users\\Moi\\OneDrive\\Documents\\[Formulaires Gravereau.xlsx]Action\"&$N333&\"'!$D$11\"),\"\")","v":""},{"$f":"IFERROR(INDIRECT(\"'C:\\Users\\Moi\\OneDrive\\Documents\\[Formulaires Gravereau.xlsx]Action\"&$N333&\"'!$h$11\"),\"\")","v":""},{"$f":"IFERROR(VLOOKUP(E334,'[1]Tarif de base'!D:E,2,FALSE)*F334,\"\")","v":""}]
[null,"",null,null,"","",{"$f":"IFERROR(VLOOKUP(E335,'[1]Tarif de base'!D:E,2,FALSE)*F335,\"\")","v":""}]
[null,"",null,null,"","",{"$f":"IFERROR(VLOOKUP(E336,'[1]Tarif de base'!D:E,2,FALSE)*F336,\"\")","v":""}]
[null,"",null,null,"","",{"$f":"IFERROR(VLOOKUP(E337,'[1]Tarif de base'!D:E,2,FALSE)*F337,\"\")","v":""}]
[null,{"$f":"B337","v":""},null,null,"","",{"$f":"IFERROR(VLOOKUP(E338,'[1]Tarif de base'!D:E,2,FALSE)*F338,\"\")","v":""}]
[null,"",null,null,"Total",{"$f":"SUM(F333:F338)","v":0},{"$f":"SUM(G333:G338)","v":0}]
["","","","","","",{"$f":"IFERROR(VLOOKUP(E340,'[1]Tarif de base'!D:E,2,FALSE)*F340,\"\")","v":""},"","","",{"$f":"IFERROR(IF(G346-H340-I340-J340<>0,\"Attention il manque \"&G346-H340-I340-J340&\"€\",\"Règlement OK\"),\"Pas de règlement\")","v":"Pas de règlement"},"",null,48]
[null,"",null,null,{"$f":"IFERROR(INDIRECT(\"'C:\\Users\\Moi\\OneDrive\\Documents\\[Formulaires Gravereau.xlsx]Action\"&$N340&\"'!$D$11\"),\"\")","v":""},{"$f":"IFERROR(INDIRECT(\"'C:\\Users\\Moi\\OneDrive\\Documents\\[Formulaires Gravereau.xlsx]Action\"&$N340&\"'!$h$11\"),\"\")","v":""},{"$f":"IFERROR(VLOOKUP(E341,'[1]Tarif de base'!D:E,2,FALSE)*F341,\"\")","v":""}]
[null,"",null,null,"","",{"$f":"IFERROR(VLOOKUP(E342,'[1]Tarif de base'!D:E,2,FALSE)*F342,\"\")","v":""}]
[null,"",null,null,"","",{"$f":"IFERROR(VLOOKUP(E343,'[1]Tarif de base'!D:E,2,FALSE)*F343,\"\")","v":""}]
[null,"",null,null,"","",{"$f":"IFERROR(VLOOKUP(E344,'[1]Tarif de base'!D:E,2,FALSE)*F344,\"\")","v":""}]
[null,"",null,null,"","",{"$f":"IFERROR(VLOOKUP(E345,'[1]Tarif de base'!D:E,2,FALSE)*F345,\"\")","v":""}]
[null,"",null,null,"Total",{"$f":"SUM(F340:F345)","v":0},{"$f":"SUM(G340:G345)","v":0}]
["","","","","","",{"$f":"IFERROR(VLOOKUP(E347,'[1]Tarif de base'!D:E,2,FALSE)*F347,\"\")","v":""},"","","",{"$f":"IFERROR(IF(G353-H347-I347-J347<>0,\"Attention il manque \"&G353-H347-I347-J347&\"€\",\"Règlement OK\"),\"Pas de règlement\")","v":"Pas de règlement"},"",null,49]
[null,"",null,null,{"$f":"IFERROR(INDIRECT(\"'C:\\Users\\Moi\\OneDrive\\Documents\\[Formulaires Gravereau.xlsx]Action\"&$N347&\"'!$D$11\"),\"\")","v":""},{"$f":"IFERROR(INDIRECT(\"'C:\\Users\\Moi\\OneDrive\\Documents\\[Formulaires Gravereau.xlsx]Action\"&$N347&\"'!$h$11\"),\"\")","v":""},{"$f":"IFERROR(VLOOKUP(E348,'[1]Tarif de base'!D:E,2,FALSE)*F348,\"\")","v":""}]
[null,"",null,null,"","",{"$f":"IFERROR(VLOOKUP(E349,'[1]Tarif de base'!D:E,2,FALSE)*F349,\"\")","v":""}]
[null,"",null,null,"","",{"$f":"IFERROR(VLOOKUP(E350,'[1]Tarif de base'!D:E,2,FALSE)*F350,\"\")","v":""}]
[null,"",null,null,"","",{"$f":"IFERROR(VLOOKUP(E351,'[1]Tarif de base'!D:E,2,FALSE)*F351,\"\")","v":""}]
[null,"",null,null,"","",{"$f":"IFERROR(VLOOKUP(E352,'[1]Tarif de base'!D:E,2,FALSE)*F352,\"\")","v":""}]
[null,"",null,null,"Total",{"$f":"SUM(F347:F352)","v":0},{"$f":"SUM(G347:G352)","v":0}]
["","","","","","",{"$f":"IFERROR(VLOOKUP(E354,'[1]Tarif de base'!D:E,2,FALSE)*F354,\"\")","v":""},"","","",{"$f":"IFERROR(IF(G360-H354-I354-J354<>0,\"Attention il manque \"&G360-H354-I354-J354&\"€\",\"Règlement OK\"),\"Pas de règlement\")","v":"Pas de règlement"},"",null,50]
[null,"",null,null,{"$f":"IFERROR(INDIRECT(\"'C:\\Users\\Moi\\OneDrive\\Documents\\[Formulaires Gravereau.xlsx]Action\"&$N354&\"'!$D$11\"),\"\")","v":""},{"$f":"IFERROR(INDIRECT(\"'C:\\Users\\Moi\\OneDrive\\Documents\\[Formulaires Gravereau.xlsx]Action\"&$N354&\"'!$h$11\"),\"\")","v":""},{"$f":"IFERROR(VLOOKUP(E355,'[1]Tarif de base'!D:E,2,FALSE)*F355,\"\")","v":""}]
[null,"",null,null,"","",{"$f":"IFERROR(VLOOKUP(E356,'[1]Tarif de base'!D:E,2,FALSE)*F356,\"\")","v":""}]
[null,"",null,null,"","",{"$f":"IFERROR(VLOOKUP(E357,'[1]Tarif de base'!D:E,2,FALSE)*F357,\"\")","v":""}]
[null,"",null,null,"","",{"$f":"IFERROR(VLOOKUP(E358,'[1]Tarif de base'!D:E,2,FALSE)*F358,\"\")","v":""}]
[null,"",null,null,"","",{"$f":"IFERROR(VLOOKUP(E359,'[1]Tarif de base'!D:E,2,FALSE)*F359,\"\")","v":""}]
[null,"",null,null,"Total",{"$f":"SUM(F354:F359)","v":0},{"$f":"SUM(G354:G359)","v":0}]
["","","","","","",{"$f":"IFERROR(VLOOKUP(E361,'[1]Tarif de base'!D:E,2,FALSE)*F361,\"\")","v":""},"","","",{"$f":"IFERROR(IF(G367-H361-I361-J361<>0,\"Attention il manque \"&G367-H361-I361-J361&\"€\",\"Règlement OK\"),\"Pas de règlement\")","v":"Pas de règlement"},"",null,51]
[null,"",null,null,{"$f":"IFERROR(INDIRECT(\"'C:\\Users\\Moi\\OneDrive\\Documents\\[Formulaires Gravereau.xlsx]Action\"&$N361&\"'!$D$11\"),\"\")","v":""},{"$f":"IFERROR(INDIRECT(\"'C:\\Users\\Moi\\OneDrive\\Documents\\[Formulaires Gravereau.xlsx]Action\"&$N361&\"'!$h$11\"),\"\")","v":""},{"$f":"IFERROR(VLOOKUP(E362,'[1]Tarif de base'!D:E,2,FALSE)*F362,\"\")","v":""}]
[null,"",null,null,"","",{"$f":"IFERROR(VLOOKUP(E363,'[1]Tarif de base'!D:E,2,FALSE)*F363,\"\")","v":""}]
[null,"",null,null,"","",{"$f":"IFERROR(VLOOKUP(E364,'[1]Tarif de base'!D:E,2,FALSE)*F364,\"\")","v":""}]
[null,"",null,null,"","",{"$f":"IFERROR(VLOOKUP(E365,'[1]Tarif de base'!D:E,2,FALSE)*F365,\"\")","v":""}]
[null,"",null,null,"","",{"$f":"IFERROR(VLOOKUP(E366,'[1]Tarif de base'!D:E,2,FALSE)*F366,\"\")","v":""}]
[null,"",null,null,"Total",{"$f":"SUM(F361:F366)","v":0},{"$f":"SUM(G361:G366)","v":0}]
["","","","","","",{"$f":"IFERROR(VLOOKUP(E368,'[1]Tarif de base'!D:E,2,FALSE)*F368,\"\")","v":""},"","","",{"$f":"IFERROR(IF(G374-H368-I368-J368<>0,\"Attention il manque \"&G374-H368-I368-J368&\"€\",\"Règlement OK\"),\"Pas de règlement\")","v":"Pas de règlement"},"",null,52]
[null,"",null,null,{"$f":"IFERROR(INDIRECT(\"'C:\\Users\\Moi\\OneDrive\\Documents\\[Formulaires Gravereau.xlsx]Action\"&$N368&\"'!$D$11\"),\"\")","v":""},{"$f":"IFERROR(INDIRECT(\"'C:\\Users\\Moi\\OneDrive\\Documents\\[Formulaires Gravereau.xlsx]Action\"&$N368&\"'!$h$11\"),\"\")","v":""},{"$f":"IFERROR(VLOOKUP(E369,'[1]Tarif de base'!D:E,2,FALSE)*F369,\"\")","v":""}]
[null,"",null,null,"","",{"$f":"IFERROR(VLOOKUP(E370,'[1]Tarif de base'!D:E,2,FALSE)*F370,\"\")","v":""}]
[null,"",null,null,"","",{"$f":"IFERROR(VLOOKUP(E371,'[1]Tarif de base'!D:E,2,FALSE)*F371,\"\")","v":""}]
[null,"",null,null,"","",{"$f":"IFERROR(VLOOKUP(E372,'[1]Tarif de base'!D:E,2,FALSE)*F372,\"\")","v":""}]
[null,"",null,null,"","",{"$f":"IFERROR(VLOOKUP(E373,'[1]Tarif de base'!D:E,2,FALSE)*F373,\"\")","v":""}]
[null,"",null,null,"Total",{"$f":"SUM(F368:F373)","v":0},{"$f":"SUM(G368:G373)","v":0}]
["","","","","","",{"$f":"IFERROR(VLOOKUP(E375,'[1]Tarif de base'!D:E,2,FALSE)*F375,\"\")","v":""},"","","",{"$f":"IFERROR(IF(G381-H375-I375-J375<>0,\"Attention il manque \"&G381-H375-I375-J375&\"€\",\"Règlement OK\"),\"Pas de règlement\")","v":"Pas de règlement"},"",null,53]
[null,"",null,null,{"$f":"IFERROR(INDIRECT(\"'C:\\Users\\Moi\\OneDrive\\Documents\\[Formulaires Gravereau.xlsx]Action\"&$N375&\"'!$D$11\"),\"\")","v":""},{"$f":"IFERROR(INDIRECT(\"'C:\\Users\\Moi\\OneDrive\\Documents\\[Formulaires Gravereau.xlsx]Action\"&$N375&\"'!$h$11\"),\"\")","v":""},{"$f":"IFERROR(VLOOKUP(E376,'[1]Tarif de base'!D:E,2,FALSE)*F376,\"\")","v":""}]
[null,"",null,null,"","",{"$f":"IFERROR(VLOOKUP(E377,'[1]Tarif de base'!D:E,2,FALSE)*F377,\"\")","v":""}]
[null,"",null,null,"","",{"$f":"IFERROR(VLOOKUP(E378,'[1]Tarif de base'!D:E,2,FALSE)*F378,\"\")","v":""}]
[null,"",null,null,"","",{"$f":"IFERROR(VLOOKUP(E379,'[1]Tarif de base'!D:E,2,FALSE)*F379,\"\")","v":""}]
[null,"",null,null,"","",{"$f":"IFERROR(VLOOKUP(E380,'[1]Tarif de base'!D:E,2,FALSE)*F380,\"\")","v":""}]
[null,"",null,null,"Total",{"$f":"SUM(F375:F380)","v":0},{"$f":"SUM(G375:G380)","v":0}]
[{"$f":"IFERROR(INDIRECT(\"'C:\\Users\\Moi\\OneDrive\\Documents\\[Formulaires Gravereau.xlsx]Action\"&$N382&\"'!$D$6\"),\"\")","v":""},{"$f":"IF(C382<>\"\",C382,\"\")","v":""},{"$f":"IFERROR(INDIRECT(\"'C:\\Users\\Moi\\OneDrive\\Documents\\[Formulaires Gravereau.xlsx]Action\"&$N382&\"'!$D$4\"),\"\")","v":""},{"$f":"IFERROR(INDIRECT(\"'C:\\Users\\Moi\\OneDrive\\Documents\\[Formulaires Gravereau.xlsx]Action\"&$N382&\"'!$h$4\"),\"\")","v":""},{"$f":"IFERROR(INDIRECT(\"'C:\\Users\\Moi\\OneDrive\\Documents\\[Formulaires Gravereau.xlsx]Action\"&$N382&\"'!$D$9\"),\"\")","v":""},{"$f":"IFERROR(INDIRECT(\"'C:\\Users\\Moi\\OneDrive\\Documents\\[Formulaires Gravereau.xlsx]Action\"&$N382&\"'!$h$9\"),\"\")","v":""},{"$f":"IFERROR(VLOOKUP(E382,'[1]Tarif de base'!D:E,2,FALSE)*F382,\"\")","v":""},{"$f":"IFERROR(INDIRECT(\"'C:\\Users\\Moi\\OneDrive\\Documents\\[Formulaires Gravereau.xlsx]Action\"&$N382&\"'!$d$26\"),\"\")","v":""},{"$f":"IFERROR(INDIRECT(\"'C:\\Users\\Moi\\OneDrive\\Documents\\[Formulaires Gravereau.xlsx]Action\"&$N382&\"'!$d$28\"),\"\")","v":""},{"$f":"IFERROR(INDIRECT(\"'C:\\Users\\Moi\\OneDrive\\Documents\\[Formulaires Gravereau.xlsx]Action\"&$N382&\"'!$h$26\"),\"\")","v":""},{"$f":"IFERROR(IF(G388-H382-I382-J382<>0,\"Attention il manque \"&G388-H382-I382-J382&\"€\",\"Règlement OK\"),\"Pas de règlement\")","v":"Pas de règlement"},{"$f":"IFERROR(INDIRECT(\"'C:\\Users\\Moi\\OneDrive\\Documents\\[Formulaires Gravereau.xlsx]Action\"&$N382&\"'!$d$30\"),\"\")","v":""},null,54]
[null,"",null,null,{"$f":"IFERROR(INDIRECT(\"'C:\\Users\\Moi\\OneDrive\\Documents\\[Formulaires Gravereau.xlsx]Action\"&$N382&\"'!$D$11\"),\"\")","v":""},{"$f":"IFERROR(INDIRECT(\"'C:\\Users\\Moi\\OneDrive\\Documents\\[Formulaires Gravereau.xlsx]Action\"&$N382&\"'!$h$11\"),\"\")","v":""},{"$f":"IFERROR(VLOOKUP(E383,'[1]Tarif de base'!D:E,2,FALSE)*F383,\"\")","v":""}]
[null,"",null,null,{"$f":"IFERROR(INDIRECT(\"'C:\\Users\\Moi\\OneDrive\\Documents\\[Formulaires Gravereau.xlsx]Action\"&$N382&\"'!$D$13\"),\"\")","v":""},{"$f":"IFERROR(INDIRECT(\"'C:\\Users\\Moi\\OneDrive\\Documents\\[Formulaires Gravereau.xlsx]Action\"&$N382&\"'!$h$13\"),\"\")","v":""},{"$f":"IFERROR(VLOOKUP(E384,'[1]Tarif de base'!D:E,2,FALSE)*F384,\"\")","v":""}]
[null,"",null,null,{"$f":"IFERROR(INDIRECT(\"'C:\\Users\\Moi\\OneDrive\\Documents\\[Formulaires Gravereau.xlsx]Action\"&$N382&\"'!$D$15\"),\"\")","v":""},{"$f":"IFERROR(INDIRECT(\"'C:\\Users\\Moi\\OneDrive\\Documents\\[Formulaires Gravereau.xlsx]Action\"&$N382&\"'!$h$15\"),\"\")","v":""},{"$f":"IFERROR(VLOOKUP(E385,'[1]Tarif de base'!D:E,2,FALSE)*F385,\"\")","v":""}]
[null,"",null,null,{"$f":"IFERROR(INDIRECT(\"'C:\\Users\\Moi\\OneDrive\\Documents\\[Formulaires Gravereau.xlsx]Action\"&$N382&\"'!$D$17\"),\"\")","v":""},{"$f":"IFERROR(INDIRECT(\"'C:\\Users\\Moi\\OneDrive\\Documents\\[Formulaires Gravereau.xlsx]Action\"&$N382&\"'!$h$17\"),\"\")","v":""},{"$f":"IFERROR(VLOOKUP(E386,'[1]Tarif de base'!D:E,2,FALSE)*F386,\"\")","v":""}]
[null,"",null,null,{"$f":"IFERROR(INDIRECT(\"'C:\\Users\\Moi\\OneDrive\\Documents\\[Formulaires Gravereau.xlsx]Action\"&$N382&\"'!$D$19\"),\"\")","v":""},{"$f":"IFERROR(INDIRECT(\"'C:\\Users\\Moi\\OneDrive\\Documents\\[Formulaires Gravereau.xlsx]Action\"&$N382&\"'!$h$19\"),\"\")","v":""},{"$f":"IFERROR(VLOOKUP(E387,'[1]Tarif de base'!D:E,2,FALSE)*F387,\"\")","v":""}]
[null,"",null,null,"Total",{"$f":"SUM(F382:F387)","v":0},{"$f":"SUM(G382:G387)","v":0}]
["","","","","","",{"$f":"IFERROR(VLOOKUP(E389,'[1]Tarif de base'!D:E,2,FALSE)*F389,\"\")","v":""},"","","",{"$f":"IFERROR(IF(G395-H389-I389-J389<>0,\"Attention il manque \"&G395-H389-I389-J389&\"€\",\"Règlement OK\"),\"Pas de règlement\")","v":"Pas de règlement"},"",null,55]
[null,"",null,null,{"$f":"IFERROR(INDIRECT(\"'C:\\Users\\Moi\\OneDrive\\Documents\\[Formulaires Gravereau.xlsx]Action\"&$N389&\"'!$D$11\"),\"\")","v":""},{"$f":"IFERROR(INDIRECT(\"'C:\\Users\\Moi\\OneDrive\\Documents\\[Formulaires Gravereau.xlsx]Action\"&$N389&\"'!$h$11\"),\"\")","v":""},{"$f":"IFERROR(VLOOKUP(E390,'[1]Tarif de base'!D:E,2,FALSE)*F390,\"\")","v":""}]
[null,"",null,null,"","",{"$f":"IFERROR(VLOOKUP(E391,'[1]Tarif de base'!D:E,2,FALSE)*F391,\"\")","v":""}]
[null,"",null,null,"","",{"$f":"IFERROR(VLOOKUP(E392,'[1]Tarif de base'!D:E,2,FALSE)*F392,\"\")","v":""}]
[null,"",null,null,"","",{"$f":"IFERROR(VLOOKUP(E393,'[1]Tarif de base'!D:E,2,FALSE)*F393,\"\")","v":""}]
[null,"",null,null,"","",{"$f":"IFERROR(VLOOKUP(E394,'[1]Tarif de base'!D:E,2,FALSE)*F394,\"\")","v":""}]
[null,"",null,null,"Total",{"$f":"SUM(F389:F394)","v":0},{"$f":"SUM(G389:G394)","v":0}]
["","","","","","",{"$f":"IFERROR(VLOOKUP(E396,'[1]Tarif de base'!D:E,2,FALSE)*F396,\"\")","v":""},"","","",{"$f":"IFERROR(IF(G402-H396-I396-J396<>0,\"Attention il manque \"&G402-H396-I396-J396&\"€\",\"Règlement OK\"),\"Pas de règlement\")","v":"Pas de règlement"},"",null,56]
[null,"",null,null,{"$f":"IFERROR(INDIRECT(\"'C:\\Users\\Moi\\OneDrive\\Documents\\[Formulaires Gravereau.xlsx]Action\"&$N396&\"'!$D$11\"),\"\")","v":""},{"$f":"IFERROR(INDIRECT(\"'C:\\Users\\Moi\\OneDrive\\Documents\\[Formulaires Gravereau.xlsx]Action\"&$N396&\"'!$h$11\"),\"\")","v":""},{"$f":"IFERROR(VLOOKUP(E397,'[1]Tarif de base'!D:E,2,FALSE)*F397,\"\")","v":""}]
[null,"",null,null,"","",{"$f":"IFERROR(VLOOKUP(E398,'[1]Tarif de base'!D:E,2,FALSE)*F398,\"\")","v":""}]
[null,"",null,null,"","",{"$f":"IFERROR(VLOOKUP(E399,'[1]Tarif de base'!D:E,2,FALSE)*F399,\"\")","v":""}]
[null,"",null,null,"","",{"$f":"IFERROR(VLOOKUP(E400,'[1]Tarif de base'!D:E,2,FALSE)*F400,\"\")","v":""}]
[null,"",null,null,"","",{"$f":"IFERROR(VLOOKUP(E401,'[1]Tarif de base'!D:E,2,FALSE)*F401,\"\")","v":""}]
[null,{"$f":"B401","v":""},null,null,"Total",{"$f":"SUM(F396:F401)","v":0},{"$f":"SUM(G396:G401)","v":0}]
["","","","","","",{"$f":"IFERROR(VLOOKUP(E403,'[1]Tarif de base'!D:E,2,FALSE)*F403,\"\")","v":""},"","","",{"$f":"IFERROR(IF(G409-H403-I403-J403<>0,\"Attention il manque \"&G409-H403-I403-J403&\"€\",\"Règlement OK\"),\"Pas de règlement\")","v":"Pas de règlement"},"",null,57]
[null,"",null,null,{"$f":"IFERROR(INDIRECT(\"'C:\\Users\\Moi\\OneDrive\\Documents\\[Formulaires Gravereau.xlsx]Action\"&$N403&\"'!$D$11\"),\"\")","v":""},{"$f":"IFERROR(INDIRECT(\"'C:\\Users\\Moi\\OneDrive\\Documents\\[Formulaires Gravereau.xlsx]Action\"&$N403&\"'!$h$11\"),\"\")","v":""},{"$f":"IFERROR(VLOOKUP(E404,'[1]Tarif de base'!D:E,2,FALSE)*F404,\"\")","v":""}]
[null,"",null,null,"","",{"$f":"IFERROR(VLOOKUP(E405,'[1]Tarif de base'!D:E,2,FALSE)*F405,\"\")","v":""}]
[null,"",null,null,"","",{"$f":"IFERROR(VLOOKUP(E406,'[1]Tarif de base'!D:E,2,FALSE)*F406,\"\")","v":""}]
[null,"",null,null,"","",{"$f":"IFERROR(VLOOKUP(E407,'[1]Tarif de base'!D:E,2,FALSE)*F407,\"\")","v":""}]
[null,"",null,null,"","",{"$f":"IFERROR(VLOOKUP(E408,'[1]Tarif de base'!D:E,2,FALSE)*F408,\"\")","v":""}]
[null,"",null,null,"Total",{"$f":"SUM(F403:F408)","v":0},{"$f":"SUM(G403:G408)","v":0}]
["","","","","","",{"$f":"IFERROR(VLOOKUP(E410,'[1]Tarif de base'!D:E,2,FALSE)*F410,\"\")","v":""},"","","",{"$f":"IFERROR(IF(G416-H410-I410-J410<>0,\"Attention il manque \"&G416-H410-I410-J410&\"€\",\"Règlement OK\"),\"Pas de règlement\")","v":"Pas de règlement"},"",null,58]
[null,"",null,null,{"$f":"IFERROR(INDIRECT(\"'C:\\Users\\Moi\\OneDrive\\Documents\\[Formulaires Gravereau.xlsx]Action\"&$N410&\"'!$D$11\"),\"\")","v":""},{"$f":"IFERROR(INDIRECT(\"'C:\\Users\\Moi\\OneDrive\\Documents\\[Formulaires Gravereau.xlsx]Action\"&$N410&\"'!$h$11\"),\"\")","v":""},{"$f":"IFERROR(VLOOKUP(E411,'[1]Tarif de base'!D:E,2,FALSE)*F411,\"\")","v":""}]
[null,"",null,null,"","",{"$f":"IFERROR(VLOOKUP(E412,'[1]Tarif de base'!D:E,2,FALSE)*F412,\"\")","v":""}]
[null,"",null,null,"","",{"$f":"IFERROR(VLOOKUP(E413,'[1]Tarif de base'!D:E,2,FALSE)*F413,\"\")","v":""}]
[null,"",null,null,"","",{"$f":"IFERROR(VLOOKUP(E414,'[1]Tarif de base'!D:E,2,FALSE)*F414,\"\")","v":""}]
[null,"",null,null,"","",{"$f":"IFERROR(VLOOKUP(E415,'[1]Tarif de base'!D:E,2,FALSE)*F415,\"\")","v":""}]
[null,"",null,null,"Total",{"$f":"SUM(F410:F415)","v":0},{"$f":"SUM(G410:G415)","v":0}]
["","","","","","",{"$f":"IFERROR(VLOOKUP(E417,'[1]Tarif de base'!D:E,2,FALSE)*F417,\"\")","v":""},"","","",{"$f":"IFERROR(IF(G423-H417-I417-J417<>0,\"Attention il manque \"&G423-H417-I417-J417&\"€\",\"Règlement OK\"),\"Pas de règlement\")","v":"Pas de règlement"},"",null,59]
[null,"",null,null,{"$f":"IFERROR(INDIRECT(\"'C:\\Users\\Moi\\OneDrive\\Documents\\[Formulaires Gravereau.xlsx]Action\"&$N417&\"'!$D$11\"),\"\")","v":""},{"$f":"IFERROR(INDIRECT(\"'C:\\Users\\Moi\\OneDrive\\Documents\\[Formulaires Gravereau.xlsx]Action\"&$N417&\"'!$h$11\"),\"\")","v":""},{"$f":"IFERROR(VLOOKUP(E418,'[1]Tarif de base'!D:E,2,FALSE)*F418,\"\")","v":""}]
[null,"",null,null,"","",{"$f":"IFERROR(VLOOKUP(E419,'[1]Tarif de base'!D:E,2,FALSE)*F419,\"\")","v":""}]
[null,"",null,null,"","",{"$f":"IFERROR(VLOOKUP(E420,'[1]Tarif de base'!D:E,2,FALSE)*F420,\"\")","v":""}]
[null,"",null,null,"","",{"$f":"IFERROR(VLOOKUP(E421,'[1]Tarif de base'!D:E,2,FALSE)*F421,\"\")","v":""}]
[null,"",null,null,"","",{"$f":"IFERROR(VLOOKUP(E422,'[1]Tarif de base'!D:E,2,FALSE)*F422,\"\")","v":""}]
[null,"",null,null,"Total",{"$f":"SUM(F417:F422)","v":0},{"$f":"SUM(G417:G422)","v":0}]
["","","","","","",{"$f":"IFERROR(VLOOKUP(E424,'[1]Tarif de base'!D:E,2,FALSE)*F424,\"\")","v":""},"","","",{"$f":"IFERROR(IF(G430-H424-I424-J424<>0,\"Attention il manque \"&G430-H424-I424-J424&\"€\",\"Règlement OK\"),\"Pas de règlement\")","v":"Pas de règlement"},"",null,60]
[null,"",null,null,{"$f":"IFERROR(INDIRECT(\"'C:\\Users\\Moi\\OneDrive\\Documents\\[Formulaires Gravereau.xlsx]Action\"&$N424&\"'!$D$11\"),\"\")","v":""},{"$f":"IFERROR(INDIRECT(\"'C:\\Users\\Moi\\OneDrive\\Documents\\[Formulaires Gravereau.xlsx]Action\"&$N424&\"'!$h$11\"),\"\")","v":""},{"$f":"IFERROR(VLOOKUP(E425,'[1]Tarif de base'!D:E,2,FALSE)*F425,\"\")","v":""}]
[null,"",null,null,"","",{"$f":"IFERROR(VLOOKUP(E426,'[1]Tarif de base'!D:E,2,FALSE)*F426,\"\")","v":""}]
[null,"",null,null,"","",{"$f":"IFERROR(VLOOKUP(E427,'[1]Tarif de base'!D:E,2,FALSE)*F427,\"\")","v":""}]
[null,"",null,null,"","",{"$f":"IFERROR(VLOOKUP(E428,'[1]Tarif de base'!D:E,2,FALSE)*F428,\"\")","v":""}]
[null,"",null,null,"","",{"$f":"IFERROR(VLOOKUP(E429,'[1]Tarif de base'!D:E,2,FALSE)*F429,\"\")","v":""}]
[null,"",null,null,"Total",{"$f":"SUM(F424:F429)","v":0},{"$f":"SUM(G424:G429)","v":0}]
["","","","","","",{"$f":"IFERROR(VLOOKUP(E431,'[1]Tarif de base'!D:E,2,FALSE)*F431,\"\")","v":""},"","","",{"$f":"IFERROR(IF(G437-H431-I431-J431<>0,\"Attention il manque \"&G437-H431-I431-J431&\"€\",\"Règlement OK\"),\"Pas de règlement\")","v":"Pas de règlement"},"",null,61]
[null,"",null,null,{"$f":"IFERROR(INDIRECT(\"'C:\\Users\\Moi\\OneDrive\\Documents\\[Formulaires Gravereau.xlsx]Action\"&$N431&\"'!$D$11\"),\"\")","v":""},{"$f":"IFERROR(INDIRECT(\"'C:\\Users\\Moi\\OneDrive\\Documents\\[Formulaires Gravereau.xlsx]Action\"&$N431&\"'!$h$11\"),\"\")","v":""},{"$f":"IFERROR(VLOOKUP(E432,'[1]Tarif de base'!D:E,2,FALSE)*F432,\"\")","v":""}]
[null,"",null,null,"","",{"$f":"IFERROR(VLOOKUP(E433,'[1]Tarif de base'!D:E,2,FALSE)*F433,\"\")","v":""}]
[null,"",null,null,"","",{"$f":"IFERROR(VLOOKUP(E434,'[1]Tarif de base'!D:E,2,FALSE)*F434,\"\")","v":""}]
[null,"",null,null,"","",{"$f":"IFERROR(VLOOKUP(E435,'[1]Tarif de base'!D:E,2,FALSE)*F435,\"\")","v":""}]
[null,"",null,null,"","",{"$f":"IFERROR(VLOOKUP(E436,'[1]Tarif de base'!D:E,2,FALSE)*F436,\"\")","v":""}]
[null,"",null,null,"Total",{"$f":"SUM(F431:F436)","v":0},{"$f":"SUM(G431:G436)","v":0}]
["","","","","","",{"$f":"IFERROR(VLOOKUP(E438,'[1]Tarif de base'!D:E,2,FALSE)*F438,\"\")","v":""},"","","",{"$f":"IFERROR(IF(G444-H438-I438-J438<>0,\"Attention il manque \"&G444-H438-I438-J438&\"€\",\"Règlement OK\"),\"Pas de règlement\")","v":"Pas de règlement"},"",null,62]
[null,"",null,null,{"$f":"IFERROR(INDIRECT(\"'C:\\Users\\Moi\\OneDrive\\Documents\\[Formulaires Gravereau.xlsx]Action\"&$N438&\"'!$D$11\"),\"\")","v":""},{"$f":"IFERROR(INDIRECT(\"'C:\\Users\\Moi\\OneDrive\\Documents\\[Formulaires Gravereau.xlsx]Action\"&$N438&\"'!$h$11\"),\"\")","v":""},{"$f":"IFERROR(VLOOKUP(E439,'[1]Tarif de base'!D:E,2,FALSE)*F439,\"\")","v":""}]
[null,"",null,null,"","",{"$f":"IFERROR(VLOOKUP(E440,'[1]Tarif de base'!D:E,2,FALSE)*F440,\"\")","v":""}]
[null,"",null,null,"","",{"$f":"IFERROR(VLOOKUP(E441,'[1]Tarif de base'!D:E,2,FALSE)*F441,\"\")","v":""}]
[null,"",null,null,"","",{"$f":"IFERROR(VLOOKUP(E442,'[1]Tarif de base'!D:E,2,FALSE)*F442,\"\")","v":""}]
[null,"",null,null,"","",{"$f":"IFERROR(VLOOKUP(E443,'[1]Tarif de base'!D:E,2,FALSE)*F443,\"\")","v":""}]
[null,"",null,null,"Total",{"$f":"SUM(F438:F443)","v":0},{"$f":"SUM(G438:G443)","v":0}]
["","","","","","",{"$f":"IFERROR(VLOOKUP(E445,'[1]Tarif de base'!D:E,2,FALSE)*F445,\"\")","v":""},"","","",{"$f":"IFERROR(IF(G451-H445-I445-J445<>0,\"Attention il manque \"&G451-H445-I445-J445&\"€\",\"Règlement OK\"),\"Pas de règlement\")","v":"Pas de règlement"},"",null,63]
[null,"",null,null,{"$f":"IFERROR(INDIRECT(\"'C:\\Users\\Moi\\OneDrive\\Documents\\[Formulaires Gravereau.xlsx]Action\"&$N445&\"'!$D$11\"),\"\")","v":""},{"$f":"IFERROR(INDIRECT(\"'C:\\Users\\Moi\\OneDrive\\Documents\\[Formulaires Gravereau.xlsx]Action\"&$N445&\"'!$h$11\"),\"\")","v":""},{"$f":"IFERROR(VLOOKUP(E446,'[1]Tarif de base'!D:E,2,FALSE)*F446,\"\")","v":""}]
[null,"",null,null,"","",{"$f":"IFERROR(VLOOKUP(E447,'[1]Tarif de base'!D:E,2,FALSE)*F447,\"\")","v":""}]
[null,"",null,null,"","",{"$f":"IFERROR(VLOOKUP(E448,'[1]Tarif de base'!D:E,2,FALSE)*F448,\"\")","v":""}]
[null,"",null,null,"","",{"$f":"IFERROR(VLOOKUP(E449,'[1]Tarif de base'!D:E,2,FALSE)*F449,\"\")","v":""}]
[null,"",null,null,"","",{"$f":"IFERROR(VLOOKUP(E450,'[1]Tarif de base'!D:E,2,FALSE)*F450,\"\")","v":""}]
[null,"",null,null,"Total",{"$f":"SUM(F445:F450)","v":0},{"$f":"SUM(G445:G450)","v":0}]
[{"$f":"IFERROR(INDIRECT(\"'C:\\Users\\Moi\\OneDrive\\Documents\\[Formulaires Gravereau.xlsx]Action\"&$N452&\"'!$D$6\"),\"\")","v":""},{"$f":"IF(C452<>\"\",C452,\"\")","v":""},{"$f":"IFERROR(INDIRECT(\"'C:\\Users\\Moi\\OneDrive\\Documents\\[Formulaires Gravereau.xlsx]Action\"&$N452&\"'!$D$4\"),\"\")","v":""},{"$f":"IFERROR(INDIRECT(\"'C:\\Users\\Moi\\OneDrive\\Documents\\[Formulaires Gravereau.xlsx]Action\"&$N452&\"'!$h$4\"),\"\")","v":""},{"$f":"IFERROR(INDIRECT(\"'C:\\Users\\Moi\\OneDrive\\Documents\\[Formulaires Gravereau.xlsx]Action\"&$N452&\"'!$D$9\"),\"\")","v":""},{"$f":"IFERROR(INDIRECT(\"'C:\\Users\\Moi\\OneDrive\\Documents\\[Formulaires Gravereau.xlsx]Action\"&$N452&\"'!$h$9\"),\"\")","v":""},{"$f":"IFERROR(VLOOKUP(E452,'[1]Tarif de base'!D:E,2,FALSE)*F452,\"\")","v":""},{"$f":"IFERROR(INDIRECT(\"'C:\\Users\\Moi\\OneDrive\\Documents\\[Formulaires Gravereau.xlsx]Action\"&$N452&\"'!$d$26\"),\"\")","v":""},{"$f":"IFERROR(INDIRECT(\"'C:\\Users\\Moi\\OneDrive\\Documents\\[Formulaires Gravereau.xlsx]Action\"&$N452&\"'!$d$28\"),\"\")","v":""},{"$f":"IFERROR(INDIRECT(\"'C:\\Users\\Moi\\OneDrive\\Documents\\[Formulaires Gravereau.xlsx]Action\"&$N452&\"'!$h$26\"),\"\")","v":""},{"$f":"IFERROR(IF(G458-H452-I452-J452<>0,\"Attention il manque \"&G458-H452-I452-J452&\"€\",\"Règlement OK\"),\"Pas de règlement\")","v":"Pas de règlement"},{"$f":"IFERROR(INDIRECT(\"'C:\\Users\\Moi\\OneDrive\\Documents\\[Formulaires Gravereau.xlsx]Action\"&$N452&\"'!$d$30\"),\"\")","v":""},null,64]
[null,"",null,null,{"$f":"IFERROR(INDIRECT(\"'C:\\Users\\Moi\\OneDrive\\Documents\\[Formulaires Gravereau.xlsx]Action\"&$N452&\"'!$D$11\"),\"\")","v":""},{"$f":"IFERROR(INDIRECT(\"'C:\\Users\\Moi\\OneDrive\\Documents\\[Formulaires Gravereau.xlsx]Action\"&$N452&\"'!$h$11\"),\"\")","v":""},{"$f":"IFERROR(VLOOKUP(E453,'[1]Tarif de base'!D:E,2,FALSE)*F453,\"\")","v":""}]
[null,"",null,null,{"$f":"IFERROR(INDIRECT(\"'C:\\Users\\Moi\\OneDrive\\Documents\\[Formulaires Gravereau.xlsx]Action\"&$N452&\"'!$D$13\"),\"\")","v":""},{"$f":"IFERROR(INDIRECT(\"'C:\\Users\\Moi\\OneDrive\\Documents\\[Formulaires Gravereau.xlsx]Action\"&$N452&\"'!$h$13\"),\"\")","v":""},{"$f":"IFERROR(VLOOKUP(E454,'[1]Tarif de base'!D:E,2,FALSE)*F454,\"\")","v":""}]
[null,"",null,null,{"$f":"IFERROR(INDIRECT(\"'C:\\Users\\Moi\\OneDrive\\Documents\\[Formulaires Gravereau.xlsx]Action\"&$N452&\"'!$D$15\"),\"\")","v":""},{"$f":"IFERROR(INDIRECT(\"'C:\\Users\\Moi\\OneDrive\\Documents\\[Formulaires Gravereau.xlsx]Action\"&$N452&\"'!$h$15\"),\"\")","v":""},{"$f":"IFERROR(VLOOKUP(E455,'[1]Tarif de base'!D:E,2,FALSE)*F455,\"\")","v":""}]
[null,"",null,null,{"$f":"IFERROR(INDIRECT(\"'C:\\Users\\Moi\\OneDrive\\Documents\\[Formulaires Gravereau.xlsx]Action\"&$N452&\"'!$D$17\"),\"\")","v":""},{"$f":"IFERROR(INDIRECT(\"'C:\\Users\\Moi\\OneDrive\\Documents\\[Formulaires Gravereau.xlsx]Action\"&$N452&\"'!$h$17\"),\"\")","v":""},{"$f":"IFERROR(VLOOKUP(E456,'[1]Tarif de base'!D:E,2,FALSE)*F456,\"\")","v":""}]
[null,"",null,null,{"$f":"IFERROR(INDIRECT(\"'C:\\Users\\Moi\\OneDrive\\Documents\\[Formulaires Gravereau.xlsx]Action\"&$N452&\"'!$D$19\"),\"\")","v":""},{"$f":"IFERROR(INDIRECT(\"'C:\\Users\\Moi\\OneDrive\\Documents\\[Formulaires Gravereau.xlsx]Action\"&$N452&\"'!$h$19\"),\"\")","v":""},{"$f":"IFERROR(VLOOKUP(E457,'[1]Tarif de base'!D:E,2,FALSE)*F457,\"\")","v":""}]
[null,"",null,null,"Total",{"$f":"SUM(F452:F457)","v":0},{"$f":"SUM(G452:G457)","v":0}]
["","","","","","",{"$f":"IFERROR(VLOOKUP(E459,'[1]Tarif de base'!D:E,2,FALSE)*F459,\"\")","v":""},"","","",{"$f":"IFERROR(IF(G465-H459-I459-J459<>0,\"Attention il manque \"&G465-H459-I459-J459&\"€\",\"Règlement OK\"),\"Pas de règlement\")","v":"Pas de règlement"},"",null,65]
[null,"",null,null,{"$f":"IFERROR(INDIRECT(\"'C:\\Users\\Moi\\OneDrive\\Documents\\[Formulaires Gravereau.xlsx]Action\"&$N459&\"'!$D$11\"),\"\")","v":""},{"$f":"IFERROR(INDIRECT(\"'C:\\Users\\Moi\\OneDrive\\Documents\\[Formulaires Gravereau.xlsx]Action\"&$N459&\"'!$h$11\"),\"\")","v":""},{"$f":"IFERROR(VLOOKUP(E460,'[1]Tarif de base'!D:E,2,FALSE)*F460,\"\")","v":""}]
[null,"",null,null,"","",{"$f":"IFERROR(VLOOKUP(E461,'[1]Tarif de base'!D:E,2,FALSE)*F461,\"\")","v":""}]
[null,"",null,null,"","",{"$f":"IFERROR(VLOOKUP(E462,'[1]Tarif de base'!D:E,2,FALSE)*F462,\"\")","v":""}]
[null,"",null,null,"","",{"$f":"IFERROR(VLOOKUP(E463,'[1]Tarif de base'!D:E,2,FALSE)*F463,\"\")","v":""}]
[null,"",null,null,"","",{"$f":"IFERROR(VLOOKUP(E464,'[1]Tarif de base'!D:E,2,FALSE)*F464,\"\")","v":""}]
[null,"",null,null,"Total",{"$f":"SUM(F459:F464)","v":0},{"$f":"SUM(G459:G464)","v":0}]
["","","","","","",{"$f":"IFERROR(VLOOKUP(E466,'[1]Tarif de base'!D:E,2,FALSE)*F466,\"\")","v":""},"","","",{"$f":"IFERROR(IF(G472-H466-I466-J466<>0,\"Attention il manque \"&G472-H466-I466-J466&\"€\",\"Règlement OK\"),\"Pas de règlement\")","v":"Pas de règlement"},"",null,66]
[null,{"$f":"B466","v":""},null,null,{"$f":"IFERROR(INDIRECT(\"'C:\\Users\\Moi\\OneDrive\\Documents\\[Formulaires Gravereau.xlsx]Action\"&$N466&\"'!$D$11\"),\"\")","v":""},{"$f":"IFERROR(INDIRECT(\"'C:\\Users\\Moi\\OneDrive\\Documents\\[Formulaires Gravereau.xlsx]Action\"&$N466&\"'!$h$11\"),\"\")","v":""},{"$f":"IFERROR(VLOOKUP(E467,'[1]Tarif de base'!D:E,2,FALSE)*F467,\"\")","v":""}]
[null,"",null,null,"","",{"$f":"IFERROR(VLOOKUP(E468,'[1]Tarif de base'!D:E,2,FALSE)*F468,\"\")","v":""}]
[null,"",null,null,"","",{"$f":"IFERROR(VLOOKUP(E469,'[1]Tarif de base'!D:E,2,FALSE)*F469,\"\")","v":""}]
[null,"",null,null,"","",{"$f":"IFERROR(VLOOKUP(E470,'[1]Tarif de base'!D:E,2,FALSE)*F470,\"\")","v":""}]
[null,"",null,null,"","",{"$f":"IFERROR(VLOOKUP(E471,'[1]Tarif de base'!D:E,2,FALSE)*F471,\"\")","v":""}]
[null,"",null,null,"Total",{"$f":"SUM(F466:F471)","v":0},{"$f":"SUM(G466:G471)","v":0}]
["","","","","","",{"$f":"IFERROR(VLOOKUP(E473,'[1]Tarif de base'!D:E,2,FALSE)*F473,\"\")","v":""},"","","",{"$f":"IFERROR(IF(G479-H473-I473-J473<>0,\"Attention il manque \"&G479-H473-I473-J473&\"€\",\"Règlement OK\"),\"Pas de règlement\")","v":"Pas de règlement"},"",null,67]
[null,"",null,null,{"$f":"IFERROR(INDIRECT(\"'C:\\Users\\Moi\\OneDrive\\Documents\\[Formulaires Gravereau.xlsx]Action\"&$N473&\"'!$D$11\"),\"\")","v":""},{"$f":"IFERROR(INDIRECT(\"'C:\\Users\\Moi\\OneDrive\\Documents\\[Formulaires Gravereau.xlsx]Action\"&$N473&\"'!$h$11\"),\"\")","v":""},{"$f":"IFERROR(VLOOKUP(E474,'[1]Tarif de base'!D:E,2,FALSE)*F474,\"\")","v":""}]
[null,"",null,null,"","",{"$f":"IFERROR(VLOOKUP(E475,'[1]Tarif de base'!D:E,2,FALSE)*F475,\"\")","v":""}]
[null,"",null,null,"","",{"$f":"IFERROR(VLOOKUP(E476,'[1]Tarif de base'!D:E,2,FALSE)*F476,\"\")","v":""}]
[null,"",null,null,"","",{"$f":"IFERROR(VLOOKUP(E477,'[1]Tarif de base'!D:E,2,FALSE)*F477,\"\")","v":""}]
[null,"",null,null,"","",{"$f":"IFERROR(VLOOKUP(E478,'[1]Tarif de base'!D:E,2,FALSE)*F478,\"\")","v":""}]
[null,"",null,null,"Total",{"$f":"SUM(F473:F478)","v":0},{"$f":"SUM(G473:G478)","v":0}]
["","","","","","",{"$f":"IFERROR(VLOOKUP(E480,'[1]Tarif de base'!D:E,2,FALSE)*F480,\"\")","v":""},"","","",{"$f":"IFERROR(IF(G486-H480-I480-J480<>0,\"Attention il manque \"&G486-H480-I480-J480&\"€\",\"Règlement OK\"),\"Pas de règlement\")","v":"Pas de règlement"},"",null,68]
[null,"",null,null,{"$f":"IFERROR(INDIRECT(\"'C:\\Users\\Moi\\OneDrive\\Documents\\[Formulaires Gravereau.xlsx]Action\"&$N480&\"'!$D$11\"),\"\")","v":""},{"$f":"IFERROR(INDIRECT(\"'C:\\Users\\Moi\\OneDrive\\Documents\\[Formulaires Gravereau.xlsx]Action\"&$N480&\"'!$h$11\"),\"\")","v":""},{"$f":"IFERROR(VLOOKUP(E481,'[1]Tarif de base'!D:E,2,FALSE)*F481,\"\")","v":""}]
[null,"",null,null,"","",{"$f":"IFERROR(VLOOKUP(E482,'[1]Tarif de base'!D:E,2,FALSE)*F482,\"\")","v":""}]
[null,"",null,null,"","",{"$f":"IFERROR(VLOOKUP(E483,'[1]Tarif de base'!D:E,2,FALSE)*F483,\"\")","v":""}]
[null,"",null,null,"","",{"$f":"IFERROR(VLOOKUP(E484,'[1]Tarif de base'!D:E,2,FALSE)*F484,\"\")","v":""}]
[null,"",null,null,"","",{"$f":"IFERROR(VLOOKUP(E485,'[1]Tarif de base'!D:E,2,FALSE)*F485,\"\")","v":""}]
[null,"",null,null,"Total",{"$f":"SUM(F480:F485)","v":0},{"$f":"SUM(G480:G485)","v":0}]
["","","","","","",{"$f":"IFERROR(VLOOKUP(E487,'[1]Tarif de base'!D:E,2,FALSE)*F487,\"\")","v":""},"","","",{"$f":"IFERROR(IF(G493-H487-I487-J487<>0,\"Attention il manque \"&G493-H487-I487-J487&\"€\",\"Règlement OK\"),\"Pas de règlement\")","v":"Pas de règlement"},"",null,69]
[null,"",null,null,{"$f":"IFERROR(INDIRECT(\"'C:\\Users\\Moi\\OneDrive\\Documents\\[Formulaires Gravereau.xlsx]Action\"&$N487&\"'!$D$11\"),\"\")","v":""},{"$f":"IFERROR(INDIRECT(\"'C:\\Users\\Moi\\OneDrive\\Documents\\[Formulaires Gravereau.xlsx]Action\"&$N487&\"'!$h$11\"),\"\")","v":""},{"$f":"IFERROR(VLOOKUP(E488,'[1]Tarif de base'!D:E,2,FALSE)*F488,\"\")","v":""}]
[null,"",null,null,"","",{"$f":"IFERROR(VLOOKUP(E489,'[1]Tarif de base'!D:E,2,FALSE)*F489,\"\")","v":""}]
[null,"",null,null,"","",{"$f":"IFERROR(VLOOKUP(E490,'[1]Tarif de base'!D:E,2,FALSE)*F490,\"\")","v":""}]
[null,"",null,null,"","",{"$f":"IFERROR(VLOOKUP(E491,'[1]Tarif de base'!D:E,2,FALSE)*F491,\"\")","v":""}]
[null,"",null,null,"","",{"$f":"IFERROR(VLOOKUP(E492,'[1]Tarif de base'!D:E,2,FALSE)*F492,\"\")","v":""}]
[null,"",null,null,"Total",{"$f":"SUM(F487:F492)","v":0},{"$f":"SUM(G487:G492)","v":0}]
["","","","","","",{"$f":"IFERROR(VLOOKUP(E494,'[1]Tarif de base'!D:E,2,FALSE)*F494,\"\")","v":""},"","","",{"$f":"IFERROR(IF(G500-H494-I494-J494<>0,\"Attention il manque \"&G500-H494-I494-J494&\"€\",\"Règlement OK\"),\"Pas de règlement\")","v":"Pas de règlement"},"",null,70]
[null,"",null,null,{"$f":"IFERROR(INDIRECT(\"'C:\\Users\\Moi\\OneDrive\\Documents\\[Formulaires Gravereau.xlsx]Action\"&$N494&\"'!$D$11\"),\"\")","v":""},{"$f":"IFERROR(INDIRECT(\"'C:\\Users\\Moi\\OneDrive\\Documents\\[Formulaires Gravereau.xlsx]Action\"&$N494&\"'!$h$11\"),\"\")","v":""},{"$f":"IFERROR(VLOOKUP(E495,'[1]Tarif de base'!D:E,2,FALSE)*F495,\"\")","v":""}]
[null,"",null,null,"","",{"$f":"IFERROR(VLOOKUP(E496,'[1]Tarif de base'!D:E,2,FALSE)*F496,\"\")","v":""}]
[null,"",null,null,"","",{"$f":"IFERROR(VLOOKUP(E497,'[1]Tarif de base'!D:E,2,FALSE)*F497,\"\")","v":""}]
[null,"",null,null,"","",{"$f":"IFERROR(VLOOKUP(E498,'[1]Tarif de base'!D:E,2,FALSE)*F498,\"\")","v":""}]
[null,"",null,null,"","",{"$f":"IFERROR(VLOOKUP(E499,'[1]Tarif de base'!D:E,2,FALSE)*F499,\"\")","v":""}]
[null,"",null,null,"Total",{"$f":"SUM(F494:F499)","v":0},{"$f":"SUM(G494:G499)","v":0}]
["","","","","","",{"$f":"IFERROR(VLOOKUP(E501,'[1]Tarif de base'!D:E,2,FALSE)*F501,\"\")","v":""},"","","",{"$f":"IFERROR(IF(G507-H501-I501-J501<>0,\"Attention il manque \"&G507-H501-I501-J501&\"€\",\"Règlement OK\"),\"Pas de règlement\")","v":"Pas de règlement"},"",null,71]
[null,"",null,null,{"$f":"IFERROR(INDIRECT(\"'C:\\Users\\Moi\\OneDrive\\Documents\\[Formulaires Gravereau.xlsx]Action\"&$N501&\"'!$D$11\"),\"\")","v":""},{"$f":"IFERROR(INDIRECT(\"'C:\\Users\\Moi\\OneDrive\\Documents\\[Formulaires Gravereau.xlsx]Action\"&$N501&\"'!$h$11\"),\"\")","v":""},{"$f":"IFERROR(VLOOKUP(E502,'[1]Tarif de base'!D:E,2,FALSE)*F502,\"\")","v":""}]
[null,"",null,null,"","",{"$f":"IFERROR(VLOOKUP(E503,'[1]Tarif de base'!D:E,2,FALSE)*F503,\"\")","v":""}]
[null,"",null,null,"","",{"$f":"IFERROR(VLOOKUP(E504,'[1]Tarif de base'!D:E,2,FALSE)*F504,\"\")","v":""}]
[null,"",null,null,"","",{"$f":"IFERROR(VLOOKUP(E505,'[1]Tarif de base'!D:E,2,FALSE)*F505,\"\")","v":""}]
[null,"",null,null,"","",{"$f":"IFERROR(VLOOKUP(E506,'[1]Tarif de base'!D:E,2,FALSE)*F506,\"\")","v":""}]
[null,"",null,null,"Total",{"$f":"SUM(F501:F506)","v":0},{"$f":"SUM(G501:G506)","v":0}]
["","","","","","",{"$f":"IFERROR(VLOOKUP(E508,'[1]Tarif de base'!D:E,2,FALSE)*F508,\"\")","v":""},"","","",{"$f":"IFERROR(IF(G514-H508-I508-J508<>0,\"Attention il manque \"&G514-H508-I508-J508&\"€\",\"Règlement OK\"),\"Pas de règlement\")","v":"Pas de règlement"},"",null,72]
[null,"",null,null,{"$f":"IFERROR(INDIRECT(\"'C:\\Users\\Moi\\OneDrive\\Documents\\[Formulaires Gravereau.xlsx]Action\"&$N508&\"'!$D$11\"),\"\")","v":""},{"$f":"IFERROR(INDIRECT(\"'C:\\Users\\Moi\\OneDrive\\Documents\\[Formulaires Gravereau.xlsx]Action\"&$N508&\"'!$h$11\"),\"\")","v":""},{"$f":"IFERROR(VLOOKUP(E509,'[1]Tarif de base'!D:E,2,FALSE)*F509,\"\")","v":""}]
[null,"",null,null,"","",{"$f":"IFERROR(VLOOKUP(E510,'[1]Tarif de base'!D:E,2,FALSE)*F510,\"\")","v":""}]
[null,"",null,null,"","",{"$f":"IFERROR(VLOOKUP(E511,'[1]Tarif de base'!D:E,2,FALSE)*F511,\"\")","v":""}]
[null,"",null,null,"","",{"$f":"IFERROR(VLOOKUP(E512,'[1]Tarif de base'!D:E,2,FALSE)*F512,\"\")","v":""}]
[null,"",null,null,"","",{"$f":"IFERROR(VLOOKUP(E513,'[1]Tarif de base'!D:E,2,FALSE)*F513,\"\")","v":""}]
[null,"",null,null,"Total",{"$f":"SUM(F508:F513)","v":0},{"$f":"SUM(G508:G513)","v":0}]
["","","","","","",{"$f":"IFERROR(VLOOKUP(E515,'[1]Tarif de base'!D:E,2,FALSE)*F515,\"\")","v":""},"","","",{"$f":"IFERROR(IF(G521-H515-I515-J515<>0,\"Attention il manque \"&G521-H515-I515-J515&\"€\",\"Règlement OK\"),\"Pas de règlement\")","v":"Pas de règlement"},"",null,73]
[null,"",null,null,{"$f":"IFERROR(INDIRECT(\"'C:\\Users\\Moi\\OneDrive\\Documents\\[Formulaires Gravereau.xlsx]Action\"&$N515&\"'!$D$11\"),\"\")","v":""},{"$f":"IFERROR(INDIRECT(\"'C:\\Users\\Moi\\OneDrive\\Documents\\[Formulaires Gravereau.xlsx]Action\"&$N515&\"'!$h$11\"),\"\")","v":""},{"$f":"IFERROR(VLOOKUP(E516,'[1]Tarif de base'!D:E,2,FALSE)*F516,\"\")","v":""}]
[null,"",null,null,"","",{"$f":"IFERROR(VLOOKUP(E517,'[1]Tarif de base'!D:E,2,FALSE)*F517,\"\")","v":""}]
[null,"",null,null,"","",{"$f":"IFERROR(VLOOKUP(E518,'[1]Tarif de base'!D:E,2,FALSE)*F518,\"\")","v":""}]
[null,"",null,null,"","",{"$f":"IFERROR(VLOOKUP(E519,'[1]Tarif de base'!D:E,2,FALSE)*F519,\"\")","v":""}]
[null,"",null,null,"","",{"$f":"IFERROR(VLOOKUP(E520,'[1]Tarif de base'!D:E,2,FALSE)*F520,\"\")","v":""}]
[null,"",null,null,"Total",{"$f":"SUM(F515:F520)","v":0},{"$f":"SUM(G515:G520)","v":0}]
[{"$f":"IFERROR(INDIRECT(\"'C:\\Users\\Moi\\OneDrive\\Documents\\[Formulaires Gravereau.xlsx]Action\"&$N522&\"'!$D$6\"),\"\")","v":""},{"$f":"IF(C522<>\"\",C522,\"\")","v":""},{"$f":"IFERROR(INDIRECT(\"'C:\\Users\\Moi\\OneDrive\\Documents\\[Formulaires Gravereau.xlsx]Action\"&$N522&\"'!$D$4\"),\"\")","v":""},{"$f":"IFERROR(INDIRECT(\"'C:\\Users\\Moi\\OneDrive\\Documents\\[Formulaires Gravereau.xlsx]Action\"&$N522&\"'!$h$4\"),\"\")","v":""},{"$f":"IFERROR(INDIRECT(\"'C:\\Users\\Moi\\OneDrive\\Documents\\[Formulaires Gravereau.xlsx]Action\"&$N522&\"'!$D$9\"),\"\")","v":""},{"$f":"IFERROR(INDIRECT(\"'C:\\Users\\Moi\\OneDrive\\Documents\\[Formulaires Gravereau.xlsx]Action\"&$N522&\"'!$h$9\"),\"\")","v":""},{"$f":"IFERROR(VLOOKUP(E522,'[1]Tarif de base'!D:E,2,FALSE)*F522,\"\")","v":""},{"$f":"IFERROR(INDIRECT(\"'C:\\Users\\Moi\\OneDrive\\Documents\\[Formulaires Gravereau.xlsx]Action\"&$N522&\"'!$d$26\"),\"\")","v":""},{"$f":"IFERROR(INDIRECT(\"'C:\\Users\\Moi\\OneDrive\\Documents\\[Formulaires Gravereau.xlsx]Action\"&$N522&\"'!$d$28\"),\"\")","v":""},{"$f":"IFERROR(INDIRECT(\"'C:\\Users\\Moi\\OneDrive\\Documents\\[Formulaires Gravereau.xlsx]Action\"&$N522&\"'!$h$26\"),\"\")","v":""},{"$f":"IFERROR(IF(G528-H522-I522-J522<>0,\"Attention il manque \"&G528-H522-I522-J522&\"€\",\"Règlement OK\"),\"Pas de règlement\")","v":"Pas de règlement"},{"$f":"IFERROR(INDIRECT(\"'C:\\Users\\Moi\\OneDrive\\Documents\\[Formulaires Gravereau.xlsx]Action\"&$N522&\"'!$d$30\"),\"\")","v":""},null,74]
[null,"",null,null,{"$f":"IFERROR(INDIRECT(\"'C:\\Users\\Moi\\OneDrive\\Documents\\[Formulaires Gravereau.xlsx]Action\"&$N522&\"'!$D$11\"),\"\")","v":""},{"$f":"IFERROR(INDIRECT(\"'C:\\Users\\Moi\\OneDrive\\Documents\\[Formulaires Gravereau.xlsx]Action\"&$N522&\"'!$h$11\"),\"\")","v":""},{"$f":"IFERROR(VLOOKUP(E523,'[1]Tarif de base'!D:E,2,FALSE)*F523,\"\")","v":""}]
[null,"",null,null,{"$f":"IFERROR(INDIRECT(\"'C:\\Users\\Moi\\OneDrive\\Documents\\[Formulaires Gravereau.xlsx]Action\"&$N522&\"'!$D$13\"),\"\")","v":""},{"$f":"IFERROR(INDIRECT(\"'C:\\Users\\Moi\\OneDrive\\Documents\\[Formulaires Gravereau.xlsx]Action\"&$N522&\"'!$h$13\"),\"\")","v":""},{"$f":"IFERROR(VLOOKUP(E524,'[1]Tarif de base'!D:E,2,FALSE)*F524,\"\")","v":""}]
[null,"",null,null,{"$f":"IFERROR(INDIRECT(\"'C:\\Users\\Moi\\OneDrive\\Documents\\[Formulaires Gravereau.xlsx]Action\"&$N522&\"'!$D$15\"),\"\")","v":""},{"$f":"IFERROR(INDIRECT(\"'C:\\Users\\Moi\\OneDrive\\Documents\\[Formulaires Gravereau.xlsx]Action\"&$N522&\"'!$h$15\"),\"\")","v":""},{"$f":"IFERROR(VLOOKUP(E525,'[1]Tarif de base'!D:E,2,FALSE)*F525,\"\")","v":""}]
[null,"",null,null,{"$f":"IFERROR(INDIRECT(\"'C:\\Users\\Moi\\OneDrive\\Documents\\[Formulaires Gravereau.xlsx]Action\"&$N522&\"'!$D$17\"),\"\")","v":""},{"$f":"IFERROR(INDIRECT(\"'C:\\Users\\Moi\\OneDrive\\Documents\\[Formulaires Gravereau.xlsx]Action\"&$N522&\"'!$h$17\"),\"\")","v":""},{"$f":"IFERROR(VLOOKUP(E526,'[1]Tarif de base'!D:E,2,FALSE)*F526,\"\")","v":""}]
[null,"",null,null,{"$f":"IFERROR(INDIRECT(\"'C:\\Users\\Moi\\OneDrive\\Documents\\[Formulaires Gravereau.xlsx]Action\"&$N522&\"'!$D$19\"),\"\")","v":""},{"$f":"IFERROR(INDIRECT(\"'C:\\Users\\Moi\\OneDrive\\Documents\\[Formulaires Gravereau.xlsx]Action\"&$N522&\"'!$h$19\"),\"\")","v":""},{"$f":"IFERROR(VLOOKUP(E527,'[1]Tarif de base'!D:E,2,FALSE)*F527,\"\")","v":""}]
[null,"",null,null,"Total",{"$f":"SUM(F522:F527)","v":0},{"$f":"SUM(G522:G527)","v":0}]
["","","","","","",{"$f":"IFERROR(VLOOKUP(E529,'[1]Tarif de base'!D:E,2,FALSE)*F529,\"\")","v":""},"","","",{"$f":"IFERROR(IF(G535-H529-I529-J529<>0,\"Attention il manque \"&G535-H529-I529-J529&\"€\",\"Règlement OK\"),\"Pas de règlement\")","v":"Pas de règlement"},"",null,75]
[null,"",null,null,{"$f":"IFERROR(INDIRECT(\"'C:\\Users\\Moi\\OneDrive\\Documents\\[Formulaires Gravereau.xlsx]Action\"&$N529&\"'!$D$11\"),\"\")","v":""},{"$f":"IFERROR(INDIRECT(\"'C:\\Users\\Moi\\OneDrive\\Documents\\[Formulaires Gravereau.xlsx]Action\"&$N529&\"'!$h$11\"),\"\")","v":""},{"$f":"IFERROR(VLOOKUP(E530,'[1]Tarif de base'!D:E,2,FALSE)*F530,\"\")","v":""}]
[null,{"$f":"B530","v":""},null,null,"","",{"$f":"IFERROR(VLOOKUP(E531,'[1]Tarif de base'!D:E,2,FALSE)*F531,\"\")","v":""}]
[null,"",null,null,"","",{"$f":"IFERROR(VLOOKUP(E532,'[1]Tarif de base'!D:E,2,FALSE)*F532,\"\")","v":""}]
[null,"",null,null,"","",{"$f":"IFERROR(VLOOKUP(E533,'[1]Tarif de base'!D:E,2,FALSE)*F533,\"\")","v":""}]
[null,"",null,null,"","",{"$f":"IFERROR(VLOOKUP(E534,'[1]Tarif de base'!D:E,2,FALSE)*F534,\"\")","v":""}]
[null,"",null,null,"Total",{"$f":"SUM(F529:F534)","v":0},{"$f":"SUM(G529:G534)","v":0}]
["","","","","","",{"$f":"IFERROR(VLOOKUP(E536,'[1]Tarif de base'!D:E,2,FALSE)*F536,\"\")","v":""},"","","",{"$f":"IFERROR(IF(G542-H536-I536-J536<>0,\"Attention il manque \"&G542-H536-I536-J536&\"€\",\"Règlement OK\"),\"Pas de règlement\")","v":"Pas de règlement"},"",null,76]
[null,"",null,null,{"$f":"IFERROR(INDIRECT(\"'C:\\Users\\Moi\\OneDrive\\Documents\\[Formulaires Gravereau.xlsx]Action\"&$N536&\"'!$D$11\"),\"\")","v":""},{"$f":"IFERROR(INDIRECT(\"'C:\\Users\\Moi\\OneDrive\\Documents\\[Formulaires Gravereau.xlsx]Action\"&$N536&\"'!$h$11\"),\"\")","v":""},{"$f":"IFERROR(VLOOKUP(E537,'[1]Tarif de base'!D:E,2,FALSE)*F537,\"\")","v":""}]
[null,"",null,null,"","",{"$f":"IFERROR(VLOOKUP(E538,'[1]Tarif de base'!D:E,2,FALSE)*F538,\"\")","v":""}]
[null,"",null,null,"","",{"$f":"IFERROR(VLOOKUP(E539,'[1]Tarif de base'!D:E,2,FALSE)*F539,\"\")","v":""}]
[null,"",null,null,"","",{"$f":"IFERROR(VLOOKUP(E540,'[1]Tarif de base'!D:E,2,FALSE)*F540,\"\")","v":""}]
[null,"",null,null,"","",{"$f":"IFERROR(VLOOKUP(E541,'[1]Tarif de base'!D:E,2,FALSE)*F541,\"\")","v":""}]
[null,"",null,null,"Total",{"$f":"SUM(F536:F541)","v":0},{"$f":"SUM(G536:G541)","v":0}]
["","","","","","",{"$f":"IFERROR(VLOOKUP(E543,'[1]Tarif de base'!D:E,2,FALSE)*F543,\"\")","v":""},"","","",{"$f":"IFERROR(IF(G549-H543-I543-J543<>0,\"Attention il manque \"&G549-H543-I543-J543&\"€\",\"Règlement OK\"),\"Pas de règlement\")","v":"Pas de règlement"},"",null,77]
[null,"",null,null,{"$f":"IFERROR(INDIRECT(\"'C:\\Users\\Moi\\OneDrive\\Documents\\[Formulaires Gravereau.xlsx]Action\"&$N543&\"'!$D$11\"),\"\")","v":""},{"$f":"IFERROR(INDIRECT(\"'C:\\Users\\Moi\\OneDrive\\Documents\\[Formulaires Gravereau.xlsx]Action\"&$N543&\"'!$h$11\"),\"\")","v":""},{"$f":"IFERROR(VLOOKUP(E544,'[1]Tarif de base'!D:E,2,FALSE)*F544,\"\")","v":""}]
[null,"",null,null,"","",{"$f":"IFERROR(VLOOKUP(E545,'[1]Tarif de base'!D:E,2,FALSE)*F545,\"\")","v":""}]
[null,"",null,null,"","",{"$f":"IFERROR(VLOOKUP(E546,'[1]Tarif de base'!D:E,2,FALSE)*F546,\"\")","v":""}]
[null,"",null,null,"","",{"$f":"IFERROR(VLOOKUP(E547,'[1]Tarif de base'!D:E,2,FALSE)*F547,\"\")","v":""}]
[null,"",null,null,"","",{"$f":"IFERROR(VLOOKUP(E548,'[1]Tarif de base'!D:E,2,FALSE)*F548,\"\")","v":""}]
[null,"",null,null,"Total",{"$f":"SUM(F543:F548)","v":0},{"$f":"SUM(G543:G548)","v":0}]
["","","","","","",{"$f":"IFERROR(VLOOKUP(E550,'[1]Tarif de base'!D:E,2,FALSE)*F550,\"\")","v":""},"","","",{"$f":"IFERROR(IF(G556-H550-I550-J550<>0,\"Attention il manque \"&G556-H550-I550-J550&\"€\",\"Règlement OK\"),\"Pas de règlement\")","v":"Pas de règlement"},"",null,78]
[null,"",null,null,{"$f":"IFERROR(INDIRECT(\"'C:\\Users\\Moi\\OneDrive\\Documents\\[Formulaires Gravereau.xlsx]Action\"&$N550&\"'!$D$11\"),\"\")","v":""},{"$f":"IFERROR(INDIRECT(\"'C:\\Users\\Moi\\OneDrive\\Documents\\[Formulaires Gravereau.xlsx]Action\"&$N550&\"'!$h$11\"),\"\")","v":""},{"$f":"IFERROR(VLOOKUP(E551,'[1]Tarif de base'!D:E,2,FALSE)*F551,\"\")","v":""}]
[null,"",null,null,"","",{"$f":"IFERROR(VLOOKUP(E552,'[1]Tarif de base'!D:E,2,FALSE)*F552,\"\")","v":""}]
[null,"",null,null,"","",{"$f":"IFERROR(VLOOKUP(E553,'[1]Tarif de base'!D:E,2,FALSE)*F553,\"\")","v":""}]
[null,"",null,null,"","",{"$f":"IFERROR(VLOOKUP(E554,'[1]Tarif de base'!D:E,2,FALSE)*F554,\"\")","v":""}]
[null,"",null,null,"","",{"$f":"IFERROR(VLOOKUP(E555,'[1]Tarif de base'!D:E,2,FALSE)*F555,\"\")","v":""}]
[null,"",null,null,"Total",{"$f":"SUM(F550:F555)","v":0},{"$f":"SUM(G550:G555)","v":0}]
["","","","","","",{"$f":"IFERROR(VLOOKUP(E557,'[1]Tarif de base'!D:E,2,FALSE)*F557,\"\")","v":""},"","","",{"$f":"IFERROR(IF(G563-H557-I557-J557<>0,\"Attention il manque \"&G563-H557-I557-J557&\"€\",\"Règlement OK\"),\"Pas de règlement\")","v":"Pas de règlement"},"",null,79]
[null,"",null,null,{"$f":"IFERROR(INDIRECT(\"'C:\\Users\\Moi\\OneDrive\\Documents\\[Formulaires Gravereau.xlsx]Action\"&$N557&\"'!$D$11\"),\"\")","v":""},{"$f":"IFERROR(INDIRECT(\"'C:\\Users\\Moi\\OneDrive\\Documents\\[Formulaires Gravereau.xlsx]Action\"&$N557&\"'!$h$11\"),\"\")","v":""},{"$f":"IFERROR(VLOOKUP(E558,'[1]Tarif de base'!D:E,2,FALSE)*F558,\"\")","v":""}]
[null,"",null,null,"","",{"$f":"IFERROR(VLOOKUP(E559,'[1]Tarif de base'!D:E,2,FALSE)*F559,\"\")","v":""}]
[null,"",null,null,"","",{"$f":"IFERROR(VLOOKUP(E560,'[1]Tarif de base'!D:E,2,FALSE)*F560,\"\")","v":""}]
[null,"",null,null,"","",{"$f":"IFERROR(VLOOKUP(E561,'[1]Tarif de base'!D:E,2,FALSE)*F561,\"\")","v":""}]
[null,"",null,null,"","",{"$f":"IFERROR(VLOOKUP(E562,'[1]Tarif de base'!D:E,2,FALSE)*F562,\"\")","v":""}]
[null,"",null,null,"Total",{"$f":"SUM(F557:F562)","v":0},{"$f":"SUM(G557:G562)","v":0}]
["","","","","","",{"$f":"IFERROR(VLOOKUP(E564,'[1]Tarif de base'!D:E,2,FALSE)*F564,\"\")","v":""},"","","",{"$f":"IFERROR(IF(G570-H564-I564-J564<>0,\"Attention il manque \"&G570-H564-I564-J564&\"€\",\"Règlement OK\"),\"Pas de règlement\")","v":"Pas de règlement"},"",null,80]
[null,"",null,null,{"$f":"IFERROR(INDIRECT(\"'C:\\Users\\Moi\\OneDrive\\Documents\\[Formulaires Gravereau.xlsx]Action\"&$N564&\"'!$D$11\"),\"\")","v":""},{"$f":"IFERROR(INDIRECT(\"'C:\\Users\\Moi\\OneDrive\\Documents\\[Formulaires Gravereau.xlsx]Action\"&$N564&\"'!$h$11\"),\"\")","v":""},{"$f":"IFERROR(VLOOKUP(E565,'[1]Tarif de base'!D:E,2,FALSE)*F565,\"\")","v":""}]
[null,"",null,null,"","",{"$f":"IFERROR(VLOOKUP(E566,'[1]Tarif de base'!D:E,2,FALSE)*F566,\"\")","v":""}]
[null,"",null,null,"","",{"$f":"IFERROR(VLOOKUP(E567,'[1]Tarif de base'!D:E,2,FALSE)*F567,\"\")","v":""}]
[null,"",null,null,"","",{"$f":"IFERROR(VLOOKUP(E568,'[1]Tarif de base'!D:E,2,FALSE)*F568,\"\")","v":""}]
[null,"",null,null,"","",{"$f":"IFERROR(VLOOKUP(E569,'[1]Tarif de base'!D:E,2,FALSE)*F569,\"\")","v":""}]
[null,"",null,null,"Total",{"$f":"SUM(F564:F569)","v":0},{"$f":"SUM(G564:G569)","v":0}]
["","","","","","",{"$f":"IFERROR(VLOOKUP(E571,'[1]Tarif de base'!D:E,2,FALSE)*F571,\"\")","v":""},"","","",{"$f":"IFERROR(IF(G577-H571-I571-J571<>0,\"Attention il manque \"&G577-H571-I571-J571&\"€\",\"Règlement OK\"),\"Pas de règlement\")","v":"Pas de règlement"},"",null,81]
[null,"",null,null,{"$f":"IFERROR(INDIRECT(\"'C:\\Users\\Moi\\OneDrive\\Documents\\[Formulaires Gravereau.xlsx]Action\"&$N571&\"'!$D$11\"),\"\")","v":""},{"$f":"IFERROR(INDIRECT(\"'C:\\Users\\Moi\\OneDrive\\Documents\\[Formulaires Gravereau.xlsx]Action\"&$N571&\"'!$h$11\"),\"\")","v":""},{"$f":"IFERROR(VLOOKUP(E572,'[1]Tarif de base'!D:E,2,FALSE)*F572,\"\")","v":""}]
[null,"",null,null,"","",{"$f":"IFERROR(VLOOKUP(E573,'[1]Tarif de base'!D:E,2,FALSE)*F573,\"\")","v":""}]
[null,"",null,null,"","",{"$f":"IFERROR(VLOOKUP(E574,'[1]Tarif de base'!D:E,2,FALSE)*F574,\"\")","v":""}]
[null,"",null,null,"","",{"$f":"IFERROR(VLOOKUP(E575,'[1]Tarif de base'!D:E,2,FALSE)*F575,\"\")","v":""}]
[null,"",null,null,"","",{"$f":"IFERROR(VLOOKUP(E576,'[1]Tarif de base'!D:E,2,FALSE)*F576,\"\")","v":""}]
[null,"",null,null,"Total",{"$f":"SUM(F571:F576)","v":0},{"$f":"SUM(G571:G576)","v":0}]
["","","","","","",{"$f":"IFERROR(VLOOKUP(E578,'[1]Tarif de base'!D:E,2,FALSE)*F578,\"\")","v":""},"","","",{"$f":"IFERROR(IF(G584-H578-I578-J578<>0,\"Attention il manque \"&G584-H578-I578-J578&\"€\",\"Règlement OK\"),\"Pas de règlement\")","v":"Pas de règlement"},"",null,82]
[null,"",null,null,{"$f":"IFERROR(INDIRECT(\"'C:\\Users\\Moi\\OneDrive\\Documents\\[Formulaires Gravereau.xlsx]Action\"&$N578&\"'!$D$11\"),\"\")","v":""},{"$f":"IFERROR(INDIRECT(\"'C:\\Users\\Moi\\OneDrive\\Documents\\[Formulaires Gravereau.xlsx]Action\"&$N578&\"'!$h$11\"),\"\")","v":""},{"$f":"IFERROR(VLOOKUP(E579,'[1]Tarif de base'!D:E,2,FALSE)*F579,\"\")","v":""}]
[null,"",null,null,"","",{"$f":"IFERROR(VLOOKUP(E580,'[1]Tarif de base'!D:E,2,FALSE)*F580,\"\")","v":""}]
[null,"",null,null,"","",{"$f":"IFERROR(VLOOKUP(E581,'[1]Tarif de base'!D:E,2,FALSE)*F581,\"\")","v":""}]
[null,"",null,null,"","",{"$f":"IFERROR(VLOOKUP(E582,'[1]Tarif de base'!D:E,2,FALSE)*F582,\"\")","v":""}]
[null,"",null,null,"","",{"$f":"IFERROR(VLOOKUP(E583,'[1]Tarif de base'!D:E,2,FALSE)*F583,\"\")","v":""}]
[null,"",null,null,"Total",{"$f":"SUM(F578:F583)","v":0},{"$f":"SUM(G578:G583)","v":0}]
["","","","","","",{"$f":"IFERROR(VLOOKUP(E585,'[1]Tarif de base'!D:E,2,FALSE)*F585,\"\")","v":""},"","","",{"$f":"IFERROR(IF(G591-H585-I585-J585<>0,\"Attention il manque \"&G591-H585-I585-J585&\"€\",\"Règlement OK\"),\"Pas de règlement\")","v":"Pas de règlement"},"",null,83]
[null,"",null,null,{"$f":"IFERROR(INDIRECT(\"'C:\\Users\\Moi\\OneDrive\\Documents\\[Formulaires Gravereau.xlsx]Action\"&$N585&\"'!$D$11\"),\"\")","v":""},{"$f":"IFERROR(INDIRECT(\"'C:\\Users\\Moi\\OneDrive\\Documents\\[Formulaires Gravereau.xlsx]Action\"&$N585&\"'!$h$11\"),\"\")","v":""},{"$f":"IFERROR(VLOOKUP(E586,'[1]Tarif de base'!D:E,2,FALSE)*F586,\"\")","v":""}]
[null,"",null,null,"","",{"$f":"IFERROR(VLOOKUP(E587,'[1]Tarif de base'!D:E,2,FALSE)*F587,\"\")","v":""}]
[null,"",null,null,"","",{"$f":"IFERROR(VLOOKUP(E588,'[1]Tarif de base'!D:E,2,FALSE)*F588,\"\")","v":""}]
[null,"",null,null,"","",{"$f":"IFERROR(VLOOKUP(E589,'[1]Tarif de base'!D:E,2,FALSE)*F589,\"\")","v":""}]
[null,"",null,null,"","",{"$f":"IFERROR(VLOOKUP(E590,'[1]Tarif de base'!D:E,2,FALSE)*F590,\"\")","v":""}]
[null,"",null,null,"Total",{"$f":"SUM(F585:F590)","v":0},{"$f":"SUM(G585:G590)","v":0}]
[{"$f":"IFERROR(INDIRECT(\"'C:\\Users\\Moi\\OneDrive\\Documents\\[Formulaires Gravereau.xlsx]Action\"&$N592&\"'!$D$6\"),\"\")","v":""},{"$f":"IF(C592<>\"\",C592,\"\")","v":""},{"$f":"IFERROR(INDIRECT(\"'C:\\Users\\Moi\\OneDrive\\Documents\\[Formulaires Gravereau.xlsx]Action\"&$N592&\"'!$D$4\"),\"\")","v":""},{"$f":"IFERROR(INDIRECT(\"'C:\\Users\\Moi\\OneDrive\\Documents\\[Formulaires Gravereau.xlsx]Action\"&$N592&\"'!$h$4\"),\"\")","v":""},{"$f":"IFERROR(INDIRECT(\"'C:\\Users\\Moi\\OneDrive\\Documents\\[Formulaires Gravereau.xlsx]Action\"&$N592&\"'!$D$9\"),\"\")","v":""},{"$f":"IFERROR(INDIRECT(\"'C:\\Users\\Moi\\OneDrive\\Documents\\[Formulaires Gravereau.xlsx]Action\"&$N592&\"'!$h$9\"),\"\")","v":""},{"$f":"IFERROR(VLOOKUP(E592,'[1]Tarif de base'!D:E,2,FALSE)*F592,\"\")","v":""},{"$f":"IFERROR(INDIRECT(\"'C:\\Users\\Moi\\OneDrive\\Documents\\[Formulaires Gravereau.xlsx]Action\"&$N592&\"'!$d$26\"),\"\")","v":""},{"$f":"IFERROR(INDIRECT(\"'C:\\Users\\Moi\\OneDrive\\Documents\\[Formulaires Gravereau.xlsx]Action\"&$N592&\"'!$d$28\"),\"\")","v":""},{"$f":"IFERROR(INDIRECT(\"'C:\\Users\\Moi\\OneDrive\\Documents\\[Formulaires Gravereau.xlsx]Action\"&$N592&\"'!$h$26\"),\"\")","v":""},{"$f":"IFERROR(IF(G598-H592-I592-J592<>0,\"Attention il manque \"&G598-H592-I592-J592&\"€\",\"Règlement OK\"),\"Pas de règlement\")","v":"Pas de règlement"},{"$f":"IFERROR(INDIRECT(\"'C:\\Users\\Moi\\OneDrive\\Documents\\[Formulaires Gravereau.xlsx]Action\"&$N592&\"'!$d$30\"),\"\")","v":""},null,84]
[null,"",null,null,{"$f":"IFERROR(INDIRECT(\"'C:\\Users\\Moi\\OneDrive\\Documents\\[Formulaires Gravereau.xlsx]Action\"&$N592&\"'!$D$11\"),\"\")","v":""},{"$f":"IFERROR(INDIRECT(\"'C:\\Users\\Moi\\OneDrive\\Documents\\[Formulaires Gravereau.xlsx]Action\"&$N592&\"'!$h$11\"),\"\")","v":""},{"$f":"IFERROR(VLOOKUP(E593,'[1]Tarif de base'!D:E,2,FALSE)*F593,\"\")","v":""}]
[null,"",null,null,{"$f":"IFERROR(INDIRECT(\"'C:\\Users\\Moi\\OneDrive\\Documents\\[Formulaires Gravereau.xlsx]Action\"&$N592&\"'!$D$13\"),\"\")","v":""},{"$f":"IFERROR(INDIRECT(\"'C:\\Users\\Moi\\OneDrive\\Documents\\[Formulaires Gravereau.xlsx]Action\"&$N592&\"'!$h$13\"),\"\")","v":""},{"$f":"IFERROR(VLOOKUP(E594,'[1]Tarif de base'!D:E,2,FALSE)*F594,\"\")","v":""}]
[null,{"$f":"B594","v":""},null,null,{"$f":"IFERROR(INDIRECT(\"'C:\\Users\\Moi\\OneDrive\\Documents\\[Formulaires Gravereau.xlsx]Action\"&$N592&\"'!$D$15\"),\"\")","v":""},{"$f":"IFERROR(INDIRECT(\"'C:\\Users\\Moi\\OneDrive\\Documents\\[Formulaires Gravereau.xlsx]Action\"&$N592&\"'!$h$15\"),\"\")","v":""},{"$f":"IFERROR(VLOOKUP(E595,'[1]Tarif de base'!D:E,2,FALSE)*F595,\"\")","v":""}]
[null,"",null,null,{"$f":"IFERROR(INDIRECT(\"'C:\\Users\\Moi\\OneDrive\\Documents\\[Formulaires Gravereau.xlsx]Action\"&$N592&\"'!$D$17\"),\"\")","v":""},{"$f":"IFERROR(INDIRECT(\"'C:\\Users\\Moi\\OneDrive\\Documents\\[Formulaires Gravereau.xlsx]Action\"&$N592&\"'!$h$17\"),\"\")","v":""},{"$f":"IFERROR(VLOOKUP(E596,'[1]Tarif de base'!D:E,2,FALSE)*F596,\"\")","v":""}]
[null,"",null,null,{"$f":"IFERROR(INDIRECT(\"'C:\\Users\\Moi\\OneDrive\\Documents\\[Formulaires Gravereau.xlsx]Action\"&$N592&\"'!$D$19\"),\"\")","v":""},{"$f":"IFERROR(INDIRECT(\"'C:\\Users\\Moi\\OneDrive\\Documents\\[Formulaires Gravereau.xlsx]Action\"&$N592&\"'!$h$19\"),\"\")","v":""},{"$f":"IFERROR(VLOOKUP(E597,'[1]Tarif de base'!D:E,2,FALSE)*F597,\"\")","v":""}]
[null,"",null,null,"Total",{"$f":"SUM(F592:F597)","v":0},{"$f":"SUM(G592:G597)","v":0}]
["","","","","","",{"$f":"IFERROR(VLOOKUP(E599,'[1]Tarif de base'!D:E,2,FALSE)*F599,\"\")","v":""},"","","",{"$f":"IFERROR(IF(G605-H599-I599-J599<>0,\"Attention il manque \"&G605-H599-I599-J599&\"€\",\"Règlement OK\"),\"Pas de règlement\")","v":"Pas de règlement"},"",null,85]
[null,"",null,null,{"$f":"IFERROR(INDIRECT(\"'C:\\Users\\Moi\\OneDrive\\Documents\\[Formulaires Gravereau.xlsx]Action\"&$N599&\"'!$D$11\"),\"\")","v":""},{"$f":"IFERROR(INDIRECT(\"'C:\\Users\\Moi\\OneDrive\\Documents\\[Formulaires Gravereau.xlsx]Action\"&$N599&\"'!$h$11\"),\"\")","v":""},{"$f":"IFERROR(VLOOKUP(E600,'[1]Tarif de base'!D:E,2,FALSE)*F600,\"\")","v":""}]
[null,"",null,null,"","",{"$f":"IFERROR(VLOOKUP(E601,'[1]Tarif de base'!D:E,2,FALSE)*F601,\"\")","v":""}]
[null,"",null,null,"","",{"$f":"IFERROR(VLOOKUP(E602,'[1]Tarif de base'!D:E,2,FALSE)*F602,\"\")","v":""}]
[null,"",null,null,"","",{"$f":"IFERROR(VLOOKUP(E603,'[1]Tarif de base'!D:E,2,FALSE)*F603,\"\")","v":""}]
[null,"",null,null,"","",{"$f":"IFERROR(VLOOKUP(E604,'[1]Tarif de base'!D:E,2,FALSE)*F604,\"\")","v":""}]
[null,"",null,null,"Total",{"$f":"SUM(F599:F604)","v":0},{"$f":"SUM(G599:G604)","v":0}]
["","","","","","",{"$f":"IFERROR(VLOOKUP(E606,'[1]Tarif de base'!D:E,2,FALSE)*F606,\"\")","v":""},"","","",{"$f":"IFERROR(IF(G612-H606-I606-J606<>0,\"Attention il manque \"&G612-H606-I606-J606&\"€\",\"Règlement OK\"),\"Pas de règlement\")","v":"Pas de règlement"},"",null,86]
[null,"",null,null,{"$f":"IFERROR(INDIRECT(\"'C:\\Users\\Moi\\OneDrive\\Documents\\[Formulaires Gravereau.xlsx]Action\"&$N606&\"'!$D$11\"),\"\")","v":""},{"$f":"IFERROR(INDIRECT(\"'C:\\Users\\Moi\\OneDrive\\Documents\\[Formulaires Gravereau.xlsx]Action\"&$N606&\"'!$h$11\"),\"\")","v":""},{"$f":"IFERROR(VLOOKUP(E607,'[1]Tarif de base'!D:E,2,FALSE)*F607,\"\")","v":""}]
[null,"",null,null,"","",{"$f":"IFERROR(VLOOKUP(E608,'[1]Tarif de base'!D:E,2,FALSE)*F608,\"\")","v":""}]
[null,"",null,null,"","",{"$f":"IFERROR(VLOOKUP(E609,'[1]Tarif de base'!D:E,2,FALSE)*F609,\"\")","v":""}]
[null,"",null,null,"","",{"$f":"IFERROR(VLOOKUP(E610,'[1]Tarif de base'!D:E,2,FALSE)*F610,\"\")","v":""}]
[null,"",null,null,"","",{"$f":"IFERROR(VLOOKUP(E611,'[1]Tarif de base'!D:E,2,FALSE)*F611,\"\")","v":""}]
[null,"",null,null,"Total",{"$f":"SUM(F606:F611)","v":0},{"$f":"SUM(G606:G611)","v":0}]
["","","","","","",{"$f":"IFERROR(VLOOKUP(E613,'[1]Tarif de base'!D:E,2,FALSE)*F613,\"\")","v":""},"","","",{"$f":"IFERROR(IF(G619-H613-I613-J613<>0,\"Attention il manque \"&G619-H613-I613-J613&\"€\",\"Règlement OK\"),\"Pas de règlement\")","v":"Pas de règlement"},"",null,87]
[null,"",null,null,{"$f":"IFERROR(INDIRECT(\"'C:\\Users\\Moi\\OneDrive\\Documents\\[Formulaires Gravereau.xlsx]Action\"&$N613&\"'!$D$11\"),\"\")","v":""},{"$f":"IFERROR(INDIRECT(\"'C:\\Users\\Moi\\OneDrive\\Documents\\[Formulaires Gravereau.xlsx]Action\"&$N613&\"'!$h$11\"),\"\")","v":""},{"$f":"IFERROR(VLOOKUP(E614,'[1]Tarif de base'!D:E,2,FALSE)*F614,\"\")","v":""}]
[null,"",null,null,"","",{"$f":"IFERROR(VLOOKUP(E615,'[1]Tarif de base'!D:E,2,FALSE)*F615,\"\")","v":""}]
[null,"",null,null,"","",{"$f":"IFERROR(VLOOKUP(E616,'[1]Tarif de base'!D:E,2,FALSE)*F616,\"\")","v":""}]
[null,"",null,null,"","",{"$f":"IFERROR(VLOOKUP(E617,'[1]Tarif de base'!D:E,2,FALSE)*F617,\"\")","v":""}]
[null,"",null,null,"","",{"$f":"IFERROR(VLOOKUP(E618,'[1]Tarif de base'!D:E,2,FALSE)*F618,\"\")","v":""}]
[null,"",null,null,"Total",{"$f":"SUM(F613:F618)","v":0},{"$f":"SUM(G613:G618)","v":0}]
["","","","","","",{"$f":"IFERROR(VLOOKUP(E620,'[1]Tarif de base'!D:E,2,FALSE)*F620,\"\")","v":""},"","","",{"$f":"IFERROR(IF(G626-H620-I620-J620<>0,\"Attention il manque \"&G626-H620-I620-J620&\"€\",\"Règlement OK\"),\"Pas de règlement\")","v":"Pas de règlement"},"",null,88]
[null,"",null,null,{"$f":"IFERROR(INDIRECT(\"'C:\\Users\\Moi\\OneDrive\\Documents\\[Formulaires Gravereau.xlsx]Action\"&$N620&\"'!$D$11\"),\"\")","v":""},{"$f":"IFERROR(INDIRECT(\"'C:\\Users\\Moi\\OneDrive\\Documents\\[Formulaires Gravereau.xlsx]Action\"&$N620&\"'!$h$11\"),\"\")","v":""},{"$f":"IFERROR(VLOOKUP(E621,'[1]Tarif de base'!D:E,2,FALSE)*F621,\"\")","v":""}]
[null,"",null,null,"","",{"$f":"IFERROR(VLOOKUP(E622,'[1]Tarif de base'!D:E,2,FALSE)*F622,\"\")","v":""}]
[null,"",null,null,"","",{"$f":"IFERROR(VLOOKUP(E623,'[1]Tarif de base'!D:E,2,FALSE)*F623,\"\")","v":""}]
[null,"",null,null,"","",{"$f":"IFERROR(VLOOKUP(E624,'[1]Tarif de base'!D:E,2,FALSE)*F624,\"\")","v":""}]
[null,"",null,null,"","",{"$f":"IFERROR(VLOOKUP(E625,'[1]Tarif de base'!D:E,2,FALSE)*F625,\"\")","v":""}]
[null,"",null,null,"Total",{"$f":"SUM(F620:F625)","v":0},{"$f":"SUM(G620:G625)","v":0}]
["","","","","","",{"$f":"IFERROR(VLOOKUP(E627,'[1]Tarif de base'!D:E,2,FALSE)*F627,\"\")","v":""},"","","",{"$f":"IFERROR(IF(G633-H627-I627-J627<>0,\"Attention il manque \"&G633-H627-I627-J627&\"€\",\"Règlement OK\"),\"Pas de règlement\")","v":"Pas de règlement"},"",null,89]
[null,"",null,null,{"$f":"IFERROR(INDIRECT(\"'C:\\Users\\Moi\\OneDrive\\Documents\\[Formulaires Gravereau.xlsx]Action\"&$N627&\"'!$D$11\"),\"\")","v":""},{"$f":"IFERROR(INDIRECT(\"'C:\\Users\\Moi\\OneDrive\\Documents\\[Formulaires Gravereau.xlsx]Action\"&$N627&\"'!$h$11\"),\"\")","v":""},{"$f":"IFERROR(VLOOKUP(E628,'[1]Tarif de base'!D:E,2,FALSE)*F628,\"\")","v":""}]
[null,"",null,null,"","",{"$f":"IFERROR(VLOOKUP(E629,'[1]Tarif de base'!D:E,2,FALSE)*F629,\"\")","v":""}]
[null,"",null,null,"","",{"$f":"IFERROR(VLOOKUP(E630,'[1]Tarif de base'!D:E,2,FALSE)*F630,\"\")","v":""}]
[null,"",null,null,"","",{"$f":"IFERROR(VLOOKUP(E631,'[1]Tarif de base'!D:E,2,FALSE)*F631,\"\")","v":""}]
[null,"",null,null,"","",{"$f":"IFERROR(VLOOKUP(E632,'[1]Tarif de base'!D:E,2,FALSE)*F632,\"\")","v":""}]
[null,"",null,null,"Total",{"$f":"SUM(F627:F632)","v":0},{"$f":"SUM(G627:G632)","v":0}]
["","","","","","",{"$f":"IFERROR(VLOOKUP(E634,'[1]Tarif de base'!D:E,2,FALSE)*F634,\"\")","v":""},"","","",{"$f":"IFERROR(IF(G640-H634-I634-J634<>0,\"Attention il manque \"&G640-H634-I634-J634&\"€\",\"Règlement OK\"),\"Pas de règlement\")","v":"Pas de règlement"},"",null,90]
[null,"",null,null,{"$f":"IFERROR(INDIRECT(\"'C:\\Users\\Moi\\OneDrive\\Documents\\[Formulaires Gravereau.xlsx]Action\"&$N634&\"'!$D$11\"),\"\")","v":""},{"$f":"IFERROR(INDIRECT(\"'C:\\Users\\Moi\\OneDrive\\Documents\\[Formulaires Gravereau.xlsx]Action\"&$N634&\"'!$h$11\"),\"\")","v":""},{"$f":"IFERROR(VLOOKUP(E635,'[1]Tarif de base'!D:E,2,FALSE)*F635,\"\")","v":""}]
[null,"",null,null,"","",{"$f":"IFERROR(VLOOKUP(E636,'[1]Tarif de base'!D:E,2,FALSE)*F636,\"\")","v":""}]
[null,"",null,null,"","",{"$f":"IFERROR(VLOOKUP(E637,'[1]Tarif de base'!D:E,2,FALSE)*F637,\"\")","v":""}]
[null,"",null,null,"","",{"$f":"IFERROR(VLOOKUP(E638,'[1]Tarif de base'!D:E,2,FALSE)*F638,\"\")","v":""}]
[null,"",null,null,"","",{"$f":"IFERROR(VLOOKUP(E639,'[1]Tarif de base'!D:E,2,FALSE)*F639,\"\")","v":""}]
[null,"",null,null,"Total",{"$f":"SUM(F634:F639)","v":0},{"$f":"SUM(G634:G639)","v":0}]
["","","","","","",{"$f":"IFERROR(VLOOKUP(E641,'[1]Tarif de base'!D:E,2,FALSE)*F641,\"\")","v":""},"","","",{"$f":"IFERROR(IF(G647-H641-I641-J641<>0,\"Attention il manque \"&G647-H641-I641-J641&\"€\",\"Règlement OK\"),\"Pas de règlement\")","v":"Pas de règlement"},"",null,91]
[null,"",null,null,{"$f":"IFERROR(INDIRECT(\"'C:\\Users\\Moi\\OneDrive\\Documents\\[Formulaires Gravereau.xlsx]Action\"&$N641&\"'!$D$11\"),\"\")","v":""},{"$f":"IFERROR(INDIRECT(\"'C:\\Users\\Moi\\OneDrive\\Documents\\[Formulaires Gravereau.xlsx]Action\"&$N641&\"'!$h$11\"),\"\")","v":""},{"$f":"IFERROR(VLOOKUP(E642,'[1]Tarif de base'!D:E,2,FALSE)*F642,\"\")","v":""}]
[null,"",null,null,"","",{"$f":"IFERROR(VLOOKUP(E643,'[1]Tarif de base'!D:E,2,FALSE)*F643,\"\")","v":""}]
[null,"",null,null,"","",{"$f":"IFERROR(VLOOKUP(E644,'[1]Tarif de base'!D:E,2,FALSE)*F644,\"\")","v":""}]
[null,"",null,null,"","",{"$f":"IFERROR(VLOOKUP(E645,'[1]Tarif de base'!D:E,2,FALSE)*F645,\"\")","v":""}]
[null,"",null,null,"","",{"$f":"IFERROR(VLOOKUP(E646,'[1]Tarif de base'!D:E,2,FALSE)*F646,\"\")","v":""}]
[null,"",null,null,"Total",{"$f":"SUM(F641:F646)","v":0},{"$f":"SUM(G641:G646)","v":0}]
["","","","","","",{"$f":"IFERROR(VLOOKUP(E648,'[1]Tarif de base'!D:E,2,FALSE)*F648,\"\")","v":""},"","","",{"$f":"IFERROR(IF(G654-H648-I648-J648<>0,\"Attention il manque \"&G654-H648-I648-J648&\"€\",\"Règlement OK\"),\"Pas de règlement\")","v":"Pas de règlement"},"",null,92]
[null,"",null,null,{"$f":"IFERROR(INDIRECT(\"'C:\\Users\\Moi\\OneDrive\\Documents\\[Formulaires Gravereau.xlsx]Action\"&$N648&\"'!$D$11\"),\"\")","v":""},{"$f":"IFERROR(INDIRECT(\"'C:\\Users\\Moi\\OneDrive\\Documents\\[Formulaires Gravereau.xlsx]Action\"&$N648&\"'!$h$11\"),\"\")","v":""},{"$f":"IFERROR(VLOOKUP(E649,'[1]Tarif de base'!D:E,2,FALSE)*F649,\"\")","v":""}]
[null,"",null,null,"","",{"$f":"IFERROR(VLOOKUP(E650,'[1]Tarif de base'!D:E,2,FALSE)*F650,\"\")","v":""}]
[null,"",null,null,"","",{"$f":"IFERROR(VLOOKUP(E651,'[1]Tarif de base'!D:E,2,FALSE)*F651,\"\")","v":""}]
[null,"",null,null,"","",{"$f":"IFERROR(VLOOKUP(E652,'[1]Tarif de base'!D:E,2,FALSE)*F652,\"\")","v":""}]
[null,"",null,null,"","",{"$f":"IFERROR(VLOOKUP(E653,'[1]Tarif de base'!D:E,2,FALSE)*F653,\"\")","v":""}]
[null,"",null,null,"Total",{"$f":"SUM(F648:F653)","v":0},{"$f":"SUM(G648:G653)","v":0}]
["","","","","","",{"$f":"IFERROR(VLOOKUP(E655,'[1]Tarif de base'!D:E,2,FALSE)*F655,\"\")","v":""},"","","",{"$f":"IFERROR(IF(G661-H655-I655-J655<>0,\"Attention il manque \"&G661-H655-I655-J655&\"€\",\"Règlement OK\"),\"Pas de règlement\")","v":"Pas de règlement"},"",null,93]
[null,"",null,null,{"$f":"IFERROR(INDIRECT(\"'C:\\Users\\Moi\\OneDrive\\Documents\\[Formulaires Gravereau.xlsx]Action\"&$N655&\"'!$D$11\"),\"\")","v":""},{"$f":"IFERROR(INDIRECT(\"'C:\\Users\\Moi\\OneDrive\\Documents\\[Formulaires Gravereau.xlsx]Action\"&$N655&\"'!$h$11\"),\"\")","v":""},{"$f":"IFERROR(VLOOKUP(E656,'[1]Tarif de base'!D:E,2,FALSE)*F656,\"\")","v":""}]
[null,"",null,null,"","",{"$f":"IFERROR(VLOOKUP(E657,'[1]Tarif de base'!D:E,2,FALSE)*F657,\"\")","v":""}]
[null,"",null,null,"","",{"$f":"IFERROR(VLOOKUP(E658,'[1]Tarif de base'!D:E,2,FALSE)*F658,\"\")","v":""}]
[null,{"$f":"B658","v":""},null,null,"","",{"$f":"IFERROR(VLOOKUP(E659,'[1]Tarif de base'!D:E,2,FALSE)*F659,\"\")","v":""}]
[null,"",null,null,"","",{"$f":"IFERROR(VLOOKUP(E660,'[1]Tarif de base'!D:E,2,FALSE)*F660,\"\")","v":""}]
[null,"",null,null,"Total",{"$f":"SUM(F655:F660)","v":0},{"$f":"SUM(G655:G660)","v":0}]
[{"$f":"IFERROR(INDIRECT(\"'C:\\Users\\Moi\\OneDrive\\Documents\\[Formulaires Gravereau.xlsx]Action\"&$N662&\"'!$D$6\"),\"\")","v":""},{"$f":"IF(C662<>\"\",C662,\"\")","v":""},{"$f":"IFERROR(INDIRECT(\"'C:\\Users\\Moi\\OneDrive\\Documents\\[Formulaires Gravereau.xlsx]Action\"&$N662&\"'!$D$4\"),\"\")","v":""},{"$f":"IFERROR(INDIRECT(\"'C:\\Users\\Moi\\OneDrive\\Documents\\[Formulaires Gravereau.xlsx]Action\"&$N662&\"'!$h$4\"),\"\")","v":""},{"$f":"IFERROR(INDIRECT(\"'C:\\Users\\Moi\\OneDrive\\Documents\\[Formulaires Gravereau.xlsx]Action\"&$N662&\"'!$D$9\"),\"\")","v":""},{"$f":"IFERROR(INDIRECT(\"'C:\\Users\\Moi\\OneDrive\\Documents\\[Formulaires Gravereau.xlsx]Action\"&$N662&\"'!$h$9\"),\"\")","v":""},{"$f":"IFERROR(VLOOKUP(E662,'[1]Tarif de base'!D:E,2,FALSE)*F662,\"\")","v":""},{"$f":"IFERROR(INDIRECT(\"'C:\\Users\\Moi\\OneDrive\\Documents\\[Formulaires Gravereau.xlsx]Action\"&$N662&\"'!$d$26\"),\"\")","v":""},{"$f":"IFERROR(INDIRECT(\"'C:\\Users\\Moi\\OneDrive\\Documents\\[Formulaires Gravereau.xlsx]Action\"&$N662&\"'!$d$28\"),\"\")","v":""},{"$f":"IFERROR(INDIRECT(\"'C:\\Users\\Moi\\OneDrive\\Documents\\[Formulaires Gravereau.xlsx]Action\"&$N662&\"'!$h$26\"),\"\")","v":""},{"$f":"IFERROR(IF(G668-H662-I662-J662<>0,\"Attention il manque \"&G668-H662-I662-J662&\"€\",\"Règlement OK\"),\"Pas de règlement\")","v":"Pas de règlement"},{"$f":"IFERROR(INDIRECT(\"'C:\\Users\\Moi\\OneDrive\\Documents\\[Formulaires Gravereau.xlsx]Action\"&$N662&\"'!$d$30\"),\"\")","v":""},null,94]
[null,"",null,null,{"$f":"IFERROR(INDIRECT(\"'C:\\Users\\Moi\\OneDrive\\Documents\\[Formulaires Gravereau.xlsx]Action\"&$N662&\"'!$D$11\"),\"\")","v":""},{"$f":"IFERROR(INDIRECT(\"'C:\\Users\\Moi\\OneDrive\\Documents\\[Formulaires Gravereau.xlsx]Action\"&$N662&\"'!$h$11\"),\"\")","v":""},{"$f":"IFERROR(VLOOKUP(E663,'[1]Tarif de base'!D:E,2,FALSE)*F663,\"\")","v":""}]
[null,"",null,null,{"$f":"IFERROR(INDIRECT(\"'C:\\Users\\Moi\\OneDrive\\Documents\\[Formulaires Gravereau.xlsx]Action\"&$N662&\"'!$D$13\"),\"\")","v":""},{"$f":"IFERROR(INDIRECT(\"'C:\\Users\\Moi\\OneDrive\\Documents\\[Formulaires Gravereau.xlsx]Action\"&$N662&\"'!$h$13\"),\"\")","v":""},{"$f":"IFERROR(VLOOKUP(E664,'[1]Tarif de base'!D:E,2,FALSE)*F664,\"\")","v":""}]
[null,"",null,null,{"$f":"IFERROR(INDIRECT(\"'C:\\Users\\Moi\\OneDrive\\Documents\\[Formulaires Gravereau.xlsx]Action\"&$N662&\"'!$D$15\"),\"\")","v":""},{"$f":"IFERROR(INDIRECT(\"'C:\\Users\\Moi\\OneDrive\\Documents\\[Formulaires Gravereau.xlsx]Action\"&$N662&\"'!$h$15\"),\"\")","v":""},{"$f":"IFERROR(VLOOKUP(E665,'[1]Tarif de base'!D:E,2,FALSE)*F665,\"\")","v":""}]
[null,"",null,null,{"$f":"IFERROR(INDIRECT(\"'C:\\Users\\Moi\\OneDrive\\Documents\\[Formulaires Gravereau.xlsx]Action\"&$N662&\"'!$D$17\"),\"\")","v":""},{"$f":"IFERROR(INDIRECT(\"'C:\\Users\\Moi\\OneDrive\\Documents\\[Formulaires Gravereau.xlsx]Action\"&$N662&\"'!$h$17\"),\"\")","v":""},{"$f":"IFERROR(VLOOKUP(E666,'[1]Tarif de base'!D:E,2,FALSE)*F666,\"\")","v":""}]
[null,"",null,null,{"$f":"IFERROR(INDIRECT(\"'C:\\Users\\Moi\\OneDrive\\Documents\\[Formulaires Gravereau.xlsx]Action\"&$N662&\"'!$D$19\"),\"\")","v":""},{"$f":"IFERROR(INDIRECT(\"'C:\\Users\\Moi\\OneDrive\\Documents\\[Formulaires Gravereau.xlsx]Action\"&$N662&\"'!$h$19\"),\"\")","v":""},{"$f":"IFERROR(VLOOKUP(E667,'[1]Tarif de base'!D:E,2,FALSE)*F667,\"\")","v":""}]
[null,"",null,null,"Total",{"$f":"SUM(F662:F667)","v":0},{"$f":"SUM(G662:G667)","v":0}]
["","","","","","",{"$f":"IFERROR(VLOOKUP(E669,'[1]Tarif de base'!D:E,2,FALSE)*F669,\"\")","v":""},"","","",{"$f":"IFERROR(IF(G675-H669-I669-J669<>0,\"Attention il manque \"&G675-H669-I669-J669&\"€\",\"Règlement OK\"),\"Pas de règlement\")","v":"Pas de règlement"},"",null,95]
[null,"",null,null,{"$f":"IFERROR(INDIRECT(\"'C:\\Users\\Moi\\OneDrive\\Documents\\[Formulaires Gravereau.xlsx]Action\"&$N669&\"'!$D$11\"),\"\")","v":""},{"$f":"IFERROR(INDIRECT(\"'C:\\Users\\Moi\\OneDrive\\Documents\\[Formulaires Gravereau.xlsx]Action\"&$N669&\"'!$h$11\"),\"\")","v":""},{"$f":"IFERROR(VLOOKUP(E670,'[1]Tarif de base'!D:E,2,FALSE)*F670,\"\")","v":""}]
[null,"",null,null,"","",{"$f":"IFERROR(VLOOKUP(E671,'[1]Tarif de base'!D:E,2,FALSE)*F671,\"\")","v":""}]
[null,"",null,null,"","",{"$f":"IFERROR(VLOOKUP(E672,'[1]Tarif de base'!D:E,2,FALSE)*F672,\"\")","v":""}]
[null,"",null,null,"","",{"$f":"IFERROR(VLOOKUP(E673,'[1]Tarif de base'!D:E,2,FALSE)*F673,\"\")","v":""}]
[null,"",null,null,"","",{"$f":"IFERROR(VLOOKUP(E674,'[1]Tarif de base'!D:E,2,FALSE)*F674,\"\")","v":""}]
[null,"",null,null,"Total",{"$f":"SUM(F669:F674)","v":0},{"$f":"SUM(G669:G674)","v":0}]
["","","","","","",{"$f":"IFERROR(VLOOKUP(E676,'[1]Tarif de base'!D:E,2,FALSE)*F676,\"\")","v":""},"","","",{"$f":"IFERROR(IF(G682-H676-I676-J676<>0,\"Attention il manque \"&G682-H676-I676-J676&\"€\",\"Règlement OK\"),\"Pas de règlement\")","v":"Pas de règlement"},"",null,96]
[null,"",null,null,{"$f":"IFERROR(INDIRECT(\"'C:\\Users\\Moi\\OneDrive\\Documents\\[Formulaires Gravereau.xlsx]Action\"&$N676&\"'!$D$11\"),\"\")","v":""},{"$f":"IFERROR(INDIRECT(\"'C:\\Users\\Moi\\OneDrive\\Documents\\[Formulaires Gravereau.xlsx]Action\"&$N676&\"'!$h$11\"),\"\")","v":""},{"$f":"IFERROR(VLOOKUP(E677,'[1]Tarif de base'!D:E,2,FALSE)*F677,\"\")","v":""}]
[null,"",null,null,"","",{"$f":"IFERROR(VLOOKUP(E678,'[1]Tarif de base'!D:E,2,FALSE)*F678,\"\")","v":""}]
[null,"",null,null,"","",{"$f":"IFERROR(VLOOKUP(E679,'[1]Tarif de base'!D:E,2,FALSE)*F679,\"\")","v":""}]
[null,"",null,null,"","",{"$f":"IFERROR(VLOOKUP(E680,'[1]Tarif de base'!D:E,2,FALSE)*F680,\"\")","v":""}]
[null,"",null,null,"","",{"$f":"IFERROR(VLOOKUP(E681,'[1]Tarif de base'!D:E,2,FALSE)*F681,\"\")","v":""}]
[null,"",null,null,"Total",{"$f":"SUM(F676:F681)","v":0},{"$f":"SUM(G676:G681)","v":0}]
["","","","","","",{"$f":"IFERROR(VLOOKUP(E683,'[1]Tarif de base'!D:E,2,FALSE)*F683,\"\")","v":""},"","","",{"$f":"IFERROR(IF(G689-H683-I683-J683<>0,\"Attention il manque \"&G689-H683-I683-J683&\"€\",\"Règlement OK\"),\"Pas de règlement\")","v":"Pas de règlement"},"",null,97]
[null,"",null,null,{"$f":"IFERROR(INDIRECT(\"'C:\\Users\\Moi\\OneDrive\\Documents\\[Formulaires Gravereau.xlsx]Action\"&$N683&\"'!$D$11\"),\"\")","v":""},{"$f":"IFERROR(INDIRECT(\"'C:\\Users\\Moi\\OneDrive\\Documents\\[Formulaires Gravereau.xlsx]Action\"&$N683&\"'!$h$11\"),\"\")","v":""},{"$f":"IFERROR(VLOOKUP(E684,'[1]Tarif de base'!D:E,2,FALSE)*F684,\"\")","v":""}]
[null,"",null,null,"","",{"$f":"IFERROR(VLOOKUP(E685,'[1]Tarif de base'!D:E,2,FALSE)*F685,\"\")","v":""}]
[null,"",null,null,"","",{"$f":"IFERROR(VLOOKUP(E686,'[1]Tarif de base'!D:E,2,FALSE)*F686,\"\")","v":""}]
[null,"",null,null,"","",{"$f":"IFERROR(VLOOKUP(E687,'[1]Tarif de base'!D:E,2,FALSE)*F687,\"\")","v":""}]
[null,"",null,null,"","",{"$f":"IFERROR(VLOOKUP(E688,'[1]Tarif de base'!D:E,2,FALSE)*F688,\"\")","v":""}]
[null,"",null,null,"Total",{"$f":"SUM(F683:F688)","v":0},{"$f":"SUM(G683:G688)","v":0}]
["","","","","","",{"$f":"IFERROR(VLOOKUP(E690,'[1]Tarif de base'!D:E,2,FALSE)*F690,\"\")","v":""},"","","",{"$f":"IFERROR(IF(G696-H690-I690-J690<>0,\"Attention il manque \"&G696-H690-I690-J690&\"€\",\"Règlement OK\"),\"Pas de règlement\")","v":"Pas de règlement"},"",null,98]
[null,"",null,null,{"$f":"IFERROR(INDIRECT(\"'C:\\Users\\Moi\\OneDrive\\Documents\\[Formulaires Gravereau.xlsx]Action\"&$N690&\"'!$D$11\"),\"\")","v":""},{"$f":"IFERROR(INDIRECT(\"'C:\\Users\\Moi\\OneDrive\\Documents\\[Formulaires Gravereau.xlsx]Action\"&$N690&\"'!$h$11\"),\"\")","v":""},{"$f":"IFERROR(VLOOKUP(E691,'[1]Tarif de base'!D:E,2,FALSE)*F691,\"\")","v":""}]
[null,"",null,null,"","",{"$f":"IFERROR(VLOOKUP(E692,'[1]Tarif de base'!D:E,2,FALSE)*F692,\"\")","v":""}]
[null,"",null,null,"","",{"$f":"IFERROR(VLOOKUP(E693,'[1]Tarif de base'!D:E,2,FALSE)*F693,\"\")","v":""}]
[null,"",null,null,"","",{"$f":"IFERROR(VLOOKUP(E694,'[1]Tarif de base'!D:E,2,FALSE)*F694,\"\")","v":""}]
[null,"",null,null,"","",{"$f":"IFERROR(VLOOKUP(E695,'[1]Tarif de base'!D:E,2,FALSE)*F695,\"\")","v":""}]
[null,"",null,null,"Total",{"$f":"SUM(F690:F695)","v":0},{"$f":"SUM(G690:G695)","v":0}]
["","","","","","",{"$f":"IFERROR(VLOOKUP(E697,'[1]Tarif de base'!D:E,2,FALSE)*F697,\"\")","v":""},"","","",{"$f":"IFERROR(IF(G703-H697-I697-J697<>0,\"Attention il manque \"&G703-H697-I697-J697&\"€\",\"Règlement OK\"),\"Pas de règlement\")","v":"Pas de règlement"},"",null,99]
[null,"",null,null,{"$f":"IFERROR(INDIRECT(\"'C:\\Users\\Moi\\OneDrive\\Documents\\[Formulaires Gravereau.xlsx]Action\"&$N697&\"'!$D$11\"),\"\")","v":""},{"$f":"IFERROR(INDIRECT(\"'C:\\Users\\Moi\\OneDrive\\Documents\\[Formulaires Gravereau.xlsx]Action\"&$N697&\"'!$h$11\"),\"\")","v":""},{"$f":"IFERROR(VLOOKUP(E698,'[1]Tarif de base'!D:E,2,FALSE)*F698,\"\")","v":""}]
[null,"",null,null,"","",{"$f":"IFERROR(VLOOKUP(E699,'[1]Tarif de base'!D:E,2,FALSE)*F699,\"\")","v":""}]
[null,"",null,null,"","",{"$f":"IFERROR(VLOOKUP(E700,'[1]Tarif de base'!D:E,2,FALSE)*F700,\"\")","v":""}]
[null,"",null,null,"","",{"$f":"IFERROR(VLOOKUP(E701,'[1]Tarif de base'!D:E,2,FALSE)*F701,\"\")","v":""}]
[null,"",null,null,"","",{"$f":"IFERROR(VLOOKUP(E702,'[1]Tarif de base'!D:E,2,FALSE)*F702,\"\")","v":""}]
[null,"",null,null,"Total",{"$f":"SUM(F697:F702)","v":0},{"$f":"SUM(G697:G702)","v":0}]
["","","","","","",{"$f":"IFERROR(VLOOKUP(E704,'[1]Tarif de base'!D:E,2,FALSE)*F704,\"\")","v":""},"","","",{"$f":"IFERROR(IF(G710-H704-I704-J704<>0,\"Attention il manque \"&G710-H704-I704-J704&\"€\",\"Règlement OK\"),\"Pas de règlement\")","v":"Pas de règlement"},"",null,100]
[null,"",null,null,{"$f":"IFERROR(INDIRECT(\"'C:\\Users\\Moi\\OneDrive\\Documents\\[Formulaires Gravereau.xlsx]Action\"&$N704&\"'!$D$11\"),\"\")","v":""},{"$f":"IFERROR(INDIRECT(\"'C:\\Users\\Moi\\OneDrive\\Documents\\[Formulaires Gravereau.xlsx]Action\"&$N704&\"'!$h$11\"),\"\")","v":""},{"$f":"IFERROR(VLOOKUP(E705,'[1]Tarif de base'!D:E,2,FALSE)*F705,\"\")","v":""}]
[null,"",null,null,"","",{"$f":"IFERROR(VLOOKUP(E706,'[1]Tarif de base'!D:E,2,FALSE)*F706,\"\")","v":""}]
[null,"",null,null,"","",{"$f":"IFERROR(VLOOKUP(E707,'[1]Tarif de base'!D:E,2,FALSE)*F707,\"\")","v":""}]
[null,"",null,null,"","",{"$f":"IFERROR(VLOOKUP(E708,'[1]Tarif de base'!D:E,2,FALSE)*F708,\"\")","v":""}]
[null,"",null,null,"","",{"$f":"IFERROR(VLOOKUP(E709,'[1]Tarif de base'!D:E,2,FALSE)*F709,\"\")","v":""}]
[null,"",null,null,"Total",{"$f":"SUM(F704:F709)","v":0},{"$f":"SUM(G704:G709)","v":0}]
["","","","","","",{"$f":"IFERROR(VLOOKUP(E711,'[1]Tarif de base'!D:E,2,FALSE)*F711,\"\")","v":""},"","","",{"$f":"IFERROR(IF(G717-H711-I711-J711<>0,\"Attention il manque \"&G717-H711-I711-J711&\"€\",\"Règlement OK\"),\"Pas de règlement\")","v":"Pas de règlement"},"",null,101]
[null,"",null,null,{"$f":"IFERROR(INDIRECT(\"'C:\\Users\\Moi\\OneDrive\\Documents\\[Formulaires Gravereau.xlsx]Action\"&$N711&\"'!$D$11\"),\"\")","v":""},{"$f":"IFERROR(INDIRECT(\"'C:\\Users\\Moi\\OneDrive\\Documents\\[Formulaires Gravereau.xlsx]Action\"&$N711&\"'!$h$11\"),\"\")","v":""},{"$f":"IFERROR(VLOOKUP(E712,'[1]Tarif de base'!D:E,2,FALSE)*F712,\"\")","v":""}]
[null,"",null,null,"","",{"$f":"IFERROR(VLOOKUP(E713,'[1]Tarif de base'!D:E,2,FALSE)*F713,\"\")","v":""}]
[null,"",null,null,"","",{"$f":"IFERROR(VLOOKUP(E714,'[1]Tarif de base'!D:E,2,FALSE)*F714,\"\")","v":""}]
[null,"",null,null,"","",{"$f":"IFERROR(VLOOKUP(E715,'[1]Tarif de base'!D:E,2,FALSE)*F715,\"\")","v":""}]
[null,"",null,null,"","",{"$f":"IFERROR(VLOOKUP(E716,'[1]Tarif de base'!D:E,2,FALSE)*F716,\"\")","v":""}]
[null,"",null,null,"Total",{"$f":"SUM(F711:F716)","v":0},{"$f":"SUM(G711:G716)","v":0}]
["","","","","","",{"$f":"IFERROR(VLOOKUP(E718,'[1]Tarif de base'!D:E,2,FALSE)*F718,\"\")","v":""},"","","",{"$f":"IFERROR(IF(G724-H718-I718-J718<>0,\"Attention il manque \"&G724-H718-I718-J718&\"€\",\"Règlement OK\"),\"Pas de règlement\")","v":"Pas de règlement"},"",null,102]
[null,"",null,null,{"$f":"IFERROR(INDIRECT(\"'C:\\Users\\Moi\\OneDrive\\Documents\\[Formulaires Gravereau.xlsx]Action\"&$N718&\"'!$D$11\"),\"\")","v":""},{"$f":"IFERROR(INDIRECT(\"'C:\\Users\\Moi\\OneDrive\\Documents\\[Formulaires Gravereau.xlsx]Action\"&$N718&\"'!$h$11\"),\"\")","v":""},{"$f":"IFERROR(VLOOKUP(E719,'[1]Tarif de base'!D:E,2,FALSE)*F719,\"\")","v":""}]
[null,"",null,null,"","",{"$f":"IFERROR(VLOOKUP(E720,'[1]Tarif de base'!D:E,2,FALSE)*F720,\"\")","v":""}]
[null,"",null,null,"","",{"$f":"IFERROR(VLOOKUP(E721,'[1]Tarif de base'!D:E,2,FALSE)*F721,\"\")","v":""}]
[null,"",null,null,"","",{"$f":"IFERROR(VLOOKUP(E722,'[1]Tarif de base'!D:E,2,FALSE)*F722,\"\")","v":""}]
[null,{"$f":"B722","v":""},null,null,"","",{"$f":"IFERROR(VLOOKUP(E723,'[1]Tarif de base'!D:E,2,FALSE)*F723,\"\")","v":""}]
[null,"",null,null,"Total",{"$f":"SUM(F718:F723)","v":0},{"$f":"SUM(G718:G723)","v":0}]
["","","","","","",{"$f":"IFERROR(VLOOKUP(E725,'[1]Tarif de base'!D:E,2,FALSE)*F725,\"\")","v":""},"","","",{"$f":"IFERROR(IF(G731-H725-I725-J725<>0,\"Attention il manque \"&G731-H725-I725-J725&\"€\",\"Règlement OK\"),\"Pas de règlement\")","v":"Pas de règlement"},"",null,103]
[null,"",null,null,{"$f":"IFERROR(INDIRECT(\"'C:\\Users\\Moi\\OneDrive\\Documents\\[Formulaires Gravereau.xlsx]Action\"&$N725&\"'!$D$11\"),\"\")","v":""},{"$f":"IFERROR(INDIRECT(\"'C:\\Users\\Moi\\OneDrive\\Documents\\[Formulaires Gravereau.xlsx]Action\"&$N725&\"'!$h$11\"),\"\")","v":""},{"$f":"IFERROR(VLOOKUP(E726,'[1]Tarif de base'!D:E,2,FALSE)*F726,\"\")","v":""}]
[null,"",null,null,"","",{"$f":"IFERROR(VLOOKUP(E727,'[1]Tarif de base'!D:E,2,FALSE)*F727,\"\")","v":""}]
[null,"",null,null,"","",{"$f":"IFERROR(VLOOKUP(E728,'[1]Tarif de base'!D:E,2,FALSE)*F728,\"\")","v":""}]
[null,"",null,null,"","",{"$f":"IFERROR(VLOOKUP(E729,'[1]Tarif de base'!D:E,2,FALSE)*F729,\"\")","v":""}]
[null,"",null,null,"","",{"$f":"IFERROR(VLOOKUP(E730,'[1]Tarif de base'!D:E,2,FALSE)*F730,\"\")","v":""}]
[null,"",null,null,"Total",{"$f":"SUM(F725:F730)","v":0},{"$f":"SUM(G725:G730)","v":0}]
[{"$f":"IFERROR(INDIRECT(\"'C:\\Users\\Moi\\OneDrive\\Documents\\[Formulaires Gravereau.xlsx]Action\"&$N732&\"'!$D$6\"),\"\")","v":""},{"$f":"IF(C732<>\"\",C732,\"\")","v":""},{"$f":"IFERROR(INDIRECT(\"'C:\\Users\\Moi\\OneDrive\\Documents\\[Formulaires Gravereau.xlsx]Action\"&$N732&\"'!$D$4\"),\"\")","v":""},{"$f":"IFERROR(INDIRECT(\"'C:\\Users\\Moi\\OneDrive\\Documents\\[Formulaires Gravereau.xlsx]Action\"&$N732&\"'!$h$4\"),\"\")","v":""},{"$f":"IFERROR(INDIRECT(\"'C:\\Users\\Moi\\OneDrive\\Documents\\[Formulaires Gravereau.xlsx]Action\"&$N732&\"'!$D$9\"),\"\")","v":""},{"$f":"IFERROR(INDIRECT(\"'C:\\Users\\Moi\\OneDrive\\Documents\\[Formulaires Gravereau.xlsx]Action\"&$N732&\"'!$h$9\"),\"\")","v":""},{"$f":"IFERROR(VLOOKUP(E732,'[1]Tarif de base'!D:E,2,FALSE)*F732,\"\")","v":""},{"$f":"IFERROR(INDIRECT(\"'C:\\Users\\Moi\\OneDrive\\Documents\\[Formulaires Gravereau.xlsx]Action\"&$N732&\"'!$d$26\"),\"\")","v":""},{"$f":"IFERROR(INDIRECT(\"'C:\\Users\\Moi\\OneDrive\\Documents\\[Formulaires Gravereau.xlsx]Action\"&$N732&\"'!$d$28\"),\"\")","v":""},{"$f":"IFERROR(INDIRECT(\"'C:\\Users\\Moi\\OneDrive\\Documents\\[Formulaires Gravereau.xlsx]Action\"&$N732&\"'!$h$26\"),\"\")","v":""},{"$f":"IFERROR(IF(G738-H732-I732-J732<>0,\"Attention il manque \"&G738-H732-I732-J732&\"€\",\"Règlement OK\"),\"Pas de règlement\")","v":"Pas de règlement"},{"$f":"IFERROR(INDIRECT(\"'C:\\Users\\Moi\\OneDrive\\Documents\\[Formulaires Gravereau.xlsx]Action\"&$N732&\"'!$d$30\"),\"\")","v":""},null,104]
[null,"",null,null,{"$f":"IFERROR(INDIRECT(\"'C:\\Users\\Moi\\OneDrive\\Documents\\[Formulaires Gravereau.xlsx]Action\"&$N732&\"'!$D$11\"),\"\")","v":""},{"$f":"IFERROR(INDIRECT(\"'C:\\Users\\Moi\\OneDrive\\Documents\\[Formulaires Gravereau.xlsx]Action\"&$N732&\"'!$h$11\"),\"\")","v":""},{"$f":"IFERROR(VLOOKUP(E733,'[1]Tarif de base'!D:E,2,FALSE)*F733,\"\")","v":""}]
[null,"",null,null,{"$f":"IFERROR(INDIRECT(\"'C:\\Users\\Moi\\OneDrive\\Documents\\[Formulaires Gravereau.xlsx]Action\"&$N732&\"'!$D$13\"),\"\")","v":""},{"$f":"IFERROR(INDIRECT(\"'C:\\Users\\Moi\\OneDrive\\Documents\\[Formulaires Gravereau.xlsx]Action\"&$N732&\"'!$h$13\"),\"\")","v":""},{"$f":"IFERROR(VLOOKUP(E734,'[1]Tarif de base'!D:E,2,FALSE)*F734,\"\")","v":""}]
[null,"",null,null,{"$f":"IFERROR(INDIRECT(\"'C:\\Users\\Moi\\OneDrive\\Documents\\[Formulaires Gravereau.xlsx]Action\"&$N732&\"'!$D$15\"),\"\")","v":""},{"$f":"IFERROR(INDIRECT(\"'C:\\Users\\Moi\\OneDrive\\Documents\\[Formulaires Gravereau.xlsx]Action\"&$N732&\"'!$h$15\"),\"\")","v":""},{"$f":"IFERROR(VLOOKUP(E735,'[1]Tarif de base'!D:E,2,FALSE)*F735,\"\")","v":""}]
[null,"",null,null,{"$f":"IFERROR(INDIRECT(\"'C:\\Users\\Moi\\OneDrive\\Documents\\[Formulaires Gravereau.xlsx]Action\"&$N732&\"'!$D$17\"),\"\")","v":""},{"$f":"IFERROR(INDIRECT(\"'C:\\Users\\Moi\\OneDrive\\Documents\\[Formulaires Gravereau.xlsx]Action\"&$N732&\"'!$h$17\"),\"\")","v":""},{"$f":"IFERROR(VLOOKUP(E736,'[1]Tarif de base'!D:E,2,FALSE)*F736,\"\")","v":""}]
[null,"",null,null,{"$f":"IFERROR(INDIRECT(\"'C:\\Users\\Moi\\OneDrive\\Documents\\[Formulaires Gravereau.xlsx]Action\"&$N732&\"'!$D$19\"),\"\")","v":""},{"$f":"IFERROR(INDIRECT(\"'C:\\Users\\Moi\\OneDrive\\Documents\\[Formulaires Gravereau.xlsx]Action\"&$N732&\"'!$h$19\"),\"\")","v":""},{"$f":"IFERROR(VLOOKUP(E737,'[1]Tarif de base'!D:E,2,FALSE)*F737,\"\")","v":""}]
[null,"",null,null,"Total",{"$f":"SUM(F732:F737)","v":0},{"$f":"SUM(G732:G737)","v":0}]
["","","","","","",{"$f":"IFERROR(VLOOKUP(E739,'[1]Tarif de base'!D:E,2,FALSE)*F739,\"\")","v":""},"","","",{"$f":"IFERROR(IF(G745-H739-I739-J739<>0,\"Attention il manque \"&G745-H739-I739-J739&\"€\",\"Règlement OK\"),\"Pas de règlement\")","v":"Pas de règlement"},"",null,105]
[null,"",null,null,{"$f":"IFERROR(INDIRECT(\"'C:\\Users\\Moi\\OneDrive\\Documents\\[Formulaires Gravereau.xlsx]Action\"&$N739&\"'!$D$11\"),\"\")","v":""},{"$f":"IFERROR(INDIRECT(\"'C:\\Users\\Moi\\OneDrive\\Documents\\[Formulaires Gravereau.xlsx]Action\"&$N739&\"'!$h$11\"),\"\")","v":""},{"$f":"IFERROR(VLOOKUP(E740,'[1]Tarif de base'!D:E,2,FALSE)*F740,\"\")","v":""}]
[null,"",null,null,"","",{"$f":"IFERROR(VLOOKUP(E741,'[1]Tarif de base'!D:E,2,FALSE)*F741,\"\")","v":""}]
[null,"",null,null,"","",{"$f":"IFERROR(VLOOKUP(E742,'[1]Tarif de base'!D:E,2,FALSE)*F742,\"\")","v":""}]
[null,"",null,null,"","",{"$f":"IFERROR(VLOOKUP(E743,'[1]Tarif de base'!D:E,2,FALSE)*F743,\"\")","v":""}]
[null,"",null,null,"","",{"$f":"IFERROR(VLOOKUP(E744,'[1]Tarif de base'!D:E,2,FALSE)*F744,\"\")","v":""}]
[null,"",null,null,"Total",{"$f":"SUM(F739:F744)","v":0},{"$f":"SUM(G739:G744)","v":0}]
["","","","","","",{"$f":"IFERROR(VLOOKUP(E746,'[1]Tarif de base'!D:E,2,FALSE)*F746,\"\")","v":""},"","","",{"$f":"IFERROR(IF(G752-H746-I746-J746<>0,\"Attention il manque \"&G752-H746-I746-J746&\"€\",\"Règlement OK\"),\"Pas de règlement\")","v":"Pas de règlement"},"",null,106]
[null,"",null,null,{"$f":"IFERROR(INDIRECT(\"'C:\\Users\\Moi\\OneDrive\\Documents\\[Formulaires Gravereau.xlsx]Action\"&$N746&\"'!$D$11\"),\"\")","v":""},{"$f":"IFERROR(INDIRECT(\"'C:\\Users\\Moi\\OneDrive\\Documents\\[Formulaires Gravereau.xlsx]Action\"&$N746&\"'!$h$11\"),\"\")","v":""},{"$f":"IFERROR(VLOOKUP(E747,'[1]Tarif de base'!D:E,2,FALSE)*F747,\"\")","v":""}]
[null,"",null,null,"","",{"$f":"IFERROR(VLOOKUP(E748,'[1]Tarif de base'!D:E,2,FALSE)*F748,\"\")","v":""}]
[null,"",null,null,"","",{"$f":"IFERROR(VLOOKUP(E749,'[1]Tarif de base'!D:E,2,FALSE)*F749,\"\")","v":""}]
[null,"",null,null,"","",{"$f":"IFERROR(VLOOKUP(E750,'[1]Tarif de base'!D:E,2,FALSE)*F750,\"\")","v":""}]
[null,"",null,null,"","",{"$f":"IFERROR(VLOOKUP(E751,'[1]Tarif de base'!D:E,2,FALSE)*F751,\"\")","v":""}]
[null,"",null,null,"Total",{"$f":"SUM(F746:F751)","v":0},{"$f":"SUM(G746:G751)","v":0}]
["","","","","","",{"$f":"IFERROR(VLOOKUP(E753,'[1]Tarif de base'!D:E,2,FALSE)*F753,\"\")","v":""},"","","",{"$f":"IFERROR(IF(G759-H753-I753-J753<>0,\"Attention il manque \"&G759-H753-I753-J753&\"€\",\"Règlement OK\"),\"Pas de règlement\")","v":"Pas de règlement"},"",null,107]
[null,"",null,null,{"$f":"IFERROR(INDIRECT(\"'C:\\Users\\Moi\\OneDrive\\Documents\\[Formulaires Gravereau.xlsx]Action\"&$N753&\"'!$D$11\"),\"\")","v":""},{"$f":"IFERROR(INDIRECT(\"'C:\\Users\\Moi\\OneDrive\\Documents\\[Formulaires Gravereau.xlsx]Action\"&$N753&\"'!$h$11\"),\"\")","v":""},{"$f":"IFERROR(VLOOKUP(E754,'[1]Tarif de base'!D:E,2,FALSE)*F754,\"\")","v":""}]
[null,"",null,null,"","",{"$f":"IFERROR(VLOOKUP(E755,'[1]Tarif de base'!D:E,2,FALSE)*F755,\"\")","v":""}]
[null,"",null,null,"","",{"$f":"IFERROR(VLOOKUP(E756,'[1]Tarif de base'!D:E,2,FALSE)*F756,\"\")","v":""}]
[null,"",null,null,"","",{"$f":"IFERROR(VLOOKUP(E757,'[1]Tarif de base'!D:E,2,FALSE)*F757,\"\")","v":""}]
[null,"",null,null,"","",{"$f":"IFERROR(VLOOKUP(E758,'[1]Tarif de base'!D:E,2,FALSE)*F758,\"\")","v":""}]
[null,"",null,null,"Total",{"$f":"SUM(F753:F758)","v":0},{"$f":"SUM(G753:G758)","v":0}]
["","","","","","",{"$f":"IFERROR(VLOOKUP(E760,'[1]Tarif de base'!D:E,2,FALSE)*F760,\"\")","v":""},"","","",{"$f":"IFERROR(IF(G766-H760-I760-J760<>0,\"Attention il manque \"&G766-H760-I760-J760&\"€\",\"Règlement OK\"),\"Pas de règlement\")","v":"Pas de règlement"},"",null,108]
[null,"",null,null,{"$f":"IFERROR(INDIRECT(\"'C:\\Users\\Moi\\OneDrive\\Documents\\[Formulaires Gravereau.xlsx]Action\"&$N760&\"'!$D$11\"),\"\")","v":""},{"$f":"IFERROR(INDIRECT(\"'C:\\Users\\Moi\\OneDrive\\Documents\\[Formulaires Gravereau.xlsx]Action\"&$N760&\"'!$h$11\"),\"\")","v":""},{"$f":"IFERROR(VLOOKUP(E761,'[1]Tarif de base'!D:E,2,FALSE)*F761,\"\")","v":""}]
[null,"",null,null,"","",{"$f":"IFERROR(VLOOKUP(E762,'[1]Tarif de base'!D:E,2,FALSE)*F762,\"\")","v":""}]
[null,"",null,null,"","",{"$f":"IFERROR(VLOOKUP(E763,'[1]Tarif de base'!D:E,2,FALSE)*F763,\"\")","v":""}]
[null,"",null,null,"","",{"$f":"IFERROR(VLOOKUP(E764,'[1]Tarif de base'!D:E,2,FALSE)*F764,\"\")","v":""}]
[null,"",null,null,"","",{"$f":"IFERROR(VLOOKUP(E765,'[1]Tarif de base'!D:E,2,FALSE)*F765,\"\")","v":""}]
[null,"",null,null,"Total",{"$f":"SUM(F760:F765)","v":0},{"$f":"SUM(G760:G765)","v":0}]
["","","","","","",{"$f":"IFERROR(VLOOKUP(E767,'[1]Tarif de base'!D:E,2,FALSE)*F767,\"\")","v":""},"","","",{"$f":"IFERROR(IF(G773-H767-I767-J767<>0,\"Attention il manque \"&G773-H767-I767-J767&\"€\",\"Règlement OK\"),\"Pas de règlement\")","v":"Pas de règlement"},"",null,109]
[null,"",null,null,{"$f":"IFERROR(INDIRECT(\"'C:\\Users\\Moi\\OneDrive\\Documents\\[Formulaires Gravereau.xlsx]Action\"&$N767&\"'!$D$11\"),\"\")","v":""},{"$f":"IFERROR(INDIRECT(\"'C:\\Users\\Moi\\OneDrive\\Documents\\[Formulaires Gravereau.xlsx]Action\"&$N767&\"'!$h$11\"),\"\")","v":""},{"$f":"IFERROR(VLOOKUP(E768,'[1]Tarif de base'!D:E,2,FALSE)*F768,\"\")","v":""}]
[null,"",null,null,"","",{"$f":"IFERROR(VLOOKUP(E769,'[1]Tarif de base'!D:E,2,FALSE)*F769,\"\")","v":""}]
[null,"",null,null,"","",{"$f":"IFERROR(VLOOKUP(E770,'[1]Tarif de base'!D:E,2,FALSE)*F770,\"\")","v":""}]
[null,"",null,null,"","",{"$f":"IFERROR(VLOOKUP(E771,'[1]Tarif de base'!D:E,2,FALSE)*F771,\"\")","v":""}]
[null,"",null,null,"","",{"$f":"IFERROR(VLOOKUP(E772,'[1]Tarif de base'!D:E,2,FALSE)*F772,\"\")","v":""}]
[null,"",null,null,"Total",{"$f":"SUM(F767:F772)","v":0},{"$f":"SUM(G767:G772)","v":0}]
["","","","","","",{"$f":"IFERROR(VLOOKUP(E774,'[1]Tarif de base'!D:E,2,FALSE)*F774,\"\")","v":""},"","","",{"$f":"IFERROR(IF(G780-H774-I774-J774<>0,\"Attention il manque \"&G780-H774-I774-J774&\"€\",\"Règlement OK\"),\"Pas de règlement\")","v":"Pas de règlement"},"",null,110]
[null,"",null,null,{"$f":"IFERROR(INDIRECT(\"'C:\\Users\\Moi\\OneDrive\\Documents\\[Formulaires Gravereau.xlsx]Action\"&$N774&\"'!$D$11\"),\"\")","v":""},{"$f":"IFERROR(INDIRECT(\"'C:\\Users\\Moi\\OneDrive\\Documents\\[Formulaires Gravereau.xlsx]Action\"&$N774&\"'!$h$11\"),\"\")","v":""},{"$f":"IFERROR(VLOOKUP(E775,'[1]Tarif de base'!D:E,2,FALSE)*F775,\"\")","v":""}]
[null,"",null,null,"","",{"$f":"IFERROR(VLOOKUP(E776,'[1]Tarif de base'!D:E,2,FALSE)*F776,\"\")","v":""}]
[null,"",null,null,"","",{"$f":"IFERROR(VLOOKUP(E777,'[1]Tarif de base'!D:E,2,FALSE)*F777,\"\")","v":""}]
[null,"",null,null,"","",{"$f":"IFERROR(VLOOKUP(E778,'[1]Tarif de base'!D:E,2,FALSE)*F778,\"\")","v":""}]
[null,"",null,null,"","",{"$f":"IFERROR(VLOOKUP(E779,'[1]Tarif de base'!D:E,2,FALSE)*F779,\"\")","v":""}]
[null,"",null,null,"Total",{"$f":"SUM(F774:F779)","v":0},{"$f":"SUM(G774:G779)","v":0}]
["","","","","","",{"$f":"IFERROR(VLOOKUP(E781,'[1]Tarif de base'!D:E,2,FALSE)*F781,\"\")","v":""},"","","",{"$f":"IFERROR(IF(G787-H781-I781-J781<>0,\"Attention il manque \"&G787-H781-I781-J781&\"€\",\"Règlement OK\"),\"Pas de règlement\")","v":"Pas de règlement"},"",null,111]
[null,"",null,null,{"$f":"IFERROR(INDIRECT(\"'C:\\Users\\Moi\\OneDrive\\Documents\\[Formulaires Gravereau.xlsx]Action\"&$N781&\"'!$D$11\"),\"\")","v":""},{"$f":"IFERROR(INDIRECT(\"'C:\\Users\\Moi\\OneDrive\\Documents\\[Formulaires Gravereau.xlsx]Action\"&$N781&\"'!$h$11\"),\"\")","v":""},{"$f":"IFERROR(VLOOKUP(E782,'[1]Tarif de base'!D:E,2,FALSE)*F782,\"\")","v":""}]
[null,"",null,null,"","",{"$f":"IFERROR(VLOOKUP(E783,'[1]Tarif de base'!D:E,2,FALSE)*F783,\"\")","v":""}]
[null,"",null,null,"","",{"$f":"IFERROR(VLOOKUP(E784,'[1]Tarif de base'!D:E,2,FALSE)*F784,\"\")","v":""}]
[null,"",null,null,"","",{"$f":"IFERROR(VLOOKUP(E785,'[1]Tarif de base'!D:E,2,FALSE)*F785,\"\")","v":""}]
[null,"",null,null,"","",{"$f":"IFERROR(VLOOKUP(E786,'[1]Tarif de base'!D:E,2,FALSE)*F786,\"\")","v":""}]
[null,{"$f":"B786","v":""},null,null,"Total",{"$f":"SUM(F781:F786)","v":0},{"$f":"SUM(G781:G786)","v":0}]
["","","","","","",{"$f":"IFERROR(VLOOKUP(E788,'[1]Tarif de base'!D:E,2,FALSE)*F788,\"\")","v":""},"","","",{"$f":"IFERROR(IF(G794-H788-I788-J788<>0,\"Attention il manque \"&G794-H788-I788-J788&\"€\",\"Règlement OK\"),\"Pas de règlement\")","v":"Pas de règlement"},"",null,112]
[null,"",null,null,{"$f":"IFERROR(INDIRECT(\"'C:\\Users\\Moi\\OneDrive\\Documents\\[Formulaires Gravereau.xlsx]Action\"&$N788&\"'!$D$11\"),\"\")","v":""},{"$f":"IFERROR(INDIRECT(\"'C:\\Users\\Moi\\OneDrive\\Documents\\[Formulaires Gravereau.xlsx]Action\"&$N788&\"'!$h$11\"),\"\")","v":""},{"$f":"IFERROR(VLOOKUP(E789,'[1]Tarif de base'!D:E,2,FALSE)*F789,\"\")","v":""}]
[null,"",null,null,"","",{"$f":"IFERROR(VLOOKUP(E790,'[1]Tarif de base'!D:E,2,FALSE)*F790,\"\")","v":""}]
[null,"",null,null,"","",{"$f":"IFERROR(VLOOKUP(E791,'[1]Tarif de base'!D:E,2,FALSE)*F791,\"\")","v":""}]
[null,"",null,null,"","",{"$f":"IFERROR(VLOOKUP(E792,'[1]Tarif de base'!D:E,2,FALSE)*F792,\"\")","v":""}]
[null,"",null,null,"","",{"$f":"IFERROR(VLOOKUP(E793,'[1]Tarif de base'!D:E,2,FALSE)*F793,\"\")","v":""}]
[null,"",null,null,"Total",{"$f":"SUM(F788:F793)","v":0},{"$f":"SUM(G788:G793)","v":0}]
["","","","","","",{"$f":"IFERROR(VLOOKUP(E795,'[1]Tarif de base'!D:E,2,FALSE)*F795,\"\")","v":""},"","","",{"$f":"IFERROR(IF(G801-H795-I795-J795<>0,\"Attention il manque \"&G801-H795-I795-J795&\"€\",\"Règlement OK\"),\"Pas de règlement\")","v":"Pas de règlement"},"",null,113]
[null,"",null,null,{"$f":"IFERROR(INDIRECT(\"'C:\\Users\\Moi\\OneDrive\\Documents\\[Formulaires Gravereau.xlsx]Action\"&$N795&\"'!$D$11\"),\"\")","v":""},{"$f":"IFERROR(INDIRECT(\"'C:\\Users\\Moi\\OneDrive\\Documents\\[Formulaires Gravereau.xlsx]Action\"&$N795&\"'!$h$11\"),\"\")","v":""},{"$f":"IFERROR(VLOOKUP(E796,'[1]Tarif de base'!D:E,2,FALSE)*F796,\"\")","v":""}]
[null,"",null,null,"","",{"$f":"IFERROR(VLOOKUP(E797,'[1]Tarif de base'!D:E,2,FALSE)*F797,\"\")","v":""}]
[null,"",null,null,"","",{"$f":"IFERROR(VLOOKUP(E798,'[1]Tarif de base'!D:E,2,FALSE)*F798,\"\")","v":""}]
[null,"",null,null,"","",{"$f":"IFERROR(VLOOKUP(E799,'[1]Tarif de base'!D:E,2,FALSE)*F799,\"\")","v":""}]
[null,"",null,null,"","",{"$f":"IFERROR(VLOOKUP(E800,'[1]Tarif de base'!D:E,2,FALSE)*F800,\"\")","v":""}]
[null,"",null,null,"Total",{"$f":"SUM(F795:F800)","v":0},{"$f":"SUM(G795:G800)","v":0}]
[{"$f":"IFERROR(INDIRECT(\"'C:\\Users\\Moi\\OneDrive\\Documents\\[Formulaires Gravereau.xlsx]Action\"&$N802&\"'!$D$6\"),\"\")","v":""},{"$f":"IF(C802<>\"\",C802,\"\")","v":""},{"$f":"IFERROR(INDIRECT(\"'C:\\Users\\Moi\\OneDrive\\Documents\\[Formulaires Gravereau.xlsx]Action\"&$N802&\"'!$D$4\"),\"\")","v":""},{"$f":"IFERROR(INDIRECT(\"'C:\\Users\\Moi\\OneDrive\\Documents\\[Formulaires Gravereau.xlsx]Action\"&$N802&\"'!$h$4\"),\"\")","v":""},{"$f":"IFERROR(INDIRECT(\"'C:\\Users\\Moi\\OneDrive\\Documents\\[Formulaires Gravereau.xlsx]Action\"&$N802&\"'!$D$9\"),\"\")","v":""},{"$f":"IFERROR(INDIRECT(\"'C:\\Users\\Moi\\OneDrive\\Documents\\[Formulaires Gravereau.xlsx]Action\"&$N802&\"'!$h$9\"),\"\")","v":""},{"$f":"IFERROR(VLOOKUP(E802,'[1]Tarif de base'!D:E,2,FALSE)*F802,\"\")","v":""},{"$f":"IFERROR(INDIRECT(\"'C:\\Users\\Moi\\OneDrive\\Documents\\[Formulaires Gravereau.xlsx]Action\"&$N802&\"'!$d$26\"),\"\")","v":""},{"$f":"IFERROR(INDIRECT(\"'C:\\Users\\Moi\\OneDrive\\Documents\\[Formulaires Gravereau.xlsx]Action\"&$N802&\"'!$d$28\"),\"\")","v":""},{"$f":"IFERROR(INDIRECT(\"'C:\\Users\\Moi\\OneDrive\\Documents\\[Formulaires Gravereau.xlsx]Action\"&$N802&\"'!$h$26\"),\"\")","v":""},{"$f":"IFERROR(IF(G808-H802-I802-J802<>0,\"Attention il manque \"&G808-H802-I802-J802&\"€\",\"Règlement OK\"),\"Pas de règlement\")","v":"Pas de règlement"},{"$f":"IFERROR(INDIRECT(\"'C:\\Users\\Moi\\OneDrive\\Documents\\[Formulaires Gravereau.xlsx]Action\"&$N802&\"'!$d$30\"),\"\")","v":""},null,114]
[null,"",null,null,{"$f":"IFERROR(INDIRECT(\"'C:\\Users\\Moi\\OneDrive\\Documents\\[Formulaires Gravereau.xlsx]Action\"&$N802&\"'!$D$11\"),\"\")","v":""},{"$f":"IFERROR(INDIRECT(\"'C:\\Users\\Moi\\OneDrive\\Documents\\[Formulaires Gravereau.xlsx]Action\"&$N802&\"'!$h$11\"),\"\")","v":""},{"$f":"IFERROR(VLOOKUP(E803,'[1]Tarif de base'!D:E,2,FALSE)*F803,\"\")","v":""}]
[null,"",null,null,{"$f":"IFERROR(INDIRECT(\"'C:\\Users\\Moi\\OneDrive\\Documents\\[Formulaires Gravereau.xlsx]Action\"&$N802&\"'!$D$13\"),\"\")","v":""},{"$f":"IFERROR(INDIRECT(\"'C:\\Users\\Moi\\OneDrive\\Documents\\[Formulaires Gravereau.xlsx]Action\"&$N802&\"'!$h$13\"),\"\")","v":""},{"$f":"IFERROR(VLOOKUP(E804,'[1]Tarif de base'!D:E,2,FALSE)*F804,\"\")","v":""}]
[null,"",null,null,{"$f":"IFERROR(INDIRECT(\"'C:\\Users\\Moi\\OneDrive\\Documents\\[Formulaires Gravereau.xlsx]Action\"&$N802&\"'!$D$15\"),\"\")","v":""},{"$f":"IFERROR(INDIRECT(\"'C:\\Users\\Moi\\OneDrive\\Documents\\[Formulaires Gravereau.xlsx]Action\"&$N802&\"'!$h$15\"),\"\")","v":""},{"$f":"IFERROR(VLOOKUP(E805,'[1]Tarif de base'!D:E,2,FALSE)*F805,\"\")","v":""}]
[null,"",null,null,{"$f":"IFERROR(INDIRECT(\"'C:\\Users\\Moi\\OneDrive\\Documents\\[Formulaires Gravereau.xlsx]Action\"&$N802&\"'!$D$17\"),\"\")","v":""},{"$f":"IFERROR(INDIRECT(\"'C:\\Users\\Moi\\OneDrive\\Documents\\[Formulaires Gravereau.xlsx]Action\"&$N802&\"'!$h$17\"),\"\")","v":""},{"$f":"IFERROR(VLOOKUP(E806,'[1]Tarif de base'!D:E,2,FALSE)*F806,\"\")","v":""}]
[null,"",null,null,{"$f":"IFERROR(INDIRECT(\"'C:\\Users\\Moi\\OneDrive\\Documents\\[Formulaires Gravereau.xlsx]Action\"&$N802&\"'!$D$19\"),\"\")","v":""},{"$f":"IFERROR(INDIRECT(\"'C:\\Users\\Moi\\OneDrive\\Documents\\[Formulaires Gravereau.xlsx]Action\"&$N802&\"'!$h$19\"),\"\")","v":""},{"$f":"IFERROR(VLOOKUP(E807,'[1]Tarif de base'!D:E,2,FALSE)*F807,\"\")","v":""}]
[null,"",null,null,"Total",{"$f":"SUM(F802:F807)","v":0},{"$f":"SUM(G802:G807)","v":0}]
["","","","","","",{"$f":"IFERROR(VLOOKUP(E809,'[1]Tarif de base'!D:E,2,FALSE)*F809,\"\")","v":""},"","","",{"$f":"IFERROR(IF(G815-H809-I809-J809<>0,\"Attention il manque \"&G815-H809-I809-J809&\"€\",\"Règlement OK\"),\"Pas de règlement\")","v":"Pas de règlement"},"",null,115]
[null,"",null,null,{"$f":"IFERROR(INDIRECT(\"'C:\\Users\\Moi\\OneDrive\\Documents\\[Formulaires Gravereau.xlsx]Action\"&$N809&\"'!$D$11\"),\"\")","v":""},{"$f":"IFERROR(INDIRECT(\"'C:\\Users\\Moi\\OneDrive\\Documents\\[Formulaires Gravereau.xlsx]Action\"&$N809&\"'!$h$11\"),\"\")","v":""},{"$f":"IFERROR(VLOOKUP(E810,'[1]Tarif de base'!D:E,2,FALSE)*F810,\"\")","v":""}]
[null,"",null,null,"","",{"$f":"IFERROR(VLOOKUP(E811,'[1]Tarif de base'!D:E,2,FALSE)*F811,\"\")","v":""}]
[null,"",null,null,"","",{"$f":"IFERROR(VLOOKUP(E812,'[1]Tarif de base'!D:E,2,FALSE)*F812,\"\")","v":""}]
[null,"",null,null,"","",{"$f":"IFERROR(VLOOKUP(E813,'[1]Tarif de base'!D:E,2,FALSE)*F813,\"\")","v":""}]
[null,"",null,null,"","",{"$f":"IFERROR(VLOOKUP(E814,'[1]Tarif de base'!D:E,2,FALSE)*F814,\"\")","v":""}]
[null,"",null,null,"Total",{"$f":"SUM(F809:F814)","v":0},{"$f":"SUM(G809:G814)","v":0}]
["","","","","","",{"$f":"IFERROR(VLOOKUP(E816,'[1]Tarif de base'!D:E,2,FALSE)*F816,\"\")","v":""},"","","",{"$f":"IFERROR(IF(G822-H816-I816-J816<>0,\"Attention il manque \"&G822-H816-I816-J816&\"€\",\"Règlement OK\"),\"Pas de règlement\")","v":"Pas de règlement"},"",null,116]
[null,"",null,null,{"$f":"IFERROR(INDIRECT(\"'C:\\Users\\Moi\\OneDrive\\Documents\\[Formulaires Gravereau.xlsx]Action\"&$N816&\"'!$D$11\"),\"\")","v":""},{"$f":"IFERROR(INDIRECT(\"'C:\\Users\\Moi\\OneDrive\\Documents\\[Formulaires Gravereau.xlsx]Action\"&$N816&\"'!$h$11\"),\"\")","v":""},{"$f":"IFERROR(VLOOKUP(E817,'[1]Tarif de base'!D:E,2,FALSE)*F817,\"\")","v":""}]
[null,"",null,null,"","",{"$f":"IFERROR(VLOOKUP(E818,'[1]Tarif de base'!D:E,2,FALSE)*F818,\"\")","v":""}]
[null,"",null,null,"","",{"$f":"IFERROR(VLOOKUP(E819,'[1]Tarif de base'!D:E,2,FALSE)*F819,\"\")","v":""}]
[null,"",null,null,"","",{"$f":"IFERROR(VLOOKUP(E820,'[1]Tarif de base'!D:E,2,FALSE)*F820,\"\")","v":""}]
[null,"",null,null,"","",{"$f":"IFERROR(VLOOKUP(E821,'[1]Tarif de base'!D:E,2,FALSE)*F821,\"\")","v":""}]
[null,"",null,null,"Total",{"$f":"SUM(F816:F821)","v":0},{"$f":"SUM(G816:G821)","v":0}]
["","","","","","",{"$f":"IFERROR(VLOOKUP(E823,'[1]Tarif de base'!D:E,2,FALSE)*F823,\"\")","v":""},"","","",{"$f":"IFERROR(IF(G829-H823-I823-J823<>0,\"Attention il manque \"&G829-H823-I823-J823&\"€\",\"Règlement OK\"),\"Pas de règlement\")","v":"Pas de règlement"},"",null,117]
[null,"",null,null,{"$f":"IFERROR(INDIRECT(\"'C:\\Users\\Moi\\OneDrive\\Documents\\[Formulaires Gravereau.xlsx]Action\"&$N823&\"'!$D$11\"),\"\")","v":""},{"$f":"IFERROR(INDIRECT(\"'C:\\Users\\Moi\\OneDrive\\Documents\\[Formulaires Gravereau.xlsx]Action\"&$N823&\"'!$h$11\"),\"\")","v":""},{"$f":"IFERROR(VLOOKUP(E824,'[1]Tarif de base'!D:E,2,FALSE)*F824,\"\")","v":""}]
[null,"",null,null,"","",{"$f":"IFERROR(VLOOKUP(E825,'[1]Tarif de base'!D:E,2,FALSE)*F825,\"\")","v":""}]
[null,"",null,null,"","",{"$f":"IFERROR(VLOOKUP(E826,'[1]Tarif de base'!D:E,2,FALSE)*F826,\"\")","v":""}]
[null,"",null,null,"","",{"$f":"IFERROR(VLOOKUP(E827,'[1]Tarif de base'!D:E,2,FALSE)*F827,\"\")","v":""}]
[null,"",null,null,"","",{"$f":"IFERROR(VLOOKUP(E828,'[1]Tarif de base'!D:E,2,FALSE)*F828,\"\")","v":""}]
[null,"",null,null,"Total",{"$f":"SUM(F823:F828)","v":0},{"$f":"SUM(G823:G828)","v":0}]
["","","","","","",{"$f":"IFERROR(VLOOKUP(E830,'[1]Tarif de base'!D:E,2,FALSE)*F830,\"\")","v":""},"","","",{"$f":"IFERROR(IF(G836-H830-I830-J830<>0,\"Attention il manque \"&G836-H830-I830-J830&\"€\",\"Règlement OK\"),\"Pas de règlement\")","v":"Pas de règlement"},"",null,118]
[null,"",null,null,{"$f":"IFERROR(INDIRECT(\"'C:\\Users\\Moi\\OneDrive\\Documents\\[Formulaires Gravereau.xlsx]Action\"&$N830&\"'!$D$11\"),\"\")","v":""},{"$f":"IFERROR(INDIRECT(\"'C:\\Users\\Moi\\OneDrive\\Documents\\[Formulaires Gravereau.xlsx]Action\"&$N830&\"'!$h$11\"),\"\")","v":""},{"$f":"IFERROR(VLOOKUP(E831,'[1]Tarif de base'!D:E,2,FALSE)*F831,\"\")","v":""}]
[null,"",null,null,"","",{"$f":"IFERROR(VLOOKUP(E832,'[1]Tarif de base'!D:E,2,FALSE)*F832,\"\")","v":""}]
[null,"",null,null,"","",{"$f":"IFERROR(VLOOKUP(E833,'[1]Tarif de base'!D:E,2,FALSE)*F833,\"\")","v":""}]
[null,"",null,null,"","",{"$f":"IFERROR(VLOOKUP(E834,'[1]Tarif de base'!D:E,2,FALSE)*F834,\"\")","v":""}]
[null,"",null,null,"","",{"$f":"IFERROR(VLOOKUP(E835,'[1]Tarif de base'!D:E,2,FALSE)*F835,\"\")","v":""}]
[null,"",null,null,"Total",{"$f":"SUM(F830:F835)","v":0},{"$f":"SUM(G830:G835)","v":0}]
["","","","","","",{"$f":"IFERROR(VLOOKUP(E837,'[1]Tarif de base'!D:E,2,FALSE)*F837,\"\")","v":""},"","","",{"$f":"IFERROR(IF(G843-H837-I837-J837<>0,\"Attention il manque \"&G843-H837-I837-J837&\"€\",\"Règlement OK\"),\"Pas de règlement\")","v":"Pas de règlement"},"",null,119]
[null,"",null,null,{"$f":"IFERROR(INDIRECT(\"'C:\\Users\\Moi\\OneDrive\\Documents\\[Formulaires Gravereau.xlsx]Action\"&$N837&\"'!$D$11\"),\"\")","v":""},{"$f":"IFERROR(INDIRECT(\"'C:\\Users\\Moi\\OneDrive\\Documents\\[Formulaires Gravereau.xlsx]Action\"&$N837&\"'!$h$11\"),\"\")","v":""},{"$f":"IFERROR(VLOOKUP(E838,'[1]Tarif de base'!D:E,2,FALSE)*F838,\"\")","v":""}]
[null,"",null,null,"","",{"$f":"IFERROR(VLOOKUP(E839,'[1]Tarif de base'!D:E,2,FALSE)*F839,\"\")","v":""}]
[null,"",null,null,"","",{"$f":"IFERROR(VLOOKUP(E840,'[1]Tarif de base'!D:E,2,FALSE)*F840,\"\")","v":""}]
[null,"",null,null,"","",{"$f":"IFERROR(VLOOKUP(E841,'[1]Tarif de base'!D:E,2,FALSE)*F841,\"\")","v":""}]
[null,"",null,null,"","",{"$f":"IFERROR(VLOOKUP(E842,'[1]Tarif de base'!D:E,2,FALSE)*F842,\"\")","v":""}]
[null,"",null,null,"Total",{"$f":"SUM(F837:F842)","v":0},{"$f":"SUM(G837:G842)","v":0}]
["","","","","","",{"$f":"IFERROR(VLOOKUP(E844,'[1]Tarif de base'!D:E,2,FALSE)*F844,\"\")","v":""},"","","",{"$f":"IFERROR(IF(G850-H844-I844-J844<>0,\"Attention il manque \"&G850-H844-I844-J844&\"€\",\"Règlement OK\"),\"Pas de règlement\")","v":"Pas de règlement"},"",null,120]
[null,"",null,null,{"$f":"IFERROR(INDIRECT(\"'C:\\Users\\Moi\\OneDrive\\Documents\\[Formulaires Gravereau.xlsx]Action\"&$N844&\"'!$D$11\"),\"\")","v":""},{"$f":"IFERROR(INDIRECT(\"'C:\\Users\\Moi\\OneDrive\\Documents\\[Formulaires Gravereau.xlsx]Action\"&$N844&\"'!$h$11\"),\"\")","v":""},{"$f":"IFERROR(VLOOKUP(E845,'[1]Tarif de base'!D:E,2,FALSE)*F845,\"\")","v":""}]
[null,"",null,null,"","",{"$f":"IFERROR(VLOOKUP(E846,'[1]Tarif de base'!D:E,2,FALSE)*F846,\"\")","v":""}]
[null,"",null,null,"","",{"$f":"IFERROR(VLOOKUP(E847,'[1]Tarif de base'!D:E,2,FALSE)*F847,\"\")","v":""}]
[null,"",null,null,"","",{"$f":"IFERROR(VLOOKUP(E848,'[1]Tarif de base'!D:E,2,FALSE)*F848,\"\")","v":""}]
[null,"",null,null,"","",{"$f":"IFERROR(VLOOKUP(E849,'[1]Tarif de base'!D:E,2,FALSE)*F849,\"\")","v":""}]
[null,"",null,null,"Total",{"$f":"SUM(F844:F849)","v":0},{"$f":"SUM(G844:G849)","v":0}]
["","","","","","",{"$f":"IFERROR(VLOOKUP(E851,'[1]Tarif de base'!D:E,2,FALSE)*F851,\"\")","v":""},"","","",{"$f":"IFERROR(IF(G857-H851-I851-J851<>0,\"Attention il manque \"&G857-H851-I851-J851&\"€\",\"Règlement OK\"),\"Pas de règlement\")","v":"Pas de règlement"},"",null,121]
[null,{"$f":"B851","v":""},null,null,{"$f":"IFERROR(INDIRECT(\"'C:\\Users\\Moi\\OneDrive\\Documents\\[Formulaires Gravereau.xlsx]Action\"&$N851&\"'!$D$11\"),\"\")","v":""},{"$f":"IFERROR(INDIRECT(\"'C:\\Users\\Moi\\OneDrive\\Documents\\[Formulaires Gravereau.xlsx]Action\"&$N851&\"'!$h$11\"),\"\")","v":""},{"$f":"IFERROR(VLOOKUP(E852,'[1]Tarif de base'!D:E,2,FALSE)*F852,\"\")","v":""}]
[null,"",null,null,"","",{"$f":"IFERROR(VLOOKUP(E853,'[1]Tarif de base'!D:E,2,FALSE)*F853,\"\")","v":""}]
[null,"",null,null,"","",{"$f":"IFERROR(VLOOKUP(E854,'[1]Tarif de base'!D:E,2,FALSE)*F854,\"\")","v":""}]
[null,"",null,null,"","",{"$f":"IFERROR(VLOOKUP(E855,'[1]Tarif de base'!D:E,2,FALSE)*F855,\"\")","v":""}]
[null,"",null,null,"","",{"$f":"IFERROR(VLOOKUP(E856,'[1]Tarif de base'!D:E,2,FALSE)*F856,\"\")","v":""}]
[null,"",null,null,"Total",{"$f":"SUM(F851:F856)","v":0},{"$f":"SUM(G851:G856)","v":0}]
["","","","","","",{"$f":"IFERROR(VLOOKUP(E858,'[1]Tarif de base'!D:E,2,FALSE)*F858,\"\")","v":""},"","","",{"$f":"IFERROR(IF(G864-H858-I858-J858<>0,\"Attention il manque \"&G864-H858-I858-J858&\"€\",\"Règlement OK\"),\"Pas de règlement\")","v":"Pas de règlement"},"",null,122]
[null,"",null,null,{"$f":"IFERROR(INDIRECT(\"'C:\\Users\\Moi\\OneDrive\\Documents\\[Formulaires Gravereau.xlsx]Action\"&$N858&\"'!$D$11\"),\"\")","v":""},{"$f":"IFERROR(INDIRECT(\"'C:\\Users\\Moi\\OneDrive\\Documents\\[Formulaires Gravereau.xlsx]Action\"&$N858&\"'!$h$11\"),\"\")","v":""},{"$f":"IFERROR(VLOOKUP(E859,'[1]Tarif de base'!D:E,2,FALSE)*F859,\"\")","v":""}]
[null,"",null,null,"","",{"$f":"IFERROR(VLOOKUP(E860,'[1]Tarif de base'!D:E,2,FALSE)*F860,\"\")","v":""}]
[null,"",null,null,"","",{"$f":"IFERROR(VLOOKUP(E861,'[1]Tarif de base'!D:E,2,FALSE)*F861,\"\")","v":""}]
[null,"",null,null,"","",{"$f":"IFERROR(VLOOKUP(E862,'[1]Tarif de base'!D:E,2,FALSE)*F862,\"\")","v":""}]
[null,"",null,null,"","",{"$f":"IFERROR(VLOOKUP(E863,'[1]Tarif de base'!D:E,2,FALSE)*F863,\"\")","v":""}]
[null,"",null,null,"Total",{"$f":"SUM(F858:F863)","v":0},{"$f":"SUM(G858:G863)","v":0}]
["","","","","","",{"$f":"IFERROR(VLOOKUP(E865,'[1]Tarif de base'!D:E,2,FALSE)*F865,\"\")","v":""},"","","",{"$f":"IFERROR(IF(G871-H865-I865-J865<>0,\"Attention il manque \"&G871-H865-I865-J865&\"€\",\"Règlement OK\"),\"Pas de règlement\")","v":"Pas de règlement"},"",null,123]
[null,"",null,null,{"$f":"IFERROR(INDIRECT(\"'C:\\Users\\Moi\\OneDrive\\Documents\\[Formulaires Gravereau.xlsx]Action\"&$N865&\"'!$D$11\"),\"\")","v":""},{"$f":"IFERROR(INDIRECT(\"'C:\\Users\\Moi\\OneDrive\\Documents\\[Formulaires Gravereau.xlsx]Action\"&$N865&\"'!$h$11\"),\"\")","v":""},{"$f":"IFERROR(VLOOKUP(E866,'[1]Tarif de base'!D:E,2,FALSE)*F866,\"\")","v":""}]
[null,"",null,null,"","",{"$f":"IFERROR(VLOOKUP(E867,'[1]Tarif de base'!D:E,2,FALSE)*F867,\"\")","v":""}]
[null,"",null,null,"","",{"$f":"IFERROR(VLOOKUP(E868,'[1]Tarif de base'!D:E,2,FALSE)*F868,\"\")","v":""}]
[null,"",null,null,"","",{"$f":"IFERROR(VLOOKUP(E869,'[1]Tarif de base'!D:E,2,FALSE)*F869,\"\")","v":""}]
[null,"",null,null,"","",{"$f":"IFERROR(VLOOKUP(E870,'[1]Tarif de base'!D:E,2,FALSE)*F870,\"\")","v":""}]
[null,"",null,null,"Total",{"$f":"SUM(F865:F870)","v":0},{"$f":"SUM(G865:G870)","v":0}]
[{"$f":"IFERROR(INDIRECT(\"'C:\\Users\\Moi\\OneDrive\\Documents\\[Formulaires Gravereau.xlsx]Action\"&$N872&\"'!$D$6\"),\"\")","v":""},{"$f":"IF(C872<>\"\",C872,\"\")","v":""},{"$f":"IFERROR(INDIRECT(\"'C:\\Users\\Moi\\OneDrive\\Documents\\[Formulaires Gravereau.xlsx]Action\"&$N872&\"'!$D$4\"),\"\")","v":""},{"$f":"IFERROR(INDIRECT(\"'C:\\Users\\Moi\\OneDrive\\Documents\\[Formulaires Gravereau.xlsx]Action\"&$N872&\"'!$h$4\"),\"\")","v":""},{"$f":"IFERROR(INDIRECT(\"'C:\\Users\\Moi\\OneDrive\\Documents\\[Formulaires Gravereau.xlsx]Action\"&$N872&\"'!$D$9\"),\"\")","v":""},{"$f":"IFERROR(INDIRECT(\"'C:\\Users\\Moi\\OneDrive\\Documents\\[Formulaires Gravereau.xlsx]Action\"&$N872&\"'!$h$9\"),\"\")","v":""},{"$f":"IFERROR(VLOOKUP(E872,'[1]Tarif de base'!D:E,2,FALSE)*F872,\"\")","v":""},{"$f":"IFERROR(INDIRECT(\"'C:\\Users\\Moi\\OneDrive\\Documents\\[Formulaires Gravereau.xlsx]Action\"&$N872&\"'!$d$26\"),\"\")","v":""},{"$f":"IFERROR(INDIRECT(\"'C:\\Users\\Moi\\OneDrive\\Documents\\[Formulaires Gravereau.xlsx]Action\"&$N872&\"'!$d$28\"),\"\")","v":""},{"$f":"IFERROR(INDIRECT(\"'C:\\Users\\Moi\\OneDrive\\Documents\\[Formulaires Gravereau.xlsx]Action\"&$N872&\"'!$h$26\"),\"\")","v":""},{"$f":"IFERROR(IF(G878-H872-I872-J872<>0,\"Attention il manque \"&G878-H872-I872-J872&\"€\",\"Règlement OK\"),\"Pas de règlement\")","v":"Pas de règlement"},{"$f":"IFERROR(INDIRECT(\"'C:\\Users\\Moi\\OneDrive\\Documents\\[Formulaires Gravereau.xlsx]Action\"&$N872&\"'!$d$30\"),\"\")","v":""},null,124]
[null,"",null,null,{"$f":"IFERROR(INDIRECT(\"'C:\\Users\\Moi\\OneDrive\\Documents\\[Formulaires Gravereau.xlsx]Action\"&$N872&\"'!$D$11\"),\"\")","v":""},{"$f":"IFERROR(INDIRECT(\"'C:\\Users\\Moi\\OneDrive\\Documents\\[Formulaires Gravereau.xlsx]Action\"&$N872&\"'!$h$11\"),\"\")","v":""},{"$f":"IFERROR(VLOOKUP(E873,'[1]Tarif de base'!D:E,2,FALSE)*F873,\"\")","v":""}]
[null,"",null,null,{"$f":"IFERROR(INDIRECT(\"'C:\\Users\\Moi\\OneDrive\\Documents\\[Formulaires Gravereau.xlsx]Action\"&$N872&\"'!$D$13\"),\"\")","v":""},{"$f":"IFERROR(INDIRECT(\"'C:\\Users\\Moi\\OneDrive\\Documents\\[Formulaires Gravereau.xlsx]Action\"&$N872&\"'!$h$13\"),\"\")","v":""},{"$f":"IFERROR(VLOOKUP(E874,'[1]Tarif de base'!D:E,2,FALSE)*F874,\"\")","v":""}]
[null,"",null,null,{"$f":"IFERROR(INDIRECT(\"'C:\\Users\\Moi\\OneDrive\\Documents\\[Formulaires Gravereau.xlsx]Action\"&$N872&\"'!$D$15\"),\"\")","v":""},{"$f":"IFERROR(INDIRECT(\"'C:\\Users\\Moi\\OneDrive\\Documents\\[Formulaires Gravereau.xlsx]Action\"&$N872&\"'!$h$15\"),\"\")","v":""},{"$f":"IFERROR(VLOOKUP(E875,'[1]Tarif de base'!D:E,2,FALSE)*F875,\"\")","v":""}]
[null,"",null,null,{"$f":"IFERROR(INDIRECT(\"'C:\\Users\\Moi\\OneDrive\\Documents\\[Formulaires Gravereau.xlsx]Action\"&$N872&\"'!$D$17\"),\"\")","v":""},{"$f":"IFERROR(INDIRECT(\"'C:\\Users\\Moi\\OneDrive\\Documents\\[Formulaires Gravereau.xlsx]Action\"&$N872&\"'!$h$17\"),\"\")","v":""},{"$f":"IFERROR(VLOOKUP(E876,'[1]Tarif de base'!D:E,2,FALSE)*F876,\"\")","v":""}]
[null,"",null,null,{"$f":"IFERROR(INDIRECT(\"'C:\\Users\\Moi\\OneDrive\\Documents\\[Formulaires Gravereau.xlsx]Action\"&$N872&\"'!$D$19\"),\"\")","v":""},{"$f":"IFERROR(INDIRECT(\"'C:\\Users\\Moi\\OneDrive\\Documents\\[Formulaires Gravereau.xlsx]Action\"&$N872&\"'!$h$19\"),\"\")","v":""},{"$f":"IFERROR(VLOOKUP(E877,'[1]Tarif de base'!D:E,2,FALSE)*F877,\"\")","v":""}]
[null,"",null,null,"Total",{"$f":"SUM(F872:F877)","v":0},{"$f":"SUM(G872:G877)","v":0}]
["","","","","","",{"$f":"IFERROR(VLOOKUP(E879,'[1]Tarif de base'!D:E,2,FALSE)*F879,\"\")","v":""},"","","",{"$f":"IFERROR(IF(G885-H879-I879-J879<>0,\"Attention il manque \"&G885-H879-I879-J879&\"€\",\"Règlement OK\"),\"Pas de règlement\")","v":"Pas de règlement"},"",null,125]
[null,"",null,null,{"$f":"IFERROR(INDIRECT(\"'C:\\Users\\Moi\\OneDrive\\Documents\\[Formulaires Gravereau.xlsx]Action\"&$N879&\"'!$D$11\"),\"\")","v":""},{"$f":"IFERROR(INDIRECT(\"'C:\\Users\\Moi\\OneDrive\\Documents\\[Formulaires Gravereau.xlsx]Action\"&$N879&\"'!$h$11\"),\"\")","v":""},{"$f":"IFERROR(VLOOKUP(E880,'[1]Tarif de base'!D:E,2,FALSE)*F880,\"\")","v":""}]
[null,"",null,null,"","",{"$f":"IFERROR(VLOOKUP(E881,'[1]Tarif de base'!D:E,2,FALSE)*F881,\"\")","v":""}]
[null,"",null,null,"","",{"$f":"IFERROR(VLOOKUP(E882,'[1]Tarif de base'!D:E,2,FALSE)*F882,\"\")","v":""}]
[null,"",null,null,"","",{"$f":"IFERROR(VLOOKUP(E883,'[1]Tarif de base'!D:E,2,FALSE)*F883,\"\")","v":""}]
[null,"",null,null,"","",{"$f":"IFERROR(VLOOKUP(E884,'[1]Tarif de base'!D:E,2,FALSE)*F884,\"\")","v":""}]
[null,"",null,null,"Total",{"$f":"SUM(F879:F884)","v":0},{"$f":"SUM(G879:G884)","v":0}]
["","","","","","",{"$f":"IFERROR(VLOOKUP(E886,'[1]Tarif de base'!D:E,2,FALSE)*F886,\"\")","v":""},"","","",{"$f":"IFERROR(IF(G892-H886-I886-J886<>0,\"Attention il manque \"&G892-H886-I886-J886&\"€\",\"Règlement OK\"),\"Pas de règlement\")","v":"Pas de règlement"},"",null,126]
[null,"",null,null,{"$f":"IFERROR(INDIRECT(\"'C:\\Users\\Moi\\OneDrive\\Documents\\[Formulaires Gravereau.xlsx]Action\"&$N886&\"'!$D$11\"),\"\")","v":""},{"$f":"IFERROR(INDIRECT(\"'C:\\Users\\Moi\\OneDrive\\Documents\\[Formulaires Gravereau.xlsx]Action\"&$N886&\"'!$h$11\"),\"\")","v":""},{"$f":"IFERROR(VLOOKUP(E887,'[1]Tarif de base'!D:E,2,FALSE)*F887,\"\")","v":""}]
[null,"",null,null,"","",{"$f":"IFERROR(VLOOKUP(E888,'[1]Tarif de base'!D:E,2,FALSE)*F888,\"\")","v":""}]
[null,"",null,null,"","",{"$f":"IFERROR(VLOOKUP(E889,'[1]Tarif de base'!D:E,2,FALSE)*F889,\"\")","v":""}]
[null,"",null,null,"","",{"$f":"IFERROR(VLOOKUP(E890,'[1]Tarif de base'!D:E,2,FALSE)*F890,\"\")","v":""}]
[null,"",null,null,"","",{"$f":"IFERROR(VLOOKUP(E891,'[1]Tarif de base'!D:E,2,FALSE)*F891,\"\")","v":""}]
[null,"",null,null,"Total",{"$f":"SUM(F886:F891)","v":0},{"$f":"SUM(G886:G891)","v":0}]
["","","","","","",{"$f":"IFERROR(VLOOKUP(E893,'[1]Tarif de base'!D:E,2,FALSE)*F893,\"\")","v":""},"","","",{"$f":"IFERROR(IF(G899-H893-I893-J893<>0,\"Attention il manque \"&G899-H893-I893-J893&\"€\",\"Règlement OK\"),\"Pas de règlement\")","v":"Pas de règlement"},"",null,127]
[null,"",null,null,{"$f":"IFERROR(INDIRECT(\"'C:\\Users\\Moi\\OneDrive\\Documents\\[Formulaires Gravereau.xlsx]Action\"&$N893&\"'!$D$11\"),\"\")","v":""},{"$f":"IFERROR(INDIRECT(\"'C:\\Users\\Moi\\OneDrive\\Documents\\[Formulaires Gravereau.xlsx]Action\"&$N893&\"'!$h$11\"),\"\")","v":""},{"$f":"IFERROR(VLOOKUP(E894,'[1]Tarif de base'!D:E,2,FALSE)*F894,\"\")","v":""}]
[null,"",null,null,"","",{"$f":"IFERROR(VLOOKUP(E895,'[1]Tarif de base'!D:E,2,FALSE)*F895,\"\")","v":""}]
[null,"",null,null,"","",{"$f":"IFERROR(VLOOKUP(E896,'[1]Tarif de base'!D:E,2,FALSE)*F896,\"\")","v":""}]
[null,"",null,null,"","",{"$f":"IFERROR(VLOOKUP(E897,'[1]Tarif de base'!D:E,2,FALSE)*F897,\"\")","v":""}]
[null,"",null,null,"","",{"$f":"IFERROR(VLOOKUP(E898,'[1]Tarif de base'!D:E,2,FALSE)*F898,\"\")","v":""}]
[null,"",null,null,"Total",{"$f":"SUM(F893:F898)","v":0},{"$f":"SUM(G893:G898)","v":0}]
["","","","","","",{"$f":"IFERROR(VLOOKUP(E900,'[1]Tarif de base'!D:E,2,FALSE)*F900,\"\")","v":""},"","","",{"$f":"IFERROR(IF(G906-H900-I900-J900<>0,\"Attention il manque \"&G906-H900-I900-J900&\"€\",\"Règlement OK\"),\"Pas de règlement\")","v":"Pas de règlement"},"",null,128]
[null,"",null,null,{"$f":"IFERROR(INDIRECT(\"'C:\\Users\\Moi\\OneDrive\\Documents\\[Formulaires Gravereau.xlsx]Action\"&$N900&\"'!$D$11\"),\"\")","v":""},{"$f":"IFERROR(INDIRECT(\"'C:\\Users\\Moi\\OneDrive\\Documents\\[Formulaires Gravereau.xlsx]Action\"&$N900&\"'!$h$11\"),\"\")","v":""},{"$f":"IFERROR(VLOOKUP(E901,'[1]Tarif de base'!D:E,2,FALSE)*F901,\"\")","v":""}]
[null,"",null,null,"","",{"$f":"IFERROR(VLOOKUP(E902,'[1]Tarif de base'!D:E,2,FALSE)*F902,\"\")","v":""}]
[null,"",null,null,"","",{"$f":"IFERROR(VLOOKUP(E903,'[1]Tarif de base'!D:E,2,FALSE)*F903,\"\")","v":""}]
[null,"",null,null,"","",{"$f":"IFERROR(VLOOKUP(E904,'[1]Tarif de base'!D:E,2,FALSE)*F904,\"\")","v":""}]
[null,"",null,null,"","",{"$f":"IFERROR(VLOOKUP(E905,'[1]Tarif de base'!D:E,2,FALSE)*F905,\"\")","v":""}]
[null,"",null,null,"Total",{"$f":"SUM(F900:F905)","v":0},{"$f":"SUM(G900:G905)","v":0}]
["","","","","","",{"$f":"IFERROR(VLOOKUP(E907,'[1]Tarif de base'!D:E,2,FALSE)*F907,\"\")","v":""},"","","",{"$f":"IFERROR(IF(G913-H907-I907-J907<>0,\"Attention il manque \"&G913-H907-I907-J907&\"€\",\"Règlement OK\"),\"Pas de règlement\")","v":"Pas de règlement"},"",null,129]
[null,"",null,null,{"$f":"IFERROR(INDIRECT(\"'C:\\Users\\Moi\\OneDrive\\Documents\\[Formulaires Gravereau.xlsx]Action\"&$N907&\"'!$D$11\"),\"\")","v":""},{"$f":"IFERROR(INDIRECT(\"'C:\\Users\\Moi\\OneDrive\\Documents\\[Formulaires Gravereau.xlsx]Action\"&$N907&\"'!$h$11\"),\"\")","v":""},{"$f":"IFERROR(VLOOKUP(E908,'[1]Tarif de base'!D:E,2,FALSE)*F908,\"\")","v":""}]
[null,"",null,null,"","",{"$f":"IFERROR(VLOOKUP(E909,'[1]Tarif de base'!D:E,2,FALSE)*F909,\"\")","v":""}]
[null,"",null,null,"","",{"$f":"IFERROR(VLOOKUP(E910,'[1]Tarif de base'!D:E,2,FALSE)*F910,\"\")","v":""}]
[null,"",null,null,"","",{"$f":"IFERROR(VLOOKUP(E911,'[1]Tarif de base'!D:E,2,FALSE)*F911,\"\")","v":""}]
[null,"",null,null,"","",{"$f":"IFERROR(VLOOKUP(E912,'[1]Tarif de base'!D:E,2,FALSE)*F912,\"\")","v":""}]
[null,"",null,null,"Total",{"$f":"SUM(F907:F912)","v":0},{"$f":"SUM(G907:G912)","v":0}]
["","","","","","",{"$f":"IFERROR(VLOOKUP(E914,'[1]Tarif de base'!D:E,2,FALSE)*F914,\"\")","v":""},"","","",{"$f":"IFERROR(IF(G920-H914-I914-J914<>0,\"Attention il manque \"&G920-H914-I914-J914&\"€\",\"Règlement OK\"),\"Pas de règlement\")","v":"Pas de règlement"},"",null,130]
[null,"",null,null,{"$f":"IFERROR(INDIRECT(\"'C:\\Users\\Moi\\OneDrive\\Documents\\[Formulaires Gravereau.xlsx]Action\"&$N914&\"'!$D$11\"),\"\")","v":""},{"$f":"IFERROR(INDIRECT(\"'C:\\Users\\Moi\\OneDrive\\Documents\\[Formulaires Gravereau.xlsx]Action\"&$N914&\"'!$h$11\"),\"\")","v":""},{"$f":"IFERROR(VLOOKUP(E915,'[1]Tarif de base'!D:E,2,FALSE)*F915,\"\")","v":""}]
[null,{"$f":"B915","v":""},null,null,"","",{"$f":"IFERROR(VLOOKUP(E916,'[1]Tarif de base'!D:E,2,FALSE)*F916,\"\")","v":""}]
[null,"",null,null,"","",{"$f":"IFERROR(VLOOKUP(E917,'[1]Tarif de base'!D:E,2,FALSE)*F917,\"\")","v":""}]
[null,"",null,null,"","",{"$f":"IFERROR(VLOOKUP(E918,'[1]Tarif de base'!D:E,2,FALSE)*F918,\"\")","v":""}]
[null,"",null,null,"","",{"$f":"IFERROR(VLOOKUP(E919,'[1]Tarif de base'!D:E,2,FALSE)*F919,\"\")","v":""}]
[null,"",null,null,"Total",{"$f":"SUM(F914:F919)","v":0},{"$f":"SUM(G914:G919)","v":0}]
["","","","","","",{"$f":"IFERROR(VLOOKUP(E921,'[1]Tarif de base'!D:E,2,FALSE)*F921,\"\")","v":""},"","","",{"$f":"IFERROR(IF(G927-H921-I921-J921<>0,\"Attention il manque \"&G927-H921-I921-J921&\"€\",\"Règlement OK\"),\"Pas de règlement\")","v":"Pas de règlement"},"",null,131]
[null,"",null,null,{"$f":"IFERROR(INDIRECT(\"'C:\\Users\\Moi\\OneDrive\\Documents\\[Formulaires Gravereau.xlsx]Action\"&$N921&\"'!$D$11\"),\"\")","v":""},{"$f":"IFERROR(INDIRECT(\"'C:\\Users\\Moi\\OneDrive\\Documents\\[Formulaires Gravereau.xlsx]Action\"&$N921&\"'!$h$11\"),\"\")","v":""},{"$f":"IFERROR(VLOOKUP(E922,'[1]Tarif de base'!D:E,2,FALSE)*F922,\"\")","v":""}]
[null,"",null,null,"","",{"$f":"IFERROR(VLOOKUP(E923,'[1]Tarif de base'!D:E,2,FALSE)*F923,\"\")","v":""}]
[null,"",null,null,"","",{"$f":"IFERROR(VLOOKUP(E924,'[1]Tarif de base'!D:E,2,FALSE)*F924,\"\")","v":""}]
[null,"",null,null,"","",{"$f":"IFERROR(VLOOKUP(E925,'[1]Tarif de base'!D:E,2,FALSE)*F925,\"\")","v":""}]
[null,"",null,null,"","",{"$f":"IFERROR(VLOOKUP(E926,'[1]Tarif de base'!D:E,2,FALSE)*F926,\"\")","v":""}]
[null,"",null,null,"Total",{"$f":"SUM(F921:F926)","v":0},{"$f":"SUM(G921:G926)","v":0}]
["","","","","","",{"$f":"IFERROR(VLOOKUP(E928,'[1]Tarif de base'!D:E,2,FALSE)*F928,\"\")","v":""},"","","",{"$f":"IFERROR(IF(G934-H928-I928-J928<>0,\"Attention il manque \"&G934-H928-I928-J928&\"€\",\"Règlement OK\"),\"Pas de règlement\")","v":"Pas de règlement"},"",null,132]
[null,"",null,null,{"$f":"IFERROR(INDIRECT(\"'C:\\Users\\Moi\\OneDrive\\Documents\\[Formulaires Gravereau.xlsx]Action\"&$N928&\"'!$D$11\"),\"\")","v":""},{"$f":"IFERROR(INDIRECT(\"'C:\\Users\\Moi\\OneDrive\\Documents\\[Formulaires Gravereau.xlsx]Action\"&$N928&\"'!$h$11\"),\"\")","v":""},{"$f":"IFERROR(VLOOKUP(E929,'[1]Tarif de base'!D:E,2,FALSE)*F929,\"\")","v":""}]
[null,"",null,null,"","",{"$f":"IFERROR(VLOOKUP(E930,'[1]Tarif de base'!D:E,2,FALSE)*F930,\"\")","v":""}]
[null,"",null,null,"","",{"$f":"IFERROR(VLOOKUP(E931,'[1]Tarif de base'!D:E,2,FALSE)*F931,\"\")","v":""}]
[null,"",null,null,"","",{"$f":"IFERROR(VLOOKUP(E932,'[1]Tarif de base'!D:E,2,FALSE)*F932,\"\")","v":""}]
[null,"",null,null,"","",{"$f":"IFERROR(VLOOKUP(E933,'[1]Tarif de base'!D:E,2,FALSE)*F933,\"\")","v":""}]
[null,"",null,null,"Total",{"$f":"SUM(F928:F933)","v":0},{"$f":"SUM(G928:G933)","v":0}]
["","","","","","",{"$f":"IFERROR(VLOOKUP(E935,'[1]Tarif de base'!D:E,2,FALSE)*F935,\"\")","v":""},"","","",{"$f":"IFERROR(IF(G941-H935-I935-J935<>0,\"Attention il manque \"&G941-H935-I935-J935&\"€\",\"Règlement OK\"),\"Pas de règlement\")","v":"Pas de règlement"},"",null,133]
[null,"",null,null,{"$f":"IFERROR(INDIRECT(\"'C:\\Users\\Moi\\OneDrive\\Documents\\[Formulaires Gravereau.xlsx]Action\"&$N935&\"'!$D$11\"),\"\")","v":""},{"$f":"IFERROR(INDIRECT(\"'C:\\Users\\Moi\\OneDrive\\Documents\\[Formulaires Gravereau.xlsx]Action\"&$N935&\"'!$h$11\"),\"\")","v":""},{"$f":"IFERROR(VLOOKUP(E936,'[1]Tarif de base'!D:E,2,FALSE)*F936,\"\")","v":""}]
[null,"",null,null,"","",{"$f":"IFERROR(VLOOKUP(E937,'[1]Tarif de base'!D:E,2,FALSE)*F937,\"\")","v":""}]
[null,"",null,null,"","",{"$f":"IFERROR(VLOOKUP(E938,'[1]Tarif de base'!D:E,2,FALSE)*F938,\"\")","v":""}]
[null,"",null,null,"","",{"$f":"IFERROR(VLOOKUP(E939,'[1]Tarif de base'!D:E,2,FALSE)*F939,\"\")","v":""}]
[null,"",null,null,"","",{"$f":"IFERROR(VLOOKUP(E940,'[1]Tarif de base'!D:E,2,FALSE)*F940,\"\")","v":""}]
[null,"",null,null,"Total",{"$f":"SUM(F935:F940)","v":0},{"$f":"SUM(G935:G940)","v":0}]
[{"$f":"IFERROR(INDIRECT(\"'C:\\Users\\Moi\\OneDrive\\Documents\\[Formulaires Gravereau.xlsx]Action\"&$N942&\"'!$D$6\"),\"\")","v":""},{"$f":"IF(C942<>\"\",C942,\"\")","v":""},{"$f":"IFERROR(INDIRECT(\"'C:\\Users\\Moi\\OneDrive\\Documents\\[Formulaires Gravereau.xlsx]Action\"&$N942&\"'!$D$4\"),\"\")","v":""},{"$f":"IFERROR(INDIRECT(\"'C:\\Users\\Moi\\OneDrive\\Documents\\[Formulaires Gravereau.xlsx]Action\"&$N942&\"'!$h$4\"),\"\")","v":""},{"$f":"IFERROR(INDIRECT(\"'C:\\Users\\Moi\\OneDrive\\Documents\\[Formulaires Gravereau.xlsx]Action\"&$N942&\"'!$D$9\"),\"\")","v":""},{"$f":"IFERROR(INDIRECT(\"'C:\\Users\\Moi\\OneDrive\\Documents\\[Formulaires Gravereau.xlsx]Action\"&$N942&\"'!$h$9\"),\"\")","v":""},{"$f":"IFERROR(VLOOKUP(E942,'[1]Tarif de base'!D:E,2,FALSE)*F942,\"\")","v":""},{"$f":"IFERROR(INDIRECT(\"'C:\\Users\\Moi\\OneDrive\\Documents\\[Formulaires Gravereau.xlsx]Action\"&$N942&\"'!$d$26\"),\"\")","v":""},{"$f":"IFERROR(INDIRECT(\"'C:\\Users\\Moi\\OneDrive\\Documents\\[Formulaires Gravereau.xlsx]Action\"&$N942&\"'!$d$28\"),\"\")","v":""},{"$f":"IFERROR(INDIRECT(\"'C:\\Users\\Moi\\OneDrive\\Documents\\[Formulaires Gravereau.xlsx]Action\"&$N942&\"'!$h$26\"),\"\")","v":""},{"$f":"IFERROR(IF(G948-H942-I942-J942<>0,\"Attention il manque \"&G948-H942-I942-J942&\"€\",\"Règlement OK\"),\"Pas de règlement\")","v":"Pas de règlement"},{"$f":"IFERROR(INDIRECT(\"'C:\\Users\\Moi\\OneDrive\\Documents\\[Formulaires Gravereau.xlsx]Action\"&$N942&\"'!$d$30\"),\"\")","v":""},null,134]
[null,"",null,null,{"$f":"IFERROR(INDIRECT(\"'C:\\Users\\Moi\\OneDrive\\Documents\\[Formulaires Gravereau.xlsx]Action\"&$N942&\"'!$D$11\"),\"\")","v":""},{"$f":"IFERROR(INDIRECT(\"'C:\\Users\\Moi\\OneDrive\\Documents\\[Formulaires Gravereau.xlsx]Action\"&$N942&\"'!$h$11\"),\"\")","v":""},{"$f":"IFERROR(VLOOKUP(E943,'[1]Tarif de base'!D:E,2,FALSE)*F943,\"\")","v":""}]
[null,"",null,null,{"$f":"IFERROR(INDIRECT(\"'C:\\Users\\Moi\\OneDrive\\Documents\\[Formulaires Gravereau.xlsx]Action\"&$N942&\"'!$D$13\"),\"\")","v":""},{"$f":"IFERROR(INDIRECT(\"'C:\\Users\\Moi\\OneDrive\\Documents\\[Formulaires Gravereau.xlsx]Action\"&$N942&\"'!$h$13\"),\"\")","v":""},{"$f":"IFERROR(VLOOKUP(E944,'[1]Tarif de base'!D:E,2,FALSE)*F944,\"\")","v":""}]
[null,"",null,null,{"$f":"IFERROR(INDIRECT(\"'C:\\Users\\Moi\\OneDrive\\Documents\\[Formulaires Gravereau.xlsx]Action\"&$N942&\"'!$D$15\"),\"\")","v":""},{"$f":"IFERROR(INDIRECT(\"'C:\\Users\\Moi\\OneDrive\\Documents\\[Formulaires Gravereau.xlsx]Action\"&$N942&\"'!$h$15\"),\"\")","v":""},{"$f":"IFERROR(VLOOKUP(E945,'[1]Tarif de base'!D:E,2,FALSE)*F945,\"\")","v":""}]
[null,"",null,null,{"$f":"IFERROR(INDIRECT(\"'C:\\Users\\Moi\\OneDrive\\Documents\\[Formulaires Gravereau.xlsx]Action\"&$N942&\"'!$D$17\"),\"\")","v":""},{"$f":"IFERROR(INDIRECT(\"'C:\\Users\\Moi\\OneDrive\\Documents\\[Formulaires Gravereau.xlsx]Action\"&$N942&\"'!$h$17\"),\"\")","v":""},{"$f":"IFERROR(VLOOKUP(E946,'[1]Tarif de base'!D:E,2,FALSE)*F946,\"\")","v":""}]
[null,"",null,null,{"$f":"IFERROR(INDIRECT(\"'C:\\Users\\Moi\\OneDrive\\Documents\\[Formulaires Gravereau.xlsx]Action\"&$N942&\"'!$D$19\"),\"\")","v":""},{"$f":"IFERROR(INDIRECT(\"'C:\\Users\\Moi\\OneDrive\\Documents\\[Formulaires Gravereau.xlsx]Action\"&$N942&\"'!$h$19\"),\"\")","v":""},{"$f":"IFERROR(VLOOKUP(E947,'[1]Tarif de base'!D:E,2,FALSE)*F947,\"\")","v":""}]
[null,"",null,null,"Total",{"$f":"SUM(F942:F947)","v":0},{"$f":"SUM(G942:G947)","v":0}]
["","","","","","",{"$f":"IFERROR(VLOOKUP(E949,'[1]Tarif de base'!D:E,2,FALSE)*F949,\"\")","v":""},"","","",{"$f":"IFERROR(IF(G955-H949-I949-J949<>0,\"Attention il manque \"&G955-H949-I949-J949&\"€\",\"Règlement OK\"),\"Pas de règlement\")","v":"Pas de règlement"},"",null,135]
[null,"",null,null,{"$f":"IFERROR(INDIRECT(\"'C:\\Users\\Moi\\OneDrive\\Documents\\[Formulaires Gravereau.xlsx]Action\"&$N949&\"'!$D$11\"),\"\")","v":""},{"$f":"IFERROR(INDIRECT(\"'C:\\Users\\Moi\\OneDrive\\Documents\\[Formulaires Gravereau.xlsx]Action\"&$N949&\"'!$h$11\"),\"\")","v":""},{"$f":"IFERROR(VLOOKUP(E950,'[1]Tarif de base'!D:E,2,FALSE)*F950,\"\")","v":""}]
[null,"",null,null,"","",{"$f":"IFERROR(VLOOKUP(E951,'[1]Tarif de base'!D:E,2,FALSE)*F951,\"\")","v":""}]
[null,"",null,null,"","",{"$f":"IFERROR(VLOOKUP(E952,'[1]Tarif de base'!D:E,2,FALSE)*F952,\"\")","v":""}]
[null,"",null,null,"","",{"$f":"IFERROR(VLOOKUP(E953,'[1]Tarif de base'!D:E,2,FALSE)*F953,\"\")","v":""}]
[null,"",null,null,"","",{"$f":"IFERROR(VLOOKUP(E954,'[1]Tarif de base'!D:E,2,FALSE)*F954,\"\")","v":""}]
[null,"",null,null,"Total",{"$f":"SUM(F949:F954)","v":0},{"$f":"SUM(G949:G954)","v":0}]
["","","","","","",{"$f":"IFERROR(VLOOKUP(E956,'[1]Tarif de base'!D:E,2,FALSE)*F956,\"\")","v":""},"","","",{"$f":"IFERROR(IF(G962-H956-I956-J956<>0,\"Attention il manque \"&G962-H956-I956-J956&\"€\",\"Règlement OK\"),\"Pas de règlement\")","v":"Pas de règlement"},"",null,136]
[null,"",null,null,{"$f":"IFERROR(INDIRECT(\"'C:\\Users\\Moi\\OneDrive\\Documents\\[Formulaires Gravereau.xlsx]Action\"&$N956&\"'!$D$11\"),\"\")","v":""},{"$f":"IFERROR(INDIRECT(\"'C:\\Users\\Moi\\OneDrive\\Documents\\[Formulaires Gravereau.xlsx]Action\"&$N956&\"'!$h$11\"),\"\")","v":""},{"$f":"IFERROR(VLOOKUP(E957,'[1]Tarif de base'!D:E,2,FALSE)*F957,\"\")","v":""}]
[null,"",null,null,"","",{"$f":"IFERROR(VLOOKUP(E958,'[1]Tarif de base'!D:E,2,FALSE)*F958,\"\")","v":""}]
[null,"",null,null,"","",{"$f":"IFERROR(VLOOKUP(E959,'[1]Tarif de base'!D:E,2,FALSE)*F959,\"\")","v":""}]
[null,"",null,null,"","",{"$f":"IFERROR(VLOOKUP(E960,'[1]Tarif de base'!D:E,2,FALSE)*F960,\"\")","v":""}]
[null,"",null,null,"","",{"$f":"IFERROR(VLOOKUP(E961,'[1]Tarif de base'!D:E,2,FALSE)*F961,\"\")","v":""}]
[null,"",null,null,"Total",{"$f":"SUM(F956:F961)","v":0},{"$f":"SUM(G956:G961)","v":0}]
["","","","","","",{"$f":"IFERROR(VLOOKUP(E963,'[1]Tarif de base'!D:E,2,FALSE)*F963,\"\")","v":""},"","","",{"$f":"IFERROR(IF(G969-H963-I963-J963<>0,\"Attention il manque \"&G969-H963-I963-J963&\"€\",\"Règlement OK\"),\"Pas de règlement\")","v":"Pas de règlement"},"",null,137]
[null,"",null,null,{"$f":"IFERROR(INDIRECT(\"'C:\\Users\\Moi\\OneDrive\\Documents\\[Formulaires Gravereau.xlsx]Action\"&$N963&\"'!$D$11\"),\"\")","v":""},{"$f":"IFERROR(INDIRECT(\"'C:\\Users\\Moi\\OneDrive\\Documents\\[Formulaires Gravereau.xlsx]Action\"&$N963&\"'!$h$11\"),\"\")","v":""},{"$f":"IFERROR(VLOOKUP(E964,'[1]Tarif de base'!D:E,2,FALSE)*F964,\"\")","v":""}]
[null,"",null,null,"","",{"$f":"IFERROR(VLOOKUP(E965,'[1]Tarif de base'!D:E,2,FALSE)*F965,\"\")","v":""}]
[null,"",null,null,"","",{"$f":"IFERROR(VLOOKUP(E966,'[1]Tarif de base'!D:E,2,FALSE)*F966,\"\")","v":""}]
[null,"",null,null,"","",{"$f":"IFERROR(VLOOKUP(E967,'[1]Tarif de base'!D:E,2,FALSE)*F967,\"\")","v":""}]
[null,"",null,null,"","",{"$f":"IFERROR(VLOOKUP(E968,'[1]Tarif de base'!D:E,2,FALSE)*F968,\"\")","v":""}]
[null,"",null,null,"Total",{"$f":"SUM(F963:F968)","v":0},{"$f":"SUM(G963:G968)","v":0}]
["","","","","","",{"$f":"IFERROR(VLOOKUP(E970,'[1]Tarif de base'!D:E,2,FALSE)*F970,\"\")","v":""},"","","",{"$f":"IFERROR(IF(G976-H970-I970-J970<>0,\"Attention il manque \"&G976-H970-I970-J970&\"€\",\"Règlement OK\"),\"Pas de règlement\")","v":"Pas de règlement"},"",null,138]
[null,"",null,null,{"$f":"IFERROR(INDIRECT(\"'C:\\Users\\Moi\\OneDrive\\Documents\\[Formulaires Gravereau.xlsx]Action\"&$N970&\"'!$D$11\"),\"\")","v":""},{"$f":"IFERROR(INDIRECT(\"'C:\\Users\\Moi\\OneDrive\\Documents\\[Formulaires Gravereau.xlsx]Action\"&$N970&\"'!$h$11\"),\"\")","v":""},{"$f":"IFERROR(VLOOKUP(E971,'[1]Tarif de base'!D:E,2,FALSE)*F971,\"\")","v":""}]
[null,"",null,null,"","",{"$f":"IFERROR(VLOOKUP(E972,'[1]Tarif de base'!D:E,2,FALSE)*F972,\"\")","v":""}]
[null,"",null,null,"","",{"$f":"IFERROR(VLOOKUP(E973,'[1]Tarif de base'!D:E,2,FALSE)*F973,\"\")","v":""}]
[null,"",null,null,"","",{"$f":"IFERROR(VLOOKUP(E974,'[1]Tarif de base'!D:E,2,FALSE)*F974,\"\")","v":""}]
[null,"",null,null,"","",{"$f":"IFERROR(VLOOKUP(E975,'[1]Tarif de base'!D:E,2,FALSE)*F975,\"\")","v":""}]
[null,"",null,null,"Total",{"$f":"SUM(F970:F975)","v":0},{"$f":"SUM(G970:G975)","v":0}]
["","","","","","",{"$f":"IFERROR(VLOOKUP(E977,'[1]Tarif de base'!D:E,2,FALSE)*F977,\"\")","v":""},"","","",{"$f":"IFERROR(IF(G983-H977-I977-J977<>0,\"Attention il manque \"&G983-H977-I977-J977&\"€\",\"Règlement OK\"),\"Pas de règlement\")","v":"Pas de règlement"},"",null,139]
[null,"",null,null,{"$f":"IFERROR(INDIRECT(\"'C:\\Users\\Moi\\OneDrive\\Documents\\[Formulaires Gravereau.xlsx]Action\"&$N977&\"'!$D$11\"),\"\")","v":""},{"$f":"IFERROR(INDIRECT(\"'C:\\Users\\Moi\\OneDrive\\Documents\\[Formulaires Gravereau.xlsx]Action\"&$N977&\"'!$h$11\"),\"\")","v":""},{"$f":"IFERROR(VLOOKUP(E978,'[1]Tarif de base'!D:E,2,FALSE)*F978,\"\")","v":""}]
[null,"",null,null,"","",{"$f":"IFERROR(VLOOKUP(E979,'[1]Tarif de base'!D:E,2,FALSE)*F979,\"\")","v":""}]
[null,{"$f":"B979","v":""},null,null,"","",{"$f":"IFERROR(VLOOKUP(E980,'[1]Tarif de base'!D:E,2,FALSE)*F980,\"\")","v":""}]
[null,"",null,null,"","",{"$f":"IFERROR(VLOOKUP(E981,'[1]Tarif de base'!D:E,2,FALSE)*F981,\"\")","v":""}]
[null,"",null,null,"","",{"$f":"IFERROR(VLOOKUP(E982,'[1]Tarif de base'!D:E,2,FALSE)*F982,\"\")","v":""}]
[null,"",null,null,"Total",{"$f":"SUM(F977:F982)","v":0},{"$f":"SUM(G977:G982)","v":0}]
["","","","","","",{"$f":"IFERROR(VLOOKUP(E984,'[1]Tarif de base'!D:E,2,FALSE)*F984,\"\")","v":""},"","","",{"$f":"IFERROR(IF(G990-H984-I984-J984<>0,\"Attention il manque \"&G990-H984-I984-J984&\"€\",\"Règlement OK\"),\"Pas de règlement\")","v":"Pas de règlement"},"",null,140]
[null,"",null,null,{"$f":"IFERROR(INDIRECT(\"'C:\\Users\\Moi\\OneDrive\\Documents\\[Formulaires Gravereau.xlsx]Action\"&$N984&\"'!$D$11\"),\"\")","v":""},{"$f":"IFERROR(INDIRECT(\"'C:\\Users\\Moi\\OneDrive\\Documents\\[Formulaires Gravereau.xlsx]Action\"&$N984&\"'!$h$11\"),\"\")","v":""},{"$f":"IFERROR(VLOOKUP(E985,'[1]Tarif de base'!D:E,2,FALSE)*F985,\"\")","v":""}]
[null,"",null,null,"","",{"$f":"IFERROR(VLOOKUP(E986,'[1]Tarif de base'!D:E,2,FALSE)*F986,\"\")","v":""}]
[null,"",null,null,"","",{"$f":"IFERROR(VLOOKUP(E987,'[1]Tarif de base'!D:E,2,FALSE)*F987,\"\")","v":""}]
[null,"",null,null,"","",{"$f":"IFERROR(VLOOKUP(E988,'[1]Tarif de base'!D:E,2,FALSE)*F988,\"\")","v":""}]
[null,"",null,null,"","",{"$f":"IFERROR(VLOOKUP(E989,'[1]Tarif de base'!D:E,2,FALSE)*F989,\"\")","v":""}]
[null,"",null,null,"Total",{"$f":"SUM(F984:F989)","v":0},{"$f":"SUM(G984:G989)","v":0}]
["","","","","","",{"$f":"IFERROR(VLOOKUP(E991,'[1]Tarif de base'!D:E,2,FALSE)*F991,\"\")","v":""},"","","",{"$f":"IFERROR(IF(G997-H991-I991-J991<>0,\"Attention il manque \"&G997-H991-I991-J991&\"€\",\"Règlement OK\"),\"Pas de règlement\")","v":"Pas de règlement"},"",null,141]
[null,"",null,null,{"$f":"IFERROR(INDIRECT(\"'C:\\Users\\Moi\\OneDrive\\Documents\\[Formulaires Gravereau.xlsx]Action\"&$N991&\"'!$D$11\"),\"\")","v":""},{"$f":"IFERROR(INDIRECT(\"'C:\\Users\\Moi\\OneDrive\\Documents\\[Formulaires Gravereau.xlsx]Action\"&$N991&\"'!$h$11\"),\"\")","v":""},{"$f":"IFERROR(VLOOKUP(E992,'[1]Tarif de base'!D:E,2,FALSE)*F992,\"\")","v":""}]
[null,"",null,null,"","",{"$f":"IFERROR(VLOOKUP(E993,'[1]Tarif de base'!D:E,2,FALSE)*F993,\"\")","v":""}]
[null,"",null,null,"","",{"$f":"IFERROR(VLOOKUP(E994,'[1]Tarif de base'!D:E,2,FALSE)*F994,\"\")","v":""}]
[null,"",null,null,"","",{"$f":"IFERROR(VLOOKUP(E995,'[1]Tarif de base'!D:E,2,FALSE)*F995,\"\")","v":""}]
[null,"",null,null,"","",{"$f":"IFERROR(VLOOKUP(E996,'[1]Tarif de base'!D:E,2,FALSE)*F996,\"\")","v":""}]
[null,"",null,null,"Total",{"$f":"SUM(F991:F996)","v":0},{"$f":"SUM(G991:G996)","v":0}]
["","","","","","",{"$f":"IFERROR(VLOOKUP(E998,'[1]Tarif de base'!D:E,2,FALSE)*F998,\"\")","v":""},"","","",{"$f":"IFERROR(IF(G1004-H998-I998-J998<>0,\"Attention il manque \"&G1004-H998-I998-J998&\"€\",\"Règlement OK\"),\"Pas de règlement\")","v":"Pas de règlement"},"",null,142]
[null,"",null,null,{"$f":"IFERROR(INDIRECT(\"'C:\\Users\\Moi\\OneDrive\\Documents\\[Formulaires Gravereau.xlsx]Action\"&$N998&\"'!$D$11\"),\"\")","v":""},{"$f":"IFERROR(INDIRECT(\"'C:\\Users\\Moi\\OneDrive\\Documents\\[Formulaires Gravereau.xlsx]Action\"&$N998&\"'!$h$11\"),\"\")","v":""},{"$f":"IFERROR(VLOOKUP(E999,'[1]Tarif de base'!D:E,2,FALSE)*F999,\"\")","v":""}]
[null,"",null,null,"","",{"$f":"IFERROR(VLOOKUP(E1000,'[1]Tarif de base'!D:E,2,FALSE)*F1000,\"\")","v":""}]
[null,"",null,null,"","",{"$f":"IFERROR(VLOOKUP(E1001,'[1]Tarif de base'!D:E,2,FALSE)*F1001,\"\")","v":""}]
[null,"",null,null,"","",{"$f":"IFERROR(VLOOKUP(E1002,'[1]Tarif de base'!D:E,2,FALSE)*F1002,\"\")","v":""}]
[null,"",null,null,"","",{"$f":"IFERROR(VLOOKUP(E1003,'[1]Tarif de base'!D:E,2,FALSE)*F1003,\"\")","v":""}]
[null,"",null,null,"Total",{"$f":"SUM(F998:F1003)","v":0},{"$f":"SUM(G998:G1003)","v":0}]
["","","","","","",{"$f":"IFERROR(VLOOKUP(E1005,'[1]Tarif de base'!D:E,2,FALSE)*F1005,\"\")","v":""},"","","",{"$f":"IFERROR(IF(G1011-H1005-I1005-J1005<>0,\"Attention il manque \"&G1011-H1005-I1005-J1005&\"€\",\"Règlement OK\"),\"Pas de règlement\")","v":"Pas de règlement"},"",null,143]
[null,"",null,null,{"$f":"IFERROR(INDIRECT(\"'C:\\Users\\Moi\\OneDrive\\Documents\\[Formulaires Gravereau.xlsx]Action\"&$N1005&\"'!$D$11\"),\"\")","v":""},{"$f":"IFERROR(INDIRECT(\"'C:\\Users\\Moi\\OneDrive\\Documents\\[Formulaires Gravereau.xlsx]Action\"&$N1005&\"'!$h$11\"),\"\")","v":""},{"$f":"IFERROR(VLOOKUP(E1006,'[1]Tarif de base'!D:E,2,FALSE)*F1006,\"\")","v":""}]
[null,"",null,null,"","",{"$f":"IFERROR(VLOOKUP(E1007,'[1]Tarif de base'!D:E,2,FALSE)*F1007,\"\")","v":""}]
[null,"",null,null,"","",{"$f":"IFERROR(VLOOKUP(E1008,'[1]Tarif de base'!D:E,2,FALSE)*F1008,\"\")","v":""}]
[null,"",null,null,"","",{"$f":"IFERROR(VLOOKUP(E1009,'[1]Tarif de base'!D:E,2,FALSE)*F1009,\"\")","v":""}]
[null,"",null,null,"","",{"$f":"IFERROR(VLOOKUP(E1010,'[1]Tarif de base'!D:E,2,FALSE)*F1010,\"\")","v":""}]
[null,"",null,null,"Total",{"$f":"SUM(F1005:F1010)","v":0},{"$f":"SUM(G1005:G1010)","v":0}]
[{"$f":"IFERROR(INDIRECT(\"'C:\\Users\\Moi\\OneDrive\\Documents\\[Formulaires Gravereau.xlsx]Action\"&$N1012&\"'!$D$6\"),\"\")","v":""},{"$f":"IF(C1012<>\"\",C1012,\"\")","v":""},{"$f":"IFERROR(INDIRECT(\"'C:\\Users\\Moi\\OneDrive\\Documents\\[Formulaires Gravereau.xlsx]Action\"&$N1012&\"'!$D$4\"),\"\")","v":""},{"$f":"IFERROR(INDIRECT(\"'C:\\Users\\Moi\\OneDrive\\Documents\\[Formulaires Gravereau.xlsx]Action\"&$N1012&\"'!$h$4\"),\"\")","v":""},{"$f":"IFERROR(INDIRECT(\"'C:\\Users\\Moi\\OneDrive\\Documents\\[Formulaires Gravereau.xlsx]Action\"&$N1012&\"'!$D$9\"),\"\")","v":""},{"$f":"IFERROR(INDIRECT(\"'C:\\Users\\Moi\\OneDrive\\Documents\\[Formulaires Gravereau.xlsx]Action\"&$N1012&\"'!$h$9\"),\"\")","v":""},{"$f":"IFERROR(VLOOKUP(E1012,'[1]Tarif de base'!D:E,2,FALSE)*F1012,\"\")","v":""},{"$f":"IFERROR(INDIRECT(\"'C:\\Users\\Moi\\OneDrive\\Documents\\[Formulaires Gravereau.xlsx]Action\"&$N1012&\"'!$d$26\"),\"\")","v":""},{"$f":"IFERROR(INDIRECT(\"'C:\\Users\\Moi\\OneDrive\\Documents\\[Formulaires Gravereau.xlsx]Action\"&$N1012&\"'!$d$28\"),\"\")","v":""},{"$f":"IFERROR(INDIRECT(\"'C:\\Users\\Moi\\OneDrive\\Documents\\[Formulaires Gravereau.xlsx]Action\"&$N1012&\"'!$h$26\"),\"\")","v":""},{"$f":"IFERROR(IF(G1018-H1012-I1012-J1012<>0,\"Attention il manque \"&G1018-H1012-I1012-J1012&\"€\",\"Règlement OK\"),\"Pas de règlement\")","v":"Pas de règlement"},{"$f":"IFERROR(INDIRECT(\"'C:\\Users\\Moi\\OneDrive\\Documents\\[Formulaires Gravereau.xlsx]Action\"&$N1012&\"'!$d$30\"),\"\")","v":""},null,144]
[null,"",null,null,{"$f":"IFERROR(INDIRECT(\"'C:\\Users\\Moi\\OneDrive\\Documents\\[Formulaires Gravereau.xlsx]Action\"&$N1012&\"'!$D$11\"),\"\")","v":""},{"$f":"IFERROR(INDIRECT(\"'C:\\Users\\Moi\\OneDrive\\Documents\\[Formulaires Gravereau.xlsx]Action\"&$N1012&\"'!$h$11\"),\"\")","v":""},{"$f":"IFERROR(VLOOKUP(E1013,'[1]Tarif de base'!D:E,2,FALSE)*F1013,\"\")","v":""}]
[null,"",null,null,{"$f":"IFERROR(INDIRECT(\"'C:\\Users\\Moi\\OneDrive\\Documents\\[Formulaires Gravereau.xlsx]Action\"&$N1012&\"'!$D$13\"),\"\")","v":""},{"$f":"IFERROR(INDIRECT(\"'C:\\Users\\Moi\\OneDrive\\Documents\\[Formulaires Gravereau.xlsx]Action\"&$N1012&\"'!$h$13\"),\"\")","v":""},{"$f":"IFERROR(VLOOKUP(E1014,'[1]Tarif de base'!D:E,2,FALSE)*F1014,\"\")","v":""}]
[null,"",null,null,{"$f":"IFERROR(INDIRECT(\"'C:\\Users\\Moi\\OneDrive\\Documents\\[Formulaires Gravereau.xlsx]Action\"&$N1012&\"'!$D$15\"),\"\")","v":""},{"$f":"IFERROR(INDIRECT(\"'C:\\Users\\Moi\\OneDrive\\Documents\\[Formulaires Gravereau.xlsx]Action\"&$N1012&\"'!$h$15\"),\"\")","v":""},{"$f":"IFERROR(VLOOKUP(E1015,'[1]Tarif de base'!D:E,2,FALSE)*F1015,\"\")","v":""}]
[null,"",null,null,{"$f":"IFERROR(INDIRECT(\"'C:\\Users\\Moi\\OneDrive\\Documents\\[Formulaires Gravereau.xlsx]Action\"&$N1012&\"'!$D$17\"),\"\")","v":""},{"$f":"IFERROR(INDIRECT(\"'C:\\Users\\Moi\\OneDrive\\Documents\\[Formulaires Gravereau.xlsx]Action\"&$N1012&\"'!$h$17\"),\"\")","v":""},{"$f":"IFERROR(VLOOKUP(E1016,'[1]Tarif de base'!D:E,2,FALSE)*F1016,\"\")","v":""}]
[null,"",null,null,{"$f":"IFERROR(INDIRECT(\"'C:\\Users\\Moi\\OneDrive\\Documents\\[Formulaires Gravereau.xlsx]Action\"&$N1012&\"'!$D$19\"),\"\")","v":""},{"$f":"IFERROR(INDIRECT(\"'C:\\Users\\Moi\\OneDrive\\Documents\\[Formulaires Gravereau.xlsx]Action\"&$N1012&\"'!$h$19\"),\"\")","v":""},{"$f":"IFERROR(VLOOKUP(E1017,'[1]Tarif de base'!D:E,2,FALSE)*F1017,\"\")","v":""}]
[null,"",null,null,"Total",{"$f":"SUM(F1012:F1017)","v":0},{"$f":"SUM(G1012:G1017)","v":0}]
["","","","","","",{"$f":"IFERROR(VLOOKUP(E1019,'[1]Tarif de base'!D:E,2,FALSE)*F1019,\"\")","v":""},"","","",{"$f":"IFERROR(IF(G1025-H1019-I1019-J1019<>0,\"Attention il manque \"&G1025-H1019-I1019-J1019&\"€\",\"Règlement OK\"),\"Pas de règlement\")","v":"Pas de règlement"},"",null,145]
[null,"",null,null,{"$f":"IFERROR(INDIRECT(\"'C:\\Users\\Moi\\OneDrive\\Documents\\[Formulaires Gravereau.xlsx]Action\"&$N1019&\"'!$D$11\"),\"\")","v":""},{"$f":"IFERROR(INDIRECT(\"'C:\\Users\\Moi\\OneDrive\\Documents\\[Formulaires Gravereau.xlsx]Action\"&$N1019&\"'!$h$11\"),\"\")","v":""},{"$f":"IFERROR(VLOOKUP(E1020,'[1]Tarif de base'!D:E,2,FALSE)*F1020,\"\")","v":""}]
[null,"",null,null,"","",{"$f":"IFERROR(VLOOKUP(E1021,'[1]Tarif de base'!D:E,2,FALSE)*F1021,\"\")","v":""}]
[null,"",null,null,"","",{"$f":"IFERROR(VLOOKUP(E1022,'[1]Tarif de base'!D:E,2,FALSE)*F1022,\"\")","v":""}]
[null,"",null,null,"","",{"$f":"IFERROR(VLOOKUP(E1023,'[1]Tarif de base'!D:E,2,FALSE)*F1023,\"\")","v":""}]
[null,"",null,null,"","",{"$f":"IFERROR(VLOOKUP(E1024,'[1]Tarif de base'!D:E,2,FALSE)*F1024,\"\")","v":""}]
[null,"",null,null,"Total",{"$f":"SUM(F1019:F1024)","v":0},{"$f":"SUM(G1019:G1024)","v":0}]
["","","","","","",{"$f":"IFERROR(VLOOKUP(E1026,'[1]Tarif de base'!D:E,2,FALSE)*F1026,\"\")","v":""},"","","",{"$f":"IFERROR(IF(G1032-H1026-I1026-J1026<>0,\"Attention il manque \"&G1032-H1026-I1026-J1026&\"€\",\"Règlement OK\"),\"Pas de règlement\")","v":"Pas de règlement"},"",null,146]
[null,"",null,null,{"$f":"IFERROR(INDIRECT(\"'C:\\Users\\Moi\\OneDrive\\Documents\\[Formulaires Gravereau.xlsx]Action\"&$N1026&\"'!$D$11\"),\"\")","v":""},{"$f":"IFERROR(INDIRECT(\"'C:\\Users\\Moi\\OneDrive\\Documents\\[Formulaires Gravereau.xlsx]Action\"&$N1026&\"'!$h$11\"),\"\")","v":""},{"$f":"IFERROR(VLOOKUP(E1027,'[1]Tarif de base'!D:E,2,FALSE)*F1027,\"\")","v":""}]
[null,"",null,null,"","",{"$f":"IFERROR(VLOOKUP(E1028,'[1]Tarif de base'!D:E,2,FALSE)*F1028,\"\")","v":""}]
[null,"",null,null,"","",{"$f":"IFERROR(VLOOKUP(E1029,'[1]Tarif de base'!D:E,2,FALSE)*F1029,\"\")","v":""}]
[null,"",null,null,"","",{"$f":"IFERROR(VLOOKUP(E1030,'[1]Tarif de base'!D:E,2,FALSE)*F1030,\"\")","v":""}]
[null,"",null,null,"","",{"$f":"IFERROR(VLOOKUP(E1031,'[1]Tarif de base'!D:E,2,FALSE)*F1031,\"\")","v":""}]
[null,"",null,null,"Total",{"$f":"SUM(F1026:F1031)","v":0},{"$f":"SUM(G1026:G1031)","v":0}]
["","","","","","",{"$f":"IFERROR(VLOOKUP(E1033,'[1]Tarif de base'!D:E,2,FALSE)*F1033,\"\")","v":""},"","","",{"$f":"IFERROR(IF(G1039-H1033-I1033-J1033<>0,\"Attention il manque \"&G1039-H1033-I1033-J1033&\"€\",\"Règlement OK\"),\"Pas de règlement\")","v":"Pas de règlement"},"",null,147]
[null,"",null,null,{"$f":"IFERROR(INDIRECT(\"'C:\\Users\\Moi\\OneDrive\\Documents\\[Formulaires Gravereau.xlsx]Action\"&$N1033&\"'!$D$11\"),\"\")","v":""},{"$f":"IFERROR(INDIRECT(\"'C:\\Users\\Moi\\OneDrive\\Documents\\[Formulaires Gravereau.xlsx]Action\"&$N1033&\"'!$h$11\"),\"\")","v":""},{"$f":"IFERROR(VLOOKUP(E1034,'[1]Tarif de base'!D:E,2,FALSE)*F1034,\"\")","v":""}]
[null,"",null,null,"","",{"$f":"IFERROR(VLOOKUP(E1035,'[1]Tarif de base'!D:E,2,FALSE)*F1035,\"\")","v":""}]
[null,"",null,null,"","",{"$f":"IFERROR(VLOOKUP(E1036,'[1]Tarif de base'!D:E,2,FALSE)*F1036,\"\")","v":""}]
[null,"",null,null,"","",{"$f":"IFERROR(VLOOKUP(E1037,'[1]Tarif de base'!D:E,2,FALSE)*F1037,\"\")","v":""}]
[null,"",null,null,"","",{"$f":"IFERROR(VLOOKUP(E1038,'[1]Tarif de base'!D:E,2,FALSE)*F1038,\"\")","v":""}]
[null,"",null,null,"Total",{"$f":"SUM(F1033:F1038)","v":0},{"$f":"SUM(G1033:G1038)","v":0}]
["","","","","","",{"$f":"IFERROR(VLOOKUP(E1040,'[1]Tarif de base'!D:E,2,FALSE)*F1040,\"\")","v":""},"","","",{"$f":"IFERROR(IF(G1046-H1040-I1040-J1040<>0,\"Attention il manque \"&G1046-H1040-I1040-J1040&\"€\",\"Règlement OK\"),\"Pas de règlement\")","v":"Pas de règlement"},"",null,148]
[null,"",null,null,{"$f":"IFERROR(INDIRECT(\"'C:\\Users\\Moi\\OneDrive\\Documents\\[Formulaires Gravereau.xlsx]Action\"&$N1040&\"'!$D$11\"),\"\")","v":""},{"$f":"IFERROR(INDIRECT(\"'C:\\Users\\Moi\\OneDrive\\Documents\\[Formulaires Gravereau.xlsx]Action\"&$N1040&\"'!$h$11\"),\"\")","v":""},{"$f":"IFERROR(VLOOKUP(E1041,'[1]Tarif de base'!D:E,2,FALSE)*F1041,\"\")","v":""}]
[null,"",null,null,"","",{"$f":"IFERROR(VLOOKUP(E1042,'[1]Tarif de base'!D:E,2,FALSE)*F1042,\"\")","v":""}]
[null,"",null,null,"","",{"$f":"IFERROR(VLOOKUP(E1043,'[1]Tarif de base'!D:E,2,FALSE)*F1043,\"\")","v":""}]
[null,{"$f":"B1043","v":""},null,null,"","",{"$f":"IFERROR(VLOOKUP(E1044,'[1]Tarif de base'!D:E,2,FALSE)*F1044,\"\")","v":""}]
[null,"",null,null,"","",{"$f":"IFERROR(VLOOKUP(E1045,'[1]Tarif de base'!D:E,2,FALSE)*F1045,\"\")","v":""}]
[null,"",null,null,"Total",{"$f":"SUM(F1040:F1045)","v":0},{"$f":"SUM(G1040:G1045)","v":0}]
["","","","","","",{"$f":"IFERROR(VLOOKUP(E1047,'[1]Tarif de base'!D:E,2,FALSE)*F1047,\"\")","v":""},"","","",{"$f":"IFERROR(IF(G1053-H1047-I1047-J1047<>0,\"Attention il manque \"&G1053-H1047-I1047-J1047&\"€\",\"Règlement OK\"),\"Pas de règlement\")","v":"Pas de règlement"},"",null,149]
[null,"",null,null,{"$f":"IFERROR(INDIRECT(\"'C:\\Users\\Moi\\OneDrive\\Documents\\[Formulaires Gravereau.xlsx]Action\"&$N1047&\"'!$D$11\"),\"\")","v":""},{"$f":"IFERROR(INDIRECT(\"'C:\\Users\\Moi\\OneDrive\\Documents\\[Formulaires Gravereau.xlsx]Action\"&$N1047&\"'!$h$11\"),\"\")","v":""},{"$f":"IFERROR(VLOOKUP(E1048,'[1]Tarif de base'!D:E,2,FALSE)*F1048,\"\")","v":""}]
[null,"",null,null,"","",{"$f":"IFERROR(VLOOKUP(E1049,'[1]Tarif de base'!D:E,2,FALSE)*F1049,\"\")","v":""}]
[null,"",null,null,"","",{"$f":"IFERROR(VLOOKUP(E1050,'[1]Tarif de base'!D:E,2,FALSE)*F1050,\"\")","v":""}]
[null,"",null,null,"","",{"$f":"IFERROR(VLOOKUP(E1051,'[1]Tarif de base'!D:E,2,FALSE)*F1051,\"\")","v":""}]
[null,"",null,null,"","",{"$f":"IFERROR(VLOOKUP(E1052,'[1]Tarif de base'!D:E,2,FALSE)*F1052,\"\")","v":""}]
[null,"",null,null,"Total",{"$f":"SUM(F1047:F1052)","v":0},{"$f":"SUM(G1047:G1052)","v":0}]
["","","","","","",{"$f":"IFERROR(VLOOKUP(E1054,'[1]Tarif de base'!D:E,2,FALSE)*F1054,\"\")","v":""},"","","",{"$f":"IFERROR(IF(G1060-H1054-I1054-J1054<>0,\"Attention il manque \"&G1060-H1054-I1054-J1054&\"€\",\"Règlement OK\"),\"Pas de règlement\")","v":"Pas de règlement"},"",null,150]
[null,"",null,null,{"$f":"IFERROR(INDIRECT(\"'C:\\Users\\Moi\\OneDrive\\Documents\\[Formulaires Gravereau.xlsx]Action\"&$N1054&\"'!$D$11\"),\"\")","v":""},{"$f":"IFERROR(INDIRECT(\"'C:\\Users\\Moi\\OneDrive\\Documents\\[Formulaires Gravereau.xlsx]Action\"&$N1054&\"'!$h$11\"),\"\")","v":""},{"$f":"IFERROR(VLOOKUP(E1055,'[1]Tarif de base'!D:E,2,FALSE)*F1055,\"\")","v":""}]
[null,"",null,null,"","",{"$f":"IFERROR(VLOOKUP(E1056,'[1]Tarif de base'!D:E,2,FALSE)*F1056,\"\")","v":""}]
[null,"",null,null,"","",{"$f":"IFERROR(VLOOKUP(E1057,'[1]Tarif de base'!D:E,2,FALSE)*F1057,\"\")","v":""}]
[null,"",null,null,"","",{"$f":"IFERROR(VLOOKUP(E1058,'[1]Tarif de base'!D:E,2,FALSE)*F1058,\"\")","v":""}]
[null,"",null,null,"","",{"$f":"IFERROR(VLOOKUP(E1059,'[1]Tarif de base'!D:E,2,FALSE)*F1059,\"\")","v":""}]
[null,"",null,null,"Total",{"$f":"SUM(F1054:F1059)","v":0},{"$f":"SUM(G1054:G1059)","v":0}]
["","","","","","",{"$f":"IFERROR(VLOOKUP(E1061,'[1]Tarif de base'!D:E,2,FALSE)*F1061,\"\")","v":""},"","","",{"$f":"IFERROR(IF(G1067-H1061-I1061-J1061<>0,\"Attention il manque \"&G1067-H1061-I1061-J1061&\"€\",\"Règlement OK\"),\"Pas de règlement\")","v":"Pas de règlement"},"",null,151]
[null,"",null,null,{"$f":"IFERROR(INDIRECT(\"'C:\\Users\\Moi\\OneDrive\\Documents\\[Formulaires Gravereau.xlsx]Action\"&$N1061&\"'!$D$11\"),\"\")","v":""},{"$f":"IFERROR(INDIRECT(\"'C:\\Users\\Moi\\OneDrive\\Documents\\[Formulaires Gravereau.xlsx]Action\"&$N1061&\"'!$h$11\"),\"\")","v":""},{"$f":"IFERROR(VLOOKUP(E1062,'[1]Tarif de base'!D:E,2,FALSE)*F1062,\"\")","v":""}]
[null,"",null,null,"","",{"$f":"IFERROR(VLOOKUP(E1063,'[1]Tarif de base'!D:E,2,FALSE)*F1063,\"\")","v":""}]
[null,"",null,null,"","",{"$f":"IFERROR(VLOOKUP(E1064,'[1]Tarif de base'!D:E,2,FALSE)*F1064,\"\")","v":""}]
[null,"",null,null,"","",{"$f":"IFERROR(VLOOKUP(E1065,'[1]Tarif de base'!D:E,2,FALSE)*F1065,\"\")","v":""}]
[null,"",null,null,"","",{"$f":"IFERROR(VLOOKUP(E1066,'[1]Tarif de base'!D:E,2,FALSE)*F1066,\"\")","v":""}]
[null,"",null,null,"Total",{"$f":"SUM(F1061:F1066)","v":0},{"$f":"SUM(G1061:G1066)","v":0}]
["","","","","","",{"$f":"IFERROR(VLOOKUP(E1068,'[1]Tarif de base'!D:E,2,FALSE)*F1068,\"\")","v":""},"","","",{"$f":"IFERROR(IF(G1074-H1068-I1068-J1068<>0,\"Attention il manque \"&G1074-H1068-I1068-J1068&\"€\",\"Règlement OK\"),\"Pas de règlement\")","v":"Pas de règlement"},"",null,152]
[null,"",null,null,{"$f":"IFERROR(INDIRECT(\"'C:\\Users\\Moi\\OneDrive\\Documents\\[Formulaires Gravereau.xlsx]Action\"&$N1068&\"'!$D$11\"),\"\")","v":""},{"$f":"IFERROR(INDIRECT(\"'C:\\Users\\Moi\\OneDrive\\Documents\\[Formulaires Gravereau.xlsx]Action\"&$N1068&\"'!$h$11\"),\"\")","v":""},{"$f":"IFERROR(VLOOKUP(E1069,'[1]Tarif de base'!D:E,2,FALSE)*F1069,\"\")","v":""}]
[null,"",null,null,"","",{"$f":"IFERROR(VLOOKUP(E1070,'[1]Tarif de base'!D:E,2,FALSE)*F1070,\"\")","v":""}]
[null,"",null,null,"","",{"$f":"IFERROR(VLOOKUP(E1071,'[1]Tarif de base'!D:E,2,FALSE)*F1071,\"\")","v":""}]
[null,"",null,null,"","",{"$f":"IFERROR(VLOOKUP(E1072,'[1]Tarif de base'!D:E,2,FALSE)*F1072,\"\")","v":""}]
[null,"",null,null,"","",{"$f":"IFERROR(VLOOKUP(E1073,'[1]Tarif de base'!D:E,2,FALSE)*F1073,\"\")","v":""}]
[null,"",null,null,"Total",{"$f":"SUM(F1068:F1073)","v":0},{"$f":"SUM(G1068:G1073)","v":0}]
["","","","","","",{"$f":"IFERROR(VLOOKUP(E1075,'[1]Tarif de base'!D:E,2,FALSE)*F1075,\"\")","v":""},"","","",{"$f":"IFERROR(IF(G1081-H1075-I1075-J1075<>0,\"Attention il manque \"&G1081-H1075-I1075-J1075&\"€\",\"Règlement OK\"),\"Pas de règlement\")","v":"Pas de règlement"},"",null,153]
[null,"",null,null,{"$f":"IFERROR(INDIRECT(\"'C:\\Users\\Moi\\OneDrive\\Documents\\[Formulaires Gravereau.xlsx]Action\"&$N1075&\"'!$D$11\"),\"\")","v":""},{"$f":"IFERROR(INDIRECT(\"'C:\\Users\\Moi\\OneDrive\\Documents\\[Formulaires Gravereau.xlsx]Action\"&$N1075&\"'!$h$11\"),\"\")","v":""},{"$f":"IFERROR(VLOOKUP(E1076,'[1]Tarif de base'!D:E,2,FALSE)*F1076,\"\")","v":""}]
[null,"",null,null,"","",{"$f":"IFERROR(VLOOKUP(E1077,'[1]Tarif de base'!D:E,2,FALSE)*F1077,\"\")","v":""}]
[null,"",null,null,"","",{"$f":"IFERROR(VLOOKUP(E1078,'[1]Tarif de base'!D:E,2,FALSE)*F1078,\"\")","v":""}]
[null,"",null,null,"","",{"$f":"IFERROR(VLOOKUP(E1079,'[1]Tarif de base'!D:E,2,FALSE)*F1079,\"\")","v":""}]
[null,"",null,null,"","",{"$f":"IFERROR(VLOOKUP(E1080,'[1]Tarif de base'!D:E,2,FALSE)*F1080,\"\")","v":""}]
[null,"",null,null,"Total",{"$f":"SUM(F1075:F1080)","v":0},{"$f":"SUM(G1075:G1080)","v":0}]
[{"$f":"IFERROR(INDIRECT(\"'C:\\Users\\Moi\\OneDrive\\Documents\\[Formulaires Gravereau.xlsx]Action\"&$N1082&\"'!$D$6\"),\"\")","v":""},{"$f":"IF(C1082<>\"\",C1082,\"\")","v":""},{"$f":"IFERROR(INDIRECT(\"'C:\\Users\\Moi\\OneDrive\\Documents\\[Formulaires Gravereau.xlsx]Action\"&$N1082&\"'!$D$4\"),\"\")","v":""},{"$f":"IFERROR(INDIRECT(\"'C:\\Users\\Moi\\OneDrive\\Documents\\[Formulaires Gravereau.xlsx]Action\"&$N1082&\"'!$h$4\"),\"\")","v":""},{"$f":"IFERROR(INDIRECT(\"'C:\\Users\\Moi\\OneDrive\\Documents\\[Formulaires Gravereau.xlsx]Action\"&$N1082&\"'!$D$9\"),\"\")","v":""},{"$f":"IFERROR(INDIRECT(\"'C:\\Users\\Moi\\OneDrive\\Documents\\[Formulaires Gravereau.xlsx]Action\"&$N1082&\"'!$h$9\"),\"\")","v":""},{"$f":"IFERROR(VLOOKUP(E1082,'[1]Tarif de base'!D:E,2,FALSE)*F1082,\"\")","v":""},{"$f":"IFERROR(INDIRECT(\"'C:\\Users\\Moi\\OneDrive\\Documents\\[Formulaires Gravereau.xlsx]Action\"&$N1082&\"'!$d$26\"),\"\")","v":""},{"$f":"IFERROR(INDIRECT(\"'C:\\Users\\Moi\\OneDrive\\Documents\\[Formulaires Gravereau.xlsx]Action\"&$N1082&\"'!$d$28\"),\"\")","v":""},{"$f":"IFERROR(INDIRECT(\"'C:\\Users\\Moi\\OneDrive\\Documents\\[Formulaires Gravereau.xlsx]Action\"&$N1082&\"'!$h$26\"),\"\")","v":""},{"$f":"IFERROR(IF(G1088-H1082-I1082-J1082<>0,\"Attention il manque \"&G1088-H1082-I1082-J1082&\"€\",\"Règlement OK\"),\"Pas de règlement\")","v":"Pas de règlement"},{"$f":"IFERROR(INDIRECT(\"'C:\\Users\\Moi\\OneDrive\\Documents\\[Formulaires Gravereau.xlsx]Action\"&$N1082&\"'!$d$30\"),\"\")","v":""},null,154]
[null,"",null,null,{"$f":"IFERROR(INDIRECT(\"'C:\\Users\\Moi\\OneDrive\\Documents\\[Formulaires Gravereau.xlsx]Action\"&$N1082&\"'!$D$11\"),\"\")","v":""},{"$f":"IFERROR(INDIRECT(\"'C:\\Users\\Moi\\OneDrive\\Documents\\[Formulaires Gravereau.xlsx]Action\"&$N1082&\"'!$h$11\"),\"\")","v":""},{"$f":"IFERROR(VLOOKUP(E1083,'[1]Tarif de base'!D:E,2,FALSE)*F1083,\"\")","v":""}]
[null,"",null,null,{"$f":"IFERROR(INDIRECT(\"'C:\\Users\\Moi\\OneDrive\\Documents\\[Formulaires Gravereau.xlsx]Action\"&$N1082&\"'!$D$13\"),\"\")","v":""},{"$f":"IFERROR(INDIRECT(\"'C:\\Users\\Moi\\OneDrive\\Documents\\[Formulaires Gravereau.xlsx]Action\"&$N1082&\"'!$h$13\"),\"\")","v":""},{"$f":"IFERROR(VLOOKUP(E1084,'[1]Tarif de base'!D:E,2,FALSE)*F1084,\"\")","v":""}]
[null,"",null,null,{"$f":"IFERROR(INDIRECT(\"'C:\\Users\\Moi\\OneDrive\\Documents\\[Formulaires Gravereau.xlsx]Action\"&$N1082&\"'!$D$15\"),\"\")","v":""},{"$f":"IFERROR(INDIRECT(\"'C:\\Users\\Moi\\OneDrive\\Documents\\[Formulaires Gravereau.xlsx]Action\"&$N1082&\"'!$h$15\"),\"\")","v":""},{"$f":"IFERROR(VLOOKUP(E1085,'[1]Tarif de base'!D:E,2,FALSE)*F1085,\"\")","v":""}]
[null,"",null,null,{"$f":"IFERROR(INDIRECT(\"'C:\\Users\\Moi\\OneDrive\\Documents\\[Formulaires Gravereau.xlsx]Action\"&$N1082&\"'!$D$17\"),\"\")","v":""},{"$f":"IFERROR(INDIRECT(\"'C:\\Users\\Moi\\OneDrive\\Documents\\[Formulaires Gravereau.xlsx]Action\"&$N1082&\"'!$h$17\"),\"\")","v":""},{"$f":"IFERROR(VLOOKUP(E1086,'[1]Tarif de base'!D:E,2,FALSE)*F1086,\"\")","v":""}]
[null,"",null,null,{"$f":"IFERROR(INDIRECT(\"'C:\\Users\\Moi\\OneDrive\\Documents\\[Formulaires Gravereau.xlsx]Action\"&$N1082&\"'!$D$19\"),\"\")","v":""},{"$f":"IFERROR(INDIRECT(\"'C:\\Users\\Moi\\OneDrive\\Documents\\[Formulaires Gravereau.xlsx]Action\"&$N1082&\"'!$h$19\"),\"\")","v":""},{"$f":"IFERROR(VLOOKUP(E1087,'[1]Tarif de base'!D:E,2,FALSE)*F1087,\"\")","v":""}]
[null,"",null,null,"Total",{"$f":"SUM(F1082:F1087)","v":0},{"$f":"SUM(G1082:G1087)","v":0}]
["","","","","","",{"$f":"IFERROR(VLOOKUP(E1089,'[1]Tarif de base'!D:E,2,FALSE)*F1089,\"\")","v":""},"","","",{"$f":"IFERROR(IF(G1095-H1089-I1089-J1089<>0,\"Attention il manque \"&G1095-H1089-I1089-J1089&\"€\",\"Règlement OK\"),\"Pas de règlement\")","v":"Pas de règlement"},"",null,155]
[null,"",null,null,{"$f":"IFERROR(INDIRECT(\"'C:\\Users\\Moi\\OneDrive\\Documents\\[Formulaires Gravereau.xlsx]Action\"&$N1089&\"'!$D$11\"),\"\")","v":""},{"$f":"IFERROR(INDIRECT(\"'C:\\Users\\Moi\\OneDrive\\Documents\\[Formulaires Gravereau.xlsx]Action\"&$N1089&\"'!$h$11\"),\"\")","v":""},{"$f":"IFERROR(VLOOKUP(E1090,'[1]Tarif de base'!D:E,2,FALSE)*F1090,\"\")","v":""}]
[null,"",null,null,"","",{"$f":"IFERROR(VLOOKUP(E1091,'[1]Tarif de base'!D:E,2,FALSE)*F1091,\"\")","v":""}]
[null,"",null,null,"","",{"$f":"IFERROR(VLOOKUP(E1092,'[1]Tarif de base'!D:E,2,FALSE)*F1092,\"\")","v":""}]
[null,"",null,null,"","",{"$f":"IFERROR(VLOOKUP(E1093,'[1]Tarif de base'!D:E,2,FALSE)*F1093,\"\")","v":""}]
[null,"",null,null,"","",{"$f":"IFERROR(VLOOKUP(E1094,'[1]Tarif de base'!D:E,2,FALSE)*F1094,\"\")","v":""}]
[null,"",null,null,"Total",{"$f":"SUM(F1089:F1094)","v":0},{"$f":"SUM(G1089:G1094)","v":0}]
["","","","","","",{"$f":"IFERROR(VLOOKUP(E1096,'[1]Tarif de base'!D:E,2,FALSE)*F1096,\"\")","v":""},"","","",{"$f":"IFERROR(IF(G1102-H1096-I1096-J1096<>0,\"Attention il manque \"&G1102-H1096-I1096-J1096&\"€\",\"Règlement OK\"),\"Pas de règlement\")","v":"Pas de règlement"},"",null,156]
[null,"",null,null,{"$f":"IFERROR(INDIRECT(\"'C:\\Users\\Moi\\OneDrive\\Documents\\[Formulaires Gravereau.xlsx]Action\"&$N1096&\"'!$D$11\"),\"\")","v":""},{"$f":"IFERROR(INDIRECT(\"'C:\\Users\\Moi\\OneDrive\\Documents\\[Formulaires Gravereau.xlsx]Action\"&$N1096&\"'!$h$11\"),\"\")","v":""},{"$f":"IFERROR(VLOOKUP(E1097,'[1]Tarif de base'!D:E,2,FALSE)*F1097,\"\")","v":""}]
[null,"",null,null,"","",{"$f":"IFERROR(VLOOKUP(E1098,'[1]Tarif de base'!D:E,2,FALSE)*F1098,\"\")","v":""}]
[null,"",null,null,"","",{"$f":"IFERROR(VLOOKUP(E1099,'[1]Tarif de base'!D:E,2,FALSE)*F1099,\"\")","v":""}]
[null,"",null,null,"","",{"$f":"IFERROR(VLOOKUP(E1100,'[1]Tarif de base'!D:E,2,FALSE)*F1100,\"\")","v":""}]
[null,"",null,null,"","",{"$f":"IFERROR(VLOOKUP(E1101,'[1]Tarif de base'!D:E,2,FALSE)*F1101,\"\")","v":""}]
[null,"",null,null,"Total",{"$f":"SUM(F1096:F1101)","v":0},{"$f":"SUM(G1096:G1101)","v":0}]
["","","","","","",{"$f":"IFERROR(VLOOKUP(E1103,'[1]Tarif de base'!D:E,2,FALSE)*F1103,\"\")","v":""},"","","",{"$f":"IFERROR(IF(G1109-H1103-I1103-J1103<>0,\"Attention il manque \"&G1109-H1103-I1103-J1103&\"€\",\"Règlement OK\"),\"Pas de règlement\")","v":"Pas de règlement"},"",null,157]
[null,"",null,null,{"$f":"IFERROR(INDIRECT(\"'C:\\Users\\Moi\\OneDrive\\Documents\\[Formulaires Gravereau.xlsx]Action\"&$N1103&\"'!$D$11\"),\"\")","v":""},{"$f":"IFERROR(INDIRECT(\"'C:\\Users\\Moi\\OneDrive\\Documents\\[Formulaires Gravereau.xlsx]Action\"&$N1103&\"'!$h$11\"),\"\")","v":""},{"$f":"IFERROR(VLOOKUP(E1104,'[1]Tarif de base'!D:E,2,FALSE)*F1104,\"\")","v":""}]
[null,"",null,null,"","",{"$f":"IFERROR(VLOOKUP(E1105,'[1]Tarif de base'!D:E,2,FALSE)*F1105,\"\")","v":""}]
[null,"",null,null,"","",{"$f":"IFERROR(VLOOKUP(E1106,'[1]Tarif de base'!D:E,2,FALSE)*F1106,\"\")","v":""}]
[null,"",null,null,"","",{"$f":"IFERROR(VLOOKUP(E1107,'[1]Tarif de base'!D:E,2,FALSE)*F1107,\"\")","v":""}]
[null,{"$f":"B1107","v":""},null,null,"","",{"$f":"IFERROR(VLOOKUP(E1108,'[1]Tarif de base'!D:E,2,FALSE)*F1108,\"\")","v":""}]
[null,"",null,null,"Total",{"$f":"SUM(F1103:F1108)","v":0},{"$f":"SUM(G1103:G1108)","v":0}]
["","","","","","",{"$f":"IFERROR(VLOOKUP(E1110,'[1]Tarif de base'!D:E,2,FALSE)*F1110,\"\")","v":""},"","","",{"$f":"IFERROR(IF(G1116-H1110-I1110-J1110<>0,\"Attention il manque \"&G1116-H1110-I1110-J1110&\"€\",\"Règlement OK\"),\"Pas de règlement\")","v":"Pas de règlement"},"",null,158]
[null,"",null,null,{"$f":"IFERROR(INDIRECT(\"'C:\\Users\\Moi\\OneDrive\\Documents\\[Formulaires Gravereau.xlsx]Action\"&$N1110&\"'!$D$11\"),\"\")","v":""},{"$f":"IFERROR(INDIRECT(\"'C:\\Users\\Moi\\OneDrive\\Documents\\[Formulaires Gravereau.xlsx]Action\"&$N1110&\"'!$h$11\"),\"\")","v":""},{"$f":"IFERROR(VLOOKUP(E1111,'[1]Tarif de base'!D:E,2,FALSE)*F1111,\"\")","v":""}]
[null,"",null,null,"","",{"$f":"IFERROR(VLOOKUP(E1112,'[1]Tarif de base'!D:E,2,FALSE)*F1112,\"\")","v":""}]
[null,"",null,null,"","",{"$f":"IFERROR(VLOOKUP(E1113,'[1]Tarif de base'!D:E,2,FALSE)*F1113,\"\")","v":""}]
[null,"",null,null,"","",{"$f":"IFERROR(VLOOKUP(E1114,'[1]Tarif de base'!D:E,2,FALSE)*F1114,\"\")","v":""}]
[null,"",null,null,"","",{"$f":"IFERROR(VLOOKUP(E1115,'[1]Tarif de base'!D:E,2,FALSE)*F1115,\"\")","v":""}]
[null,"",null,null,"Total",{"$f":"SUM(F1110:F1115)","v":0},{"$f":"SUM(G1110:G1115)","v":0}]
["","","","","","",{"$f":"IFERROR(VLOOKUP(E1117,'[1]Tarif de base'!D:E,2,FALSE)*F1117,\"\")","v":""},"","","",{"$f":"IFERROR(IF(G1123-H1117-I1117-J1117<>0,\"Attention il manque \"&G1123-H1117-I1117-J1117&\"€\",\"Règlement OK\"),\"Pas de règlement\")","v":"Pas de règlement"},"",null,159]
[null,"",null,null,{"$f":"IFERROR(INDIRECT(\"'C:\\Users\\Moi\\OneDrive\\Documents\\[Formulaires Gravereau.xlsx]Action\"&$N1117&\"'!$D$11\"),\"\")","v":""},{"$f":"IFERROR(INDIRECT(\"'C:\\Users\\Moi\\OneDrive\\Documents\\[Formulaires Gravereau.xlsx]Action\"&$N1117&\"'!$h$11\"),\"\")","v":""},{"$f":"IFERROR(VLOOKUP(E1118,'[1]Tarif de base'!D:E,2,FALSE)*F1118,\"\")","v":""}]
[null,"",null,null,"","",{"$f":"IFERROR(VLOOKUP(E1119,'[1]Tarif de base'!D:E,2,FALSE)*F1119,\"\")","v":""}]
[null,"",null,null,"","",{"$f":"IFERROR(VLOOKUP(E1120,'[1]Tarif de base'!D:E,2,FALSE)*F1120,\"\")","v":""}]
[null,"",null,null,"","",{"$f":"IFERROR(VLOOKUP(E1121,'[1]Tarif de base'!D:E,2,FALSE)*F1121,\"\")","v":""}]
[null,"",null,null,"","",{"$f":"IFERROR(VLOOKUP(E1122,'[1]Tarif de base'!D:E,2,FALSE)*F1122,\"\")","v":""}]
[null,"",null,null,"Total",{"$f":"SUM(F1117:F1122)","v":0},{"$f":"SUM(G1117:G1122)","v":0}]
["","","","","","",{"$f":"IFERROR(VLOOKUP(E1124,'[1]Tarif de base'!D:E,2,FALSE)*F1124,\"\")","v":""},"","","",{"$f":"IFERROR(IF(G1130-H1124-I1124-J1124<>0,\"Attention il manque \"&G1130-H1124-I1124-J1124&\"€\",\"Règlement OK\"),\"Pas de règlement\")","v":"Pas de règlement"},"",null,160]
[null,"",null,null,{"$f":"IFERROR(INDIRECT(\"'C:\\Users\\Moi\\OneDrive\\Documents\\[Formulaires Gravereau.xlsx]Action\"&$N1124&\"'!$D$11\"),\"\")","v":""},{"$f":"IFERROR(INDIRECT(\"'C:\\Users\\Moi\\OneDrive\\Documents\\[Formulaires Gravereau.xlsx]Action\"&$N1124&\"'!$h$11\"),\"\")","v":""},{"$f":"IFERROR(VLOOKUP(E1125,'[1]Tarif de base'!D:E,2,FALSE)*F1125,\"\")","v":""}]
[null,"",null,null,"","",{"$f":"IFERROR(VLOOKUP(E1126,'[1]Tarif de base'!D:E,2,FALSE)*F1126,\"\")","v":""}]
[null,"",null,null,"","",{"$f":"IFERROR(VLOOKUP(E1127,'[1]Tarif de base'!D:E,2,FALSE)*F1127,\"\")","v":""}]
[null,"",null,null,"","",{"$f":"IFERROR(VLOOKUP(E1128,'[1]Tarif de base'!D:E,2,FALSE)*F1128,\"\")","v":""}]
[null,"",null,null,"","",{"$f":"IFERROR(VLOOKUP(E1129,'[1]Tarif de base'!D:E,2,FALSE)*F1129,\"\")","v":""}]
[null,"",null,null,"Total",{"$f":"SUM(F1124:F1129)","v":0},{"$f":"SUM(G1124:G1129)","v":0}]
["","","","","","",{"$f":"IFERROR(VLOOKUP(E1131,'[1]Tarif de base'!D:E,2,FALSE)*F1131,\"\")","v":""},"","","",{"$f":"IFERROR(IF(G1137-H1131-I1131-J1131<>0,\"Attention il manque \"&G1137-H1131-I1131-J1131&\"€\",\"Règlement OK\"),\"Pas de règlement\")","v":"Pas de règlement"},"",null,161]
[null,"",null,null,{"$f":"IFERROR(INDIRECT(\"'C:\\Users\\Moi\\OneDrive\\Documents\\[Formulaires Gravereau.xlsx]Action\"&$N1131&\"'!$D$11\"),\"\")","v":""},{"$f":"IFERROR(INDIRECT(\"'C:\\Users\\Moi\\OneDrive\\Documents\\[Formulaires Gravereau.xlsx]Action\"&$N1131&\"'!$h$11\"),\"\")","v":""},{"$f":"IFERROR(VLOOKUP(E1132,'[1]Tarif de base'!D:E,2,FALSE)*F1132,\"\")","v":""}]
[null,"",null,null,"","",{"$f":"IFERROR(VLOOKUP(E1133,'[1]Tarif de base'!D:E,2,FALSE)*F1133,\"\")","v":""}]
[null,"",null,null,"","",{"$f":"IFERROR(VLOOKUP(E1134,'[1]Tarif de base'!D:E,2,FALSE)*F1134,\"\")","v":""}]
[null,"",null,null,"","",{"$f":"IFERROR(VLOOKUP(E1135,'[1]Tarif de base'!D:E,2,FALSE)*F1135,\"\")","v":""}]
[null,"",null,null,"","",{"$f":"IFERROR(VLOOKUP(E1136,'[1]Tarif de base'!D:E,2,FALSE)*F1136,\"\")","v":""}]
[null,"",null,null,"Total",{"$f":"SUM(F1131:F1136)","v":0},{"$f":"SUM(G1131:G1136)","v":0}]
["","","","","","",{"$f":"IFERROR(VLOOKUP(E1138,'[1]Tarif de base'!D:E,2,FALSE)*F1138,\"\")","v":""},"","","",{"$f":"IFERROR(IF(G1144-H1138-I1138-J1138<>0,\"Attention il manque \"&G1144-H1138-I1138-J1138&\"€\",\"Règlement OK\"),\"Pas de règlement\")","v":"Pas de règlement"},"",null,162]
[null,"",null,null,{"$f":"IFERROR(INDIRECT(\"'C:\\Users\\Moi\\OneDrive\\Documents\\[Formulaires Gravereau.xlsx]Action\"&$N1138&\"'!$D$11\"),\"\")","v":""},{"$f":"IFERROR(INDIRECT(\"'C:\\Users\\Moi\\OneDrive\\Documents\\[Formulaires Gravereau.xlsx]Action\"&$N1138&\"'!$h$11\"),\"\")","v":""},{"$f":"IFERROR(VLOOKUP(E1139,'[1]Tarif de base'!D:E,2,FALSE)*F1139,\"\")","v":""}]
[null,"",null,null,"","",{"$f":"IFERROR(VLOOKUP(E1140,'[1]Tarif de base'!D:E,2,FALSE)*F1140,\"\")","v":""}]
[null,"",null,null,"","",{"$f":"IFERROR(VLOOKUP(E1141,'[1]Tarif de base'!D:E,2,FALSE)*F1141,\"\")","v":""}]
[null,"",null,null,"","",{"$f":"IFERROR(VLOOKUP(E1142,'[1]Tarif de base'!D:E,2,FALSE)*F1142,\"\")","v":""}]
[null,"",null,null,"","",{"$f":"IFERROR(VLOOKUP(E1143,'[1]Tarif de base'!D:E,2,FALSE)*F1143,\"\")","v":""}]
[null,"",null,null,"Total",{"$f":"SUM(F1138:F1143)","v":0},{"$f":"SUM(G1138:G1143)","v":0}]
["","","","","","",{"$f":"IFERROR(VLOOKUP(E1145,'[1]Tarif de base'!D:E,2,FALSE)*F1145,\"\")","v":""},"","","",{"$f":"IFERROR(IF(G1151-H1145-I1145-J1145<>0,\"Attention il manque \"&G1151-H1145-I1145-J1145&\"€\",\"Règlement OK\"),\"Pas de règlement\")","v":"Pas de règlement"},"",null,163]
[null,"",null,null,{"$f":"IFERROR(INDIRECT(\"'C:\\Users\\Moi\\OneDrive\\Documents\\[Formulaires Gravereau.xlsx]Action\"&$N1145&\"'!$D$11\"),\"\")","v":""},{"$f":"IFERROR(INDIRECT(\"'C:\\Users\\Moi\\OneDrive\\Documents\\[Formulaires Gravereau.xlsx]Action\"&$N1145&\"'!$h$11\"),\"\")","v":""},{"$f":"IFERROR(VLOOKUP(E1146,'[1]Tarif de base'!D:E,2,FALSE)*F1146,\"\")","v":""}]
[null,"",null,null,"","",{"$f":"IFERROR(VLOOKUP(E1147,'[1]Tarif de base'!D:E,2,FALSE)*F1147,\"\")","v":""}]
[null,"",null,null,"","",{"$f":"IFERROR(VLOOKUP(E1148,'[1]Tarif de base'!D:E,2,FALSE)*F1148,\"\")","v":""}]
[null,"",null,null,"","",{"$f":"IFERROR(VLOOKUP(E1149,'[1]Tarif de base'!D:E,2,FALSE)*F1149,\"\")","v":""}]
[null,"",null,null,"","",{"$f":"IFERROR(VLOOKUP(E1150,'[1]Tarif de base'!D:E,2,FALSE)*F1150,\"\")","v":""}]
[null,"",null,null,"Total",{"$f":"SUM(F1145:F1150)","v":0},{"$f":"SUM(G1145:G1150)","v":0}]
[{"$f":"IFERROR(INDIRECT(\"'C:\\Users\\Moi\\OneDrive\\Documents\\[Formulaires Gravereau.xlsx]Action\"&$N1152&\"'!$D$6\"),\"\")","v":""},{"$f":"IF(C1152<>\"\",C1152,\"\")","v":""},{"$f":"IFERROR(INDIRECT(\"'C:\\Users\\Moi\\OneDrive\\Documents\\[Formulaires Gravereau.xlsx]Action\"&$N1152&\"'!$D$4\"),\"\")","v":""},{"$f":"IFERROR(INDIRECT(\"'C:\\Users\\Moi\\OneDrive\\Documents\\[Formulaires Gravereau.xlsx]Action\"&$N1152&\"'!$h$4\"),\"\")","v":""},{"$f":"IFERROR(INDIRECT(\"'C:\\Users\\Moi\\OneDrive\\Documents\\[Formulaires Gravereau.xlsx]Action\"&$N1152&\"'!$D$9\"),\"\")","v":""},{"$f":"IFERROR(INDIRECT(\"'C:\\Users\\Moi\\OneDrive\\Documents\\[Formulaires Gravereau.xlsx]Action\"&$N1152&\"'!$h$9\"),\"\")","v":""},{"$f":"IFERROR(VLOOKUP(E1152,'[1]Tarif de base'!D:E,2,FALSE)*F1152,\"\")","v":""},{"$f":"IFERROR(INDIRECT(\"'C:\\Users\\Moi\\OneDrive\\Documents\\[Formulaires Gravereau.xlsx]Action\"&$N1152&\"'!$d$26\"),\"\")","v":""},{"$f":"IFERROR(INDIRECT(\"'C:\\Users\\Moi\\OneDrive\\Documents\\[Formulaires Gravereau.xlsx]Action\"&$N1152&\"'!$d$28\"),\"\")","v":""},{"$f":"IFERROR(INDIRECT(\"'C:\\Users\\Moi\\OneDrive\\Documents\\[Formulaires Gravereau.xlsx]Action\"&$N1152&\"'!$h$26\"),\"\")","v":""},{"$f":"IFERROR(IF(G1158-H1152-I1152-J1152<>0,\"Attention il manque \"&G1158-H1152-I1152-J1152&\"€\",\"Règlement OK\"),\"Pas de règlement\")","v":"Pas de règlement"},{"$f":"IFERROR(INDIRECT(\"'C:\\Users\\Moi\\OneDrive\\Documents\\[Formulaires Gravereau.xlsx]Action\"&$N1152&\"'!$d$30\"),\"\")","v":""},null,164]
[null,"",null,null,{"$f":"IFERROR(INDIRECT(\"'C:\\Users\\Moi\\OneDrive\\Documents\\[Formulaires Gravereau.xlsx]Action\"&$N1152&\"'!$D$11\"),\"\")","v":""},{"$f":"IFERROR(INDIRECT(\"'C:\\Users\\Moi\\OneDrive\\Documents\\[Formulaires Gravereau.xlsx]Action\"&$N1152&\"'!$h$11\"),\"\")","v":""},{"$f":"IFERROR(VLOOKUP(E1153,'[1]Tarif de base'!D:E,2,FALSE)*F1153,\"\")","v":""}]
[null,"",null,null,{"$f":"IFERROR(INDIRECT(\"'C:\\Users\\Moi\\OneDrive\\Documents\\[Formulaires Gravereau.xlsx]Action\"&$N1152&\"'!$D$13\"),\"\")","v":""},{"$f":"IFERROR(INDIRECT(\"'C:\\Users\\Moi\\OneDrive\\Documents\\[Formulaires Gravereau.xlsx]Action\"&$N1152&\"'!$h$13\"),\"\")","v":""},{"$f":"IFERROR(VLOOKUP(E1154,'[1]Tarif de base'!D:E,2,FALSE)*F1154,\"\")","v":""}]
[null,"",null,null,{"$f":"IFERROR(INDIRECT(\"'C:\\Users\\Moi\\OneDrive\\Documents\\[Formulaires Gravereau.xlsx]Action\"&$N1152&\"'!$D$15\"),\"\")","v":""},{"$f":"IFERROR(INDIRECT(\"'C:\\Users\\Moi\\OneDrive\\Documents\\[Formulaires Gravereau.xlsx]Action\"&$N1152&\"'!$h$15\"),\"\")","v":""},{"$f":"IFERROR(VLOOKUP(E1155,'[1]Tarif de base'!D:E,2,FALSE)*F1155,\"\")","v":""}]
[null,"",null,null,{"$f":"IFERROR(INDIRECT(\"'C:\\Users\\Moi\\OneDrive\\Documents\\[Formulaires Gravereau.xlsx]Action\"&$N1152&\"'!$D$17\"),\"\")","v":""},{"$f":"IFERROR(INDIRECT(\"'C:\\Users\\Moi\\OneDrive\\Documents\\[Formulaires Gravereau.xlsx]Action\"&$N1152&\"'!$h$17\"),\"\")","v":""},{"$f":"IFERROR(VLOOKUP(E1156,'[1]Tarif de base'!D:E,2,FALSE)*F1156,\"\")","v":""}]
[null,"",null,null,{"$f":"IFERROR(INDIRECT(\"'C:\\Users\\Moi\\OneDrive\\Documents\\[Formulaires Gravereau.xlsx]Action\"&$N1152&\"'!$D$19\"),\"\")","v":""},{"$f":"IFERROR(INDIRECT(\"'C:\\Users\\Moi\\OneDrive\\Documents\\[Formulaires Gravereau.xlsx]Action\"&$N1152&\"'!$h$19\"),\"\")","v":""},{"$f":"IFERROR(VLOOKUP(E1157,'[1]Tarif de base'!D:E,2,FALSE)*F1157,\"\")","v":""}]
[null,"",null,null,"Total",{"$f":"SUM(F1152:F1157)","v":0},{"$f":"SUM(G1152:G1157)","v":0}]
["","","","","","",{"$f":"IFERROR(VLOOKUP(E1159,'[1]Tarif de base'!D:E,2,FALSE)*F1159,\"\")","v":""},"","","",{"$f":"IFERROR(IF(G1165-H1159-I1159-J1159<>0,\"Attention il manque \"&G1165-H1159-I1159-J1159&\"€\",\"Règlement OK\"),\"Pas de règlement\")","v":"Pas de règlement"},"",null,165]
[null,"",null,null,{"$f":"IFERROR(INDIRECT(\"'C:\\Users\\Moi\\OneDrive\\Documents\\[Formulaires Gravereau.xlsx]Action\"&$N1159&\"'!$D$11\"),\"\")","v":""},{"$f":"IFERROR(INDIRECT(\"'C:\\Users\\Moi\\OneDrive\\Documents\\[Formulaires Gravereau.xlsx]Action\"&$N1159&\"'!$h$11\"),\"\")","v":""},{"$f":"IFERROR(VLOOKUP(E1160,'[1]Tarif de base'!D:E,2,FALSE)*F1160,\"\")","v":""}]
[null,"",null,null,"","",{"$f":"IFERROR(VLOOKUP(E1161,'[1]Tarif de base'!D:E,2,FALSE)*F1161,\"\")","v":""}]
[null,"",null,null,"","",{"$f":"IFERROR(VLOOKUP(E1162,'[1]Tarif de base'!D:E,2,FALSE)*F1162,\"\")","v":""}]
[null,"",null,null,"","",{"$f":"IFERROR(VLOOKUP(E1163,'[1]Tarif de base'!D:E,2,FALSE)*F1163,\"\")","v":""}]
[null,"",null,null,"","",{"$f":"IFERROR(VLOOKUP(E1164,'[1]Tarif de base'!D:E,2,FALSE)*F1164,\"\")","v":""}]
[null,"",null,null,"Total",{"$f":"SUM(F1159:F1164)","v":0},{"$f":"SUM(G1159:G1164)","v":0}]
["","","","","","",{"$f":"IFERROR(VLOOKUP(E1166,'[1]Tarif de base'!D:E,2,FALSE)*F1166,\"\")","v":""},"","","",{"$f":"IFERROR(IF(G1172-H1166-I1166-J1166<>0,\"Attention il manque \"&G1172-H1166-I1166-J1166&\"€\",\"Règlement OK\"),\"Pas de règlement\")","v":"Pas de règlement"},"",null,166]
[null,"",null,null,{"$f":"IFERROR(INDIRECT(\"'C:\\Users\\Moi\\OneDrive\\Documents\\[Formulaires Gravereau.xlsx]Action\"&$N1166&\"'!$D$11\"),\"\")","v":""},{"$f":"IFERROR(INDIRECT(\"'C:\\Users\\Moi\\OneDrive\\Documents\\[Formulaires Gravereau.xlsx]Action\"&$N1166&\"'!$h$11\"),\"\")","v":""},{"$f":"IFERROR(VLOOKUP(E1167,'[1]Tarif de base'!D:E,2,FALSE)*F1167,\"\")","v":""}]
[null,"",null,null,"","",{"$f":"IFERROR(VLOOKUP(E1168,'[1]Tarif de base'!D:E,2,FALSE)*F1168,\"\")","v":""}]
[null,"",null,null,"","",{"$f":"IFERROR(VLOOKUP(E1169,'[1]Tarif de base'!D:E,2,FALSE)*F1169,\"\")","v":""}]
[null,"",null,null,"","",{"$f":"IFERROR(VLOOKUP(E1170,'[1]Tarif de base'!D:E,2,FALSE)*F1170,\"\")","v":""}]
[null,"",null,null,"","",{"$f":"IFERROR(VLOOKUP(E1171,'[1]Tarif de base'!D:E,2,FALSE)*F1171,\"\")","v":""}]
[null,{"$f":"B1171","v":""},null,null,"Total",{"$f":"SUM(F1166:F1171)","v":0},{"$f":"SUM(G1166:G1171)","v":0}]
["","","","","","",{"$f":"IFERROR(VLOOKUP(E1173,'[1]Tarif de base'!D:E,2,FALSE)*F1173,\"\")","v":""},"","","",{"$f":"IFERROR(IF(G1179-H1173-I1173-J1173<>0,\"Attention il manque \"&G1179-H1173-I1173-J1173&\"€\",\"Règlement OK\"),\"Pas de règlement\")","v":"Pas de règlement"},"",null,167]
[null,"",null,null,{"$f":"IFERROR(INDIRECT(\"'C:\\Users\\Moi\\OneDrive\\Documents\\[Formulaires Gravereau.xlsx]Action\"&$N1173&\"'!$D$11\"),\"\")","v":""},{"$f":"IFERROR(INDIRECT(\"'C:\\Users\\Moi\\OneDrive\\Documents\\[Formulaires Gravereau.xlsx]Action\"&$N1173&\"'!$h$11\"),\"\")","v":""},{"$f":"IFERROR(VLOOKUP(E1174,'[1]Tarif de base'!D:E,2,FALSE)*F1174,\"\")","v":""}]
[null,"",null,null,"","",{"$f":"IFERROR(VLOOKUP(E1175,'[1]Tarif de base'!D:E,2,FALSE)*F1175,\"\")","v":""}]
[null,"",null,null,"","",{"$f":"IFERROR(VLOOKUP(E1176,'[1]Tarif de base'!D:E,2,FALSE)*F1176,\"\")","v":""}]
[null,"",null,null,"","",{"$f":"IFERROR(VLOOKUP(E1177,'[1]Tarif de base'!D:E,2,FALSE)*F1177,\"\")","v":""}]
[null,"",null,null,"","",{"$f":"IFERROR(VLOOKUP(E1178,'[1]Tarif de base'!D:E,2,FALSE)*F1178,\"\")","v":""}]
[null,"",null,null,"Total",{"$f":"SUM(F1173:F1178)","v":0},{"$f":"SUM(G1173:G1178)","v":0}]
["","","","","","",{"$f":"IFERROR(VLOOKUP(E1180,'[1]Tarif de base'!D:E,2,FALSE)*F1180,\"\")","v":""},"","","",{"$f":"IFERROR(IF(G1186-H1180-I1180-J1180<>0,\"Attention il manque \"&G1186-H1180-I1180-J1180&\"€\",\"Règlement OK\"),\"Pas de règlement\")","v":"Pas de règlement"},"",null,168]
[null,"",null,null,{"$f":"IFERROR(INDIRECT(\"'C:\\Users\\Moi\\OneDrive\\Documents\\[Formulaires Gravereau.xlsx]Action\"&$N1180&\"'!$D$11\"),\"\")","v":""},{"$f":"IFERROR(INDIRECT(\"'C:\\Users\\Moi\\OneDrive\\Documents\\[Formulaires Gravereau.xlsx]Action\"&$N1180&\"'!$h$11\"),\"\")","v":""},{"$f":"IFERROR(VLOOKUP(E1181,'[1]Tarif de base'!D:E,2,FALSE)*F1181,\"\")","v":""}]
[null,"",null,null,"","",{"$f":"IFERROR(VLOOKUP(E1182,'[1]Tarif de base'!D:E,2,FALSE)*F1182,\"\")","v":""}]
[null,"",null,null,"","",{"$f":"IFERROR(VLOOKUP(E1183,'[1]Tarif de base'!D:E,2,FALSE)*F1183,\"\")","v":""}]
[null,"",null,null,"","",{"$f":"IFERROR(VLOOKUP(E1184,'[1]Tarif de base'!D:E,2,FALSE)*F1184,\"\")","v":""}]
[null,"",null,null,"","",{"$f":"IFERROR(VLOOKUP(E1185,'[1]Tarif de base'!D:E,2,FALSE)*F1185,\"\")","v":""}]
[null,"",null,null,"Total",{"$f":"SUM(F1180:F1185)","v":0},{"$f":"SUM(G1180:G1185)","v":0}]
["","","","","","",{"$f":"IFERROR(VLOOKUP(E1187,'[1]Tarif de base'!D:E,2,FALSE)*F1187,\"\")","v":""},"","","",{"$f":"IFERROR(IF(G1193-H1187-I1187-J1187<>0,\"Attention il manque \"&G1193-H1187-I1187-J1187&\"€\",\"Règlement OK\"),\"Pas de règlement\")","v":"Pas de règlement"},"",null,169]
[null,"",null,null,{"$f":"IFERROR(INDIRECT(\"'C:\\Users\\Moi\\OneDrive\\Documents\\[Formulaires Gravereau.xlsx]Action\"&$N1187&\"'!$D$11\"),\"\")","v":""},{"$f":"IFERROR(INDIRECT(\"'C:\\Users\\Moi\\OneDrive\\Documents\\[Formulaires Gravereau.xlsx]Action\"&$N1187&\"'!$h$11\"),\"\")","v":""},{"$f":"IFERROR(VLOOKUP(E1188,'[1]Tarif de base'!D:E,2,FALSE)*F1188,\"\")","v":""}]
[null,"",null,null,"","",{"$f":"IFERROR(VLOOKUP(E1189,'[1]Tarif de base'!D:E,2,FALSE)*F1189,\"\")","v":""}]
[null,"",null,null,"","",{"$f":"IFERROR(VLOOKUP(E1190,'[1]Tarif de base'!D:E,2,FALSE)*F1190,\"\")","v":""}]
[null,"",null,null,"","",{"$f":"IFERROR(VLOOKUP(E1191,'[1]Tarif de base'!D:E,2,FALSE)*F1191,\"\")","v":""}]
[null,"",null,null,"","",{"$f":"IFERROR(VLOOKUP(E1192,'[1]Tarif de base'!D:E,2,FALSE)*F1192,\"\")","v":""}]
[null,"",null,null,"Total",{"$f":"SUM(F1187:F1192)","v":0},{"$f":"SUM(G1187:G1192)","v":0}]
["","","","","","",{"$f":"IFERROR(VLOOKUP(E1194,'[1]Tarif de base'!D:E,2,FALSE)*F1194,\"\")","v":""},"","","",{"$f":"IFERROR(IF(G1200-H1194-I1194-J1194<>0,\"Attention il manque \"&G1200-H1194-I1194-J1194&\"€\",\"Règlement OK\"),\"Pas de règlement\")","v":"Pas de règlement"},"",null,170]
[null,"",null,null,{"$f":"IFERROR(INDIRECT(\"'C:\\Users\\Moi\\OneDrive\\Documents\\[Formulaires Gravereau.xlsx]Action\"&$N1194&\"'!$D$11\"),\"\")","v":""},{"$f":"IFERROR(INDIRECT(\"'C:\\Users\\Moi\\OneDrive\\Documents\\[Formulaires Gravereau.xlsx]Action\"&$N1194&\"'!$h$11\"),\"\")","v":""},{"$f":"IFERROR(VLOOKUP(E1195,'[1]Tarif de base'!D:E,2,FALSE)*F1195,\"\")","v":""}]
[null,"",null,null,"","",{"$f":"IFERROR(VLOOKUP(E1196,'[1]Tarif de base'!D:E,2,FALSE)*F1196,\"\")","v":""}]
[null,"",null,null,"","",{"$f":"IFERROR(VLOOKUP(E1197,'[1]Tarif de base'!D:E,2,FALSE)*F1197,\"\")","v":""}]
[null,"",null,null,"","",{"$f":"IFERROR(VLOOKUP(E1198,'[1]Tarif de base'!D:E,2,FALSE)*F1198,\"\")","v":""}]
[null,"",null,null,"","",{"$f":"IFERROR(VLOOKUP(E1199,'[1]Tarif de base'!D:E,2,FALSE)*F1199,\"\")","v":""}]
[null,"",null,null,"Total",{"$f":"SUM(F1194:F1199)","v":0},{"$f":"SUM(G1194:G1199)","v":0}]
["","","","","","",{"$f":"IFERROR(VLOOKUP(E1201,'[1]Tarif de base'!D:E,2,FALSE)*F1201,\"\")","v":""},"","","",{"$f":"IFERROR(IF(G1207-H1201-I1201-J1201<>0,\"Attention il manque \"&G1207-H1201-I1201-J1201&\"€\",\"Règlement OK\"),\"Pas de règlement\")","v":"Pas de règlement"},"",null,171]
[null,"",null,null,{"$f":"IFERROR(INDIRECT(\"'C:\\Users\\Moi\\OneDrive\\Documents\\[Formulaires Gravereau.xlsx]Action\"&$N1201&\"'!$D$11\"),\"\")","v":""},{"$f":"IFERROR(INDIRECT(\"'C:\\Users\\Moi\\OneDrive\\Documents\\[Formulaires Gravereau.xlsx]Action\"&$N1201&\"'!$h$11\"),\"\")","v":""},{"$f":"IFERROR(VLOOKUP(E1202,'[1]Tarif de base'!D:E,2,FALSE)*F1202,\"\")","v":""}]
[null,"",null,null,"","",{"$f":"IFERROR(VLOOKUP(E1203,'[1]Tarif de base'!D:E,2,FALSE)*F1203,\"\")","v":""}]
[null,"",null,null,"","",{"$f":"IFERROR(VLOOKUP(E1204,'[1]Tarif de base'!D:E,2,FALSE)*F1204,\"\")","v":""}]
[null,"",null,null,"","",{"$f":"IFERROR(VLOOKUP(E1205,'[1]Tarif de base'!D:E,2,FALSE)*F1205,\"\")","v":""}]
[null,"",null,null,"","",{"$f":"IFERROR(VLOOKUP(E1206,'[1]Tarif de base'!D:E,2,FALSE)*F1206,\"\")","v":""}]
[null,"",null,null,"Total",{"$f":"SUM(F1201:F1206)","v":0},{"$f":"SUM(G1201:G1206)","v":0}]
["","","","","","",{"$f":"IFERROR(VLOOKUP(E1208,'[1]Tarif de base'!D:E,2,FALSE)*F1208,\"\")","v":""},"","","",{"$f":"IFERROR(IF(G1214-H1208-I1208-J1208<>0,\"Attention il manque \"&G1214-H1208-I1208-J1208&\"€\",\"Règlement OK\"),\"Pas de règlement\")","v":"Pas de règlement"},"",null,172]
[null,"",null,null,{"$f":"IFERROR(INDIRECT(\"'C:\\Users\\Moi\\OneDrive\\Documents\\[Formulaires Gravereau.xlsx]Action\"&$N1208&\"'!$D$11\"),\"\")","v":""},{"$f":"IFERROR(INDIRECT(\"'C:\\Users\\Moi\\OneDrive\\Documents\\[Formulaires Gravereau.xlsx]Action\"&$N1208&\"'!$h$11\"),\"\")","v":""},{"$f":"IFERROR(VLOOKUP(E1209,'[1]Tarif de base'!D:E,2,FALSE)*F1209,\"\")","v":""}]
[null,"",null,null,"","",{"$f":"IFERROR(VLOOKUP(E1210,'[1]Tarif de base'!D:E,2,FALSE)*F1210,\"\")","v":""}]
[null,"",null,null,"","",{"$f":"IFERROR(VLOOKUP(E1211,'[1]Tarif de base'!D:E,2,FALSE)*F1211,\"\")","v":""}]
[null,"",null,null,"","",{"$f":"IFERROR(VLOOKUP(E1212,'[1]Tarif de base'!D:E,2,FALSE)*F1212,\"\")","v":""}]
[null,"",null,null,"","",{"$f":"IFERROR(VLOOKUP(E1213,'[1]Tarif de base'!D:E,2,FALSE)*F1213,\"\")","v":""}]
[null,"",null,null,"Total",{"$f":"SUM(F1208:F1213)","v":0},{"$f":"SUM(G1208:G1213)","v":0}]
["","","","","","",{"$f":"IFERROR(VLOOKUP(E1215,'[1]Tarif de base'!D:E,2,FALSE)*F1215,\"\")","v":""},"","","",{"$f":"IFERROR(IF(G1221-H1215-I1215-J1215<>0,\"Attention il manque \"&G1221-H1215-I1215-J1215&\"€\",\"Règlement OK\"),\"Pas de règlement\")","v":"Pas de règlement"},"",null,173]
[null,"",null,null,{"$f":"IFERROR(INDIRECT(\"'C:\\Users\\Moi\\OneDrive\\Documents\\[Formulaires Gravereau.xlsx]Action\"&$N1215&\"'!$D$11\"),\"\")","v":""},{"$f":"IFERROR(INDIRECT(\"'C:\\Users\\Moi\\OneDrive\\Documents\\[Formulaires Gravereau.xlsx]Action\"&$N1215&\"'!$h$11\"),\"\")","v":""},{"$f":"IFERROR(VLOOKUP(E1216,'[1]Tarif de base'!D:E,2,FALSE)*F1216,\"\")","v":""}]
[null,"",null,null,"","",{"$f":"IFERROR(VLOOKUP(E1217,'[1]Tarif de base'!D:E,2,FALSE)*F1217,\"\")","v":""}]
[null,"",null,null,"","",{"$f":"IFERROR(VLOOKUP(E1218,'[1]Tarif de base'!D:E,2,FALSE)*F1218,\"\")","v":""}]
[null,"",null,null,"","",{"$f":"IFERROR(VLOOKUP(E1219,'[1]Tarif de base'!D:E,2,FALSE)*F1219,\"\")","v":""}]
[null,"",null,null,"","",{"$f":"IFERROR(VLOOKUP(E1220,'[1]Tarif de base'!D:E,2,FALSE)*F1220,\"\")","v":""}]
[null,"",null,null,"Total",{"$f":"SUM(F1215:F1220)","v":0},{"$f":"SUM(G1215:G1220)","v":0}]
[{"$f":"IFERROR(INDIRECT(\"'C:\\Users\\Moi\\OneDrive\\Documents\\[Formulaires Gravereau.xlsx]Action\"&$N1222&\"'!$D$6\"),\"\")","v":""},{"$f":"IF(C1222<>\"\",C1222,\"\")","v":""},{"$f":"IFERROR(INDIRECT(\"'C:\\Users\\Moi\\OneDrive\\Documents\\[Formulaires Gravereau.xlsx]Action\"&$N1222&\"'!$D$4\"),\"\")","v":""},{"$f":"IFERROR(INDIRECT(\"'C:\\Users\\Moi\\OneDrive\\Documents\\[Formulaires Gravereau.xlsx]Action\"&$N1222&\"'!$h$4\"),\"\")","v":""},{"$f":"IFERROR(INDIRECT(\"'C:\\Users\\Moi\\OneDrive\\Documents\\[Formulaires Gravereau.xlsx]Action\"&$N1222&\"'!$D$9\"),\"\")","v":""},{"$f":"IFERROR(INDIRECT(\"'C:\\Users\\Moi\\OneDrive\\Documents\\[Formulaires Gravereau.xlsx]Action\"&$N1222&\"'!$h$9\"),\"\")","v":""},{"$f":"IFERROR(VLOOKUP(E1222,'[1]Tarif de base'!D:E,2,FALSE)*F1222,\"\")","v":""},{"$f":"IFERROR(INDIRECT(\"'C:\\Users\\Moi\\OneDrive\\Documents\\[Formulaires Gravereau.xlsx]Action\"&$N1222&\"'!$d$26\"),\"\")","v":""},{"$f":"IFERROR(INDIRECT(\"'C:\\Users\\Moi\\OneDrive\\Documents\\[Formulaires Gravereau.xlsx]Action\"&$N1222&\"'!$d$28\"),\"\")","v":""},{"$f":"IFERROR(INDIRECT(\"'C:\\Users\\Moi\\OneDrive\\Documents\\[Formulaires Gravereau.xlsx]Action\"&$N1222&\"'!$h$26\"),\"\")","v":""},{"$f":"IFERROR(IF(G1228-H1222-I1222-J1222<>0,\"Attention il manque \"&G1228-H1222-I1222-J1222&\"€\",\"Règlement OK\"),\"Pas de règlement\")","v":"Pas de règlement"},{"$f":"IFERROR(INDIRECT(\"'C:\\Users\\Moi\\OneDrive\\Documents\\[Formulaires Gravereau.xlsx]Action\"&$N1222&\"'!$d$30\"),\"\")","v":""},null,174]
[null,"",null,null,{"$f":"IFERROR(INDIRECT(\"'C:\\Users\\Moi\\OneDrive\\Documents\\[Formulaires Gravereau.xlsx]Action\"&$N1222&\"'!$D$11\"),\"\")","v":""},{"$f":"IFERROR(INDIRECT(\"'C:\\Users\\Moi\\OneDrive\\Documents\\[Formulaires Gravereau.xlsx]Action\"&$N1222&\"'!$h$11\"),\"\")","v":""},{"$f":"IFERROR(VLOOKUP(E1223,'[1]Tarif de base'!D:E,2,FALSE)*F1223,\"\")","v":""}]
[null,"",null,null,{"$f":"IFERROR(INDIRECT(\"'C:\\Users\\Moi\\OneDrive\\Documents\\[Formulaires Gravereau.xlsx]Action\"&$N1222&\"'!$D$13\"),\"\")","v":""},{"$f":"IFERROR(INDIRECT(\"'C:\\Users\\Moi\\OneDrive\\Documents\\[Formulaires Gravereau.xlsx]Action\"&$N1222&\"'!$h$13\"),\"\")","v":""},{"$f":"IFERROR(VLOOKUP(E1224,'[1]Tarif de base'!D:E,2,FALSE)*F1224,\"\")","v":""}]
[null,"",null,null,{"$f":"IFERROR(INDIRECT(\"'C:\\Users\\Moi\\OneDrive\\Documents\\[Formulaires Gravereau.xlsx]Action\"&$N1222&\"'!$D$15\"),\"\")","v":""},{"$f":"IFERROR(INDIRECT(\"'C:\\Users\\Moi\\OneDrive\\Documents\\[Formulaires Gravereau.xlsx]Action\"&$N1222&\"'!$h$15\"),\"\")","v":""},{"$f":"IFERROR(VLOOKUP(E1225,'[1]Tarif de base'!D:E,2,FALSE)*F1225,\"\")","v":""}]
[null,"",null,null,{"$f":"IFERROR(INDIRECT(\"'C:\\Users\\Moi\\OneDrive\\Documents\\[Formulaires Gravereau.xlsx]Action\"&$N1222&\"'!$D$17\"),\"\")","v":""},{"$f":"IFERROR(INDIRECT(\"'C:\\Users\\Moi\\OneDrive\\Documents\\[Formulaires Gravereau.xlsx]Action\"&$N1222&\"'!$h$17\"),\"\")","v":""},{"$f":"IFERROR(VLOOKUP(E1226,'[1]Tarif de base'!D:E,2,FALSE)*F1226,\"\")","v":""}]
[null,"",null,null,{"$f":"IFERROR(INDIRECT(\"'C:\\Users\\Moi\\OneDrive\\Documents\\[Formulaires Gravereau.xlsx]Action\"&$N1222&\"'!$D$19\"),\"\")","v":""},{"$f":"IFERROR(INDIRECT(\"'C:\\Users\\Moi\\OneDrive\\Documents\\[Formulaires Gravereau.xlsx]Action\"&$N1222&\"'!$h$19\"),\"\")","v":""},{"$f":"IFERROR(VLOOKUP(E1227,'[1]Tarif de base'!D:E,2,FALSE)*F1227,\"\")","v":""}]
[null,"",null,null,"Total",{"$f":"SUM(F1222:F1227)","v":0},{"$f":"SUM(G1222:G1227)","v":0}]
["","","","","","",{"$f":"IFERROR(VLOOKUP(E1229,'[1]Tarif de base'!D:E,2,FALSE)*F1229,\"\")","v":""},"","","",{"$f":"IFERROR(IF(G1235-H1229-I1229-J1229<>0,\"Attention il manque \"&G1235-H1229-I1229-J1229&\"€\",\"Règlement OK\"),\"Pas de règlement\")","v":"Pas de règlement"},"",null,175]
[null,"",null,null,{"$f":"IFERROR(INDIRECT(\"'C:\\Users\\Moi\\OneDrive\\Documents\\[Formulaires Gravereau.xlsx]Action\"&$N1229&\"'!$D$11\"),\"\")","v":""},{"$f":"IFERROR(INDIRECT(\"'C:\\Users\\Moi\\OneDrive\\Documents\\[Formulaires Gravereau.xlsx]Action\"&$N1229&\"'!$h$11\"),\"\")","v":""},{"$f":"IFERROR(VLOOKUP(E1230,'[1]Tarif de base'!D:E,2,FALSE)*F1230,\"\")","v":""}]
[null,"",null,null,"","",{"$f":"IFERROR(VLOOKUP(E1231,'[1]Tarif de base'!D:E,2,FALSE)*F1231,\"\")","v":""}]
[null,"",null,null,"","",{"$f":"IFERROR(VLOOKUP(E1232,'[1]Tarif de base'!D:E,2,FALSE)*F1232,\"\")","v":""}]
[null,"",null,null,"","",{"$f":"IFERROR(VLOOKUP(E1233,'[1]Tarif de base'!D:E,2,FALSE)*F1233,\"\")","v":""}]
[null,"",null,null,"","",{"$f":"IFERROR(VLOOKUP(E1234,'[1]Tarif de base'!D:E,2,FALSE)*F1234,\"\")","v":""}]
[null,"",null,null,"Total",{"$f":"SUM(F1229:F1234)","v":0},{"$f":"SUM(G1229:G1234)","v":0}]
["","","","","","",{"$f":"IFERROR(VLOOKUP(E1236,'[1]Tarif de base'!D:E,2,FALSE)*F1236,\"\")","v":""},"","","",{"$f":"IFERROR(IF(G1242-H1236-I1236-J1236<>0,\"Attention il manque \"&G1242-H1236-I1236-J1236&\"€\",\"Règlement OK\"),\"Pas de règlement\")","v":"Pas de règlement"},"",null,176]
[null,{"$f":"B1236","v":""},null,null,{"$f":"IFERROR(INDIRECT(\"'C:\\Users\\Moi\\OneDrive\\Documents\\[Formulaires Gravereau.xlsx]Action\"&$N1236&\"'!$D$11\"),\"\")","v":""},{"$f":"IFERROR(INDIRECT(\"'C:\\Users\\Moi\\OneDrive\\Documents\\[Formulaires Gravereau.xlsx]Action\"&$N1236&\"'!$h$11\"),\"\")","v":""},{"$f":"IFERROR(VLOOKUP(E1237,'[1]Tarif de base'!D:E,2,FALSE)*F1237,\"\")","v":""}]
[null,"",null,null,"","",{"$f":"IFERROR(VLOOKUP(E1238,'[1]Tarif de base'!D:E,2,FALSE)*F1238,\"\")","v":""}]
[null,"",null,null,"","",{"$f":"IFERROR(VLOOKUP(E1239,'[1]Tarif de base'!D:E,2,FALSE)*F1239,\"\")","v":""}]
[null,"",null,null,"","",{"$f":"IFERROR(VLOOKUP(E1240,'[1]Tarif de base'!D:E,2,FALSE)*F1240,\"\")","v":""}]
[null,"",null,null,"","",{"$f":"IFERROR(VLOOKUP(E1241,'[1]Tarif de base'!D:E,2,FALSE)*F1241,\"\")","v":""}]
[null,"",null,null,"Total",{"$f":"SUM(F1236:F1241)","v":0},{"$f":"SUM(G1236:G1241)","v":0}]
["","","","","","",{"$f":"IFERROR(VLOOKUP(E1243,'[1]Tarif de base'!D:E,2,FALSE)*F1243,\"\")","v":""},"","","",{"$f":"IFERROR(IF(G1249-H1243-I1243-J1243<>0,\"Attention il manque \"&G1249-H1243-I1243-J1243&\"€\",\"Règlement OK\"),\"Pas de règlement\")","v":"Pas de règlement"},"",null,177]
[null,"",null,null,{"$f":"IFERROR(INDIRECT(\"'C:\\Users\\Moi\\OneDrive\\Documents\\[Formulaires Gravereau.xlsx]Action\"&$N1243&\"'!$D$11\"),\"\")","v":""},{"$f":"IFERROR(INDIRECT(\"'C:\\Users\\Moi\\OneDrive\\Documents\\[Formulaires Gravereau.xlsx]Action\"&$N1243&\"'!$h$11\"),\"\")","v":""},{"$f":"IFERROR(VLOOKUP(E1244,'[1]Tarif de base'!D:E,2,FALSE)*F1244,\"\")","v":""}]
[null,"",null,null,"","",{"$f":"IFERROR(VLOOKUP(E1245,'[1]Tarif de base'!D:E,2,FALSE)*F1245,\"\")","v":""}]
[null,"",null,null,"","",{"$f":"IFERROR(VLOOKUP(E1246,'[1]Tarif de base'!D:E,2,FALSE)*F1246,\"\")","v":""}]
[null,"",null,null,"","",{"$f":"IFERROR(VLOOKUP(E1247,'[1]Tarif de base'!D:E,2,FALSE)*F1247,\"\")","v":""}]
[null,"",null,null,"","",{"$f":"IFERROR(VLOOKUP(E1248,'[1]Tarif de base'!D:E,2,FALSE)*F1248,\"\")","v":""}]
[null,"",null,null,"Total",{"$f":"SUM(F1243:F1248)","v":0},{"$f":"SUM(G1243:G1248)","v":0}]
["","","","","","",{"$f":"IFERROR(VLOOKUP(E1250,'[1]Tarif de base'!D:E,2,FALSE)*F1250,\"\")","v":""},"","","",{"$f":"IFERROR(IF(G1256-H1250-I1250-J1250<>0,\"Attention il manque \"&G1256-H1250-I1250-J1250&\"€\",\"Règlement OK\"),\"Pas de règlement\")","v":"Pas de règlement"},"",null,178]
[null,"",null,null,{"$f":"IFERROR(INDIRECT(\"'C:\\Users\\Moi\\OneDrive\\Documents\\[Formulaires Gravereau.xlsx]Action\"&$N1250&\"'!$D$11\"),\"\")","v":""},{"$f":"IFERROR(INDIRECT(\"'C:\\Users\\Moi\\OneDrive\\Documents\\[Formulaires Gravereau.xlsx]Action\"&$N1250&\"'!$h$11\"),\"\")","v":""},{"$f":"IFERROR(VLOOKUP(E1251,'[1]Tarif de base'!D:E,2,FALSE)*F1251,\"\")","v":""}]
[null,"",null,null,"","",{"$f":"IFERROR(VLOOKUP(E1252,'[1]Tarif de base'!D:E,2,FALSE)*F1252,\"\")","v":""}]
[null,"",null,null,"","",{"$f":"IFERROR(VLOOKUP(E1253,'[1]Tarif de base'!D:E,2,FALSE)*F1253,\"\")","v":""}]
[null,"",null,null,"","",{"$f":"IFERROR(VLOOKUP(E1254,'[1]Tarif de base'!D:E,2,FALSE)*F1254,\"\")","v":""}]
[null,"",null,null,"","",{"$f":"IFERROR(VLOOKUP(E1255,'[1]Tarif de base'!D:E,2,FALSE)*F1255,\"\")","v":""}]
[null,"",null,null,"Total",{"$f":"SUM(F1250:F1255)","v":0},{"$f":"SUM(G1250:G1255)","v":0}]
["","","","","","",{"$f":"IFERROR(VLOOKUP(E1257,'[1]Tarif de base'!D:E,2,FALSE)*F1257,\"\")","v":""},"","","",{"$f":"IFERROR(IF(G1263-H1257-I1257-J1257<>0,\"Attention il manque \"&G1263-H1257-I1257-J1257&\"€\",\"Règlement OK\"),\"Pas de règlement\")","v":"Pas de règlement"},"",null,179]
[null,"",null,null,{"$f":"IFERROR(INDIRECT(\"'C:\\Users\\Moi\\OneDrive\\Documents\\[Formulaires Gravereau.xlsx]Action\"&$N1257&\"'!$D$11\"),\"\")","v":""},{"$f":"IFERROR(INDIRECT(\"'C:\\Users\\Moi\\OneDrive\\Documents\\[Formulaires Gravereau.xlsx]Action\"&$N1257&\"'!$h$11\"),\"\")","v":""},{"$f":"IFERROR(VLOOKUP(E1258,'[1]Tarif de base'!D:E,2,FALSE)*F1258,\"\")","v":""}]
[null,"",null,null,"","",{"$f":"IFERROR(VLOOKUP(E1259,'[1]Tarif de base'!D:E,2,FALSE)*F1259,\"\")","v":""}]
[null,"",null,null,"","",{"$f":"IFERROR(VLOOKUP(E1260,'[1]Tarif de base'!D:E,2,FALSE)*F1260,\"\")","v":""}]
[null,"",null,null,"","",{"$f":"IFERROR(VLOOKUP(E1261,'[1]Tarif de base'!D:E,2,FALSE)*F1261,\"\")","v":""}]
[null,"",null,null,"","",{"$f":"IFERROR(VLOOKUP(E1262,'[1]Tarif de base'!D:E,2,FALSE)*F1262,\"\")","v":""}]
[null,"",null,null,"Total",{"$f":"SUM(F1257:F1262)","v":0},{"$f":"SUM(G1257:G1262)","v":0}]
["","","","","","",{"$f":"IFERROR(VLOOKUP(E1264,'[1]Tarif de base'!D:E,2,FALSE)*F1264,\"\")","v":""},"","","",{"$f":"IFERROR(IF(G1270-H1264-I1264-J1264<>0,\"Attention il manque \"&G1270-H1264-I1264-J1264&\"€\",\"Règlement OK\"),\"Pas de règlement\")","v":"Pas de règlement"},"",null,180]
[null,"",null,null,{"$f":"IFERROR(INDIRECT(\"'C:\\Users\\Moi\\OneDrive\\Documents\\[Formulaires Gravereau.xlsx]Action\"&$N1264&\"'!$D$11\"),\"\")","v":""},{"$f":"IFERROR(INDIRECT(\"'C:\\Users\\Moi\\OneDrive\\Documents\\[Formulaires Gravereau.xlsx]Action\"&$N1264&\"'!$h$11\"),\"\")","v":""},{"$f":"IFERROR(VLOOKUP(E1265,'[1]Tarif de base'!D:E,2,FALSE)*F1265,\"\")","v":""}]
[null,"",null,null,"","",{"$f":"IFERROR(VLOOKUP(E1266,'[1]Tarif de base'!D:E,2,FALSE)*F1266,\"\")","v":""}]
[null,"",null,null,"","",{"$f":"IFERROR(VLOOKUP(E1267,'[1]Tarif de base'!D:E,2,FALSE)*F1267,\"\")","v":""}]
[null,"",null,null,"","",{"$f":"IFERROR(VLOOKUP(E1268,'[1]Tarif de base'!D:E,2,FALSE)*F1268,\"\")","v":""}]
[null,"",null,null,"","",{"$f":"IFERROR(VLOOKUP(E1269,'[1]Tarif de base'!D:E,2,FALSE)*F1269,\"\")","v":""}]
[null,"",null,null,"Total",{"$f":"SUM(F1264:F1269)","v":0},{"$f":"SUM(G1264:G1269)","v":0}]
["","","","","","",{"$f":"IFERROR(VLOOKUP(E1271,'[1]Tarif de base'!D:E,2,FALSE)*F1271,\"\")","v":""},"","","",{"$f":"IFERROR(IF(G1277-H1271-I1271-J1271<>0,\"Attention il manque \"&G1277-H1271-I1271-J1271&\"€\",\"Règlement OK\"),\"Pas de règlement\")","v":"Pas de règlement"},"",null,181]
[null,"",null,null,{"$f":"IFERROR(INDIRECT(\"'C:\\Users\\Moi\\OneDrive\\Documents\\[Formulaires Gravereau.xlsx]Action\"&$N1271&\"'!$D$11\"),\"\")","v":""},{"$f":"IFERROR(INDIRECT(\"'C:\\Users\\Moi\\OneDrive\\Documents\\[Formulaires Gravereau.xlsx]Action\"&$N1271&\"'!$h$11\"),\"\")","v":""},{"$f":"IFERROR(VLOOKUP(E1272,'[1]Tarif de base'!D:E,2,FALSE)*F1272,\"\")","v":""}]
[null,"",null,null,"","",{"$f":"IFERROR(VLOOKUP(E1273,'[1]Tarif de base'!D:E,2,FALSE)*F1273,\"\")","v":""}]
[null,"",null,null,"","",{"$f":"IFERROR(VLOOKUP(E1274,'[1]Tarif de base'!D:E,2,FALSE)*F1274,\"\")","v":""}]
[null,"",null,null,"","",{"$f":"IFERROR(VLOOKUP(E1275,'[1]Tarif de base'!D:E,2,FALSE)*F1275,\"\")","v":""}]
[null,"",null,null,"","",{"$f":"IFERROR(VLOOKUP(E1276,'[1]Tarif de base'!D:E,2,FALSE)*F1276,\"\")","v":""}]
[null,"",null,null,"Total",{"$f":"SUM(F1271:F1276)","v":0},{"$f":"SUM(G1271:G1276)","v":0}]
["","","","","","",{"$f":"IFERROR(VLOOKUP(E1278,'[1]Tarif de base'!D:E,2,FALSE)*F1278,\"\")","v":""},"","","",{"$f":"IFERROR(IF(G1284-H1278-I1278-J1278<>0,\"Attention il manque \"&G1284-H1278-I1278-J1278&\"€\",\"Règlement OK\"),\"Pas de règlement\")","v":"Pas de règlement"},"",null,182]
[null,"",null,null,{"$f":"IFERROR(INDIRECT(\"'C:\\Users\\Moi\\OneDrive\\Documents\\[Formulaires Gravereau.xlsx]Action\"&$N1278&\"'!$D$11\"),\"\")","v":""},{"$f":"IFERROR(INDIRECT(\"'C:\\Users\\Moi\\OneDrive\\Documents\\[Formulaires Gravereau.xlsx]Action\"&$N1278&\"'!$h$11\"),\"\")","v":""},{"$f":"IFERROR(VLOOKUP(E1279,'[1]Tarif de base'!D:E,2,FALSE)*F1279,\"\")","v":""}]
[null,"",null,null,"","",{"$f":"IFERROR(VLOOKUP(E1280,'[1]Tarif de base'!D:E,2,FALSE)*F1280,\"\")","v":""}]
[null,"",null,null,"","",{"$f":"IFERROR(VLOOKUP(E1281,'[1]Tarif de base'!D:E,2,FALSE)*F1281,\"\")","v":""}]
[null,"",null,null,"","",{"$f":"IFERROR(VLOOKUP(E1282,'[1]Tarif de base'!D:E,2,FALSE)*F1282,\"\")","v":""}]
[null,"",null,null,"","",{"$f":"IFERROR(VLOOKUP(E1283,'[1]Tarif de base'!D:E,2,FALSE)*F1283,\"\")","v":""}]
[null,"",null,null,"Total",{"$f":"SUM(F1278:F1283)","v":0},{"$f":"SUM(G1278:G1283)","v":0}]
["","","","","","",{"$f":"IFERROR(VLOOKUP(E1285,'[1]Tarif de base'!D:E,2,FALSE)*F1285,\"\")","v":""},"","","",{"$f":"IFERROR(IF(G1291-H1285-I1285-J1285<>0,\"Attention il manque \"&G1291-H1285-I1285-J1285&\"€\",\"Règlement OK\"),\"Pas de règlement\")","v":"Pas de règlement"},"",null,183]
[null,"",null,null,{"$f":"IFERROR(INDIRECT(\"'C:\\Users\\Moi\\OneDrive\\Documents\\[Formulaires Gravereau.xlsx]Action\"&$N1285&\"'!$D$11\"),\"\")","v":""},{"$f":"IFERROR(INDIRECT(\"'C:\\Users\\Moi\\OneDrive\\Documents\\[Formulaires Gravereau.xlsx]Action\"&$N1285&\"'!$h$11\"),\"\")","v":""},{"$f":"IFERROR(VLOOKUP(E1286,'[1]Tarif de base'!D:E,2,FALSE)*F1286,\"\")","v":""}]
[null,"",null,null,"","",{"$f":"IFERROR(VLOOKUP(E1287,'[1]Tarif de base'!D:E,2,FALSE)*F1287,\"\")","v":""}]
[null,"",null,null,"","",{"$f":"IFERROR(VLOOKUP(E1288,'[1]Tarif de base'!D:E,2,FALSE)*F1288,\"\")","v":""}]
[null,"",null,null,"","",{"$f":"IFERROR(VLOOKUP(E1289,'[1]Tarif de base'!D:E,2,FALSE)*F1289,\"\")","v":""}]
[null,"",null,null,"","",{"$f":"IFERROR(VLOOKUP(E1290,'[1]Tarif de base'!D:E,2,FALSE)*F1290,\"\")","v":""}]
[null,"",null,null,"Total",{"$f":"SUM(F1285:F1290)","v":0},{"$f":"SUM(G1285:G1290)","v":0}]
[{"$f":"IFERROR(INDIRECT(\"'C:\\Users\\Moi\\OneDrive\\Documents\\[Formulaires Gravereau.xlsx]Action\"&$N1292&\"'!$D$6\"),\"\")","v":""},{"$f":"IF(C1292<>\"\",C1292,\"\")","v":""},{"$f":"IFERROR(INDIRECT(\"'C:\\Users\\Moi\\OneDrive\\Documents\\[Formulaires Gravereau.xlsx]Action\"&$N1292&\"'!$D$4\"),\"\")","v":""},{"$f":"IFERROR(INDIRECT(\"'C:\\Users\\Moi\\OneDrive\\Documents\\[Formulaires Gravereau.xlsx]Action\"&$N1292&\"'!$h$4\"),\"\")","v":""},{"$f":"IFERROR(INDIRECT(\"'C:\\Users\\Moi\\OneDrive\\Documents\\[Formulaires Gravereau.xlsx]Action\"&$N1292&\"'!$D$9\"),\"\")","v":""},{"$f":"IFERROR(INDIRECT(\"'C:\\Users\\Moi\\OneDrive\\Documents\\[Formulaires Gravereau.xlsx]Action\"&$N1292&\"'!$h$9\"),\"\")","v":""},{"$f":"IFERROR(VLOOKUP(E1292,'[1]Tarif de base'!D:E,2,FALSE)*F1292,\"\")","v":""},{"$f":"IFERROR(INDIRECT(\"'C:\\Users\\Moi\\OneDrive\\Documents\\[Formulaires Gravereau.xlsx]Action\"&$N1292&\"'!$d$26\"),\"\")","v":""},{"$f":"IFERROR(INDIRECT(\"'C:\\Users\\Moi\\OneDrive\\Documents\\[Formulaires Gravereau.xlsx]Action\"&$N1292&\"'!$d$28\"),\"\")","v":""},{"$f":"IFERROR(INDIRECT(\"'C:\\Users\\Moi\\OneDrive\\Documents\\[Formulaires Gravereau.xlsx]Action\"&$N1292&\"'!$h$26\"),\"\")","v":""},{"$f":"IFERROR(IF(G1298-H1292-I1292-J1292<>0,\"Attention il manque \"&G1298-H1292-I1292-J1292&\"€\",\"Règlement OK\"),\"Pas de règlement\")","v":"Pas de règlement"},{"$f":"IFERROR(INDIRECT(\"'C:\\Users\\Moi\\OneDrive\\Documents\\[Formulaires Gravereau.xlsx]Action\"&$N1292&\"'!$d$30\"),\"\")","v":""},null,184]
[null,"",null,null,{"$f":"IFERROR(INDIRECT(\"'C:\\Users\\Moi\\OneDrive\\Documents\\[Formulaires Gravereau.xlsx]Action\"&$N1292&\"'!$D$11\"),\"\")","v":""},{"$f":"IFERROR(INDIRECT(\"'C:\\Users\\Moi\\OneDrive\\Documents\\[Formulaires Gravereau.xlsx]Action\"&$N1292&\"'!$h$11\"),\"\")","v":""},{"$f":"IFERROR(VLOOKUP(E1293,'[1]Tarif de base'!D:E,2,FALSE)*F1293,\"\")","v":""}]
[null,"",null,null,{"$f":"IFERROR(INDIRECT(\"'C:\\Users\\Moi\\OneDrive\\Documents\\[Formulaires Gravereau.xlsx]Action\"&$N1292&\"'!$D$13\"),\"\")","v":""},{"$f":"IFERROR(INDIRECT(\"'C:\\Users\\Moi\\OneDrive\\Documents\\[Formulaires Gravereau.xlsx]Action\"&$N1292&\"'!$h$13\"),\"\")","v":""},{"$f":"IFERROR(VLOOKUP(E1294,'[1]Tarif de base'!D:E,2,FALSE)*F1294,\"\")","v":""}]
[null,"",null,null,{"$f":"IFERROR(INDIRECT(\"'C:\\Users\\Moi\\OneDrive\\Documents\\[Formulaires Gravereau.xlsx]Action\"&$N1292&\"'!$D$15\"),\"\")","v":""},{"$f":"IFERROR(INDIRECT(\"'C:\\Users\\Moi\\OneDrive\\Documents\\[Formulaires Gravereau.xlsx]Action\"&$N1292&\"'!$h$15\"),\"\")","v":""},{"$f":"IFERROR(VLOOKUP(E1295,'[1]Tarif de base'!D:E,2,FALSE)*F1295,\"\")","v":""}]
[null,"",null,null,{"$f":"IFERROR(INDIRECT(\"'C:\\Users\\Moi\\OneDrive\\Documents\\[Formulaires Gravereau.xlsx]Action\"&$N1292&\"'!$D$17\"),\"\")","v":""},{"$f":"IFERROR(INDIRECT(\"'C:\\Users\\Moi\\OneDrive\\Documents\\[Formulaires Gravereau.xlsx]Action\"&$N1292&\"'!$h$17\"),\"\")","v":""},{"$f":"IFERROR(VLOOKUP(E1296,'[1]Tarif de base'!D:E,2,FALSE)*F1296,\"\")","v":""}]
[null,"",null,null,{"$f":"IFERROR(INDIRECT(\"'C:\\Users\\Moi\\OneDrive\\Documents\\[Formulaires Gravereau.xlsx]Action\"&$N1292&\"'!$D$19\"),\"\")","v":""},{"$f":"IFERROR(INDIRECT(\"'C:\\Users\\Moi\\OneDrive\\Documents\\[Formulaires Gravereau.xlsx]Action\"&$N1292&\"'!$h$19\"),\"\")","v":""},{"$f":"IFERROR(VLOOKUP(E1297,'[1]Tarif de base'!D:E,2,FALSE)*F1297,\"\")","v":""}]
[null,"",null,null,"Total",{"$f":"SUM(F1292:F1297)","v":0},{"$f":"SUM(G1292:G1297)","v":0}]
["","","","","","",{"$f":"IFERROR(VLOOKUP(E1299,'[1]Tarif de base'!D:E,2,FALSE)*F1299,\"\")","v":""},"","","",{"$f":"IFERROR(IF(G1305-H1299-I1299-J1299<>0,\"Attention il manque \"&G1305-H1299-I1299-J1299&\"€\",\"Règlement OK\"),\"Pas de règlement\")","v":"Pas de règlement"},"",null,185]
[null,"",null,null,{"$f":"IFERROR(INDIRECT(\"'C:\\Users\\Moi\\OneDrive\\Documents\\[Formulaires Gravereau.xlsx]Action\"&$N1299&\"'!$D$11\"),\"\")","v":""},{"$f":"IFERROR(INDIRECT(\"'C:\\Users\\Moi\\OneDrive\\Documents\\[Formulaires Gravereau.xlsx]Action\"&$N1299&\"'!$h$11\"),\"\")","v":""},{"$f":"IFERROR(VLOOKUP(E1300,'[1]Tarif de base'!D:E,2,FALSE)*F1300,\"\")","v":""}]
[null,{"$f":"B1300","v":""},null,null,"","",{"$f":"IFERROR(VLOOKUP(E1301,'[1]Tarif de base'!D:E,2,FALSE)*F1301,\"\")","v":""}]
[null,"",null,null,"","",{"$f":"IFERROR(VLOOKUP(E1302,'[1]Tarif de base'!D:E,2,FALSE)*F1302,\"\")","v":""}]
[null,"",null,null,"","",{"$f":"IFERROR(VLOOKUP(E1303,'[1]Tarif de base'!D:E,2,FALSE)*F1303,\"\")","v":""}]
[null,"",null,null,"","",{"$f":"IFERROR(VLOOKUP(E1304,'[1]Tarif de base'!D:E,2,FALSE)*F1304,\"\")","v":""}]
[null,"",null,null,"Total",{"$f":"SUM(F1299:F1304)","v":0},{"$f":"SUM(G1299:G1304)","v":0}]
["","","","","","",{"$f":"IFERROR(VLOOKUP(E1306,'[1]Tarif de base'!D:E,2,FALSE)*F1306,\"\")","v":""},"","","",{"$f":"IFERROR(IF(G1312-H1306-I1306-J1306<>0,\"Attention il manque \"&G1312-H1306-I1306-J1306&\"€\",\"Règlement OK\"),\"Pas de règlement\")","v":"Pas de règlement"},"",null,186]
[null,"",null,null,{"$f":"IFERROR(INDIRECT(\"'C:\\Users\\Moi\\OneDrive\\Documents\\[Formulaires Gravereau.xlsx]Action\"&$N1306&\"'!$D$11\"),\"\")","v":""},{"$f":"IFERROR(INDIRECT(\"'C:\\Users\\Moi\\OneDrive\\Documents\\[Formulaires Gravereau.xlsx]Action\"&$N1306&\"'!$h$11\"),\"\")","v":""},{"$f":"IFERROR(VLOOKUP(E1307,'[1]Tarif de base'!D:E,2,FALSE)*F1307,\"\")","v":""}]
[null,"",null,null,"","",{"$f":"IFERROR(VLOOKUP(E1308,'[1]Tarif de base'!D:E,2,FALSE)*F1308,\"\")","v":""}]
[null,"",null,null,"","",{"$f":"IFERROR(VLOOKUP(E1309,'[1]Tarif de base'!D:E,2,FALSE)*F1309,\"\")","v":""}]
[null,"",null,null,"","",{"$f":"IFERROR(VLOOKUP(E1310,'[1]Tarif de base'!D:E,2,FALSE)*F1310,\"\")","v":""}]
[null,"",null,null,"","",{"$f":"IFERROR(VLOOKUP(E1311,'[1]Tarif de base'!D:E,2,FALSE)*F1311,\"\")","v":""}]
[null,"",null,null,"Total",{"$f":"SUM(F1306:F1311)","v":0},{"$f":"SUM(G1306:G1311)","v":0}]
["","","","","","",{"$f":"IFERROR(VLOOKUP(E1313,'[1]Tarif de base'!D:E,2,FALSE)*F1313,\"\")","v":""},"","","",{"$f":"IFERROR(IF(G1319-H1313-I1313-J1313<>0,\"Attention il manque \"&G1319-H1313-I1313-J1313&\"€\",\"Règlement OK\"),\"Pas de règlement\")","v":"Pas de règlement"},"",null,187]
[null,"",null,null,{"$f":"IFERROR(INDIRECT(\"'C:\\Users\\Moi\\OneDrive\\Documents\\[Formulaires Gravereau.xlsx]Action\"&$N1313&\"'!$D$11\"),\"\")","v":""},{"$f":"IFERROR(INDIRECT(\"'C:\\Users\\Moi\\OneDrive\\Documents\\[Formulaires Gravereau.xlsx]Action\"&$N1313&\"'!$h$11\"),\"\")","v":""},{"$f":"IFERROR(VLOOKUP(E1314,'[1]Tarif de base'!D:E,2,FALSE)*F1314,\"\")","v":""}]
[null,"",null,null,"","",{"$f":"IFERROR(VLOOKUP(E1315,'[1]Tarif de base'!D:E,2,FALSE)*F1315,\"\")","v":""}]
[null,"",null,null,"","",{"$f":"IFERROR(VLOOKUP(E1316,'[1]Tarif de base'!D:E,2,FALSE)*F1316,\"\")","v":""}]
[null,"",null,null,"","",{"$f":"IFERROR(VLOOKUP(E1317,'[1]Tarif de base'!D:E,2,FALSE)*F1317,\"\")","v":""}]
[null,"",null,null,"","",{"$f":"IFERROR(VLOOKUP(E1318,'[1]Tarif de base'!D:E,2,FALSE)*F1318,\"\")","v":""}]
[null,"",null,null,"Total",{"$f":"SUM(F1313:F1318)","v":0},{"$f":"SUM(G1313:G1318)","v":0}]
["","","","","","",{"$f":"IFERROR(VLOOKUP(E1320,'[1]Tarif de base'!D:E,2,FALSE)*F1320,\"\")","v":""},"","","",{"$f":"IFERROR(IF(G1326-H1320-I1320-J1320<>0,\"Attention il manque \"&G1326-H1320-I1320-J1320&\"€\",\"Règlement OK\"),\"Pas de règlement\")","v":"Pas de règlement"},"",null,188]
[null,"",null,null,{"$f":"IFERROR(INDIRECT(\"'C:\\Users\\Moi\\OneDrive\\Documents\\[Formulaires Gravereau.xlsx]Action\"&$N1320&\"'!$D$11\"),\"\")","v":""},{"$f":"IFERROR(INDIRECT(\"'C:\\Users\\Moi\\OneDrive\\Documents\\[Formulaires Gravereau.xlsx]Action\"&$N1320&\"'!$h$11\"),\"\")","v":""},{"$f":"IFERROR(VLOOKUP(E1321,'[1]Tarif de base'!D:E,2,FALSE)*F1321,\"\")","v":""}]
[null,"",null,null,"","",{"$f":"IFERROR(VLOOKUP(E1322,'[1]Tarif de base'!D:E,2,FALSE)*F1322,\"\")","v":""}]
[null,"",null,null,"","",{"$f":"IFERROR(VLOOKUP(E1323,'[1]Tarif de base'!D:E,2,FALSE)*F1323,\"\")","v":""}]
[null,"",null,null,"","",{"$f":"IFERROR(VLOOKUP(E1324,'[1]Tarif de base'!D:E,2,FALSE)*F1324,\"\")","v":""}]
[null,"",null,null,"","",{"$f":"IFERROR(VLOOKUP(E1325,'[1]Tarif de base'!D:E,2,FALSE)*F1325,\"\")","v":""}]
[null,"",null,null,"Total",{"$f":"SUM(F1320:F1325)","v":0},{"$f":"SUM(G1320:G1325)","v":0}]
["","","","","","",{"$f":"IFERROR(VLOOKUP(E1327,'[1]Tarif de base'!D:E,2,FALSE)*F1327,\"\")","v":""},"","","",{"$f":"IFERROR(IF(G1333-H1327-I1327-J1327<>0,\"Attention il manque \"&G1333-H1327-I1327-J1327&\"€\",\"Règlement OK\"),\"Pas de règlement\")","v":"Pas de règlement"},"",null,189]
[null,"",null,null,{"$f":"IFERROR(INDIRECT(\"'C:\\Users\\Moi\\OneDrive\\Documents\\[Formulaires Gravereau.xlsx]Action\"&$N1327&\"'!$D$11\"),\"\")","v":""},{"$f":"IFERROR(INDIRECT(\"'C:\\Users\\Moi\\OneDrive\\Documents\\[Formulaires Gravereau.xlsx]Action\"&$N1327&\"'!$h$11\"),\"\")","v":""},{"$f":"IFERROR(VLOOKUP(E1328,'[1]Tarif de base'!D:E,2,FALSE)*F1328,\"\")","v":""}]
[null,"",null,null,"","",{"$f":"IFERROR(VLOOKUP(E1329,'[1]Tarif de base'!D:E,2,FALSE)*F1329,\"\")","v":""}]
[null,"",null,null,"","",{"$f":"IFERROR(VLOOKUP(E1330,'[1]Tarif de base'!D:E,2,FALSE)*F1330,\"\")","v":""}]
[null,"",null,null,"","",{"$f":"IFERROR(VLOOKUP(E1331,'[1]Tarif de base'!D:E,2,FALSE)*F1331,\"\")","v":""}]
[null,"",null,null,"","",{"$f":"IFERROR(VLOOKUP(E1332,'[1]Tarif de base'!D:E,2,FALSE)*F1332,\"\")","v":""}]
[null,"",null,null,"Total",{"$f":"SUM(F1327:F1332)","v":0},{"$f":"SUM(G1327:G1332)","v":0}]
["","","","","","",{"$f":"IFERROR(VLOOKUP(E1334,'[1]Tarif de base'!D:E,2,FALSE)*F1334,\"\")","v":""},"","","",{"$f":"IFERROR(IF(G1340-H1334-I1334-J1334<>0,\"Attention il manque \"&G1340-H1334-I1334-J1334&\"€\",\"Règlement OK\"),\"Pas de règlement\")","v":"Pas de règlement"},"",null,190]
[null,"",null,null,{"$f":"IFERROR(INDIRECT(\"'C:\\Users\\Moi\\OneDrive\\Documents\\[Formulaires Gravereau.xlsx]Action\"&$N1334&\"'!$D$11\"),\"\")","v":""},{"$f":"IFERROR(INDIRECT(\"'C:\\Users\\Moi\\OneDrive\\Documents\\[Formulaires Gravereau.xlsx]Action\"&$N1334&\"'!$h$11\"),\"\")","v":""},{"$f":"IFERROR(VLOOKUP(E1335,'[1]Tarif de base'!D:E,2,FALSE)*F1335,\"\")","v":""}]
[null,"",null,null,"","",{"$f":"IFERROR(VLOOKUP(E1336,'[1]Tarif de base'!D:E,2,FALSE)*F1336,\"\")","v":""}]
[null,"",null,null,"","",{"$f":"IFERROR(VLOOKUP(E1337,'[1]Tarif de base'!D:E,2,FALSE)*F1337,\"\")","v":""}]
[null,"",null,null,"","",{"$f":"IFERROR(VLOOKUP(E1338,'[1]Tarif de base'!D:E,2,FALSE)*F1338,\"\")","v":""}]
[null,"",null,null,"","",{"$f":"IFERROR(VLOOKUP(E1339,'[1]Tarif de base'!D:E,2,FALSE)*F1339,\"\")","v":""}]
[null,"",null,null,"Total",{"$f":"SUM(F1334:F1339)","v":0},{"$f":"SUM(G1334:G1339)","v":0}]
["","","","","","",{"$f":"IFERROR(VLOOKUP(E1341,'[1]Tarif de base'!D:E,2,FALSE)*F1341,\"\")","v":""},"","","",{"$f":"IFERROR(IF(G1347-H1341-I1341-J1341<>0,\"Attention il manque \"&G1347-H1341-I1341-J1341&\"€\",\"Règlement OK\"),\"Pas de règlement\")","v":"Pas de règlement"},"",null,191]
[null,"",null,null,{"$f":"IFERROR(INDIRECT(\"'C:\\Users\\Moi\\OneDrive\\Documents\\[Formulaires Gravereau.xlsx]Action\"&$N1341&\"'!$D$11\"),\"\")","v":""},{"$f":"IFERROR(INDIRECT(\"'C:\\Users\\Moi\\OneDrive\\Documents\\[Formulaires Gravereau.xlsx]Action\"&$N1341&\"'!$h$11\"),\"\")","v":""},{"$f":"IFERROR(VLOOKUP(E1342,'[1]Tarif de base'!D:E,2,FALSE)*F1342,\"\")","v":""}]
[null,"",null,null,"","",{"$f":"IFERROR(VLOOKUP(E1343,'[1]Tarif de base'!D:E,2,FALSE)*F1343,\"\")","v":""}]
[null,"",null,null,"","",{"$f":"IFERROR(VLOOKUP(E1344,'[1]Tarif de base'!D:E,2,FALSE)*F1344,\"\")","v":""}]
[null,"",null,null,"","",{"$f":"IFERROR(VLOOKUP(E1345,'[1]Tarif de base'!D:E,2,FALSE)*F1345,\"\")","v":""}]
[null,"",null,null,"","",{"$f":"IFERROR(VLOOKUP(E1346,'[1]Tarif de base'!D:E,2,FALSE)*F1346,\"\")","v":""}]
[null,"",null,null,"Total",{"$f":"SUM(F1341:F1346)","v":0},{"$f":"SUM(G1341:G1346)","v":0}]
["","","","","","",{"$f":"IFERROR(VLOOKUP(E1348,'[1]Tarif de base'!D:E,2,FALSE)*F1348,\"\")","v":""},"","","",{"$f":"IFERROR(IF(G1354-H1348-I1348-J1348<>0,\"Attention il manque \"&G1354-H1348-I1348-J1348&\"€\",\"Règlement OK\"),\"Pas de règlement\")","v":"Pas de règlement"},"",null,192]
[null,"",null,null,{"$f":"IFERROR(INDIRECT(\"'C:\\Users\\Moi\\OneDrive\\Documents\\[Formulaires Gravereau.xlsx]Action\"&$N1348&\"'!$D$11\"),\"\")","v":""},{"$f":"IFERROR(INDIRECT(\"'C:\\Users\\Moi\\OneDrive\\Documents\\[Formulaires Gravereau.xlsx]Action\"&$N1348&\"'!$h$11\"),\"\")","v":""},{"$f":"IFERROR(VLOOKUP(E1349,'[1]Tarif de base'!D:E,2,FALSE)*F1349,\"\")","v":""}]
[null,"",null,null,"","",{"$f":"IFERROR(VLOOKUP(E1350,'[1]Tarif de base'!D:E,2,FALSE)*F1350,\"\")","v":""}]
[null,"",null,null,"","",{"$f":"IFERROR(VLOOKUP(E1351,'[1]Tarif de base'!D:E,2,FALSE)*F1351,\"\")","v":""}]
[null,"",null,null,"","",{"$f":"IFERROR(VLOOKUP(E1352,'[1]Tarif de base'!D:E,2,FALSE)*F1352,\"\")","v":""}]
[null,"",null,null,"","",{"$f":"IFERROR(VLOOKUP(E1353,'[1]Tarif de base'!D:E,2,FALSE)*F1353,\"\")","v":""}]
[null,"",null,null,"Total",{"$f":"SUM(F1348:F1353)","v":0},{"$f":"SUM(G1348:G1353)","v":0}]
["","","","","","",{"$f":"IFERROR(VLOOKUP(E1355,'[1]Tarif de base'!D:E,2,FALSE)*F1355,\"\")","v":""},"","","",{"$f":"IFERROR(IF(G1361-H1355-I1355-J1355<>0,\"Attention il manque \"&G1361-H1355-I1355-J1355&\"€\",\"Règlement OK\"),\"Pas de règlement\")","v":"Pas de règlement"},"",null,193]
[null,"",null,null,{"$f":"IFERROR(INDIRECT(\"'C:\\Users\\Moi\\OneDrive\\Documents\\[Formulaires Gravereau.xlsx]Action\"&$N1355&\"'!$D$11\"),\"\")","v":""},{"$f":"IFERROR(INDIRECT(\"'C:\\Users\\Moi\\OneDrive\\Documents\\[Formulaires Gravereau.xlsx]Action\"&$N1355&\"'!$h$11\"),\"\")","v":""},{"$f":"IFERROR(VLOOKUP(E1356,'[1]Tarif de base'!D:E,2,FALSE)*F1356,\"\")","v":""}]
[null,"",null,null,"","",{"$f":"IFERROR(VLOOKUP(E1357,'[1]Tarif de base'!D:E,2,FALSE)*F1357,\"\")","v":""}]
[null,"",null,null,"","",{"$f":"IFERROR(VLOOKUP(E1358,'[1]Tarif de base'!D:E,2,FALSE)*F1358,\"\")","v":""}]
[null,"",null,null,"","",{"$f":"IFERROR(VLOOKUP(E1359,'[1]Tarif de base'!D:E,2,FALSE)*F1359,\"\")","v":""}]
[null,"",null,null,"","",{"$f":"IFERROR(VLOOKUP(E1360,'[1]Tarif de base'!D:E,2,FALSE)*F1360,\"\")","v":""}]
[null,"",null,null,"Total",{"$f":"SUM(F1355:F1360)","v":0},{"$f":"SUM(G1355:G1360)","v":0}]
[{"$f":"IFERROR(INDIRECT(\"'C:\\Users\\Moi\\OneDrive\\Documents\\[Formulaires Gravereau.xlsx]Action\"&$N1362&\"'!$D$6\"),\"\")","v":""},{"$f":"IF(C1362<>\"\",C1362,\"\")","v":""},{"$f":"IFERROR(INDIRECT(\"'C:\\Users\\Moi\\OneDrive\\Documents\\[Formulaires Gravereau.xlsx]Action\"&$N1362&\"'!$D$4\"),\"\")","v":""},{"$f":"IFERROR(INDIRECT(\"'C:\\Users\\Moi\\OneDrive\\Documents\\[Formulaires Gravereau.xlsx]Action\"&$N1362&\"'!$h$4\"),\"\")","v":""},{"$f":"IFERROR(INDIRECT(\"'C:\\Users\\Moi\\OneDrive\\Documents\\[Formulaires Gravereau.xlsx]Action\"&$N1362&\"'!$D$9\"),\"\")","v":""},{"$f":"IFERROR(INDIRECT(\"'C:\\Users\\Moi\\OneDrive\\Documents\\[Formulaires Gravereau.xlsx]Action\"&$N1362&\"'!$h$9\"),\"\")","v":""},{"$f":"IFERROR(VLOOKUP(E1362,'[1]Tarif de base'!D:E,2,FALSE)*F1362,\"\")","v":""},{"$f":"IFERROR(INDIRECT(\"'C:\\Users\\Moi\\OneDrive\\Documents\\[Formulaires Gravereau.xlsx]Action\"&$N1362&\"'!$d$26\"),\"\")","v":""},{"$f":"IFERROR(INDIRECT(\"'C:\\Users\\Moi\\OneDrive\\Documents\\[Formulaires Gravereau.xlsx]Action\"&$N1362&\"'!$d$28\"),\"\")","v":""},{"$f":"IFERROR(INDIRECT(\"'C:\\Users\\Moi\\OneDrive\\Documents\\[Formulaires Gravereau.xlsx]Action\"&$N1362&\"'!$h$26\"),\"\")","v":""},{"$f":"IFERROR(IF(G1368-H1362-I1362-J1362<>0,\"Attention il manque \"&G1368-H1362-I1362-J1362&\"€\",\"Règlement OK\"),\"Pas de règlement\")","v":"Pas de règlement"},{"$f":"IFERROR(INDIRECT(\"'C:\\Users\\Moi\\OneDrive\\Documents\\[Formulaires Gravereau.xlsx]Action\"&$N1362&\"'!$d$30\"),\"\")","v":""},null,194]
[null,"",null,null,{"$f":"IFERROR(INDIRECT(\"'C:\\Users\\Moi\\OneDrive\\Documents\\[Formulaires Gravereau.xlsx]Action\"&$N1362&\"'!$D$11\"),\"\")","v":""},{"$f":"IFERROR(INDIRECT(\"'C:\\Users\\Moi\\OneDrive\\Documents\\[Formulaires Gravereau.xlsx]Action\"&$N1362&\"'!$h$11\"),\"\")","v":""},{"$f":"IFERROR(VLOOKUP(E1363,'[1]Tarif de base'!D:E,2,FALSE)*F1363,\"\")","v":""}]
[null,"",null,null,{"$f":"IFERROR(INDIRECT(\"'C:\\Users\\Moi\\OneDrive\\Documents\\[Formulaires Gravereau.xlsx]Action\"&$N1362&\"'!$D$13\"),\"\")","v":""},{"$f":"IFERROR(INDIRECT(\"'C:\\Users\\Moi\\OneDrive\\Documents\\[Formulaires Gravereau.xlsx]Action\"&$N1362&\"'!$h$13\"),\"\")","v":""},{"$f":"IFERROR(VLOOKUP(E1364,'[1]Tarif de base'!D:E,2,FALSE)*F1364,\"\")","v":""}]
[null,{"$f":"B1364","v":""},null,null,{"$f":"IFERROR(INDIRECT(\"'C:\\Users\\Moi\\OneDrive\\Documents\\[Formulaires Gravereau.xlsx]Action\"&$N1362&\"'!$D$15\"),\"\")","v":""},{"$f":"IFERROR(INDIRECT(\"'C:\\Users\\Moi\\OneDrive\\Documents\\[Formulaires Gravereau.xlsx]Action\"&$N1362&\"'!$h$15\"),\"\")","v":""},{"$f":"IFERROR(VLOOKUP(E1365,'[1]Tarif de base'!D:E,2,FALSE)*F1365,\"\")","v":""}]
[null,"",null,null,{"$f":"IFERROR(INDIRECT(\"'C:\\Users\\Moi\\OneDrive\\Documents\\[Formulaires Gravereau.xlsx]Action\"&$N1362&\"'!$D$17\"),\"\")","v":""},{"$f":"IFERROR(INDIRECT(\"'C:\\Users\\Moi\\OneDrive\\Documents\\[Formulaires Gravereau.xlsx]Action\"&$N1362&\"'!$h$17\"),\"\")","v":""},{"$f":"IFERROR(VLOOKUP(E1366,'[1]Tarif de base'!D:E,2,FALSE)*F1366,\"\")","v":""}]
[null,"",null,null,{"$f":"IFERROR(INDIRECT(\"'C:\\Users\\Moi\\OneDrive\\Documents\\[Formulaires Gravereau.xlsx]Action\"&$N1362&\"'!$D$19\"),\"\")","v":""},{"$f":"IFERROR(INDIRECT(\"'C:\\Users\\Moi\\OneDrive\\Documents\\[Formulaires Gravereau.xlsx]Action\"&$N1362&\"'!$h$19\"),\"\")","v":""},{"$f":"IFERROR(VLOOKUP(E1367,'[1]Tarif de base'!D:E,2,FALSE)*F1367,\"\")","v":""}]
[null,"",null,null,"Total",{"$f":"SUM(F1362:F1367)","v":0},{"$f":"SUM(G1362:G1367)","v":0}]
["","","","","","",{"$f":"IFERROR(VLOOKUP(E1369,'[1]Tarif de base'!D:E,2,FALSE)*F1369,\"\")","v":""},"","","",{"$f":"IFERROR(IF(G1375-H1369-I1369-J1369<>0,\"Attention il manque \"&G1375-H1369-I1369-J1369&\"€\",\"Règlement OK\"),\"Pas de règlement\")","v":"Pas de règlement"},"",null,195]
[null,"",null,null,{"$f":"IFERROR(INDIRECT(\"'C:\\Users\\Moi\\OneDrive\\Documents\\[Formulaires Gravereau.xlsx]Action\"&$N1369&\"'!$D$11\"),\"\")","v":""},{"$f":"IFERROR(INDIRECT(\"'C:\\Users\\Moi\\OneDrive\\Documents\\[Formulaires Gravereau.xlsx]Action\"&$N1369&\"'!$h$11\"),\"\")","v":""},{"$f":"IFERROR(VLOOKUP(E1370,'[1]Tarif de base'!D:E,2,FALSE)*F1370,\"\")","v":""}]
[null,"",null,null,"","",{"$f":"IFERROR(VLOOKUP(E1371,'[1]Tarif de base'!D:E,2,FALSE)*F1371,\"\")","v":""}]
[null,"",null,null,"","",{"$f":"IFERROR(VLOOKUP(E1372,'[1]Tarif de base'!D:E,2,FALSE)*F1372,\"\")","v":""}]
[null,"",null,null,"","",{"$f":"IFERROR(VLOOKUP(E1373,'[1]Tarif de base'!D:E,2,FALSE)*F1373,\"\")","v":""}]
[null,"",null,null,"","",{"$f":"IFERROR(VLOOKUP(E1374,'[1]Tarif de base'!D:E,2,FALSE)*F1374,\"\")","v":""}]
[null,"",null,null,"Total",{"$f":"SUM(F1369:F1374)","v":0},{"$f":"SUM(G1369:G1374)","v":0}]
["","","","","","",{"$f":"IFERROR(VLOOKUP(E1376,'[1]Tarif de base'!D:E,2,FALSE)*F1376,\"\")","v":""},"","","",{"$f":"IFERROR(IF(G1382-H1376-I1376-J1376<>0,\"Attention il manque \"&G1382-H1376-I1376-J1376&\"€\",\"Règlement OK\"),\"Pas de règlement\")","v":"Pas de règlement"},"",null,196]
[null,"",null,null,{"$f":"IFERROR(INDIRECT(\"'C:\\Users\\Moi\\OneDrive\\Documents\\[Formulaires Gravereau.xlsx]Action\"&$N1376&\"'!$D$11\"),\"\")","v":""},{"$f":"IFERROR(INDIRECT(\"'C:\\Users\\Moi\\OneDrive\\Documents\\[Formulaires Gravereau.xlsx]Action\"&$N1376&\"'!$h$11\"),\"\")","v":""},{"$f":"IFERROR(VLOOKUP(E1377,'[1]Tarif de base'!D:E,2,FALSE)*F1377,\"\")","v":""}]
[null,"",null,null,"","",{"$f":"IFERROR(VLOOKUP(E1378,'[1]Tarif de base'!D:E,2,FALSE)*F1378,\"\")","v":""}]
[null,"",null,null,"","",{"$f":"IFERROR(VLOOKUP(E1379,'[1]Tarif de base'!D:E,2,FALSE)*F1379,\"\")","v":""}]
[null,"",null,null,"","",{"$f":"IFERROR(VLOOKUP(E1380,'[1]Tarif de base'!D:E,2,FALSE)*F1380,\"\")","v":""}]
[null,"",null,null,"","",{"$f":"IFERROR(VLOOKUP(E1381,'[1]Tarif de base'!D:E,2,FALSE)*F1381,\"\")","v":""}]
[null,"",null,null,"Total",{"$f":"SUM(F1376:F1381)","v":0},{"$f":"SUM(G1376:G1381)","v":0}]
["","","","","","",{"$f":"IFERROR(VLOOKUP(E1383,'[1]Tarif de base'!D:E,2,FALSE)*F1383,\"\")","v":""},"","","",{"$f":"IFERROR(IF(G1389-H1383-I1383-J1383<>0,\"Attention il manque \"&G1389-H1383-I1383-J1383&\"€\",\"Règlement OK\"),\"Pas de règlement\")","v":"Pas de règlement"},"",null,197]
[null,"",null,null,{"$f":"IFERROR(INDIRECT(\"'C:\\Users\\Moi\\OneDrive\\Documents\\[Formulaires Gravereau.xlsx]Action\"&$N1383&\"'!$D$11\"),\"\")","v":""},{"$f":"IFERROR(INDIRECT(\"'C:\\Users\\Moi\\OneDrive\\Documents\\[Formulaires Gravereau.xlsx]Action\"&$N1383&\"'!$h$11\"),\"\")","v":""},{"$f":"IFERROR(VLOOKUP(E1384,'[1]Tarif de base'!D:E,2,FALSE)*F1384,\"\")","v":""}]
[null,"",null,null,"","",{"$f":"IFERROR(VLOOKUP(E1385,'[1]Tarif de base'!D:E,2,FALSE)*F1385,\"\")","v":""}]
[null,"",null,null,"","",{"$f":"IFERROR(VLOOKUP(E1386,'[1]Tarif de base'!D:E,2,FALSE)*F1386,\"\")","v":""}]
[null,"",null,null,"","",{"$f":"IFERROR(VLOOKUP(E1387,'[1]Tarif de base'!D:E,2,FALSE)*F1387,\"\")","v":""}]
[null,"",null,null,"","",{"$f":"IFERROR(VLOOKUP(E1388,'[1]Tarif de base'!D:E,2,FALSE)*F1388,\"\")","v":""}]
[null,"",null,null,"Total",{"$f":"SUM(F1383:F1388)","v":0},{"$f":"SUM(G1383:G1388)","v":0}]
["","","","","","",{"$f":"IFERROR(VLOOKUP(E1390,'[1]Tarif de base'!D:E,2,FALSE)*F1390,\"\")","v":""},"","","",{"$f":"IFERROR(IF(G1396-H1390-I1390-J1390<>0,\"Attention il manque \"&G1396-H1390-I1390-J1390&\"€\",\"Règlement OK\"),\"Pas de règlement\")","v":"Pas de règlement"},"",null,198]
[null,"",null,null,{"$f":"IFERROR(INDIRECT(\"'C:\\Users\\Moi\\OneDrive\\Documents\\[Formulaires Gravereau.xlsx]Action\"&$N1390&\"'!$D$11\"),\"\")","v":""},{"$f":"IFERROR(INDIRECT(\"'C:\\Users\\Moi\\OneDrive\\Documents\\[Formulaires Gravereau.xlsx]Action\"&$N1390&\"'!$h$11\"),\"\")","v":""},{"$f":"IFERROR(VLOOKUP(E1391,'[1]Tarif de base'!D:E,2,FALSE)*F1391,\"\")","v":""}]
[null,"",null,null,"","",{"$f":"IFERROR(VLOOKUP(E1392,'[1]Tarif de base'!D:E,2,FALSE)*F1392,\"\")","v":""}]
[null,"",null,null,"","",{"$f":"IFERROR(VLOOKUP(E1393,'[1]Tarif de base'!D:E,2,FALSE)*F1393,\"\")","v":""}]
[null,"",null,null,"","",{"$f":"IFERROR(VLOOKUP(E1394,'[1]Tarif de base'!D:E,2,FALSE)*F1394,\"\")","v":""}]
[null,"",null,null,"","",{"$f":"IFERROR(VLOOKUP(E1395,'[1]Tarif de base'!D:E,2,FALSE)*F1395,\"\")","v":""}]
[null,"",null,null,"Total",{"$f":"SUM(F1390:F1395)","v":0},{"$f":"SUM(G1390:G1395)","v":0}]
["","","","","","",{"$f":"IFERROR(VLOOKUP(E1397,'[1]Tarif de base'!D:E,2,FALSE)*F1397,\"\")","v":""},"","","",{"$f":"IFERROR(IF(G1403-H1397-I1397-J1397<>0,\"Attention il manque \"&G1403-H1397-I1397-J1397&\"€\",\"Règlement OK\"),\"Pas de règlement\")","v":"Pas de règlement"},"",null,199]
[null,"",null,null,{"$f":"IFERROR(INDIRECT(\"'C:\\Users\\Moi\\OneDrive\\Documents\\[Formulaires Gravereau.xlsx]Action\"&$N1397&\"'!$D$11\"),\"\")","v":""},{"$f":"IFERROR(INDIRECT(\"'C:\\Users\\Moi\\OneDrive\\Documents\\[Formulaires Gravereau.xlsx]Action\"&$N1397&\"'!$h$11\"),\"\")","v":""},{"$f":"IFERROR(VLOOKUP(E1398,'[1]Tarif de base'!D:E,2,FALSE)*F1398,\"\")","v":""}]
[null,"",null,null,"","",{"$f":"IFERROR(VLOOKUP(E1399,'[1]Tarif de base'!D:E,2,FALSE)*F1399,\"\")","v":""}]
[null,"",null,null,"","",{"$f":"IFERROR(VLOOKUP(E1400,'[1]Tarif de base'!D:E,2,FALSE)*F1400,\"\")","v":""}]
[null,"",null,null,"","",{"$f":"IFERROR(VLOOKUP(E1401,'[1]Tarif de base'!D:E,2,FALSE)*F1401,\"\")","v":""}]
[null,"",null,null,"","",{"$f":"IFERROR(VLOOKUP(E1402,'[1]Tarif de base'!D:E,2,FALSE)*F1402,\"\")","v":""}]
[null,"",null,null,"Total",{"$f":"SUM(F1397:F1402)","v":0},{"$f":"SUM(G1397:G1402)","v":0}]
["","","","","","",{"$f":"IFERROR(VLOOKUP(E1404,'[1]Tarif de base'!D:E,2,FALSE)*F1404,\"\")","v":""},"","","",{"$f":"IFERROR(IF(G1410-H1404-I1404-J1404<>0,\"Attention il manque \"&G1410-H1404-I1404-J1404&\"€\",\"Règlement OK\"),\"Pas de règlement\")","v":"Pas de règlement"},"",null,200]
[null,"",null,null,{"$f":"IFERROR(INDIRECT(\"'C:\\Users\\Moi\\OneDrive\\Documents\\[Formulaires Gravereau.xlsx]Action\"&$N1404&\"'!$D$11\"),\"\")","v":""},{"$f":"IFERROR(INDIRECT(\"'C:\\Users\\Moi\\OneDrive\\Documents\\[Formulaires Gravereau.xlsx]Action\"&$N1404&\"'!$h$11\"),\"\")","v":""},{"$f":"IFERROR(VLOOKUP(E1405,'[1]Tarif de base'!D:E,2,FALSE)*F1405,\"\")","v":""}]
[null,"",null,null,"","",{"$f":"IFERROR(VLOOKUP(E1406,'[1]Tarif de base'!D:E,2,FALSE)*F1406,\"\")","v":""}]
[null,"",null,null,"","",{"$f":"IFERROR(VLOOKUP(E1407,'[1]Tarif de base'!D:E,2,FALSE)*F1407,\"\")","v":""}]
[null,"",null,null,"","",{"$f":"IFERROR(VLOOKUP(E1408,'[1]Tarif de base'!D:E,2,FALSE)*F1408,\"\")","v":""}]
[null,"",null,null,"","",{"$f":"IFERROR(VLOOKUP(E1409,'[1]Tarif de base'!D:E,2,FALSE)*F1409,\"\")","v":""}]
[null,"",null,null,"Total",{"$f":"SUM(F1404:F1409)","v":0},{"$f":"SUM(G1404:G1409)","v":0}]
["","","","","","",{"$f":"IFERROR(VLOOKUP(E1411,'[1]Tarif de base'!D:E,2,FALSE)*F1411,\"\")","v":""},"","","",{"$f":"IFERROR(IF(G1417-H1411-I1411-J1411<>0,\"Attention il manque \"&G1417-H1411-I1411-J1411&\"€\",\"Règlement OK\"),\"Pas de règlement\")","v":"Pas de règlement"},"",null,201]
[null,"",null,null,{"$f":"IFERROR(INDIRECT(\"'C:\\Users\\Moi\\OneDrive\\Documents\\[Formulaires Gravereau.xlsx]Action\"&$N1411&\"'!$D$11\"),\"\")","v":""},{"$f":"IFERROR(INDIRECT(\"'C:\\Users\\Moi\\OneDrive\\Documents\\[Formulaires Gravereau.xlsx]Action\"&$N1411&\"'!$h$11\"),\"\")","v":""},{"$f":"IFERROR(VLOOKUP(E1412,'[1]Tarif de base'!D:E,2,FALSE)*F1412,\"\")","v":""}]
[null,"",null,null,"","",{"$f":"IFERROR(VLOOKUP(E1413,'[1]Tarif de base'!D:E,2,FALSE)*F1413,\"\")","v":""}]
[null,"",null,null,"","",{"$f":"IFERROR(VLOOKUP(E1414,'[1]Tarif de base'!D:E,2,FALSE)*F1414,\"\")","v":""}]
[null,"",null,null,"","",{"$f":"IFERROR(VLOOKUP(E1415,'[1]Tarif de base'!D:E,2,FALSE)*F1415,\"\")","v":""}]
[null,"",null,null,"","",{"$f":"IFERROR(VLOOKUP(E1416,'[1]Tarif de base'!D:E,2,FALSE)*F1416,\"\")","v":""}]
[null,"",null,null,"Total",{"$f":"SUM(F1411:F1416)","v":0},{"$f":"SUM(G1411:G1416)","v":0}]
["","","","","","",{"$f":"IFERROR(VLOOKUP(E1418,'[1]Tarif de base'!D:E,2,FALSE)*F1418,\"\")","v":""},"","","",{"$f":"IFERROR(IF(G1424-H1418-I1418-J1418<>0,\"Attention il manque \"&G1424-H1418-I1418-J1418&\"€\",\"Règlement OK\"),\"Pas de règlement\")","v":"Pas de règlement"},"",null,202]
[null,"",null,null,{"$f":"IFERROR(INDIRECT(\"'C:\\Users\\Moi\\OneDrive\\Documents\\[Formulaires Gravereau.xlsx]Action\"&$N1418&\"'!$D$11\"),\"\")","v":""},{"$f":"IFERROR(INDIRECT(\"'C:\\Users\\Moi\\OneDrive\\Documents\\[Formulaires Gravereau.xlsx]Action\"&$N1418&\"'!$h$11\"),\"\")","v":""},{"$f":"IFERROR(VLOOKUP(E1419,'[1]Tarif de base'!D:E,2,FALSE)*F1419,\"\")","v":""}]
[null,"",null,null,"","",{"$f":"IFERROR(VLOOKUP(E1420,'[1]Tarif de base'!D:E,2,FALSE)*F1420,\"\")","v":""}]
[null,"",null,null,"","",{"$f":"IFERROR(VLOOKUP(E1421,'[1]Tarif de base'!D:E,2,FALSE)*F1421,\"\")","v":""}]
[null,"",null,null,"","",{"$f":"IFERROR(VLOOKUP(E1422,'[1]Tarif de base'!D:E,2,FALSE)*F1422,\"\")","v":""}]
[null,"",null,null,"","",{"$f":"IFERROR(VLOOKUP(E1423,'[1]Tarif de base'!D:E,2,FALSE)*F1423,\"\")","v":""}]
[null,"",null,null,"Total",{"$f":"SUM(F1418:F1423)","v":0},{"$f":"SUM(G1418:G1423)","v":0}]
["","","","","","",{"$f":"IFERROR(VLOOKUP(E1425,'[1]Tarif de base'!D:E,2,FALSE)*F1425,\"\")","v":""},"","","",{"$f":"IFERROR(IF(G1431-H1425-I1425-J1425<>0,\"Attention il manque \"&G1431-H1425-I1425-J1425&\"€\",\"Règlement OK\"),\"Pas de règlement\")","v":"Pas de règlement"},"",null,203]
[null,"",null,null,{"$f":"IFERROR(INDIRECT(\"'C:\\Users\\Moi\\OneDrive\\Documents\\[Formulaires Gravereau.xlsx]Action\"&$N1425&\"'!$D$11\"),\"\")","v":""},{"$f":"IFERROR(INDIRECT(\"'C:\\Users\\Moi\\OneDrive\\Documents\\[Formulaires Gravereau.xlsx]Action\"&$N1425&\"'!$h$11\"),\"\")","v":""},{"$f":"IFERROR(VLOOKUP(E1426,'[1]Tarif de base'!D:E,2,FALSE)*F1426,\"\")","v":""}]
[null,"",null,null,"","",{"$f":"IFERROR(VLOOKUP(E1427,'[1]Tarif de base'!D:E,2,FALSE)*F1427,\"\")","v":""}]
[null,"",null,null,"","",{"$f":"IFERROR(VLOOKUP(E1428,'[1]Tarif de base'!D:E,2,FALSE)*F1428,\"\")","v":""}]
[null,{"$f":"B1428","v":""},null,null,"","",{"$f":"IFERROR(VLOOKUP(E1429,'[1]Tarif de base'!D:E,2,FALSE)*F1429,\"\")","v":""}]
[null,"",null,null,"","",{"$f":"IFERROR(VLOOKUP(E1430,'[1]Tarif de base'!D:E,2,FALSE)*F1430,\"\")","v":""}]
[null,"",null,null,"Total",{"$f":"SUM(F1425:F1430)","v":0},{"$f":"SUM(G1425:G1430)","v":0}]
[{"$f":"IFERROR(INDIRECT(\"'C:\\Users\\Moi\\OneDrive\\Documents\\[Formulaires Gravereau.xlsx]Action\"&$N1432&\"'!$D$6\"),\"\")","v":""},{"$f":"IF(C1432<>\"\",C1432,\"\")","v":""},{"$f":"IFERROR(INDIRECT(\"'C:\\Users\\Moi\\OneDrive\\Documents\\[Formulaires Gravereau.xlsx]Action\"&$N1432&\"'!$D$4\"),\"\")","v":""},{"$f":"IFERROR(INDIRECT(\"'C:\\Users\\Moi\\OneDrive\\Documents\\[Formulaires Gravereau.xlsx]Action\"&$N1432&\"'!$h$4\"),\"\")","v":""},{"$f":"IFERROR(INDIRECT(\"'C:\\Users\\Moi\\OneDrive\\Documents\\[Formulaires Gravereau.xlsx]Action\"&$N1432&\"'!$D$9\"),\"\")","v":""},{"$f":"IFERROR(INDIRECT(\"'C:\\Users\\Moi\\OneDrive\\Documents\\[Formulaires Gravereau.xlsx]Action\"&$N1432&\"'!$h$9\"),\"\")","v":""},{"$f":"IFERROR(VLOOKUP(E1432,'[1]Tarif de base'!D:E,2,FALSE)*F1432,\"\")","v":""},{"$f":"IFERROR(INDIRECT(\"'C:\\Users\\Moi\\OneDrive\\Documents\\[Formulaires Gravereau.xlsx]Action\"&$N1432&\"'!$d$26\"),\"\")","v":""},{"$f":"IFERROR(INDIRECT(\"'C:\\Users\\Moi\\OneDrive\\Documents\\[Formulaires Gravereau.xlsx]Action\"&$N1432&\"'!$d$28\"),\"\")","v":""},{"$f":"IFERROR(INDIRECT(\"'C:\\Users\\Moi\\OneDrive\\Documents\\[Formulaires Gravereau.xlsx]Action\"&$N1432&\"'!$h$26\"),\"\")","v":""},{"$f":"IFERROR(IF(G1438-H1432-I1432-J1432<>0,\"Attention il manque \"&G1438-H1432-I1432-J1432&\"€\",\"Règlement OK\"),\"Pas de règlement\")","v":"Pas de règlement"},{"$f":"IFERROR(INDIRECT(\"'C:\\Users\\Moi\\OneDrive\\Documents\\[Formulaires Gravereau.xlsx]Action\"&$N1432&\"'!$d$30\"),\"\")","v":""},null,204]
[null,"",null,null,{"$f":"IFERROR(INDIRECT(\"'C:\\Users\\Moi\\OneDrive\\Documents\\[Formulaires Gravereau.xlsx]Action\"&$N1432&\"'!$D$11\"),\"\")","v":""},{"$f":"IFERROR(INDIRECT(\"'C:\\Users\\Moi\\OneDrive\\Documents\\[Formulaires Gravereau.xlsx]Action\"&$N1432&\"'!$h$11\"),\"\")","v":""},{"$f":"IFERROR(VLOOKUP(E1433,'[1]Tarif de base'!D:E,2,FALSE)*F1433,\"\")","v":""}]
[null,"",null,null,{"$f":"IFERROR(INDIRECT(\"'C:\\Users\\Moi\\OneDrive\\Documents\\[Formulaires Gravereau.xlsx]Action\"&$N1432&\"'!$D$13\"),\"\")","v":""},{"$f":"IFERROR(INDIRECT(\"'C:\\Users\\Moi\\OneDrive\\Documents\\[Formulaires Gravereau.xlsx]Action\"&$N1432&\"'!$h$13\"),\"\")","v":""},{"$f":"IFERROR(VLOOKUP(E1434,'[1]Tarif de base'!D:E,2,FALSE)*F1434,\"\")","v":""}]
[null,"",null,null,{"$f":"IFERROR(INDIRECT(\"'C:\\Users\\Moi\\OneDrive\\Documents\\[Formulaires Gravereau.xlsx]Action\"&$N1432&\"'!$D$15\"),\"\")","v":""},{"$f":"IFERROR(INDIRECT(\"'C:\\Users\\Moi\\OneDrive\\Documents\\[Formulaires Gravereau.xlsx]Action\"&$N1432&\"'!$h$15\"),\"\")","v":""},{"$f":"IFERROR(VLOOKUP(E1435,'[1]Tarif de base'!D:E,2,FALSE)*F1435,\"\")","v":""}]
[null,"",null,null,{"$f":"IFERROR(INDIRECT(\"'C:\\Users\\Moi\\OneDrive\\Documents\\[Formulaires Gravereau.xlsx]Action\"&$N1432&\"'!$D$17\"),\"\")","v":""},{"$f":"IFERROR(INDIRECT(\"'C:\\Users\\Moi\\OneDrive\\Documents\\[Formulaires Gravereau.xlsx]Action\"&$N1432&\"'!$h$17\"),\"\")","v":""},{"$f":"IFERROR(VLOOKUP(E1436,'[1]Tarif de base'!D:E,2,FALSE)*F1436,\"\")","v":""}]
[null,"",null,null,{"$f":"IFERROR(INDIRECT(\"'C:\\Users\\Moi\\OneDrive\\Documents\\[Formulaires Gravereau.xlsx]Action\"&$N1432&\"'!$D$19\"),\"\")","v":""},{"$f":"IFERROR(INDIRECT(\"'C:\\Users\\Moi\\OneDrive\\Documents\\[Formulaires Gravereau.xlsx]Action\"&$N1432&\"'!$h$19\"),\"\")","v":""},{"$f":"IFERROR(VLOOKUP(E1437,'[1]Tarif de base'!D:E,2,FALSE)*F1437,\"\")","v":""}]
[null,"",null,null,"Total",{"$f":"SUM(F1432:F1437)","v":0},{"$f":"SUM(G1432:G1437)","v":0}]
["","","","","","",{"$f":"IFERROR(VLOOKUP(E1439,'[1]Tarif de base'!D:E,2,FALSE)*F1439,\"\")","v":""},"","","",{"$f":"IFERROR(IF(G1445-H1439-I1439-J1439<>0,\"Attention il manque \"&G1445-H1439-I1439-J1439&\"€\",\"Règlement OK\"),\"Pas de règlement\")","v":"Pas de règlement"},"",null,205]
[null,"",null,null,{"$f":"IFERROR(INDIRECT(\"'C:\\Users\\Moi\\OneDrive\\Documents\\[Formulaires Gravereau.xlsx]Action\"&$N1439&\"'!$D$11\"),\"\")","v":""},{"$f":"IFERROR(INDIRECT(\"'C:\\Users\\Moi\\OneDrive\\Documents\\[Formulaires Gravereau.xlsx]Action\"&$N1439&\"'!$h$11\"),\"\")","v":""},{"$f":"IFERROR(VLOOKUP(E1440,'[1]Tarif de base'!D:E,2,FALSE)*F1440,\"\")","v":""}]
[null,"",null,null,"","",{"$f":"IFERROR(VLOOKUP(E1441,'[1]Tarif de base'!D:E,2,FALSE)*F1441,\"\")","v":""}]
[null,"",null,null,"","",{"$f":"IFERROR(VLOOKUP(E1442,'[1]Tarif de base'!D:E,2,FALSE)*F1442,\"\")","v":""}]
[null,"",null,null,"","",{"$f":"IFERROR(VLOOKUP(E1443,'[1]Tarif de base'!D:E,2,FALSE)*F1443,\"\")","v":""}]
[null,"",null,null,"","",{"$f":"IFERROR(VLOOKUP(E1444,'[1]Tarif de base'!D:E,2,FALSE)*F1444,\"\")","v":""}]
[null,"",null,null,"Total",{"$f":"SUM(F1439:F1444)","v":0},{"$f":"SUM(G1439:G1444)","v":0}]
["","","","","","",{"$f":"IFERROR(VLOOKUP(E1446,'[1]Tarif de base'!D:E,2,FALSE)*F1446,\"\")","v":""},"","","",{"$f":"IFERROR(IF(G1452-H1446-I1446-J1446<>0,\"Attention il manque \"&G1452-H1446-I1446-J1446&\"€\",\"Règlement OK\"),\"Pas de règlement\")","v":"Pas de règlement"},"",null,206]
[null,"",null,null,{"$f":"IFERROR(INDIRECT(\"'C:\\Users\\Moi\\OneDrive\\Documents\\[Formulaires Gravereau.xlsx]Action\"&$N1446&\"'!$D$11\"),\"\")","v":""},{"$f":"IFERROR(INDIRECT(\"'C:\\Users\\Moi\\OneDrive\\Documents\\[Formulaires Gravereau.xlsx]Action\"&$N1446&\"'!$h$11\"),\"\")","v":""},{"$f":"IFERROR(VLOOKUP(E1447,'[1]Tarif de base'!D:E,2,FALSE)*F1447,\"\")","v":""}]
[null,"",null,null,"","",{"$f":"IFERROR(VLOOKUP(E1448,'[1]Tarif de base'!D:E,2,FALSE)*F1448,\"\")","v":""}]
[null,"",null,null,"","",{"$f":"IFERROR(VLOOKUP(E1449,'[1]Tarif de base'!D:E,2,FALSE)*F1449,\"\")","v":""}]
[null,"",null,null,"","",{"$f":"IFERROR(VLOOKUP(E1450,'[1]Tarif de base'!D:E,2,FALSE)*F1450,\"\")","v":""}]
[null,"",null,null,"","",{"$f":"IFERROR(VLOOKUP(E1451,'[1]Tarif de base'!D:E,2,FALSE)*F1451,\"\")","v":""}]
[null,"",null,null,"Total",{"$f":"SUM(F1446:F1451)","v":0},{"$f":"SUM(G1446:G1451)","v":0}]
["","","","","","",{"$f":"IFERROR(VLOOKUP(E1453,'[1]Tarif de base'!D:E,2,FALSE)*F1453,\"\")","v":""},"","","",{"$f":"IFERROR(IF(G1459-H1453-I1453-J1453<>0,\"Attention il manque \"&G1459-H1453-I1453-J1453&\"€\",\"Règlement OK\"),\"Pas de règlement\")","v":"Pas de règlement"},"",null,207]
[null,"",null,null,{"$f":"IFERROR(INDIRECT(\"'C:\\Users\\Moi\\OneDrive\\Documents\\[Formulaires Gravereau.xlsx]Action\"&$N1453&\"'!$D$11\"),\"\")","v":""},{"$f":"IFERROR(INDIRECT(\"'C:\\Users\\Moi\\OneDrive\\Documents\\[Formulaires Gravereau.xlsx]Action\"&$N1453&\"'!$h$11\"),\"\")","v":""},{"$f":"IFERROR(VLOOKUP(E1454,'[1]Tarif de base'!D:E,2,FALSE)*F1454,\"\")","v":""}]
[null,"",null,null,"","",{"$f":"IFERROR(VLOOKUP(E1455,'[1]Tarif de base'!D:E,2,FALSE)*F1455,\"\")","v":""}]
[null,"",null,null,"","",{"$f":"IFERROR(VLOOKUP(E1456,'[1]Tarif de base'!D:E,2,FALSE)*F1456,\"\")","v":""}]
[null,"",null,null,"","",{"$f":"IFERROR(VLOOKUP(E1457,'[1]Tarif de base'!D:E,2,FALSE)*F1457,\"\")","v":""}]
[null,"",null,null,"","",{"$f":"IFERROR(VLOOKUP(E1458,'[1]Tarif de base'!D:E,2,FALSE)*F1458,\"\")","v":""}]
[null,"",null,null,"Total",{"$f":"SUM(F1453:F1458)","v":0},{"$f":"SUM(G1453:G1458)","v":0}]
["","","","","","",{"$f":"IFERROR(VLOOKUP(E1460,'[1]Tarif de base'!D:E,2,FALSE)*F1460,\"\")","v":""},"","","",{"$f":"IFERROR(IF(G1466-H1460-I1460-J1460<>0,\"Attention il manque \"&G1466-H1460-I1460-J1460&\"€\",\"Règlement OK\"),\"Pas de règlement\")","v":"Pas de règlement"},"",null,208]
[null,"",null,null,{"$f":"IFERROR(INDIRECT(\"'C:\\Users\\Moi\\OneDrive\\Documents\\[Formulaires Gravereau.xlsx]Action\"&$N1460&\"'!$D$11\"),\"\")","v":""},{"$f":"IFERROR(INDIRECT(\"'C:\\Users\\Moi\\OneDrive\\Documents\\[Formulaires Gravereau.xlsx]Action\"&$N1460&\"'!$h$11\"),\"\")","v":""},{"$f":"IFERROR(VLOOKUP(E1461,'[1]Tarif de base'!D:E,2,FALSE)*F1461,\"\")","v":""}]
[null,"",null,null,"","",{"$f":"IFERROR(VLOOKUP(E1462,'[1]Tarif de base'!D:E,2,FALSE)*F1462,\"\")","v":""}]
[null,"",null,null,"","",{"$f":"IFERROR(VLOOKUP(E1463,'[1]Tarif de base'!D:E,2,FALSE)*F1463,\"\")","v":""}]
[null,"",null,null,"","",{"$f":"IFERROR(VLOOKUP(E1464,'[1]Tarif de base'!D:E,2,FALSE)*F1464,\"\")","v":""}]
[null,"",null,null,"","",{"$f":"IFERROR(VLOOKUP(E1465,'[1]Tarif de base'!D:E,2,FALSE)*F1465,\"\")","v":""}]
[null,"",null,null,"Total",{"$f":"SUM(F1460:F1465)","v":0},{"$f":"SUM(G1460:G1465)","v":0}]
["","","","","","",{"$f":"IFERROR(VLOOKUP(E1467,'[1]Tarif de base'!D:E,2,FALSE)*F1467,\"\")","v":""},"","","",{"$f":"IFERROR(IF(G1473-H1467-I1467-J1467<>0,\"Attention il manque \"&G1473-H1467-I1467-J1467&\"€\",\"Règlement OK\"),\"Pas de règlement\")","v":"Pas de règlement"},"",null,209]
[null,"",null,null,{"$f":"IFERROR(INDIRECT(\"'C:\\Users\\Moi\\OneDrive\\Documents\\[Formulaires Gravereau.xlsx]Action\"&$N1467&\"'!$D$11\"),\"\")","v":""},{"$f":"IFERROR(INDIRECT(\"'C:\\Users\\Moi\\OneDrive\\Documents\\[Formulaires Gravereau.xlsx]Action\"&$N1467&\"'!$h$11\"),\"\")","v":""},{"$f":"IFERROR(VLOOKUP(E1468,'[1]Tarif de base'!D:E,2,FALSE)*F1468,\"\")","v":""}]
[null,"",null,null,"","",{"$f":"IFERROR(VLOOKUP(E1469,'[1]Tarif de base'!D:E,2,FALSE)*F1469,\"\")","v":""}]
[null,"",null,null,"","",{"$f":"IFERROR(VLOOKUP(E1470,'[1]Tarif de base'!D:E,2,FALSE)*F1470,\"\")","v":""}]
[null,"",null,null,"","",{"$f":"IFERROR(VLOOKUP(E1471,'[1]Tarif de base'!D:E,2,FALSE)*F1471,\"\")","v":""}]
[null,"",null,null,"","",{"$f":"IFERROR(VLOOKUP(E1472,'[1]Tarif de base'!D:E,2,FALSE)*F1472,\"\")","v":""}]
[null,"",null,null,"Total",{"$f":"SUM(F1467:F1472)","v":0},{"$f":"SUM(G1467:G1472)","v":0}]
["","","","","","",{"$f":"IFERROR(VLOOKUP(E1474,'[1]Tarif de base'!D:E,2,FALSE)*F1474,\"\")","v":""},"","","",{"$f":"IFERROR(IF(G1480-H1474-I1474-J1474<>0,\"Attention il manque \"&G1480-H1474-I1474-J1474&\"€\",\"Règlement OK\"),\"Pas de règlement\")","v":"Pas de règlement"},"",null,210]
[null,"",null,null,{"$f":"IFERROR(INDIRECT(\"'C:\\Users\\Moi\\OneDrive\\Documents\\[Formulaires Gravereau.xlsx]Action\"&$N1474&\"'!$D$11\"),\"\")","v":""},{"$f":"IFERROR(INDIRECT(\"'C:\\Users\\Moi\\OneDrive\\Documents\\[Formulaires Gravereau.xlsx]Action\"&$N1474&\"'!$h$11\"),\"\")","v":""},{"$f":"IFERROR(VLOOKUP(E1475,'[1]Tarif de base'!D:E,2,FALSE)*F1475,\"\")","v":""}]
[null,"",null,null,"","",{"$f":"IFERROR(VLOOKUP(E1476,'[1]Tarif de base'!D:E,2,FALSE)*F1476,\"\")","v":""}]
[null,"",null,null,"","",{"$f":"IFERROR(VLOOKUP(E1477,'[1]Tarif de base'!D:E,2,FALSE)*F1477,\"\")","v":""}]
[null,"",null,null,"","",{"$f":"IFERROR(VLOOKUP(E1478,'[1]Tarif de base'!D:E,2,FALSE)*F1478,\"\")","v":""}]
[null,"",null,null,"","",{"$f":"IFERROR(VLOOKUP(E1479,'[1]Tarif de base'!D:E,2,FALSE)*F1479,\"\")","v":""}]
[null,"",null,null,"Total",{"$f":"SUM(F1474:F1479)","v":0},{"$f":"SUM(G1474:G1479)","v":0}]
["","","","","","",{"$f":"IFERROR(VLOOKUP(E1481,'[1]Tarif de base'!D:E,2,FALSE)*F1481,\"\")","v":""},"","","",{"$f":"IFERROR(IF(G1487-H1481-I1481-J1481<>0,\"Attention il manque \"&G1487-H1481-I1481-J1481&\"€\",\"Règlement OK\"),\"Pas de règlement\")","v":"Pas de règlement"},"",null,211]
[null,"",null,null,{"$f":"IFERROR(INDIRECT(\"'C:\\Users\\Moi\\OneDrive\\Documents\\[Formulaires Gravereau.xlsx]Action\"&$N1481&\"'!$D$11\"),\"\")","v":""},{"$f":"IFERROR(INDIRECT(\"'C:\\Users\\Moi\\OneDrive\\Documents\\[Formulaires Gravereau.xlsx]Action\"&$N1481&\"'!$h$11\"),\"\")","v":""},{"$f":"IFERROR(VLOOKUP(E1482,'[1]Tarif de base'!D:E,2,FALSE)*F1482,\"\")","v":""}]
[null,"",null,null,"","",{"$f":"IFERROR(VLOOKUP(E1483,'[1]Tarif de base'!D:E,2,FALSE)*F1483,\"\")","v":""}]
[null,"",null,null,"","",{"$f":"IFERROR(VLOOKUP(E1484,'[1]Tarif de base'!D:E,2,FALSE)*F1484,\"\")","v":""}]
[null,"",null,null,"","",{"$f":"IFERROR(VLOOKUP(E1485,'[1]Tarif de base'!D:E,2,FALSE)*F1485,\"\")","v":""}]
[null,"",null,null,"","",{"$f":"IFERROR(VLOOKUP(E1486,'[1]Tarif de base'!D:E,2,FALSE)*F1486,\"\")","v":""}]
[null,"",null,null,"Total",{"$f":"SUM(F1481:F1486)","v":0},{"$f":"SUM(G1481:G1486)","v":0}]
["","","","","","",{"$f":"IFERROR(VLOOKUP(E1488,'[1]Tarif de base'!D:E,2,FALSE)*F1488,\"\")","v":""},"","","",{"$f":"IFERROR(IF(G1494-H1488-I1488-J1488<>0,\"Attention il manque \"&G1494-H1488-I1488-J1488&\"€\",\"Règlement OK\"),\"Pas de règlement\")","v":"Pas de règlement"},"",null,212]
[null,"",null,null,{"$f":"IFERROR(INDIRECT(\"'C:\\Users\\Moi\\OneDrive\\Documents\\[Formulaires Gravereau.xlsx]Action\"&$N1488&\"'!$D$11\"),\"\")","v":""},{"$f":"IFERROR(INDIRECT(\"'C:\\Users\\Moi\\OneDrive\\Documents\\[Formulaires Gravereau.xlsx]Action\"&$N1488&\"'!$h$11\"),\"\")","v":""},{"$f":"IFERROR(VLOOKUP(E1489,'[1]Tarif de base'!D:E,2,FALSE)*F1489,\"\")","v":""}]
[null,"",null,null,"","",{"$f":"IFERROR(VLOOKUP(E1490,'[1]Tarif de base'!D:E,2,FALSE)*F1490,\"\")","v":""}]
[null,"",null,null,"","",{"$f":"IFERROR(VLOOKUP(E1491,'[1]Tarif de base'!D:E,2,FALSE)*F1491,\"\")","v":""}]
[null,"",null,null,"","",{"$f":"IFERROR(VLOOKUP(E1492,'[1]Tarif de base'!D:E,2,FALSE)*F1492,\"\")","v":""}]
[null,{"$f":"B1492","v":""},null,null,"","",{"$f":"IFERROR(VLOOKUP(E1493,'[1]Tarif de base'!D:E,2,FALSE)*F1493,\"\")","v":""}]
[null,"",null,null,"Total",{"$f":"SUM(F1488:F1493)","v":0},{"$f":"SUM(G1488:G1493)","v":0}]
["","","","","","",{"$f":"IFERROR(VLOOKUP(E1495,'[1]Tarif de base'!D:E,2,FALSE)*F1495,\"\")","v":""},"","","",{"$f":"IFERROR(IF(G1501-H1495-I1495-J1495<>0,\"Attention il manque \"&G1501-H1495-I1495-J1495&\"€\",\"Règlement OK\"),\"Pas de règlement\")","v":"Pas de règlement"},"",null,213]
[null,"",null,null,{"$f":"IFERROR(INDIRECT(\"'C:\\Users\\Moi\\OneDrive\\Documents\\[Formulaires Gravereau.xlsx]Action\"&$N1495&\"'!$D$11\"),\"\")","v":""},{"$f":"IFERROR(INDIRECT(\"'C:\\Users\\Moi\\OneDrive\\Documents\\[Formulaires Gravereau.xlsx]Action\"&$N1495&\"'!$h$11\"),\"\")","v":""},{"$f":"IFERROR(VLOOKUP(E1496,'[1]Tarif de base'!D:E,2,FALSE)*F1496,\"\")","v":""}]
[null,"",null,null,"","",{"$f":"IFERROR(VLOOKUP(E1497,'[1]Tarif de base'!D:E,2,FALSE)*F1497,\"\")","v":""}]
[null,"",null,null,"","",{"$f":"IFERROR(VLOOKUP(E1498,'[1]Tarif de base'!D:E,2,FALSE)*F1498,\"\")","v":""}]
[null,"",null,null,"","",{"$f":"IFERROR(VLOOKUP(E1499,'[1]Tarif de base'!D:E,2,FALSE)*F1499,\"\")","v":""}]
[null,"",null,null,"","",{"$f":"IFERROR(VLOOKUP(E1500,'[1]Tarif de base'!D:E,2,FALSE)*F1500,\"\")","v":""}]
[null,"",null,null,"Total",{"$f":"SUM(F1495:F1500)","v":0},{"$f":"SUM(G1495:G1500)","v":0}]
[{"$f":"IFERROR(INDIRECT(\"'C:\\Users\\Moi\\OneDrive\\Documents\\[Formulaires Gravereau.xlsx]Action\"&$N1502&\"'!$D$6\"),\"\")","v":""},{"$f":"IF(C1502<>\"\",C1502,\"\")","v":""},{"$f":"IFERROR(INDIRECT(\"'C:\\Users\\Moi\\OneDrive\\Documents\\[Formulaires Gravereau.xlsx]Action\"&$N1502&\"'!$D$4\"),\"\")","v":""},{"$f":"IFERROR(INDIRECT(\"'C:\\Users\\Moi\\OneDrive\\Documents\\[Formulaires Gravereau.xlsx]Action\"&$N1502&\"'!$h$4\"),\"\")","v":""},{"$f":"IFERROR(INDIRECT(\"'C:\\Users\\Moi\\OneDrive\\Documents\\[Formulaires Gravereau.xlsx]Action\"&$N1502&\"'!$D$9\"),\"\")","v":""},{"$f":"IFERROR(INDIRECT(\"'C:\\Users\\Moi\\OneDrive\\Documents\\[Formulaires Gravereau.xlsx]Action\"&$N1502&\"'!$h$9\"),\"\")","v":""},{"$f":"IFERROR(VLOOKUP(E1502,'[1]Tarif de base'!D:E,2,FALSE)*F1502,\"\")","v":""},{"$f":"IFERROR(INDIRECT(\"'C:\\Users\\Moi\\OneDrive\\Documents\\[Formulaires Gravereau.xlsx]Action\"&$N1502&\"'!$d$26\"),\"\")","v":""},{"$f":"IFERROR(INDIRECT(\"'C:\\Users\\Moi\\OneDrive\\Documents\\[Formulaires Gravereau.xlsx]Action\"&$N1502&\"'!$d$28\"),\"\")","v":""},{"$f":"IFERROR(INDIRECT(\"'C:\\Users\\Moi\\OneDrive\\Documents\\[Formulaires Gravereau.xlsx]Action\"&$N1502&\"'!$h$26\"),\"\")","v":""},{"$f":"IFERROR(IF(G1508-H1502-I1502-J1502<>0,\"Attention il manque \"&G1508-H1502-I1502-J1502&\"€\",\"Règlement OK\"),\"Pas de règlement\")","v":"Pas de règlement"},{"$f":"IFERROR(INDIRECT(\"'C:\\Users\\Moi\\OneDrive\\Documents\\[Formulaires Gravereau.xlsx]Action\"&$N1502&\"'!$d$30\"),\"\")","v":""},null,214]
[null,"",null,null,{"$f":"IFERROR(INDIRECT(\"'C:\\Users\\Moi\\OneDrive\\Documents\\[Formulaires Gravereau.xlsx]Action\"&$N1502&\"'!$D$11\"),\"\")","v":""},{"$f":"IFERROR(INDIRECT(\"'C:\\Users\\Moi\\OneDrive\\Documents\\[Formulaires Gravereau.xlsx]Action\"&$N1502&\"'!$h$11\"),\"\")","v":""},{"$f":"IFERROR(VLOOKUP(E1503,'[1]Tarif de base'!D:E,2,FALSE)*F1503,\"\")","v":""}]
[null,"",null,null,{"$f":"IFERROR(INDIRECT(\"'C:\\Users\\Moi\\OneDrive\\Documents\\[Formulaires Gravereau.xlsx]Action\"&$N1502&\"'!$D$13\"),\"\")","v":""},{"$f":"IFERROR(INDIRECT(\"'C:\\Users\\Moi\\OneDrive\\Documents\\[Formulaires Gravereau.xlsx]Action\"&$N1502&\"'!$h$13\"),\"\")","v":""},{"$f":"IFERROR(VLOOKUP(E1504,'[1]Tarif de base'!D:E,2,FALSE)*F1504,\"\")","v":""}]
[null,"",null,null,{"$f":"IFERROR(INDIRECT(\"'C:\\Users\\Moi\\OneDrive\\Documents\\[Formulaires Gravereau.xlsx]Action\"&$N1502&\"'!$D$15\"),\"\")","v":""},{"$f":"IFERROR(INDIRECT(\"'C:\\Users\\Moi\\OneDrive\\Documents\\[Formulaires Gravereau.xlsx]Action\"&$N1502&\"'!$h$15\"),\"\")","v":""},{"$f":"IFERROR(VLOOKUP(E1505,'[1]Tarif de base'!D:E,2,FALSE)*F1505,\"\")","v":""}]
[null,"",null,null,{"$f":"IFERROR(INDIRECT(\"'C:\\Users\\Moi\\OneDrive\\Documents\\[Formulaires Gravereau.xlsx]Action\"&$N1502&\"'!$D$17\"),\"\")","v":""},{"$f":"IFERROR(INDIRECT(\"'C:\\Users\\Moi\\OneDrive\\Documents\\[Formulaires Gravereau.xlsx]Action\"&$N1502&\"'!$h$17\"),\"\")","v":""},{"$f":"IFERROR(VLOOKUP(E1506,'[1]Tarif de base'!D:E,2,FALSE)*F1506,\"\")","v":""}]
[null,"",null,null,{"$f":"IFERROR(INDIRECT(\"'C:\\Users\\Moi\\OneDrive\\Documents\\[Formulaires Gravereau.xlsx]Action\"&$N1502&\"'!$D$19\"),\"\")","v":""},{"$f":"IFERROR(INDIRECT(\"'C:\\Users\\Moi\\OneDrive\\Documents\\[Formulaires Gravereau.xlsx]Action\"&$N1502&\"'!$h$19\"),\"\")","v":""},{"$f":"IFERROR(VLOOKUP(E1507,'[1]Tarif de base'!D:E,2,FALSE)*F1507,\"\")","v":""}]
[null,"",null,null,"Total",{"$f":"SUM(F1502:F1507)","v":0},{"$f":"SUM(G1502:G1507)","v":0}]
["","","","","","",{"$f":"IFERROR(VLOOKUP(E1509,'[1]Tarif de base'!D:E,2,FALSE)*F1509,\"\")","v":""},"","","",{"$f":"IFERROR(IF(G1515-H1509-I1509-J1509<>0,\"Attention il manque \"&G1515-H1509-I1509-J1509&\"€\",\"Règlement OK\"),\"Pas de règlement\")","v":"Pas de règlement"},"",null,215]
[null,"",null,null,{"$f":"IFERROR(INDIRECT(\"'C:\\Users\\Moi\\OneDrive\\Documents\\[Formulaires Gravereau.xlsx]Action\"&$N1509&\"'!$D$11\"),\"\")","v":""},{"$f":"IFERROR(INDIRECT(\"'C:\\Users\\Moi\\OneDrive\\Documents\\[Formulaires Gravereau.xlsx]Action\"&$N1509&\"'!$h$11\"),\"\")","v":""},{"$f":"IFERROR(VLOOKUP(E1510,'[1]Tarif de base'!D:E,2,FALSE)*F1510,\"\")","v":""}]
[null,"",null,null,"","",{"$f":"IFERROR(VLOOKUP(E1511,'[1]Tarif de base'!D:E,2,FALSE)*F1511,\"\")","v":""}]
[null,"",null,null,"","",{"$f":"IFERROR(VLOOKUP(E1512,'[1]Tarif de base'!D:E,2,FALSE)*F1512,\"\")","v":""}]
[null,"",null,null,"","",{"$f":"IFERROR(VLOOKUP(E1513,'[1]Tarif de base'!D:E,2,FALSE)*F1513,\"\")","v":""}]
[null,"",null,null,"","",{"$f":"IFERROR(VLOOKUP(E1514,'[1]Tarif de base'!D:E,2,FALSE)*F1514,\"\")","v":""}]
[null,"",null,null,"Total",{"$f":"SUM(F1509:F1514)","v":0},{"$f":"SUM(G1509:G1514)","v":0}]
["","","","","","",{"$f":"IFERROR(VLOOKUP(E1516,'[1]Tarif de base'!D:E,2,FALSE)*F1516,\"\")","v":""},"","","",{"$f":"IFERROR(IF(G1522-H1516-I1516-J1516<>0,\"Attention il manque \"&G1522-H1516-I1516-J1516&\"€\",\"Règlement OK\"),\"Pas de règlement\")","v":"Pas de règlement"},"",null,216]
[null,"",null,null,{"$f":"IFERROR(INDIRECT(\"'C:\\Users\\Moi\\OneDrive\\Documents\\[Formulaires Gravereau.xlsx]Action\"&$N1516&\"'!$D$11\"),\"\")","v":""},{"$f":"IFERROR(INDIRECT(\"'C:\\Users\\Moi\\OneDrive\\Documents\\[Formulaires Gravereau.xlsx]Action\"&$N1516&\"'!$h$11\"),\"\")","v":""},{"$f":"IFERROR(VLOOKUP(E1517,'[1]Tarif de base'!D:E,2,FALSE)*F1517,\"\")","v":""}]
[null,"",null,null,"","",{"$f":"IFERROR(VLOOKUP(E1518,'[1]Tarif de base'!D:E,2,FALSE)*F1518,\"\")","v":""}]
[null,"",null,null,"","",{"$f":"IFERROR(VLOOKUP(E1519,'[1]Tarif de base'!D:E,2,FALSE)*F1519,\"\")","v":""}]
[null,"",null,null,"","",{"$f":"IFERROR(VLOOKUP(E1520,'[1]Tarif de base'!D:E,2,FALSE)*F1520,\"\")","v":""}]
[null,"",null,null,"","",{"$f":"IFERROR(VLOOKUP(E1521,'[1]Tarif de base'!D:E,2,FALSE)*F1521,\"\")","v":""}]
[null,"",null,null,"Total",{"$f":"SUM(F1516:F1521)","v":0},{"$f":"SUM(G1516:G1521)","v":0}]
["","","","","","",{"$f":"IFERROR(VLOOKUP(E1523,'[1]Tarif de base'!D:E,2,FALSE)*F1523,\"\")","v":""},"","","",{"$f":"IFERROR(IF(G1529-H1523-I1523-J1523<>0,\"Attention il manque \"&G1529-H1523-I1523-J1523&\"€\",\"Règlement OK\"),\"Pas de règlement\")","v":"Pas de règlement"},"",null,217]
[null,"",null,null,{"$f":"IFERROR(INDIRECT(\"'C:\\Users\\Moi\\OneDrive\\Documents\\[Formulaires Gravereau.xlsx]Action\"&$N1523&\"'!$D$11\"),\"\")","v":""},{"$f":"IFERROR(INDIRECT(\"'C:\\Users\\Moi\\OneDrive\\Documents\\[Formulaires Gravereau.xlsx]Action\"&$N1523&\"'!$h$11\"),\"\")","v":""},{"$f":"IFERROR(VLOOKUP(E1524,'[1]Tarif de base'!D:E,2,FALSE)*F1524,\"\")","v":""}]
[null,"",null,null,"","",{"$f":"IFERROR(VLOOKUP(E1525,'[1]Tarif de base'!D:E,2,FALSE)*F1525,\"\")","v":""}]
[null,"",null,null,"","",{"$f":"IFERROR(VLOOKUP(E1526,'[1]Tarif de base'!D:E,2,FALSE)*F1526,\"\")","v":""}]
[null,"",null,null,"","",{"$f":"IFERROR(VLOOKUP(E1527,'[1]Tarif de base'!D:E,2,FALSE)*F1527,\"\")","v":""}]
[null,"",null,null,"","",{"$f":"IFERROR(VLOOKUP(E1528,'[1]Tarif de base'!D:E,2,FALSE)*F1528,\"\")","v":""}]
[null,"",null,null,"Total",{"$f":"SUM(F1523:F1528)","v":0},{"$f":"SUM(G1523:G1528)","v":0}]
["","","","","","",{"$f":"IFERROR(VLOOKUP(E1530,'[1]Tarif de base'!D:E,2,FALSE)*F1530,\"\")","v":""},"","","",{"$f":"IFERROR(IF(G1536-H1530-I1530-J1530<>0,\"Attention il manque \"&G1536-H1530-I1530-J1530&\"€\",\"Règlement OK\"),\"Pas de règlement\")","v":"Pas de règlement"},"",null,218]
[null,"",null,null,{"$f":"IFERROR(INDIRECT(\"'C:\\Users\\Moi\\OneDrive\\Documents\\[Formulaires Gravereau.xlsx]Action\"&$N1530&\"'!$D$11\"),\"\")","v":""},{"$f":"IFERROR(INDIRECT(\"'C:\\Users\\Moi\\OneDrive\\Documents\\[Formulaires Gravereau.xlsx]Action\"&$N1530&\"'!$h$11\"),\"\")","v":""},{"$f":"IFERROR(VLOOKUP(E1531,'[1]Tarif de base'!D:E,2,FALSE)*F1531,\"\")","v":""}]
[null,"",null,null,"","",{"$f":"IFERROR(VLOOKUP(E1532,'[1]Tarif de base'!D:E,2,FALSE)*F1532,\"\")","v":""}]
[null,"",null,null,"","",{"$f":"IFERROR(VLOOKUP(E1533,'[1]Tarif de base'!D:E,2,FALSE)*F1533,\"\")","v":""}]
[null,"",null,null,"","",{"$f":"IFERROR(VLOOKUP(E1534,'[1]Tarif de base'!D:E,2,FALSE)*F1534,\"\")","v":""}]
[null,"",null,null,"","",{"$f":"IFERROR(VLOOKUP(E1535,'[1]Tarif de base'!D:E,2,FALSE)*F1535,\"\")","v":""}]
[null,"",null,null,"Total",{"$f":"SUM(F1530:F1535)","v":0},{"$f":"SUM(G1530:G1535)","v":0}]
["","","","","","",{"$f":"IFERROR(VLOOKUP(E1537,'[1]Tarif de base'!D:E,2,FALSE)*F1537,\"\")","v":""},"","","",{"$f":"IFERROR(IF(G1543-H1537-I1537-J1537<>0,\"Attention il manque \"&G1543-H1537-I1537-J1537&\"€\",\"Règlement OK\"),\"Pas de règlement\")","v":"Pas de règlement"},"",null,219]
[null,"",null,null,{"$f":"IFERROR(INDIRECT(\"'C:\\Users\\Moi\\OneDrive\\Documents\\[Formulaires Gravereau.xlsx]Action\"&$N1537&\"'!$D$11\"),\"\")","v":""},{"$f":"IFERROR(INDIRECT(\"'C:\\Users\\Moi\\OneDrive\\Documents\\[Formulaires Gravereau.xlsx]Action\"&$N1537&\"'!$h$11\"),\"\")","v":""},{"$f":"IFERROR(VLOOKUP(E1538,'[1]Tarif de base'!D:E,2,FALSE)*F1538,\"\")","v":""}]
[null,"",null,null,"","",{"$f":"IFERROR(VLOOKUP(E1539,'[1]Tarif de base'!D:E,2,FALSE)*F1539,\"\")","v":""}]
[null,"",null,null,"","",{"$f":"IFERROR(VLOOKUP(E1540,'[1]Tarif de base'!D:E,2,FALSE)*F1540,\"\")","v":""}]
[null,"",null,null,"","",{"$f":"IFERROR(VLOOKUP(E1541,'[1]Tarif de base'!D:E,2,FALSE)*F1541,\"\")","v":""}]
[null,"",null,null,"","",{"$f":"IFERROR(VLOOKUP(E1542,'[1]Tarif de base'!D:E,2,FALSE)*F1542,\"\")","v":""}]
[null,"",null,null,"Total",{"$f":"SUM(F1537:F1542)","v":0},{"$f":"SUM(G1537:G1542)","v":0}]
["","","","","","",{"$f":"IFERROR(VLOOKUP(E1544,'[1]Tarif de base'!D:E,2,FALSE)*F1544,\"\")","v":""},"","","",{"$f":"IFERROR(IF(G1550-H1544-I1544-J1544<>0,\"Attention il manque \"&G1550-H1544-I1544-J1544&\"€\",\"Règlement OK\"),\"Pas de règlement\")","v":"Pas de règlement"},"",null,220]
[null,"",null,null,{"$f":"IFERROR(INDIRECT(\"'C:\\Users\\Moi\\OneDrive\\Documents\\[Formulaires Gravereau.xlsx]Action\"&$N1544&\"'!$D$11\"),\"\")","v":""},{"$f":"IFERROR(INDIRECT(\"'C:\\Users\\Moi\\OneDrive\\Documents\\[Formulaires Gravereau.xlsx]Action\"&$N1544&\"'!$h$11\"),\"\")","v":""},{"$f":"IFERROR(VLOOKUP(E1545,'[1]Tarif de base'!D:E,2,FALSE)*F1545,\"\")","v":""}]
[null,"",null,null,"","",{"$f":"IFERROR(VLOOKUP(E1546,'[1]Tarif de base'!D:E,2,FALSE)*F1546,\"\")","v":""}]
[null,"",null,null,"","",{"$f":"IFERROR(VLOOKUP(E1547,'[1]Tarif de base'!D:E,2,FALSE)*F1547,\"\")","v":""}]
[null,"",null,null,"","",{"$f":"IFERROR(VLOOKUP(E1548,'[1]Tarif de base'!D:E,2,FALSE)*F1548,\"\")","v":""}]
[null,"",null,null,"","",{"$f":"IFERROR(VLOOKUP(E1549,'[1]Tarif de base'!D:E,2,FALSE)*F1549,\"\")","v":""}]
[null,"",null,null,"Total",{"$f":"SUM(F1544:F1549)","v":0},{"$f":"SUM(G1544:G1549)","v":0}]
["","","","","","",{"$f":"IFERROR(VLOOKUP(E1551,'[1]Tarif de base'!D:E,2,FALSE)*F1551,\"\")","v":""},"","","",{"$f":"IFERROR(IF(G1557-H1551-I1551-J1551<>0,\"Attention il manque \"&G1557-H1551-I1551-J1551&\"€\",\"Règlement OK\"),\"Pas de règlement\")","v":"Pas de règlement"},"",null,221]
[null,"",null,null,{"$f":"IFERROR(INDIRECT(\"'C:\\Users\\Moi\\OneDrive\\Documents\\[Formulaires Gravereau.xlsx]Action\"&$N1551&\"'!$D$11\"),\"\")","v":""},{"$f":"IFERROR(INDIRECT(\"'C:\\Users\\Moi\\OneDrive\\Documents\\[Formulaires Gravereau.xlsx]Action\"&$N1551&\"'!$h$11\"),\"\")","v":""},{"$f":"IFERROR(VLOOKUP(E1552,'[1]Tarif de base'!D:E,2,FALSE)*F1552,\"\")","v":""}]
[null,"",null,null,"","",{"$f":"IFERROR(VLOOKUP(E1553,'[1]Tarif de base'!D:E,2,FALSE)*F1553,\"\")","v":""}]
[null,"",null,null,"","",{"$f":"IFERROR(VLOOKUP(E1554,'[1]Tarif de base'!D:E,2,FALSE)*F1554,\"\")","v":""}]
[null,"",null,null,"","",{"$f":"IFERROR(VLOOKUP(E1555,'[1]Tarif de base'!D:E,2,FALSE)*F1555,\"\")","v":""}]
[null,"",null,null,"","",{"$f":"IFERROR(VLOOKUP(E1556,'[1]Tarif de base'!D:E,2,FALSE)*F1556,\"\")","v":""}]
[null,{"$f":"B1556","v":""},null,null,"Total",{"$f":"SUM(F1551:F1556)","v":0},{"$f":"SUM(G1551:G1556)","v":0}]
["","","","","","",{"$f":"IFERROR(VLOOKUP(E1558,'[1]Tarif de base'!D:E,2,FALSE)*F1558,\"\")","v":""},"","","",{"$f":"IFERROR(IF(G1564-H1558-I1558-J1558<>0,\"Attention il manque \"&G1564-H1558-I1558-J1558&\"€\",\"Règlement OK\"),\"Pas de règlement\")","v":"Pas de règlement"},"",null,222]
[null,"",null,null,{"$f":"IFERROR(INDIRECT(\"'C:\\Users\\Moi\\OneDrive\\Documents\\[Formulaires Gravereau.xlsx]Action\"&$N1558&\"'!$D$11\"),\"\")","v":""},{"$f":"IFERROR(INDIRECT(\"'C:\\Users\\Moi\\OneDrive\\Documents\\[Formulaires Gravereau.xlsx]Action\"&$N1558&\"'!$h$11\"),\"\")","v":""},{"$f":"IFERROR(VLOOKUP(E1559,'[1]Tarif de base'!D:E,2,FALSE)*F1559,\"\")","v":""}]
[null,"",null,null,"","",{"$f":"IFERROR(VLOOKUP(E1560,'[1]Tarif de base'!D:E,2,FALSE)*F1560,\"\")","v":""}]
[null,"",null,null,"","",{"$f":"IFERROR(VLOOKUP(E1561,'[1]Tarif de base'!D:E,2,FALSE)*F1561,\"\")","v":""}]
[null,"",null,null,"","",{"$f":"IFERROR(VLOOKUP(E1562,'[1]Tarif de base'!D:E,2,FALSE)*F1562,\"\")","v":""}]
[null,"",null,null,"","",{"$f":"IFERROR(VLOOKUP(E1563,'[1]Tarif de base'!D:E,2,FALSE)*F1563,\"\")","v":""}]
[null,"",null,null,"Total",{"$f":"SUM(F1558:F1563)","v":0},{"$f":"SUM(G1558:G1563)","v":0}]
["","","","","","",{"$f":"IFERROR(VLOOKUP(E1565,'[1]Tarif de base'!D:E,2,FALSE)*F1565,\"\")","v":""},"","","",{"$f":"IFERROR(IF(G1571-H1565-I1565-J1565<>0,\"Attention il manque \"&G1571-H1565-I1565-J1565&\"€\",\"Règlement OK\"),\"Pas de règlement\")","v":"Pas de règlement"},"",null,223]
[null,"",null,null,{"$f":"IFERROR(INDIRECT(\"'C:\\Users\\Moi\\OneDrive\\Documents\\[Formulaires Gravereau.xlsx]Action\"&$N1565&\"'!$D$11\"),\"\")","v":""},{"$f":"IFERROR(INDIRECT(\"'C:\\Users\\Moi\\OneDrive\\Documents\\[Formulaires Gravereau.xlsx]Action\"&$N1565&\"'!$h$11\"),\"\")","v":""},{"$f":"IFERROR(VLOOKUP(E1566,'[1]Tarif de base'!D:E,2,FALSE)*F1566,\"\")","v":""}]
[null,"",null,null,"","",{"$f":"IFERROR(VLOOKUP(E1567,'[1]Tarif de base'!D:E,2,FALSE)*F1567,\"\")","v":""}]
[null,"",null,null,"","",{"$f":"IFERROR(VLOOKUP(E1568,'[1]Tarif de base'!D:E,2,FALSE)*F1568,\"\")","v":""}]
[null,"",null,null,"","",{"$f":"IFERROR(VLOOKUP(E1569,'[1]Tarif de base'!D:E,2,FALSE)*F1569,\"\")","v":""}]
[null,"",null,null,"","",{"$f":"IFERROR(VLOOKUP(E1570,'[1]Tarif de base'!D:E,2,FALSE)*F1570,\"\")","v":""}]
[null,"",null,null,"Total",{"$f":"SUM(F1565:F1570)","v":0},{"$f":"SUM(G1565:G1570)","v":0}]
[{"$f":"IFERROR(INDIRECT(\"'C:\\Users\\Moi\\OneDrive\\Documents\\[Formulaires Gravereau.xlsx]Action\"&$N1572&\"'!$D$6\"),\"\")","v":""},{"$f":"IF(C1572<>\"\",C1572,\"\")","v":""},{"$f":"IFERROR(INDIRECT(\"'C:\\Users\\Moi\\OneDrive\\Documents\\[Formulaires Gravereau.xlsx]Action\"&$N1572&\"'!$D$4\"),\"\")","v":""},{"$f":"IFERROR(INDIRECT(\"'C:\\Users\\Moi\\OneDrive\\Documents\\[Formulaires Gravereau.xlsx]Action\"&$N1572&\"'!$h$4\"),\"\")","v":""},{"$f":"IFERROR(INDIRECT(\"'C:\\Users\\Moi\\OneDrive\\Documents\\[Formulaires Gravereau.xlsx]Action\"&$N1572&\"'!$D$9\"),\"\")","v":""},{"$f":"IFERROR(INDIRECT(\"'C:\\Users\\Moi\\OneDrive\\Documents\\[Formulaires Gravereau.xlsx]Action\"&$N1572&\"'!$h$9\"),\"\")","v":""},{"$f":"IFERROR(VLOOKUP(E1572,'[1]Tarif de base'!D:E,2,FALSE)*F1572,\"\")","v":""},{"$f":"IFERROR(INDIRECT(\"'C:\\Users\\Moi\\OneDrive\\Documents\\[Formulaires Gravereau.xlsx]Action\"&$N1572&\"'!$d$26\"),\"\")","v":""},{"$f":"IFERROR(INDIRECT(\"'C:\\Users\\Moi\\OneDrive\\Documents\\[Formulaires Gravereau.xlsx]Action\"&$N1572&\"'!$d$28\"),\"\")","v":""},{"$f":"IFERROR(INDIRECT(\"'C:\\Users\\Moi\\OneDrive\\Documents\\[Formulaires Gravereau.xlsx]Action\"&$N1572&\"'!$h$26\"),\"\")","v":""},{"$f":"IFERROR(IF(G1578-H1572-I1572-J1572<>0,\"Attention il manque \"&G1578-H1572-I1572-J1572&\"€\",\"Règlement OK\"),\"Pas de règlement\")","v":"Pas de règlement"},{"$f":"IFERROR(INDIRECT(\"'C:\\Users\\Moi\\OneDrive\\Documents\\[Formulaires Gravereau.xlsx]Action\"&$N1572&\"'!$d$30\"),\"\")","v":""},null,224]
[null,"",null,null,{"$f":"IFERROR(INDIRECT(\"'C:\\Users\\Moi\\OneDrive\\Documents\\[Formulaires Gravereau.xlsx]Action\"&$N1572&\"'!$D$11\"),\"\")","v":""},{"$f":"IFERROR(INDIRECT(\"'C:\\Users\\Moi\\OneDrive\\Documents\\[Formulaires Gravereau.xlsx]Action\"&$N1572&\"'!$h$11\"),\"\")","v":""},{"$f":"IFERROR(VLOOKUP(E1573,'[1]Tarif de base'!D:E,2,FALSE)*F1573,\"\")","v":""}]
[null,"",null,null,{"$f":"IFERROR(INDIRECT(\"'C:\\Users\\Moi\\OneDrive\\Documents\\[Formulaires Gravereau.xlsx]Action\"&$N1572&\"'!$D$13\"),\"\")","v":""},{"$f":"IFERROR(INDIRECT(\"'C:\\Users\\Moi\\OneDrive\\Documents\\[Formulaires Gravereau.xlsx]Action\"&$N1572&\"'!$h$13\"),\"\")","v":""},{"$f":"IFERROR(VLOOKUP(E1574,'[1]Tarif de base'!D:E,2,FALSE)*F1574,\"\")","v":""}]
[null,"",null,null,{"$f":"IFERROR(INDIRECT(\"'C:\\Users\\Moi\\OneDrive\\Documents\\[Formulaires Gravereau.xlsx]Action\"&$N1572&\"'!$D$15\"),\"\")","v":""},{"$f":"IFERROR(INDIRECT(\"'C:\\Users\\Moi\\OneDrive\\Documents\\[Formulaires Gravereau.xlsx]Action\"&$N1572&\"'!$h$15\"),\"\")","v":""},{"$f":"IFERROR(VLOOKUP(E1575,'[1]Tarif de base'!D:E,2,FALSE)*F1575,\"\")","v":""}]
[null,"",null,null,{"$f":"IFERROR(INDIRECT(\"'C:\\Users\\Moi\\OneDrive\\Documents\\[Formulaires Gravereau.xlsx]Action\"&$N1572&\"'!$D$17\"),\"\")","v":""},{"$f":"IFERROR(INDIRECT(\"'C:\\Users\\Moi\\OneDrive\\Documents\\[Formulaires Gravereau.xlsx]Action\"&$N1572&\"'!$h$17\"),\"\")","v":""},{"$f":"IFERROR(VLOOKUP(E1576,'[1]Tarif de base'!D:E,2,FALSE)*F1576,\"\")","v":""}]
[null,"",null,null,{"$f":"IFERROR(INDIRECT(\"'C:\\Users\\Moi\\OneDrive\\Documents\\[Formulaires Gravereau.xlsx]Action\"&$N1572&\"'!$D$19\"),\"\")","v":""},{"$f":"IFERROR(INDIRECT(\"'C:\\Users\\Moi\\OneDrive\\Documents\\[Formulaires Gravereau.xlsx]Action\"&$N1572&\"'!$h$19\"),\"\")","v":""},{"$f":"IFERROR(VLOOKUP(E1577,'[1]Tarif de base'!D:E,2,FALSE)*F1577,\"\")","v":""}]
[null,"",null,null,"Total",{"$f":"SUM(F1572:F1577)","v":0},{"$f":"SUM(G1572:G1577)","v":0}]
["","","","","","",{"$f":"IFERROR(VLOOKUP(E1579,'[1]Tarif de base'!D:E,2,FALSE)*F1579,\"\")","v":""},"","","",{"$f":"IFERROR(IF(G1585-H1579-I1579-J1579<>0,\"Attention il manque \"&G1585-H1579-I1579-J1579&\"€\",\"Règlement OK\"),\"Pas de règlement\")","v":"Pas de règlement"},"",null,225]
[null,"",null,null,{"$f":"IFERROR(INDIRECT(\"'C:\\Users\\Moi\\OneDrive\\Documents\\[Formulaires Gravereau.xlsx]Action\"&$N1579&\"'!$D$11\"),\"\")","v":""},{"$f":"IFERROR(INDIRECT(\"'C:\\Users\\Moi\\OneDrive\\Documents\\[Formulaires Gravereau.xlsx]Action\"&$N1579&\"'!$h$11\"),\"\")","v":""},{"$f":"IFERROR(VLOOKUP(E1580,'[1]Tarif de base'!D:E,2,FALSE)*F1580,\"\")","v":""}]
[null,"",null,null,"","",{"$f":"IFERROR(VLOOKUP(E1581,'[1]Tarif de base'!D:E,2,FALSE)*F1581,\"\")","v":""}]
[null,"",null,null,"","",{"$f":"IFERROR(VLOOKUP(E1582,'[1]Tarif de base'!D:E,2,FALSE)*F1582,\"\")","v":""}]
[null,"",null,null,"","",{"$f":"IFERROR(VLOOKUP(E1583,'[1]Tarif de base'!D:E,2,FALSE)*F1583,\"\")","v":""}]
[null,"",null,null,"","",{"$f":"IFERROR(VLOOKUP(E1584,'[1]Tarif de base'!D:E,2,FALSE)*F1584,\"\")","v":""}]
[null,"",null,null,"Total",{"$f":"SUM(F1579:F1584)","v":0},{"$f":"SUM(G1579:G1584)","v":0}]
["","","","","","",{"$f":"IFERROR(VLOOKUP(E1586,'[1]Tarif de base'!D:E,2,FALSE)*F1586,\"\")","v":""},"","","",{"$f":"IFERROR(IF(G1592-H1586-I1586-J1586<>0,\"Attention il manque \"&G1592-H1586-I1586-J1586&\"€\",\"Règlement OK\"),\"Pas de règlement\")","v":"Pas de règlement"},"",null,226]
[null,"",null,null,{"$f":"IFERROR(INDIRECT(\"'C:\\Users\\Moi\\OneDrive\\Documents\\[Formulaires Gravereau.xlsx]Action\"&$N1586&\"'!$D$11\"),\"\")","v":""},{"$f":"IFERROR(INDIRECT(\"'C:\\Users\\Moi\\OneDrive\\Documents\\[Formulaires Gravereau.xlsx]Action\"&$N1586&\"'!$h$11\"),\"\")","v":""},{"$f":"IFERROR(VLOOKUP(E1587,'[1]Tarif de base'!D:E,2,FALSE)*F1587,\"\")","v":""}]
[null,"",null,null,"","",{"$f":"IFERROR(VLOOKUP(E1588,'[1]Tarif de base'!D:E,2,FALSE)*F1588,\"\")","v":""}]
[null,"",null,null,"","",{"$f":"IFERROR(VLOOKUP(E1589,'[1]Tarif de base'!D:E,2,FALSE)*F1589,\"\")","v":""}]
[null,"",null,null,"","",{"$f":"IFERROR(VLOOKUP(E1590,'[1]Tarif de base'!D:E,2,FALSE)*F1590,\"\")","v":""}]
[null,"",null,null,"","",{"$f":"IFERROR(VLOOKUP(E1591,'[1]Tarif de base'!D:E,2,FALSE)*F1591,\"\")","v":""}]
[null,"",null,null,"Total",{"$f":"SUM(F1586:F1591)","v":0},{"$f":"SUM(G1586:G1591)","v":0}]
["","","","","","",{"$f":"IFERROR(VLOOKUP(E1593,'[1]Tarif de base'!D:E,2,FALSE)*F1593,\"\")","v":""},"","","",{"$f":"IFERROR(IF(G1599-H1593-I1593-J1593<>0,\"Attention il manque \"&G1599-H1593-I1593-J1593&\"€\",\"Règlement OK\"),\"Pas de règlement\")","v":"Pas de règlement"},"",null,227]
[null,"",null,null,{"$f":"IFERROR(INDIRECT(\"'C:\\Users\\Moi\\OneDrive\\Documents\\[Formulaires Gravereau.xlsx]Action\"&$N1593&\"'!$D$11\"),\"\")","v":""},{"$f":"IFERROR(INDIRECT(\"'C:\\Users\\Moi\\OneDrive\\Documents\\[Formulaires Gravereau.xlsx]Action\"&$N1593&\"'!$h$11\"),\"\")","v":""},{"$f":"IFERROR(VLOOKUP(E1594,'[1]Tarif de base'!D:E,2,FALSE)*F1594,\"\")","v":""}]
[null,"",null,null,"","",{"$f":"IFERROR(VLOOKUP(E1595,'[1]Tarif de base'!D:E,2,FALSE)*F1595,\"\")","v":""}]
[null,"",null,null,"","",{"$f":"IFERROR(VLOOKUP(E1596,'[1]Tarif de base'!D:E,2,FALSE)*F1596,\"\")","v":""}]
[null,"",null,null,"","",{"$f":"IFERROR(VLOOKUP(E1597,'[1]Tarif de base'!D:E,2,FALSE)*F1597,\"\")","v":""}]
[null,"",null,null,"","",{"$f":"IFERROR(VLOOKUP(E1598,'[1]Tarif de base'!D:E,2,FALSE)*F1598,\"\")","v":""}]
[null,"",null,null,"Total",{"$f":"SUM(F1593:F1598)","v":0},{"$f":"SUM(G1593:G1598)","v":0}]
["","","","","","",{"$f":"IFERROR(VLOOKUP(E1600,'[1]Tarif de base'!D:E,2,FALSE)*F1600,\"\")","v":""},"","","",{"$f":"IFERROR(IF(G1606-H1600-I1600-J1600<>0,\"Attention il manque \"&G1606-H1600-I1600-J1600&\"€\",\"Règlement OK\"),\"Pas de règlement\")","v":"Pas de règlement"},"",null,228]
[null,"",null,null,{"$f":"IFERROR(INDIRECT(\"'C:\\Users\\Moi\\OneDrive\\Documents\\[Formulaires Gravereau.xlsx]Action\"&$N1600&\"'!$D$11\"),\"\")","v":""},{"$f":"IFERROR(INDIRECT(\"'C:\\Users\\Moi\\OneDrive\\Documents\\[Formulaires Gravereau.xlsx]Action\"&$N1600&\"'!$h$11\"),\"\")","v":""},{"$f":"IFERROR(VLOOKUP(E1601,'[1]Tarif de base'!D:E,2,FALSE)*F1601,\"\")","v":""}]
[null,"",null,null,"","",{"$f":"IFERROR(VLOOKUP(E1602,'[1]Tarif de base'!D:E,2,FALSE)*F1602,\"\")","v":""}]
[null,"",null,null,"","",{"$f":"IFERROR(VLOOKUP(E1603,'[1]Tarif de base'!D:E,2,FALSE)*F1603,\"\")","v":""}]
[null,"",null,null,"","",{"$f":"IFERROR(VLOOKUP(E1604,'[1]Tarif de base'!D:E,2,FALSE)*F1604,\"\")","v":""}]
[null,"",null,null,"","",{"$f":"IFERROR(VLOOKUP(E1605,'[1]Tarif de base'!D:E,2,FALSE)*F1605,\"\")","v":""}]
[null,"",null,null,"Total",{"$f":"SUM(F1600:F1605)","v":0},{"$f":"SUM(G1600:G1605)","v":0}]
["","","","","","",{"$f":"IFERROR(VLOOKUP(E1607,'[1]Tarif de base'!D:E,2,FALSE)*F1607,\"\")","v":""},"","","",{"$f":"IFERROR(IF(G1613-H1607-I1607-J1607<>0,\"Attention il manque \"&G1613-H1607-I1607-J1607&\"€\",\"Règlement OK\"),\"Pas de règlement\")","v":"Pas de règlement"},"",null,229]
[null,"",null,null,{"$f":"IFERROR(INDIRECT(\"'C:\\Users\\Moi\\OneDrive\\Documents\\[Formulaires Gravereau.xlsx]Action\"&$N1607&\"'!$D$11\"),\"\")","v":""},{"$f":"IFERROR(INDIRECT(\"'C:\\Users\\Moi\\OneDrive\\Documents\\[Formulaires Gravereau.xlsx]Action\"&$N1607&\"'!$h$11\"),\"\")","v":""},{"$f":"IFERROR(VLOOKUP(E1608,'[1]Tarif de base'!D:E,2,FALSE)*F1608,\"\")","v":""}]
[null,"",null,null,"","",{"$f":"IFERROR(VLOOKUP(E1609,'[1]Tarif de base'!D:E,2,FALSE)*F1609,\"\")","v":""}]
[null,"",null,null,"","",{"$f":"IFERROR(VLOOKUP(E1610,'[1]Tarif de base'!D:E,2,FALSE)*F1610,\"\")","v":""}]
[null,"",null,null,"","",{"$f":"IFERROR(VLOOKUP(E1611,'[1]Tarif de base'!D:E,2,FALSE)*F1611,\"\")","v":""}]
[null,"",null,null,"","",{"$f":"IFERROR(VLOOKUP(E1612,'[1]Tarif de base'!D:E,2,FALSE)*F1612,\"\")","v":""}]
[null,"",null,null,"Total",{"$f":"SUM(F1607:F1612)","v":0},{"$f":"SUM(G1607:G1612)","v":0}]
["","","","","","",{"$f":"IFERROR(VLOOKUP(E1614,'[1]Tarif de base'!D:E,2,FALSE)*F1614,\"\")","v":""},"","","",{"$f":"IFERROR(IF(G1620-H1614-I1614-J1614<>0,\"Attention il manque \"&G1620-H1614-I1614-J1614&\"€\",\"Règlement OK\"),\"Pas de règlement\")","v":"Pas de règlement"},"",null,230]
[null,"",null,null,{"$f":"IFERROR(INDIRECT(\"'C:\\Users\\Moi\\OneDrive\\Documents\\[Formulaires Gravereau.xlsx]Action\"&$N1614&\"'!$D$11\"),\"\")","v":""},{"$f":"IFERROR(INDIRECT(\"'C:\\Users\\Moi\\OneDrive\\Documents\\[Formulaires Gravereau.xlsx]Action\"&$N1614&\"'!$h$11\"),\"\")","v":""},{"$f":"IFERROR(VLOOKUP(E1615,'[1]Tarif de base'!D:E,2,FALSE)*F1615,\"\")","v":""}]
[null,"",null,null,"","",{"$f":"IFERROR(VLOOKUP(E1616,'[1]Tarif de base'!D:E,2,FALSE)*F1616,\"\")","v":""}]
[null,"",null,null,"","",{"$f":"IFERROR(VLOOKUP(E1617,'[1]Tarif de base'!D:E,2,FALSE)*F1617,\"\")","v":""}]
[null,"",null,null,"","",{"$f":"IFERROR(VLOOKUP(E1618,'[1]Tarif de base'!D:E,2,FALSE)*F1618,\"\")","v":""}]
[null,"",null,null,"","",{"$f":"IFERROR(VLOOKUP(E1619,'[1]Tarif de base'!D:E,2,FALSE)*F1619,\"\")","v":""}]
[null,"",null,null,"Total",{"$f":"SUM(F1614:F1619)","v":0},{"$f":"SUM(G1614:G1619)","v":0}]
["","","","","","",{"$f":"IFERROR(VLOOKUP(E1621,'[1]Tarif de base'!D:E,2,FALSE)*F1621,\"\")","v":""},"","","",{"$f":"IFERROR(IF(G1627-H1621-I1621-J1621<>0,\"Attention il manque \"&G1627-H1621-I1621-J1621&\"€\",\"Règlement OK\"),\"Pas de règlement\")","v":"Pas de règlement"},"",null,231]
[null,{"$f":"B1621","v":""},null,null,{"$f":"IFERROR(INDIRECT(\"'C:\\Users\\Moi\\OneDrive\\Documents\\[Formulaires Gravereau.xlsx]Action\"&$N1621&\"'!$D$11\"),\"\")","v":""},{"$f":"IFERROR(INDIRECT(\"'C:\\Users\\Moi\\OneDrive\\Documents\\[Formulaires Gravereau.xlsx]Action\"&$N1621&\"'!$h$11\"),\"\")","v":""},{"$f":"IFERROR(VLOOKUP(E1622,'[1]Tarif de base'!D:E,2,FALSE)*F1622,\"\")","v":""}]
[null,"",null,null,"","",{"$f":"IFERROR(VLOOKUP(E1623,'[1]Tarif de base'!D:E,2,FALSE)*F1623,\"\")","v":""}]
[null,"",null,null,"","",{"$f":"IFERROR(VLOOKUP(E1624,'[1]Tarif de base'!D:E,2,FALSE)*F1624,\"\")","v":""}]
[null,"",null,null,"","",{"$f":"IFERROR(VLOOKUP(E1625,'[1]Tarif de base'!D:E,2,FALSE)*F1625,\"\")","v":""}]
[null,"",null,null,"","",{"$f":"IFERROR(VLOOKUP(E1626,'[1]Tarif de base'!D:E,2,FALSE)*F1626,\"\")","v":""}]
[null,"",null,null,"Total",{"$f":"SUM(F1621:F1626)","v":0},{"$f":"SUM(G1621:G1626)","v":0}]
["","","","","","",{"$f":"IFERROR(VLOOKUP(E1628,'[1]Tarif de base'!D:E,2,FALSE)*F1628,\"\")","v":""},"","","",{"$f":"IFERROR(IF(G1634-H1628-I1628-J1628<>0,\"Attention il manque \"&G1634-H1628-I1628-J1628&\"€\",\"Règlement OK\"),\"Pas de règlement\")","v":"Pas de règlement"},"",null,232]
[null,"",null,null,{"$f":"IFERROR(INDIRECT(\"'C:\\Users\\Moi\\OneDrive\\Documents\\[Formulaires Gravereau.xlsx]Action\"&$N1628&\"'!$D$11\"),\"\")","v":""},{"$f":"IFERROR(INDIRECT(\"'C:\\Users\\Moi\\OneDrive\\Documents\\[Formulaires Gravereau.xlsx]Action\"&$N1628&\"'!$h$11\"),\"\")","v":""},{"$f":"IFERROR(VLOOKUP(E1629,'[1]Tarif de base'!D:E,2,FALSE)*F1629,\"\")","v":""}]
[null,"",null,null,"","",{"$f":"IFERROR(VLOOKUP(E1630,'[1]Tarif de base'!D:E,2,FALSE)*F1630,\"\")","v":""}]
[null,"",null,null,"","",{"$f":"IFERROR(VLOOKUP(E1631,'[1]Tarif de base'!D:E,2,FALSE)*F1631,\"\")","v":""}]
[null,"",null,null,"","",{"$f":"IFERROR(VLOOKUP(E1632,'[1]Tarif de base'!D:E,2,FALSE)*F1632,\"\")","v":""}]
[null,"",null,null,"","",{"$f":"IFERROR(VLOOKUP(E1633,'[1]Tarif de base'!D:E,2,FALSE)*F1633,\"\")","v":""}]
[null,"",null,null,"Total",{"$f":"SUM(F1628:F1633)","v":0},{"$f":"SUM(G1628:G1633)","v":0}]
["","","","","","",{"$f":"IFERROR(VLOOKUP(E1635,'[1]Tarif de base'!D:E,2,FALSE)*F1635,\"\")","v":""},"","","",{"$f":"IFERROR(IF(G1641-H1635-I1635-J1635<>0,\"Attention il manque \"&G1641-H1635-I1635-J1635&\"€\",\"Règlement OK\"),\"Pas de règlement\")","v":"Pas de règlement"},"",null,233]
[null,"",null,null,{"$f":"IFERROR(INDIRECT(\"'C:\\Users\\Moi\\OneDrive\\Documents\\[Formulaires Gravereau.xlsx]Action\"&$N1635&\"'!$D$11\"),\"\")","v":""},{"$f":"IFERROR(INDIRECT(\"'C:\\Users\\Moi\\OneDrive\\Documents\\[Formulaires Gravereau.xlsx]Action\"&$N1635&\"'!$h$11\"),\"\")","v":""},{"$f":"IFERROR(VLOOKUP(E1636,'[1]Tarif de base'!D:E,2,FALSE)*F1636,\"\")","v":""}]
[null,"",null,null,"","",{"$f":"IFERROR(VLOOKUP(E1637,'[1]Tarif de base'!D:E,2,FALSE)*F1637,\"\")","v":""}]
[null,"",null,null,"","",{"$f":"IFERROR(VLOOKUP(E1638,'[1]Tarif de base'!D:E,2,FALSE)*F1638,\"\")","v":""}]
[null,"",null,null,"","",{"$f":"IFERROR(VLOOKUP(E1639,'[1]Tarif de base'!D:E,2,FALSE)*F1639,\"\")","v":""}]
[null,"",null,null,"","",{"$f":"IFERROR(VLOOKUP(E1640,'[1]Tarif de base'!D:E,2,FALSE)*F1640,\"\")","v":""}]
[null,"",null,null,"Total",{"$f":"SUM(F1635:F1640)","v":0},{"$f":"SUM(G1635:G1640)","v":0}]
[{"$f":"IFERROR(INDIRECT(\"'C:\\Users\\Moi\\OneDrive\\Documents\\[Formulaires Gravereau.xlsx]Action\"&$N1642&\"'!$D$6\"),\"\")","v":""},{"$f":"IF(C1642<>\"\",C1642,\"\")","v":""},{"$f":"IFERROR(INDIRECT(\"'C:\\Users\\Moi\\OneDrive\\Documents\\[Formulaires Gravereau.xlsx]Action\"&$N1642&\"'!$D$4\"),\"\")","v":""},{"$f":"IFERROR(INDIRECT(\"'C:\\Users\\Moi\\OneDrive\\Documents\\[Formulaires Gravereau.xlsx]Action\"&$N1642&\"'!$h$4\"),\"\")","v":""},{"$f":"IFERROR(INDIRECT(\"'C:\\Users\\Moi\\OneDrive\\Documents\\[Formulaires Gravereau.xlsx]Action\"&$N1642&\"'!$D$9\"),\"\")","v":""},{"$f":"IFERROR(INDIRECT(\"'C:\\Users\\Moi\\OneDrive\\Documents\\[Formulaires Gravereau.xlsx]Action\"&$N1642&\"'!$h$9\"),\"\")","v":""},{"$f":"IFERROR(VLOOKUP(E1642,'[1]Tarif de base'!D:E,2,FALSE)*F1642,\"\")","v":""},{"$f":"IFERROR(INDIRECT(\"'C:\\Users\\Moi\\OneDrive\\Documents\\[Formulaires Gravereau.xlsx]Action\"&$N1642&\"'!$d$26\"),\"\")","v":""},{"$f":"IFERROR(INDIRECT(\"'C:\\Users\\Moi\\OneDrive\\Documents\\[Formulaires Gravereau.xlsx]Action\"&$N1642&\"'!$d$28\"),\"\")","v":""},{"$f":"IFERROR(INDIRECT(\"'C:\\Users\\Moi\\OneDrive\\Documents\\[Formulaires Gravereau.xlsx]Action\"&$N1642&\"'!$h$26\"),\"\")","v":""},{"$f":"IFERROR(IF(G1648-H1642-I1642-J1642<>0,\"Attention il manque \"&G1648-H1642-I1642-J1642&\"€\",\"Règlement OK\"),\"Pas de règlement\")","v":"Pas de règlement"},{"$f":"IFERROR(INDIRECT(\"'C:\\Users\\Moi\\OneDrive\\Documents\\[Formulaires Gravereau.xlsx]Action\"&$N1642&\"'!$d$30\"),\"\")","v":""},null,234]
[null,"",null,null,{"$f":"IFERROR(INDIRECT(\"'C:\\Users\\Moi\\OneDrive\\Documents\\[Formulaires Gravereau.xlsx]Action\"&$N1642&\"'!$D$11\"),\"\")","v":""},{"$f":"IFERROR(INDIRECT(\"'C:\\Users\\Moi\\OneDrive\\Documents\\[Formulaires Gravereau.xlsx]Action\"&$N1642&\"'!$h$11\"),\"\")","v":""},{"$f":"IFERROR(VLOOKUP(E1643,'[1]Tarif de base'!D:E,2,FALSE)*F1643,\"\")","v":""}]
[null,"",null,null,{"$f":"IFERROR(INDIRECT(\"'C:\\Users\\Moi\\OneDrive\\Documents\\[Formulaires Gravereau.xlsx]Action\"&$N1642&\"'!$D$13\"),\"\")","v":""},{"$f":"IFERROR(INDIRECT(\"'C:\\Users\\Moi\\OneDrive\\Documents\\[Formulaires Gravereau.xlsx]Action\"&$N1642&\"'!$h$13\"),\"\")","v":""},{"$f":"IFERROR(VLOOKUP(E1644,'[1]Tarif de base'!D:E,2,FALSE)*F1644,\"\")","v":""}]
[null,"",null,null,{"$f":"IFERROR(INDIRECT(\"'C:\\Users\\Moi\\OneDrive\\Documents\\[Formulaires Gravereau.xlsx]Action\"&$N1642&\"'!$D$15\"),\"\")","v":""},{"$f":"IFERROR(INDIRECT(\"'C:\\Users\\Moi\\OneDrive\\Documents\\[Formulaires Gravereau.xlsx]Action\"&$N1642&\"'!$h$15\"),\"\")","v":""},{"$f":"IFERROR(VLOOKUP(E1645,'[1]Tarif de base'!D:E,2,FALSE)*F1645,\"\")","v":""}]
[null,"",null,null,{"$f":"IFERROR(INDIRECT(\"'C:\\Users\\Moi\\OneDrive\\Documents\\[Formulaires Gravereau.xlsx]Action\"&$N1642&\"'!$D$17\"),\"\")","v":""},{"$f":"IFERROR(INDIRECT(\"'C:\\Users\\Moi\\OneDrive\\Documents\\[Formulaires Gravereau.xlsx]Action\"&$N1642&\"'!$h$17\"),\"\")","v":""},{"$f":"IFERROR(VLOOKUP(E1646,'[1]Tarif de base'!D:E,2,FALSE)*F1646,\"\")","v":""}]
[null,"",null,null,{"$f":"IFERROR(INDIRECT(\"'C:\\Users\\Moi\\OneDrive\\Documents\\[Formulaires Gravereau.xlsx]Action\"&$N1642&\"'!$D$19\"),\"\")","v":""},{"$f":"IFERROR(INDIRECT(\"'C:\\Users\\Moi\\OneDrive\\Documents\\[Formulaires Gravereau.xlsx]Action\"&$N1642&\"'!$h$19\"),\"\")","v":""},{"$f":"IFERROR(VLOOKUP(E1647,'[1]Tarif de base'!D:E,2,FALSE)*F1647,\"\")","v":""}]
[null,"",null,null,"Total",{"$f":"SUM(F1642:F1647)","v":0},{"$f":"SUM(G1642:G1647)","v":0}]
["","","","","","",{"$f":"IFERROR(VLOOKUP(E1649,'[1]Tarif de base'!D:E,2,FALSE)*F1649,\"\")","v":""},"","","",{"$f":"IFERROR(IF(G1655-H1649-I1649-J1649<>0,\"Attention il manque \"&G1655-H1649-I1649-J1649&\"€\",\"Règlement OK\"),\"Pas de règlement\")","v":"Pas de règlement"},"",null,235]
[null,"",null,null,{"$f":"IFERROR(INDIRECT(\"'C:\\Users\\Moi\\OneDrive\\Documents\\[Formulaires Gravereau.xlsx]Action\"&$N1649&\"'!$D$11\"),\"\")","v":""},{"$f":"IFERROR(INDIRECT(\"'C:\\Users\\Moi\\OneDrive\\Documents\\[Formulaires Gravereau.xlsx]Action\"&$N1649&\"'!$h$11\"),\"\")","v":""},{"$f":"IFERROR(VLOOKUP(E1650,'[1]Tarif de base'!D:E,2,FALSE)*F1650,\"\")","v":""}]
[null,"",null,null,"","",{"$f":"IFERROR(VLOOKUP(E1651,'[1]Tarif de base'!D:E,2,FALSE)*F1651,\"\")","v":""}]
[null,"",null,null,"","",{"$f":"IFERROR(VLOOKUP(E1652,'[1]Tarif de base'!D:E,2,FALSE)*F1652,\"\")","v":""}]
[null,"",null,null,"","",{"$f":"IFERROR(VLOOKUP(E1653,'[1]Tarif de base'!D:E,2,FALSE)*F1653,\"\")","v":""}]
[null,"",null,null,"","",{"$f":"IFERROR(VLOOKUP(E1654,'[1]Tarif de base'!D:E,2,FALSE)*F1654,\"\")","v":""}]
[null,"",null,null,"Total",{"$f":"SUM(F1649:F1654)","v":0},{"$f":"SUM(G1649:G1654)","v":0}]
["","","","","","",{"$f":"IFERROR(VLOOKUP(E1656,'[1]Tarif de base'!D:E,2,FALSE)*F1656,\"\")","v":""},"","","",{"$f":"IFERROR(IF(G1662-H1656-I1656-J1656<>0,\"Attention il manque \"&G1662-H1656-I1656-J1656&\"€\",\"Règlement OK\"),\"Pas de règlement\")","v":"Pas de règlement"},"",null,236]
[null,"",null,null,{"$f":"IFERROR(INDIRECT(\"'C:\\Users\\Moi\\OneDrive\\Documents\\[Formulaires Gravereau.xlsx]Action\"&$N1656&\"'!$D$11\"),\"\")","v":""},{"$f":"IFERROR(INDIRECT(\"'C:\\Users\\Moi\\OneDrive\\Documents\\[Formulaires Gravereau.xlsx]Action\"&$N1656&\"'!$h$11\"),\"\")","v":""},{"$f":"IFERROR(VLOOKUP(E1657,'[1]Tarif de base'!D:E,2,FALSE)*F1657,\"\")","v":""}]
[null,"",null,null,"","",{"$f":"IFERROR(VLOOKUP(E1658,'[1]Tarif de base'!D:E,2,FALSE)*F1658,\"\")","v":""}]
[null,"",null,null,"","",{"$f":"IFERROR(VLOOKUP(E1659,'[1]Tarif de base'!D:E,2,FALSE)*F1659,\"\")","v":""}]
[null,"",null,null,"","",{"$f":"IFERROR(VLOOKUP(E1660,'[1]Tarif de base'!D:E,2,FALSE)*F1660,\"\")","v":""}]
[null,"",null,null,"","",{"$f":"IFERROR(VLOOKUP(E1661,'[1]Tarif de base'!D:E,2,FALSE)*F1661,\"\")","v":""}]
[null,"",null,null,"Total",{"$f":"SUM(F1656:F1661)","v":0},{"$f":"SUM(G1656:G1661)","v":0}]
["","","","","","",{"$f":"IFERROR(VLOOKUP(E1663,'[1]Tarif de base'!D:E,2,FALSE)*F1663,\"\")","v":""},"","","",{"$f":"IFERROR(IF(G1669-H1663-I1663-J1663<>0,\"Attention il manque \"&G1669-H1663-I1663-J1663&\"€\",\"Règlement OK\"),\"Pas de règlement\")","v":"Pas de règlement"},"",null,237]
[null,"",null,null,{"$f":"IFERROR(INDIRECT(\"'C:\\Users\\Moi\\OneDrive\\Documents\\[Formulaires Gravereau.xlsx]Action\"&$N1663&\"'!$D$11\"),\"\")","v":""},{"$f":"IFERROR(INDIRECT(\"'C:\\Users\\Moi\\OneDrive\\Documents\\[Formulaires Gravereau.xlsx]Action\"&$N1663&\"'!$h$11\"),\"\")","v":""},{"$f":"IFERROR(VLOOKUP(E1664,'[1]Tarif de base'!D:E,2,FALSE)*F1664,\"\")","v":""}]
[null,"",null,null,"","",{"$f":"IFERROR(VLOOKUP(E1665,'[1]Tarif de base'!D:E,2,FALSE)*F1665,\"\")","v":""}]
[null,"",null,null,"","",{"$f":"IFERROR(VLOOKUP(E1666,'[1]Tarif de base'!D:E,2,FALSE)*F1666,\"\")","v":""}]
[null,"",null,null,"","",{"$f":"IFERROR(VLOOKUP(E1667,'[1]Tarif de base'!D:E,2,FALSE)*F1667,\"\")","v":""}]
[null,"",null,null,"","",{"$f":"IFERROR(VLOOKUP(E1668,'[1]Tarif de base'!D:E,2,FALSE)*F1668,\"\")","v":""}]
[null,"",null,null,"Total",{"$f":"SUM(F1663:F1668)","v":0},{"$f":"SUM(G1663:G1668)","v":0}]
["","","","","","",{"$f":"IFERROR(VLOOKUP(E1670,'[1]Tarif de base'!D:E,2,FALSE)*F1670,\"\")","v":""},"","","",{"$f":"IFERROR(IF(G1676-H1670-I1670-J1670<>0,\"Attention il manque \"&G1676-H1670-I1670-J1670&\"€\",\"Règlement OK\"),\"Pas de règlement\")","v":"Pas de règlement"},"",null,238]
[null,"",null,null,{"$f":"IFERROR(INDIRECT(\"'C:\\Users\\Moi\\OneDrive\\Documents\\[Formulaires Gravereau.xlsx]Action\"&$N1670&\"'!$D$11\"),\"\")","v":""},{"$f":"IFERROR(INDIRECT(\"'C:\\Users\\Moi\\OneDrive\\Documents\\[Formulaires Gravereau.xlsx]Action\"&$N1670&\"'!$h$11\"),\"\")","v":""},{"$f":"IFERROR(VLOOKUP(E1671,'[1]Tarif de base'!D:E,2,FALSE)*F1671,\"\")","v":""}]
[null,"",null,null,"","",{"$f":"IFERROR(VLOOKUP(E1672,'[1]Tarif de base'!D:E,2,FALSE)*F1672,\"\")","v":""}]
[null,"",null,null,"","",{"$f":"IFERROR(VLOOKUP(E1673,'[1]Tarif de base'!D:E,2,FALSE)*F1673,\"\")","v":""}]
[null,"",null,null,"","",{"$f":"IFERROR(VLOOKUP(E1674,'[1]Tarif de base'!D:E,2,FALSE)*F1674,\"\")","v":""}]
[null,"",null,null,"","",{"$f":"IFERROR(VLOOKUP(E1675,'[1]Tarif de base'!D:E,2,FALSE)*F1675,\"\")","v":""}]
[null,"",null,null,"Total",{"$f":"SUM(F1670:F1675)","v":0},{"$f":"SUM(G1670:G1675)","v":0}]
["","","","","","",{"$f":"IFERROR(VLOOKUP(E1677,'[1]Tarif de base'!D:E,2,FALSE)*F1677,\"\")","v":""},"","","",{"$f":"IFERROR(IF(G1683-H1677-I1677-J1677<>0,\"Attention il manque \"&G1683-H1677-I1677-J1677&\"€\",\"Règlement OK\"),\"Pas de règlement\")","v":"Pas de règlement"},"",null,239]
[null,"",null,null,{"$f":"IFERROR(INDIRECT(\"'C:\\Users\\Moi\\OneDrive\\Documents\\[Formulaires Gravereau.xlsx]Action\"&$N1677&\"'!$D$11\"),\"\")","v":""},{"$f":"IFERROR(INDIRECT(\"'C:\\Users\\Moi\\OneDrive\\Documents\\[Formulaires Gravereau.xlsx]Action\"&$N1677&\"'!$h$11\"),\"\")","v":""},{"$f":"IFERROR(VLOOKUP(E1678,'[1]Tarif de base'!D:E,2,FALSE)*F1678,\"\")","v":""}]
[null,"",null,null,"","",{"$f":"IFERROR(VLOOKUP(E1679,'[1]Tarif de base'!D:E,2,FALSE)*F1679,\"\")","v":""}]
[null,"",null,null,"","",{"$f":"IFERROR(VLOOKUP(E1680,'[1]Tarif de base'!D:E,2,FALSE)*F1680,\"\")","v":""}]
[null,"",null,null,"","",{"$f":"IFERROR(VLOOKUP(E1681,'[1]Tarif de base'!D:E,2,FALSE)*F1681,\"\")","v":""}]
[null,"",null,null,"","",{"$f":"IFERROR(VLOOKUP(E1682,'[1]Tarif de base'!D:E,2,FALSE)*F1682,\"\")","v":""}]
[null,"",null,null,"Total",{"$f":"SUM(F1677:F1682)","v":0},{"$f":"SUM(G1677:G1682)","v":0}]
["","","","","","",{"$f":"IFERROR(VLOOKUP(E1684,'[1]Tarif de base'!D:E,2,FALSE)*F1684,\"\")","v":""},"","","",{"$f":"IFERROR(IF(G1690-H1684-I1684-J1684<>0,\"Attention il manque \"&G1690-H1684-I1684-J1684&\"€\",\"Règlement OK\"),\"Pas de règlement\")","v":"Pas de règlement"},"",null,240]
[null,"",null,null,{"$f":"IFERROR(INDIRECT(\"'C:\\Users\\Moi\\OneDrive\\Documents\\[Formulaires Gravereau.xlsx]Action\"&$N1684&\"'!$D$11\"),\"\")","v":""},{"$f":"IFERROR(INDIRECT(\"'C:\\Users\\Moi\\OneDrive\\Documents\\[Formulaires Gravereau.xlsx]Action\"&$N1684&\"'!$h$11\"),\"\")","v":""},{"$f":"IFERROR(VLOOKUP(E1685,'[1]Tarif de base'!D:E,2,FALSE)*F1685,\"\")","v":""}]
[null,{"$f":"B1685","v":""},null,null,"","",{"$f":"IFERROR(VLOOKUP(E1686,'[1]Tarif de base'!D:E,2,FALSE)*F1686,\"\")","v":""}]
[null,"",null,null,"","",{"$f":"IFERROR(VLOOKUP(E1687,'[1]Tarif de base'!D:E,2,FALSE)*F1687,\"\")","v":""}]
[null,"",null,null,"","",{"$f":"IFERROR(VLOOKUP(E1688,'[1]Tarif de base'!D:E,2,FALSE)*F1688,\"\")","v":""}]
[null,"",null,null,"","",{"$f":"IFERROR(VLOOKUP(E1689,'[1]Tarif de base'!D:E,2,FALSE)*F1689,\"\")","v":""}]
[null,"",null,null,"Total",{"$f":"SUM(F1684:F1689)","v":0},{"$f":"SUM(G1684:G1689)","v":0}]
["","","","","","",{"$f":"IFERROR(VLOOKUP(E1691,'[1]Tarif de base'!D:E,2,FALSE)*F1691,\"\")","v":""},"","","",{"$f":"IFERROR(IF(G1697-H1691-I1691-J1691<>0,\"Attention il manque \"&G1697-H1691-I1691-J1691&\"€\",\"Règlement OK\"),\"Pas de règlement\")","v":"Pas de règlement"},"",null,241]
[null,"",null,null,{"$f":"IFERROR(INDIRECT(\"'C:\\Users\\Moi\\OneDrive\\Documents\\[Formulaires Gravereau.xlsx]Action\"&$N1691&\"'!$D$11\"),\"\")","v":""},{"$f":"IFERROR(INDIRECT(\"'C:\\Users\\Moi\\OneDrive\\Documents\\[Formulaires Gravereau.xlsx]Action\"&$N1691&\"'!$h$11\"),\"\")","v":""},{"$f":"IFERROR(VLOOKUP(E1692,'[1]Tarif de base'!D:E,2,FALSE)*F1692,\"\")","v":""}]
[null,"",null,null,"","",{"$f":"IFERROR(VLOOKUP(E1693,'[1]Tarif de base'!D:E,2,FALSE)*F1693,\"\")","v":""}]
[null,"",null,null,"","",{"$f":"IFERROR(VLOOKUP(E1694,'[1]Tarif de base'!D:E,2,FALSE)*F1694,\"\")","v":""}]
[null,"",null,null,"","",{"$f":"IFERROR(VLOOKUP(E1695,'[1]Tarif de base'!D:E,2,FALSE)*F1695,\"\")","v":""}]
[null,"",null,null,"","",{"$f":"IFERROR(VLOOKUP(E1696,'[1]Tarif de base'!D:E,2,FALSE)*F1696,\"\")","v":""}]
[null,"",null,null,"Total",{"$f":"SUM(F1691:F1696)","v":0},{"$f":"SUM(G1691:G1696)","v":0}]
["","","","","","",{"$f":"IFERROR(VLOOKUP(E1698,'[1]Tarif de base'!D:E,2,FALSE)*F1698,\"\")","v":""},"","","",{"$f":"IFERROR(IF(G1704-H1698-I1698-J1698<>0,\"Attention il manque \"&G1704-H1698-I1698-J1698&\"€\",\"Règlement OK\"),\"Pas de règlement\")","v":"Pas de règlement"},"",null,242]
[null,"",null,null,{"$f":"IFERROR(INDIRECT(\"'C:\\Users\\Moi\\OneDrive\\Documents\\[Formulaires Gravereau.xlsx]Action\"&$N1698&\"'!$D$11\"),\"\")","v":""},{"$f":"IFERROR(INDIRECT(\"'C:\\Users\\Moi\\OneDrive\\Documents\\[Formulaires Gravereau.xlsx]Action\"&$N1698&\"'!$h$11\"),\"\")","v":""},{"$f":"IFERROR(VLOOKUP(E1699,'[1]Tarif de base'!D:E,2,FALSE)*F1699,\"\")","v":""}]
[null,"",null,null,"","",{"$f":"IFERROR(VLOOKUP(E1700,'[1]Tarif de base'!D:E,2,FALSE)*F1700,\"\")","v":""}]
[null,"",null,null,"","",{"$f":"IFERROR(VLOOKUP(E1701,'[1]Tarif de base'!D:E,2,FALSE)*F1701,\"\")","v":""}]
[null,"",null,null,"","",{"$f":"IFERROR(VLOOKUP(E1702,'[1]Tarif de base'!D:E,2,FALSE)*F1702,\"\")","v":""}]
[null,"",null,null,"","",{"$f":"IFERROR(VLOOKUP(E1703,'[1]Tarif de base'!D:E,2,FALSE)*F1703,\"\")","v":""}]
[null,"",null,null,"Total",{"$f":"SUM(F1698:F1703)","v":0},{"$f":"SUM(G1698:G1703)","v":0}]
["","","","","","",{"$f":"IFERROR(VLOOKUP(E1705,'[1]Tarif de base'!D:E,2,FALSE)*F1705,\"\")","v":""},"","","",{"$f":"IFERROR(IF(G1711-H1705-I1705-J1705<>0,\"Attention il manque \"&G1711-H1705-I1705-J1705&\"€\",\"Règlement OK\"),\"Pas de règlement\")","v":"Pas de règlement"},"",null,243]
[null,"",null,null,{"$f":"IFERROR(INDIRECT(\"'C:\\Users\\Moi\\OneDrive\\Documents\\[Formulaires Gravereau.xlsx]Action\"&$N1705&\"'!$D$11\"),\"\")","v":""},{"$f":"IFERROR(INDIRECT(\"'C:\\Users\\Moi\\OneDrive\\Documents\\[Formulaires Gravereau.xlsx]Action\"&$N1705&\"'!$h$11\"),\"\")","v":""},{"$f":"IFERROR(VLOOKUP(E1706,'[1]Tarif de base'!D:E,2,FALSE)*F1706,\"\")","v":""}]
[null,"",null,null,"","",{"$f":"IFERROR(VLOOKUP(E1707,'[1]Tarif de base'!D:E,2,FALSE)*F1707,\"\")","v":""}]
[null,"",null,null,"","",{"$f":"IFERROR(VLOOKUP(E1708,'[1]Tarif de base'!D:E,2,FALSE)*F1708,\"\")","v":""}]
[null,"",null,null,"","",{"$f":"IFERROR(VLOOKUP(E1709,'[1]Tarif de base'!D:E,2,FALSE)*F1709,\"\")","v":""}]
[null,"",null,null,"","",{"$f":"IFERROR(VLOOKUP(E1710,'[1]Tarif de base'!D:E,2,FALSE)*F1710,\"\")","v":""}]
[null,"",null,null,"Total",{"$f":"SUM(F1705:F1710)","v":0},{"$f":"SUM(G1705:G1710)","v":0}]
[{"$f":"IFERROR(INDIRECT(\"'C:\\Users\\Moi\\OneDrive\\Documents\\[Formulaires Gravereau.xlsx]Action\"&$N1712&\"'!$D$6\"),\"\")","v":""},{"$f":"IF(C1712<>\"\",C1712,\"\")","v":""},{"$f":"IFERROR(INDIRECT(\"'C:\\Users\\Moi\\OneDrive\\Documents\\[Formulaires Gravereau.xlsx]Action\"&$N1712&\"'!$D$4\"),\"\")","v":""},{"$f":"IFERROR(INDIRECT(\"'C:\\Users\\Moi\\OneDrive\\Documents\\[Formulaires Gravereau.xlsx]Action\"&$N1712&\"'!$h$4\"),\"\")","v":""},{"$f":"IFERROR(INDIRECT(\"'C:\\Users\\Moi\\OneDrive\\Documents\\[Formulaires Gravereau.xlsx]Action\"&$N1712&\"'!$D$9\"),\"\")","v":""},{"$f":"IFERROR(INDIRECT(\"'C:\\Users\\Moi\\OneDrive\\Documents\\[Formulaires Gravereau.xlsx]Action\"&$N1712&\"'!$h$9\"),\"\")","v":""},{"$f":"IFERROR(VLOOKUP(E1712,'[1]Tarif de base'!D:E,2,FALSE)*F1712,\"\")","v":""},{"$f":"IFERROR(INDIRECT(\"'C:\\Users\\Moi\\OneDrive\\Documents\\[Formulaires Gravereau.xlsx]Action\"&$N1712&\"'!$d$26\"),\"\")","v":""},{"$f":"IFERROR(INDIRECT(\"'C:\\Users\\Moi\\OneDrive\\Documents\\[Formulaires Gravereau.xlsx]Action\"&$N1712&\"'!$d$28\"),\"\")","v":""},{"$f":"IFERROR(INDIRECT(\"'C:\\Users\\Moi\\OneDrive\\Documents\\[Formulaires Gravereau.xlsx]Action\"&$N1712&\"'!$h$26\"),\"\")","v":""},{"$f":"IFERROR(IF(G1718-H1712-I1712-J1712<>0,\"Attention il manque \"&G1718-H1712-I1712-J1712&\"€\",\"Règlement OK\"),\"Pas de règlement\")","v":"Pas de règlement"},{"$f":"IFERROR(INDIRECT(\"'C:\\Users\\Moi\\OneDrive\\Documents\\[Formulaires Gravereau.xlsx]Action\"&$N1712&\"'!$d$30\"),\"\")","v":""},null,244]
[null,"",null,null,{"$f":"IFERROR(INDIRECT(\"'C:\\Users\\Moi\\OneDrive\\Documents\\[Formulaires Gravereau.xlsx]Action\"&$N1712&\"'!$D$11\"),\"\")","v":""},{"$f":"IFERROR(INDIRECT(\"'C:\\Users\\Moi\\OneDrive\\Documents\\[Formulaires Gravereau.xlsx]Action\"&$N1712&\"'!$h$11\"),\"\")","v":""},{"$f":"IFERROR(VLOOKUP(E1713,'[1]Tarif de base'!D:E,2,FALSE)*F1713,\"\")","v":""}]
[null,"",null,null,{"$f":"IFERROR(INDIRECT(\"'C:\\Users\\Moi\\OneDrive\\Documents\\[Formulaires Gravereau.xlsx]Action\"&$N1712&\"'!$D$13\"),\"\")","v":""},{"$f":"IFERROR(INDIRECT(\"'C:\\Users\\Moi\\OneDrive\\Documents\\[Formulaires Gravereau.xlsx]Action\"&$N1712&\"'!$h$13\"),\"\")","v":""},{"$f":"IFERROR(VLOOKUP(E1714,'[1]Tarif de base'!D:E,2,FALSE)*F1714,\"\")","v":""}]
[null,"",null,null,{"$f":"IFERROR(INDIRECT(\"'C:\\Users\\Moi\\OneDrive\\Documents\\[Formulaires Gravereau.xlsx]Action\"&$N1712&\"'!$D$15\"),\"\")","v":""},{"$f":"IFERROR(INDIRECT(\"'C:\\Users\\Moi\\OneDrive\\Documents\\[Formulaires Gravereau.xlsx]Action\"&$N1712&\"'!$h$15\"),\"\")","v":""},{"$f":"IFERROR(VLOOKUP(E1715,'[1]Tarif de base'!D:E,2,FALSE)*F1715,\"\")","v":""}]
[null,"",null,null,{"$f":"IFERROR(INDIRECT(\"'C:\\Users\\Moi\\OneDrive\\Documents\\[Formulaires Gravereau.xlsx]Action\"&$N1712&\"'!$D$17\"),\"\")","v":""},{"$f":"IFERROR(INDIRECT(\"'C:\\Users\\Moi\\OneDrive\\Documents\\[Formulaires Gravereau.xlsx]Action\"&$N1712&\"'!$h$17\"),\"\")","v":""},{"$f":"IFERROR(VLOOKUP(E1716,'[1]Tarif de base'!D:E,2,FALSE)*F1716,\"\")","v":""}]
[null,"",null,null,{"$f":"IFERROR(INDIRECT(\"'C:\\Users\\Moi\\OneDrive\\Documents\\[Formulaires Gravereau.xlsx]Action\"&$N1712&\"'!$D$19\"),\"\")","v":""},{"$f":"IFERROR(INDIRECT(\"'C:\\Users\\Moi\\OneDrive\\Documents\\[Formulaires Gravereau.xlsx]Action\"&$N1712&\"'!$h$19\"),\"\")","v":""},{"$f":"IFERROR(VLOOKUP(E1717,'[1]Tarif de base'!D:E,2,FALSE)*F1717,\"\")","v":""}]
[null,"",null,null,"Total",{"$f":"SUM(F1712:F1717)","v":0},{"$f":"SUM(G1712:G1717)","v":0}]
["","","","","","",{"$f":"IFERROR(VLOOKUP(E1719,'[1]Tarif de base'!D:E,2,FALSE)*F1719,\"\")","v":""},"","","",{"$f":"IFERROR(IF(G1725-H1719-I1719-J1719<>0,\"Attention il manque \"&G1725-H1719-I1719-J1719&\"€\",\"Règlement OK\"),\"Pas de règlement\")","v":"Pas de règlement"},"",null,245]
[null,"",null,null,{"$f":"IFERROR(INDIRECT(\"'C:\\Users\\Moi\\OneDrive\\Documents\\[Formulaires Gravereau.xlsx]Action\"&$N1719&\"'!$D$11\"),\"\")","v":""},{"$f":"IFERROR(INDIRECT(\"'C:\\Users\\Moi\\OneDrive\\Documents\\[Formulaires Gravereau.xlsx]Action\"&$N1719&\"'!$h$11\"),\"\")","v":""},{"$f":"IFERROR(VLOOKUP(E1720,'[1]Tarif de base'!D:E,2,FALSE)*F1720,\"\")","v":""}]
[null,"",null,null,"","",{"$f":"IFERROR(VLOOKUP(E1721,'[1]Tarif de base'!D:E,2,FALSE)*F1721,\"\")","v":""}]
[null,"",null,null,"","",{"$f":"IFERROR(VLOOKUP(E1722,'[1]Tarif de base'!D:E,2,FALSE)*F1722,\"\")","v":""}]
[null,"",null,null,"","",{"$f":"IFERROR(VLOOKUP(E1723,'[1]Tarif de base'!D:E,2,FALSE)*F1723,\"\")","v":""}]
[null,"",null,null,"","",{"$f":"IFERROR(VLOOKUP(E1724,'[1]Tarif de base'!D:E,2,FALSE)*F1724,\"\")","v":""}]
[null,"",null,null,"Total",{"$f":"SUM(F1719:F1724)","v":0},{"$f":"SUM(G1719:G1724)","v":0}]
["","","","","","",{"$f":"IFERROR(VLOOKUP(E1726,'[1]Tarif de base'!D:E,2,FALSE)*F1726,\"\")","v":""},"","","",{"$f":"IFERROR(IF(G1732-H1726-I1726-J1726<>0,\"Attention il manque \"&G1732-H1726-I1726-J1726&\"€\",\"Règlement OK\"),\"Pas de règlement\")","v":"Pas de règlement"},"",null,246]
[null,"",null,null,{"$f":"IFERROR(INDIRECT(\"'C:\\Users\\Moi\\OneDrive\\Documents\\[Formulaires Gravereau.xlsx]Action\"&$N1726&\"'!$D$11\"),\"\")","v":""},{"$f":"IFERROR(INDIRECT(\"'C:\\Users\\Moi\\OneDrive\\Documents\\[Formulaires Gravereau.xlsx]Action\"&$N1726&\"'!$h$11\"),\"\")","v":""},{"$f":"IFERROR(VLOOKUP(E1727,'[1]Tarif de base'!D:E,2,FALSE)*F1727,\"\")","v":""}]
[null,"",null,null,"","",{"$f":"IFERROR(VLOOKUP(E1728,'[1]Tarif de base'!D:E,2,FALSE)*F1728,\"\")","v":""}]
[null,"",null,null,"","",{"$f":"IFERROR(VLOOKUP(E1729,'[1]Tarif de base'!D:E,2,FALSE)*F1729,\"\")","v":""}]
[null,"",null,null,"","",{"$f":"IFERROR(VLOOKUP(E1730,'[1]Tarif de base'!D:E,2,FALSE)*F1730,\"\")","v":""}]
[null,"",null,null,"","",{"$f":"IFERROR(VLOOKUP(E1731,'[1]Tarif de base'!D:E,2,FALSE)*F1731,\"\")","v":""}]
[null,"",null,null,"Total",{"$f":"SUM(F1726:F1731)","v":0},{"$f":"SUM(G1726:G1731)","v":0}]
["","","","","","",{"$f":"IFERROR(VLOOKUP(E1733,'[1]Tarif de base'!D:E,2,FALSE)*F1733,\"\")","v":""},"","","",{"$f":"IFERROR(IF(G1739-H1733-I1733-J1733<>0,\"Attention il manque \"&G1739-H1733-I1733-J1733&\"€\",\"Règlement OK\"),\"Pas de règlement\")","v":"Pas de règlement"},"",null,247]
[null,"",null,null,{"$f":"IFERROR(INDIRECT(\"'C:\\Users\\Moi\\OneDrive\\Documents\\[Formulaires Gravereau.xlsx]Action\"&$N1733&\"'!$D$11\"),\"\")","v":""},{"$f":"IFERROR(INDIRECT(\"'C:\\Users\\Moi\\OneDrive\\Documents\\[Formulaires Gravereau.xlsx]Action\"&$N1733&\"'!$h$11\"),\"\")","v":""},{"$f":"IFERROR(VLOOKUP(E1734,'[1]Tarif de base'!D:E,2,FALSE)*F1734,\"\")","v":""}]
[null,"",null,null,"","",{"$f":"IFERROR(VLOOKUP(E1735,'[1]Tarif de base'!D:E,2,FALSE)*F1735,\"\")","v":""}]
[null,"",null,null,"","",{"$f":"IFERROR(VLOOKUP(E1736,'[1]Tarif de base'!D:E,2,FALSE)*F1736,\"\")","v":""}]
[null,"",null,null,"","",{"$f":"IFERROR(VLOOKUP(E1737,'[1]Tarif de base'!D:E,2,FALSE)*F1737,\"\")","v":""}]
[null,"",null,null,"","",{"$f":"IFERROR(VLOOKUP(E1738,'[1]Tarif de base'!D:E,2,FALSE)*F1738,\"\")","v":""}]
[null,"",null,null,"Total",{"$f":"SUM(F1733:F1738)","v":0},{"$f":"SUM(G1733:G1738)","v":0}]
["","","","","","",{"$f":"IFERROR(VLOOKUP(E1740,'[1]Tarif de base'!D:E,2,FALSE)*F1740,\"\")","v":""},"","","",{"$f":"IFERROR(IF(G1746-H1740-I1740-J1740<>0,\"Attention il manque \"&G1746-H1740-I1740-J1740&\"€\",\"Règlement OK\"),\"Pas de règlement\")","v":"Pas de règlement"},"",null,248]
[null,"",null,null,{"$f":"IFERROR(INDIRECT(\"'C:\\Users\\Moi\\OneDrive\\Documents\\[Formulaires Gravereau.xlsx]Action\"&$N1740&\"'!$D$11\"),\"\")","v":""},{"$f":"IFERROR(INDIRECT(\"'C:\\Users\\Moi\\OneDrive\\Documents\\[Formulaires Gravereau.xlsx]Action\"&$N1740&\"'!$h$11\"),\"\")","v":""},{"$f":"IFERROR(VLOOKUP(E1741,'[1]Tarif de base'!D:E,2,FALSE)*F1741,\"\")","v":""}]
[null,"",null,null,"","",{"$f":"IFERROR(VLOOKUP(E1742,'[1]Tarif de base'!D:E,2,FALSE)*F1742,\"\")","v":""}]
[null,"",null,null,"","",{"$f":"IFERROR(VLOOKUP(E1743,'[1]Tarif de base'!D:E,2,FALSE)*F1743,\"\")","v":""}]
[null,"",null,null,"","",{"$f":"IFERROR(VLOOKUP(E1744,'[1]Tarif de base'!D:E,2,FALSE)*F1744,\"\")","v":""}]
[null,"",null,null,"","",{"$f":"IFERROR(VLOOKUP(E1745,'[1]Tarif de base'!D:E,2,FALSE)*F1745,\"\")","v":""}]
[null,"",null,null,"Total",{"$f":"SUM(F1740:F1745)","v":0},{"$f":"SUM(G1740:G1745)","v":0}]
["","","","","","",{"$f":"IFERROR(VLOOKUP(E1747,'[1]Tarif de base'!D:E,2,FALSE)*F1747,\"\")","v":""},"","","",{"$f":"IFERROR(IF(G1753-H1747-I1747-J1747<>0,\"Attention il manque \"&G1753-H1747-I1747-J1747&\"€\",\"Règlement OK\"),\"Pas de règlement\")","v":"Pas de règlement"},"",null,249]
[null,"",null,null,{"$f":"IFERROR(INDIRECT(\"'C:\\Users\\Moi\\OneDrive\\Documents\\[Formulaires Gravereau.xlsx]Action\"&$N1747&\"'!$D$11\"),\"\")","v":""},{"$f":"IFERROR(INDIRECT(\"'C:\\Users\\Moi\\OneDrive\\Documents\\[Formulaires Gravereau.xlsx]Action\"&$N1747&\"'!$h$11\"),\"\")","v":""},{"$f":"IFERROR(VLOOKUP(E1748,'[1]Tarif de base'!D:E,2,FALSE)*F1748,\"\")","v":""}]
[null,"",null,null,"","",{"$f":"IFERROR(VLOOKUP(E1749,'[1]Tarif de base'!D:E,2,FALSE)*F1749,\"\")","v":""}]
[null,{"$f":"B1749","v":""},null,null,"","",{"$f":"IFERROR(VLOOKUP(E1750,'[1]Tarif de base'!D:E,2,FALSE)*F1750,\"\")","v":""}]
[null,"",null,null,"","",{"$f":"IFERROR(VLOOKUP(E1751,'[1]Tarif de base'!D:E,2,FALSE)*F1751,\"\")","v":""}]
[null,"",null,null,"","",{"$f":"IFERROR(VLOOKUP(E1752,'[1]Tarif de base'!D:E,2,FALSE)*F1752,\"\")","v":""}]
[null,"",null,null,"Total",{"$f":"SUM(F1747:F1752)","v":0},{"$f":"SUM(G1747:G1752)","v":0}]
["","","","","","",{"$f":"IFERROR(VLOOKUP(E1754,'[1]Tarif de base'!D:E,2,FALSE)*F1754,\"\")","v":""},"","","",{"$f":"IFERROR(IF(G1760-H1754-I1754-J1754<>0,\"Attention il manque \"&G1760-H1754-I1754-J1754&\"€\",\"Règlement OK\"),\"Pas de règlement\")","v":"Pas de règlement"},"",null,250]
[null,"",null,null,{"$f":"IFERROR(INDIRECT(\"'C:\\Users\\Moi\\OneDrive\\Documents\\[Formulaires Gravereau.xlsx]Action\"&$N1754&\"'!$D$11\"),\"\")","v":""},{"$f":"IFERROR(INDIRECT(\"'C:\\Users\\Moi\\OneDrive\\Documents\\[Formulaires Gravereau.xlsx]Action\"&$N1754&\"'!$h$11\"),\"\")","v":""},{"$f":"IFERROR(VLOOKUP(E1755,'[1]Tarif de base'!D:E,2,FALSE)*F1755,\"\")","v":""}]
[null,"",null,null,"","",{"$f":"IFERROR(VLOOKUP(E1756,'[1]Tarif de base'!D:E,2,FALSE)*F1756,\"\")","v":""}]
[null,"",null,null,"","",{"$f":"IFERROR(VLOOKUP(E1757,'[1]Tarif de base'!D:E,2,FALSE)*F1757,\"\")","v":""}]
[null,"",null,null,"","",{"$f":"IFERROR(VLOOKUP(E1758,'[1]Tarif de base'!D:E,2,FALSE)*F1758,\"\")","v":""}]
[null,"",null,null,"","",{"$f":"IFERROR(VLOOKUP(E1759,'[1]Tarif de base'!D:E,2,FALSE)*F1759,\"\")","v":""}]
[null,"",null,null,"Total",{"$f":"SUM(F1754:F1759)","v":0},{"$f":"SUM(G1754:G1759)","v":0}]
["","","","","","",{"$f":"IFERROR(VLOOKUP(E1761,'[1]Tarif de base'!D:E,2,FALSE)*F1761,\"\")","v":""},"","","",{"$f":"IFERROR(IF(G1767-H1761-I1761-J1761<>0,\"Attention il manque \"&G1767-H1761-I1761-J1761&\"€\",\"Règlement OK\"),\"Pas de règlement\")","v":"Pas de règlement"},"",null,251]
[null,"",null,null,{"$f":"IFERROR(INDIRECT(\"'C:\\Users\\Moi\\OneDrive\\Documents\\[Formulaires Gravereau.xlsx]Action\"&$N1761&\"'!$D$11\"),\"\")","v":""},{"$f":"IFERROR(INDIRECT(\"'C:\\Users\\Moi\\OneDrive\\Documents\\[Formulaires Gravereau.xlsx]Action\"&$N1761&\"'!$h$11\"),\"\")","v":""},{"$f":"IFERROR(VLOOKUP(E1762,'[1]Tarif de base'!D:E,2,FALSE)*F1762,\"\")","v":""}]
[null,"",null,null,"","",{"$f":"IFERROR(VLOOKUP(E1763,'[1]Tarif de base'!D:E,2,FALSE)*F1763,\"\")","v":""}]
[null,"",null,null,"","",{"$f":"IFERROR(VLOOKUP(E1764,'[1]Tarif de base'!D:E,2,FALSE)*F1764,\"\")","v":""}]
[null,"",null,null,"","",{"$f":"IFERROR(VLOOKUP(E1765,'[1]Tarif de base'!D:E,2,FALSE)*F1765,\"\")","v":""}]
[null,"",null,null,"","",{"$f":"IFERROR(VLOOKUP(E1766,'[1]Tarif de base'!D:E,2,FALSE)*F1766,\"\")","v":""}]
[null,"",null,null,"Total",{"$f":"SUM(F1761:F1766)","v":0},{"$f":"SUM(G1761:G1766)","v":0}]
["","","","","","",{"$f":"IFERROR(VLOOKUP(E1768,'[1]Tarif de base'!D:E,2,FALSE)*F1768,\"\")","v":""},"","","",{"$f":"IFERROR(IF(G1774-H1768-I1768-J1768<>0,\"Attention il manque \"&G1774-H1768-I1768-J1768&\"€\",\"Règlement OK\"),\"Pas de règlement\")","v":"Pas de règlement"},"",null,252]
[null,"",null,null,{"$f":"IFERROR(INDIRECT(\"'C:\\Users\\Moi\\OneDrive\\Documents\\[Formulaires Gravereau.xlsx]Action\"&$N1768&\"'!$D$11\"),\"\")","v":""},{"$f":"IFERROR(INDIRECT(\"'C:\\Users\\Moi\\OneDrive\\Documents\\[Formulaires Gravereau.xlsx]Action\"&$N1768&\"'!$h$11\"),\"\")","v":""},{"$f":"IFERROR(VLOOKUP(E1769,'[1]Tarif de base'!D:E,2,FALSE)*F1769,\"\")","v":""}]
[null,"",null,null,"","",{"$f":"IFERROR(VLOOKUP(E1770,'[1]Tarif de base'!D:E,2,FALSE)*F1770,\"\")","v":""}]
[null,"",null,null,"","",{"$f":"IFERROR(VLOOKUP(E1771,'[1]Tarif de base'!D:E,2,FALSE)*F1771,\"\")","v":""}]
[null,"",null,null,"","",{"$f":"IFERROR(VLOOKUP(E1772,'[1]Tarif de base'!D:E,2,FALSE)*F1772,\"\")","v":""}]
[null,"",null,null,"","",{"$f":"IFERROR(VLOOKUP(E1773,'[1]Tarif de base'!D:E,2,FALSE)*F1773,\"\")","v":""}]
[null,"",null,null,"Total",{"$f":"SUM(F1768:F1773)","v":0},{"$f":"SUM(G1768:G1773)","v":0}]
["","","","","","",{"$f":"IFERROR(VLOOKUP(E1775,'[1]Tarif de base'!D:E,2,FALSE)*F1775,\"\")","v":""},"","","",{"$f":"IFERROR(IF(G1781-H1775-I1775-J1775<>0,\"Attention il manque \"&G1781-H1775-I1775-J1775&\"€\",\"Règlement OK\"),\"Pas de règlement\")","v":"Pas de règlement"},"",null,253]
[null,"",null,null,{"$f":"IFERROR(INDIRECT(\"'C:\\Users\\Moi\\OneDrive\\Documents\\[Formulaires Gravereau.xlsx]Action\"&$N1775&\"'!$D$11\"),\"\")","v":""},{"$f":"IFERROR(INDIRECT(\"'C:\\Users\\Moi\\OneDrive\\Documents\\[Formulaires Gravereau.xlsx]Action\"&$N1775&\"'!$h$11\"),\"\")","v":""},{"$f":"IFERROR(VLOOKUP(E1776,'[1]Tarif de base'!D:E,2,FALSE)*F1776,\"\")","v":""}]
[null,"",null,null,"","",{"$f":"IFERROR(VLOOKUP(E1777,'[1]Tarif de base'!D:E,2,FALSE)*F1777,\"\")","v":""}]
[null,"",null,null,"","",{"$f":"IFERROR(VLOOKUP(E1778,'[1]Tarif de base'!D:E,2,FALSE)*F1778,\"\")","v":""}]
[null,"",null,null,"","",{"$f":"IFERROR(VLOOKUP(E1779,'[1]Tarif de base'!D:E,2,FALSE)*F1779,\"\")","v":""}]
[null,"",null,null,"","",{"$f":"IFERROR(VLOOKUP(E1780,'[1]Tarif de base'!D:E,2,FALSE)*F1780,\"\")","v":""}]
[null,"",null,null,"Total",{"$f":"SUM(F1775:F1780)","v":0},{"$f":"SUM(G1775:G1780)","v":0}]
[{"$f":"IFERROR(INDIRECT(\"'C:\\Users\\Moi\\OneDrive\\Documents\\[Formulaires Gravereau.xlsx]Action\"&$N1782&\"'!$D$6\"),\"\")","v":""},{"$f":"IF(C1782<>\"\",C1782,\"\")","v":""},{"$f":"IFERROR(INDIRECT(\"'C:\\Users\\Moi\\OneDrive\\Documents\\[Formulaires Gravereau.xlsx]Action\"&$N1782&\"'!$D$4\"),\"\")","v":""},{"$f":"IFERROR(INDIRECT(\"'C:\\Users\\Moi\\OneDrive\\Documents\\[Formulaires Gravereau.xlsx]Action\"&$N1782&\"'!$h$4\"),\"\")","v":""},{"$f":"IFERROR(INDIRECT(\"'C:\\Users\\Moi\\OneDrive\\Documents\\[Formulaires Gravereau.xlsx]Action\"&$N1782&\"'!$D$9\"),\"\")","v":""},{"$f":"IFERROR(INDIRECT(\"'C:\\Users\\Moi\\OneDrive\\Documents\\[Formulaires Gravereau.xlsx]Action\"&$N1782&\"'!$h$9\"),\"\")","v":""},{"$f":"IFERROR(VLOOKUP(E1782,'[1]Tarif de base'!D:E,2,FALSE)*F1782,\"\")","v":""},{"$f":"IFERROR(INDIRECT(\"'C:\\Users\\Moi\\OneDrive\\Documents\\[Formulaires Gravereau.xlsx]Action\"&$N1782&\"'!$d$26\"),\"\")","v":""},{"$f":"IFERROR(INDIRECT(\"'C:\\Users\\Moi\\OneDrive\\Documents\\[Formulaires Gravereau.xlsx]Action\"&$N1782&\"'!$d$28\"),\"\")","v":""},{"$f":"IFERROR(INDIRECT(\"'C:\\Users\\Moi\\OneDrive\\Documents\\[Formulaires Gravereau.xlsx]Action\"&$N1782&\"'!$h$26\"),\"\")","v":""},{"$f":"IFERROR(IF(G1788-H1782-I1782-J1782<>0,\"Attention il manque \"&G1788-H1782-I1782-J1782&\"€\",\"Règlement OK\"),\"Pas de règlement\")","v":"Pas de règlement"},{"$f":"IFERROR(INDIRECT(\"'C:\\Users\\Moi\\OneDrive\\Documents\\[Formulaires Gravereau.xlsx]Action\"&$N1782&\"'!$d$30\"),\"\")","v":""},null,254]
[null,"",null,null,{"$f":"IFERROR(INDIRECT(\"'C:\\Users\\Moi\\OneDrive\\Documents\\[Formulaires Gravereau.xlsx]Action\"&$N1782&\"'!$D$11\"),\"\")","v":""},{"$f":"IFERROR(INDIRECT(\"'C:\\Users\\Moi\\OneDrive\\Documents\\[Formulaires Gravereau.xlsx]Action\"&$N1782&\"'!$h$11\"),\"\")","v":""},{"$f":"IFERROR(VLOOKUP(E1783,'[1]Tarif de base'!D:E,2,FALSE)*F1783,\"\")","v":""}]
[null,"",null,null,{"$f":"IFERROR(INDIRECT(\"'C:\\Users\\Moi\\OneDrive\\Documents\\[Formulaires Gravereau.xlsx]Action\"&$N1782&\"'!$D$13\"),\"\")","v":""},{"$f":"IFERROR(INDIRECT(\"'C:\\Users\\Moi\\OneDrive\\Documents\\[Formulaires Gravereau.xlsx]Action\"&$N1782&\"'!$h$13\"),\"\")","v":""},{"$f":"IFERROR(VLOOKUP(E1784,'[1]Tarif de base'!D:E,2,FALSE)*F1784,\"\")","v":""}]
[null,"",null,null,{"$f":"IFERROR(INDIRECT(\"'C:\\Users\\Moi\\OneDrive\\Documents\\[Formulaires Gravereau.xlsx]Action\"&$N1782&\"'!$D$15\"),\"\")","v":""},{"$f":"IFERROR(INDIRECT(\"'C:\\Users\\Moi\\OneDrive\\Documents\\[Formulaires Gravereau.xlsx]Action\"&$N1782&\"'!$h$15\"),\"\")","v":""},{"$f":"IFERROR(VLOOKUP(E1785,'[1]Tarif de base'!D:E,2,FALSE)*F1785,\"\")","v":""}]
[null,"",null,null,{"$f":"IFERROR(INDIRECT(\"'C:\\Users\\Moi\\OneDrive\\Documents\\[Formulaires Gravereau.xlsx]Action\"&$N1782&\"'!$D$17\"),\"\")","v":""},{"$f":"IFERROR(INDIRECT(\"'C:\\Users\\Moi\\OneDrive\\Documents\\[Formulaires Gravereau.xlsx]Action\"&$N1782&\"'!$h$17\"),\"\")","v":""},{"$f":"IFERROR(VLOOKUP(E1786,'[1]Tarif de base'!D:E,2,FALSE)*F1786,\"\")","v":""}]
[null,"",null,null,{"$f":"IFERROR(INDIRECT(\"'C:\\Users\\Moi\\OneDrive\\Documents\\[Formulaires Gravereau.xlsx]Action\"&$N1782&\"'!$D$19\"),\"\")","v":""},{"$f":"IFERROR(INDIRECT(\"'C:\\Users\\Moi\\OneDrive\\Documents\\[Formulaires Gravereau.xlsx]Action\"&$N1782&\"'!$h$19\"),\"\")","v":""},{"$f":"IFERROR(VLOOKUP(E1787,'[1]Tarif de base'!D:E,2,FALSE)*F1787,\"\")","v":""}]
[null,"",null,null,"Total",{"$f":"SUM(F1782:F1787)","v":0},{"$f":"SUM(G1782:G1787)","v":0}]
["","","","","","",{"$f":"IFERROR(VLOOKUP(E1789,'[1]Tarif de base'!D:E,2,FALSE)*F1789,\"\")","v":""},"","","",{"$f":"IFERROR(IF(G1795-H1789-I1789-J1789<>0,\"Attention il manque \"&G1795-H1789-I1789-J1789&\"€\",\"Règlement OK\"),\"Pas de règlement\")","v":"Pas de règlement"},"",null,255]
[null,"",null,null,{"$f":"IFERROR(INDIRECT(\"'C:\\Users\\Moi\\OneDrive\\Documents\\[Formulaires Gravereau.xlsx]Action\"&$N1789&\"'!$D$11\"),\"\")","v":""},{"$f":"IFERROR(INDIRECT(\"'C:\\Users\\Moi\\OneDrive\\Documents\\[Formulaires Gravereau.xlsx]Action\"&$N1789&\"'!$h$11\"),\"\")","v":""},{"$f":"IFERROR(VLOOKUP(E1790,'[1]Tarif de base'!D:E,2,FALSE)*F1790,\"\")","v":""}]
[null,"",null,null,"","",{"$f":"IFERROR(VLOOKUP(E1791,'[1]Tarif de base'!D:E,2,FALSE)*F1791,\"\")","v":""}]
[null,"",null,null,"","",{"$f":"IFERROR(VLOOKUP(E1792,'[1]Tarif de base'!D:E,2,FALSE)*F1792,\"\")","v":""}]
[null,"",null,null,"","",{"$f":"IFERROR(VLOOKUP(E1793,'[1]Tarif de base'!D:E,2,FALSE)*F1793,\"\")","v":""}]
[null,"",null,null,"","",{"$f":"IFERROR(VLOOKUP(E1794,'[1]Tarif de base'!D:E,2,FALSE)*F1794,\"\")","v":""}]
[null,"",null,null,"Total",{"$f":"SUM(F1789:F1794)","v":0},{"$f":"SUM(G1789:G1794)","v":0}]
["","","","","","",{"$f":"IFERROR(VLOOKUP(E1796,'[1]Tarif de base'!D:E,2,FALSE)*F1796,\"\")","v":""},"","","",{"$f":"IFERROR(IF(G1802-H1796-I1796-J1796<>0,\"Attention il manque \"&G1802-H1796-I1796-J1796&\"€\",\"Règlement OK\"),\"Pas de règlement\")","v":"Pas de règlement"},"",null,256]
[null,"",null,null,{"$f":"IFERROR(INDIRECT(\"'C:\\Users\\Moi\\OneDrive\\Documents\\[Formulaires Gravereau.xlsx]Action\"&$N1796&\"'!$D$11\"),\"\")","v":""},{"$f":"IFERROR(INDIRECT(\"'C:\\Users\\Moi\\OneDrive\\Documents\\[Formulaires Gravereau.xlsx]Action\"&$N1796&\"'!$h$11\"),\"\")","v":""},{"$f":"IFERROR(VLOOKUP(E1797,'[1]Tarif de base'!D:E,2,FALSE)*F1797,\"\")","v":""}]
[null,"",null,null,"","",{"$f":"IFERROR(VLOOKUP(E1798,'[1]Tarif de base'!D:E,2,FALSE)*F1798,\"\")","v":""}]
[null,"",null,null,"","",{"$f":"IFERROR(VLOOKUP(E1799,'[1]Tarif de base'!D:E,2,FALSE)*F1799,\"\")","v":""}]
[null,"",null,null,"","",{"$f":"IFERROR(VLOOKUP(E1800,'[1]Tarif de base'!D:E,2,FALSE)*F1800,\"\")","v":""}]
[null,"",null,null,"","",{"$f":"IFERROR(VLOOKUP(E1801,'[1]Tarif de base'!D:E,2,FALSE)*F1801,\"\")","v":""}]
[null,"",null,null,"Total",{"$f":"SUM(F1796:F1801)","v":0},{"$f":"SUM(G1796:G1801)","v":0}]
["","","","","","",{"$f":"IFERROR(VLOOKUP(E1803,'[1]Tarif de base'!D:E,2,FALSE)*F1803,\"\")","v":""},"","","",{"$f":"IFERROR(IF(G1809-H1803-I1803-J1803<>0,\"Attention il manque \"&G1809-H1803-I1803-J1803&\"€\",\"Règlement OK\"),\"Pas de règlement\")","v":"Pas de règlement"},"",null,257]
[null,"",null,null,{"$f":"IFERROR(INDIRECT(\"'C:\\Users\\Moi\\OneDrive\\Documents\\[Formulaires Gravereau.xlsx]Action\"&$N1803&\"'!$D$11\"),\"\")","v":""},{"$f":"IFERROR(INDIRECT(\"'C:\\Users\\Moi\\OneDrive\\Documents\\[Formulaires Gravereau.xlsx]Action\"&$N1803&\"'!$h$11\"),\"\")","v":""},{"$f":"IFERROR(VLOOKUP(E1804,'[1]Tarif de base'!D:E,2,FALSE)*F1804,\"\")","v":""}]
[null,"",null,null,"","",{"$f":"IFERROR(VLOOKUP(E1805,'[1]Tarif de base'!D:E,2,FALSE)*F1805,\"\")","v":""}]
[null,"",null,null,"","",{"$f":"IFERROR(VLOOKUP(E1806,'[1]Tarif de base'!D:E,2,FALSE)*F1806,\"\")","v":""}]
[null,"",null,null,"","",{"$f":"IFERROR(VLOOKUP(E1807,'[1]Tarif de base'!D:E,2,FALSE)*F1807,\"\")","v":""}]
[null,"",null,null,"","",{"$f":"IFERROR(VLOOKUP(E1808,'[1]Tarif de base'!D:E,2,FALSE)*F1808,\"\")","v":""}]
[null,"",null,null,"Total",{"$f":"SUM(F1803:F1808)","v":0},{"$f":"SUM(G1803:G1808)","v":0}]
["","","","","","",{"$f":"IFERROR(VLOOKUP(E1810,'[1]Tarif de base'!D:E,2,FALSE)*F1810,\"\")","v":""},"","","",{"$f":"IFERROR(IF(G1816-H1810-I1810-J1810<>0,\"Attention il manque \"&G1816-H1810-I1810-J1810&\"€\",\"Règlement OK\"),\"Pas de règlement\")","v":"Pas de règlement"},"",null,258]
[null,"",null,null,{"$f":"IFERROR(INDIRECT(\"'C:\\Users\\Moi\\OneDrive\\Documents\\[Formulaires Gravereau.xlsx]Action\"&$N1810&\"'!$D$11\"),\"\")","v":""},{"$f":"IFERROR(INDIRECT(\"'C:\\Users\\Moi\\OneDrive\\Documents\\[Formulaires Gravereau.xlsx]Action\"&$N1810&\"'!$h$11\"),\"\")","v":""},{"$f":"IFERROR(VLOOKUP(E1811,'[1]Tarif de base'!D:E,2,FALSE)*F1811,\"\")","v":""}]
[null,"",null,null,"","",{"$f":"IFERROR(VLOOKUP(E1812,'[1]Tarif de base'!D:E,2,FALSE)*F1812,\"\")","v":""}]
[null,"",null,null,"","",{"$f":"IFERROR(VLOOKUP(E1813,'[1]Tarif de base'!D:E,2,FALSE)*F1813,\"\")","v":""}]
[null,{"$f":"B1813","v":""},null,null,"","",{"$f":"IFERROR(VLOOKUP(E1814,'[1]Tarif de base'!D:E,2,FALSE)*F1814,\"\")","v":""}]
[null,"",null,null,"","",{"$f":"IFERROR(VLOOKUP(E1815,'[1]Tarif de base'!D:E,2,FALSE)*F1815,\"\")","v":""}]
[null,"",null,null,"Total",{"$f":"SUM(F1810:F1815)","v":0},{"$f":"SUM(G1810:G1815)","v":0}]
["","","","","","",{"$f":"IFERROR(VLOOKUP(E1817,'[1]Tarif de base'!D:E,2,FALSE)*F1817,\"\")","v":""},"","","",{"$f":"IFERROR(IF(G1823-H1817-I1817-J1817<>0,\"Attention il manque \"&G1823-H1817-I1817-J1817&\"€\",\"Règlement OK\"),\"Pas de règlement\")","v":"Pas de règlement"},"",null,259]
[null,"",null,null,{"$f":"IFERROR(INDIRECT(\"'C:\\Users\\Moi\\OneDrive\\Documents\\[Formulaires Gravereau.xlsx]Action\"&$N1817&\"'!$D$11\"),\"\")","v":""},{"$f":"IFERROR(INDIRECT(\"'C:\\Users\\Moi\\OneDrive\\Documents\\[Formulaires Gravereau.xlsx]Action\"&$N1817&\"'!$h$11\"),\"\")","v":""},{"$f":"IFERROR(VLOOKUP(E1818,'[1]Tarif de base'!D:E,2,FALSE)*F1818,\"\")","v":""}]
[null,"",null,null,"","",{"$f":"IFERROR(VLOOKUP(E1819,'[1]Tarif de base'!D:E,2,FALSE)*F1819,\"\")","v":""}]
[null,"",null,null,"","",{"$f":"IFERROR(VLOOKUP(E1820,'[1]Tarif de base'!D:E,2,FALSE)*F1820,\"\")","v":""}]
[null,"",null,null,"","",{"$f":"IFERROR(VLOOKUP(E1821,'[1]Tarif de base'!D:E,2,FALSE)*F1821,\"\")","v":""}]
[null,"",null,null,"","",{"$f":"IFERROR(VLOOKUP(E1822,'[1]Tarif de base'!D:E,2,FALSE)*F1822,\"\")","v":""}]
[null,"",null,null,"Total",{"$f":"SUM(F1817:F1822)","v":0},{"$f":"SUM(G1817:G1822)","v":0}]
["","","","","","",{"$f":"IFERROR(VLOOKUP(E1824,'[1]Tarif de base'!D:E,2,FALSE)*F1824,\"\")","v":""},"","","",{"$f":"IFERROR(IF(G1830-H1824-I1824-J1824<>0,\"Attention il manque \"&G1830-H1824-I1824-J1824&\"€\",\"Règlement OK\"),\"Pas de règlement\")","v":"Pas de règlement"},"",null,260]
[null,"",null,null,{"$f":"IFERROR(INDIRECT(\"'C:\\Users\\Moi\\OneDrive\\Documents\\[Formulaires Gravereau.xlsx]Action\"&$N1824&\"'!$D$11\"),\"\")","v":""},{"$f":"IFERROR(INDIRECT(\"'C:\\Users\\Moi\\OneDrive\\Documents\\[Formulaires Gravereau.xlsx]Action\"&$N1824&\"'!$h$11\"),\"\")","v":""},{"$f":"IFERROR(VLOOKUP(E1825,'[1]Tarif de base'!D:E,2,FALSE)*F1825,\"\")","v":""}]
[null,"",null,null,"","",{"$f":"IFERROR(VLOOKUP(E1826,'[1]Tarif de base'!D:E,2,FALSE)*F1826,\"\")","v":""}]
[null,"",null,null,"","",{"$f":"IFERROR(VLOOKUP(E1827,'[1]Tarif de base'!D:E,2,FALSE)*F1827,\"\")","v":""}]
[null,"",null,null,"","",{"$f":"IFERROR(VLOOKUP(E1828,'[1]Tarif de base'!D:E,2,FALSE)*F1828,\"\")","v":""}]
[null,"",null,null,"","",{"$f":"IFERROR(VLOOKUP(E1829,'[1]Tarif de base'!D:E,2,FALSE)*F1829,\"\")","v":""}]
[null,"",null,null,"Total",{"$f":"SUM(F1824:F1829)","v":0},{"$f":"SUM(G1824:G1829)","v":0}]
["","","","","","",{"$f":"IFERROR(VLOOKUP(E1831,'[1]Tarif de base'!D:E,2,FALSE)*F1831,\"\")","v":""},"","","",{"$f":"IFERROR(IF(G1837-H1831-I1831-J1831<>0,\"Attention il manque \"&G1837-H1831-I1831-J1831&\"€\",\"Règlement OK\"),\"Pas de règlement\")","v":"Pas de règlement"},"",null,261]
[null,"",null,null,{"$f":"IFERROR(INDIRECT(\"'C:\\Users\\Moi\\OneDrive\\Documents\\[Formulaires Gravereau.xlsx]Action\"&$N1831&\"'!$D$11\"),\"\")","v":""},{"$f":"IFERROR(INDIRECT(\"'C:\\Users\\Moi\\OneDrive\\Documents\\[Formulaires Gravereau.xlsx]Action\"&$N1831&\"'!$h$11\"),\"\")","v":""},{"$f":"IFERROR(VLOOKUP(E1832,'[1]Tarif de base'!D:E,2,FALSE)*F1832,\"\")","v":""}]
[null,"",null,null,"","",{"$f":"IFERROR(VLOOKUP(E1833,'[1]Tarif de base'!D:E,2,FALSE)*F1833,\"\")","v":""}]
[null,"",null,null,"","",{"$f":"IFERROR(VLOOKUP(E1834,'[1]Tarif de base'!D:E,2,FALSE)*F1834,\"\")","v":""}]
[null,"",null,null,"","",{"$f":"IFERROR(VLOOKUP(E1835,'[1]Tarif de base'!D:E,2,FALSE)*F1835,\"\")","v":""}]
[null,"",null,null,"","",{"$f":"IFERROR(VLOOKUP(E1836,'[1]Tarif de base'!D:E,2,FALSE)*F1836,\"\")","v":""}]
[null,"",null,null,"Total",{"$f":"SUM(F1831:F1836)","v":0},{"$f":"SUM(G1831:G1836)","v":0}]
["","","","","","",{"$f":"IFERROR(VLOOKUP(E1838,'[1]Tarif de base'!D:E,2,FALSE)*F1838,\"\")","v":""},"","","",{"$f":"IFERROR(IF(G1844-H1838-I1838-J1838<>0,\"Attention il manque \"&G1844-H1838-I1838-J1838&\"€\",\"Règlement OK\"),\"Pas de règlement\")","v":"Pas de règlement"},"",null,262]
[null,"",null,null,{"$f":"IFERROR(INDIRECT(\"'C:\\Users\\Moi\\OneDrive\\Documents\\[Formulaires Gravereau.xlsx]Action\"&$N1838&\"'!$D$11\"),\"\")","v":""},{"$f":"IFERROR(INDIRECT(\"'C:\\Users\\Moi\\OneDrive\\Documents\\[Formulaires Gravereau.xlsx]Action\"&$N1838&\"'!$h$11\"),\"\")","v":""},{"$f":"IFERROR(VLOOKUP(E1839,'[1]Tarif de base'!D:E,2,FALSE)*F1839,\"\")","v":""}]
[null,"",null,null,"","",{"$f":"IFERROR(VLOOKUP(E1840,'[1]Tarif de base'!D:E,2,FALSE)*F1840,\"\")","v":""}]
[null,"",null,null,"","",{"$f":"IFERROR(VLOOKUP(E1841,'[1]Tarif de base'!D:E,2,FALSE)*F1841,\"\")","v":""}]
[null,"",null,null,"","",{"$f":"IFERROR(VLOOKUP(E1842,'[1]Tarif de base'!D:E,2,FALSE)*F1842,\"\")","v":""}]
[null,"",null,null,"","",{"$f":"IFERROR(VLOOKUP(E1843,'[1]Tarif de base'!D:E,2,FALSE)*F1843,\"\")","v":""}]
[null,"",null,null,"Total",{"$f":"SUM(F1838:F1843)","v":0},{"$f":"SUM(G1838:G1843)","v":0}]
["","","","","","",{"$f":"IFERROR(VLOOKUP(E1845,'[1]Tarif de base'!D:E,2,FALSE)*F1845,\"\")","v":""},"","","",{"$f":"IFERROR(IF(G1851-H1845-I1845-J1845<>0,\"Attention il manque \"&G1851-H1845-I1845-J1845&\"€\",\"Règlement OK\"),\"Pas de règlement\")","v":"Pas de règlement"},"",null,263]
[null,"",null,null,{"$f":"IFERROR(INDIRECT(\"'C:\\Users\\Moi\\OneDrive\\Documents\\[Formulaires Gravereau.xlsx]Action\"&$N1845&\"'!$D$11\"),\"\")","v":""},{"$f":"IFERROR(INDIRECT(\"'C:\\Users\\Moi\\OneDrive\\Documents\\[Formulaires Gravereau.xlsx]Action\"&$N1845&\"'!$h$11\"),\"\")","v":""},{"$f":"IFERROR(VLOOKUP(E1846,'[1]Tarif de base'!D:E,2,FALSE)*F1846,\"\")","v":""}]
[null,"",null,null,"","",{"$f":"IFERROR(VLOOKUP(E1847,'[1]Tarif de base'!D:E,2,FALSE)*F1847,\"\")","v":""}]
[null,"",null,null,"","",{"$f":"IFERROR(VLOOKUP(E1848,'[1]Tarif de base'!D:E,2,FALSE)*F1848,\"\")","v":""}]
[null,"",null,null,"","",{"$f":"IFERROR(VLOOKUP(E1849,'[1]Tarif de base'!D:E,2,FALSE)*F1849,\"\")","v":""}]
[null,"",null,null,"","",{"$f":"IFERROR(VLOOKUP(E1850,'[1]Tarif de base'!D:E,2,FALSE)*F1850,\"\")","v":""}]
[null,"",null,null,"Total",{"$f":"SUM(F1845:F1850)","v":0},{"$f":"SUM(G1845:G1850)","v":0}]
[{"$f":"IFERROR(INDIRECT(\"'C:\\Users\\Moi\\OneDrive\\Documents\\[Formulaires Gravereau.xlsx]Action\"&$N1852&\"'!$D$6\"),\"\")","v":""},{"$f":"IF(C1852<>\"\",C1852,\"\")","v":""},{"$f":"IFERROR(INDIRECT(\"'C:\\Users\\Moi\\OneDrive\\Documents\\[Formulaires Gravereau.xlsx]Action\"&$N1852&\"'!$D$4\"),\"\")","v":""},{"$f":"IFERROR(INDIRECT(\"'C:\\Users\\Moi\\OneDrive\\Documents\\[Formulaires Gravereau.xlsx]Action\"&$N1852&\"'!$h$4\"),\"\")","v":""},{"$f":"IFERROR(INDIRECT(\"'C:\\Users\\Moi\\OneDrive\\Documents\\[Formulaires Gravereau.xlsx]Action\"&$N1852&\"'!$D$9\"),\"\")","v":""},{"$f":"IFERROR(INDIRECT(\"'C:\\Users\\Moi\\OneDrive\\Documents\\[Formulaires Gravereau.xlsx]Action\"&$N1852&\"'!$h$9\"),\"\")","v":""},{"$f":"IFERROR(VLOOKUP(E1852,'[1]Tarif de base'!D:E,2,FALSE)*F1852,\"\")","v":""},{"$f":"IFERROR(INDIRECT(\"'C:\\Users\\Moi\\OneDrive\\Documents\\[Formulaires Gravereau.xlsx]Action\"&$N1852&\"'!$d$26\"),\"\")","v":""},{"$f":"IFERROR(INDIRECT(\"'C:\\Users\\Moi\\OneDrive\\Documents\\[Formulaires Gravereau.xlsx]Action\"&$N1852&\"'!$d$28\"),\"\")","v":""},{"$f":"IFERROR(INDIRECT(\"'C:\\Users\\Moi\\OneDrive\\Documents\\[Formulaires Gravereau.xlsx]Action\"&$N1852&\"'!$h$26\"),\"\")","v":""},{"$f":"IFERROR(IF(G1858-H1852-I1852-J1852<>0,\"Attention il manque \"&G1858-H1852-I1852-J1852&\"€\",\"Règlement OK\"),\"Pas de règlement\")","v":"Pas de règlement"},{"$f":"IFERROR(INDIRECT(\"'C:\\Users\\Moi\\OneDrive\\Documents\\[Formulaires Gravereau.xlsx]Action\"&$N1852&\"'!$d$30\"),\"\")","v":""},null,264]
[null,"",null,null,{"$f":"IFERROR(INDIRECT(\"'C:\\Users\\Moi\\OneDrive\\Documents\\[Formulaires Gravereau.xlsx]Action\"&$N1852&\"'!$D$11\"),\"\")","v":""},{"$f":"IFERROR(INDIRECT(\"'C:\\Users\\Moi\\OneDrive\\Documents\\[Formulaires Gravereau.xlsx]Action\"&$N1852&\"'!$h$11\"),\"\")","v":""},{"$f":"IFERROR(VLOOKUP(E1853,'[1]Tarif de base'!D:E,2,FALSE)*F1853,\"\")","v":""}]
[null,"",null,null,{"$f":"IFERROR(INDIRECT(\"'C:\\Users\\Moi\\OneDrive\\Documents\\[Formulaires Gravereau.xlsx]Action\"&$N1852&\"'!$D$13\"),\"\")","v":""},{"$f":"IFERROR(INDIRECT(\"'C:\\Users\\Moi\\OneDrive\\Documents\\[Formulaires Gravereau.xlsx]Action\"&$N1852&\"'!$h$13\"),\"\")","v":""},{"$f":"IFERROR(VLOOKUP(E1854,'[1]Tarif de base'!D:E,2,FALSE)*F1854,\"\")","v":""}]
[null,"",null,null,{"$f":"IFERROR(INDIRECT(\"'C:\\Users\\Moi\\OneDrive\\Documents\\[Formulaires Gravereau.xlsx]Action\"&$N1852&\"'!$D$15\"),\"\")","v":""},{"$f":"IFERROR(INDIRECT(\"'C:\\Users\\Moi\\OneDrive\\Documents\\[Formulaires Gravereau.xlsx]Action\"&$N1852&\"'!$h$15\"),\"\")","v":""},{"$f":"IFERROR(VLOOKUP(E1855,'[1]Tarif de base'!D:E,2,FALSE)*F1855,\"\")","v":""}]
[null,"",null,null,{"$f":"IFERROR(INDIRECT(\"'C:\\Users\\Moi\\OneDrive\\Documents\\[Formulaires Gravereau.xlsx]Action\"&$N1852&\"'!$D$17\"),\"\")","v":""},{"$f":"IFERROR(INDIRECT(\"'C:\\Users\\Moi\\OneDrive\\Documents\\[Formulaires Gravereau.xlsx]Action\"&$N1852&\"'!$h$17\"),\"\")","v":""},{"$f":"IFERROR(VLOOKUP(E1856,'[1]Tarif de base'!D:E,2,FALSE)*F1856,\"\")","v":""}]
[null,"",null,null,{"$f":"IFERROR(INDIRECT(\"'C:\\Users\\Moi\\OneDrive\\Documents\\[Formulaires Gravereau.xlsx]Action\"&$N1852&\"'!$D$19\"),\"\")","v":""},{"$f":"IFERROR(INDIRECT(\"'C:\\Users\\Moi\\OneDrive\\Documents\\[Formulaires Gravereau.xlsx]Action\"&$N1852&\"'!$h$19\"),\"\")","v":""},{"$f":"IFERROR(VLOOKUP(E1857,'[1]Tarif de base'!D:E,2,FALSE)*F1857,\"\")","v":""}]
[null,"",null,null,"Total",{"$f":"SUM(F1852:F1857)","v":0},{"$f":"SUM(G1852:G1857)","v":0}]
["","","","","","",{"$f":"IFERROR(VLOOKUP(E1859,'[1]Tarif de base'!D:E,2,FALSE)*F1859,\"\")","v":""},"","","",{"$f":"IFERROR(IF(G1865-H1859-I1859-J1859<>0,\"Attention il manque \"&G1865-H1859-I1859-J1859&\"€\",\"Règlement OK\"),\"Pas de règlement\")","v":"Pas de règlement"},"",null,265]
[null,"",null,null,{"$f":"IFERROR(INDIRECT(\"'C:\\Users\\Moi\\OneDrive\\Documents\\[Formulaires Gravereau.xlsx]Action\"&$N1859&\"'!$D$11\"),\"\")","v":""},{"$f":"IFERROR(INDIRECT(\"'C:\\Users\\Moi\\OneDrive\\Documents\\[Formulaires Gravereau.xlsx]Action\"&$N1859&\"'!$h$11\"),\"\")","v":""},{"$f":"IFERROR(VLOOKUP(E1860,'[1]Tarif de base'!D:E,2,FALSE)*F1860,\"\")","v":""}]
[null,"",null,null,"","",{"$f":"IFERROR(VLOOKUP(E1861,'[1]Tarif de base'!D:E,2,FALSE)*F1861,\"\")","v":""}]
[null,"",null,null,"","",{"$f":"IFERROR(VLOOKUP(E1862,'[1]Tarif de base'!D:E,2,FALSE)*F1862,\"\")","v":""}]
[null,"",null,null,"","",{"$f":"IFERROR(VLOOKUP(E1863,'[1]Tarif de base'!D:E,2,FALSE)*F1863,\"\")","v":""}]
[null,"",null,null,"","",{"$f":"IFERROR(VLOOKUP(E1864,'[1]Tarif de base'!D:E,2,FALSE)*F1864,\"\")","v":""}]
[null,"",null,null,"Total",{"$f":"SUM(F1859:F1864)","v":0},{"$f":"SUM(G1859:G1864)","v":0}]
["","","","","","",{"$f":"IFERROR(VLOOKUP(E1866,'[1]Tarif de base'!D:E,2,FALSE)*F1866,\"\")","v":""},"","","",{"$f":"IFERROR(IF(G1872-H1866-I1866-J1866<>0,\"Attention il manque \"&G1872-H1866-I1866-J1866&\"€\",\"Règlement OK\"),\"Pas de règlement\")","v":"Pas de règlement"},"",null,266]
[null,"",null,null,{"$f":"IFERROR(INDIRECT(\"'C:\\Users\\Moi\\OneDrive\\Documents\\[Formulaires Gravereau.xlsx]Action\"&$N1866&\"'!$D$11\"),\"\")","v":""},{"$f":"IFERROR(INDIRECT(\"'C:\\Users\\Moi\\OneDrive\\Documents\\[Formulaires Gravereau.xlsx]Action\"&$N1866&\"'!$h$11\"),\"\")","v":""},{"$f":"IFERROR(VLOOKUP(E1867,'[1]Tarif de base'!D:E,2,FALSE)*F1867,\"\")","v":""}]
[null,"",null,null,"","",{"$f":"IFERROR(VLOOKUP(E1868,'[1]Tarif de base'!D:E,2,FALSE)*F1868,\"\")","v":""}]
[null,"",null,null,"","",{"$f":"IFERROR(VLOOKUP(E1869,'[1]Tarif de base'!D:E,2,FALSE)*F1869,\"\")","v":""}]
[null,"",null,null,"","",{"$f":"IFERROR(VLOOKUP(E1870,'[1]Tarif de base'!D:E,2,FALSE)*F1870,\"\")","v":""}]
[null,"",null,null,"","",{"$f":"IFERROR(VLOOKUP(E1871,'[1]Tarif de base'!D:E,2,FALSE)*F1871,\"\")","v":""}]
[null,"",null,null,"Total",{"$f":"SUM(F1866:F1871)","v":0},{"$f":"SUM(G1866:G1871)","v":0}]
["","","","","","",{"$f":"IFERROR(VLOOKUP(E1873,'[1]Tarif de base'!D:E,2,FALSE)*F1873,\"\")","v":""},"","","",{"$f":"IFERROR(IF(G1879-H1873-I1873-J1873<>0,\"Attention il manque \"&G1879-H1873-I1873-J1873&\"€\",\"Règlement OK\"),\"Pas de règlement\")","v":"Pas de règlement"},"",null,267]
[null,"",null,null,{"$f":"IFERROR(INDIRECT(\"'C:\\Users\\Moi\\OneDrive\\Documents\\[Formulaires Gravereau.xlsx]Action\"&$N1873&\"'!$D$11\"),\"\")","v":""},{"$f":"IFERROR(INDIRECT(\"'C:\\Users\\Moi\\OneDrive\\Documents\\[Formulaires Gravereau.xlsx]Action\"&$N1873&\"'!$h$11\"),\"\")","v":""},{"$f":"IFERROR(VLOOKUP(E1874,'[1]Tarif de base'!D:E,2,FALSE)*F1874,\"\")","v":""}]
[null,"",null,null,"","",{"$f":"IFERROR(VLOOKUP(E1875,'[1]Tarif de base'!D:E,2,FALSE)*F1875,\"\")","v":""}]
[null,"",null,null,"","",{"$f":"IFERROR(VLOOKUP(E1876,'[1]Tarif de base'!D:E,2,FALSE)*F1876,\"\")","v":""}]
[null,"",null,null,"","",{"$f":"IFERROR(VLOOKUP(E1877,'[1]Tarif de base'!D:E,2,FALSE)*F1877,\"\")","v":""}]
[null,{"$f":"B1877","v":""},null,null,"","",{"$f":"IFERROR(VLOOKUP(E1878,'[1]Tarif de base'!D:E,2,FALSE)*F1878,\"\")","v":""}]
[null,"",null,null,"Total",{"$f":"SUM(F1873:F1878)","v":0},{"$f":"SUM(G1873:G1878)","v":0}]
["","","","","","",{"$f":"IFERROR(VLOOKUP(E1880,'[1]Tarif de base'!D:E,2,FALSE)*F1880,\"\")","v":""},"","","",{"$f":"IFERROR(IF(G1886-H1880-I1880-J1880<>0,\"Attention il manque \"&G1886-H1880-I1880-J1880&\"€\",\"Règlement OK\"),\"Pas de règlement\")","v":"Pas de règlement"},"",null,268]
[null,"",null,null,{"$f":"IFERROR(INDIRECT(\"'C:\\Users\\Moi\\OneDrive\\Documents\\[Formulaires Gravereau.xlsx]Action\"&$N1880&\"'!$D$11\"),\"\")","v":""},{"$f":"IFERROR(INDIRECT(\"'C:\\Users\\Moi\\OneDrive\\Documents\\[Formulaires Gravereau.xlsx]Action\"&$N1880&\"'!$h$11\"),\"\")","v":""},{"$f":"IFERROR(VLOOKUP(E1881,'[1]Tarif de base'!D:E,2,FALSE)*F1881,\"\")","v":""}]
[null,"",null,null,"","",{"$f":"IFERROR(VLOOKUP(E1882,'[1]Tarif de base'!D:E,2,FALSE)*F1882,\"\")","v":""}]
[null,"",null,null,"","",{"$f":"IFERROR(VLOOKUP(E1883,'[1]Tarif de base'!D:E,2,FALSE)*F1883,\"\")","v":""}]
[null,"",null,null,"","",{"$f":"IFERROR(VLOOKUP(E1884,'[1]Tarif de base'!D:E,2,FALSE)*F1884,\"\")","v":""}]
[null,"",null,null,"","",{"$f":"IFERROR(VLOOKUP(E1885,'[1]Tarif de base'!D:E,2,FALSE)*F1885,\"\")","v":""}]
[null,"",null,null,"Total",{"$f":"SUM(F1880:F1885)","v":0},{"$f":"SUM(G1880:G1885)","v":0}]
["","","","","","",{"$f":"IFERROR(VLOOKUP(E1887,'[1]Tarif de base'!D:E,2,FALSE)*F1887,\"\")","v":""},"","","",{"$f":"IFERROR(IF(G1893-H1887-I1887-J1887<>0,\"Attention il manque \"&G1893-H1887-I1887-J1887&\"€\",\"Règlement OK\"),\"Pas de règlement\")","v":"Pas de règlement"},"",null,269]
[null,"",null,null,{"$f":"IFERROR(INDIRECT(\"'C:\\Users\\Moi\\OneDrive\\Documents\\[Formulaires Gravereau.xlsx]Action\"&$N1887&\"'!$D$11\"),\"\")","v":""},{"$f":"IFERROR(INDIRECT(\"'C:\\Users\\Moi\\OneDrive\\Documents\\[Formulaires Gravereau.xlsx]Action\"&$N1887&\"'!$h$11\"),\"\")","v":""},{"$f":"IFERROR(VLOOKUP(E1888,'[1]Tarif de base'!D:E,2,FALSE)*F1888,\"\")","v":""}]
[null,"",null,null,"","",{"$f":"IFERROR(VLOOKUP(E1889,'[1]Tarif de base'!D:E,2,FALSE)*F1889,\"\")","v":""}]
[null,"",null,null,"","",{"$f":"IFERROR(VLOOKUP(E1890,'[1]Tarif de base'!D:E,2,FALSE)*F1890,\"\")","v":""}]
[null,"",null,null,"","",{"$f":"IFERROR(VLOOKUP(E1891,'[1]Tarif de base'!D:E,2,FALSE)*F1891,\"\")","v":""}]
[null,"",null,null,"","",{"$f":"IFERROR(VLOOKUP(E1892,'[1]Tarif de base'!D:E,2,FALSE)*F1892,\"\")","v":""}]
[null,"",null,null,"Total",{"$f":"SUM(F1887:F1892)","v":0},{"$f":"SUM(G1887:G1892)","v":0}]
["","","","","","",{"$f":"IFERROR(VLOOKUP(E1894,'[1]Tarif de base'!D:E,2,FALSE)*F1894,\"\")","v":""},"","","",{"$f":"IFERROR(IF(G1900-H1894-I1894-J1894<>0,\"Attention il manque \"&G1900-H1894-I1894-J1894&\"€\",\"Règlement OK\"),\"Pas de règlement\")","v":"Pas de règlement"},"",null,270]
[null,"",null,null,{"$f":"IFERROR(INDIRECT(\"'C:\\Users\\Moi\\OneDrive\\Documents\\[Formulaires Gravereau.xlsx]Action\"&$N1894&\"'!$D$11\"),\"\")","v":""},{"$f":"IFERROR(INDIRECT(\"'C:\\Users\\Moi\\OneDrive\\Documents\\[Formulaires Gravereau.xlsx]Action\"&$N1894&\"'!$h$11\"),\"\")","v":""},{"$f":"IFERROR(VLOOKUP(E1895,'[1]Tarif de base'!D:E,2,FALSE)*F1895,\"\")","v":""}]
[null,"",null,null,"","",{"$f":"IFERROR(VLOOKUP(E1896,'[1]Tarif de base'!D:E,2,FALSE)*F1896,\"\")","v":""}]
[null,"",null,null,"","",{"$f":"IFERROR(VLOOKUP(E1897,'[1]Tarif de base'!D:E,2,FALSE)*F1897,\"\")","v":""}]
[null,"",null,null,"","",{"$f":"IFERROR(VLOOKUP(E1898,'[1]Tarif de base'!D:E,2,FALSE)*F1898,\"\")","v":""}]
[null,"",null,null,"","",{"$f":"IFERROR(VLOOKUP(E1899,'[1]Tarif de base'!D:E,2,FALSE)*F1899,\"\")","v":""}]
[null,"",null,null,"Total",{"$f":"SUM(F1894:F1899)","v":0},{"$f":"SUM(G1894:G1899)","v":0}]
["","","","","","",{"$f":"IFERROR(VLOOKUP(E1901,'[1]Tarif de base'!D:E,2,FALSE)*F1901,\"\")","v":""},"","","",{"$f":"IFERROR(IF(G1907-H1901-I1901-J1901<>0,\"Attention il manque \"&G1907-H1901-I1901-J1901&\"€\",\"Règlement OK\"),\"Pas de règlement\")","v":"Pas de règlement"},"",null,271]
[null,"",null,null,{"$f":"IFERROR(INDIRECT(\"'C:\\Users\\Moi\\OneDrive\\Documents\\[Formulaires Gravereau.xlsx]Action\"&$N1901&\"'!$D$11\"),\"\")","v":""},{"$f":"IFERROR(INDIRECT(\"'C:\\Users\\Moi\\OneDrive\\Documents\\[Formulaires Gravereau.xlsx]Action\"&$N1901&\"'!$h$11\"),\"\")","v":""},{"$f":"IFERROR(VLOOKUP(E1902,'[1]Tarif de base'!D:E,2,FALSE)*F1902,\"\")","v":""}]
[null,"",null,null,"","",{"$f":"IFERROR(VLOOKUP(E1903,'[1]Tarif de base'!D:E,2,FALSE)*F1903,\"\")","v":""}]
[null,"",null,null,"","",{"$f":"IFERROR(VLOOKUP(E1904,'[1]Tarif de base'!D:E,2,FALSE)*F1904,\"\")","v":""}]
[null,"",null,null,"","",{"$f":"IFERROR(VLOOKUP(E1905,'[1]Tarif de base'!D:E,2,FALSE)*F1905,\"\")","v":""}]
[null,"",null,null,"","",{"$f":"IFERROR(VLOOKUP(E1906,'[1]Tarif de base'!D:E,2,FALSE)*F1906,\"\")","v":""}]
[null,"",null,null,"Total",{"$f":"SUM(F1901:F1906)","v":0},{"$f":"SUM(G1901:G1906)","v":0}]
["","","","","","",{"$f":"IFERROR(VLOOKUP(E1908,'[1]Tarif de base'!D:E,2,FALSE)*F1908,\"\")","v":""},"","","",{"$f":"IFERROR(IF(G1914-H1908-I1908-J1908<>0,\"Attention il manque \"&G1914-H1908-I1908-J1908&\"€\",\"Règlement OK\"),\"Pas de règlement\")","v":"Pas de règlement"},"",null,272]
[null,"",null,null,{"$f":"IFERROR(INDIRECT(\"'C:\\Users\\Moi\\OneDrive\\Documents\\[Formulaires Gravereau.xlsx]Action\"&$N1908&\"'!$D$11\"),\"\")","v":""},{"$f":"IFERROR(INDIRECT(\"'C:\\Users\\Moi\\OneDrive\\Documents\\[Formulaires Gravereau.xlsx]Action\"&$N1908&\"'!$h$11\"),\"\")","v":""},{"$f":"IFERROR(VLOOKUP(E1909,'[1]Tarif de base'!D:E,2,FALSE)*F1909,\"\")","v":""}]
[null,"",null,null,"","",{"$f":"IFERROR(VLOOKUP(E1910,'[1]Tarif de base'!D:E,2,FALSE)*F1910,\"\")","v":""}]
[null,"",null,null,"","",{"$f":"IFERROR(VLOOKUP(E1911,'[1]Tarif de base'!D:E,2,FALSE)*F1911,\"\")","v":""}]
[null,"",null,null,"","",{"$f":"IFERROR(VLOOKUP(E1912,'[1]Tarif de base'!D:E,2,FALSE)*F1912,\"\")","v":""}]
[null,"",null,null,"","",{"$f":"IFERROR(VLOOKUP(E1913,'[1]Tarif de base'!D:E,2,FALSE)*F1913,\"\")","v":""}]
[null,"",null,null,"Total",{"$f":"SUM(F1908:F1913)","v":0},{"$f":"SUM(G1908:G1913)","v":0}]
["","","","","","",{"$f":"IFERROR(VLOOKUP(E1915,'[1]Tarif de base'!D:E,2,FALSE)*F1915,\"\")","v":""},"","","",{"$f":"IFERROR(IF(G1921-H1915-I1915-J1915<>0,\"Attention il manque \"&G1921-H1915-I1915-J1915&\"€\",\"Règlement OK\"),\"Pas de règlement\")","v":"Pas de règlement"},"",null,273]
[null,"",null,null,{"$f":"IFERROR(INDIRECT(\"'C:\\Users\\Moi\\OneDrive\\Documents\\[Formulaires Gravereau.xlsx]Action\"&$N1915&\"'!$D$11\"),\"\")","v":""},{"$f":"IFERROR(INDIRECT(\"'C:\\Users\\Moi\\OneDrive\\Documents\\[Formulaires Gravereau.xlsx]Action\"&$N1915&\"'!$h$11\"),\"\")","v":""},{"$f":"IFERROR(VLOOKUP(E1916,'[1]Tarif de base'!D:E,2,FALSE)*F1916,\"\")","v":""}]
[null,"",null,null,"","",{"$f":"IFERROR(VLOOKUP(E1917,'[1]Tarif de base'!D:E,2,FALSE)*F1917,\"\")","v":""}]
[null,"",null,null,"","",{"$f":"IFERROR(VLOOKUP(E1918,'[1]Tarif de base'!D:E,2,FALSE)*F1918,\"\")","v":""}]
[null,"",null,null,"","",{"$f":"IFERROR(VLOOKUP(E1919,'[1]Tarif de base'!D:E,2,FALSE)*F1919,\"\")","v":""}]
[null,"",null,null,"","",{"$f":"IFERROR(VLOOKUP(E1920,'[1]Tarif de base'!D:E,2,FALSE)*F1920,\"\")","v":""}]
[null,"",null,null,"Total",{"$f":"SUM(F1915:F1920)","v":0},{"$f":"SUM(G1915:G1920)","v":0}]
[{"$f":"IFERROR(INDIRECT(\"'C:\\Users\\Moi\\OneDrive\\Documents\\[Formulaires Gravereau.xlsx]Action\"&$N1922&\"'!$D$6\"),\"\")","v":""},{"$f":"IF(C1922<>\"\",C1922,\"\")","v":""},{"$f":"IFERROR(INDIRECT(\"'C:\\Users\\Moi\\OneDrive\\Documents\\[Formulaires Gravereau.xlsx]Action\"&$N1922&\"'!$D$4\"),\"\")","v":""},{"$f":"IFERROR(INDIRECT(\"'C:\\Users\\Moi\\OneDrive\\Documents\\[Formulaires Gravereau.xlsx]Action\"&$N1922&\"'!$h$4\"),\"\")","v":""},{"$f":"IFERROR(INDIRECT(\"'C:\\Users\\Moi\\OneDrive\\Documents\\[Formulaires Gravereau.xlsx]Action\"&$N1922&\"'!$D$9\"),\"\")","v":""},{"$f":"IFERROR(INDIRECT(\"'C:\\Users\\Moi\\OneDrive\\Documents\\[Formulaires Gravereau.xlsx]Action\"&$N1922&\"'!$h$9\"),\"\")","v":""},{"$f":"IFERROR(VLOOKUP(E1922,'[1]Tarif de base'!D:E,2,FALSE)*F1922,\"\")","v":""},{"$f":"IFERROR(INDIRECT(\"'C:\\Users\\Moi\\OneDrive\\Documents\\[Formulaires Gravereau.xlsx]Action\"&$N1922&\"'!$d$26\"),\"\")","v":""},{"$f":"IFERROR(INDIRECT(\"'C:\\Users\\Moi\\OneDrive\\Documents\\[Formulaires Gravereau.xlsx]Action\"&$N1922&\"'!$d$28\"),\"\")","v":""},{"$f":"IFERROR(INDIRECT(\"'C:\\Users\\Moi\\OneDrive\\Documents\\[Formulaires Gravereau.xlsx]Action\"&$N1922&\"'!$h$26\"),\"\")","v":""},{"$f":"IFERROR(IF(G1928-H1922-I1922-J1922<>0,\"Attention il manque \"&G1928-H1922-I1922-J1922&\"€\",\"Règlement OK\"),\"Pas de règlement\")","v":"Pas de règlement"},{"$f":"IFERROR(INDIRECT(\"'C:\\Users\\Moi\\OneDrive\\Documents\\[Formulaires Gravereau.xlsx]Action\"&$N1922&\"'!$d$30\"),\"\")","v":""},null,274]
[null,"",null,null,{"$f":"IFERROR(INDIRECT(\"'C:\\Users\\Moi\\OneDrive\\Documents\\[Formulaires Gravereau.xlsx]Action\"&$N1922&\"'!$D$11\"),\"\")","v":""},{"$f":"IFERROR(INDIRECT(\"'C:\\Users\\Moi\\OneDrive\\Documents\\[Formulaires Gravereau.xlsx]Action\"&$N1922&\"'!$h$11\"),\"\")","v":""},{"$f":"IFERROR(VLOOKUP(E1923,'[1]Tarif de base'!D:E,2,FALSE)*F1923,\"\")","v":""}]
[null,"",null,null,{"$f":"IFERROR(INDIRECT(\"'C:\\Users\\Moi\\OneDrive\\Documents\\[Formulaires Gravereau.xlsx]Action\"&$N1922&\"'!$D$13\"),\"\")","v":""},{"$f":"IFERROR(INDIRECT(\"'C:\\Users\\Moi\\OneDrive\\Documents\\[Formulaires Gravereau.xlsx]Action\"&$N1922&\"'!$h$13\"),\"\")","v":""},{"$f":"IFERROR(VLOOKUP(E1924,'[1]Tarif de base'!D:E,2,FALSE)*F1924,\"\")","v":""}]
[null,"",null,null,{"$f":"IFERROR(INDIRECT(\"'C:\\Users\\Moi\\OneDrive\\Documents\\[Formulaires Gravereau.xlsx]Action\"&$N1922&\"'!$D$15\"),\"\")","v":""},{"$f":"IFERROR(INDIRECT(\"'C:\\Users\\Moi\\OneDrive\\Documents\\[Formulaires Gravereau.xlsx]Action\"&$N1922&\"'!$h$15\"),\"\")","v":""},{"$f":"IFERROR(VLOOKUP(E1925,'[1]Tarif de base'!D:E,2,FALSE)*F1925,\"\")","v":""}]
[null,"",null,null,{"$f":"IFERROR(INDIRECT(\"'C:\\Users\\Moi\\OneDrive\\Documents\\[Formulaires Gravereau.xlsx]Action\"&$N1922&\"'!$D$17\"),\"\")","v":""},{"$f":"IFERROR(INDIRECT(\"'C:\\Users\\Moi\\OneDrive\\Documents\\[Formulaires Gravereau.xlsx]Action\"&$N1922&\"'!$h$17\"),\"\")","v":""},{"$f":"IFERROR(VLOOKUP(E1926,'[1]Tarif de base'!D:E,2,FALSE)*F1926,\"\")","v":""}]
[null,"",null,null,{"$f":"IFERROR(INDIRECT(\"'C:\\Users\\Moi\\OneDrive\\Documents\\[Formulaires Gravereau.xlsx]Action\"&$N1922&\"'!$D$19\"),\"\")","v":""},{"$f":"IFERROR(INDIRECT(\"'C:\\Users\\Moi\\OneDrive\\Documents\\[Formulaires Gravereau.xlsx]Action\"&$N1922&\"'!$h$19\"),\"\")","v":""},{"$f":"IFERROR(VLOOKUP(E1927,'[1]Tarif de base'!D:E,2,FALSE)*F1927,\"\")","v":""}]
[null,"",null,null,"Total",{"$f":"SUM(F1922:F1927)","v":0},{"$f":"SUM(G1922:G1927)","v":0}]
["","","","","","",{"$f":"IFERROR(VLOOKUP(E1929,'[1]Tarif de base'!D:E,2,FALSE)*F1929,\"\")","v":""},"","","",{"$f":"IFERROR(IF(G1935-H1929-I1929-J1929<>0,\"Attention il manque \"&G1935-H1929-I1929-J1929&\"€\",\"Règlement OK\"),\"Pas de règlement\")","v":"Pas de règlement"},"",null,275]
[null,"",null,null,{"$f":"IFERROR(INDIRECT(\"'C:\\Users\\Moi\\OneDrive\\Documents\\[Formulaires Gravereau.xlsx]Action\"&$N1929&\"'!$D$11\"),\"\")","v":""},{"$f":"IFERROR(INDIRECT(\"'C:\\Users\\Moi\\OneDrive\\Documents\\[Formulaires Gravereau.xlsx]Action\"&$N1929&\"'!$h$11\"),\"\")","v":""},{"$f":"IFERROR(VLOOKUP(E1930,'[1]Tarif de base'!D:E,2,FALSE)*F1930,\"\")","v":""}]
[null,"",null,null,"","",{"$f":"IFERROR(VLOOKUP(E1931,'[1]Tarif de base'!D:E,2,FALSE)*F1931,\"\")","v":""}]
[null,"",null,null,"","",{"$f":"IFERROR(VLOOKUP(E1932,'[1]Tarif de base'!D:E,2,FALSE)*F1932,\"\")","v":""}]
[null,"",null,null,"","",{"$f":"IFERROR(VLOOKUP(E1933,'[1]Tarif de base'!D:E,2,FALSE)*F1933,\"\")","v":""}]
[null,"",null,null,"","",{"$f":"IFERROR(VLOOKUP(E1934,'[1]Tarif de base'!D:E,2,FALSE)*F1934,\"\")","v":""}]
[null,"",null,null,"Total",{"$f":"SUM(F1929:F1934)","v":0},{"$f":"SUM(G1929:G1934)","v":0}]
["","","","","","",{"$f":"IFERROR(VLOOKUP(E1936,'[1]Tarif de base'!D:E,2,FALSE)*F1936,\"\")","v":""},"","","",{"$f":"IFERROR(IF(G1942-H1936-I1936-J1936<>0,\"Attention il manque \"&G1942-H1936-I1936-J1936&\"€\",\"Règlement OK\"),\"Pas de règlement\")","v":"Pas de règlement"},"",null,276]
[null,"",null,null,{"$f":"IFERROR(INDIRECT(\"'C:\\Users\\Moi\\OneDrive\\Documents\\[Formulaires Gravereau.xlsx]Action\"&$N1936&\"'!$D$11\"),\"\")","v":""},{"$f":"IFERROR(INDIRECT(\"'C:\\Users\\Moi\\OneDrive\\Documents\\[Formulaires Gravereau.xlsx]Action\"&$N1936&\"'!$h$11\"),\"\")","v":""},{"$f":"IFERROR(VLOOKUP(E1937,'[1]Tarif de base'!D:E,2,FALSE)*F1937,\"\")","v":""}]
[null,"",null,null,"","",{"$f":"IFERROR(VLOOKUP(E1938,'[1]Tarif de base'!D:E,2,FALSE)*F1938,\"\")","v":""}]
[null,"",null,null,"","",{"$f":"IFERROR(VLOOKUP(E1939,'[1]Tarif de base'!D:E,2,FALSE)*F1939,\"\")","v":""}]
[null,"",null,null,"","",{"$f":"IFERROR(VLOOKUP(E1940,'[1]Tarif de base'!D:E,2,FALSE)*F1940,\"\")","v":""}]
[null,"",null,null,"","",{"$f":"IFERROR(VLOOKUP(E1941,'[1]Tarif de base'!D:E,2,FALSE)*F1941,\"\")","v":""}]
[null,{"$f":"B1941","v":""},null,null,"Total",{"$f":"SUM(F1936:F1941)","v":0},{"$f":"SUM(G1936:G1941)","v":0}]
["","","","","","",{"$f":"IFERROR(VLOOKUP(E1943,'[1]Tarif de base'!D:E,2,FALSE)*F1943,\"\")","v":""},"","","",{"$f":"IFERROR(IF(G1949-H1943-I1943-J1943<>0,\"Attention il manque \"&G1949-H1943-I1943-J1943&\"€\",\"Règlement OK\"),\"Pas de règlement\")","v":"Pas de règlement"},"",null,277]
[null,"",null,null,{"$f":"IFERROR(INDIRECT(\"'C:\\Users\\Moi\\OneDrive\\Documents\\[Formulaires Gravereau.xlsx]Action\"&$N1943&\"'!$D$11\"),\"\")","v":""},{"$f":"IFERROR(INDIRECT(\"'C:\\Users\\Moi\\OneDrive\\Documents\\[Formulaires Gravereau.xlsx]Action\"&$N1943&\"'!$h$11\"),\"\")","v":""},{"$f":"IFERROR(VLOOKUP(E1944,'[1]Tarif de base'!D:E,2,FALSE)*F1944,\"\")","v":""}]
[null,"",null,null,"","",{"$f":"IFERROR(VLOOKUP(E1945,'[1]Tarif de base'!D:E,2,FALSE)*F1945,\"\")","v":""}]
[null,"",null,null,"","",{"$f":"IFERROR(VLOOKUP(E1946,'[1]Tarif de base'!D:E,2,FALSE)*F1946,\"\")","v":""}]
[null,"",null,null,"","",{"$f":"IFERROR(VLOOKUP(E1947,'[1]Tarif de base'!D:E,2,FALSE)*F1947,\"\")","v":""}]
[null,"",null,null,"","",{"$f":"IFERROR(VLOOKUP(E1948,'[1]Tarif de base'!D:E,2,FALSE)*F1948,\"\")","v":""}]
[null,"",null,null,"Total",{"$f":"SUM(F1943:F1948)","v":0},{"$f":"SUM(G1943:G1948)","v":0}]
["","","","","","",{"$f":"IFERROR(VLOOKUP(E1950,'[1]Tarif de base'!D:E,2,FALSE)*F1950,\"\")","v":""},"","","",{"$f":"IFERROR(IF(G1956-H1950-I1950-J1950<>0,\"Attention il manque \"&G1956-H1950-I1950-J1950&\"€\",\"Règlement OK\"),\"Pas de règlement\")","v":"Pas de règlement"},"",null,278]
[null,"",null,null,{"$f":"IFERROR(INDIRECT(\"'C:\\Users\\Moi\\OneDrive\\Documents\\[Formulaires Gravereau.xlsx]Action\"&$N1950&\"'!$D$11\"),\"\")","v":""},{"$f":"IFERROR(INDIRECT(\"'C:\\Users\\Moi\\OneDrive\\Documents\\[Formulaires Gravereau.xlsx]Action\"&$N1950&\"'!$h$11\"),\"\")","v":""},{"$f":"IFERROR(VLOOKUP(E1951,'[1]Tarif de base'!D:E,2,FALSE)*F1951,\"\")","v":""}]
[null,"",null,null,"","",{"$f":"IFERROR(VLOOKUP(E1952,'[1]Tarif de base'!D:E,2,FALSE)*F1952,\"\")","v":""}]
[null,"",null,null,"","",{"$f":"IFERROR(VLOOKUP(E1953,'[1]Tarif de base'!D:E,2,FALSE)*F1953,\"\")","v":""}]
[null,"",null,null,"","",{"$f":"IFERROR(VLOOKUP(E1954,'[1]Tarif de base'!D:E,2,FALSE)*F1954,\"\")","v":""}]
[null,"",null,null,"","",{"$f":"IFERROR(VLOOKUP(E1955,'[1]Tarif de base'!D:E,2,FALSE)*F1955,\"\")","v":""}]
[null,"",null,null,"Total",{"$f":"SUM(F1950:F1955)","v":0},{"$f":"SUM(G1950:G1955)","v":0}]
["","","","","","",{"$f":"IFERROR(VLOOKUP(E1957,'[1]Tarif de base'!D:E,2,FALSE)*F1957,\"\")","v":""},"","","",{"$f":"IFERROR(IF(G1963-H1957-I1957-J1957<>0,\"Attention il manque \"&G1963-H1957-I1957-J1957&\"€\",\"Règlement OK\"),\"Pas de règlement\")","v":"Pas de règlement"},"",null,279]
[null,"",null,null,{"$f":"IFERROR(INDIRECT(\"'C:\\Users\\Moi\\OneDrive\\Documents\\[Formulaires Gravereau.xlsx]Action\"&$N1957&\"'!$D$11\"),\"\")","v":""},{"$f":"IFERROR(INDIRECT(\"'C:\\Users\\Moi\\OneDrive\\Documents\\[Formulaires Gravereau.xlsx]Action\"&$N1957&\"'!$h$11\"),\"\")","v":""},{"$f":"IFERROR(VLOOKUP(E1958,'[1]Tarif de base'!D:E,2,FALSE)*F1958,\"\")","v":""}]
[null,"",null,null,"","",{"$f":"IFERROR(VLOOKUP(E1959,'[1]Tarif de base'!D:E,2,FALSE)*F1959,\"\")","v":""}]
[null,"",null,null,"","",{"$f":"IFERROR(VLOOKUP(E1960,'[1]Tarif de base'!D:E,2,FALSE)*F1960,\"\")","v":""}]
[null,"",null,null,"","",{"$f":"IFERROR(VLOOKUP(E1961,'[1]Tarif de base'!D:E,2,FALSE)*F1961,\"\")","v":""}]
[null,"",null,null,"","",{"$f":"IFERROR(VLOOKUP(E1962,'[1]Tarif de base'!D:E,2,FALSE)*F1962,\"\")","v":""}]
[null,"",null,null,"Total",{"$f":"SUM(F1957:F1962)","v":0},{"$f":"SUM(G1957:G1962)","v":0}]
["","","","","","",{"$f":"IFERROR(VLOOKUP(E1964,'[1]Tarif de base'!D:E,2,FALSE)*F1964,\"\")","v":""},"","","",{"$f":"IFERROR(IF(G1970-H1964-I1964-J1964<>0,\"Attention il manque \"&G1970-H1964-I1964-J1964&\"€\",\"Règlement OK\"),\"Pas de règlement\")","v":"Pas de règlement"},"",null,280]
[null,"",null,null,{"$f":"IFERROR(INDIRECT(\"'C:\\Users\\Moi\\OneDrive\\Documents\\[Formulaires Gravereau.xlsx]Action\"&$N1964&\"'!$D$11\"),\"\")","v":""},{"$f":"IFERROR(INDIRECT(\"'C:\\Users\\Moi\\OneDrive\\Documents\\[Formulaires Gravereau.xlsx]Action\"&$N1964&\"'!$h$11\"),\"\")","v":""},{"$f":"IFERROR(VLOOKUP(E1965,'[1]Tarif de base'!D:E,2,FALSE)*F1965,\"\")","v":""}]
[null,"",null,null,"","",{"$f":"IFERROR(VLOOKUP(E1966,'[1]Tarif de base'!D:E,2,FALSE)*F1966,\"\")","v":""}]
[null,"",null,null,"","",{"$f":"IFERROR(VLOOKUP(E1967,'[1]Tarif de base'!D:E,2,FALSE)*F1967,\"\")","v":""}]
[null,"",null,null,"","",{"$f":"IFERROR(VLOOKUP(E1968,'[1]Tarif de base'!D:E,2,FALSE)*F1968,\"\")","v":""}]
[null,"",null,null,"","",{"$f":"IFERROR(VLOOKUP(E1969,'[1]Tarif de base'!D:E,2,FALSE)*F1969,\"\")","v":""}]
[null,"",null,null,"Total",{"$f":"SUM(F1964:F1969)","v":0},{"$f":"SUM(G1964:G1969)","v":0}]
["","","","","","",{"$f":"IFERROR(VLOOKUP(E1971,'[1]Tarif de base'!D:E,2,FALSE)*F1971,\"\")","v":""},"","","",{"$f":"IFERROR(IF(G1977-H1971-I1971-J1971<>0,\"Attention il manque \"&G1977-H1971-I1971-J1971&\"€\",\"Règlement OK\"),\"Pas de règlement\")","v":"Pas de règlement"},"",null,281]
[null,"",null,null,{"$f":"IFERROR(INDIRECT(\"'C:\\Users\\Moi\\OneDrive\\Documents\\[Formulaires Gravereau.xlsx]Action\"&$N1971&\"'!$D$11\"),\"\")","v":""},{"$f":"IFERROR(INDIRECT(\"'C:\\Users\\Moi\\OneDrive\\Documents\\[Formulaires Gravereau.xlsx]Action\"&$N1971&\"'!$h$11\"),\"\")","v":""},{"$f":"IFERROR(VLOOKUP(E1972,'[1]Tarif de base'!D:E,2,FALSE)*F1972,\"\")","v":""}]
[null,"",null,null,"","",{"$f":"IFERROR(VLOOKUP(E1973,'[1]Tarif de base'!D:E,2,FALSE)*F1973,\"\")","v":""}]
[null,"",null,null,"","",{"$f":"IFERROR(VLOOKUP(E1974,'[1]Tarif de base'!D:E,2,FALSE)*F1974,\"\")","v":""}]
[null,"",null,null,"","",{"$f":"IFERROR(VLOOKUP(E1975,'[1]Tarif de base'!D:E,2,FALSE)*F1975,\"\")","v":""}]
[null,"",null,null,"","",{"$f":"IFERROR(VLOOKUP(E1976,'[1]Tarif de base'!D:E,2,FALSE)*F1976,\"\")","v":""}]
[null,"",null,null,"Total",{"$f":"SUM(F1971:F1976)","v":0},{"$f":"SUM(G1971:G1976)","v":0}]
["","","","","","",{"$f":"IFERROR(VLOOKUP(E1978,'[1]Tarif de base'!D:E,2,FALSE)*F1978,\"\")","v":""},"","","",{"$f":"IFERROR(IF(G1984-H1978-I1978-J1978<>0,\"Attention il manque \"&G1984-H1978-I1978-J1978&\"€\",\"Règlement OK\"),\"Pas de règlement\")","v":"Pas de règlement"},"",null,282]
[null,"",null,null,{"$f":"IFERROR(INDIRECT(\"'C:\\Users\\Moi\\OneDrive\\Documents\\[Formulaires Gravereau.xlsx]Action\"&$N1978&\"'!$D$11\"),\"\")","v":""},{"$f":"IFERROR(INDIRECT(\"'C:\\Users\\Moi\\OneDrive\\Documents\\[Formulaires Gravereau.xlsx]Action\"&$N1978&\"'!$h$11\"),\"\")","v":""},{"$f":"IFERROR(VLOOKUP(E1979,'[1]Tarif de base'!D:E,2,FALSE)*F1979,\"\")","v":""}]
[null,"",null,null,"","",{"$f":"IFERROR(VLOOKUP(E1980,'[1]Tarif de base'!D:E,2,FALSE)*F1980,\"\")","v":""}]
[null,"",null,null,"","",{"$f":"IFERROR(VLOOKUP(E1981,'[1]Tarif de base'!D:E,2,FALSE)*F1981,\"\")","v":""}]
[null,"",null,null,"","",{"$f":"IFERROR(VLOOKUP(E1982,'[1]Tarif de base'!D:E,2,FALSE)*F1982,\"\")","v":""}]
[null,"",null,null,"","",{"$f":"IFERROR(VLOOKUP(E1983,'[1]Tarif de base'!D:E,2,FALSE)*F1983,\"\")","v":""}]
[null,"",null,null,"Total",{"$f":"SUM(F1978:F1983)","v":0},{"$f":"SUM(G1978:G1983)","v":0}]
["","","","","","",{"$f":"IFERROR(VLOOKUP(E1985,'[1]Tarif de base'!D:E,2,FALSE)*F1985,\"\")","v":""},"","","",{"$f":"IFERROR(IF(G1991-H1985-I1985-J1985<>0,\"Attention il manque \"&G1991-H1985-I1985-J1985&\"€\",\"Règlement OK\"),\"Pas de règlement\")","v":"Pas de règlement"},"",null,283]
[null,"",null,null,{"$f":"IFERROR(INDIRECT(\"'C:\\Users\\Moi\\OneDrive\\Documents\\[Formulaires Gravereau.xlsx]Action\"&$N1985&\"'!$D$11\"),\"\")","v":""},{"$f":"IFERROR(INDIRECT(\"'C:\\Users\\Moi\\OneDrive\\Documents\\[Formulaires Gravereau.xlsx]Action\"&$N1985&\"'!$h$11\"),\"\")","v":""},{"$f":"IFERROR(VLOOKUP(E1986,'[1]Tarif de base'!D:E,2,FALSE)*F1986,\"\")","v":""}]
[null,"",null,null,"","",{"$f":"IFERROR(VLOOKUP(E1987,'[1]Tarif de base'!D:E,2,FALSE)*F1987,\"\")","v":""}]
[null,"",null,null,"","",{"$f":"IFERROR(VLOOKUP(E1988,'[1]Tarif de base'!D:E,2,FALSE)*F1988,\"\")","v":""}]
[null,"",null,null,"","",{"$f":"IFERROR(VLOOKUP(E1989,'[1]Tarif de base'!D:E,2,FALSE)*F1989,\"\")","v":""}]
[null,"",null,null,"","",{"$f":"IFERROR(VLOOKUP(E1990,'[1]Tarif de base'!D:E,2,FALSE)*F1990,\"\")","v":""}]
[null,"",null,null,"Total",{"$f":"SUM(F1985:F1990)","v":0},{"$f":"SUM(G1985:G1990)","v":0}]
[{"$f":"IFERROR(INDIRECT(\"'C:\\Users\\Moi\\OneDrive\\Documents\\[Formulaires Gravereau.xlsx]Action\"&$N1992&\"'!$D$6\"),\"\")","v":""},{"$f":"IF(C1992<>\"\",C1992,\"\")","v":""},{"$f":"IFERROR(INDIRECT(\"'C:\\Users\\Moi\\OneDrive\\Documents\\[Formulaires Gravereau.xlsx]Action\"&$N1992&\"'!$D$4\"),\"\")","v":""},{"$f":"IFERROR(INDIRECT(\"'C:\\Users\\Moi\\OneDrive\\Documents\\[Formulaires Gravereau.xlsx]Action\"&$N1992&\"'!$h$4\"),\"\")","v":""},{"$f":"IFERROR(INDIRECT(\"'C:\\Users\\Moi\\OneDrive\\Documents\\[Formulaires Gravereau.xlsx]Action\"&$N1992&\"'!$D$9\"),\"\")","v":""},{"$f":"IFERROR(INDIRECT(\"'C:\\Users\\Moi\\OneDrive\\Documents\\[Formulaires Gravereau.xlsx]Action\"&$N1992&\"'!$h$9\"),\"\")","v":""},{"$f":"IFERROR(VLOOKUP(E1992,'[1]Tarif de base'!D:E,2,FALSE)*F1992,\"\")","v":""},{"$f":"IFERROR(INDIRECT(\"'C:\\Users\\Moi\\OneDrive\\Documents\\[Formulaires Gravereau.xlsx]Action\"&$N1992&\"'!$d$26\"),\"\")","v":""},{"$f":"IFERROR(INDIRECT(\"'C:\\Users\\Moi\\OneDrive\\Documents\\[Formulaires Gravereau.xlsx]Action\"&$N1992&\"'!$d$28\"),\"\")","v":""},{"$f":"IFERROR(INDIRECT(\"'C:\\Users\\Moi\\OneDrive\\Documents\\[Formulaires Gravereau.xlsx]Action\"&$N1992&\"'!$h$26\"),\"\")","v":""},{"$f":"IFERROR(IF(G1998-H1992-I1992-J1992<>0,\"Attention il manque \"&G1998-H1992-I1992-J1992&\"€\",\"Règlement OK\"),\"Pas de règlement\")","v":"Pas de règlement"},{"$f":"IFERROR(INDIRECT(\"'C:\\Users\\Moi\\OneDrive\\Documents\\[Formulaires Gravereau.xlsx]Action\"&$N1992&\"'!$d$30\"),\"\")","v":""},null,284]
[null,"",null,null,{"$f":"IFERROR(INDIRECT(\"'C:\\Users\\Moi\\OneDrive\\Documents\\[Formulaires Gravereau.xlsx]Action\"&$N1992&\"'!$D$11\"),\"\")","v":""},{"$f":"IFERROR(INDIRECT(\"'C:\\Users\\Moi\\OneDrive\\Documents\\[Formulaires Gravereau.xlsx]Action\"&$N1992&\"'!$h$11\"),\"\")","v":""},{"$f":"IFERROR(VLOOKUP(E1993,'[1]Tarif de base'!D:E,2,FALSE)*F1993,\"\")","v":""}]
[null,"",null,null,{"$f":"IFERROR(INDIRECT(\"'C:\\Users\\Moi\\OneDrive\\Documents\\[Formulaires Gravereau.xlsx]Action\"&$N1992&\"'!$D$13\"),\"\")","v":""},{"$f":"IFERROR(INDIRECT(\"'C:\\Users\\Moi\\OneDrive\\Documents\\[Formulaires Gravereau.xlsx]Action\"&$N1992&\"'!$h$13\"),\"\")","v":""},{"$f":"IFERROR(VLOOKUP(E1994,'[1]Tarif de base'!D:E,2,FALSE)*F1994,\"\")","v":""}]
[null,"",null,null,{"$f":"IFERROR(INDIRECT(\"'C:\\Users\\Moi\\OneDrive\\Documents\\[Formulaires Gravereau.xlsx]Action\"&$N1992&\"'!$D$15\"),\"\")","v":""},{"$f":"IFERROR(INDIRECT(\"'C:\\Users\\Moi\\OneDrive\\Documents\\[Formulaires Gravereau.xlsx]Action\"&$N1992&\"'!$h$15\"),\"\")","v":""},{"$f":"IFERROR(VLOOKUP(E1995,'[1]Tarif de base'!D:E,2,FALSE)*F1995,\"\")","v":""}]
[null,"",null,null,{"$f":"IFERROR(INDIRECT(\"'C:\\Users\\Moi\\OneDrive\\Documents\\[Formulaires Gravereau.xlsx]Action\"&$N1992&\"'!$D$17\"),\"\")","v":""},{"$f":"IFERROR(INDIRECT(\"'C:\\Users\\Moi\\OneDrive\\Documents\\[Formulaires Gravereau.xlsx]Action\"&$N1992&\"'!$h$17\"),\"\")","v":""},{"$f":"IFERROR(VLOOKUP(E1996,'[1]Tarif de base'!D:E,2,FALSE)*F1996,\"\")","v":""}]
[null,"",null,null,{"$f":"IFERROR(INDIRECT(\"'C:\\Users\\Moi\\OneDrive\\Documents\\[Formulaires Gravereau.xlsx]Action\"&$N1992&\"'!$D$19\"),\"\")","v":""},{"$f":"IFERROR(INDIRECT(\"'C:\\Users\\Moi\\OneDrive\\Documents\\[Formulaires Gravereau.xlsx]Action\"&$N1992&\"'!$h$19\"),\"\")","v":""},{"$f":"IFERROR(VLOOKUP(E1997,'[1]Tarif de base'!D:E,2,FALSE)*F1997,\"\")","v":""}]
[null,"",null,null,"Total",{"$f":"SUM(F1992:F1997)","v":0},{"$f":"SUM(G1992:G1997)","v":0}]
["","","","","","",{"$f":"IFERROR(VLOOKUP(E1999,'[1]Tarif de base'!D:E,2,FALSE)*F1999,\"\")","v":""},"","","",{"$f":"IFERROR(IF(G2005-H1999-I1999-J1999<>0,\"Attention il manque \"&G2005-H1999-I1999-J1999&\"€\",\"Règlement OK\"),\"Pas de règlement\")","v":"Pas de règlement"},"",null,285]
[null,"",null,null,{"$f":"IFERROR(INDIRECT(\"'C:\\Users\\Moi\\OneDrive\\Documents\\[Formulaires Gravereau.xlsx]Action\"&$N1999&\"'!$D$11\"),\"\")","v":""},{"$f":"IFERROR(INDIRECT(\"'C:\\Users\\Moi\\OneDrive\\Documents\\[Formulaires Gravereau.xlsx]Action\"&$N1999&\"'!$h$11\"),\"\")","v":""},{"$f":"IFERROR(VLOOKUP(E2000,'[1]Tarif de base'!D:E,2,FALSE)*F2000,\"\")","v":""}]
[null,"",null,null,"","",{"$f":"IFERROR(VLOOKUP(E2001,'[1]Tarif de base'!D:E,2,FALSE)*F2001,\"\")","v":""}]
[null,"",null,null,"","",{"$f":"IFERROR(VLOOKUP(E2002,'[1]Tarif de base'!D:E,2,FALSE)*F2002,\"\")","v":""}]
[null,"",null,null,"","",{"$f":"IFERROR(VLOOKUP(E2003,'[1]Tarif de base'!D:E,2,FALSE)*F2003,\"\")","v":""}]
[null,"",null,null,"","",{"$f":"IFERROR(VLOOKUP(E2004,'[1]Tarif de base'!D:E,2,FALSE)*F2004,\"\")","v":""}]
[null,"",null,null,"Total",{"$f":"SUM(F1999:F2004)","v":0},{"$f":"SUM(G1999:G2004)","v":0}]
["","","","","","",{"$f":"IFERROR(VLOOKUP(E2006,'[1]Tarif de base'!D:E,2,FALSE)*F2006,\"\")","v":""},"","","",{"$f":"IFERROR(IF(G2012-H2006-I2006-J2006<>0,\"Attention il manque \"&G2012-H2006-I2006-J2006&\"€\",\"Règlement OK\"),\"Pas de règlement\")","v":"Pas de règlement"},"",null,286]
[null,{"$f":"B2006","v":""},null,null,{"$f":"IFERROR(INDIRECT(\"'C:\\Users\\Moi\\OneDrive\\Documents\\[Formulaires Gravereau.xlsx]Action\"&$N2006&\"'!$D$11\"),\"\")","v":""},{"$f":"IFERROR(INDIRECT(\"'C:\\Users\\Moi\\OneDrive\\Documents\\[Formulaires Gravereau.xlsx]Action\"&$N2006&\"'!$h$11\"),\"\")","v":""},{"$f":"IFERROR(VLOOKUP(E2007,'[1]Tarif de base'!D:E,2,FALSE)*F2007,\"\")","v":""}]
[null,"",null,null,"","",{"$f":"IFERROR(VLOOKUP(E2008,'[1]Tarif de base'!D:E,2,FALSE)*F2008,\"\")","v":""}]
[null,"",null,null,"","",{"$f":"IFERROR(VLOOKUP(E2009,'[1]Tarif de base'!D:E,2,FALSE)*F2009,\"\")","v":""}]
[null,"",null,null,"","",{"$f":"IFERROR(VLOOKUP(E2010,'[1]Tarif de base'!D:E,2,FALSE)*F2010,\"\")","v":""}]
[null,"",null,null,"","",{"$f":"IFERROR(VLOOKUP(E2011,'[1]Tarif de base'!D:E,2,FALSE)*F2011,\"\")","v":""}]
[null,"",null,null,"Total",{"$f":"SUM(F2006:F2011)","v":0},{"$f":"SUM(G2006:G2011)","v":0}]
["","","","","","",{"$f":"IFERROR(VLOOKUP(E2013,'[1]Tarif de base'!D:E,2,FALSE)*F2013,\"\")","v":""},"","","",{"$f":"IFERROR(IF(G2019-H2013-I2013-J2013<>0,\"Attention il manque \"&G2019-H2013-I2013-J2013&\"€\",\"Règlement OK\"),\"Pas de règlement\")","v":"Pas de règlement"},"",null,287]
[null,"",null,null,{"$f":"IFERROR(INDIRECT(\"'C:\\Users\\Moi\\OneDrive\\Documents\\[Formulaires Gravereau.xlsx]Action\"&$N2013&\"'!$D$11\"),\"\")","v":""},{"$f":"IFERROR(INDIRECT(\"'C:\\Users\\Moi\\OneDrive\\Documents\\[Formulaires Gravereau.xlsx]Action\"&$N2013&\"'!$h$11\"),\"\")","v":""},{"$f":"IFERROR(VLOOKUP(E2014,'[1]Tarif de base'!D:E,2,FALSE)*F2014,\"\")","v":""}]
[null,"",null,null,"","",{"$f":"IFERROR(VLOOKUP(E2015,'[1]Tarif de base'!D:E,2,FALSE)*F2015,\"\")","v":""}]
[null,"",null,null,"","",{"$f":"IFERROR(VLOOKUP(E2016,'[1]Tarif de base'!D:E,2,FALSE)*F2016,\"\")","v":""}]
[null,"",null,null,"","",{"$f":"IFERROR(VLOOKUP(E2017,'[1]Tarif de base'!D:E,2,FALSE)*F2017,\"\")","v":""}]
[null,"",null,null,"","",{"$f":"IFERROR(VLOOKUP(E2018,'[1]Tarif de base'!D:E,2,FALSE)*F2018,\"\")","v":""}]
[null,"",null,null,"Total",{"$f":"SUM(F2013:F2018)","v":0},{"$f":"SUM(G2013:G2018)","v":0}]
["","","","","","",{"$f":"IFERROR(VLOOKUP(E2020,'[1]Tarif de base'!D:E,2,FALSE)*F2020,\"\")","v":""},"","","",{"$f":"IFERROR(IF(G2026-H2020-I2020-J2020<>0,\"Attention il manque \"&G2026-H2020-I2020-J2020&\"€\",\"Règlement OK\"),\"Pas de règlement\")","v":"Pas de règlement"},"",null,288]
[null,"",null,null,{"$f":"IFERROR(INDIRECT(\"'C:\\Users\\Moi\\OneDrive\\Documents\\[Formulaires Gravereau.xlsx]Action\"&$N2020&\"'!$D$11\"),\"\")","v":""},{"$f":"IFERROR(INDIRECT(\"'C:\\Users\\Moi\\OneDrive\\Documents\\[Formulaires Gravereau.xlsx]Action\"&$N2020&\"'!$h$11\"),\"\")","v":""},{"$f":"IFERROR(VLOOKUP(E2021,'[1]Tarif de base'!D:E,2,FALSE)*F2021,\"\")","v":""}]
[null,"",null,null,"","",{"$f":"IFERROR(VLOOKUP(E2022,'[1]Tarif de base'!D:E,2,FALSE)*F2022,\"\")","v":""}]
[null,"",null,null,"","",{"$f":"IFERROR(VLOOKUP(E2023,'[1]Tarif de base'!D:E,2,FALSE)*F2023,\"\")","v":""}]
[null,"",null,null,"","",{"$f":"IFERROR(VLOOKUP(E2024,'[1]Tarif de base'!D:E,2,FALSE)*F2024,\"\")","v":""}]
[null,"",null,null,"","",{"$f":"IFERROR(VLOOKUP(E2025,'[1]Tarif de base'!D:E,2,FALSE)*F2025,\"\")","v":""}]
[null,"",null,null,"Total",{"$f":"SUM(F2020:F2025)","v":0},{"$f":"SUM(G2020:G2025)","v":0}]
["","","","","","",{"$f":"IFERROR(VLOOKUP(E2027,'[1]Tarif de base'!D:E,2,FALSE)*F2027,\"\")","v":""},"","","",{"$f":"IFERROR(IF(G2033-H2027-I2027-J2027<>0,\"Attention il manque \"&G2033-H2027-I2027-J2027&\"€\",\"Règlement OK\"),\"Pas de règlement\")","v":"Pas de règlement"},"",null,289]
[null,"",null,null,{"$f":"IFERROR(INDIRECT(\"'C:\\Users\\Moi\\OneDrive\\Documents\\[Formulaires Gravereau.xlsx]Action\"&$N2027&\"'!$D$11\"),\"\")","v":""},{"$f":"IFERROR(INDIRECT(\"'C:\\Users\\Moi\\OneDrive\\Documents\\[Formulaires Gravereau.xlsx]Action\"&$N2027&\"'!$h$11\"),\"\")","v":""},{"$f":"IFERROR(VLOOKUP(E2028,'[1]Tarif de base'!D:E,2,FALSE)*F2028,\"\")","v":""}]
[null,"",null,null,"","",{"$f":"IFERROR(VLOOKUP(E2029,'[1]Tarif de base'!D:E,2,FALSE)*F2029,\"\")","v":""}]
[null,"",null,null,"","",{"$f":"IFERROR(VLOOKUP(E2030,'[1]Tarif de base'!D:E,2,FALSE)*F2030,\"\")","v":""}]
[null,"",null,null,"","",{"$f":"IFERROR(VLOOKUP(E2031,'[1]Tarif de base'!D:E,2,FALSE)*F2031,\"\")","v":""}]
[null,"",null,null,"","",{"$f":"IFERROR(VLOOKUP(E2032,'[1]Tarif de base'!D:E,2,FALSE)*F2032,\"\")","v":""}]
[null,"",null,null,"Total",{"$f":"SUM(F2027:F2032)","v":0},{"$f":"SUM(G2027:G2032)","v":0}]
["","","","","","",{"$f":"IFERROR(VLOOKUP(E2034,'[1]Tarif de base'!D:E,2,FALSE)*F2034,\"\")","v":""},"","","",{"$f":"IFERROR(IF(G2040-H2034-I2034-J2034<>0,\"Attention il manque \"&G2040-H2034-I2034-J2034&\"€\",\"Règlement OK\"),\"Pas de règlement\")","v":"Pas de règlement"},"",null,290]
[null,"",null,null,{"$f":"IFERROR(INDIRECT(\"'C:\\Users\\Moi\\OneDrive\\Documents\\[Formulaires Gravereau.xlsx]Action\"&$N2034&\"'!$D$11\"),\"\")","v":""},{"$f":"IFERROR(INDIRECT(\"'C:\\Users\\Moi\\OneDrive\\Documents\\[Formulaires Gravereau.xlsx]Action\"&$N2034&\"'!$h$11\"),\"\")","v":""},{"$f":"IFERROR(VLOOKUP(E2035,'[1]Tarif de base'!D:E,2,FALSE)*F2035,\"\")","v":""}]
[null,"",null,null,"","",{"$f":"IFERROR(VLOOKUP(E2036,'[1]Tarif de base'!D:E,2,FALSE)*F2036,\"\")","v":""}]
[null,"",null,null,"","",{"$f":"IFERROR(VLOOKUP(E2037,'[1]Tarif de base'!D:E,2,FALSE)*F2037,\"\")","v":""}]
[null,"",null,null,"","",{"$f":"IFERROR(VLOOKUP(E2038,'[1]Tarif de base'!D:E,2,FALSE)*F2038,\"\")","v":""}]
[null,"",null,null,"","",{"$f":"IFERROR(VLOOKUP(E2039,'[1]Tarif de base'!D:E,2,FALSE)*F2039,\"\")","v":""}]
[null,"",null,null,"Total",{"$f":"SUM(F2034:F2039)","v":0},{"$f":"SUM(G2034:G2039)","v":0}]
["","","","","","",{"$f":"IFERROR(VLOOKUP(E2041,'[1]Tarif de base'!D:E,2,FALSE)*F2041,\"\")","v":""},"","","",{"$f":"IFERROR(IF(G2047-H2041-I2041-J2041<>0,\"Attention il manque \"&G2047-H2041-I2041-J2041&\"€\",\"Règlement OK\"),\"Pas de règlement\")","v":"Pas de règlement"},"",null,291]
[null,"",null,null,{"$f":"IFERROR(INDIRECT(\"'C:\\Users\\Moi\\OneDrive\\Documents\\[Formulaires Gravereau.xlsx]Action\"&$N2041&\"'!$D$11\"),\"\")","v":""},{"$f":"IFERROR(INDIRECT(\"'C:\\Users\\Moi\\OneDrive\\Documents\\[Formulaires Gravereau.xlsx]Action\"&$N2041&\"'!$h$11\"),\"\")","v":""},{"$f":"IFERROR(VLOOKUP(E2042,'[1]Tarif de base'!D:E,2,FALSE)*F2042,\"\")","v":""}]
[null,"",null,null,"","",{"$f":"IFERROR(VLOOKUP(E2043,'[1]Tarif de base'!D:E,2,FALSE)*F2043,\"\")","v":""}]
[null,"",null,null,"","",{"$f":"IFERROR(VLOOKUP(E2044,'[1]Tarif de base'!D:E,2,FALSE)*F2044,\"\")","v":""}]
[null,"",null,null,"","",{"$f":"IFERROR(VLOOKUP(E2045,'[1]Tarif de base'!D:E,2,FALSE)*F2045,\"\")","v":""}]
[null,"",null,null,"","",{"$f":"IFERROR(VLOOKUP(E2046,'[1]Tarif de base'!D:E,2,FALSE)*F2046,\"\")","v":""}]
[null,"",null,null,"Total",{"$f":"SUM(F2041:F2046)","v":0},{"$f":"SUM(G2041:G2046)","v":0}]
["","","","","","",{"$f":"IFERROR(VLOOKUP(E2048,'[1]Tarif de base'!D:E,2,FALSE)*F2048,\"\")","v":""},"","","",{"$f":"IFERROR(IF(G2054-H2048-I2048-J2048<>0,\"Attention il manque \"&G2054-H2048-I2048-J2048&\"€\",\"Règlement OK\"),\"Pas de règlement\")","v":"Pas de règlement"},"",null,292]
[null,"",null,null,{"$f":"IFERROR(INDIRECT(\"'C:\\Users\\Moi\\OneDrive\\Documents\\[Formulaires Gravereau.xlsx]Action\"&$N2048&\"'!$D$11\"),\"\")","v":""},{"$f":"IFERROR(INDIRECT(\"'C:\\Users\\Moi\\OneDrive\\Documents\\[Formulaires Gravereau.xlsx]Action\"&$N2048&\"'!$h$11\"),\"\")","v":""},{"$f":"IFERROR(VLOOKUP(E2049,'[1]Tarif de base'!D:E,2,FALSE)*F2049,\"\")","v":""}]
[null,"",null,null,"","",{"$f":"IFERROR(VLOOKUP(E2050,'[1]Tarif de base'!D:E,2,FALSE)*F2050,\"\")","v":""}]
[null,"",null,null,"","",{"$f":"IFERROR(VLOOKUP(E2051,'[1]Tarif de base'!D:E,2,FALSE)*F2051,\"\")","v":""}]
[null,"",null,null,"","",{"$f":"IFERROR(VLOOKUP(E2052,'[1]Tarif de base'!D:E,2,FALSE)*F2052,\"\")","v":""}]
[null,"",null,null,"","",{"$f":"IFERROR(VLOOKUP(E2053,'[1]Tarif de base'!D:E,2,FALSE)*F2053,\"\")","v":""}]
[null,"",null,null,"Total",{"$f":"SUM(F2048:F2053)","v":0},{"$f":"SUM(G2048:G2053)","v":0}]
["","","","","","",{"$f":"IFERROR(VLOOKUP(E2055,'[1]Tarif de base'!D:E,2,FALSE)*F2055,\"\")","v":""},"","","",{"$f":"IFERROR(IF(G2061-H2055-I2055-J2055<>0,\"Attention il manque \"&G2061-H2055-I2055-J2055&\"€\",\"Règlement OK\"),\"Pas de règlement\")","v":"Pas de règlement"},"",null,293]
[null,"",null,null,{"$f":"IFERROR(INDIRECT(\"'C:\\Users\\Moi\\OneDrive\\Documents\\[Formulaires Gravereau.xlsx]Action\"&$N2055&\"'!$D$11\"),\"\")","v":""},{"$f":"IFERROR(INDIRECT(\"'C:\\Users\\Moi\\OneDrive\\Documents\\[Formulaires Gravereau.xlsx]Action\"&$N2055&\"'!$h$11\"),\"\")","v":""},{"$f":"IFERROR(VLOOKUP(E2056,'[1]Tarif de base'!D:E,2,FALSE)*F2056,\"\")","v":""}]
[null,"",null,null,"","",{"$f":"IFERROR(VLOOKUP(E2057,'[1]Tarif de base'!D:E,2,FALSE)*F2057,\"\")","v":""}]
[null,"",null,null,"","",{"$f":"IFERROR(VLOOKUP(E2058,'[1]Tarif de base'!D:E,2,FALSE)*F2058,\"\")","v":""}]
[null,"",null,null,"","",{"$f":"IFERROR(VLOOKUP(E2059,'[1]Tarif de base'!D:E,2,FALSE)*F2059,\"\")","v":""}]
[null,"",null,null,"","",{"$f":"IFERROR(VLOOKUP(E2060,'[1]Tarif de base'!D:E,2,FALSE)*F2060,\"\")","v":""}]
[null,"",null,null,"Total",{"$f":"SUM(F2055:F2060)","v":0},{"$f":"SUM(G2055:G2060)","v":0}]
[{"$f":"IFERROR(INDIRECT(\"'C:\\Users\\Moi\\OneDrive\\Documents\\[Formulaires Gravereau.xlsx]Action\"&$N2062&\"'!$D$6\"),\"\")","v":""},{"$f":"IF(C2062<>\"\",C2062,\"\")","v":""},{"$f":"IFERROR(INDIRECT(\"'C:\\Users\\Moi\\OneDrive\\Documents\\[Formulaires Gravereau.xlsx]Action\"&$N2062&\"'!$D$4\"),\"\")","v":""},{"$f":"IFERROR(INDIRECT(\"'C:\\Users\\Moi\\OneDrive\\Documents\\[Formulaires Gravereau.xlsx]Action\"&$N2062&\"'!$h$4\"),\"\")","v":""},{"$f":"IFERROR(INDIRECT(\"'C:\\Users\\Moi\\OneDrive\\Documents\\[Formulaires Gravereau.xlsx]Action\"&$N2062&\"'!$D$9\"),\"\")","v":""},{"$f":"IFERROR(INDIRECT(\"'C:\\Users\\Moi\\OneDrive\\Documents\\[Formulaires Gravereau.xlsx]Action\"&$N2062&\"'!$h$9\"),\"\")","v":""},{"$f":"IFERROR(VLOOKUP(E2062,'[1]Tarif de base'!D:E,2,FALSE)*F2062,\"\")","v":""},{"$f":"IFERROR(INDIRECT(\"'C:\\Users\\Moi\\OneDrive\\Documents\\[Formulaires Gravereau.xlsx]Action\"&$N2062&\"'!$d$26\"),\"\")","v":""},{"$f":"IFERROR(INDIRECT(\"'C:\\Users\\Moi\\OneDrive\\Documents\\[Formulaires Gravereau.xlsx]Action\"&$N2062&\"'!$d$28\"),\"\")","v":""},{"$f":"IFERROR(INDIRECT(\"'C:\\Users\\Moi\\OneDrive\\Documents\\[Formulaires Gravereau.xlsx]Action\"&$N2062&\"'!$h$26\"),\"\")","v":""},{"$f":"IFERROR(IF(G2068-H2062-I2062-J2062<>0,\"Attention il manque \"&G2068-H2062-I2062-J2062&\"€\",\"Règlement OK\"),\"Pas de règlement\")","v":"Pas de règlement"},{"$f":"IFERROR(INDIRECT(\"'C:\\Users\\Moi\\OneDrive\\Documents\\[Formulaires Gravereau.xlsx]Action\"&$N2062&\"'!$d$30\"),\"\")","v":""},null,294]
[null,"",null,null,{"$f":"IFERROR(INDIRECT(\"'C:\\Users\\Moi\\OneDrive\\Documents\\[Formulaires Gravereau.xlsx]Action\"&$N2062&\"'!$D$11\"),\"\")","v":""},{"$f":"IFERROR(INDIRECT(\"'C:\\Users\\Moi\\OneDrive\\Documents\\[Formulaires Gravereau.xlsx]Action\"&$N2062&\"'!$h$11\"),\"\")","v":""},{"$f":"IFERROR(VLOOKUP(E2063,'[1]Tarif de base'!D:E,2,FALSE)*F2063,\"\")","v":""}]
[null,"",null,null,{"$f":"IFERROR(INDIRECT(\"'C:\\Users\\Moi\\OneDrive\\Documents\\[Formulaires Gravereau.xlsx]Action\"&$N2062&\"'!$D$13\"),\"\")","v":""},{"$f":"IFERROR(INDIRECT(\"'C:\\Users\\Moi\\OneDrive\\Documents\\[Formulaires Gravereau.xlsx]Action\"&$N2062&\"'!$h$13\"),\"\")","v":""},{"$f":"IFERROR(VLOOKUP(E2064,'[1]Tarif de base'!D:E,2,FALSE)*F2064,\"\")","v":""}]
[null,"",null,null,{"$f":"IFERROR(INDIRECT(\"'C:\\Users\\Moi\\OneDrive\\Documents\\[Formulaires Gravereau.xlsx]Action\"&$N2062&\"'!$D$15\"),\"\")","v":""},{"$f":"IFERROR(INDIRECT(\"'C:\\Users\\Moi\\OneDrive\\Documents\\[Formulaires Gravereau.xlsx]Action\"&$N2062&\"'!$h$15\"),\"\")","v":""},{"$f":"IFERROR(VLOOKUP(E2065,'[1]Tarif de base'!D:E,2,FALSE)*F2065,\"\")","v":""}]
[null,"",null,null,{"$f":"IFERROR(INDIRECT(\"'C:\\Users\\Moi\\OneDrive\\Documents\\[Formulaires Gravereau.xlsx]Action\"&$N2062&\"'!$D$17\"),\"\")","v":""},{"$f":"IFERROR(INDIRECT(\"'C:\\Users\\Moi\\OneDrive\\Documents\\[Formulaires Gravereau.xlsx]Action\"&$N2062&\"'!$h$17\"),\"\")","v":""},{"$f":"IFERROR(VLOOKUP(E2066,'[1]Tarif de base'!D:E,2,FALSE)*F2066,\"\")","v":""}]
[null,"",null,null,{"$f":"IFERROR(INDIRECT(\"'C:\\Users\\Moi\\OneDrive\\Documents\\[Formulaires Gravereau.xlsx]Action\"&$N2062&\"'!$D$19\"),\"\")","v":""},{"$f":"IFERROR(INDIRECT(\"'C:\\Users\\Moi\\OneDrive\\Documents\\[Formulaires Gravereau.xlsx]Action\"&$N2062&\"'!$h$19\"),\"\")","v":""},{"$f":"IFERROR(VLOOKUP(E2067,'[1]Tarif de base'!D:E,2,FALSE)*F2067,\"\")","v":""}]
[null,"",null,null,"Total",{"$f":"SUM(F2062:F2067)","v":0},{"$f":"SUM(G2062:G2067)","v":0}]
["","","","","","",{"$f":"IFERROR(VLOOKUP(E2069,'[1]Tarif de base'!D:E,2,FALSE)*F2069,\"\")","v":""},"","","",{"$f":"IFERROR(IF(G2075-H2069-I2069-J2069<>0,\"Attention il manque \"&G2075-H2069-I2069-J2069&\"€\",\"Règlement OK\"),\"Pas de règlement\")","v":"Pas de règlement"},"",null,295]
[null,"",null,null,{"$f":"IFERROR(INDIRECT(\"'C:\\Users\\Moi\\OneDrive\\Documents\\[Formulaires Gravereau.xlsx]Action\"&$N2069&\"'!$D$11\"),\"\")","v":""},{"$f":"IFERROR(INDIRECT(\"'C:\\Users\\Moi\\OneDrive\\Documents\\[Formulaires Gravereau.xlsx]Action\"&$N2069&\"'!$h$11\"),\"\")","v":""},{"$f":"IFERROR(VLOOKUP(E2070,'[1]Tarif de base'!D:E,2,FALSE)*F2070,\"\")","v":""}]
[null,{"$f":"B2070","v":""},null,null,"","",{"$f":"IFERROR(VLOOKUP(E2071,'[1]Tarif de base'!D:E,2,FALSE)*F2071,\"\")","v":""}]
[null,"",null,null,"","",{"$f":"IFERROR(VLOOKUP(E2072,'[1]Tarif de base'!D:E,2,FALSE)*F2072,\"\")","v":""}]
[null,"",null,null,"","",{"$f":"IFERROR(VLOOKUP(E2073,'[1]Tarif de base'!D:E,2,FALSE)*F2073,\"\")","v":""}]
[null,"",null,null,"","",{"$f":"IFERROR(VLOOKUP(E2074,'[1]Tarif de base'!D:E,2,FALSE)*F2074,\"\")","v":""}]
[null,"",null,null,"Total",{"$f":"SUM(F2069:F2074)","v":0},{"$f":"SUM(G2069:G2074)","v":0}]
["","","","","","",{"$f":"IFERROR(VLOOKUP(E2076,'[1]Tarif de base'!D:E,2,FALSE)*F2076,\"\")","v":""},"","","",{"$f":"IFERROR(IF(G2082-H2076-I2076-J2076<>0,\"Attention il manque \"&G2082-H2076-I2076-J2076&\"€\",\"Règlement OK\"),\"Pas de règlement\")","v":"Pas de règlement"},"",null,296]
[null,"",null,null,{"$f":"IFERROR(INDIRECT(\"'C:\\Users\\Moi\\OneDrive\\Documents\\[Formulaires Gravereau.xlsx]Action\"&$N2076&\"'!$D$11\"),\"\")","v":""},{"$f":"IFERROR(INDIRECT(\"'C:\\Users\\Moi\\OneDrive\\Documents\\[Formulaires Gravereau.xlsx]Action\"&$N2076&\"'!$h$11\"),\"\")","v":""},{"$f":"IFERROR(VLOOKUP(E2077,'[1]Tarif de base'!D:E,2,FALSE)*F2077,\"\")","v":""}]
[null,"",null,null,"","",{"$f":"IFERROR(VLOOKUP(E2078,'[1]Tarif de base'!D:E,2,FALSE)*F2078,\"\")","v":""}]
[null,"",null,null,"","",{"$f":"IFERROR(VLOOKUP(E2079,'[1]Tarif de base'!D:E,2,FALSE)*F2079,\"\")","v":""}]
[null,"",null,null,"","",{"$f":"IFERROR(VLOOKUP(E2080,'[1]Tarif de base'!D:E,2,FALSE)*F2080,\"\")","v":""}]
[null,"",null,null,"","",{"$f":"IFERROR(VLOOKUP(E2081,'[1]Tarif de base'!D:E,2,FALSE)*F2081,\"\")","v":""}]
[null,"",null,null,"Total",{"$f":"SUM(F2076:F2081)","v":0},{"$f":"SUM(G2076:G2081)","v":0}]
["","","","","","",{"$f":"IFERROR(VLOOKUP(E2083,'[1]Tarif de base'!D:E,2,FALSE)*F2083,\"\")","v":""},"","","",{"$f":"IFERROR(IF(G2089-H2083-I2083-J2083<>0,\"Attention il manque \"&G2089-H2083-I2083-J2083&\"€\",\"Règlement OK\"),\"Pas de règlement\")","v":"Pas de règlement"},"",null,297]
[null,"",null,null,{"$f":"IFERROR(INDIRECT(\"'C:\\Users\\Moi\\OneDrive\\Documents\\[Formulaires Gravereau.xlsx]Action\"&$N2083&\"'!$D$11\"),\"\")","v":""},{"$f":"IFERROR(INDIRECT(\"'C:\\Users\\Moi\\OneDrive\\Documents\\[Formulaires Gravereau.xlsx]Action\"&$N2083&\"'!$h$11\"),\"\")","v":""},{"$f":"IFERROR(VLOOKUP(E2084,'[1]Tarif de base'!D:E,2,FALSE)*F2084,\"\")","v":""}]
[null,"",null,null,"","",{"$f":"IFERROR(VLOOKUP(E2085,'[1]Tarif de base'!D:E,2,FALSE)*F2085,\"\")","v":""}]
[null,"",null,null,"","",{"$f":"IFERROR(VLOOKUP(E2086,'[1]Tarif de base'!D:E,2,FALSE)*F2086,\"\")","v":""}]
[null,"",null,null,"","",{"$f":"IFERROR(VLOOKUP(E2087,'[1]Tarif de base'!D:E,2,FALSE)*F2087,\"\")","v":""}]
[null,"",null,null,"","",{"$f":"IFERROR(VLOOKUP(E2088,'[1]Tarif de base'!D:E,2,FALSE)*F2088,\"\")","v":""}]
[null,"",null,null,"Total",{"$f":"SUM(F2083:F2088)","v":0},{"$f":"SUM(G2083:G2088)","v":0}]
["","","","","","",{"$f":"IFERROR(VLOOKUP(E2090,'[1]Tarif de base'!D:E,2,FALSE)*F2090,\"\")","v":""},"","","",{"$f":"IFERROR(IF(G2096-H2090-I2090-J2090<>0,\"Attention il manque \"&G2096-H2090-I2090-J2090&\"€\",\"Règlement OK\"),\"Pas de règlement\")","v":"Pas de règlement"},"",null,298]
[null,"",null,null,{"$f":"IFERROR(INDIRECT(\"'C:\\Users\\Moi\\OneDrive\\Documents\\[Formulaires Gravereau.xlsx]Action\"&$N2090&\"'!$D$11\"),\"\")","v":""},{"$f":"IFERROR(INDIRECT(\"'C:\\Users\\Moi\\OneDrive\\Documents\\[Formulaires Gravereau.xlsx]Action\"&$N2090&\"'!$h$11\"),\"\")","v":""},{"$f":"IFERROR(VLOOKUP(E2091,'[1]Tarif de base'!D:E,2,FALSE)*F2091,\"\")","v":""}]
[null,"",null,null,"","",{"$f":"IFERROR(VLOOKUP(E2092,'[1]Tarif de base'!D:E,2,FALSE)*F2092,\"\")","v":""}]
[null,"",null,null,"","",{"$f":"IFERROR(VLOOKUP(E2093,'[1]Tarif de base'!D:E,2,FALSE)*F2093,\"\")","v":""}]
[null,"",null,null,"","",{"$f":"IFERROR(VLOOKUP(E2094,'[1]Tarif de base'!D:E,2,FALSE)*F2094,\"\")","v":""}]
[null,"",null,null,"","",{"$f":"IFERROR(VLOOKUP(E2095,'[1]Tarif de base'!D:E,2,FALSE)*F2095,\"\")","v":""}]
[null,"",null,null,"Total",{"$f":"SUM(F2090:F2095)","v":0},{"$f":"SUM(G2090:G2095)","v":0}]
["","","","","","",{"$f":"IFERROR(VLOOKUP(E2097,'[1]Tarif de base'!D:E,2,FALSE)*F2097,\"\")","v":""},"","","",{"$f":"IFERROR(IF(G2103-H2097-I2097-J2097<>0,\"Attention il manque \"&G2103-H2097-I2097-J2097&\"€\",\"Règlement OK\"),\"Pas de règlement\")","v":"Pas de règlement"},"",null,299]
[null,"",null,null,{"$f":"IFERROR(INDIRECT(\"'C:\\Users\\Moi\\OneDrive\\Documents\\[Formulaires Gravereau.xlsx]Action\"&$N2097&\"'!$D$11\"),\"\")","v":""},{"$f":"IFERROR(INDIRECT(\"'C:\\Users\\Moi\\OneDrive\\Documents\\[Formulaires Gravereau.xlsx]Action\"&$N2097&\"'!$h$11\"),\"\")","v":""},{"$f":"IFERROR(VLOOKUP(E2098,'[1]Tarif de base'!D:E,2,FALSE)*F2098,\"\")","v":""}]
[null,"",null,null,"","",{"$f":"IFERROR(VLOOKUP(E2099,'[1]Tarif de base'!D:E,2,FALSE)*F2099,\"\")","v":""}]
[null,"",null,null,"","",{"$f":"IFERROR(VLOOKUP(E2100,'[1]Tarif de base'!D:E,2,FALSE)*F2100,\"\")","v":""}]
[null,"",null,null,"","",{"$f":"IFERROR(VLOOKUP(E2101,'[1]Tarif de base'!D:E,2,FALSE)*F2101,\"\")","v":""}]
[null,"",null,null,"","",{"$f":"IFERROR(VLOOKUP(E2102,'[1]Tarif de base'!D:E,2,FALSE)*F2102,\"\")","v":""}]
[null,"",null,null,"Total",{"$f":"SUM(F2097:F2102)","v":0},{"$f":"SUM(G2097:G2102)","v":0}]
["","","","","","",{"$f":"IFERROR(VLOOKUP(E2104,'[1]Tarif de base'!D:E,2,FALSE)*F2104,\"\")","v":""},"","","",{"$f":"IFERROR(IF(G2110-H2104-I2104-J2104<>0,\"Attention il manque \"&G2110-H2104-I2104-J2104&\"€\",\"Règlement OK\"),\"Pas de règlement\")","v":"Pas de règlement"},"",null,300]
[null,"",null,null,{"$f":"IFERROR(INDIRECT(\"'C:\\Users\\Moi\\OneDrive\\Documents\\[Formulaires Gravereau.xlsx]Action\"&$N2104&\"'!$D$11\"),\"\")","v":""},{"$f":"IFERROR(INDIRECT(\"'C:\\Users\\Moi\\OneDrive\\Documents\\[Formulaires Gravereau.xlsx]Action\"&$N2104&\"'!$h$11\"),\"\")","v":""},{"$f":"IFERROR(VLOOKUP(E2105,'[1]Tarif de base'!D:E,2,FALSE)*F2105,\"\")","v":""}]
[null,"",null,null,"","",{"$f":"IFERROR(VLOOKUP(E2106,'[1]Tarif de base'!D:E,2,FALSE)*F2106,\"\")","v":""}]
[null,"",null,null,"","",{"$f":"IFERROR(VLOOKUP(E2107,'[1]Tarif de base'!D:E,2,FALSE)*F2107,\"\")","v":""}]
[null,"",null,null,"","",{"$f":"IFERROR(VLOOKUP(E2108,'[1]Tarif de base'!D:E,2,FALSE)*F2108,\"\")","v":""}]
[null,"",null,null,"","",{"$f":"IFERROR(VLOOKUP(E2109,'[1]Tarif de base'!D:E,2,FALSE)*F2109,\"\")","v":""}]
[null,"",null,null,"Total",{"$f":"SUM(F2104:F2109)","v":0},{"$f":"SUM(G2104:G2109)","v":0}]
["","","","","","",{"$f":"IFERROR(VLOOKUP(E2111,'[1]Tarif de base'!D:E,2,FALSE)*F2111,\"\")","v":""},"","","",{"$f":"IFERROR(IF(G2117-H2111-I2111-J2111<>0,\"Attention il manque \"&G2117-H2111-I2111-J2111&\"€\",\"Règlement OK\"),\"Pas de règlement\")","v":"Pas de règlement"},"",null,301]
[null,"",null,null,{"$f":"IFERROR(INDIRECT(\"'C:\\Users\\Moi\\OneDrive\\Documents\\[Formulaires Gravereau.xlsx]Action\"&$N2111&\"'!$D$11\"),\"\")","v":""},{"$f":"IFERROR(INDIRECT(\"'C:\\Users\\Moi\\OneDrive\\Documents\\[Formulaires Gravereau.xlsx]Action\"&$N2111&\"'!$h$11\"),\"\")","v":""},{"$f":"IFERROR(VLOOKUP(E2112,'[1]Tarif de base'!D:E,2,FALSE)*F2112,\"\")","v":""}]
[null,"",null,null,"","",{"$f":"IFERROR(VLOOKUP(E2113,'[1]Tarif de base'!D:E,2,FALSE)*F2113,\"\")","v":""}]
[null,"",null,null,"","",{"$f":"IFERROR(VLOOKUP(E2114,'[1]Tarif de base'!D:E,2,FALSE)*F2114,\"\")","v":""}]
[null,"",null,null,"","",{"$f":"IFERROR(VLOOKUP(E2115,'[1]Tarif de base'!D:E,2,FALSE)*F2115,\"\")","v":""}]
[null,"",null,null,"","",{"$f":"IFERROR(VLOOKUP(E2116,'[1]Tarif de base'!D:E,2,FALSE)*F2116,\"\")","v":""}]
[null,"",null,null,"Total",{"$f":"SUM(F2111:F2116)","v":0},{"$f":"SUM(G2111:G2116)","v":0}]
["","","","","","",{"$f":"IFERROR(VLOOKUP(E2118,'[1]Tarif de base'!D:E,2,FALSE)*F2118,\"\")","v":""},"","","",{"$f":"IFERROR(IF(G2124-H2118-I2118-J2118<>0,\"Attention il manque \"&G2124-H2118-I2118-J2118&\"€\",\"Règlement OK\"),\"Pas de règlement\")","v":"Pas de règlement"},"",null,302]
[null,"",null,null,{"$f":"IFERROR(INDIRECT(\"'C:\\Users\\Moi\\OneDrive\\Documents\\[Formulaires Gravereau.xlsx]Action\"&$N2118&\"'!$D$11\"),\"\")","v":""},{"$f":"IFERROR(INDIRECT(\"'C:\\Users\\Moi\\OneDrive\\Documents\\[Formulaires Gravereau.xlsx]Action\"&$N2118&\"'!$h$11\"),\"\")","v":""},{"$f":"IFERROR(VLOOKUP(E2119,'[1]Tarif de base'!D:E,2,FALSE)*F2119,\"\")","v":""}]
[null,"",null,null,"","",{"$f":"IFERROR(VLOOKUP(E2120,'[1]Tarif de base'!D:E,2,FALSE)*F2120,\"\")","v":""}]
[null,"",null,null,"","",{"$f":"IFERROR(VLOOKUP(E2121,'[1]Tarif de base'!D:E,2,FALSE)*F2121,\"\")","v":""}]
[null,"",null,null,"","",{"$f":"IFERROR(VLOOKUP(E2122,'[1]Tarif de base'!D:E,2,FALSE)*F2122,\"\")","v":""}]
[null,"",null,null,"","",{"$f":"IFERROR(VLOOKUP(E2123,'[1]Tarif de base'!D:E,2,FALSE)*F2123,\"\")","v":""}]
[null,"",null,null,"Total",{"$f":"SUM(F2118:F2123)","v":0},{"$f":"SUM(G2118:G2123)","v":0}]
["","","","","","",{"$f":"IFERROR(VLOOKUP(E2125,'[1]Tarif de base'!D:E,2,FALSE)*F2125,\"\")","v":""},"","","",{"$f":"IFERROR(IF(G2131-H2125-I2125-J2125<>0,\"Attention il manque \"&G2131-H2125-I2125-J2125&\"€\",\"Règlement OK\"),\"Pas de règlement\")","v":"Pas de règlement"},"",null,303]
[null,"",null,null,{"$f":"IFERROR(INDIRECT(\"'C:\\Users\\Moi\\OneDrive\\Documents\\[Formulaires Gravereau.xlsx]Action\"&$N2125&\"'!$D$11\"),\"\")","v":""},{"$f":"IFERROR(INDIRECT(\"'C:\\Users\\Moi\\OneDrive\\Documents\\[Formulaires Gravereau.xlsx]Action\"&$N2125&\"'!$h$11\"),\"\")","v":""},{"$f":"IFERROR(VLOOKUP(E2126,'[1]Tarif de base'!D:E,2,FALSE)*F2126,\"\")","v":""}]
[null,"",null,null,"","",{"$f":"IFERROR(VLOOKUP(E2127,'[1]Tarif de base'!D:E,2,FALSE)*F2127,\"\")","v":""}]
[null,"",null,null,"","",{"$f":"IFERROR(VLOOKUP(E2128,'[1]Tarif de base'!D:E,2,FALSE)*F2128,\"\")","v":""}]
[null,"",null,null,"","",{"$f":"IFERROR(VLOOKUP(E2129,'[1]Tarif de base'!D:E,2,FALSE)*F2129,\"\")","v":""}]
[null,"",null,null,"","",{"$f":"IFERROR(VLOOKUP(E2130,'[1]Tarif de base'!D:E,2,FALSE)*F2130,\"\")","v":""}]
[null,"",null,null,"Total",{"$f":"SUM(F2125:F2130)","v":0},{"$f":"SUM(G2125:G2130)","v":0}]
[{"$f":"IFERROR(INDIRECT(\"'C:\\Users\\Moi\\OneDrive\\Documents\\[Formulaires Gravereau.xlsx]Action\"&$N2132&\"'!$D$6\"),\"\")","v":""},{"$f":"IF(C2132<>\"\",C2132,\"\")","v":""},{"$f":"IFERROR(INDIRECT(\"'C:\\Users\\Moi\\OneDrive\\Documents\\[Formulaires Gravereau.xlsx]Action\"&$N2132&\"'!$D$4\"),\"\")","v":""},{"$f":"IFERROR(INDIRECT(\"'C:\\Users\\Moi\\OneDrive\\Documents\\[Formulaires Gravereau.xlsx]Action\"&$N2132&\"'!$h$4\"),\"\")","v":""},{"$f":"IFERROR(INDIRECT(\"'C:\\Users\\Moi\\OneDrive\\Documents\\[Formulaires Gravereau.xlsx]Action\"&$N2132&\"'!$D$9\"),\"\")","v":""},{"$f":"IFERROR(INDIRECT(\"'C:\\Users\\Moi\\OneDrive\\Documents\\[Formulaires Gravereau.xlsx]Action\"&$N2132&\"'!$h$9\"),\"\")","v":""},{"$f":"IFERROR(VLOOKUP(E2132,'[1]Tarif de base'!D:E,2,FALSE)*F2132,\"\")","v":""},{"$f":"IFERROR(INDIRECT(\"'C:\\Users\\Moi\\OneDrive\\Documents\\[Formulaires Gravereau.xlsx]Action\"&$N2132&\"'!$d$26\"),\"\")","v":""},{"$f":"IFERROR(INDIRECT(\"'C:\\Users\\Moi\\OneDrive\\Documents\\[Formulaires Gravereau.xlsx]Action\"&$N2132&\"'!$d$28\"),\"\")","v":""},{"$f":"IFERROR(INDIRECT(\"'C:\\Users\\Moi\\OneDrive\\Documents\\[Formulaires Gravereau.xlsx]Action\"&$N2132&\"'!$h$26\"),\"\")","v":""},{"$f":"IFERROR(IF(G2138-H2132-I2132-J2132<>0,\"Attention il manque \"&G2138-H2132-I2132-J2132&\"€\",\"Règlement OK\"),\"Pas de règlement\")","v":"Pas de règlement"},{"$f":"IFERROR(INDIRECT(\"'C:\\Users\\Moi\\OneDrive\\Documents\\[Formulaires Gravereau.xlsx]Action\"&$N2132&\"'!$d$30\"),\"\")","v":""},null,304]
[null,"",null,null,{"$f":"IFERROR(INDIRECT(\"'C:\\Users\\Moi\\OneDrive\\Documents\\[Formulaires Gravereau.xlsx]Action\"&$N2132&\"'!$D$11\"),\"\")","v":""},{"$f":"IFERROR(INDIRECT(\"'C:\\Users\\Moi\\OneDrive\\Documents\\[Formulaires Gravereau.xlsx]Action\"&$N2132&\"'!$h$11\"),\"\")","v":""},{"$f":"IFERROR(VLOOKUP(E2133,'[1]Tarif de base'!D:E,2,FALSE)*F2133,\"\")","v":""}]
[null,"",null,null,{"$f":"IFERROR(INDIRECT(\"'C:\\Users\\Moi\\OneDrive\\Documents\\[Formulaires Gravereau.xlsx]Action\"&$N2132&\"'!$D$13\"),\"\")","v":""},{"$f":"IFERROR(INDIRECT(\"'C:\\Users\\Moi\\OneDrive\\Documents\\[Formulaires Gravereau.xlsx]Action\"&$N2132&\"'!$h$13\"),\"\")","v":""},{"$f":"IFERROR(VLOOKUP(E2134,'[1]Tarif de base'!D:E,2,FALSE)*F2134,\"\")","v":""}]
[null,{"$f":"B2134","v":""},null,null,{"$f":"IFERROR(INDIRECT(\"'C:\\Users\\Moi\\OneDrive\\Documents\\[Formulaires Gravereau.xlsx]Action\"&$N2132&\"'!$D$15\"),\"\")","v":""},{"$f":"IFERROR(INDIRECT(\"'C:\\Users\\Moi\\OneDrive\\Documents\\[Formulaires Gravereau.xlsx]Action\"&$N2132&\"'!$h$15\"),\"\")","v":""},{"$f":"IFERROR(VLOOKUP(E2135,'[1]Tarif de base'!D:E,2,FALSE)*F2135,\"\")","v":""}]
[null,"",null,null,{"$f":"IFERROR(INDIRECT(\"'C:\\Users\\Moi\\OneDrive\\Documents\\[Formulaires Gravereau.xlsx]Action\"&$N2132&\"'!$D$17\"),\"\")","v":""},{"$f":"IFERROR(INDIRECT(\"'C:\\Users\\Moi\\OneDrive\\Documents\\[Formulaires Gravereau.xlsx]Action\"&$N2132&\"'!$h$17\"),\"\")","v":""},{"$f":"IFERROR(VLOOKUP(E2136,'[1]Tarif de base'!D:E,2,FALSE)*F2136,\"\")","v":""}]
[null,"",null,null,{"$f":"IFERROR(INDIRECT(\"'C:\\Users\\Moi\\OneDrive\\Documents\\[Formulaires Gravereau.xlsx]Action\"&$N2132&\"'!$D$19\"),\"\")","v":""},{"$f":"IFERROR(INDIRECT(\"'C:\\Users\\Moi\\OneDrive\\Documents\\[Formulaires Gravereau.xlsx]Action\"&$N2132&\"'!$h$19\"),\"\")","v":""},{"$f":"IFERROR(VLOOKUP(E2137,'[1]Tarif de base'!D:E,2,FALSE)*F2137,\"\")","v":""}]
[null,"",null,null,"Total",{"$f":"SUM(F2132:F2137)","v":0},{"$f":"SUM(G2132:G2137)","v":0}]
["","","","","","",{"$f":"IFERROR(VLOOKUP(E2139,'[1]Tarif de base'!D:E,2,FALSE)*F2139,\"\")","v":""},"","","",{"$f":"IFERROR(IF(G2145-H2139-I2139-J2139<>0,\"Attention il manque \"&G2145-H2139-I2139-J2139&\"€\",\"Règlement OK\"),\"Pas de règlement\")","v":"Pas de règlement"},"",null,305]
[null,"",null,null,{"$f":"IFERROR(INDIRECT(\"'C:\\Users\\Moi\\OneDrive\\Documents\\[Formulaires Gravereau.xlsx]Action\"&$N2139&\"'!$D$11\"),\"\")","v":""},{"$f":"IFERROR(INDIRECT(\"'C:\\Users\\Moi\\OneDrive\\Documents\\[Formulaires Gravereau.xlsx]Action\"&$N2139&\"'!$h$11\"),\"\")","v":""},{"$f":"IFERROR(VLOOKUP(E2140,'[1]Tarif de base'!D:E,2,FALSE)*F2140,\"\")","v":""}]
[null,"",null,null,"","",{"$f":"IFERROR(VLOOKUP(E2141,'[1]Tarif de base'!D:E,2,FALSE)*F2141,\"\")","v":""}]
[null,"",null,null,"","",{"$f":"IFERROR(VLOOKUP(E2142,'[1]Tarif de base'!D:E,2,FALSE)*F2142,\"\")","v":""}]
[null,"",null,null,"","",{"$f":"IFERROR(VLOOKUP(E2143,'[1]Tarif de base'!D:E,2,FALSE)*F2143,\"\")","v":""}]
[null,"",null,null,"","",{"$f":"IFERROR(VLOOKUP(E2144,'[1]Tarif de base'!D:E,2,FALSE)*F2144,\"\")","v":""}]
[null,"",null,null,"Total",{"$f":"SUM(F2139:F2144)","v":0},{"$f":"SUM(G2139:G2144)","v":0}]
["","","","","","",{"$f":"IFERROR(VLOOKUP(E2146,'[1]Tarif de base'!D:E,2,FALSE)*F2146,\"\")","v":""},"","","",{"$f":"IFERROR(IF(G2152-H2146-I2146-J2146<>0,\"Attention il manque \"&G2152-H2146-I2146-J2146&\"€\",\"Règlement OK\"),\"Pas de règlement\")","v":"Pas de règlement"},"",null,306]
[null,"",null,null,{"$f":"IFERROR(INDIRECT(\"'C:\\Users\\Moi\\OneDrive\\Documents\\[Formulaires Gravereau.xlsx]Action\"&$N2146&\"'!$D$11\"),\"\")","v":""},{"$f":"IFERROR(INDIRECT(\"'C:\\Users\\Moi\\OneDrive\\Documents\\[Formulaires Gravereau.xlsx]Action\"&$N2146&\"'!$h$11\"),\"\")","v":""},{"$f":"IFERROR(VLOOKUP(E2147,'[1]Tarif de base'!D:E,2,FALSE)*F2147,\"\")","v":""}]
[null,"",null,null,"","",{"$f":"IFERROR(VLOOKUP(E2148,'[1]Tarif de base'!D:E,2,FALSE)*F2148,\"\")","v":""}]
[null,"",null,null,"","",{"$f":"IFERROR(VLOOKUP(E2149,'[1]Tarif de base'!D:E,2,FALSE)*F2149,\"\")","v":""}]
[null,"",null,null,"","",{"$f":"IFERROR(VLOOKUP(E2150,'[1]Tarif de base'!D:E,2,FALSE)*F2150,\"\")","v":""}]
[null,"",null,null,"","",{"$f":"IFERROR(VLOOKUP(E2151,'[1]Tarif de base'!D:E,2,FALSE)*F2151,\"\")","v":""}]
[null,"",null,null,"Total",{"$f":"SUM(F2146:F2151)","v":0},{"$f":"SUM(G2146:G2151)","v":0}]
["","","","","","",{"$f":"IFERROR(VLOOKUP(E2153,'[1]Tarif de base'!D:E,2,FALSE)*F2153,\"\")","v":""},"","","",{"$f":"IFERROR(IF(G2159-H2153-I2153-J2153<>0,\"Attention il manque \"&G2159-H2153-I2153-J2153&\"€\",\"Règlement OK\"),\"Pas de règlement\")","v":"Pas de règlement"},"",null,307]
[null,"",null,null,{"$f":"IFERROR(INDIRECT(\"'C:\\Users\\Moi\\OneDrive\\Documents\\[Formulaires Gravereau.xlsx]Action\"&$N2153&\"'!$D$11\"),\"\")","v":""},{"$f":"IFERROR(INDIRECT(\"'C:\\Users\\Moi\\OneDrive\\Documents\\[Formulaires Gravereau.xlsx]Action\"&$N2153&\"'!$h$11\"),\"\")","v":""},{"$f":"IFERROR(VLOOKUP(E2154,'[1]Tarif de base'!D:E,2,FALSE)*F2154,\"\")","v":""}]
[null,"",null,null,"","",{"$f":"IFERROR(VLOOKUP(E2155,'[1]Tarif de base'!D:E,2,FALSE)*F2155,\"\")","v":""}]
[null,"",null,null,"","",{"$f":"IFERROR(VLOOKUP(E2156,'[1]Tarif de base'!D:E,2,FALSE)*F2156,\"\")","v":""}]
[null,"",null,null,"","",{"$f":"IFERROR(VLOOKUP(E2157,'[1]Tarif de base'!D:E,2,FALSE)*F2157,\"\")","v":""}]
[null,"",null,null,"","",{"$f":"IFERROR(VLOOKUP(E2158,'[1]Tarif de base'!D:E,2,FALSE)*F2158,\"\")","v":""}]
[null,"",null,null,"Total",{"$f":"SUM(F2153:F2158)","v":0},{"$f":"SUM(G2153:G2158)","v":0}]
["","","","","","",{"$f":"IFERROR(VLOOKUP(E2160,'[1]Tarif de base'!D:E,2,FALSE)*F2160,\"\")","v":""},"","","",{"$f":"IFERROR(IF(G2166-H2160-I2160-J2160<>0,\"Attention il manque \"&G2166-H2160-I2160-J2160&\"€\",\"Règlement OK\"),\"Pas de règlement\")","v":"Pas de règlement"},"",null,308]
[null,"",null,null,{"$f":"IFERROR(INDIRECT(\"'C:\\Users\\Moi\\OneDrive\\Documents\\[Formulaires Gravereau.xlsx]Action\"&$N2160&\"'!$D$11\"),\"\")","v":""},{"$f":"IFERROR(INDIRECT(\"'C:\\Users\\Moi\\OneDrive\\Documents\\[Formulaires Gravereau.xlsx]Action\"&$N2160&\"'!$h$11\"),\"\")","v":""},{"$f":"IFERROR(VLOOKUP(E2161,'[1]Tarif de base'!D:E,2,FALSE)*F2161,\"\")","v":""}]
[null,"",null,null,"","",{"$f":"IFERROR(VLOOKUP(E2162,'[1]Tarif de base'!D:E,2,FALSE)*F2162,\"\")","v":""}]
[null,"",null,null,"","",{"$f":"IFERROR(VLOOKUP(E2163,'[1]Tarif de base'!D:E,2,FALSE)*F2163,\"\")","v":""}]
[null,"",null,null,"","",{"$f":"IFERROR(VLOOKUP(E2164,'[1]Tarif de base'!D:E,2,FALSE)*F2164,\"\")","v":""}]
[null,"",null,null,"","",{"$f":"IFERROR(VLOOKUP(E2165,'[1]Tarif de base'!D:E,2,FALSE)*F2165,\"\")","v":""}]
[null,"",null,null,"Total",{"$f":"SUM(F2160:F2165)","v":0},{"$f":"SUM(G2160:G2165)","v":0}]
["","","","","","",{"$f":"IFERROR(VLOOKUP(E2167,'[1]Tarif de base'!D:E,2,FALSE)*F2167,\"\")","v":""},"","","",{"$f":"IFERROR(IF(G2173-H2167-I2167-J2167<>0,\"Attention il manque \"&G2173-H2167-I2167-J2167&\"€\",\"Règlement OK\"),\"Pas de règlement\")","v":"Pas de règlement"},"",null,309]
[null,"",null,null,{"$f":"IFERROR(INDIRECT(\"'C:\\Users\\Moi\\OneDrive\\Documents\\[Formulaires Gravereau.xlsx]Action\"&$N2167&\"'!$D$11\"),\"\")","v":""},{"$f":"IFERROR(INDIRECT(\"'C:\\Users\\Moi\\OneDrive\\Documents\\[Formulaires Gravereau.xlsx]Action\"&$N2167&\"'!$h$11\"),\"\")","v":""},{"$f":"IFERROR(VLOOKUP(E2168,'[1]Tarif de base'!D:E,2,FALSE)*F2168,\"\")","v":""}]
[null,"",null,null,"","",{"$f":"IFERROR(VLOOKUP(E2169,'[1]Tarif de base'!D:E,2,FALSE)*F2169,\"\")","v":""}]
[null,"",null,null,"","",{"$f":"IFERROR(VLOOKUP(E2170,'[1]Tarif de base'!D:E,2,FALSE)*F2170,\"\")","v":""}]
[null,"",null,null,"","",{"$f":"IFERROR(VLOOKUP(E2171,'[1]Tarif de base'!D:E,2,FALSE)*F2171,\"\")","v":""}]
[null,"",null,null,"","",{"$f":"IFERROR(VLOOKUP(E2172,'[1]Tarif de base'!D:E,2,FALSE)*F2172,\"\")","v":""}]
[null,"",null,null,"Total",{"$f":"SUM(F2167:F2172)","v":0},{"$f":"SUM(G2167:G2172)","v":0}]
["","","","","","",{"$f":"IFERROR(VLOOKUP(E2174,'[1]Tarif de base'!D:E,2,FALSE)*F2174,\"\")","v":""},"","","",{"$f":"IFERROR(IF(G2180-H2174-I2174-J2174<>0,\"Attention il manque \"&G2180-H2174-I2174-J2174&\"€\",\"Règlement OK\"),\"Pas de règlement\")","v":"Pas de règlement"},"",null,310]
[null,"",null,null,{"$f":"IFERROR(INDIRECT(\"'C:\\Users\\Moi\\OneDrive\\Documents\\[Formulaires Gravereau.xlsx]Action\"&$N2174&\"'!$D$11\"),\"\")","v":""},{"$f":"IFERROR(INDIRECT(\"'C:\\Users\\Moi\\OneDrive\\Documents\\[Formulaires Gravereau.xlsx]Action\"&$N2174&\"'!$h$11\"),\"\")","v":""},{"$f":"IFERROR(VLOOKUP(E2175,'[1]Tarif de base'!D:E,2,FALSE)*F2175,\"\")","v":""}]
[null,"",null,null,"","",{"$f":"IFERROR(VLOOKUP(E2176,'[1]Tarif de base'!D:E,2,FALSE)*F2176,\"\")","v":""}]
[null,"",null,null,"","",{"$f":"IFERROR(VLOOKUP(E2177,'[1]Tarif de base'!D:E,2,FALSE)*F2177,\"\")","v":""}]
[null,"",null,null,"","",{"$f":"IFERROR(VLOOKUP(E2178,'[1]Tarif de base'!D:E,2,FALSE)*F2178,\"\")","v":""}]
[null,"",null,null,"","",{"$f":"IFERROR(VLOOKUP(E2179,'[1]Tarif de base'!D:E,2,FALSE)*F2179,\"\")","v":""}]
[null,"",null,null,"Total",{"$f":"SUM(F2174:F2179)","v":0},{"$f":"SUM(G2174:G2179)","v":0}]
["","","","","","",{"$f":"IFERROR(VLOOKUP(E2181,'[1]Tarif de base'!D:E,2,FALSE)*F2181,\"\")","v":""},"","","",{"$f":"IFERROR(IF(G2187-H2181-I2181-J2181<>0,\"Attention il manque \"&G2187-H2181-I2181-J2181&\"€\",\"Règlement OK\"),\"Pas de règlement\")","v":"Pas de règlement"},"",null,311]
[null,"",null,null,{"$f":"IFERROR(INDIRECT(\"'C:\\Users\\Moi\\OneDrive\\Documents\\[Formulaires Gravereau.xlsx]Action\"&$N2181&\"'!$D$11\"),\"\")","v":""},{"$f":"IFERROR(INDIRECT(\"'C:\\Users\\Moi\\OneDrive\\Documents\\[Formulaires Gravereau.xlsx]Action\"&$N2181&\"'!$h$11\"),\"\")","v":""},{"$f":"IFERROR(VLOOKUP(E2182,'[1]Tarif de base'!D:E,2,FALSE)*F2182,\"\")","v":""}]
[null,"",null,null,"","",{"$f":"IFERROR(VLOOKUP(E2183,'[1]Tarif de base'!D:E,2,FALSE)*F2183,\"\")","v":""}]
[null,"",null,null,"","",{"$f":"IFERROR(VLOOKUP(E2184,'[1]Tarif de base'!D:E,2,FALSE)*F2184,\"\")","v":""}]
[null,"",null,null,"","",{"$f":"IFERROR(VLOOKUP(E2185,'[1]Tarif de base'!D:E,2,FALSE)*F2185,\"\")","v":""}]
[null,"",null,null,"","",{"$f":"IFERROR(VLOOKUP(E2186,'[1]Tarif de base'!D:E,2,FALSE)*F2186,\"\")","v":""}]
[null,"",null,null,"Total",{"$f":"SUM(F2181:F2186)","v":0},{"$f":"SUM(G2181:G2186)","v":0}]
["","","","","","",{"$f":"IFERROR(VLOOKUP(E2188,'[1]Tarif de base'!D:E,2,FALSE)*F2188,\"\")","v":""},"","","",{"$f":"IFERROR(IF(G2194-H2188-I2188-J2188<>0,\"Attention il manque \"&G2194-H2188-I2188-J2188&\"€\",\"Règlement OK\"),\"Pas de règlement\")","v":"Pas de règlement"},"",null,312]
[null,"",null,null,{"$f":"IFERROR(INDIRECT(\"'C:\\Users\\Moi\\OneDrive\\Documents\\[Formulaires Gravereau.xlsx]Action\"&$N2188&\"'!$D$11\"),\"\")","v":""},{"$f":"IFERROR(INDIRECT(\"'C:\\Users\\Moi\\OneDrive\\Documents\\[Formulaires Gravereau.xlsx]Action\"&$N2188&\"'!$h$11\"),\"\")","v":""},{"$f":"IFERROR(VLOOKUP(E2189,'[1]Tarif de base'!D:E,2,FALSE)*F2189,\"\")","v":""}]
[null,"",null,null,"","",{"$f":"IFERROR(VLOOKUP(E2190,'[1]Tarif de base'!D:E,2,FALSE)*F2190,\"\")","v":""}]
[null,"",null,null,"","",{"$f":"IFERROR(VLOOKUP(E2191,'[1]Tarif de base'!D:E,2,FALSE)*F2191,\"\")","v":""}]
[null,"",null,null,"","",{"$f":"IFERROR(VLOOKUP(E2192,'[1]Tarif de base'!D:E,2,FALSE)*F2192,\"\")","v":""}]
[null,"",null,null,"","",{"$f":"IFERROR(VLOOKUP(E2193,'[1]Tarif de base'!D:E,2,FALSE)*F2193,\"\")","v":""}]
[null,"",null,null,"Total",{"$f":"SUM(F2188:F2193)","v":0},{"$f":"SUM(G2188:G2193)","v":0}]
["","","","","","",{"$f":"IFERROR(VLOOKUP(E2195,'[1]Tarif de base'!D:E,2,FALSE)*F2195,\"\")","v":""},"","","",{"$f":"IFERROR(IF(G2201-H2195-I2195-J2195<>0,\"Attention il manque \"&G2201-H2195-I2195-J2195&\"€\",\"Règlement OK\"),\"Pas de règlement\")","v":"Pas de règlement"},"",null,313]
[null,"",null,null,{"$f":"IFERROR(INDIRECT(\"'C:\\Users\\Moi\\OneDrive\\Documents\\[Formulaires Gravereau.xlsx]Action\"&$N2195&\"'!$D$11\"),\"\")","v":""},{"$f":"IFERROR(INDIRECT(\"'C:\\Users\\Moi\\OneDrive\\Documents\\[Formulaires Gravereau.xlsx]Action\"&$N2195&\"'!$h$11\"),\"\")","v":""},{"$f":"IFERROR(VLOOKUP(E2196,'[1]Tarif de base'!D:E,2,FALSE)*F2196,\"\")","v":""}]
[null,"",null,null,"","",{"$f":"IFERROR(VLOOKUP(E2197,'[1]Tarif de base'!D:E,2,FALSE)*F2197,\"\")","v":""}]
[null,"",null,null,"","",{"$f":"IFERROR(VLOOKUP(E2198,'[1]Tarif de base'!D:E,2,FALSE)*F2198,\"\")","v":""}]
[null,{"$f":"B2198","v":""},null,null,"","",{"$f":"IFERROR(VLOOKUP(E2199,'[1]Tarif de base'!D:E,2,FALSE)*F2199,\"\")","v":""}]
[null,"",null,null,"","",{"$f":"IFERROR(VLOOKUP(E2200,'[1]Tarif de base'!D:E,2,FALSE)*F2200,\"\")","v":""}]
[null,"",null,null,"Total",{"$f":"SUM(F2195:F2200)","v":0},{"$f":"SUM(G2195:G2200)","v":0}]
[{"$f":"IFERROR(INDIRECT(\"'C:\\Users\\Moi\\OneDrive\\Documents\\[Formulaires Gravereau.xlsx]Action\"&$N2202&\"'!$D$6\"),\"\")","v":""},{"$f":"IF(C2202<>\"\",C2202,\"\")","v":""},{"$f":"IFERROR(INDIRECT(\"'C:\\Users\\Moi\\OneDrive\\Documents\\[Formulaires Gravereau.xlsx]Action\"&$N2202&\"'!$D$4\"),\"\")","v":""},{"$f":"IFERROR(INDIRECT(\"'C:\\Users\\Moi\\OneDrive\\Documents\\[Formulaires Gravereau.xlsx]Action\"&$N2202&\"'!$h$4\"),\"\")","v":""},{"$f":"IFERROR(INDIRECT(\"'C:\\Users\\Moi\\OneDrive\\Documents\\[Formulaires Gravereau.xlsx]Action\"&$N2202&\"'!$D$9\"),\"\")","v":""},{"$f":"IFERROR(INDIRECT(\"'C:\\Users\\Moi\\OneDrive\\Documents\\[Formulaires Gravereau.xlsx]Action\"&$N2202&\"'!$h$9\"),\"\")","v":""},{"$f":"IFERROR(VLOOKUP(E2202,'[1]Tarif de base'!D:E,2,FALSE)*F2202,\"\")","v":""},{"$f":"IFERROR(INDIRECT(\"'C:\\Users\\Moi\\OneDrive\\Documents\\[Formulaires Gravereau.xlsx]Action\"&$N2202&\"'!$d$26\"),\"\")","v":""},{"$f":"IFERROR(INDIRECT(\"'C:\\Users\\Moi\\OneDrive\\Documents\\[Formulaires Gravereau.xlsx]Action\"&$N2202&\"'!$d$28\"),\"\")","v":""},{"$f":"IFERROR(INDIRECT(\"'C:\\Users\\Moi\\OneDrive\\Documents\\[Formulaires Gravereau.xlsx]Action\"&$N2202&\"'!$h$26\"),\"\")","v":""},{"$f":"IFERROR(IF(G2208-H2202-I2202-J2202<>0,\"Attention il manque \"&G2208-H2202-I2202-J2202&\"€\",\"Règlement OK\"),\"Pas de règlement\")","v":"Pas de règlement"},{"$f":"IFERROR(INDIRECT(\"'C:\\Users\\Moi\\OneDrive\\Documents\\[Formulaires Gravereau.xlsx]Action\"&$N2202&\"'!$d$30\"),\"\")","v":""},null,314]
[null,"",null,null,{"$f":"IFERROR(INDIRECT(\"'C:\\Users\\Moi\\OneDrive\\Documents\\[Formulaires Gravereau.xlsx]Action\"&$N2202&\"'!$D$11\"),\"\")","v":""},{"$f":"IFERROR(INDIRECT(\"'C:\\Users\\Moi\\OneDrive\\Documents\\[Formulaires Gravereau.xlsx]Action\"&$N2202&\"'!$h$11\"),\"\")","v":""},{"$f":"IFERROR(VLOOKUP(E2203,'[1]Tarif de base'!D:E,2,FALSE)*F2203,\"\")","v":""}]
[null,"",null,null,{"$f":"IFERROR(INDIRECT(\"'C:\\Users\\Moi\\OneDrive\\Documents\\[Formulaires Gravereau.xlsx]Action\"&$N2202&\"'!$D$13\"),\"\")","v":""},{"$f":"IFERROR(INDIRECT(\"'C:\\Users\\Moi\\OneDrive\\Documents\\[Formulaires Gravereau.xlsx]Action\"&$N2202&\"'!$h$13\"),\"\")","v":""},{"$f":"IFERROR(VLOOKUP(E2204,'[1]Tarif de base'!D:E,2,FALSE)*F2204,\"\")","v":""}]
[null,"",null,null,{"$f":"IFERROR(INDIRECT(\"'C:\\Users\\Moi\\OneDrive\\Documents\\[Formulaires Gravereau.xlsx]Action\"&$N2202&\"'!$D$15\"),\"\")","v":""},{"$f":"IFERROR(INDIRECT(\"'C:\\Users\\Moi\\OneDrive\\Documents\\[Formulaires Gravereau.xlsx]Action\"&$N2202&\"'!$h$15\"),\"\")","v":""},{"$f":"IFERROR(VLOOKUP(E2205,'[1]Tarif de base'!D:E,2,FALSE)*F2205,\"\")","v":""}]
[null,"",null,null,{"$f":"IFERROR(INDIRECT(\"'C:\\Users\\Moi\\OneDrive\\Documents\\[Formulaires Gravereau.xlsx]Action\"&$N2202&\"'!$D$17\"),\"\")","v":""},{"$f":"IFERROR(INDIRECT(\"'C:\\Users\\Moi\\OneDrive\\Documents\\[Formulaires Gravereau.xlsx]Action\"&$N2202&\"'!$h$17\"),\"\")","v":""},{"$f":"IFERROR(VLOOKUP(E2206,'[1]Tarif de base'!D:E,2,FALSE)*F2206,\"\")","v":""}]
[null,"",null,null,{"$f":"IFERROR(INDIRECT(\"'C:\\Users\\Moi\\OneDrive\\Documents\\[Formulaires Gravereau.xlsx]Action\"&$N2202&\"'!$D$19\"),\"\")","v":""},{"$f":"IFERROR(INDIRECT(\"'C:\\Users\\Moi\\OneDrive\\Documents\\[Formulaires Gravereau.xlsx]Action\"&$N2202&\"'!$h$19\"),\"\")","v":""},{"$f":"IFERROR(VLOOKUP(E2207,'[1]Tarif de base'!D:E,2,FALSE)*F2207,\"\")","v":""}]
[null,"",null,null,"Total",{"$f":"SUM(F2202:F2207)","v":0},{"$f":"SUM(G2202:G2207)","v":0}]
["","","","","","",{"$f":"IFERROR(VLOOKUP(E2209,'[1]Tarif de base'!D:E,2,FALSE)*F2209,\"\")","v":""},"","","",{"$f":"IFERROR(IF(G2215-H2209-I2209-J2209<>0,\"Attention il manque \"&G2215-H2209-I2209-J2209&\"€\",\"Règlement OK\"),\"Pas de règlement\")","v":"Pas de règlement"},"",null,315]
[null,"",null,null,{"$f":"IFERROR(INDIRECT(\"'C:\\Users\\Moi\\OneDrive\\Documents\\[Formulaires Gravereau.xlsx]Action\"&$N2209&\"'!$D$11\"),\"\")","v":""},{"$f":"IFERROR(INDIRECT(\"'C:\\Users\\Moi\\OneDrive\\Documents\\[Formulaires Gravereau.xlsx]Action\"&$N2209&\"'!$h$11\"),\"\")","v":""},{"$f":"IFERROR(VLOOKUP(E2210,'[1]Tarif de base'!D:E,2,FALSE)*F2210,\"\")","v":""}]
[null,"",null,null,"","",{"$f":"IFERROR(VLOOKUP(E2211,'[1]Tarif de base'!D:E,2,FALSE)*F2211,\"\")","v":""}]
[null,"",null,null,"","",{"$f":"IFERROR(VLOOKUP(E2212,'[1]Tarif de base'!D:E,2,FALSE)*F2212,\"\")","v":""}]
[null,"",null,null,"","",{"$f":"IFERROR(VLOOKUP(E2213,'[1]Tarif de base'!D:E,2,FALSE)*F2213,\"\")","v":""}]
[null,"",null,null,"","",{"$f":"IFERROR(VLOOKUP(E2214,'[1]Tarif de base'!D:E,2,FALSE)*F2214,\"\")","v":""}]
[null,"",null,null,"Total",{"$f":"SUM(F2209:F2214)","v":0},{"$f":"SUM(G2209:G2214)","v":0}]
["","","","","","",{"$f":"IFERROR(VLOOKUP(E2216,'[1]Tarif de base'!D:E,2,FALSE)*F2216,\"\")","v":""},"","","",{"$f":"IFERROR(IF(G2222-H2216-I2216-J2216<>0,\"Attention il manque \"&G2222-H2216-I2216-J2216&\"€\",\"Règlement OK\"),\"Pas de règlement\")","v":"Pas de règlement"},"",null,316]
[null,"",null,null,{"$f":"IFERROR(INDIRECT(\"'C:\\Users\\Moi\\OneDrive\\Documents\\[Formulaires Gravereau.xlsx]Action\"&$N2216&\"'!$D$11\"),\"\")","v":""},{"$f":"IFERROR(INDIRECT(\"'C:\\Users\\Moi\\OneDrive\\Documents\\[Formulaires Gravereau.xlsx]Action\"&$N2216&\"'!$h$11\"),\"\")","v":""},{"$f":"IFERROR(VLOOKUP(E2217,'[1]Tarif de base'!D:E,2,FALSE)*F2217,\"\")","v":""}]
[null,"",null,null,"","",{"$f":"IFERROR(VLOOKUP(E2218,'[1]Tarif de base'!D:E,2,FALSE)*F2218,\"\")","v":""}]
[null,"",null,null,"","",{"$f":"IFERROR(VLOOKUP(E2219,'[1]Tarif de base'!D:E,2,FALSE)*F2219,\"\")","v":""}]
[null,"",null,null,"","",{"$f":"IFERROR(VLOOKUP(E2220,'[1]Tarif de base'!D:E,2,FALSE)*F2220,\"\")","v":""}]
[null,"",null,null,"","",{"$f":"IFERROR(VLOOKUP(E2221,'[1]Tarif de base'!D:E,2,FALSE)*F2221,\"\")","v":""}]
[null,"",null,null,"Total",{"$f":"SUM(F2216:F2221)","v":0},{"$f":"SUM(G2216:G2221)","v":0}]
["","","","","","",{"$f":"IFERROR(VLOOKUP(E2223,'[1]Tarif de base'!D:E,2,FALSE)*F2223,\"\")","v":""},"","","",{"$f":"IFERROR(IF(G2229-H2223-I2223-J2223<>0,\"Attention il manque \"&G2229-H2223-I2223-J2223&\"€\",\"Règlement OK\"),\"Pas de règlement\")","v":"Pas de règlement"},"",null,317]
[null,"",null,null,{"$f":"IFERROR(INDIRECT(\"'C:\\Users\\Moi\\OneDrive\\Documents\\[Formulaires Gravereau.xlsx]Action\"&$N2223&\"'!$D$11\"),\"\")","v":""},{"$f":"IFERROR(INDIRECT(\"'C:\\Users\\Moi\\OneDrive\\Documents\\[Formulaires Gravereau.xlsx]Action\"&$N2223&\"'!$h$11\"),\"\")","v":""},{"$f":"IFERROR(VLOOKUP(E2224,'[1]Tarif de base'!D:E,2,FALSE)*F2224,\"\")","v":""}]
[null,"",null,null,"","",{"$f":"IFERROR(VLOOKUP(E2225,'[1]Tarif de base'!D:E,2,FALSE)*F2225,\"\")","v":""}]
[null,"",null,null,"","",{"$f":"IFERROR(VLOOKUP(E2226,'[1]Tarif de base'!D:E,2,FALSE)*F2226,\"\")","v":""}]
[null,"",null,null,"","",{"$f":"IFERROR(VLOOKUP(E2227,'[1]Tarif de base'!D:E,2,FALSE)*F2227,\"\")","v":""}]
[null,"",null,null,"","",{"$f":"IFERROR(VLOOKUP(E2228,'[1]Tarif de base'!D:E,2,FALSE)*F2228,\"\")","v":""}]
[null,"",null,null,"Total",{"$f":"SUM(F2223:F2228)","v":0},{"$f":"SUM(G2223:G2228)","v":0}]
["","","","","","",{"$f":"IFERROR(VLOOKUP(E2230,'[1]Tarif de base'!D:E,2,FALSE)*F2230,\"\")","v":""},"","","",{"$f":"IFERROR(IF(G2236-H2230-I2230-J2230<>0,\"Attention il manque \"&G2236-H2230-I2230-J2230&\"€\",\"Règlement OK\"),\"Pas de règlement\")","v":"Pas de règlement"},"",null,318]
[null,"",null,null,{"$f":"IFERROR(INDIRECT(\"'C:\\Users\\Moi\\OneDrive\\Documents\\[Formulaires Gravereau.xlsx]Action\"&$N2230&\"'!$D$11\"),\"\")","v":""},{"$f":"IFERROR(INDIRECT(\"'C:\\Users\\Moi\\OneDrive\\Documents\\[Formulaires Gravereau.xlsx]Action\"&$N2230&\"'!$h$11\"),\"\")","v":""},{"$f":"IFERROR(VLOOKUP(E2231,'[1]Tarif de base'!D:E,2,FALSE)*F2231,\"\")","v":""}]
[null,"",null,null,"","",{"$f":"IFERROR(VLOOKUP(E2232,'[1]Tarif de base'!D:E,2,FALSE)*F2232,\"\")","v":""}]
[null,"",null,null,"","",{"$f":"IFERROR(VLOOKUP(E2233,'[1]Tarif de base'!D:E,2,FALSE)*F2233,\"\")","v":""}]
[null,"",null,null,"","",{"$f":"IFERROR(VLOOKUP(E2234,'[1]Tarif de base'!D:E,2,FALSE)*F2234,\"\")","v":""}]
[null,"",null,null,"","",{"$f":"IFERROR(VLOOKUP(E2235,'[1]Tarif de base'!D:E,2,FALSE)*F2235,\"\")","v":""}]
[null,"",null,null,"Total",{"$f":"SUM(F2230:F2235)","v":0},{"$f":"SUM(G2230:G2235)","v":0}]
["","","","","","",{"$f":"IFERROR(VLOOKUP(E2237,'[1]Tarif de base'!D:E,2,FALSE)*F2237,\"\")","v":""},"","","",{"$f":"IFERROR(IF(G2243-H2237-I2237-J2237<>0,\"Attention il manque \"&G2243-H2237-I2237-J2237&\"€\",\"Règlement OK\"),\"Pas de règlement\")","v":"Pas de règlement"},"",null,319]
[null,"",null,null,{"$f":"IFERROR(INDIRECT(\"'C:\\Users\\Moi\\OneDrive\\Documents\\[Formulaires Gravereau.xlsx]Action\"&$N2237&\"'!$D$11\"),\"\")","v":""},{"$f":"IFERROR(INDIRECT(\"'C:\\Users\\Moi\\OneDrive\\Documents\\[Formulaires Gravereau.xlsx]Action\"&$N2237&\"'!$h$11\"),\"\")","v":""},{"$f":"IFERROR(VLOOKUP(E2238,'[1]Tarif de base'!D:E,2,FALSE)*F2238,\"\")","v":""}]
[null,"",null,null,"","",{"$f":"IFERROR(VLOOKUP(E2239,'[1]Tarif de base'!D:E,2,FALSE)*F2239,\"\")","v":""}]
[null,"",null,null,"","",{"$f":"IFERROR(VLOOKUP(E2240,'[1]Tarif de base'!D:E,2,FALSE)*F2240,\"\")","v":""}]
[null,"",null,null,"","",{"$f":"IFERROR(VLOOKUP(E2241,'[1]Tarif de base'!D:E,2,FALSE)*F2241,\"\")","v":""}]
[null,"",null,null,"","",{"$f":"IFERROR(VLOOKUP(E2242,'[1]Tarif de base'!D:E,2,FALSE)*F2242,\"\")","v":""}]
[null,"",null,null,"Total",{"$f":"SUM(F2237:F2242)","v":0},{"$f":"SUM(G2237:G2242)","v":0}]
["","","","","","",{"$f":"IFERROR(VLOOKUP(E2244,'[1]Tarif de base'!D:E,2,FALSE)*F2244,\"\")","v":""},"","","",{"$f":"IFERROR(IF(G2250-H2244-I2244-J2244<>0,\"Attention il manque \"&G2250-H2244-I2244-J2244&\"€\",\"Règlement OK\"),\"Pas de règlement\")","v":"Pas de règlement"},"",null,320]
[null,"",null,null,{"$f":"IFERROR(INDIRECT(\"'C:\\Users\\Moi\\OneDrive\\Documents\\[Formulaires Gravereau.xlsx]Action\"&$N2244&\"'!$D$11\"),\"\")","v":""},{"$f":"IFERROR(INDIRECT(\"'C:\\Users\\Moi\\OneDrive\\Documents\\[Formulaires Gravereau.xlsx]Action\"&$N2244&\"'!$h$11\"),\"\")","v":""},{"$f":"IFERROR(VLOOKUP(E2245,'[1]Tarif de base'!D:E,2,FALSE)*F2245,\"\")","v":""}]
[null,"",null,null,"","",{"$f":"IFERROR(VLOOKUP(E2246,'[1]Tarif de base'!D:E,2,FALSE)*F2246,\"\")","v":""}]
[null,"",null,null,"","",{"$f":"IFERROR(VLOOKUP(E2247,'[1]Tarif de base'!D:E,2,FALSE)*F2247,\"\")","v":""}]
[null,"",null,null,"","",{"$f":"IFERROR(VLOOKUP(E2248,'[1]Tarif de base'!D:E,2,FALSE)*F2248,\"\")","v":""}]
[null,"",null,null,"","",{"$f":"IFERROR(VLOOKUP(E2249,'[1]Tarif de base'!D:E,2,FALSE)*F2249,\"\")","v":""}]
[null,"",null,null,"Total",{"$f":"SUM(F2244:F2249)","v":0},{"$f":"SUM(G2244:G2249)","v":0}]

{"sheet":"Tarif de base","index":1,"n_rows":16,"n_cols":5,"rows_kept":16,"cut":false,"hidden":false,"merged":[]}
["Tarif de base",null,null,"Désignation avec tarif"]
[]
["Produit","Tarif",null,"Tarifs","Colonne1"]
["A.O.C. Côtes de Bourg Rouge 1995",25,null,{"$f":"A4&\" à \"&B4&\" € \"","v":"A.O.C. Côtes de Bourg Rouge 1995 à 25 € "},{"$f":"Tarif[[#This Row],[Tarif]]","v":25}]
["Rouge BP 2003(Fût de Chêne)",6,null,"Rouge BP 2003(Fût de Chêne) à 6 € ",{"$f":"Tarif[[#This Row],[Tarif]]","v":6}]
["Rouge BP 2005",5,null,"Rouge BP 2005 à 5 € ",{"$f":"Tarif[[#This Row],[Tarif]]","v":5}]
["Rouge BP  2005(Fût de Chêne)",6,null,"Rouge BP  2005(Fût de Chêne) à 6 € ",{"$f":"Tarif[[#This Row],[Tarif]]","v":6}]
["A.O.C. Côtes de Bourg Rouge 2007",5,null,"A.O.C. Côtes de Bourg Rouge 2007 à 5 € ",{"$f":"Tarif[[#This Row],[Tarif]]","v":5}]
["A.O.C. Côtes de Bourg Rouge 2012",7,null,"A.O.C. Côtes de Bourg Rouge 2012 à 7 € ",{"$f":"Tarif[[#This Row],[Tarif]]","v":7}]
["A.O.C  Côtes de Bourg Rouge 2014",7,null,"A.O.C  Côtes de Bourg Rouge 2014 à 7 € ",{"$f":"Tarif[[#This Row],[Tarif]]","v":7}]
["Bordeaux Blanc 2015",4,null,"Bordeaux Blanc 2015 à 4 € ",{"$f":"Tarif[[#This Row],[Tarif]]","v":4}]
["Bordeaux Blanc 2016",4,null,"Bordeaux Blanc 2016 à 4 € ",{"$f":"Tarif[[#This Row],[Tarif]]","v":4}]
["Bordeaux Rosé 2015",5,null,"Bordeaux Rosé 2015 à 5 € ",{"$f":"Tarif[[#This Row],[Tarif]]","v":5}]
["Bordeaux Rosé 2017",5,null,"Bordeaux Rosé 2017 à 5 € ",{"$f":"Tarif[[#This Row],[Tarif]]","v":5}]
["Clos Maine G Rouge 2014",4,null,"Clos Maine G Rouge 2014 à 4 € ",{"$f":"Tarif[[#This Row],[Tarif]]","v":4}]
["Bag in Box Bordeaux 5L  Rouge 2016 ",20,null,"Bag in Box Bordeaux 5L  Rouge 2016  à 20 € ",{"$f":"Tarif[[#This Row],[Tarif]]","v":20}]

{"sheet":"formulaire","index":2,"n_rows":8,"n_cols":1,"rows_kept":8,"cut":false,"hidden":false,"merged":[]}
[]
["Action"]
[]
["Dégustation"]
["Cadeau"]
["Vente"]
["Casse"]
["Vol"]