{"text_format":"1","workbook":"xlsx","n_sheets":3,"sheets":["Application","Tarif de base","formulaire"],"not_rendered":{"charts":0,"images":0,"macros":1,"external_links":1,"defined_names":2,"comments":0,"pivot_tables":0},"unopened":[],"bounds":{"document_bytes":16777216,"sheet_cells":100000,"rows_first":2000,"rows_last":500,"rows_between":2000,"halvings":0,"cell_chars":16384,"cell_head_chars":4096},"cells_cut":0,"cells_raw":0,"read":"whole","date_system":"1900"}

{"sheet":"Application","index":0,"n_rows":2250,"n_cols":14,"rows_kept":2250,"cut":false,"hidden":false,"merged":[[2243,9,2249,9],[2243,10,2249,10],[2243,11,2249,11],[2243,12,2249,12],[2243,13,2249,13],[2243,0,2249,0],[2243,2,2249,2],[2243,3,2249,3],[2243,7,2249,7],[2243,8,2249,8],[2236,9,2242,9],[2236,10,2242,10],[2236,11,2242,11],[2236,12,2242,12],[2236,13,2242,13],[2236,0,2242,0],[2236,2,2242,2],[2236,3,2242,3],[2236,7,2242,7],[2236,8,2242,8],[2229,9,2235,9],[2229,10,2235,10],[2229,11,2235,11],[2229,12,2235,12],[2229,13,2235,13],[2229,0,2235,0],[2229,2,2235,2],[2229,3,2235,3],[2229,7,2235,7],[2229,8,2235,8],[2222,9,2228,9],[2222,10,2228,10],[2222,11,2228,11],[2222,12,2228,12],[2222,13,2228,13],[2222,0,2228,0],[2222,2,2228,2],[2222,3,2228,3],[2222,7,2228,7],[2222,8,2228,8],[2215,9,2221,9],[2215,10,2221,10],[2215,11,2221,11],[2215,12,2221,12],[2215,13,2221,13],[2215,0,2221,0],[2215,2,2221,2],[2215,3,2221,3],[2215,7,2221,7],[2215,8,2221,8],[2208,9,2214,9],[2208,10,2214,10],[2208,11,2214,11],[2208,12,2214,12],[2208,13,2214,13],[2208,0,2214,0],[2208,2,2214,2],[2208,3,2214,3],[2208,7,2214,7],[2208,8,2214,8],[2201,9,2207,9],[2201,10,2207,10],[2201,11,2207,11],[2201,12,2207,12],[2201,13,2207,13],[2201,0,2207,0],[2201,2,2207,2],[2201,3,2207,3],[2201,7,2207,7],[2201,8,2207,8],[2194,9,2200,9],[2194,10,2200,10],[2194,11,2200,11],[2194,12,2200,12],[2194,13,2200,13],[2194,0,2200,0],[2194,2,2200,2],[2194,3,2200,3],[2194,7,2200,7],[2194,8,2200,8],[2187,9,2193,9],[2187,10,2193,10],[2187,11,2193,11],[2187,12,2193,12],[2187,13,2193,13],[2187,0,2193,0],[2187,2,2193,2],[2187,3,2193,3],[2187,7,2193,7],[2187,8,2193,8],[2180,9,2186,9],[2180,10,2186,10],[2180,11,2186,11],[2180,12,2186,12],[2180,13,2186,13],[2180,0,2186,0],[2180,2,2186,2],[2180,3,2186,3],[2180,7,2186,7],[2180,8,2186,8],[2173,9,2179,9],[2173,10,2179,10],[2173,11,2179,11],[2173,12,2179,12],[2173,13,2179,13],[2173,0,2179,0],[2173,2,2179,2],[2173,3,2179,3],[2173,7,2179,7],[2173,8,2179,8],[2166,9,2172,9],[2166,10,2172,10],[2166,11,2172,11],[2166,12,2172,12],[2166,13,2172,13],[2166,0,2172,0],[2166,2,2172,2],[2166,3,2172,3],[2166,7,2172,7],[2166,8,2172,8],[2159,9,2165,9],[2159,10,2165,10],[2159,11,2165,11],[2159,12,2165,12],[2159,13,2165,13],[2159,0,2165,0],[2159,2,2165,2],[2159,3,2165,3],[2159,7,2165,7],[2159,8,2165,8],[2152,9,2158,9],[2152,10,2158,10],[2152,11,2158,11],[2152,12,2158,12],[2152,13,2158,13],[2152,0,2158,0],[2152,2,2158,2],[2152,3,2158,3],[2152,7,2158,7],[2152,8,2158,8],[2145,9,2151,9],[2145,10,2151,10],[2145,11,2151,11],[2145,12,2151,12],[2145,13,2151,13],[2145,0,2151,0],[2145,2,2151,2],[2145,3,2151,3],[2145,7,2151,7],[2145,8,2151,8],[2138,9,2144,9],[2138,10,2144,10],[2138,11,2144,11],[2138,12,2144,12],[2138,13,2144,13],[2138,0,2144,0],[2138,2,2144,2],[2138,3,2144,3],[2138,7,2144,7],[2138,8,2144,8],[2131,9,2137,9],[2131,10,2137,10],[2131,11,2137,11],[2131,12,2137,12],[2131,13,2137,13],[2131,0,2137,0],[2131,2,2137,2],[2131,3,2137,3],[2131,7,2137,7],[2131,8,2137,8],[2124,9,2130,9],[2124,10,2130,10],[2124,11,2130,11],[2124,12,2130,12],[2124,13,2130,13],[2124,0,2130,0],[2124,2,2130,2],[2124,3,2130,3],[2124,7,2130,7],[2124,8,2130,8],[2117,9,2123,9],[2117,10,2123,10],[2117,11,2123,11],[2117,12,2123,12],[2117,13,2123,13],[2117,0,2123,0],[2117,2,2123,2],[2117,3,2123,3],[2117,7,2123,7],[2117,8,2123,8],[2110,9,2116,9],[2110,10,2116,10],[2110,11,2116,11],[2110,12,2116,12],[2110,13,2116,13],[2110,0,2116,0],[2110,2,2116,2],[2110,3,2116,3],[2110,7,2116,7],[2110,8,2116,8],[2103,9,2109,9],[2103,10,2109,10],[2103,11,2109,11],[2103,12,2109,12],[2103,13,2109,13],[2103,0,2109,0],[2103,2,2109,2],[2103,3,2109,3],[2103,7,2109,7],[2103,8,2109,8],[2096,9,2102,9],[2096,10,2102,10],[2096,11,2102,11],[2096,12,2102,12],[2096,13,2102,13],[2096,0,2102,0],[2096,2,2102,2],[2096,3,2102,3],[2096,7,2102,7],[2096,8,2102,8],[2089,9,2095,9],[2089,10,2095,10],[2089,11,2095,11],[2089,12,2095,12],[2089,13,2095,13],[2089,0,2095,0],[2089,2,2095,2],[2089,3,2095,3],[2089,7,2095,7],[2089,8,2095,8],[2082,9,2088,9],[2082,10,2088,10],[2082,11,2088,11],[2082,12,2088,12],[2082,13,2088,13],[2082,0,2088,0],[2082,2,2088,2],[2082,3,2088,3],[2082,7,2088,7],[2082,8,2088,8],[2075,9,2081,9],[2075,10,2081,10],[2075,11,2081,11],[2075,12,2081,12],[2075,13,2081,13],[2075,0,2081,0],[2075,2,2081,2],[2075,3,2081,3],[2075,7,2081,7],[2075,8,2081,8],[2068,9,2074,9],[2068,10,2074,10],[2068,11,2074,11],[2068,12,2074,12],[2068,13,2074,13],[2068,0,2074,0],[2068,2,2074,2],[2068,3,2074,3],[2068,7,2074,7],[2068,8,2074,8],[2061,9,2067,9],[2061,10,2067,10],[2061,11,2067,11],[2061,12,2067,12],[2061,13,2067,13],[2061,0,2067,0],[2061,2,2067,2],[2061,3,2067,3],[2061,7,2067,7],[2061,8,2067,8],[2054,9,2060,9],[2054,10,2060,10],[2054,11,2060,11],[2054,12,2060,12],[2054,13,2060,13],[2054,0,2060,0],[2054,2,2060,2],[2054,3,2060,3],[2054,7,2060,7],[2054,8,2060,8],[2047,9,2053,9],[2047,10,2053,10],[2047,11,2053,11],[2047,12,2053,12],[2047,13,2053,13],[2047,0,2053,0],[2047,2,2053,2],[2047,3,2053,3],[2047,7,2053,7],[2047,8,2053,8],[2040,9,2046,9],[2040,10,2046,10],[2040,11,2046,11],[2040,12,2046,12],[2040,13,2046,13],[2040,0,2046,0],[2040,2,2046,2],[2040,3,2046,3],[2040,7,2046,7],[2040,8,2046,8],[2033,9,2039,9],[2033,10,2039,10],[2033,11,2039,11],[2033,12,2039,12],[2033,13,2039,13],[2033,0,2039,0],[2033,2,2039,2],[2033,3,2039,3],[2033,7,2039,7],[2033,8,2039,8],[2026,9,2032,9],[2026,10,2032,10],[2026,11,2032,11],[2026,12,2032,12],[2026,13,2032,13],[2026,0,2032,0],[2026,2,2032,2],[2026,3,2032,3],[2026,7,2032,7],[2026,8,2032,8],[2019,9,2025,9],[2019,10,2025,10],[2019,11,2025,11],[2019,12,2025,12],[2019,13,2025,13],[2019,0,2025,0],[2019,2,2025,2],[2019,3,2025,3],[2019,7,2025,7],[2019,8,2025,8],[2012,9,2018,9],[2012,10,2018,10],[2012,11,2018,11],[2012,12,2018,12],[2012,13,2018,13],[2012,0,2018,0],[2012,2,2018,2],[2012,3,2018,3],[2012,7,2018,7],[2012,8,2018,8],[2005,9,2011,9],[2005,10,2011,10],[2005,11,2011,11],[2005,12,2011,12],[2005,13,2011,13],[2005,0,2011,0],[2005,2,2011,2],[2005,3,2011,3],[2005,7,2011,7],[2005,8,2011,8],[1998,9,2004,9],[1998,10,2004,10],[1998,11,2004,11],[1998,12,2004,12],[1998,13,2004,13],[1998,0,2004,0],[1998,2,2004,2],[1998,3,2004,3],[1998,7,2004,7],[1998,8,2004,8],[1991,9,1997,9],[1991,10,1997,10],[1991,11,1997,11],[1991,12,1997,12],[1991,13,1997,13],[1991,0,1997,0],[1991,2,1997,2],[1991,3,1997,3],[1991,7,1997,7],[1991,8,1997,8],[1984,9,1990,9],[1984,10,1990,10],[1984,11,1990,11],[1984,12,1990,12],[1984,13,1990,13],[1984,0,1990,0],[1984,2,1990,2],[1984,3,1990,3],[1984,7,1990,7],[1984,8,1990,8],[1977,9,1983,9],[1977,10,1983,10],[1977,11,1983,11],[1977,12,1983,12],[1977,13,1983,13],[1977,0,1983,0],[1977,2,1983,2],[1977,3,1983,3],[1977,7,1983,7],[1977,8,1983,8],[1970,9,1976,9],[1970,10,1976,10],[1970,11,1976,11],[1970,12,1976,12],[1970,13,1976,13],[1970,0,1976,0],[1970,2,1976,2],[1970,3,1976,3],[1970,7,1976,7],[1970,8,1976,8],[1963,9,1969,9],[1963,10,1969,10],[1963,11,1969,11],[1963,12,1969,12],[1963,13,1969,13],[1963,0,1969,0],[1963,2,1969,2],[1963,3,1969,3],[1963,7,1969,7],[1963,8,1969,8],[1956,9,1962,9],[1956,10,1962,10],[1956,11,1962,11],[1956,12,1962,12],[1956,13,1962,13],[1956,0,1962,0],[1956,2,1962,2],[1956,3,1962,3],[1956,7,1962,7],[1956,8,1962,8],[1949,9,1955,9],[1949,10,1955,10],[1949,11,1955,11],[1949,12,1955,12],[1949,13,1955,13],[1949,0,1955,0],[1949,2,1955,2],[1949,3,1955,3],[1949,7,1955,7],[1949,8,1955,8],[1942,9,1948,9],[1942,10,1948,10],[1942,11,1948,11],[1942,12,1948,12],[1942,13,1948,13],[1942,0,1948,0],[1942,2,1948,2],[1942,3,1948,3],[1942,7,1948,7],[1942,8,1948,8],[1935,9,1941,9],[1935,10,1941,10],[1935,11,1941,11],[1935,12,1941,12],[1935,13,1941,13],[1935,0,1941,0],[1935,2,1941,2],[1935,3,1941,3],[1935,7,1941,7],[1935,8,1941,8],[1928,9,1934,9],[1928,10,1934,10],[1928,11,1934,11],[1928,12,1934,12],[1928,13,1934,13],[1928,0,1934,0],[1928,2,1934,2],[1928,3,1934,3],[1928,7,1934,7],[1928,8,1934,8],[1921,9,1927,9],[1921,10,1927,10],[1921,11,1927,11],[1921,12,1927,12],[1921,13,1927,13],[1921,0,1927,0],[1921,2,1927,2],[1921,3,1927,3],[1921,7,1927,7],[1921,8,1927,8],[1914,9,1920,9],[1914,10,1920,10],[1914,11,1920,11],[1914,12,1920,12],[1914,13,1920,13],[1914,0,1920,0],[1914,2,1920,2],[1914,3,1920,3],[1914,7,1920,7],[1914,8,1920,8],[1907,9,1913,9],[1907,10,1913,10],[1907,11,1913,11],[1907,12,1913,12],[1907,13,1913,13],[1907,0,1913,0],[1907,2,1913,2],[1907,3,1913,3],[1907,7,1913,7],[1907,8,1913,8],[1900,9,1906,9],[1900,10,1906,10],[1900,11,1906,11],[1900,12,1906,12],[1900,13,1906,13],[1900,0,1906,0],[1900,2,1906,2],[1900,3,1906,3],[1900,7,1906,7],[1900,8,1906,8],[1893,9,1899,9],[1893,10,1899,10],[1893,11,1899,11],[1893,12,1899,12],[1893,13,1899,13],[1893,0,1899,0],[1893,2,1899,2],[1893,3,1899,3],[1893,7,1899,7],[1893,8,1899,8],[1886,9,1892,9],[1886,10,1892,10],[1886,11,1892,11],[1886,12,1892,12],[1886,13,1892,13],[1886,0,1892,0],[1886,2,1892,2],[1886,3,1892,3],[1886,7,1892,7],[1886,8,1892,8],[1879,9,1885,9],[1879,10,1885,10],[1879,11,1885,11],[1879,12,1885,12],[1879,13,1885,13],[1879,0,1885,0],[1879,2,1885,2],[1879,3,1885,3],[1879,7,1885,7],[1879,8,1885,8],[1872,9,1878,9],[1872,10,1878,10],[1872,11,1878,11],[1872,12,1878,12],[1872,13,1878,13],[1872,0,1878,0],[1872,2,1878,2],[1872,3,1878,3],[1872,7,1878,7],[1872,8,1878,8],[1865,9,1871,9],[1865,10,1871,10],[1865,11,1871,11],[1865,12,1871,12],[1865,13,1871,13],[1865,0,1871,0],[1865,2,1871,2],[1865,3,1871,3],[1865,7,1871,7],[1865,8,1871,8],[1858,9,1864,9],[1858,10,1864,10],[1858,11,1864,11],[1858,12,1864,12],[1858,13,1864,13],[1858,0,1864,0],[1858,2,1864,2],[1858,3,1864,3],[1858,7,1864,7],[1858,8,1864,8],[1851,9,1857,9],[1851,10,1857,10],[1851,11,1857,11],[1851,12,1857,12],[1851,13,1857,13],[1851,0,1857,0],[1851,2,1857,2],[1851,3,1857,3],[1851,7,1857,7],[1851,8,1857,8],[1844,9,1850,9],[1844,10,1850,10],[1844,11,1850,11],[1844,12,1850,12],[1844,13,1850,13],[1844,0,1850,0],[1844,2,1850,2],[1844,3,1850,3],[1844,7,1850,7],[1844,8,1850,8],[1837,9,1843,9],[1837,10,1843,10],[1837,11,1843,11],[1837,12,1843,12],[1837,13,1843,13],[1837,0,1843,0],[1837,2,1843,2],[1837,3,1843,3],[1837,7,1843,7],[1837,8,1843,8],[1830,9,1836,9],[1830,10,1836,10],[1830,11,1836,11],[1830,12,1836,12],[1830,13,1836,13],[1830,0,1836,0],[1830,2,1836,2],[1830,3,1836,3],[1830,7,1836,7],[1830,8,1836,8],[1823,9,1829,9],[1823,10,1829,10],[1823,11,1829,11],[1823,12,1829,12],[1823,13,1829,13],[1823,0,1829,0],[1823,2,1829,2],[1823,3,1829,3],[1823,7,1829,7],[1823,8,1829,8],[1816,9,1822,9],[1816,10,1822,10],[1816,11,1822,11],[1816,12,1822,12],[1816,13,1822,13],[1816,0,1822,0],[1816,2,1822,2],[1816,3,1822,3],[1816,7,1822,7],[1816,8,1822,8],[1809,9,1815,9],[1809,10,1815,10],[1809,11,1815,11],[1809,12,1815,12],[1809,13,1815,13],[1809,0,1815,0],[1809,2,1815,2],[1809,3,1815,3],[1809,7,1815,7],[1809,8,1815,8],[1802,9,1808,9],[1802,10,1808,10],[1802,11,1808,11],[1802,12,1808,12],[1802,13,1808,13],[1802,0,1808,0],[1802,2,1808,2],[1802,3,1808,3],[1802,7,1808,7],[1802,8,1808,8],[1795,9,1801,9],[1795,10,1801,10],[1795,11,1801,11],[1795,12,1801,12],[1795,13,1801,13],[1795,0,1801,0],[1795,2,1801,2],[1795,3,1801,3],[1795,7,1801,7],[1795,8,1801,8],[1788,9,1794,9],[1788,10,1794,10],[1788,11,1794,11],[1788,12,1794,12],[1788,13,1794,13],[1788,0,1794,0],[1788,2,1794,2],[1788,3,1794,3],[1788,7,1794,7],[1788,8,1794,8],[1781,9,1787,9],[1781,10,1787,10],[1781,11,1787,11],[1781,12,1787,12],[1781,13,1787,13],[1781,0,1787,0],[1781,2,1787,2],[1781,3,1787,3],[1781,7,1787,7],[1781,8,1787,8],[1774,9,1780,9],[1774,10,1780,10],[1774,11,1780,11],[1774,12,1780,12],[1774,13,1780,13],[1774,0,1780,0],[1774,2,1780,2],[1774,3,1780,3],[1774,7,1780,7],[1774,8,1780,8],[1767,9,1773,9],[1767,10,1773,10],[1767,11,1773,11],[1767,12,1773,12],[1767,13,1773,13],[1767,0,1773,0],[1767,2,1773,2],[1767,3,1773,3],[1767,7,1773,7],[1767,8,1773,8],[1760,9,1766,9],[1760,10,1766,10],[1760,11,1766,11],[1760,12,1766,12],[1760,13,1766,13],[1760,0,1766,0],[1760,2,1766,2],[1760,3,1766,3],[1760,7,1766,7],[1760,8,1766,8],[1753,9,1759,9],[1753,10,1759,10],[1753,11,1759,11],[1753,12,1759,12],[1753,13,1759,13],[1753,0,1759,0],[1753,2,1759,2],[1753,3,1759,3],[1753,7,1759,7],[1753,8,1759,8],[1746,9,1752,9],[1746,10,1752,10],[1746,11,1752,11],[1746,12,1752,12],[1746,13,1752,13],[1746,0,1752,0],[1746,2,1752,2],[1746,3,1752,3],[1746,7,1752,7],[1746,8,1752,8],[1739,9,1745,9],[1739,10,1745,10],[1739,11,1745,11],[1739,12,1745,12],[1739,13,1745,13],[1739,0,1745,0],[1739,2,1745,2],[1739,3,1745,3],[1739,7,1745,7],[1739,8,1745,8],[1732,9,1738,9],[1732,10,1738,10],[1732,11,1738,11],[1732,12,1738,12],[1732,13,1738,13],[1732,0,1738,0],[1732,2,1738,2],[1732,3,1738,3],[1732,7,1738,7],[1732,8,1738,8],[1725,9,1731,9],[1725,10,1731,10],[1725,11,1731,11],[1725,12,1731,12],[1725,13,1731,13],[1725,0,1731,0],[1725,2,1731,2],[1725,3,1731,3],[1725,7,1731,7],[1725,8,1731,8],[1718,9,1724,9],[1718,10,1724,10],[1718,11,1724,11],[1718,12,1724,12],[1718,13,1724,13],[1718,0,1724,0],[1718,2,1724,2],[1718,3,1724,3],[1718,7,1724,7],[1718,8,1724,8],[1711,9,1717,9],[1711,10,1717,10],[1711,11,1717,11],[1711,12,1717,12],[1711,13,1717,13],[1711,0,1717,0],[1711,2,1717,2],[1711,3,1717,3],[1711,7,1717,7],[1711,8,1717,8],[1704,9,1710,9],[1704,10,1710,10],[1704,11,1710,11],[1704,12,1710,12],[1704,13,1710,13],[1704,0,1710,0],[1704,2,1710,2],[1704,3,1710,3],[1704,7,1710,7],[1704,8,1710,8],[1697,9,1703,9],[1697,10,1703,10],[1697,11,1703,11],[1697,12,1703,12],[1697,13,1703,13],[1697,0,1703,0],[1697,2,1703,2],[1697,3,1703,3],[1697,7,1703,7],[1697,8,1703,8],[1690,9,1696,9],[1690,10,1696,10],[1690,11,1696,11],[1690,12,1696,12],[1690,13,1696,13],[1690,0,1696,0],[1690,2,1696,2],[1690,3,1696,3],[1690,7,1696,7],[1690,8,1696,8],[1683,9,1689,9],[1683,10,1689,10],[1683,11,1689,11],[1683,12,1689,12],[1683,13,1689,13],[1683,0,1689,0],[1683,2,1689,2],[1683,3,1689,3],[1683,7,1689,7],[1683,8,1689,8],[1676,9,1682,9],[1676,10,1682,10],[1676,11,1682,11],[1676,12,1682,12],[1676,13,1682,13],[1676,0,1682,0],[1676,2,1682,2],[1676,3,1682,3],[1676,7,1682,7],[1676,8,1682,8],[1669,9,1675,9],[1669,10,1675,10],[1669,11,1675,11],[1669,12,1675,12],[1669,13,1675,13],[1669,0,1675,0],[1669,2,1675,2],[1669,3,1675,3],[1669,7,1675,7],[1669,8,1675,8],[1662,9,1668,9],[1662,10,1668,10],[1662,11,1668,11],[1662,12,1668,12],[1662,13,1668,13],[1662,0,1668,0],[1662,2,1668,2],[1662,3,1668,3],[1662,7,1668,7],[1662,8,1668,8],[1655,9,1661,9],[1655,10,1661,10],[1655,11,1661,11],[1655,12,1661,12],[1655,13,1661,13],[1655,0,1661,0],[1655,2,1661,2],[1655,3,1661,3],[1655,7,1661,7],[1655,8,1661,8],[1648,9,1654,9],[1648,10,1654,10],[1648,11,1654,11],[1648,12,1654,12],[1648,13,1654,13],[1648,0,1654,0],[1648,2,1654,2],[1648,3,1654,3],[1648,7,1654,7],[1648,8,1654,8],[1641,9,1647,9],[1641,10,1647,10],[1641,11,1647,11],[1641,12,1647,12],[1641,13,1647,13],[1641,0,1647,0],[1641,2,1647,2],[1641,3,1647,3],[1641,7,1647,7],[1641,8,1647,8],[1634,9,1640,9],[1634,10,1640,10],[1634,11,1640,11],[1634,12,1640,12],[1634,13,1640,13],[1634,0,1640,0],[1634,2,1640,2],[1634,3,1640,3],[1634,7,1640,7],[1634,8,1640,8],[1627,9,1633,9],[1627,10,1633,10],[1627,11,1633,11],[1627,12,1633,12],[1627,13,1633,13],[1627,0,1633,0],[1627,2,1633,2],[1627,3,1633,3],[1627,7,1633,7],[1627,8,1633,8],[1620,9,1626,9],[1620,10,1626,10],[1620,11,1626,11],[1620,12,1626,12],[1620,13,1626,13],[1620,0,1626,0],[1620,2,1626,2],[1620,3,1626,3],[1620,7,1626,7],[1620,8,1626,8],[1613,9,1619,9],[1613,10,1619,10],[1613,11,1619,11],[1613,12,1619,12],[1613,13,1619,13],[1613,0,1619,0],[1613,2,1619,2],[1613,3,1619,3],[1613,7,1619,7],[1613,8,1619,8],[1606,9,1612,9],[1606,10,1612,10],[1606,11,1612,11],[1606,12,1612,12],[1606,13,1612,13],[1606,0,1612,0],[1606,2,1612,2],[1606,3,1612,3],[1606,7,1612,7],[1606,8,1612,8],[1599,9,1605,9],[1599,10,1605,10],[1599,11,1605,11],[1599,12,1605,12],[1599,13,1605,13],[1599,0,1605,0],[1599,2,1605,2],[1599,3,1605,3],[1599,7,1605,7],[1599,8,1605,8],[1592,9,1598,9],[1592,10,1598,10],[1592,11,1598,11],[1592,12,1598,12],[1592,13,1598,13],[1592,0,1598,0],[1592,2,1598,2],[1592,3,1598,3],[1592,7,1598,7],[1592,8,1598,8],[1585,9,1591,9],[1585,10,1591,10],[1585,11,1591,11],[1585,12,1591,12],[1585,13,1591,13],[1585,0,1591,0],[1585,2,1591,2],[1585,3,1591,3],[1585,7,1591,7],[1585,8,1591,8],[1578,9,1584,9],[1578,10,1584,10],[1578,11,1584,11],[1578,12,1584,12],[1578,13,1584,13],[1578,0,1584,0],[1578,2,1584,2],[1578,3,1584,3],[1578,7,1584,7],[1578,8,1584,8],[1571,9,1577,9],[1571,10,1577,10],[1571,11,1577,11],[1571,12,1577,12],[1571,13,1577,13],[1571,0,1577,0],[1571,2,1577,2],[1571,3,1577,3],[1571,7,1577,7],[1571,8,1577,8],[1564,9,1570,9],[1564,10,1570,10],[1564,11,1570,11],[1564,12,1570,12],[1564,13,1570,13],[1564,0,1570,0],[1564,2,1570,2],[1564,3,1570,3],[1564,7,1570,7],[1564,8,1570,8],[1557,9,1563,9],[1557,10,1563,10],[1557,11,1563,11],[1557,12,1563,12],[1557,13,1563,13],[1557,0,1563,0],[1557,2,1563,2],[1557,3,1563,3],[1557,7,1563,7],[1557,8,1563,8],[1550,9,1556,9],[1550,10,1556,10],[1550,11,1556,11],[1550,12,1556,12],[1550,13,1556,13],[1550,0,1556,0],[1550,2,1556,2],[1550,3,1556,3],[1550,7,1556,7],[1550,8,1556,8]],"merged_total":3200,"flags":["merged_cut"]}
[]
[]
[]
[]
[]
[]
[]
[]
[]
["Action","Mois","Date","Client","Produits ","Qté de bouteille ou litre","Montant","Somme reçue en CB","Somme reçue en chèque","Somme reçue en espèces","Contrôle","Observations","Comptabilisé\noui/non","n°action"]
[{"$f":"IFERROR(INDIRECT(\"'C:\\Users\\Moi\\OneDrive\\Documents\\[Formulaires Gravereau.xlsx]Action\"&$N11&\"'!$D$6\"),\"\")","v":""},{"$f":"IF(C11<>\"\",C11,\"\")","v":""},{"$f":"IFERROR(INDIRECT(\"'C:\\Users\\Moi\\OneDrive\\Documents\\[Formulaires Gravereau.xlsx]Action\"&ROW()-10&\"'!$D$4\"),\"\")","v":""},{"$f":"IFERROR(INDIRECT(\"'C:\\Users\\Moi\\OneDrive\\Documents\\[Formulaires Gravereau.xlsx]Action\"&ROW()-10&\"'!$h$4\"),\"\")","v":""},{"$f":"IFERROR(INDIRECT(\"'C:\\Users\\Moi\\OneDrive\\Documents\\[Formulaires G.xlsx]Action\"&ROW()-10&\"'!$D$9\"),\"\")","v":""},{"$f":"IFERROR(INDIRECT(\"'C:\\Users\\Moi\\OneDrive\\Documents\\[Formulaires G.xlsx]Action\"&ROW()-10&\"'!$h$9\"),\"\")","v":""},{"$f":"IFERROR(VLOOKUP(E11,'Tarif de base'!D:E,2,FALSE)*F11,\"\")","v":""},{"$f":"IFERROR(INDIRECT(\"'C:\\Users\\Moi\\OneDrive\\Documents\\[Formulaires G.xlsx]Action\"&ROW()-10&\"'!$d$26\"),\"\")","v":""},{"$f":"IFERROR(INDIRECT(\"'C:\\Users\\Moi\\OneDrive\\Documents\\[Formulaires G.xlsx]Action\"&ROW()-10&\"'!$d$28\"),\"\")","v":""},{"$f":"IFERROR(INDIRECT(\"'C:\\Users\\Moi\\OneDrive\\Documents\\[Formulaires G.xlsx]Action\"&ROW()-10&\"'!$h$26\"),\"\")","v":""},{"$f":"IFERROR(IF(G17-H11-I11-J11<>0,\"Attention il manque \"&G17-H11-I11-J11&\"€\",\"Règlement OK\"),\"Pas de règlement\")","v":"Pas de règlement"},{"$f":"IFERROR(INDIRECT(\"'C:\\Users\\Moi\\OneDrive\\Documents\\[Formulaires G.xlsx]Action\"&ROW()-10&\"'!$d$30\"),\"\")","v":""},null,1]
[null,{"$f":"B11","v":""},null,null,{"$f":"IFERROR(INDIRECT(\"'C:\\Users\\Moi\\OneDrive\\Documents\\[Formulaires G.xlsx]Action\"&ROW()-11&\"'!$D$13\"),\"\")","v":""},{"$f":"IFERROR(INDIRECT(\"'C:\\Users\\Moi\\OneDrive\\Documents\\[Formulaires G.xlsx]Action\"&ROW()-11&\"'!$h$11\"),\"\")","v":""},{"$f":"IFERROR(VLOOKUP(E12,'Tarif de base'!D:E,2,FALSE)*F12,\"\")","v":""}]
[null,"",null,null,{"$f":"IFERROR(INDIRECT(\"'C:\\Users\\Moi\\OneDrive\\Documents\\[Formulaires G.xlsx]Action\"&ROW()-12&\"'!$D$11\"),\"\")","v":""},{"$f":"IFERROR(INDIRECT(\"'C:\\Users\\Moi\\OneDrive\\Documents\\[Formulaires G.xlsx]Action\"&ROW()-12&\"'!$h$13\"),\"\")","v":""},{"$f":"IFERROR(VLOOKUP(E13,'Tarif de base'!D:E,2,FALSE)*F13,\"\")","v":""}]
[null,"",null,null,{"$f":"IFERROR(INDIRECT(\"'C:\\Users\\Moi\\OneDrive\\Documents\\[Formulaires G.xlsx]Action\"&ROW()-13&\"'!$D$15\"),\"\")","v":""},{"$f":"IFERROR(INDIRECT(\"'C:\\Users\\Moi\\OneDrive\\Documents\\[Formulaires G.xlsx]Action\"&ROW()-13&\"'!$h$15\"),\"\")","v":""},{"$f":"IFERROR(VLOOKUP(E14,'Tarif de base'!D:E,2,FALSE)*F14,\"\")","v":""}]
[null,"",null,null,{"$f":"IFERROR(INDIRECT(\"'C:\\Users\\Moi\\OneDrive\\Documents\\[Formulaires G.xlsx]Action\"&ROW()-14&\"'!$D$17\"),\"\")","v":""},{"$f":"IFERROR(INDIRECT(\"'C:\\Users\\Moi\\OneDrive\\Documents\\[Formulaires G.xlsx]Action\"&ROW()-14&\"'!$h$17\"),\"\")","v":""},{"$f":"IFERROR(VLOOKUP(E15,'Tarif de base'!D:E,2,FALSE)*F15,\"\")","v":""}]
[null,"",null,null,{"$f":"IFERROR(INDIRECT(\"'C:\\Users\\Moi\\OneDrive\\Documents\\[Formulaires G.xlsx]Action\"&ROW()-15&\"'!$D$19\"),\"\")","v":""},{"$f":"IFERROR(INDIRECT(\"'C:\\Users\\Moi\\OneDrive\\Documents\\[Formulaires G.xlsx]Action\"&ROW()-15&\"'!$h$19\"),\"\")","v":""},{"$f":"IFERROR(VLOOKUP(E16,'Tarif de base'!D:E,2,FALSE)*F16,\"\")","v":""}]
[null,"",null,null,"Total",{"$f":"SUM(F11:F16)","v":0},{"$f":"SUM(G11:G16)","v":0}]
[{"$f":"IFERROR(INDIRECT(\"'C:\\Users\\Moi\\OneDrive\\Documents\\[Formulaires Gravereau.xlsx]Action\"&$N18&\"'!$D$6\"),\"\")","v":""},{"$f":"IF(C18<>\"\",C18,\"\")","v":""},{"$f":"IFERROR(INDIRECT(\"'C:\\Users\\Moi\\OneDrive\\Documents\\[Formulaires Gravereau.xlsx]Action\"&$N18&\"'!$D$4\"),\"\")","v":""},{"$f":"IFERROR(INDIRECT(\"'C:\\Users\\Moi\\OneDrive\\Documents\\[Formulaires Gravereau.xlsx]Action\"&$N18&\"'!$h$4\"),\"\")","v":""},{"$f":"IFERROR(INDIRECT(\"'C:\\Users\\Moi\\OneDrive\\Documents\\[Formulaires G.xlsx]Action\"&$N18&\"'!$D$9\"),\"\")","v":""},{"$f":"IFERROR(INDIRECT(\"'C:\\Users\\Moi\\OneDrive\\Documents\\[Formulaires G.xlsx]Action\"&$N18&\"'!$h$9\"),\"\")","v":""},{"$f":"IFERROR(VLOOKUP(E18,'Tarif de base'!D:E,2,FALSE)*F18,\"\")","v":""},{"$f":"IFERROR(INDIRECT(\"'C:\\Users\\Moi\\OneDrive\\Documents\\[Formulaires G.xlsx]Action\"&$N18&\"'!$d$26\"),\"\")","v":""},{"$f":"IFERROR(INDIRECT(\"'C:\\Users\\Moi\\OneDrive\\Documents\\[Formulaires G.xlsx]Action\"&$N18&\"'!$d$28\"),\"\")","v":""},{"$f":"IFERROR(INDIRECT(\"'C:\\Users\\Moi\\OneDrive\\Documents\\[Formulaires G.xlsx]Action\"&$N18&\"'!$h$26\"),\"\")","v":""},{"$f":"IFERROR(IF(G24-H18-I18-J18<>0,\"Attention il manque \"&G24-H18-I18-J18&\"€\",\"Règlement OK\"),\"Pas de règlement\")","v":"Pas de règlement"},{"$f":"IFERROR(INDIRECT(\"'C:\\Users\\Moi\\OneDrive\\Documents\\[Formulaires G.xlsx]Action\"&$N18&\"'!$d$30\"),\"\")","v":""},null,2]
[null,"",null,null,{"$f":"IFERROR(INDIRECT(\"'C:\\Users\\Moi\\OneDrive\\Documents\\[Formulaires G.xlsx]Action\"&$N18&\"'!$D$11\"),\"\")","v":""},{"$f":"IFERROR(INDIRECT(\"'C:\\Users\\Moi\\OneDrive\\Documents\\[Formulaires G.xlsx]Action\"&$N18&\"'!$h$11\"),\"\")","v":""},{"$f":"IFERROR(VLOOKUP(E19,'Tarif de base'!D:E,2,FALSE)*F19,\"\")","v":""}]
[null,"",null,null,{"$f":"IFERROR(INDIRECT(\"'C:\\Users\\Moi\\OneDrive\\Documents\\[Formulaires G.xlsx]Action\"&$N18&\"'!$D$13\"),\"\")","v":""},{"$f":"IFERROR(INDIRECT(\"'C:\\Users\\Moi\\OneDrive\\Documents\\[Formulaires G.xlsx]Action\"&$N18&\"'!$h$13\"),\"\")","v":""},{"$f":"IFERROR(VLOOKUP(E20,'Tarif de base'!D:E,2,FALSE)*F20,\"\")","v":""}]
{"$rows_left_out":2231}
{"sheet":"Tarif de base","index":1,"n_rows":16,"n_cols":5,"rows_kept":16,"cut":false,"hidden":false,"merged":[]}
["Tarif de base",null,null,"Désignation avec tarif"]
[]
["Produit","Tarif",null,"Tarifs","Colonne1"]
["A.O.C. Côtes de Bourg Rouge 1995",25,null,{"$f":"A4&\" à \"&B4&\" € \"","v":"A.O.C. Côtes de Bourg Rouge 1995 à 25 € "},{"$f":"Tarif[[#This Row],[Tarif]]","v":25}]
["Rouge BP 2003(Fût de Chêne)",6,null,"Rouge BP 2003(Fût de Chêne) à 6 € ",{"$f":"Tarif[[#This Row],[Tarif]]","v":6}]
["Rouge BP 2005",5,null,"Rouge BP 2005 à 5 € ",{"$f":"Tarif[[#This Row],[Tarif]]","v":5}]
["Rouge BP  2005(Fût de Chêne)",6,null,"Rouge BP  2005(Fût de Chêne) à 6 € ",{"$f":"Tarif[[#This Row],[Tarif]]","v":6}]
["A.O.C. Côtes de Bourg Rouge 2007",5,null,"A.O.C. Côtes de Bourg Rouge 2007 à 5 € ",{"$f":"Tarif[[#This Row],[Tarif]]","v":5}]
["A.O.C. Côtes de Bourg Rouge 2012",7,null,"A.O.C. Côtes de Bourg Rouge 2012 à 7 € ",{"$f":"Tarif[[#This Row],[Tarif]]","v":7}]
["A.O.C  Côtes de Bourg Rouge 2014",7,null,"A.O.C  Côtes de Bourg Rouge 2014 à 7 € ",{"$f":"Tarif[[#This Row],[Tarif]]","v":7}]
["Bordeaux Blanc 2015",4,null,"Bordeaux Blanc 2015 à 4 € ",{"$f":"Tarif[[#This Row],[Tarif]]","v":4}]
["Bordeaux Blanc 2016",4,null,"Bordeaux Blanc 2016 à 4 € ",{"$f":"Tarif[[#This Row],[Tarif]]","v":4}]
["Bordeaux Rosé 2015",5,null,"Bordeaux Rosé 2015 à 5 € ",{"$f":"Tarif[[#This Row],[Tarif]]","v":5}]
["Bordeaux Rosé 2017",5,null,"Bordeaux Rosé 2017 à 5 € ",{"$f":"Tarif[[#This Row],[Tarif]]","v":5}]
["Clos Maine G Rouge 2014",4,null,"Clos Maine G Rouge 2014 à 4 € ",{"$f":"Tarif[[#This Row],[Tarif]]","v":4}]
["Bag in Box Bordeaux 5L  Rouge 2016 ",20,null,"Bag in Box Bordeaux 5L  Rouge 2016  à 20 € ",{"$f":"Tarif[[#This Row],[Tarif]]","v":20}]

{"sheet":"formulaire","index":2,"n_rows":8,"n_cols":1,"rows_kept":8,"cut":false,"hidden":false,"merged":[]}
[]
["Action"]
[]
["Dégustation"]
["Cadeau"]
["Vente"]
["Casse"]
["Vol"]