{"text_format":"1","workbook":"xlsx","n_sheets":15,"sheets":["GESTION A","GESTION B","GESTION C","VIDES A","VIDES B","MACHINES ","REFERENCES A","REFERENCES B","REFERENCES C","DESIGNATIONS","CLIENTS","ADRESSES A","ADRESSES B","ADRESSES C","VALORISATION DES STOCKS A B C"],"not_rendered":{"charts":0,"images":0,"macros":1,"external_links":0,"defined_names":18,"comments":0,"pivot_tables":0},"unopened":[],"bounds":{"document_bytes":16777216,"sheet_cells":100000,"rows_first":2000,"rows_last":500,"rows_between":2000,"halvings":0,"cell_chars":16384,"cell_head_chars":4096},"cells_cut":0,"cells_raw":0,"read":"whole","date_system":"1900"}

{"sheet":"GESTION A","index":0,"n_rows":447,"n_cols":8,"rows_kept":447,"cut":false,"hidden":false,"merged":[[0,2,0,4],[0,7,0,8],[0,0,0,1]]}
[null,null,"GESTION DE STOCK A"]
["ADRESSE","MACHINES","REFERENCES","DESIGNATIONS","FIFO","STOCKS","POIDS/PIECE","POIDS TOTAL"]
[null,null,null,null,null,null,null,{"$f":"IF(G3>0,G3*F3,\" \")","v":""}]
["A0101","SIRUGUE","M110","EBAUCHE 2 FACES",null,17,1123,{"$f":"IF(G4>0,G4*F4,\" \")","v":19091}]
["A0102","SIRUGUE","M110","EBAUCHE 1 FACE",null,23,1753,{"$f":"IF(G5>0,G5*F5,\" \")","v":40319}]
["A0103","SIRUGUE","M110","EBAUCHE 1 FACE",null,24,1753,42072]
["A0104","SIRUGUE","M110","EBAUCHE 1 FACE",null,19,1753,33307]
["A0105","SIRUGUE","M110","EBAUCHE 1 FACE",null,13,1753,22789]
["A0106-A","SIRUGUE","M40","EBAUCHE PERCEE",null,7,143,1001]
["A0106-B","SIRUGUE","M40","EBAUCHE FRAISEE NON PERCEE",null,28,187,5236]
["A0107","SIRUGUE","M40","EBAUCHE FRAISEE",null,213,153,32589]
["A0108","SIRUGUE","M40","EBAUCHE FRAISEE",null,215,153,32895]
["A0109","SIRUGUE","M40","EBAUCHE",null,137,190,26030]
["A0109","SIRUGUE","M40","EBAUCHE SCS",null,0,null,""]
["A0110","SIRUGUE","M34","EBAUCHE FRAISEE PERCEE",null,29,84,2436]
["A0111-A","SIRUGUE","M34","EBAUCHE PERCEE Ø16",null,3,98,294]
["A0111-B","SIRUGUE","M34","EBAUCHE",null,75,114,8550]
["A0112-A","SIRUGUE","M14","EBAUCHE",null,72,5,360]
["A0112-B","SIRUGUE","M24","EBAUCHE",null,188,44,8272]
["A0113","SIRUGUE","PC16","Ø26",null,130,110,14300]
["A0114","SIRUGUE","PC16","SUPERIEUR CORPS 20",null,180,84,15120]
["A0115","SIRUGUE","PC16","EBAUCHE 1 REPERE",null,312,69,21528]
["A0116","SIRUGUE","PC14","SUPERIEUR CORPS 20",null,272,60,16320]
["A0117","SIRUGUE","PC14","SUPERIEUR CORPS 19,5",null,295,58,17110]
["A0118-A","SIRUGUE","PC14","SUPERIEUR CORPS 20",null,76,67,5092]
["A0118-B","SIRUGUE","PC14","EBAUCHE 1 REPERE",null,187,42,7854]
["A0119-A","SIRUGUE","PC10","EBAUCHE FRAISEE",null,79,26,2054]
["A0119-A","SIRUGUE","PC10","EBAUCHE NON FRAISEE Ø10",null,76,26,1976]
["A0119-B","SIRUGUE","PC10","EBAUCHE NON FRAISEE Ø6",null,24,20,480]
["A0119-B","SIRUGUE","PC10","EBAUCHE NON FRAISEE \u009d\u009dØ8",null,126,14,1764]
{"$rows_left_out":418}
{"sheet":"GESTION B","index":1,"n_rows":418,"n_cols":9,"rows_kept":418,"cut":false,"hidden":false,"merged":[[0,1,0,4],[0,6,0,7]]}
[null,"GESTION DE STOCK B"]
["ADRESSES","MACHINES","REFERENCES","DESIGNATIONS","FIFO","STOCKS","POIDS/PIECE","POIDS TOTAL"]
[null,null,null,null,null," ",null,{"$f":"IF(G3>0,G3*F3,\" \")","v":""}]
["B0101-A","KINGSLAND",9001,"EBAUCHE FRAISEE",null,45,357,{"$f":"IF(G4>0,G4*F4,\" \")","v":16065}]
["B0101-B","KINGSLAND",9001,"EBAUCHE FRAISEE L90",null,0,null,""]
["B0102-A","KINGSLAND",9001,"EBAUCHE FRAISEE L70",null,12,414,4968]
["B0102-B","KINGSLAND",9001,"EBAUCHE FRAISEE L71",null,1,418,418]
["B0103-A","KINGSLAND",9001,"EBAUCHE FRAISEE L80",null,2,471,942]
["B0103-B","KINGSLAND",9001,"EBAUCHE FRAISEE L97",null,1,573,573]
["B0104","KINGSLAND",9004,"EBAUCHE FRAISEE",null,2,550,1100]
["B0105","KINGSLAND",9004,"EBAUCHE FRAISEE",null,200,null," "]
["B0106-A","KINGSLAND",9004,"EBAUCHE FRAISEE L80",null,0," ",{"$f":"IF(F12>0,G12*F12,\" \")","v":""}]
["B0106-B","KINGSLAND",9004,"EBAUCHE FRAISEE L120",null,0,null,""]
["B0106-C","KINGSLAND",9004,"EBAUCHE FRAISEE L140",null,1,1244,1244]
["B0107","KINGSLAND",9007,"EBAUCHE FRAISEE",null,0,null,""]
["B0108","KINGSLAND",9007,"EBAUCHE FRAISEE",null,12,null," "]
["B0109","KINGSLAND",9006,"EBAUCHE FRAISEE",null,27,739,19953]
["B0110","KINGSLAND",9006,"EBAUCHE FRAISEE",null,0,null,""]
["B0111","KINGSLAND",9009,"EBAUCHE FRAISEE",null,12,1525,18300]
["B0112","KINGSLAND",9009,"EBAUCHE FRAISEE",null,0,null,""]
["B0113-A","KINGSLAND",9006,"EBAUCHE FRAISEE L…",null,0,null,""]
["B0113-B","KINGSLAND",9009,"EBAUCHE FRAISEE L…",null,11,1524,16764]
["B0114","KINGSLAND",9010,"EBAUCHE FRAISEE",null,12,3380,40560]
["B0115","KINGSLAND",9010,"EBAUCHE FRAISEE L70",null,4,3120,12480]
["B0116","KINGSLAND",9010,"EBAUCHE NON TOURNEE",null,4,3820,15280]
["B0117","KINGSLAND",9010,"EBAUCHE NON TOURNEE",null,12,3820,45840]
["B0118","KINGSLAND",9010,"EBAUCHE NON TOURNEE",null,12,3820,45840]
["B0119-A","KINGSLAND",9011,"EBAUCHE FRAISEE",null,6,5660,33960]
["B0119-B",null,null,null,null,null,null,""]
["B0119-C",null,null,null,null,null,null,""]
{"$rows_left_out":389}
{"sheet":"GESTION C","index":2,"n_rows":332,"n_cols":8,"rows_kept":332,"cut":false,"hidden":false,"merged":[[0,2,0,4]]}
[null,null,"GESTION DE STOCK C"]
["ADRESSE","MACHINES","REFERENCES","DESIGNATIONS","FIFO","STOCKS","POIDS/PIECE","POIDS TOTAL"]
[null,null,null,null,null,null,null,{"$f":"IF(F3>0,F3*G3/1000,\" \")","v":""}]
["C0901","VERNET","5013710-1","EBAUCHE",null,0,125,{"$f":"IF(F4>0,F4*G4/1000,\" \")","v":""}]
["C0902",null,null,null,null,null,null,""]
["C0903",null,null,null,null,null,null,""]
["C0904",null,null,null,null,null,null,""]
["C0905",null,null,null,null,null,null,""]
["C0906",null,null,null,null,null,null,""]
["C0907",null,null,null,null,null,null,""]
["C0908",null,null,null,null,null,null,""]
["C0909",null,null,null,null,null,null,""]
["C0910",null,null,null,null,null,null,""]
["C0911",null,null,null,null,null,null,""]
["C0912",null,null,null,null,null,null,""]
["C0913",null,null,null,null,null,null,""]
["C0914",null,null,null,null,null,null,""]
["C0915",null,null,null,null,null,null,""]
["C0916",null,null,null,null,12,null,0]
["C0917",null,null,null,null,null,null,""]
["C1001",null,null,null,null,null,null,""]
["C1002",null,null,null,null,null,null,""]
["C1003",null,null,null,null,null,null,""]
["C1004",null,null,null,null,null,null,""]
["C1005",null,null,null,null,null,null,""]
["C1006",null,null,null,null,null,null,""]
["C1007",null,null,null,null,null,null,""]
["C1008",null,null,null,null,null,null,""]
["C1009",null,null,null,null,null,null,""]
["C1010",null,null,null,null,null,null,""]
{"$rows_left_out":303}
{"sheet":"VIDES A","index":3,"n_rows":403,"n_cols":4,"rows_kept":403,"cut":false,"hidden":false,"merged":[[3,0,4,1]]}
["     EMPLACEMENTS VIDES ETAGERE A"]
[]
[]
[]
[]
["ADRESSES","MACHINE","REFERENCE","DESIGNATION"]
[{"$f":"IF('GESTION A'!F4<=0,'GESTION A'!A4,\" \")","v":" "},{"$f":"IF('GESTION A'!F4<=0,'GESTION A'!B4,\" \")","v":" "},{"$f":"IF('GESTION A'!F4<=0,'GESTION A'!C4,\" \" )","v":" "},{"$f":"IF('GESTION A'!F4<=0,'GESTION A'!D4,\" \")","v":" "}]
[{"$f":"IF('GESTION A'!F5<=0,'GESTION A'!A5,\" \")","v":" "},{"$f":"IF('GESTION A'!F5<=0,'GESTION A'!B5,\" \")","v":" "},{"$f":"IF('GESTION A'!F5<=0,'GESTION A'!C5,\" \" )","v":" "},{"$f":"IF('GESTION A'!F5<=0,'GESTION A'!D5,\" \")","v":" "}]
[{"$f":"IF('GESTION A'!F6<=0,'GESTION A'!A6,\" \")","v":" "},{"$f":"IF('GESTION A'!F6<=0,'GESTION A'!B6,\" \")","v":" "},{"$f":"IF('GESTION A'!F6<=0,'GESTION A'!C6,\" \" )","v":" "},{"$f":"IF('GESTION A'!F6<=0,'GESTION A'!D6,\" \")","v":" "}]
[{"$f":"IF('GESTION A'!F7<=0,'GESTION A'!A7,\" \")","v":" "},{"$f":"IF('GESTION A'!F7<=0,'GESTION A'!B7,\" \")","v":" "},{"$f":"IF('GESTION A'!F7<=0,'GESTION A'!C7,\" \" )","v":" "},{"$f":"IF('GESTION A'!F7<=0,'GESTION A'!D7,\" \")","v":" "}]
[{"$f":"IF('GESTION A'!F8<=0,'GESTION A'!A8,\" \")","v":" "},{"$f":"IF('GESTION A'!F8<=0,'GESTION A'!B8,\" \")","v":" "},{"$f":"IF('GESTION A'!F8<=0,'GESTION A'!C8,\" \" )","v":" "},{"$f":"IF('GESTION A'!F8<=0,'GESTION A'!D8,\" \")","v":" "}]
[{"$f":"IF('GESTION A'!F10<=0,'GESTION A'!A10,\" \")","v":" "},{"$f":"IF('GESTION A'!F10<=0,'GESTION A'!B10,\" \")","v":" "},{"$f":"IF('GESTION A'!F10<=0,'GESTION A'!C10,\" \" )","v":" "},{"$f":"IF('GESTION A'!F10<=0,'GESTION A'!D10,\" \")","v":" "}]
[{"$f":"IF('GESTION A'!F11<=0,'GESTION A'!A11,\" \")","v":" "},{"$f":"IF('GESTION A'!F11<=0,'GESTION A'!B11,\" \")","v":" "},{"$f":"IF('GESTION A'!F11<=0,'GESTION A'!C11,\" \" )","v":" "},{"$f":"IF('GESTION A'!F11<=0,'GESTION A'!D11,\" \")","v":" "}]
[{"$f":"IF('GESTION A'!F12<=0,'GESTION A'!A12,\" \")","v":" "},{"$f":"IF('GESTION A'!F12<=0,'GESTION A'!B12,\" \")","v":" "},{"$f":"IF('GESTION A'!F12<=0,'GESTION A'!C12,\" \" )","v":" "},{"$f":"IF('GESTION A'!F12<=0,'GESTION A'!D12,\" \")","v":" "}]
[{"$f":"IF('GESTION A'!F13<=0,'GESTION A'!A13,\" \")","v":" "},{"$f":"IF('GESTION A'!F13<=0,'GESTION A'!B13,\" \")","v":" "},{"$f":"IF('GESTION A'!F13<=0,'GESTION A'!C13,\" \" )","v":" "},{"$f":"IF('GESTION A'!F13<=0,'GESTION A'!D13,\" \")","v":" "}]
[{"$f":"IF('GESTION A'!F14<=0,'GESTION A'!A14,\" \")","v":"A0109"},{"$f":"IF('GESTION A'!F14<=0,'GESTION A'!B14,\" \")","v":"SIRUGUE"},{"$f":"IF('GESTION A'!F14<=0,'GESTION A'!C14,\" \" )","v":"M40"},{"$f":"IF('GESTION A'!F14<=0,'GESTION A'!D14,\" \")","v":"EBAUCHE SCS"}]
[{"$f":"IF('GESTION A'!F15<=0,'GESTION A'!A15,\" \")","v":" "},{"$f":"IF('GESTION A'!F15<=0,'GESTION A'!B15,\" \")","v":" "},{"$f":"IF('GESTION A'!F15<=0,'GESTION A'!C15,\" \" )","v":" "},{"$f":"IF('GESTION A'!F15<=0,'GESTION A'!D15,\" \")","v":" "}]
[{"$f":"IF('GESTION A'!F16<=0,'GESTION A'!A16,\" \")","v":" "},{"$f":"IF('GESTION A'!F16<=0,'GESTION A'!B16,\" \")","v":" "},{"$f":"IF('GESTION A'!F16<=0,'GESTION A'!C16,\" \" )","v":" "},{"$f":"IF('GESTION A'!F16<=0,'GESTION A'!D16,\" \")","v":" "}]
[{"$f":"IF('GESTION A'!F17<=0,'GESTION A'!A17,\" \")","v":" "},{"$f":"IF('GESTION A'!F17<=0,'GESTION A'!B17,\" \")","v":" "},{"$f":"IF('GESTION A'!F17<=0,'GESTION A'!C17,\" \" )","v":" "},{"$f":"IF('GESTION A'!F17<=0,'GESTION A'!D17,\" \")","v":" "}]
[{"$f":"IF('GESTION A'!F18<=0,'GESTION A'!A18,\" \")","v":" "},{"$f":"IF('GESTION A'!F18<=0,'GESTION A'!B18,\" \")","v":" "},{"$f":"IF('GESTION A'!F18<=0,'GESTION A'!C18,\" \" )","v":" "},{"$f":"IF('GESTION A'!F18<=0,'GESTION A'!D18,\" \")","v":" "}]
[{"$f":"IF('GESTION A'!F19<=0,'GESTION A'!A19,\" \")","v":" "},{"$f":"IF('GESTION A'!F19<=0,'GESTION A'!B19,\" \")","v":" "},{"$f":"IF('GESTION A'!F19<=0,'GESTION A'!C19,\" \" )","v":" "},{"$f":"IF('GESTION A'!F19<=0,'GESTION A'!D19,\" \")","v":" "}]
[{"$f":"IF('GESTION A'!F20<=0,'GESTION A'!A20,\" \")","v":" "},{"$f":"IF('GESTION A'!F20<=0,'GESTION A'!B20,\" \")","v":" "},{"$f":"IF('GESTION A'!F20<=0,'GESTION A'!C20,\" \" )","v":" "},{"$f":"IF('GESTION A'!F20<=0,'GESTION A'!D20,\" \")","v":" "}]
[{"$f":"IF('GESTION A'!F21<=0,'GESTION A'!A21,\" \")","v":" "},{"$f":"IF('GESTION A'!F21<=0,'GESTION A'!B21,\" \")","v":" "},{"$f":"IF('GESTION A'!F21<=0,'GESTION A'!C21,\" \" )","v":" "},{"$f":"IF('GESTION A'!F21<=0,'GESTION A'!D21,\" \")","v":" "}]
[{"$f":"IF('GESTION A'!F22<=0,'GESTION A'!A22,\" \")","v":" "},{"$f":"IF('GESTION A'!F22<=0,'GESTION A'!B22,\" \")","v":" "},{"$f":"IF('GESTION A'!F22<=0,'GESTION A'!C22,\" \" )","v":" "},{"$f":"IF('GESTION A'!F22<=0,'GESTION A'!D22,\" \")","v":" "}]
[{"$f":"IF('GESTION A'!F23<=0,'GESTION A'!A23,\" \")","v":" "},{"$f":"IF('GESTION A'!F23<=0,'GESTION A'!B23,\" \")","v":" "},{"$f":"IF('GESTION A'!F23<=0,'GESTION A'!C23,\" \" )","v":" "},{"$f":"IF('GESTION A'!F23<=0,'GESTION A'!D23,\" \")","v":" "}]
[{"$f":"IF('GESTION A'!F24<=0,'GESTION A'!A24,\" \")","v":" "},{"$f":"IF('GESTION A'!F24<=0,'GESTION A'!B24,\" \")","v":" "},{"$f":"IF('GESTION A'!F24<=0,'GESTION A'!C24,\" \" )","v":" "},{"$f":"IF('GESTION A'!F24<=0,'GESTION A'!D24,\" \")","v":" "}]
[{"$f":"IF('GESTION A'!F25<=0,'GESTION A'!A25,\" \")","v":" "},{"$f":"IF('GESTION A'!F25<=0,'GESTION A'!B25,\" \")","v":" "},{"$f":"IF('GESTION A'!F25<=0,'GESTION A'!C25,\" \" )","v":" "},{"$f":"IF('GESTION A'!F25<=0,'GESTION A'!D25,\" \")","v":" "}]
[{"$f":"IF('GESTION A'!F26<=0,'GESTION A'!A26,\" \")","v":" "},{"$f":"IF('GESTION A'!F26<=0,'GESTION A'!B26,\" \")","v":" "},{"$f":"IF('GESTION A'!F26<=0,'GESTION A'!C26,\" \" )","v":" "},{"$f":"IF('GESTION A'!F26<=0,'GESTION A'!D26,\" \")","v":" "}]
[{"$f":"IF('GESTION A'!F27<=0,'GESTION A'!A27,\" \")","v":" "},{"$f":"IF('GESTION A'!F27<=0,'GESTION A'!B27,\" \")","v":" "},{"$f":"IF('GESTION A'!F27<=0,'GESTION A'!C27,\" \" )","v":" "},{"$f":"IF('GESTION A'!F27<=0,'GESTION A'!D27,\" \")","v":" "}]
[{"$f":"IF('GESTION A'!F28<=0,'GESTION A'!A28,\" \")","v":" "},{"$f":"IF('GESTION A'!F28<=0,'GESTION A'!B28,\" \")","v":" "},{"$f":"IF('GESTION A'!F28<=0,'GESTION A'!C28,\" \" )","v":" "},{"$f":"IF('GESTION A'!F28<=0,'GESTION A'!D28,\" \")","v":" "}]
{"$rows_left_out":374}
{"sheet":"VIDES B","index":4,"n_rows":400,"n_cols":4,"rows_kept":400,"cut":false,"hidden":false,"merged":[[0,5,0,9],[0,0,0,3]]}
["EMPLACEMENTS VIDES ETAGERE B"]
[]
[]
["ADRESSES","MACHINES","REFERENCE","DESIGNATION"]
[{"$f":"IF('GESTION B'!F4<=0,'GESTION B'!A4,\" \")","v":" "},{"$f":"IF('GESTION B'!F4<=0,'GESTION B'!B4,\" \")","v":" "},{"$f":"IF('GESTION B'!F4>=0,'GESTION B'!C4,\" \")","v":9001},{"$f":"IF('GESTION B'!F4>=0,'GESTION B'!D4,\" \")","v":"EBAUCHE FRAISEE"}]
[{"$f":"IF('GESTION B'!F7<=0,'GESTION B'!A7,\" \")","v":" "},{"$f":"IF('GESTION B'!F7<=0,'GESTION B'!B7,\" \")","v":" "},{"$f":"IF('GESTION B'!F7>=0,'GESTION B'!C7,\" \")","v":9001},{"$f":"IF('GESTION B'!F7>=0,'GESTION B'!D7,\" \")","v":"EBAUCHE FRAISEE L71"}]
[{"$f":"IF('GESTION B'!F8<=0,'GESTION B'!A8,\" \")","v":" "},{"$f":"IF('GESTION B'!F8<=0,'GESTION B'!B8,\" \")","v":" "},{"$f":"IF('GESTION B'!F8>=0,'GESTION B'!C8,\" \")","v":9001},{"$f":"IF('GESTION B'!F8>=0,'GESTION B'!D8,\" \")","v":"EBAUCHE FRAISEE L80"}]
[{"$f":"IF('GESTION B'!F9<=0,'GESTION B'!A9,\" \")","v":" "},{"$f":"IF('GESTION B'!F9<=0,'GESTION B'!B9,\" \")","v":" "},{"$f":"IF('GESTION B'!F9>=0,'GESTION B'!C9,\" \")","v":9001},{"$f":"IF('GESTION B'!F9>=0,'GESTION B'!D9,\" \")","v":"EBAUCHE FRAISEE L97"}]
[{"$f":"IF('GESTION B'!F10<=0,'GESTION B'!A10,\" \")","v":" "},{"$f":"IF('GESTION B'!F10<=0,'GESTION B'!B10,\" \")","v":" "},{"$f":"IF('GESTION B'!F10>=0,'GESTION B'!C10,\" \")","v":9004},{"$f":"IF('GESTION B'!F10>=0,'GESTION B'!D10,\" \")","v":"EBAUCHE FRAISEE"}]
[{"$f":"IF('GESTION B'!F11<=0,'GESTION B'!A11,\" \")","v":" "},{"$f":"IF('GESTION B'!F11<=0,'GESTION B'!B11,\" \")","v":" "},{"$f":"IF('GESTION B'!F11>=0,'GESTION B'!C11,\" \")","v":9004},{"$f":"IF('GESTION B'!F11>=0,'GESTION B'!D11,\" \")","v":"EBAUCHE FRAISEE"}]
[{"$f":"IF('GESTION B'!F12<=0,'GESTION B'!A12,\" \")","v":"B0106-A"},{"$f":"IF('GESTION B'!F12<=0,'GESTION B'!B12,\" \")","v":"KINGSLAND"},{"$f":"IF('GESTION B'!F12>=0,'GESTION B'!C12,\" \")","v":9004},{"$f":"IF('GESTION B'!F12>=0,'GESTION B'!D12,\" \")","v":"EBAUCHE FRAISEE L80"}]
[{"$f":"IF('GESTION B'!F13<=0,'GESTION B'!A13,\" \")","v":"B0106-B"},{"$f":"IF('GESTION B'!F13<=0,'GESTION B'!B13,\" \")","v":"KINGSLAND"},{"$f":"IF('GESTION B'!F13>=0,'GESTION B'!C13,\" \")","v":9004},{"$f":"IF('GESTION B'!F13>=0,'GESTION B'!D13,\" \")","v":"EBAUCHE FRAISEE L120"}]
[{"$f":"IF('GESTION B'!F14<=0,'GESTION B'!A14,\" \")","v":" "},{"$f":"IF('GESTION B'!F14<=0,'GESTION B'!B14,\" \")","v":" "},{"$f":"IF('GESTION B'!F14>=0,'GESTION B'!C14,\" \")","v":9004},{"$f":"IF('GESTION B'!F14>=0,'GESTION B'!D14,\" \")","v":"EBAUCHE FRAISEE L140"}]
[{"$f":"IF('GESTION B'!F15<=0,'GESTION B'!A15,\" \")","v":"B0107"},{"$f":"IF('GESTION B'!F15<=0,'GESTION B'!B15,\" \")","v":"KINGSLAND"},{"$f":"IF('GESTION B'!F15>=0,'GESTION B'!C15,\" \")","v":9007},{"$f":"IF('GESTION B'!F15>=0,'GESTION B'!D15,\" \")","v":"EBAUCHE FRAISEE"}]
[{"$f":"IF('GESTION B'!F16<=0,'GESTION B'!A16,\" \")","v":" "},{"$f":"IF('GESTION B'!F16<=0,'GESTION B'!B16,\" \")","v":" "},{"$f":"IF('GESTION B'!F16>=0,'GESTION B'!C16,\" \")","v":9007},{"$f":"IF('GESTION B'!F16>=0,'GESTION B'!D16,\" \")","v":"EBAUCHE FRAISEE"}]
[{"$f":"IF('GESTION B'!F17<=0,'GESTION B'!A17,\" \")","v":" "},{"$f":"IF('GESTION B'!F17<=0,'GESTION B'!B17,\" \")","v":" "},{"$f":"IF('GESTION B'!F17>=0,'GESTION B'!C17,\" \")","v":9006},{"$f":"IF('GESTION B'!F17>=0,'GESTION B'!D17,\" \")","v":"EBAUCHE FRAISEE"}]
[{"$f":"IF('GESTION B'!F18<=0,'GESTION B'!A18,\" \")","v":"B0110"},{"$f":"IF('GESTION B'!F18<=0,'GESTION B'!B18,\" \")","v":"KINGSLAND"},{"$f":"IF('GESTION B'!F18>=0,'GESTION B'!C18,\" \")","v":9006},{"$f":"IF('GESTION B'!F18>=0,'GESTION B'!D18,\" \")","v":"EBAUCHE FRAISEE"}]
[{"$f":"IF('GESTION B'!F19<=0,'GESTION B'!A19,\" \")","v":" "},{"$f":"IF('GESTION B'!F19<=0,'GESTION B'!B19,\" \")","v":" "},{"$f":"IF('GESTION B'!F19>=0,'GESTION B'!C19,\" \")","v":9009},{"$f":"IF('GESTION B'!F19>=0,'GESTION B'!D19,\" \")","v":"EBAUCHE FRAISEE"}]
[{"$f":"IF('GESTION B'!F20<=0,'GESTION B'!A20,\" \")","v":"B0112"},{"$f":"IF('GESTION B'!F20<=0,'GESTION B'!B20,\" \")","v":"KINGSLAND"},{"$f":"IF('GESTION B'!F20>=0,'GESTION B'!C20,\" \")","v":9009},{"$f":"IF('GESTION B'!F20>=0,'GESTION B'!D20,\" \")","v":"EBAUCHE FRAISEE"}]
[{"$f":"IF('GESTION B'!F21<=0,'GESTION B'!A21,\" \")","v":"B0113-A"},{"$f":"IF('GESTION B'!F21<=0,'GESTION B'!B21,\" \")","v":"KINGSLAND"},{"$f":"IF('GESTION B'!F21>=0,'GESTION B'!C21,\" \")","v":9006},{"$f":"IF('GESTION B'!F21>=0,'GESTION B'!D21,\" \")","v":"EBAUCHE FRAISEE L…"}]
[{"$f":"IF('GESTION B'!F22<=0,'GESTION B'!A22,\" \")","v":" "},{"$f":"IF('GESTION B'!F22<=0,'GESTION B'!B22,\" \")","v":" "},{"$f":"IF('GESTION B'!F22>=0,'GESTION B'!C22,\" \")","v":9009},{"$f":"IF('GESTION B'!F22>=0,'GESTION B'!D22,\" \")","v":"EBAUCHE FRAISEE L…"}]
[{"$f":"IF('GESTION B'!F23<=0,'GESTION B'!A23,\" \")","v":" "},{"$f":"IF('GESTION B'!F23<=0,'GESTION B'!B23,\" \")","v":" "},{"$f":"IF('GESTION B'!F23>=0,'GESTION B'!C23,\" \")","v":9010},{"$f":"IF('GESTION B'!F23>=0,'GESTION B'!D23,\" \")","v":"EBAUCHE FRAISEE"}]
[{"$f":"IF('GESTION B'!F24<=0,'GESTION B'!A24,\" \")","v":" "},{"$f":"IF('GESTION B'!F24<=0,'GESTION B'!B24,\" \")","v":" "},{"$f":"IF('GESTION B'!F24>=0,'GESTION B'!C24,\" \")","v":9010},{"$f":"IF('GESTION B'!F24>=0,'GESTION B'!D24,\" \")","v":"EBAUCHE FRAISEE L70"}]
[{"$f":"IF('GESTION B'!F25<=0,'GESTION B'!A25,\" \")","v":" "},{"$f":"IF('GESTION B'!F25<=0,'GESTION B'!B25,\" \")","v":" "},{"$f":"IF('GESTION B'!F25>=0,'GESTION B'!C25,\" \")","v":9010},{"$f":"IF('GESTION B'!F25>=0,'GESTION B'!D25,\" \")","v":"EBAUCHE NON TOURNEE"}]
[{"$f":"IF('GESTION B'!F26<=0,'GESTION B'!A26,\" \")","v":" "},{"$f":"IF('GESTION B'!F26<=0,'GESTION B'!B26,\" \")","v":" "},{"$f":"IF('GESTION B'!F26>=0,'GESTION B'!C26,\" \")","v":9010},{"$f":"IF('GESTION B'!F26>=0,'GESTION B'!D26,\" \")","v":"EBAUCHE NON TOURNEE"}]
[{"$f":"IF('GESTION B'!F27<=0,'GESTION B'!A27,\" \")","v":" "},{"$f":"IF('GESTION B'!F27<=0,'GESTION B'!B27,\" \")","v":" "},{"$f":"IF('GESTION B'!F27>=0,'GESTION B'!C27,\" \")","v":9010},{"$f":"IF('GESTION B'!F27>=0,'GESTION B'!D27,\" \")","v":"EBAUCHE NON TOURNEE"}]
[{"$f":"IF('GESTION B'!F28<=0,'GESTION B'!A28,\" \")","v":" "},{"$f":"IF('GESTION B'!F28<=0,'GESTION B'!B28,\" \")","v":" "},{"$f":"IF('GESTION B'!F28>=0,'GESTION B'!C28,\" \")","v":9011},{"$f":"IF('GESTION B'!F28>=0,'GESTION B'!D28,\" \")","v":"EBAUCHE FRAISEE"}]
[{"$f":"IF('GESTION B'!F31<=0,'GESTION B'!A31,\" \")","v":" "},{"$f":"IF('GESTION B'!F31<=0,'GESTION B'!B31,\" \")","v":" "},{"$f":"IF('GESTION B'!F31>=0,'GESTION B'!C31,\" \")","v":9011},{"$f":"IF('GESTION B'!F31>=0,'GESTION B'!D31,\" \")","v":"EBAUCHE FRAISEE"}]
[{"$f":"IF('GESTION B'!F32<=0,'GESTION B'!A32,\" \")","v":" "},{"$f":"IF('GESTION B'!F32<=0,'GESTION B'!B32,\" \")","v":" "},{"$f":"IF('GESTION B'!F32>=0,'GESTION B'!C32,\" \")","v":9011},{"$f":"IF('GESTION B'!F32>=0,'GESTION B'!D32,\" \")","v":"EBAUCHE NON TOURNEE"}]
[{"$f":"IF('GESTION B'!F33<=0,'GESTION B'!A33,\" \")","v":" "},{"$f":"IF('GESTION B'!F33<=0,'GESTION B'!B33,\" \")","v":" "},{"$f":"IF('GESTION B'!F33>=0,'GESTION B'!C33,\" \")","v":9011},{"$f":"IF('GESTION B'!F33>=0,'GESTION B'!D33,\" \")","v":"EBAUCHE NON TOURNEE"}]
{"$rows_left_out":371}
{"sheet":"MACHINES ","index":5,"n_rows":36,"n_cols":7,"rows_kept":36,"cut":false,"hidden":false,"merged":[]}
[null,null,null,null,null,null,"MACHINES"]
[null,"ABL"]
[null,"ABL - PROFEL"]
[null,"ALFRA"]
[null,"ALPHYDRO"]
[null,"BOUTILLON"]
[null,"FICEP"]
[null,"GEKA"]
[null,"GEKA/PEDDY"]
[null,"IMAC"]
[null,"IMAC SELFER ALFRA"]
[null,"KINGSLAND"]
[null,"LOPIN"]
[null,"MUBEA"]
[null,"MUBEA/SUNRISE"]
[null,"PEDDY"]
[null,"PROFEL"]
[null,"ROUYER RC"]
[null,"SELFER"]
[null,"SIRUGUE"]
[null,"SOCLAM"]
[null,"SUNRISE"]
[null,"VERNET"]
[null,"IMS"]
[null,"SOMMER"]
[null,"ARMO-EDNOR"]
[null,"PROMAT/PROFEL"]
[null,"PROMAT"]
[null,"OMERA"]
[null,"DENHEZ/RASKIN"]
{"$rows_left_out":7}
{"sheet":"REFERENCES A","index":6,"n_rows":127,"n_cols":5,"rows_kept":127,"cut":false,"hidden":false,"merged":[]}
[null,null,null,null,"REFERENCES A"]
[null,"C14"]
[null,"C18"]
[null,"C22"]
[null,"CORPS 25"]
[null,"CORPS 32"]
[null,"CORPS 40"]
[]
[null,"EM300"]
[]
[null,"GM11"]
[null,"GM10"]
[null,"GM12"]
[null,"GM13"]
[null,"GM5"]
[null,"GM8"]
[null,"GN10"]
[null,"GN11"]
[null,"GN11A"]
[null,"GN12"]
[null,"GN12A"]
[null,"GN13"]
[null,"GN13A"]
[null,"GN5/27"]
[null,"GN5/30"]
[null,"GN6"]
[null,"GN8/31"]
[null,"GN8/40"]
[null,"LPA 8D"]
[null,"M110"]
{"$rows_left_out":98}
{"sheet":"REFERENCES B","index":7,"n_rows":140,"n_cols":11,"rows_kept":140,"cut":false,"hidden":false,"merged":[]}
[null,null,null,null,null,"REFERENCES B"]
[]
[null,9001]
[null,9004]
[null,9006]
[null,9007]
[null,9009]
[null,9010]
[null,9011]
[null,9020]
[null,9022]
[null,9023]
[null,9024]
[null,9025]
[null,9026]
[]
[null,"5012836 - 101"]
[null,"5012836 - 102"]
[]
[null,"C10"]
[null,"C15"]
[null,"C20"]
[]
[null,"DEVETISSEUR "]
[]
[null,"ED50"]
[]
[null,"GN13"]
[null,"GP-P01-075-3"]
[null,"GP-P01-100-3"]
{"$rows_left_out":111}
{"sheet":"REFERENCES C","index":8,"n_rows":81,"n_cols":2,"rows_kept":81,"cut":false,"hidden":false,"merged":[]}
[]
[]
[null,"P70"]
[null,"M40"]
[null,"P40"]
[null,"5013205-38"]
[null,"5012090+"]
[null,"5013710-1"]
[null,"5013090+"]
[null,"CORPS 34"]
[null,"CORPS 28"]
[null,"P CORPS 26 Lg45"]
[null,"b"]
[null,"c"]
[null,"a"]
[null,"b"]
[null,"c"]
[null,"a"]
[null,"b"]
[null,"c"]
[null,"a"]
[null,"b"]
[null,"c"]
[null,"a"]
[null,"b"]
[null,"c"]
[null,"a"]
[null,"b"]
[null,"c"]
[null,"a"]
{"$rows_left_out":52}
{"sheet":"DESIGNATIONS","index":9,"n_rows":385,"n_cols":6,"rows_kept":385,"cut":false,"hidden":false,"merged":[]}
[null,null,null,null,null,"DESIGNATIONS"]
[null,"BONNET"]
[]
[null,"CANON EUROPEEN"]
[null,"CONE REDUCTION EBAUCHE"]
[null,"CORPS 101 1 ENCOCHE"]
[null,"CORPS 101 2 ENCOCHES"]
[null,"CORPS 18 Ø50 FRAISE"]
[null,"CORPS 18 Ø50 NON FRAISE"]
[null,"CORPS 20 Ø50 FRAISE"]
[null,"CORPS 20 Ø50 FRAISE SANS POINTE"]
[null,"CORPS 20 Ø60 FRAISE"]
[null,"CORPS 20 Ø70 FRAISE H30"]
[null,"CORPS 20 Ø70 FRAISE H40"]
[null,"CORPS 20 Ø70 FRAISE SANS POINTE"]
[null,"CORPS 22 Ø100 FRAISE H30"]
[null,"CORPS 22 Ø100 FRAISE H30 SANS POINTE"]
[null,"CORPS 22 Ø100 FRAISE H40 SANS POINTE"]
[null,"CORPS 22 Ø110 FRAISE  SANS POINTE"]
[null,"CORPS 22 Ø50 FRAISE H30"]
[null,"CORPS 22 Ø50 FRAISE H40"]
[null,"CORPS 22 Ø70 FRAISE H30"]
[null,"CORPS 22 Ø70 FRAISE H40"]
[null,"CORPS 80 1 ENCOCHE"]
[null,"CORPS 80 2 ENCOCHES"]
[null,"CORPS Ø24 PERCE 1 TROU Ø3"]
[null,"CORPS Ø24 PERCE 4 TROUS Ø3"]
[null,"CORPS Ø24 PERCE 4 TROUS Ø3 EXCENTRE"]
[null,"CORPS Ø25 PERCE 1 TROU Ø3"]
[null,"CORPS Ø26 PERCE 1 TROU Ø3"]
{"$rows_left_out":356}
{"sheet":"CLIENTS","index":10,"n_rows":9,"n_cols":7,"rows_kept":9,"cut":false,"hidden":false,"merged":[]}
[null,null,null,null,null,null,"CLIENTS"]
[]
[null,"MATELON"]
[null,"A0703+A0704"]
[null,"REY"]
[]
[]
[]
[null,"-"]

{"sheet":"ADRESSES A","index":11,"n_rows":470,"n_cols":7,"rows_kept":470,"cut":false,"hidden":false,"merged":[]}
[null,null,null,null,null,null,"ADRESSES A"]
[]
[null,"A0101"]
[null,"A0102"]
[null,"A0103"]
[null,"A0104"]
[null,"A0105"]
[null,"A0106-A"]
[null,"A0106-B"]
[null,"A0107"]
[null,"A0108"]
[null,"A0109"]
[null,"A0110"]
[null,"A0111-A"]
[null,"A0111-B"]
[null,"A0112-A"]
[null,"A0112-B"]
[null,"A0113"]
[null,"A0114"]
[null,"A0115"]
[null,"A0116"]
[null,"A0117"]
[null,"A0118-A"]
[null,"A0118-B"]
[null,"A0119-A"]
[null,"A0119-B"]
[null,"A0120-A"]
[null,"A0120-B"]
[null,"A0120-C"]
[null,"A0121"]
{"$rows_left_out":441}
{"sheet":"ADRESSES B","index":12,"n_rows":1241,"n_cols":12,"rows_kept":1241,"cut":false,"hidden":false,"merged":[]}
[null,null,null,null,null,null,"ADRESSES B"]
[]
["B0101-A"]
["B0101-B"]
["B0102-A"]
["B0102-B"]
["B0103-A"]
["B0103-B"]
["B0104"]
["B0105"]
["B0106-A"]
["B0106-B"]
["B0106-C"]
["B0107"]
["B0108"]
["B0109"]
["B0110"]
["B0111"]
["B0112"]
["B0113-A"]
["B0113-B"]
["B0114"]
["B0115"]
["B0116"]
["B0117"]
["B0118"]
["B0119-A"]
["B0119-B"]
["B0119-C"]
["B0120"]
{"$rows_left_out":1212}
{"sheet":"ADRESSES C","index":13,"n_rows":173,"n_cols":7,"rows_kept":173,"cut":false,"hidden":false,"merged":[]}
[null,null,null,null,null,null,"ADRESSES C"]
[]
["C0901-A"]
["C0901-B"]
["C0902-A"]
["C0902-B"]
["C0903-A"]
["C0903-B"]
["C0904-A"]
["C0904-B"]
["C0905-A"]
["C0905-B"]
["C0906-A"]
["C0906-B"]
["C0907-A"]
["C0907-B"]
["C0908-A"]
["C0908-B"]
["C0916"]
["C0917"]
["C1001"]
["C1002"]
["C1003"]
["C1004"]
["C1005"]
["C1006"]
["C1007"]
["C1008"]
["C1009"]
["C1010"]
{"$rows_left_out":144}
{"sheet":"VALORISATION DES STOCKS A B C","index":14,"n_rows":17,"n_cols":8,"rows_kept":17,"cut":false,"hidden":false,"merged":[[8,9,8,11],[5,0,5,1],[6,0,6,1],[7,0,7,1],[11,0,11,1],[16,1,16,2],[15,3,17,7],[5,5,5,6],[6,5,6,6],[7,5,7,6],[11,5,11,6],[13,0,13,1],[12,0,12,1]]}
[null,null,"VALORISATION DES STOCKS A B C"]
[]
[]
[]
[]
["POIDS TOTAL A",null,{"$f":"'GESTION A'!H447","v":3820.837},"kg",null,"VALORISATION A",null,{"$f":"C6*C14","v":6877.5065999999997}]
["POIDS TOTAL B",null,{"$f":"'GESTION B'!H416","v":3428.8536819999999},"kg",null,"VALORISATION B",null,{"$f":"C7*C14","v":6171.9366276000001}]
["POIDS TOTAL C",null,{"$f":"'GESTION C'!H332","v":26.419},"kg",null,"VALORISATION C",null,{"$f":"C8*C14","v":47.554200000000002}]
[]
[]
[]
["PRIX MATIERE AU KG",null,1.5]
["COÛT M.O 20%",null,{"$f":"(C12*20)/100","v":0.3}]
["PRIX PIECE EBAUCHEE AU KG",null,{"$f":"C12+C13","v":1.8}]
[]
[null,null,null,{"$f":"SUM(H6:H8)","v":13096.997427600001}]
[null,"   VALORISATION A B C"]