{"text_format":"1","workbook":"xlsx","n_sheets":15,"sheets":["GESTION A","GESTION B","GESTION C","VIDES A","VIDES B","MACHINES ","REFERENCES A","REFERENCES B","REFERENCES C","DESIGNATIONS","CLIENTS","ADRESSES A","ADRESSES B","ADRESSES C","VALORISATION DES STOCKS A B C"],"not_rendered":{"charts":0,"images":0,"macros":1,"external_links":0,"defined_names":18,"comments":0,"pivot_tables":0},"unopened":[],"bounds":{"document_bytes":16777216,"sheet_cells":100000,"rows_first":2000,"rows_last":500,"rows_between":2000,"halvings":0,"cell_chars":16384,"cell_head_chars":4096},"cells_cut":0,"cells_raw":0,"read":"whole","date_system":"1900"}

{"sheet":"GESTION A","index":0,"n_rows":447,"n_cols":8,"rows_kept":447,"cut":false,"hidden":false,"merged":[[0,2,0,4],[0,7,0,8],[0,0,0,1]]}
[null,null,"GESTION DE STOCK A"]
["ADRESSE","MACHINES","REFERENCES","DESIGNATIONS","FIFO","STOCKS","POIDS/PIECE","POIDS TOTAL"]
[null,null,null,null,null,null,null,{"$f":"IF(G3>0,G3*F3,\" \")","v":""}]
["A0101","SIRUGUE","M110","EBAUCHE 2 FACES",null,17,1123,{"$f":"IF(G4>0,G4*F4,\" \")","v":19091}]
["A0102","SIRUGUE","M110","EBAUCHE 1 FACE",null,23,1753,{"$f":"IF(G5>0,G5*F5,\" \")","v":40319}]
["A0103","SIRUGUE","M110","EBAUCHE 1 FACE",null,24,1753,42072]
["A0104","SIRUGUE","M110","EBAUCHE 1 FACE",null,19,1753,33307]
["A0105","SIRUGUE","M110","EBAUCHE 1 FACE",null,13,1753,22789]
["A0106-A","SIRUGUE","M40","EBAUCHE PERCEE",null,7,143,1001]
["A0106-B","SIRUGUE","M40","EBAUCHE FRAISEE NON PERCEE",null,28,187,5236]
["A0107","SIRUGUE","M40","EBAUCHE FRAISEE",null,213,153,32589]
["A0108","SIRUGUE","M40","EBAUCHE FRAISEE",null,215,153,32895]
["A0109","SIRUGUE","M40","EBAUCHE",null,137,190,26030]
["A0109","SIRUGUE","M40","EBAUCHE SCS",null,0,null,""]
["A0110","SIRUGUE","M34","EBAUCHE FRAISEE PERCEE",null,29,84,2436]
["A0111-A","SIRUGUE","M34","EBAUCHE PERCEE Ø16",null,3,98,294]
["A0111-B","SIRUGUE","M34","EBAUCHE",null,75,114,8550]
["A0112-A","SIRUGUE","M14","EBAUCHE",null,72,5,360]
["A0112-B","SIRUGUE","M24","EBAUCHE",null,188,44,8272]
["A0113","SIRUGUE","PC16","Ø26",null,130,110,14300]
["A0114","SIRUGUE","PC16","SUPERIEUR CORPS 20",null,180,84,15120]
["A0115","SIRUGUE","PC16","EBAUCHE 1 REPERE",null,312,69,21528]
["A0116","SIRUGUE","PC14","SUPERIEUR CORPS 20",null,272,60,16320]
["A0117","SIRUGUE","PC14","SUPERIEUR CORPS 19,5",null,295,58,17110]
["A0118-A","SIRUGUE","PC14","SUPERIEUR CORPS 20",null,76,67,5092]
["A0118-B","SIRUGUE","PC14","EBAUCHE 1 REPERE",null,187,42,7854]
["A0119-A","SIRUGUE","PC10","EBAUCHE FRAISEE",null,79,26,2054]
["A0119-A","SIRUGUE","PC10","EBAUCHE NON FRAISEE Ø10",null,76,26,1976]
["A0119-B","SIRUGUE","PC10","EBAUCHE NON FRAISEE Ø6",null,24,20,480]
["A0119-B","SIRUGUE","PC10","EBAUCHE NON FRAISEE \u009d\u009dØ8",null,126,14,1764]
["A0120-A","SIRUGUE","EM300","N°1",null,3,75,225]
["A0120-B","SIRUGUE","EM300","N°3",null,1,354,354]
["A0120-C","SIRUGUE","EM300","N°3 CANON EUROPEEN",null,5,383,1915]
["A0121","SIRUGUE","SC4","EBAUCHE FRAISEE",null,27,560,15120]
["A0122-A","SIRUGUE","SC3","EBAUCHE FRAISEE",null,6,328,1968]
["A0122-B","SIRUGUE","SC3","CANON EUROPEEN",null,2,344,688]
["A0123","SIRUGUE","SC2","EBAUCHE FRAISEE",null,29,154,4466]
["A0124-A","SIRUGUE","SC1","EBAUCHE NON FRAISEE",null,32,69,2208]
["A0124-B","SIRUGUE","SC1","EBAUCHE FRAISEE",null,68,69,4692]
["A0125",null,null,null,null,null,null,""]
["A0201-A","SIRUGUE","M50","EBAUCHE",null,4,381,1524]
["A0201-B","SIRUGUE","M50","EBAUCHE 1/4 ROND",null,7,695,4865]
["A0202","SIRUGUE","M50","EBAUCHE FRAISEE Ø24",null,67,320,21440]
["A0203","SIRUGUE","M50","EBAUCHE FRAISEE Ø34",null,97,244,23668]
["A0204","SIRUGUE","M50","EBAUCHE PERCEE \u009dØ21",null,50,300,15000]
["A0205","SIRUGUE","M50","EBAUCHE Ø34",null,20,270,5400]
["A0206-A","SIRUGUE","M70","EBAUCHE Ø46",null,0,null,""]
["A0206-B","SIRUGUE","M70","EBAUCHE Ø47",null,11,740,8140]
["A0206-C","SIRUGUE","M70","EBAUCHE",null,9,739,6651]
["A0207","SIRUGUE","M70","EBAUCHE ED",null,34,655,22270]
["A0208-A","SIRUGUE","PED 18","CORPS 18 Ø50 FRAISE",null,5,976,4880]
["A0208-B","SIRUGUE","PED 18","CORPS 18 Ø50 NON FRAISE",null,8,1020,8160]
["A0209","SIRUGUE","PED 20","CORPS 20 D50 FRAISE",null,34,561,19074]
["A0210","SIRUGUE","PED 20","CORPS 20 Ø50 FRAISE SANS POINTE",null,18,620,11160]
["A0211","SIRUGUE","PED 20","CORPS 20 Ø70 FRAISE SANS POINTE",null,11,1141,12551]
["A0212","SIRUGUE","PED 20","CORPS 20 Ø70 FRAISE SANS POINTE",null,20,1138,22760]
["A0213","SIRUGUE","PED 22","CORPS 22 Ø50 FRAISE H30",null,15,590,8850]
["A0214","SIRUGUE","PED 22","CORPS 22 Ø50 FRAISE H40",null,24,787,18888]
["A0215","SIRUGUE","PED 22","CORPS 22 Ø70 FRAISE H30",null,25,1169,29225]
["A0216","SIRUGUE","PED 22","CORPS 22 Ø70 FRAISE H40",null,27,1169,31563]
["A0217","SIRUGUE","PED 22","CORPS 22 Ø70 FRAISE H40",null,21,1169,24549]
["A0218","SIRUGUE","PED 22","CORPS 22 Ø100 FRAISE H30",null,16,1975,31600]
["A0219","SIRUGUE","PED 22","CORPS 22 Ø100 FRAISE H30 SANS POINTE",null,5,2196,10980]
["A0220","SIRUGUE","PED 22","CORPS 22 Ø100 FRAISE H40 SANS POINTE",null,12,2867,34404]
["A0221","SIRUGUE","PED 22","CORPS 22 Ø100 FRAISE H40 SANS POINTE",null,8,2880,23040]
["A0222","SIRUGUE","PED 22","CORPS 22 Ø100 FRAISE H30 SANS POINTE",null,7,2877,20139]
["A0223","SIRUGUE","PED 22","CORPS 22 Ø110 FRAISE  SANS POINTE",null,4,3449,13796]
["A0224-A","SIRUGUE","PED 22","PED 22 LONG Ø22",null,3,369,1107]
["A0224-B","SIRUGUE","PED 22","PED 22 LONG Ø40",null,5,867,{"$f":"IF(G69>0,G69*F69,\" \")","v":4335}]
["A0225","SIRUGUE","TRA3","EBAUCHE",null,1,560,560]
["A0301-A","SIRUGUE","PED 30","Ø30",null,12,756,9072]
["A0301-B","SIRUGUE","PED 30","Ø80",null,1,3947,3947]
["A0302-A","SIRUGUE","PED 30","Ø50",null,1,1460,1460]
["A0302-B","SIRUGUE","PED 30","Ø50 LONGUEUR + 10 MM",null,4,1592,6368]
["A0303","SIRUGUE","PED 30","Ø102",null,5,3666,18330]
["A0304","SIRUGUE","PED 25","Ø50",null,17,1498,25466]
["A0305-A","SIRUGUE","PEMH","EBAUCHE Ø30",null,47,423,19881]
["A0305-B","SIRUGUE","PEMH","EBAUCHE Ø27",null,19,381,7239]
["A0306-A","SIRUGUE","PED 36","TIRANT PORTE MATRICE 428",null,22,279,6138]
["A0306-B","SIRUGUE","ED36","EBAUCHE","MATELON",5,778,3890]
["A0307","SIRUGUE","SC3","NEZ DE BROCHE Ø30",null,24,null,""]
["A0308","SIRUGUE","SC4","NEZ DE BROCHE Ø30",null,20,null,""]
["A0309","SIRUGUE","SC4","NEZ DE BROCHE Ø30",null,22,null,""]
["A0310","SIRUGUE","SC4","NEZ DE BROCHE Ø30",null,16,null,""]
["A0311","SIRUGUE","SC4","NEZ DE BROCHE Ø30",null,14,null,""]
["A0312","SIRUGUE","SC3","NEZ DE BROCHE Ø30",null,24,null,""]
["A0313","SIRUGUE","SC3","NEZ DE BROCHE Ø30",null,22,null,""]
["A0314","SIRUGUE","SC4","BONNET",null,16,null,""]
["A0315","SIRUGUE","SC4","BONNET",null,39,null,""]
["A0316","SIRUGUE","SC4","BONNET",null,39,null,""]
["A0317","SIRUGUE","SC4","BONNET",null,39,null,""]
["A0318","SIRUGUE","SC4","BONNET",null,39,null,""]
["A0319","SIRUGUE","SC3","NEZ DE BROCHE 06/22",null,79,null,""]
["A0320","SIRUGUE","SC2","BONNET",null,97,null,""]
["A0321","SIRUGUE","SC2","BONNET",null,94,null,""]
["A0322-A","SIRUGUE",null,"DECHAUSSOIR",null,null,null,""]
["A0322-B","SIRUGUE",null,"DECHAUSSOIR",null,20,null,""]
["A0323-A","SIRUGUE","M164","EBAUCHE TREMPEE",null,1,4480,4480]
["A0323-B","SIRUGUE","M164","EBAUCHE",null,4,4480,17920]
["A0324-A","SIRUGUE","TRA1","EBAUCHE",null,3,275,825]
["A0324-B","SIRUGUE","TRA EMH","EBAUCHE",null,5,584,2920]
["A0325","SIRUGUE","TRA2","EBAUCHE",null,41,356,14596]
["A0401-A","FICEP","PC28","EBAUCHE FRAISEE L55",null,13,267,3471]
["A0401-B","FICEP","PC28","EBAUCHE FRAISEE L65",null,29,316,9164]
["A0401-C","FICEP","PC28","EBAUCHE FRAISEE L85",null,0,null,""]
["A0402-A","FICEP","PC28","EBAUCHE FRAISEE 0 ET 90°",null,12,266,3192]
["A0402-B","FICEP","PC28","EBAUCHE FRAISEE 0 ET 45°",null,0,null,""]
["A0403","FICEP","PC32","EBAUCHE FRAISEE",null,20,382,7640]
["A0404-A","FICEP","PC32","EBAUCHE FRAISEE EXCENTREE",null,4,395,1580]
["A0404-B","FICEP","PC32","CANON EUROPEEN",null,11,438,4818]
["A0405","FICEP","PC40","EBAUCHE FRAISEE",null,7,613,4291]
["A0406","FICEP","PC51","EBAUCHE FRAISEE",null,18,988,17784]
["A0407","FICEP","MC79,37","EBAUCHE",null,21,1871,39291]
["A0408","FICEP","MC79,37","EBAUCHE PERCEE",null,3,1042,3126]
["A0409","FICEP","PC31","EBAUCHE PERCEE",null,2,508,1016]
["A0410-A","FICEP","PC39,5","EBAUCHE PERCEE",null,38,848,32224]
["A0410-B","FICEP","PC40","EBAUCHE PERCEE",null,4,871,3484]
["A0411","FICEP","PC45","EBAUCHE PERCEE",null,34,1083,36822]
["A0412-A","FICEP","PC45","EBAUCHE PERCEE 2 REPERES 0° ET 90°",null,6,783,4698]
["A0412-B","FICEP","PC45","EBAUCHE PERCEE Ø34 +Ø3 2 REPERES 0°ET 90°",null,18,1125,20250]
["A0413","FICEP","M50,8","EBAUCHE PERCEE",null,56,390,21840]
["A0414","FICEP","M50,8","EBAUCHE PERCEE",null,83,390,32370]
["A0415-A","FICEP","M73","EBAUCHE",null,2,680,1360]
["A0415-B","FICEP","M73","EBAUCHE PERCEE",null,8,936,7488]
["A0416-A","FICEP","LPA 8D","POINCON EBAUCHE",null,32,300,9600]
["A0416-B","FICEP","LPA 8D","MATRICE EBAUCHE",null,10,119,1190]
["A0417","FICEP","PC27","EBAUCHE PERCEE",null,4,388,1552]
["A0418-A","FICEP","M50,8 P","EBAUCHE 1 REPERE DERVAUX",null,10,397,3970]
["A0418-B","FICEP","M73","EBAUCHE PERCEE Ø22",null,3,939,2817]
["A0418-C","FICEP","M73","EBAUCHE PERCEE Ø50 2 REPERES 0° et 90°",null,2,704,1408]
["A0419",null,null,null,null,null,null,""]
["A0420",null,null,null,null,null,null,""]
["A0421",null,null,null,null,null,null,""]
["A0422",null,null,null,null,null,null,""]
["A0423","SIRUGUE","SC3","NEZ DE BROCHE 04/20",null,54,null,{"$f":"IF(G135>0,G135*F135,\" \")","v":""}]
["A0424","SIRUGUE","PED 30","Ø102",null,10,3673,36730]
["A0425","SIRUGUE","PED 30","Ø102 LONGUEUR + 20MM",null,4,4899,19596]
["A0501-A","PEDDY","PN1","EBAUCHE FRAISEE",null,2,65,130]
["A0501-B","PEDDY","PN1","EBAUCHE FRAISEE L55",null,5,73,365]
["A0501-C","PEDDY","PN1","EBAUCHE FRAISEE SUPERIEUR",null,3,106,318]
["A0502-A","PEDDY","PN2","EBAUCHE FRAISEE",null,62,142,8804]
["A0502-B","PEDDY","PN4","EBAUCHE FRAISEE L85",null,0,null,""]
["A0502-C","PEDDY","PN4","CANON EUROPEEN",null,2,280,560]
["A0503-A","PEDDY","PN3","EBAUCHE FRAISEE 26,4",null,24,305,7320]
["A0503-B","PEDDY","PN4","EBAUCHE FRAISEE 0° et 90° Ø26,4",null,28,211,5908]
["A0504","PEDDY","PN4","EBAUCHE FRAISEE 27",null,45,223,10035]
["A0505-A","PEDDY","PN5","EBAUCHE FRAISEE 31,5",null,0,369,0]
["A0505-B","PEDDY","PN5","EBAUCHE FRAISEE EXCENTREE Ø32",null,26,399,10374]
["A0506-A","PEDDY","PN5","EBAUCHE FRAISEE 32",null,15,381,5715]
["A0506-B","PEDDY","PN5","EBAUCHE FRAISEE 0 ET 45°",null,28,366,10248]
["A0507-A","PEDDY","PN5","EBAUCHE FRAISEE 0 ET 90°",null,8,366,2928]
["A0507-B",null,null,null,null,null,null,""]
["A0508-A","PEDDY","PN5","EBAUCHE FRAISEE L74",null,9,451,4059]
["A0508-B","PEDDY","PN5","EBAUCHE FRAISEE L80",null,7,487,3409]
["A0508-C","PEDDY","PN5","EBAUCHE FRAISEE L90",null,7,549,3843]
["A0508-D","PEDDY","PN5","EBAUCHE FRAISEE L86",null,6,523,3138]
["A0508-E","PEDDY","PN5","EBAUCHE FRAISEE L100",null,15,609,9135]
["A0508-F","PEDDY","PN5","EBAUCHE FRAISEE   Ø32 L95",null,6,596,3576]
["A0509-A","PEDDY","PN4 S","EBAUCHE FRAISEE",null,4,272,1088]
["A0509-B","PEDDY","PN4 S","EBAUCHE FRAISEE 0 ET 45°",null,16,268,4288]
["A0509-C","PEDDY","PN4 S","EBAUCHE FRAISEE L85",null,10,467,4670]
["A0510","PEDDY","PN6","EBAUCHE FRAISEE",null,11,664,7304]
["A0511-A","PEDDY","PN6","EBAUCHE FRAISEE Ø40",null,2,682,1364]
["A0511-B","PEDDY","PN6","EBAUCHE FRAISEE L106",null,2,1009,2018]
["A0512-A","PEDDY","PN4","EBAUCHE FRAISEE 0 ET 45°",null,31,211,6541]
["A0512-B","PEDDY","PN5","CANON EUROPEEN",null,16,391,6256]
["A0513",null,null,null,null,null,null,""]
["A0514",null,null,null,null,null,null,""]
["A0515","PEDDY","PN7","EBAUCHE FRAISEE CORPS 41",null,9,1096,9864]
["A0516","PEDDY","PN7","EBAUCHE FRAISEE CORPS 58,5",null,5,1599,7995]
["A0517","PEDDY","PN7","EBAUCHE FRAISEE CORPS 58,5",null,13,1599,20787]
["A0518","PEDDY","PN7","EBAUCHE FRAISEE CORPS 58,5",null,8,1596,12768]
["A0519","PEDDY","PN7","EBAUCHE FRAISEE CORPS 60",null,5,1685,8425]
["A0520","PEDDY","PN7","EBAUCHE FRAISEE L100",null,7,2090,14630]
["A0521-A","PEDDY","PN7","EBAUCHE NON TOURNEE",null,2,1946,3892]
["A0521-B","PEDDY","PN7","EBAUCHE FRAISEE L85",null,6,1781,10686]
["A0522","PEDDY","PN11","EBAUCHE FRAISEE",null,6,3754,22524]
["A0523","PEDDY","PN11","EBAUCHE FRAISEE",null,6,3757,22542]
["A0524","PEDDY","PN11","EBAUCHE FRAISEE",null,1,2154,2154]
["A0525","PEDDY","PN11","EBAUCHE NON TOURNEE L98",null,5,5220,26100]
["A0601","PEDDY","M35","EBAUCHE",null,223,110,24530]
["A0602","PEDDY","M35","EBAUCHE",null,232,110,25520]
["A0603-A","PEDDY","M35","EBAUCHE FRAISEE PERCEE Ø20,5",null,1,93,93]
["A0603-B","PEDDY","M35","EBAUCHE PERCEE Ø22",null,28,88,2464]
["A0604-A","PEDDY","M20","EBAUCHE PERCEE",null,37,34,1258]
["A0604-B","PEDDY","M30","EBAUCHE PERCEE Ø3",null,68,80,5440]
["A0605-A",null,null,null,null,null,null,""]
["A0605-B","PEDDY","M28","EBAUCHE FRAISEE EXCENTREE",null,62,54,3348]
["A0606","PEDDY","MN2","EBAUCHE FRAISEE EXCENTREE",null,32,362,11584]
["A0607-A","PEDDY","MN2","EBAUCHE FRAISEE PERCEE 3 REPERES 0° -45° +45°",null,19,249,4731]
["A0607-B","PEDDY","MN2","EBAUCHE FRAISEE PERCEE 3 REPERES 0° +45° +135°",null,24,249,5976]
["A0608-A","PEDDY","MN2","EBAUCHE",null,17,298,5066]
["A0608-B","PEDDY","MN2","EBAUCHE PERCEE",null,12,270,3240]
["A0609-A","PEDDY","MN2","EBAUCHE UPN",null,22,433,9526]
["A0609-B","PEDDY","MN2","EBAUCHE 1/4 ROND",null,8,523,4184]
["A0610","PEDDY","MN2","EBAUCHE FRAISEE PERCEE 0° ET 90°",null,12,234,2808]
["A0611","PEDDY","MN2","EBAUCHE FRAISEE PERCEE 0° ET 90°",null,0,253,0]
["A0612-A","PEDDY","MN3","EBAUCHE FRAISEE PERCEE 0° ET 90°",null,0,260,0]
[null,null,null,null,null,null,null,""]
["A0613","PEDDY","MN3","EBAUCHE FRAISEE PERCEE 0° ET 90°",null,158,288,{"$f":"IF(G200>0,G200*F200,\" \")","v":45504}]
["A0614-A","PEDDY","MN3","EBAUCHE FRAISEE PERCEE 0° ET 45°",null,13,285,3705]
["A0614-B","PEDDY","MN3","EBAUCHE FRAISEE PERCEE 4 ENCOCHES",null,51,286,14586]
["A0615-A","PEDDY","MN3","EBAUCHE DEPORTEE",null,2,393,786]
["A0615-B","PEDDY","MN3","EBAUCHE DEPORTEE +1 REPERE 45°",null,8,393,3144]
["A0616-A","PEDDY","MN3","EBAUCHE",null,3,396,1188]
["A0616-B","PEDDY","MN3","EBAUCHE FRAISEE PERCEE Ø3 2 REPERES 0° 90°",null,0,null,""]
["A0617-A","PEDDY","MN3","EBAUCHE PERCEE Ø16",null,26,349,9074]
["A0617-B","PEDDY","MN3","EBAUCHE DEPORTEE",null,40,390,15600]
["A0618-A","PEDDY","MN3","EBAUCHE 1/4 ROND",null,14,606,8484]
["A0618-B","PEDDY","MN3","1/4 ROND (VIEUX)",null,11,720,7920]
["A0619","PEDDY","MN4","EBAUCHE",null,45,770,34650]
["A0620","PEDDY","MN4","EBAUCHE PERCEE Ø22",null,21,693,14553]
["A0621","PEDDY","MN4","EBAUCHE FRAISEE PERCEE Ø3",null,31,764,23684]
["A0622","PEDDY","MN4","EBAUCHE FRAISEE PERCEE",null,0,558,0]
["A0623","PEDDY","MN4","EBAUCHE FRAISEE PERCEE",null,20,529,10580]
["A0624","PEDDY","MN4","EBAUCHE 1/4 ROND",null,20,1198,23960]
["A0625","PEDDY","MN6","EBAUCHE",null,10,1553,15530]
["A0701","PEDDY","MN6","EBAUCHE MATRICE DEGAGEE",null,0,null,""]
["A0702","PEDDY","MN6","EBAUCHE 1/4 ROND",null,7,2694,18858]
["A0703","PEDDY","MN20","EBAUCHE","A0703+A0704",13,3770,49010]
["A0704","PEDDY","MN20","EBAUCHE MATRICE DEGAGEE",null,4,2706,10824]
["A0705","PEDDY","PN11","EBAUCHE NON TOURNEE",null,24,4060,97440]
["A0706","PEDDY","PN11","EBAUCHE NON TOURNEE",null,24,4060,97440]
["A0707","PEDDY","PN11","EBAUCHE NON TOURNEE",null,10,3767,37670]
["A0708","PEDDY","MN6","EBAUCHE Ø90 H70",null,0,null,""]
["A0709","GEKA/PEDDY","PG6","EBAUCHE FRAISEE",null,21,580,12180]
["A0710-A","GEKA/PEDDY","PG6","EBAUCHE FRAISEE L85",null,4,831,3324]
["A0710-B","GEKA/PEDDY","PG6","EBAUCHE FRAISEE SUPERIEUR",null,2,822,1644]
["A0711-A","PEDDY","POINCON 272","EBAUCHE",null,0,null,""]
["A0711-B","PEDDY","MATRICE 271","EBAUCHE 2 REPERES 1 PLAT",null,22,432,9504]
["A0712-A","GEKA/PEDDY","PG6","EBAUCHE FRAISEE EXCENTREE Ø40",null,17,632,10744]
["A0712-B",null,null,null,null,null,null,""]
["A0713","PEDDY","MN3","EBAUCHE FRAISEE DEGAGEE PERCEE Ø3 2 REPERES 0° 90°",null,0,null,""]
["A0714-A","PEDDY","TRA30x45","EBAUCHE",null,19,null,""]
["A0714-B","PEDDY","TRA36X55","EBAUCHE",null,18,240,4320]
["A0715","PEDDY","PN11","EBAUCHE SOUS TIGE Ø110 ",null,6,465,2790]
["A0716",null,null,null,null,null,null,""]
["A0717",null,null,null,null,null,null,""]
["A0718",null,null,null,null,null,null,""]
["A0719",null,null,null,null,null,null,""]
["A0720",null,null,null,null,null,null,""]
["A0721",null,null,null,null,null,null,""]
["A0722",null,null,null,null,null,null,""]
["A0723","PEDDY","MN6","EBAUCHE Ø90 H70",null,10,3581,35810]
["A0724","PEDDY","MN6","EBAUCHE Ø90 H70",null,9,3581,32229]
["A0725","PEDDY","MN6","EBAUCHE Ø90 H70",null,9,3581,32229]
["A0801","GEKA","GN5/27","EBAUCHE FRAISEE",null,17,235,3995]
["A0802-A","GEKA","GN5/27","EBAUCHE FRAISEE EXCENTREE",null,23,820,18860]
["A0802-B","GEKA","GN5/27","EBAUCHE FRAISEE 0 ET 45°",null,4,233,932]
["A0803","GEKA","GN5/27","EBAUCHE FRAISEE LONG 80",null,8,359,2872]
["A0804-A","GEKA","GN5/27","EBAUCHE CE",null,15,298,4470]
["A0804-B","GEKA","GN5/30","EBAUCHE FRAISEE",null,26,285,7410]
["A0805","GEKA","GN8/31","EBAUCHE FRAISEE",null,40,368,14720]
["A0806-A","GEKA","GN8/31","EBAUCHE FRAISEE 0 ET 45°",null,19,368,6992]
["A0806-B","GEKA","GN8/31","EBAUCHE CE",null,22,414,9108]
["A0807","GEKA","GN8/31","EBAUCHE FRAISEE EXCENTREE",null,19,433,8227]
["A0808-A","GEKA","GN8/31","EBAUCHE FRAISEE L90",null,7,529,3703]
["A0808-B","GEKA","GN8/31","EBAUCHE FRAISEE L74",null,9,438,3942]
["A0809-A","GEKA","GN6","EBAUCHE FRAISEE CLAVETTE 4 MM",null,4,260,1040]
["A0809-B","GEKA","GN6/30","EBAUCHE FRAISEE CLAVETTE 4 MM",null,27,271,7317]
["A0809-C","GEKA","GN6","EBAUCHE FRAISEE 0 ET 45° CLAVETTE 4 MM",null,0,null,""]
["A0810-A","GEKA","GN6","EBAUCHE FRAISEE CLAVETTE 6 MM",null,4,268,1072]
["A0810-B","GEKA","GN6/30","EBAUCHE FRAISEE CLAVETTE 6 MM",null,11,304,3344]
["A0810-C","GEKA","GN6","EBAUCHE FRAISEE 0 ET 45° CLAVETTE 6 MM",null,0,null,""]
["A0811-A","GEKA","GN8/31A","EBAUCHE FRAISEE CORPS 27",null,22,425,9350]
["A0811-B","GEKA","GN8/31A","EBAUCHE FRAISEE CORPS 31",null,23,573,13179]
["A0812","GEKA","GN8/40","EBAUCHE FRAISEE",null,24,606,{"$f":"IF(G267>0,G267*F267,\" \")","v":14544}]
["A0813","GEKA","GN8/40","EBAUCHE FRAISEE 0 ET 45°",null,0,null,""]
["A0814","GEKA","GN8/40","EBAUCHE FRAISEE L90",null,18,979,17622]
["A0815","GEKA","GN8/40","EBAUCHE FRAISEE L100",null,4,877,3508]
["A0816",null,null,null,null,0,null,""]
["A0817","GEKA","GN10","EBAUCHE FRAISEE",null,23,698,16054]
["A0818",null,null,null,null,null,null,""]
["A0819",null,null,null,null,null,null,""]
["A0820","GEKA","GN11","EBAUCHE FRAISEE",null,3,846,2538]
["A0821","GEKA",null,null,null,null,null,""]
["A0822-A","GEKA","GN11","EBAUCHE FRAISEE L61",null,1,937,937]
["A0822-B","GEKA","GN11","EBAUCHE FRAISEE L100",null,3,1519,4557]
["A0823","GEKA","GN11A","EBAUCHE FRAISEE",null,25,1071,26775]
["A0824","GEKA",null,null,null,null,null,""]
["A0825","GEKA","GN12","EBAUCHE FRAISEE",null,4,1324,5296]
["A0901","GEKA","GN12","EBAUCHE FRAISEE",null,22,1897,41734]
["A0902","GEKA","GN12","EBAUCHE NON TOURNEE",null,14,2098,29372]
["A0903","GEKA","GN12","EBAUCHE NON TOURNEE",null,14,2097,29358]
["A0904","GEKA","GN12A","EBAUCHE FRAISEE",null,0,null,""]
["A0905","GEKA","GN12A",null,null,null,null,""]
["A0906","GEKA","GN12A","EBAUCHE NON TOURNEE",null,4,2680,10720]
["A0907","GEKA","GN12A",null,null,0,null,""]
["A0908","GEKA","GN13","EBAUCHE FRAISEE LARG 6 ET 4",null,12,3380,40560]
["A0909","GEKA","GN13","EBAUCHE FRAISEE LARG 6 ET 4",null,3,3380,10140]
["A0910","GEKA","GN13","EBAUCHE NON TOURNEE",null,8,3920,31360]
["A0911","GEKA","GN13","EBAUCHE NON TOURNEE",null,8,3920,31360]
["A0912",null,null,null,null,null,null,""]
["A0913","GEKA","GN13A","EBAUCHE NON FRAISEE",null,8,4260,34080]
["A0914",null,null,null,null,null,null,""]
["A0915","GEKA","GN13A","EBAUCHE NON TOURNEE",null,7,4580,32060]
["A0916","GEKA","GN13A","EBAUCHE NON TOURNEE",null,5,4600,23000]
["A0917",null,null,null,null,null,null,""]
["A0918","GEKA","GN13A","EBAUCHE FRAISEE",null,1,4240,4240]
["A0919","GEKA",null,"SOUS TIGE",null,3,3940,11820]
["A0920","GEKA","GN8/31 DOUBLE","ALPS 150 EBAUCHE ",null,4,2394,9576]
["A0921","GEKA","GN5 DOUBLE","ALPS 150 EBAUCHE ",null,22,1378,30316]
["A0922",null,null,null,null,null,null,""]
["A0923",null,null,null,null,null,null,""]
["A0924",null,null,null,null,null,null,""]
["A0925",null,null,null,null,null,null,""]
["A1001","GEKA","GM5","EBAUCHE CARRE 0° ET 45°",null,31,390,12090]
["A1002","GEKA",null,null,null,null,null,""]
["A1003-A","GEKA","GM10","EBAUCHE FRAISEE  PERCEE Ø36",null,2,864,1728]
["A1003-B","GEKA","GM10","EBAUCHE FRAISEE  PERCEE Ø50",null,2,710,1420]
["A1004","GEKA","GM8","EBAUCHE CARRE 0° ET 45°",null,33,690,22770]
["A1005","GEKA","GM8","EBAUCHE CARRE 0° ET 90°",null,0,null,""]
["A1006","GEKA","GM8","9023 DEPORTEE",null,74,694,51356]
["A1007","GEKA","GM8","EBAUCHE EXCENTREE",null,null,null,""]
["A1008","GEKA","GM8","EBAUCHE",null,49,590,28910]
["A1009","GEKA","GM8","EBAUCHE",null,10,440,4400]
["A1010","GEKA","GM8","EBAUCHE FRAISEE PERCEE",null,4,453,1812]
["A1011","GEKA","GM8","EBAUCHE FRAISEE PERCEE",null,2,440,880]
["A1012","GEKA","GM8","EBAUCHE FRAISEE PERCEE",null,64,440,28160]
["A1013-A","GEKA","GM8","EBAUCHE 1/4 ROND  L 50",null,3,1088,3264]
["A1013-B","GEKA","GM8","EBAUCHE 1/4 ROND  L 40",null,17,866,14722]
["A1013-C","GEKA","GM8","EBAUCHE 1/4 ROND  L 55",null,1,1198,1198]
["A1014","GEKA","GM11","EBAUCHE",null,6,1049,6294]
["A1015","GEKA","GM11","EBAUCHE",null,null,null,""]
["A1016-A","GEKA","GM11","EBAUCHE PERCEE",null,6,754,4524]
["A1016-B","GEKA","GM11","EBAUCHE FRAISEE PERCEE",null,2,737,1474]
["A1017","GEKA","GM12","EBAUCHE",null,16,1726,27616]
["A1018","GEKA","GM12","EBAUCHE",null,null,null,""]
["A1019","GEKA","GM12","EBAUCHE FRAISEE PERCEE",null,0,null,""]
["A1020","GEKA","GM13","EBAUCHE",null,6,2686,16116]
["A1021","GEKA","GM13","EBAUCHE",null,2,2688,{"$f":"IF(G331>0,G331*F331,\" \")","v":5376}]
["A1022","GEKA","GM13","EBAUCHE PERCEE",null,0,null,""]
["A1023-A","GEKA","GM11","EBAUCHE 1/4 ROND",null,0,null,""]
["A1023-B","GEKA","GM12","EBAUCHE 1/4 ROND",null,1,3132,3132]
["A1024","GEKA","GM13","EBAUCHE 1/4 ROND",null,2,4900,9800]
["A1025",null,null,null,null,null,null,""]
["A1101-A","ROUYER RC","C14","EBAUCHE",null,59,52,3068]
["A1101-B",null,null,null,null,null,null,""]
["A1102-A","ROUYER RC","C14","EBAUCHE SUPERIEUR",null,9,114,1026]
["A1102-B",null,null,null,null,null,null,""]
["A1103-A","ROUYER RC","C14","EBAUCHE 2 REPERES",null,35,68,2380]
["A1103-B","ROUYER RC","C14","EBAUCHE SUPERIEUR 2 REPERES",null,8,109,872]
["A1104-A",null,null,null,null,null,null,""]
["A1104-B",null,null,null,null,null,null,""]
["A1105-A","ROUYER RC","C18","EBAUCHE",null,2,82,164]
["A1105-B",null,null,null,null,null,null,""]
["A1106-A","ROUYER RC","C18","EBAUCHE SUPERIEUR",null,16,131,2096]
["A1106-B",null,null,null,null,null,null,""]
["A1107-A","ROUYER RC","C18","EBAUCHE 2 REPERES",null,4,105,420]
["A1107-B",null,null,null,null,null,null,""]
["A1108-A","ROUYER RC","C18","EBAUCHE SUPERIEUR 2 REPERES",null,0,null,""]
["A1108-B",null,null,null,null,null,null,""]
["A1109-A","ROUYER RC","C22","EBAUCHE",null,25,188,4700]
["A1109-B",null,null,null,null,null,null,""]
["A1110-A","ROUYER RC","C22","EBAUCHE SUPERIEUR",null,51,203,10353]
["A1110-B",null,null,null,null,null,null,""]
["A1111-A","ROUYER RC","C22","EBAUCHE 2 REPERES",null,0,null,""]
["A1111-B",null,null,null,null,null,null,""]
["A1112-A","ROUYER RC","C22","EBAUCHE SUPERIEUR 2 REPERES",null,28,301,8428]
["A1112-B",null,null,null,null,null,null,""]
["A1113-A",null,null,null,null,null,null,""]
["A1113-B","ROUYER RC","M22","EBAUCHE",null,null,null,""]
["A1114-A","ROUYER RC","M26","EBAUCHE",null,42,55,2310]
["A1114-B",null,null,null,null,null,null,""]
["A1115-A","ROUYER RC","M30","EBAUCHE",null,22,84,1848]
["A1115-B","ROUYER RC","M30","EBAUCHE FRAISEE  PERCEE 2 REPERES 0° 90°",null,14,62,868]
["A1116-A","ROUYER RC","M31","EBAUCHE",null,23,88,2024]
["A1116-B",null,null,null,null,null,null,""]
["A1117-A","ROUYER RC","M34","EBAUCHE",null,null,null,""]
["A1117-B",null,null,null,null,null,null,""]
["A1118-A","ROUYER RC","M39","EBAUCHE",null,152,174,26448]
["A1118-B",null,null,null,null,null,null,""]
["A1119-A","ROUYER RC","M40","EBAUCHE",null,null,null,""]
["A1119-B",null,null,null,null,null,null,""]
["A1120-A","ROUYER RC","M41","EBAUCHE",null,17,188,3196]
["A1120-B",null,null,null,null,null,null,""]
["A1121A","ROUYER RC","M41","EBAUCHE 2 REPERES",null,31,180,5580]
["A1121-B",null,null,null,null,null,null,""]
["A1122","ROUYER RC","M47","EBAUCHE",null,12,194,2328]
["A1123","ROUYER RC","M47",null,null,0,null,""]
["A1124",null,null,null,null,0,null,""]
["A1125",null,null,null,null,0,null,""]
["A1201","BOUTILLON","PN1","EBAUCHE",null,0,null,""]
["A1202","BOUTILLON","PN1","EBAUCHE FRAISEE",null,0,null,""]
["A1203-A","BOUTILLON","PN2","EBAUCHE",null,0,109,0]
["A1203-B","BOUTILLON","PN2","EBAUCHE FRAISEE",null,0,null,""]
["A1204","BOUTILLON","PN3","EBAUCHE",null,0,null,""]
["A1205","BOUTILLON","PN3","EBAUCHE",null,3,223,669]
["A1206","BOUTILLON","PN4","EBAUCHE",null,21,332,6972]
["A1207","BOUTILLON","PN4","EBAUCHE FRAISEE",null,1,255,255]
["A1208","BOUTILLON","PN5","EBAUCHE",null,1,531,531]
["A1209","BOUTILLON","PN5","EBAUCHE FRAISEE",null,25,528,13200]
["A1210","BOUTILLON","PED","Ø55",null,1,1324,1324]
["A1211","BOUTILLON","PED","Ø90",null,1,2977,2977]
["A1212","BOUTILLON","M24","EBAUCHE",null,null,null,{"$f":"IF(G395>0,G395*F395,\" \")","v":""}]
["A1213","BOUTILLON","M24","EBAUCHE PERCEE",null,0,null,""]
["A1214","BOUTILLON","M32","EBAUCHE",null,69,156,10764]
["A1215","BOUTILLON","M32","EBAUCHE PERCEE",null,22,120,2640]
["A1216","BOUTILLON","M45","EBAUCHE",null,150,365,54750]
["A1217","BOUTILLON","M45","EBAUCHE",null,108,365,39420]
["A1218","BOUTILLON","M45","EBAUCHE PERCEE Ø3 2 REPERES 0° ET 90°",null,49,361,17689]
["A1219","BOUTILLON","M45","EBAUCHE PERCEE Ø24 2 REPERES 0° - 90°",null,27,291,7857]
["A1220","BOUTILLON","M45","EBAUCHE PERCEE Ø29 2 REPERES 0° - 90°",null,79,363,28677]
["A1221","BOUTILLON","M55","EBAUCHE",null,8,549,4392]
["A1222","BOUTILLON","M55","EBAUCHE PERCEE 2 REPERES 0° ET 90°",null,20,361,7220]
["A1223","BOUTILLON","M95","EBAUCHE",null,3,2371,7113]
["A1224",null,null,null,null,null,null,""]
["A1225",null,null,null,null,null,null,""]
["A1301-A","ABL","C18","EBAUCHE",null,70,86,6020]
["A1301-B","ABL","C18","EBAUCHE SUPERIEUR Ø20 ",null,17,106,1802]
["A1301-C","ABL","C18","EBAUCHE Lg 40 TREMPEE",null,21,77,1617]
["A1301-D","ABL","C18","EBAUCHE Lg 45 TREMPEE",null,7,89,623]
[null,null,null,null,null,null,null,""]
["A1302-A","ABL","C18","EBAUCHE FRAISEE 0 ET 90°",null,4,84,336]
["A1302-B","ABL","C20","EBAUCHE FRAISEE 0 ET 90° SUPERIEUR \u009dØ30",null,20,180,3600]
["A1302-C","ABL","C20","EBAUCHE FRAISEE 1 REPERE",null,25,120,3000]
["A1303-A","ABL","M32","EBAUCHE Ø32 L30",null,17,144,2448]
["A1303-B","ABL","M24","EBAUCHE PERCEE \u009dØ15  L20",null,25,46,1150]
["A1304","ABL","M32","EBAUCHE FRAISEE PERCEE 0° ET 90° L30",null,20,116,2320]
["A1305","ABL","M32","EBAUCHE Ø32 L32",null,0,null,""]
["A1306-A","ABL","M32","EBAUCHE FRAISEE 0° ET 90° L32",null,11,193,2123]
["A1306-B","ABL","M32","EBAUCHE FRAISEE PERCEE 0° ET 90° L32",null,29,111,3219]
["A1307","ABL - PROFEL","PA3000 POINCON","EBAUCHE FRAISEE",null,10,248,2480]
["A1308-A","ABL - PROFEL","T22 MATRICE Ø31,7","EBAUCHE",null,0,null,""]
["A1308-B","ABL - PROFEL","T22 MATRICE Ø31,7","EBAUCHE FRAISEE PERCEE 0° ET 90°",null,0,null,""]
["A1309-A","ABL - PROFEL","T32 MATRICE Ø54","EBAUCHE",null,0,null,""]
["A1309-B","ABL - PROFEL","T32 MATRICE Ø54","EBAUCHE FRAISEE PERCEE 0° ET 90°",null,0,null,""]
["A1310","ABL - PROFEL","PA5000 POINCON","EBAUCHE FRAISEE",null,0,null,""]
["A1311-A","ABL - PROFEL","PA5000 MATRICE Ø38,1","EBAUCHE",null,0,null,""]
["A1311-B","ABL - PROFEL","PA5000 MATRICE Ø38,1","EBAUCHE FRAISEE PERCEE 0° ET 90°",null,0,null,""]
["A1312","ABL - PROFEL","PA5046 MATRICE Ø46","EBAUCHE",null,72,382,27504]
["A1313","ABL - PROFEL","PA5046 MATRICE Ø46","EBAUCHE PERCEE",null,83,337,27971]
["A1314","ABL - PROFEL","PA5046 MATRICE Ø46","EBAUCHE 2 REPERES",null,93,382,35526]
["A1315","PROFEL","CORPS 25","EBAUCHE",null,0,null,""]
["A1316","PROFEL","CORPS 25","EBAUCHE",null,0,null,""]
["A1317","PROFEL","CORPS 40","EBAUCHE",null,39,1072,41808]
["A1318","PROFEL","CORPS 40","EBAUCHE",null,18,1018,18324]
["A1319","PROFEL","M38","EBAUCHE",null,0,null,""]
["A1320","PROFEL","M38","EBAUCHE PERCEE 2 REPERES 0° ET 90°",null,0,null,""]
["A1321","PROFEL","M48","EBAUCHE",null,154,268,41272]
["A1322","PROFEL","M48","EBAUCHE PERCEE 2 REPERES 0° ET 180°",null,155,265,41075]
["A1323","PROFEL","M48","EBAUCHE PERCEE 2 REPERES 0° ET 90°",null,0,null,""]
["A1324-A","PROFEL","M58","EBAUCHE",null,15,509,7635]
["A1324-B","PROFEL","M58","EBAUCHE PERCEE",null,43,362,15566]
["A1325-A","PROMAT/PROFEL","M58","EBAUCHE FRAISEE PERCEE 0° ET 90°",null,10,395,3950]
["A1325-B","PROMAT","CORPS 32","EBAUCHE FRAISEE",null,14,354,4956]
[null,null,null,null,null,null,"poids total",{"$f":"(SUM(H4:H446))/1000","v":3820.837}]

{"sheet":"GESTION B","index":1,"n_rows":418,"n_cols":9,"rows_kept":418,"cut":false,"hidden":false,"merged":[[0,1,0,4],[0,6,0,7]]}
[null,"GESTION DE STOCK B"]
["ADRESSES","MACHINES","REFERENCES","DESIGNATIONS","FIFO","STOCKS","POIDS/PIECE","POIDS TOTAL"]
[null,null,null,null,null," ",null,{"$f":"IF(G3>0,G3*F3,\" \")","v":""}]
["B0101-A","KINGSLAND",9001,"EBAUCHE FRAISEE",null,45,357,{"$f":"IF(G4>0,G4*F4,\" \")","v":16065}]
["B0101-B","KINGSLAND",9001,"EBAUCHE FRAISEE L90",null,0,null,""]
["B0102-A","KINGSLAND",9001,"EBAUCHE FRAISEE L70",null,12,414,4968]
["B0102-B","KINGSLAND",9001,"EBAUCHE FRAISEE L71",null,1,418,418]
["B0103-A","KINGSLAND",9001,"EBAUCHE FRAISEE L80",null,2,471,942]
["B0103-B","KINGSLAND",9001,"EBAUCHE FRAISEE L97",null,1,573,573]
["B0104","KINGSLAND",9004,"EBAUCHE FRAISEE",null,2,550,1100]
["B0105","KINGSLAND",9004,"EBAUCHE FRAISEE",null,200,null," "]
["B0106-A","KINGSLAND",9004,"EBAUCHE FRAISEE L80",null,0," ",{"$f":"IF(F12>0,G12*F12,\" \")","v":""}]
["B0106-B","KINGSLAND",9004,"EBAUCHE FRAISEE L120",null,0,null,""]
["B0106-C","KINGSLAND",9004,"EBAUCHE FRAISEE L140",null,1,1244,1244]
["B0107","KINGSLAND",9007,"EBAUCHE FRAISEE",null,0,null,""]
["B0108","KINGSLAND",9007,"EBAUCHE FRAISEE",null,12,null," "]
["B0109","KINGSLAND",9006,"EBAUCHE FRAISEE",null,27,739,19953]
["B0110","KINGSLAND",9006,"EBAUCHE FRAISEE",null,0,null,""]
["B0111","KINGSLAND",9009,"EBAUCHE FRAISEE",null,12,1525,18300]
["B0112","KINGSLAND",9009,"EBAUCHE FRAISEE",null,0,null,""]
["B0113-A","KINGSLAND",9006,"EBAUCHE FRAISEE L…",null,0,null,""]
["B0113-B","KINGSLAND",9009,"EBAUCHE FRAISEE L…",null,11,1524,16764]
["B0114","KINGSLAND",9010,"EBAUCHE FRAISEE",null,12,3380,40560]
["B0115","KINGSLAND",9010,"EBAUCHE FRAISEE L70",null,4,3120,12480]
["B0116","KINGSLAND",9010,"EBAUCHE NON TOURNEE",null,4,3820,15280]
["B0117","KINGSLAND",9010,"EBAUCHE NON TOURNEE",null,12,3820,45840]
["B0118","KINGSLAND",9010,"EBAUCHE NON TOURNEE",null,12,3820,45840]
["B0119-A","KINGSLAND",9011,"EBAUCHE FRAISEE",null,6,5660,33960]
["B0119-B",null,null,null,null,null,null,""]
["B0119-C",null,null,null,null,null,null,""]
["B0120","KINGSLAND",9011,"EBAUCHE FRAISEE",null,5,5660,28300]
["B0121","KINGSLAND",9011,"EBAUCHE NON TOURNEE",null,6,5620,33720]
["B0122","KINGSLAND",9011,"EBAUCHE NON TOURNEE",null,6,5620,33720]
["B0123","KINGSLAND",9011,"EBAUCHE NON TOURNEE",null,6,5620,33720]
["B0124","KINGSLAND",9011,"EBAUCHE NON TOURNEE",null,4,5620,22480]
["B0125",null,null,null,null,null,null,""]
["B0201-A","KINGSLAND",9020,"EBAUCHE",null,44,171,7524]
["B0201-B","KINGSLAND",9020,"EBAUCHE FRAISEE PERCEE",null,24,78,1872]
["B0202-A","KINGSLAND",9022,"EBAUCHE",null,50,157,7850]
["B0202-B","KINGSLAND",9022,"EBAUCHE FRAISEE PERCEE",null,5,121,605]
["B0203","KINGSLAND",9023,"EBAUCHE",null,21,696,14616]
["B0204","KINGSLAND",9023,"EBAUCHE DEPORTEE",null,1,466,466]
["B0205","KINGSLAND",9023,"EBAUCHE PERCEE Ø20",null,12,564,6768]
["B0206","KINGSLAND",9023,"EBAUCHE FRAISEE PERCEE",null,4,460,1840]
["B0207","KINGSLAND",9023,"EBAUCHE FRAISEE PERCEE",null,60,460,27600]
["B0208","KINGSLAND",9023,"EBAUCHE FRAISEE PERCEE",null,0,null,""]
["B0209","KINGSLAND",9023,"EBAUCHE FRAISEE PERCEE",null,0,null,""]
["B0210","KINGSLAND",9023,"EBAUCHE FRAISEE PERCEE Ø3",null,0,null,""]
["B0211","KINGSLAND",9023,"EBAUCHE TOUT VENANT",null,4,912,3648]
["B0212","KINGSLAND",9023,"EBAUCHE 1/4 ROND",null,7,1155,8085]
["B0213","KINGSLAND",9024,"EBAUCHE",null,0,null,""]
["B0214","KINGSLAND",9024,"EBAUCHE",null,15,1209,18135]
["B0215","KINGSLAND",9025,"EBAUCHE",null,15,2520,37800]
["B0216","KINGSLAND",9025,"EBAUCHE",null,15,2520,37800]
["B0217","KINGSLAND",9025,"EBAUCHE FRAISEE PERCEE",null,2,1537,3074]
["B0218","KINGSLAND",9023,"EBAUCHE PERCEE Ø48 2 PLATS 0° et 90°",null,30,480,14400]
["B0219",null,null,null,null,null,null,""]
["B0220",null,null,null,null,null,null,""]
["B0221",null,null,null,null,null,null,""]
["B0222",null,null,null,null,null,null,""]
["B0223",null,null,null,null,null,null,""]
["B0224",null,null,null,null,null,null,""]
["B0225",null,null,null,null,null,null,""]
["B0301","MUBEA","GR2","EBAUCHE FRAISEE",null,28,387,10836]
["B0302","MUBEA","GR2","EBAUCHE FRAISEE",null,0,null,""]
["B0303","MUBEA","GR2","EBAUCHE FRAISEE",null,0,null,""]
["B0304-A","MUBEA","GR2","EBAUCHE FRAISEE 0 ET 45°",null,0,null,""]
["B0304-B","MUBEA","GR2",null,null,0,null,{"$f":"IF(G68>0,G68*F68,\" \")","v":""}]
["B0305-A","MUBEA","GR2","EBAUCHE FRAISEE L85",null,9,482,4338]
["B0305-B","MUBEA","GR2","EBAUCHE FRAISEE L95",null,5,538,2690]
["B0305-C","MUBEA","GR2","EBAUCHE FRAISEE L90",null,12,510,6120]
["B0305-D","MUBEA","GR2","EBAUCHE FRAISEE L100",null,3,563,1689]
["B0306","MUBEA","GR2","CANON EUROPEEN",null,0,null,""]
["B0307","MUBEA","GR2","EBAUCHE FRAISEE EXCENTREE",null,1,410,410]
["B0308-A","MUBEA","GR2","EBAUCHE FRAISEE SUPERIEUR Ø55",null,9,768,6912]
["B0308-B","MUBEA","GR2","EBAUCHE FRAISEE SUPERIEUR Ø60",null,5,886,4430]
["B0308-C","MUBEA","GR2","EBAUCHE FRAISEE SUPERIEUR Ø32",null,9,406,3654]
["B0309","MUBEA","GR2","EBAUCHE PERCEE D6",null,24,387,9288]
["B0310","MUBEA","GR3","EBAUCHE FRAISEE",null,17,675,11475]
["B0311","MUBEA","GR3","EBAUCHE FRAISEE",null,17,675,11475]
["B0312","MUBEA","GR3","EBAUCHE FRAISEE",null,0,null,""]
["B0313","MUBEA","GR3","EBAUCHE FRAISEE 0 ET 45°",null,13,670,8710]
["B0314","MUBEA","GR3","EBAUCHE FRAISEE L…….",null,null,null,""]
["B0315","MUBEA","GR3","EBAUCHE FRAISEE EXCENTREE",null,8,714,5712]
["B0316","MUBEA","GR4","EBAUCHE FRAISEE",null,22,1044,22968]
["B0317","MUBEA","GR4","EBAUCHE FRAISEE",null,0,null,""]
["B0318","MUBEA","GR4","EBAUCHE FRAISEE",null,0,null,""]
["B0319","MUBEA","GR4","EBAUCHE FRAISEE 0 ET 45°",null,0,null,""]
["B0320","MUBEA","GR4","EBAUCHE FRAISEE EXCENTREE",null,16,1105,17680]
["B0321-A","MUBEA","GR4","EBAUCHE FRAISEE L90",null,3,1395,4185]
["B0321-B","MUBEA","GR4","EBAUCHE FRAISEE L100",null,3,1576,4728]
["B0321-C","MUBEA","GR4","EBAUCHE FRAISEE L110",null,2,1697,3394]
["B0321-D","MUBEA","GR4","EBAUCHE FRAISEE L130",null,1,1999,1999]
["B0322",null,null,null,null,null,null,""]
["B0323",null,null,null,null,null,null,""]
["B0324",null,null,null,null,null,null,""]
["B0325",null,null,null,null,null,null,""]
["B0401","MUBEA","ED50","CORPS 80 1 ENCOCHE",null,6,3140,18840]
["B0402","MUBEA","ED50","CORPS 80 2 ENCOCHES",null,12,3140,37680]
["B0403","MUBEA","ED50","CORPS 101 1 ENCOCHE",null,4,4440,17760]
["B0404","MUBEA","ED50","CORPS 101 2 ENCOCHES",null,9,4420,39780]
["B0405","MUBEA","ED50","CORPS 101 2 ENCOCHES",null,2,4420,8840]
["B0406","MUBEA","M45","EBAUCHE EXCENTREE",null,42,274,11508]
["B0407-A","MUBEA","M30","EBAUCHE PERCEE 1 REPERE",null,0,null,""]
["B0407-B","MUBEA","M30","EBAUCHE PERCEE 2 REPERES 0° ET 90°",null,164,65,10660]
["B0408-A","MUBEA","M30","EBAUCHE PERCEE D3 2 REPERES 0° ET 90°",null,94,280,26320]
["B0408-B","MUBEA","M45","EBAUCHE PERCEE 4 REPERES",null,8,660,5280]
["B0409-A","MUBEA","M45","EBAUCHE",null,12,865,10380]
["B0409-B","MUBEA",null,null,null,0,null,""]
["B0410","MUBEA","M45","EBAUCHE PERCEE 2 REPERES 0° ET 90°",null,0,184,0]
["B0411","MUBEA","M45","EBAUCHE PERCEE 2 REPERES 0° ET 90°",null,52,184,9568]
["B0412-A","MUBEA","M45","EBAUCHE PERCEE 4 REPERES",null,0,null,""]
["B0412-B","MUBEA","M45","EBAUCHE PERCEE Ø34 et Ø3 2 REPERES 0° et 90°",null,0,null,""]
["B0413-A","MUBEA","M45","EBAUCHE 3 REPERES 0° 45° 90° ",null,24,965,23160]
["B0413-B","MUBEA","M45","EBAUCHE PERCEE D3 3 REPERES 0° 45° 90°",null,41,960,39360]
["B0413-C","MUBEA","M45","EBAUCHE PERCEE D3 2 REPERES 0° ET 90°",null,8,965,7720]
["B0414","MUBEA","M45","EBAUCHE 1/4 ROND",null,1,1670,1670]
["B0415-A","MUBEA","M45","EBAUCHE UPN",null,6,965,5790]
["B0415-B","MUBEA","M45","EBAUCHE IPN ",null,23,1050,24150]
["B0416","MUBEA","M45","EBAUCHE UPN FRAISEE",null,14,1045,14630]
["B0417","MUBEA","M45","EBAUCHE IPN FRAISEE",null,86,1155,99330]
["B0418","MUBEA","M60","EBAUCHE",null,0,null,""]
["B0419","MUBEA","M60","EBAUCHE",null,0,null,""]
["B0420","MUBEA","M60","EBAUCHE PERCEE 2 REPERES 0° ET 90°",null,56,400,22400]
["B0421","MUBEA","M60","EBAUCHE PERCEE 2 REPERES 0° ET 90°",null,0,null,""]
["B0422","MUBEA","M60","EBAUCHE PERCEE 2 REPERES 0° ET 90°",null,40,1485,59400]
["B0423","MUBEA","M60","EBAUCHE 3 REPERES 0° 45° 90° ",null,15,1435,21525,{"$f":"IF(F124=0,\"B908\",\" \")","v":""}]
["B0424-A","MUBEA","M60","EBAUCHE EXCENTREE",null,16,2295,36720]
["B0424-B","MUBEA","M60","EBAUCHE EXCENTREE PERCEE",null,1,1375,1375]
["B0425-A","MUBEA","M60","EBAUCHE 1/4 ROND",null,2,4155,8310]
["B0425-B","MUBEA","M60","EBAUCHE 1/4 ROND PERCEE",null,4,3295,13180]
["B0501","MUBEA","M60","EBAUCHE  PERCEE D3",null,33,649,{"$f":"IF(G132>0,G132*F132,\" \")","v":21417}]
["B0502-A","MUBEA","M60","EBAUCHE UPN",null,16,715,11440]
["B0502-B","MUBEA","P. N°4","EBAUCHE FRAISEE Ø26,2 L85",null,0,null,""]
["B0503","MUBEA","M80","EBAUCHE PERCEE 2 REPERES 0° ET 90°",null,1,911,911]
["B0504","MUBEA","M80","EBAUCHE PERCEE 2 REPERES 0° ET 90°",null,0,null,""]
["B0505","MUBEA","M80","EBAUCHE 2 REPERES 0° ET 45°",null,1,1041,1041]
["B0506","MUBEA","M80","EBAUCHE",null,0,null,""]
["B0507","MUBEA","M80","EBAUCHE 3 REPERES 0° 45° 90° ",null,1,1547,1547]
["B0508","MUBEA","M80","EBAUCHE 1/4 ROND",null,6,2519,15114]
["B0509","MUBEA","M110","EBAUCHE",null,10,2912,29120]
["B0510","MUBEA","M110","EBAUCHE PERCEE",null,2,1996,3992]
["B0511","MUBEA","M150","EBAUCHE",null,4,5460,21840]
["B0512","MUBEA","M150","EBAUCHE",null,2,5460,10920]
["B0513",null,null,null,null,null,null,""]
["B0514",null,null,null,null,null,null,""]
["B0515",null,null,null,null,null,null,""]
["B0516",null,null,null,null,null,null,""]
["B0517",null,null,null,null,null,null,""]
["B0518",null,null,null,null,null,null,""]
["B0519",null,null,null,null,null,null,""]
["B0520",null,null,null,null,null,null,""]
["B0521",null,null,null,null,null,null,""]
["B0522",null,null,null,null,null,null,""]
["B0523",null,null,null,null,null,null,""]
["B0524",null,null,null,null,null,null,""]
["B0525",null,null,null,null,null,null,""]
["B0601","MUBEA","GR3","SOUS TIGE 60",null,25,523,13075]
["B0602","MUBEA","GR2","SOUS TIGE 65",null,23,899,20677]
["B0602","MUBEA","GR2","SOUS TIGE 100",null,1,2345,2345]
["B0603","MUBEA","GR4","SOUS TIGE 65",null,35,681,23835]
["B0604","MUBEA","C10","EBAUCHE",null,22,21,462]
["B0605-A","MUBEA","C15","EBAUCHE 1 REPERE",null,41,71,2911]
["B0605-B","MUBEA","C15","EBAUCHE 2 REPERES",null,9,70,630]
["B0606-A","MUBEA","C15","EBAUCHE SUPERIEUR Ø20 1 REPERE",null,5,99,495]
["B0606-B","MUBEA","C15","EBAUCHE SUPERIEUR Ø20 2 REPERES",null,0,96,0]
["B0607-A","MUBEA","C15","EBAUCHE SUPERIEUR Ø30 1 REPERE",null,2,215,430]
["B0607-B","MUBEA","C15","EBAUCHE SUPERIEUR Ø30 2 REPERES",null,4,198,792]
["B0608","MUBEA","C15","MIXTE",null,null,null,""]
["B0609-A","MUBEA","C20","EBAUCHE SUPERIEUR Ø20 1 REPERE",null,34,172,5848]
["B0609-B","MUBEA","C20","EBAUCHE SUPERIEUR Ø20 2 REPERES",null,34,170,5780]
["B0609-C","MUBEA","C20","EBAUCHE SUPERIEURE Ø30 2 REPERES 0° et 90°",null,12,241,2892]
["B0610","MUBEA","TRI","EBAUCHE FRAISEE",null,23,539,12397]
["B0611-A","MUBEA/SUNRISE","RP4","EBAUCHE",null,9,1503,13527]
["B0611-B","MUBEA/SUNRISE","RP4","EBAUCHE FRAISEE",null,2,1497,2994]
["B0612-A","MUBEA/SUNRISE","RP5","EBAUCHE",null,5,2044,10220]
["B0612-B","MUBEA/SUNRISE","RP5","EBAUCHE FRAISEE",null,0,null,""]
["B0613","MUBEA/SUNRISE","RP6","EBAUCHE",null,0,null,""]
["B0614","MUBEA/SUNRISE","RP6","EBAUCHE FRAISEE",null,15,3124,46860]
["B0615","MUBEA/SUNRISE","RP8","EBAUCHE",null,2,4540,9080]
["B0616","MUBEA/SUNRISE","RP8","EBAUCHE FRAISEE",null,6,4140,24840]
["B0617","SUNRISE","GP-P01-075-3","EBAUCHE",null,16,3562,56992]
["B0618","SUNRISE","GP-P01-075-3","EBAUCHE",null,11,3562,39182]
["B0619","SUNRISE","GP-P01-075-3","EBAUCHE FRAISEE",null,11,3096,34056]
["B0620","SUNRISE","GP-P01-075-3","EBAUCHE FRAISEE",null,11,3096,34056]
["B0621","SUNRISE","GP-P01-100-3","EBAUCHE",null,10,5960,59600]
["B0622","SUNRISE","GP-P01-100-3","EBAUCHE",null,8,5960,47680]
["B0623","SUNRISE","GP-P01-100-3","EBAUCHE FRAISEE L90",null,6,5460,32760]
["B0624","SUNRISE","GP-P01-075-3","EBAUCHE AUDINOX",null,3,3098,9294]
["B0625",null,null,null,null,null,null,""]
["B0701-A","VERNET","P. N°1","EBAUCHE FRAISEE L4",null,0,null,""]
["B0701-B","VERNET","P. N°2","EBAUCHE FRAISEE L4",null,125,68,8500]
["B0702-A","VERNET","P. N°3","EBAUCHE FRAISEE L4",null,60,180,10800]
["B0702-B","VERNET","P. N°3","EBAUCHE FRAISEE L4 LONG +3 MM",null,8,193,1544]
["B0703-A","VERNET","P. N°4","EBAUCHE FRAISEE L4",null,48,285,13680]
["B0703-B","VERNET","P. N°4","EBAUCHE FRAISEE CROIX L4",null,7,285,{"$f":"IF(G196>0,G196*F196,\" \")","v":1995}]
["B0704","VERNET","P. N°4","EBAUCHE FRAISEE CROIX L8",null,85,272,23120]
["B0705-A","VERNET","P. N°4","EBAUCHE FRAISEE ERGOT 8 AVEC MOUCHE Ø33",null,26,305,7930]
["B0705-B","VERNET","P. N°4","EBAUCHE FRAISEE ERGOT 8 SANS MOUCHE Ø33",null,16,300,4800]
["B0706","VERNET","P. N°4","EBAUCHE FRAISEE ERGOT 8 AVEC MOUCHE",null,10,292,2920]
["B0707","VERNET","P. N°1 PG80","EBAUCHE FRAISEE L8",null,18,462,8316]
["B0708","VERNET","P. N°1 PG80","EBAUCHE FRAISEE ERGOT 8 SANS MOUCHE",null,30,481,14430]
["B0709","VERNET","P. N°1 PG80","EBAUCHE FRAISEE CROIX L8",null,24,461,11064]
["B0710","VERNET","P. N°1 PG116/MAP AMB","EBAUCHE FRAISEE ERGOT 8 AVEC MOUCHE",null,17,536,9112]
["B0711","VERNET","P. N°1 PG116/MAP AME","EBAUCHE FRAISEE CROIX L8",null,3,510,1530]
["B0712","VERNET","P. N°1 PG116/MAP AME","EBAUCHE FRAISEE ERGOT 8 SANS MOUCHE",null,21,531,11151]
["B0713","VERNET","P. N°2 PG116/MAP AME","EBAUCHE FRAISEE ERGOT 8 SANS MOUCHE",null,2,757,1514]
["B0714","VERNET","P. N°4","EBAUCHE FRAISEE L8",null,5,278,1390]
["B0714","VERNET","P. N°1 PG116/MAP AME","EBAUCHE FRAISEE L8",null,3,428,1284]
["B0715",null,null,null,null,0,null,""]
["B0716",null,null,null,null,0,null,""]
["B0717","VERNET","PED 30","EBAUCHE  \u009d\u009dØ75 FRAISE 0° ET 90°",null,14,2.2330000000000001,31.262]
["B0718","VERNET","PED 30","Ø50 FRAISEE 0° ET 90°",null,12,1136,13632]
["B0719","VERNET","PED 30","EBAUCHE  \u009d\u009dØ80 FRAISE 0° ET 90°",null,9,2.69,24.21]
["B0720","VERNET","PED 30","EBAUCHE  \u009d\u009dØ80 FRAISE 0° ET 90°",null,9,2.69,24.21]
["B0721","VERNET","PED 30","Ø98",null,0,null,""]
["B0722-A","VERNET","PED 25","EBAUCHE",null,1,363,363]
["B0722-B","VERNET","PG 41 ","EBAUCHE",null,10,691,6910]
["B0723",null,null,null,null,null,null,""]
["B0724","VERNET","TIRANT PORTE MATRICE","M14",null,89,155,13795]
["B0725","VERNET","DEVETISSEUR ","TIRANT DROIT",null,16,407,6512]
["B0725","VERNET","DEVETISSEUR ","MOLETTE DROITE",null,14,328,4592]
["B0725","VERNET","DEVETISSEUR ","TIRANT GAUCHE",null,14,403,5642,{"$f":"IF(F220=0,\"B908\",\" \")","v":""}]
["B0725","VERNET","DEVETISSEUR ","MOLETTE GAUCHE ",null,16,324,5184,""]
["B0801-A","VERNET","M25","EBAUCHE",null,0,null,"",""]
["B0801-B","VERNET","M25","EBAUCHE PERCEE",null,0,null,"",""]
["B0801-C","VERNET","M25","EBAUCHE FRAISEE PERCEE 0° ET 90°",null,24,48,1152,""]
["B0802-A","VERNET","M30","EBAUCHE PERCEE",null,138,76,10488]
["B0802-B","VERNET","M30","EBAUCHE FRAISEE PERCEE 0° ET 90°",null,217,79,17143]
["B0803","VERNET","M30","EBAUCHE FRAISEE PERCEE 0° ET 90°",null,495,79,39105]
["B0804","VERNET","M30","EBAUCHE FRAISEE PERCEE Ø3",null,355,94,33370,""]
["B0805","VERNET","M35","EBAUCHE PERCEE \u009dØ19",null,44,102,4488,""]
["B0806","VERNET","M35","EBAUCHE FRAISEE PERCEE 0° ET 90°",null,8,96,768,""]
["B0807","VERNET","M35","EBAUCHE FRAISEE PERCEE Ø3 0° ET 90°",null,0,null,"",""]
["B0808","VERNET","M45","EBAUCHE",null,121,305,36905,""]
["B0809","VERNET","M45","EBAUCHE FRAISEE PERCEE 0° ET 90°",null,74,219,16206,""]
["B0810","VERNET","M45","EBAUCHE FRAISEE PERCEE Ø3 0° ET 90°",null,92,300,27600]
["B0811","VERNET","M45","EBAUCHE PERCEE",null,3,228,684]
["B0812","VERNET","M55","EBAUCHE",null,70,457,31990]
["B0813","VERNET","M55","EBAUCHE FRAISEE PERCEE 0° ET 90°",null,88,335,29480]
["B0814","VERNET","M55","EBAUCHE FRAISEE PERCEE Ø3 0° ET 90°",null,43,451,19393]
["B0815","VERNET","M55","EBAUCHE 1 REPERE",null,2,401,802]
["B0816","VERNET","M70","EBAUCHE",null,20,738,14760]
["B0817","VERNET","M70","EBAUCHE FRAISEE PERCEE",null,0,null,""]
["B0818","VERNET","M90","EBAUCHE",null,1,440,440]
["B0819","VERNET","M90","EBAUCHE FRAISEE PERCEE",null,0,null,""]
["B0820-A","VERNET","M100","EBAUCHE TREMPEE",null,1,1518,1518]
["B0820-B","VERNET","M100","EBAUCHE",null,1,1518,1518]
["B0821","VERNET","M100","EBAUCHE PERCEE",null,0,null,""]
["B0822",null,null,null,null,null,null,""]
["B0823",null,null,null,null,null,null,""]
["B0824",null,null,null,null,null,null,""]
["B0825",null,null,null,null,null,null,""]
["B0901-A","VERNET","VP M20 H6","EBAUCHE",null,83,16,1328]
["B0901-B","VERNET","VP M20 H6","EBAUCHE FRAISEE",null,0,null,""]
["B0901-C","VERNET","VP M24 H7","EBAUCHE",null,145,25,3625]
["B0901-D","VERNET","VP M24 H7","EBAUCHE FRAISEE",null,42,24,1008,""]
["B0902-A","VERNET","VP M32 H8","EBAUCHE",null,30,49,1470]
["B0902-B","VERNET","VP M38 H9","EBAUCHE",null,136,78,10608]
["B0902-C","VERNET","VP M38 H10","EBAUCHE",null,9,49,441]
["B0903-A","VERNET","VP M43 H10","EBAUCHE",null,0,null,{"$f":"IF(G261>0,G261*F261,\" \")","v":""}]
["B0903-B","VERNET","VP M46 H10","EBAUCHE",null,5,128,640]
["B0904-A","VERNET","VP derniere  generation M24","EBAUCHE",null,0,null,""]
["B0904-B","VERNET","VP derniere  generation M32","EBAUCHE",null,0,null,""]
["B0905-A","VERNET","VP derniere  generation M38","EBAUCHE",null,0,null,""]
["B0905-B","VERNET",null,null,null,null,null,""]
["B0905-C","VERNET","VP derniere  generation M43","EBAUCHE",null,28,145,4060]
["B0905-D","VERNET","VP derniere  generation M43","EBAUCHE FRAISEE PERCEE",null,21,109,2289]
["B0906","VERNET","VP derniere  generation M48","EBAUCHE",null,41,180,7380]
["B0907-A","VERNET","MAP M25 ","EBAUCHE RAINURE CIRCULAIRE",null,0,null,""]
["B0907-B","VERNET","MAP M25 ","EBAUCHE RAINURE FRAISEE",null,0,null,""]
["B0907-C","VERNET","MAP M25 ","EBAUCHE RAINURE FRAISEE 0° ET 90°",null,0,null,""]
["B0908-A","VERNET","MAP M35","EBAUCHE RAINURE CIRCULAIRE",null,0,null,""]
["B0908-B","VERNET","MAP M35","EBAUCHE RAINURE FRAISEE",null,0,null,""]
["B0908-C","VERNET","MAP M35","EBAUCHE RAINURE FRAISEE 0° ET 90°",null,0,null,""]
["B0909","VERNET","MAP M42","EBAUCHE RAINURE CIRCULAIRE",null,163,154,25102]
["B0910-A","VERNET","MAP M42","EBAUCHE RAINURE FRAISEE 1 RAINURE",null,23,159,3657]
["B0910-B","VERNET","MAP M42","EBAUCHE RAINURE FRAISEE PERCEE 0° ET 45° ",null,8,158,1264]
["B0910-C","VERNET","MAP M42","EBAUCHE RAINURE FRAISEE PERCEE 0° ET 90° ",null,8,114,912,{"$f":"IF(F276=0,\"B908\",\" \")","v":""}]
["B0911","VERNET","MAP M55","EBAUCHE RAINURE FRAISEE",null,5,401,2005,""]
["B0912","VERNET","MAP M55","EBAUCHE RAINURE FRAISEE 0° ET 90°",null,89,402,35778,""]
["B0913-\u009d\u009dA","VERNET","MAP M55","EBAUCHE RAINURE FRAISEE PERCEE 0° ET 90° ",null,8,295,2360,""]
["B0913-B","VERNET","MAP M55","EBAUCHE VERTICAL + HORIZONTALE REP 0° ET 90°",null,26,302,7852]
["B0914","VERNET","PG M55","EBAUCHE",null,59,403,23777,{"$f":"IF(F280=0,\"B908\",\" \")","v":""}]
["B0915-A","VERNET","PG M55","EBAUCHE PERCEE Ø28",null,3,249,747]
["B0915-B","VERNET","PG M55","EBAUCHE FRAISEE PERCEE Ø36 0° ET 90°",null,46,230,10580,{"$f":"IF(F281=0,\"B908\",\" \")","v":""}]
["B0916-A","VERNET","PG M55","EBAUCHE PERCEE Ø31",null,10,293,2930,{"$f":"IF(F282=0,\"B908\",\" \")","v":""}]
["B0916-B","VERNET","PG M55","EBAUCHE PERCEE Ø35",null,15,292,4380]
["B0917-A","VERNET","MAP M55","EBAUCHE FRAISEE",null,21,233,4893,{"$f":"IF(F284=0,\"B908\",\" \")","v":""}]
["B0917-B","VERNET","MAP M55","EBAUCHE FRAISEE",null,5,362,1810]
["B0918","VERNET","MAP M70","EBAUCHE",null,6,652,3912,{"$f":"IF(F286=0,\"B908\",\" \")","v":""}]
["B0919","VERNET","PG M70","EBAUCHE",null,2,395,790,{"$f":"IF(F287=0,\"B908\",\" \")","v":""}]
["B0920-A","VERNET",null,null,null,0,null,"",{"$f":"IF(F289=0,\"B908\",\" \")","v":""}]
["B0920-B","VERNET","RETIS","POINCON N°5013710-9",null,14,759,10626]
["B0921","VERNET","RETIS","M55 EBAUCHE PERCEE 2 REPERES 0° et 90°",null,35,277,9695]
["B0922",null,null,null,null,null,null,""]
["B0923",null,null,null,null,null,null,""]
["B0924",null,null,null,null,null,null,""]
["B0925",null,null,null,null,null,null,""]
["B1001","IMAC SELFER ALFRA","P24","CORPS Ø24 PERCE 1 TROU Ø3",null,149,228,33972]
["B1002","IMAC SELFER ALFRA","P24","CORPS Ø24 PERCE 1 TROU Ø3",null,91,226,20566]
["B1003","IMAC SELFER ALFRA","P25","CORPS Ø25 PERCE 1 TROU Ø3",null,0,null,""]
["B1004","IMAC SELFER ALFRA","P26","CORPS Ø26 PERCE 1 TROU Ø3",null,0,null,""]
["B1005","IMAC SELFER ALFRA","P24 SUPERIEUR Ø30","CORPS Ø24 PERCE 1 TROU Ø3",null,21,266,5586]
["B1006","IMAC SELFER ALFRA","P24 EXCENTRE","CORPS Ø24 PERCE 4 TROUS Ø3",null,6,293,1758]
["B1007","IMAC","P40","EBAUCHE 2 REPERES",null,44,252,11088]
["B1008","IMAC","P40","EBAUCHE SUPERIEUR TREMPEE",null,9,294,2646]
["B1009","IMAC","P70","EBAUCHE 2 REPERES",null,7,503,3521]
["B1010-A","IMAC","P70","EBAUCHE SUPERIEUR TREMPEE",null,2,600,1200]
["B1010-B","IMAC","M54","EBAUCHE",null,2,445,890]
["B1011","IMAC","M42","EBAUCHE 1 REPERE ALESEE Ø30",null,154,129,19866]
["B1012-A","IMAC","M54","EBAUCHE PERCEE \u009dØ32 à RECTIFIER",null,26,338,8788]
["B1012-B","VERNET","M55","EBAUCHE PERCEE",null,12,380,4560]
["B1013","IMAC SELFER ALFRA","M42","EBAUCHE",null,279,176,49104]
["B1014","IMAC SELFER ALFRA","M42","EBAUCHE PERCEE Ø16",null,181,158,28598]
["B1015","IMAC SELFER ALFRA","M42","EBAUCHE PERCEE Ø16",null,130,157,20410]
["B1016","ALFRA","M42","EBAUCHE PERCEE Ø26 2 REPERES 0° - 90°",null,50,127,6350]
["B1017","IMAC SELFER ALFRA","M42","EBAUCHE PERCEE 1 REPERE FACE INCLINEE",null,97,178,17266]
["B1018","IMAC SELFER ALFRA","M42","EBAUCHE PERCEE 1 REPERE FACE INCLINEE",null,47,164,7708]
["B1019","IMAC","M40","EBAUCHE PERCEE Ø35 2 REPERES 0° ET 90°",null,63,339,21357]
["B1020-A","IMAC","M42","EBAUCHE TREMPEE RECTIFIEE Ø29",null,16,127,2032]
["B1020-B","IMAC","M45","EBAUCHE TREMPEE RECTIFIEE Ø3",null,0,null,""]
["B1021-A","IMAC","M42","EBAUCHE ELECTRO",null,72,129,9288]
["B1021-B",null,null,null,null,null,null,""]
["B1022","IMAC","P70","EBAUCHE TREMPEE",null,35,491,{"$f":"IF(G325>0,G325*F325,\" \")","v":17185}]
["B1023",null,null,null,null,null,null,""]
["B1024",null,null,null,null,null,null,""]
["B1025",null,null,null,null,null,null,""]
["B1101","ALPHYDRO","POINCON MN1","EBAUCHE FRAISEE",null,32,242,7744]
["B1102","ALPHYDRO","POINCON MN2","EBAUCHE FRAISEE",null,0,null,""]
["B1103","ALPHYDRO","POINCON MN3","EBAUCHE FRAISEE",null,0,null,""]
["B1104","ALPHYDRO","POINCON AM","EBAUCHE FRAISEE",null,13,182,2366]
["B1105-A","ALPHYDRO","POINCON SP","EBAUCHE",null,10,288,2880]
["B1105-B","ALPHYDRO","MATRICE SP","EBAUCHE",null,0,null,""]
["B1106","ALPHYDRO","MATRICE MN1","EBAUCHE",null,133,358,47614]
["B1107","ALPHYDRO","MATRICE MN1","EBAUCHE PERCEE Ø16",null,148,316,46768]
["B1108","ALPHYDRO","MATRICE MN1","EBAUCHE PERCEE Ø16",null,49,314,15386]
["B1109","ALPHYDRO","MATRICE MN1","EBAUCHE PERCEE Ø30 4 REPERES",null,49,245,12005]
["B1110","ALPHYDRO","MATRICE MN1","EBAUCHE FRAISEE 2 ENCOCHES 0 ET 180°",null,12,363,4356]
["B1111",null,null,null,null,null,null,""]
["B1112",null,null,null,null,null,null,""]
["B1113","IMS","M50,8","EBAUCHE 1 REPERE",null,44,396,17424]
["B1114-A","IMS","M50,8","EBAUCHE 2 REPERES",null,3,400,1200]
["B1114-B","IMS","M50,8","EBAUCHE",null,11,401,4411]
["B1115","IMS","M50,8","EBAUCHE 3 REPERES 0° 45° 90° ",null,47,270,12690]
["B1116","IMS","M79,5","EBAUCHE",null,4,1391,5564]
["B1117","IMS","M79,5","EBAUCHE PERCEE 2 REPERES 0° ET 90°",null,2,934,1868]
["B1118","IMS","M120","EBAUCHE",null,23,2204,50692]
["B1119","IMS","M120","EBAUCHE",null,8,2210,17680]
["B1120","IMS","M120","EBAUCHE FRAISEE PERCEE",null,1,1832,1832]
["B1121-A","IMS","C52","EBAUCHE SOUS TIGE 90 TALON",null,6,811,4866]
["B1121-B","IMS","C52","EBAUCHE PERCEE",null,2,2853,5706]
["B1122",null,null,null,null,null,null,""]
["B1123","IMS","C52","SOUS TIGE 108",null,2,2454,4908]
["B1124","IMS","C52","EBAUCHE FRAISEE",null,1,1024,1024]
["B1125",null,null,null,null,null,null,""]
["B1201-A","SOMMER","C22","EBAUCHE FRAISEE",null,5,127,635]
["B1201-B","SOMMER","M34 HAUTE","PERCEE Ø22 2 REPERES 0° ET 90°",null,8,274,2192]
["B1202",null,null,null,null,null,null,""]
["B1203-A","ARMO-EDNOR","C20","EBAUCHE FRAISEE 2 ENCOCHES",null,14,155,2170]
["B1203-B","ARMO-EDNOR","C20","EBAUCHE FRAISEE 2 ENCOCHES SUPERIEUR 25",null,10,188,1880]
["B1203-C","ARMO-EDNOR","TRA3454H18","EBAUCHE",null,23,257,5911]
["B1204-A","OMERA","M45","EBAUCHE PERCEE 2 REPERES 0° ET 90°",null,21,180,3780]
["B1204-B","OMERA","C30","EBAUCHE PERCEE GOUPILLE Ø5  0° ET 90°",null,11,283,3113]
["B1205","OMERA","C35","EBAUCHE PERCEE GOUPILLE Ø5  0° ET 90°",null,13,522,6786]
["B1206","OMERA","M65","EBAUCHE PERCEE Ø38 FRAISEE 1 REPERE",null,20,542,10840]
["B1207","SOCLAM","5012836-189","EBAUCHE",null,6,1154,6924]
["B1208-A","SUP-GRAUVRE","5013058-M35","EBAUCHE",null,19,65,1235]
["B1208-B","SUP-GRAUVRE","5013058-P14","EBAUCHE",null,14,112,1568]
["B1208-C","SUP-GRAUVRE","2013058-M35H10","EBAUCHE",null,13,73,949]
["B1209",null,null,null,null,null,null,""]
["B1210",null,null,null,null,null,null,""]
["B1211",null,null,null,null,null,null,""]
["B1212",null,null,null,null,null,null,""]
["B1213",null,null,null,null,null,null,""]
["B1214",null,null,null,null,null,null,""]
["B1215",null,null,null,null,null,null,""]
["B1216",null,null,null,null,null,null,""]
["B1217",null,null,null,null,null,null,""]
["B1218",null,null,null,null,null,null,""]
["B1219",null,null,null,null,null,null,""]
["B1220",null,null,null,null,null,null,""]
["B1221",null,null,null,null,null,null,""]
["B1222",null,null,null,null,null,null,""]
["B1223",null,null,null,null,null,null,""]
["B1224",null,null,null,null,null,null,""]
["B1225-A","EDEL","MT3030","EBAUCHE",null,27,97,2619]
["B1225-B","EDEL","MT3040","EBAUCHE",null,25,251,6275]
["B1301","GEKA","GN13","CONE REDUCTION EBAUCHE",null,24,1524,{"$f":"IF(G389>0,G389*F389,\" \")","v":36576}]
["B1302","GEKA","GN13","CONE REDUCTION EBAUCHE",null,18,1524,27432]
["B1303","PEDDY","PN11","CONE REDUCTION EBAUCHE",null,24,1577,37848]
["B1304","PEDDY","PN11","CONE REDUCTION EBAUCHE",null,9,1577,14193]
["B1305","SOCLAM","5012836 - 102","CONE REDUCTION EBAUCHE",null,5,1427,7135]
["B1306","SOCLAM","5012836 - 101","REDUCTION MATRICE",null,1,4470,4470]
["B1307","LOPIN","Ø113X26,5","EBAUCHE",null,10,2047,20470]
["B1308","LOPIN","Ø113XDIVERS","EBAUCHE",null,4,1958,7832]
["B1309-A","DENHEZ/RASKIN","M44","EBAUCHE PERCEE Ø23,5 2 REPERES 4 et 5",null,22,136,2992]
["B1309-B",null,null,null,null,null,null,""]
["B1310","DENHEZ/RASKIN","P NUM C30","EBAUCHE Ø21,5 FRAISEE L 6 + GOUPILLAGE",null,31,252,7812]
["B1311","DENHEZ/RASKIN","P NUM C30","EBAUCHE Ø29 FRAISEE L 6 + GOUPILLAGE",null,12,293,3516]
["B1312",null,null,null,null,null,null,""]
["B1313",null,null,null,null,null,null,""]
["B1314",null,null,null,null,null,null,""]
["B1315-B","SCOTCHMAN","C31,5","EBAUCHE FRAISEE",null,6,514,3084]
["B1315-A","SCOTCHMAN","C39","EBAUCHE FRAISEE",null,4,746,2984]
["B1316",null,null,null,null,null,null,""]
["B1317",null,null,null,null,null,null,""]
["B1318",null,null,null,null,null,null,""]
["B1319",null,null,null,null,null,null,""]
["B1320",null,null,null,null,null,null,""]
["B1321",null,null,null,null,null,null,""]
["B1322",null,null,null,null,null,null,""]
["B1323",null,null,null,null,null,null,""]
["B1324",null,null,null,null,null,null,""]
["B1325",null,null,null,null,null,null,""]
[null,null,null,null,null,null,null,{"$f":"SUM(H4:H415)/1000","v":3428.8536819999999}]
[]
[null,null,null,null,null,null,null,{"$f":"(SUM(H4:H415))/1000","v":3428.8536819999999}]

{"sheet":"GESTION C","index":2,"n_rows":332,"n_cols":8,"rows_kept":332,"cut":false,"hidden":false,"merged":[[0,2,0,4]]}
[null,null,"GESTION DE STOCK C"]
["ADRESSE","MACHINES","REFERENCES","DESIGNATIONS","FIFO","STOCKS","POIDS/PIECE","POIDS TOTAL"]
[null,null,null,null,null,null,null,{"$f":"IF(F3>0,F3*G3/1000,\" \")","v":""}]
["C0901","VERNET","5013710-1","EBAUCHE",null,0,125,{"$f":"IF(F4>0,F4*G4/1000,\" \")","v":""}]
["C0902",null,null,null,null,null,null,""]
["C0903",null,null,null,null,null,null,""]
["C0904",null,null,null,null,null,null,""]
["C0905",null,null,null,null,null,null,""]
["C0906",null,null,null,null,null,null,""]
["C0907",null,null,null,null,null,null,""]
["C0908",null,null,null,null,null,null,""]
["C0909",null,null,null,null,null,null,""]
["C0910",null,null,null,null,null,null,""]
["C0911",null,null,null,null,null,null,""]
["C0912",null,null,null,null,null,null,""]
["C0913",null,null,null,null,null,null,""]
["C0914",null,null,null,null,null,null,""]
["C0915",null,null,null,null,null,null,""]
["C0916",null,null,null,null,12,null,0]
["C0917",null,null,null,null,null,null,""]
["C1001",null,null,null,null,null,null,""]
["C1002",null,null,null,null,null,null,""]
["C1003",null,null,null,null,null,null,""]
["C1004",null,null,null,null,null,null,""]
["C1005",null,null,null,null,null,null,""]
["C1006",null,null,null,null,null,null,""]
["C1007",null,null,null,null,null,null,""]
["C1008",null,null,null,null,null,null,""]
["C1009",null,null,null,null,null,null,""]
["C1010",null,null,null,null,null,null,""]
["C1011",null,null,null,null,null,null,""]
["C1012",null,null,null,null,null,null,""]
["C1013",null,null,null,null,null,null,""]
["C1014",null,null,null,null,null,null,""]
["C1015",null,null,null,null,null,null,""]
["C1016",null,null,null,null,null,null,""]
["C1017",null,null,null,null,null,null,""]
["C1018",null,null,null,null,null,null,""]
["C1101",null,null,null,null,null,null,""]
["C1102",null,null,null,null,null,null,""]
["C1103",null,null,null,null,null,null,""]
["C1104",null,null,null,null,null,null,""]
["C1105",null,null,null,null,null,null,""]
["C1106",null,null,null,null,null,null,""]
["C1107",null,null,null,null,null,null,""]
["C1108",null,null,null,null,null,null,""]
["C1109",null,null,null,null,null,null,""]
["C1110",null,null,null,null,null,null,""]
["C1111",null,null,null,null,null,null,""]
["C1112",null,null,null,null,null,null,""]
["C1113",null,null,null,null,null,null,""]
["C1114",null,null,null,null,null,null,""]
["C1115",null,null,null,null,null,null,""]
["C1116",null,null,null,null,null,null,""]
["C1117",null,null,null,null,null,null,""]
["C1201-A","IRES","5013090+","EBAUCHE",null,21,371,7.7910000000000004]
["C1201-B",null,null,null,null,null,null,""]
["C1202-A","REY","P CORPS 26 Lg45","EBAUCHE FRAISEE",null,24,189,4.5359999999999996]
["C1202-B",null,null,null,null,null,null,""]
["C1203",null,null,null,null,null,null,""]
["C1204",null,null,null,null,null,null,""]
["C1205",null,null,null,null,null,null,""]
["C1206",null,null,null,null,null,null,""]
["C1207",null,null,null,null,null,null,""]
["C1208",null,null,null,null,null,null,""]
["C1209",null,null,null,null,null,null,""]
["C1210",null,null,null,null,null,null,""]
["C1211",null,null,null,null,null,null,{"$f":"IF(F68>0,F68*G68/1000,\" \")","v":""}]
["C1212",null,null,null,null,null,null,""]
["C1213",null,null,null,null,null,null,""]
["C1214",null,null,null,null,null,null,""]
["C1215","IMAC","P70","OBLONG 12/24",null,null,null,""]
["C1216","IMAC","M40","Ø26 J1",null,0,null,""]
["C1217-A","IMAC","P70","Ø11",null,0,null,""]
["C1217-B","IMAC","M40","Ø11",null,null,null,""]
["C1301-A","HUVEMA","CORPS 28","\u009d\u009d\u009d\u009dØ22,5",null,16,197,3.1520000000000001]
["C1301-B1","HUVEMA","CORPS 34","Ø16",null,31,238,7.3780000000000001]
["C1301-B2","IMAC","M40","Ø18 J,7",null,0,null,""]
["C1301-B3","IMAC","M40","T3000",null,0,null,""]
["C1302-A","HUVEMA","CORPS 34","\u009d\u009d\u009d\u009dØ22,5",null,13,274,3.5619999999999998]
["C1302-B","IMAC","M40","Ø19 RECTIF",null,0,null,""]
["C1303-A","IMAC","P70","Ø20",null,0,null,""]
["C1303-B","IMAC","M40","Ø20 J1",null,0,null,""]
["C1304-A","IMAC","P70","Ø21",null,0,null,""]
["C1304-B","IMAC","M40","Ø21",null,0,null,""]
["C1305-A","IMAC","P70","Ø22",null,0,null,""]
["C1305-B","IMAC","M40","Ø22 J2",null,0,null,""]
["C1305-C","IMAC","M40","Ø22 J1",null,0,null,""]
["C1305-D","IMAC","M40","Ø22 J,7",null,0,null,""]
["C1306-A","IMAC","P70","Ø23",null,0,null,""]
["C1306-B1","IMAC","M40","Ø23 J1",null,0,null,""]
["C1306-B2","IMAC",null,null,null,null,null,""]
["C1307-A","IMAC","P70","Ø24",null,0,null,""]
["C1307-B1","IMAC","M40","Ø24 J,7",null,0,null,""]
["C1307-B2","IMAC","M40","Ø24 J1",null,0,null,""]
["C1308-A","IMAC","P70","Ø25",null,0,null,""]
["C1308-B","IMAC","M40","Ø25",null,0,null,""]
["C1309-A","IMAC","P70","Ø30",null,0,null,""]
["C1309-B1","IMAC","M40","Ø30 J1",null,0,null,""]
["C1309-B2","IMAC","M40","Ø30 J2",null,0,null,""]
["C1310-A","IMAC","P70","Ø27",null,0,null,""]
["C1310-B","IMAC","M40","Ø27",null,0,null,""]
["C1311-A","IMAC","P70","Ø28",null,0,null,""]
["C1311-B1","IMAC","M40","Ø28",null,0,null,""]
["C1311-B2","IMAC","M40","Ø28 J1",null,0,null,""]
["C1311-B3","IMAC","M40","Ø28 J2",null,0,null,""]
["C1311-B4","IMAC","M40","Ø28,5 J1",null,0,null,""]
["C1311-B5","IMAC","M40","Ø28 J,7",null,0,null,""]
["C1312-A",null,null,null,null,null,null,""]
["C1312-B",null,null,null,null,0,null,""]
["C1313-A","IMAC","P70","Ø30",null,0,null,""]
["C1313-B","IMAC","M40","Ø30 J1",null,0,null,""]
["C1314-A1","IMAC","P70","Ø31,5",null,0,null,""]
["C1314-A2","IMAC","P70","Ø31",null,0,null,""]
["C1314-B1","IMAC","M40","Ø31,5 J1",null,0,null,""]
["C1314-B2","IMAC","M40","Ø31",null,0,null,""]
["C1315-A1","IMAC","P70","Ø32",null,0,null,""]
["C1315-A2","IMAC","P70","Ø33",null,0,null,""]
["C1315-A3","IMAC","P70","Ø34",null,0,null,""]
["C1315-A4","IMAC","P70","Ø35",null,0,null,""]
["C1315-B","IMAC","M40","Ø33",null,0,null,""]
["C1316-A","IMAC","P70","Ø31,5",null,0,null,""]
["C1316-B","IMAC","M40","Ø31,5",null,0,null,""]
["C1317-A1","IMAC","P40","Ø12",null,0,null,""]
["C1317-A2","IMAC","P40","Ø14",null,0,null,""]
["C1317-A3","IMAC","P40","Ø16",null,0,null,""]
["C1317-A4","IMAC","P40","Ø20",null,0,null,""]
["C1317-A5","IMAC","P40","Ø22",null,0,null,""]
["C1317-A6","IMAC","P40","Ø24",null,0,null,""]
["C1317-A7","IMAC","P40","Ø28",null,0,null,""]
["C1401-A","IMAC","P70","OBLONG 12/30",null,0,null,""]
["C1401-B","IMAC","M40","OBLONG 12/30 J1",null,0,null,{"$f":"IF(F132>0,F132*G132/1000,\" \")","v":""}]
["C1402-A","IMAC","P70","OBLONG 14/30",null,0,null,""]
["C1402-B","IMAC","M40","OBLONG 14/30 J1",null,0,null,""]
["C1403-A","IMAC","P70","OBLONG 16/30",null,0,null,""]
["C1403-B","IMAC","M40","OBLONG 16/30 J1",null,0,null,""]
["C1404-A","IMAC","P70","OBLONG 18/30",null,0,null,""]
["C1404-B","IMAC","M40","OBLONG 18/30",null,0,null,""]
["C1405-A","IMAC","P70","OBLONG 20/30",null,0,null,""]
["C1405-B","IMAC","M40","OBLONG 20/30 J1",null,0,null,""]
["C1406-A","IMAC","P70","OBLONG 22/30",null,0,null,""]
["C1406-B","IMAC","M40","OBLONG 22/30 J1",null,0,null,""]
["C1407-A","IMAC","P70","OBLONG 18/26",null,0,null,""]
["C1407-B","IMAC","M40","OBLONG 18/26 J1",null,0,null,""]
["C1408-A","IMAC","P70","OBLONG 22/26",null,0,null,""]
["C1408-B","IMAC","M40","OBLONG 22/26 J1",null,0,null,""]
["C1409-A","IMAC","P70","OBLONG 10/30",null,0,null,""]
["C1409-A","IMAC","M40","OBLONG 10/30 J1",null,0,null,""]
["C1410-A","IMAC","P70","OBLONG 8/30",null,0,null,""]
["C1410-B","IMAC",null,null,null,null,null,""]
["C1411-A","IMAC","P70","Ø10",null,0,null,""]
["C1411-B","IMAC","M40","Ø10 J1",null,0,null,""]
["C1411-C","IMAC","M40","Ø10 J7",null,0,null,""]
["C1412-A","IMAC","P70","Ø12",null,0,null,""]
["C1412-B","IMAC","M40","Ø12",null,0,null,""]
["C1412-C","IMAC","M40","Ø12 J,7",null,0,null,""]
["C1413-A","IMAC","P70","Ø13",null,0,null,""]
["C1413-B","IMAC","M40","Ø13",null,0,null,""]
["C1414-A","IMAC","P70","Ø14",null,0,null,""]
["C1414-B1","IMAC","M40","Ø14  J1",null,0,null,""]
["C1414-B2","IMAC","M40","Ø14,7",null,0,null,""]
["C1415-A","IMAC","P70","Ø15",null,0,null,""]
["C1415-B","IMAC","M40","Ø15",null,0,null,""]
["C1416-A","IMAC","P70","Ø16",null,0,null,""]
["C1416-B","IMAC","M40","Ø16",null,0,null,""]
["C1416-C","IMAC","M40","Ø16 J1",null,0,null,""]
["C1417-A","IMAC","P70","Ø17",null,0,null,""]
["C1417-B1","IMAC","M40","Ø17 J1",null,0,null,""]
["C1417-B2","IMAC","M40","Ø17 RECTIF",null,0,null,""]
["C1417-B3","IMAC","M40","Ø17",null,0,null,""]
[null,null,null,null,null,null,null,""]
[null,null,null,null,null,null,null,""]
[null,null,null,null,null,null,null,""]
[null,null,null,null,null,null,null,""]
[null,null,null,null,null,null,null,""]
[null,null,null,null,null,null,null,""]
[null,null,null,null,null,null,null,""]
[null,null,null,null,null,null,null,""]
[null,null,null,null,null,null,null,""]
[null,null,null,null,null,null,null,""]
[null,null,null,null,null,null,null,""]
[null,null,null,null,null,null,null,""]
[null,null,null,null,null,null,null,""]
[null,null,null,null,null,null,null,""]
[null,null,null,null,null,null,null,""]
[null,null,null,null,null,null,null,""]
[null,null,null,null,null,null,null,""]
[null,null,null,null,null,null,null,""]
[null,null,null,null,null,null,null,""]
[null,null,null,null,null,null,null,""]
[null,null,null,null,null,null,null,""]
[null,null,null,null,null,null,null,""]
[null,null,null,null,null,null,null,""]
[null,null,null,null,null,null,null,""]
[null,null,null,null,null,null,null,""]
[null,null,null,null,null,null,null,{"$f":"IF(F196>0,F196*G196/1000,\" \")","v":""}]
[null,null,null,null,null,null,null,""]
[null,null,null,null,null,null,null,""]
[null,null,null,null,null,null,null,""]
[null,null,null,null,null,null,null,""]
[null,null,null,null,null,null,null,""]
[null,null,null,null,null,null,null,""]
[null,null,null,null,null,null,null,""]
[null,null,null,null,null,null,null,""]
[null,null,null,null,null,null,null,""]
[null,null,null,null,null,null,null,""]
[null,null,null,null,null,null,null,""]
[null,null,null,null,null,null,null,""]
[null,null,null,null,null,null,null,""]
[null,null,null,null,null,null,null,""]
[null,null,null,null,null,null,null,""]
[null,null,null,null,null,null,null,""]
[null,null,null,null,null,null,null,""]
[null,null,null,null,null,null,null,""]
[null,null,null,null,null,null,null,""]
[null,null,null,null,null,null,null,""]
[null,null,null,null,null,null,null,""]
[null,null,null,null,null,null,null,""]
[null,null,null,null,null,null,null,""]
[null,null,null,null,null,null,null,""]
[null,null,null,null,null,null,null,""]
[null,null,null,null,null,null,null,""]
[null,null,null,null,null,null,null,""]
[null,null,null,null,null,null,null,""]
[null,null,null,null,null,null,null,""]
[null,null,null,null,null,null,null,""]
[null,null,null,null,null,null,null,""]
[null,null,null,null,null,null,null,""]
[null,null,null,null,null,null,null,""]
[null,null,null,null,null,null,null,""]
[null,null,null,null,null,null,null,""]
[null,null,null,null,null,null,null,""]
[null,null,null,null,null,null,null,""]
[null,null,null,null,null,null,null,""]
[null,null,null,null,null,null,null,""]
[null,null,null,null,null,null,null,""]
[null,null,null,null,null,null,null,""]
[null,null,null,null,null,null,null,""]
[null,null,null,null,null,null,null,""]
[null,null,null,null,null,null,null,""]
[null,null,null,null,null,null,null,""]
[null,null,null,null,null,null,null,""]
[null,null,null,null,null,null,null,""]
[null,null,null,null,null,null,null,""]
[null,null,null,null,null,null,null,""]
[null,null,null,null,null,null,null,""]
[null,null,null,null,null,null,null,""]
[null,null,null,null,null,null,null,""]
[null,null,null,null,null,null,null,""]
[null,null,null,null,null,null,null,""]
[null,null,null,null,null,null,null,""]
[null,null,null,null,null,null,null,""]
[null,null,null,null,null,null,null,""]
[null,null,null,null,null,null,null,""]
[null,null,null,null,null,null,null,""]
[null,null,null,null,null,null,null,""]
[null,null,null,null,null,null,null,""]
[null,null,null,null,null,null,null,""]
[null,null,null,null,null,null,null,""]
[null,null,null,null,null,null,null,{"$f":"IF(F260>0,F260*G260/1000,\" \")","v":""}]
[null,null,null,null,null,null,null,""]
[null,null,null,null,null,null,null,""]
[null,null,null,null,null,null,null,""]
[null,null,null,null,null,null,null,""]
[null,null,null,null,null,null,null,""]
[null,null,null,null,null,null,null,""]
[null,null,null,null,null,null,null,""]
[null,null,null,null,null,null,null,""]
[null,null,null,null,null,null,null,""]
[null,null,null,null,null,null,null,""]
[null,null,null,null,null,null,null,""]
[null,null,null,null,null,null,null,""]
[null,null,null,null,null,null,null,""]
[null,null,null,null,null,null,null,""]
[null,null,null,null,null,null,null,""]
[null,null,null,null,null,null,null,""]
[null,null,null,null,null,null,null,""]
[null,null,null,null,null,null,null,""]
[null,null,null,null,null,null,null,""]
[null,null,null,null,null,null,null,""]
[null,null,null,null,null,null,null,""]
[null,null,null,null,null,null,null,""]
[null,null,null,null,null,null,null,""]
[null,null,null,null,null,null,null,""]
[null,null,null,null,null,null,null,""]
[null,null,null,null,null,null,null,""]
[null,null,null,null,null,null,null,""]
[null,null,null,null,null,null,null,""]
[null,null,null,null,null,null,null,""]
[null,null,null,null,null,null,null,""]
[null,null,null,null,null,null,null,""]
[null,null,null,null,null,null,null,""]
[null,null,null,null,null,null,null,""]
[null,null,null,null,null,null,null,""]
[null,null,null,null,null,null,null,""]
[null,null,null,null,null,null,null,""]
[null,null,null,null,null,null,null,""]
[null,null,null,null,null,null,null,""]
[null,null,null,null,null,null,null,""]
[null,null,null,null,null,null,null,""]
[null,null,null,null,null,null,null,""]
[null,null,null,null,null,null,null,""]
[null,null,null,null,null,null,null,""]
[null,null,null,null,null,null,null,""]
[null,null,null,null,null,null,null,""]
[null,null,null,null,null,null,null,""]
[null,null,null,null,null,null,null,""]
[null,null,null,null,null,null,null,""]
[null,null,null,null,null,null,null,""]
[null,null,null,null,null,null,null,""]
[null,null,null,null,null,null,null,""]
[null,null,null,null,null,null,null,""]
[null,null,null,null,null,null,null,""]
[null,null,null,null,null,null,null,""]
[null,null,null,null,null,null,null,""]
[null,null,null,null,null,null,null,""]
[null,null,null,null,null,null,null,""]
[null,null,null,null,null,null,null,""]
[null,null,null,null,null,null,null,""]
[null,null,null,null,null,null,null,""]
[null,null,null,null,null,null,null,""]
[null,null,null,null,null,null,null,""]
[null,null,null,null,null,null,null,""]
[null,null,null,null,null,null,null,{"$f":"IF(F324>0,F324*G324/1000,\" \")","v":""}]
[null,null,null,null,null,null,null,""]
[null,null,null,null,null,null,null,""]
[null,null,null,null,null,null,null,""]
[null,null,null,null,null,null,null,""]
[null,null,null,null,null,null,null,""]
[null,null,null,null,null,null,null,""]
[null,null,null,null,null,null,null,""]
[null,null,null,null,null,null,"POIDS TOTAL",{"$f":"SUM(H4:H331)","v":26.419}]

{"sheet":"VIDES A","index":3,"n_rows":403,"n_cols":4,"rows_kept":403,"cut":false,"hidden":false,"merged":[[3,0,4,1]]}
["     EMPLACEMENTS VIDES ETAGERE A"]
[]
[]
[]
[]
["ADRESSES","MACHINE","REFERENCE","DESIGNATION"]
[{"$f":"IF('GESTION A'!F4<=0,'GESTION A'!A4,\" \")","v":" "},{"$f":"IF('GESTION A'!F4<=0,'GESTION A'!B4,\" \")","v":" "},{"$f":"IF('GESTION A'!F4<=0,'GESTION A'!C4,\" \" )","v":" "},{"$f":"IF('GESTION A'!F4<=0,'GESTION A'!D4,\" \")","v":" "}]
[{"$f":"IF('GESTION A'!F5<=0,'GESTION A'!A5,\" \")","v":" "},{"$f":"IF('GESTION A'!F5<=0,'GESTION A'!B5,\" \")","v":" "},{"$f":"IF('GESTION A'!F5<=0,'GESTION A'!C5,\" \" )","v":" "},{"$f":"IF('GESTION A'!F5<=0,'GESTION A'!D5,\" \")","v":" "}]
[{"$f":"IF('GESTION A'!F6<=0,'GESTION A'!A6,\" \")","v":" "},{"$f":"IF('GESTION A'!F6<=0,'GESTION A'!B6,\" \")","v":" "},{"$f":"IF('GESTION A'!F6<=0,'GESTION A'!C6,\" \" )","v":" "},{"$f":"IF('GESTION A'!F6<=0,'GESTION A'!D6,\" \")","v":" "}]
[{"$f":"IF('GESTION A'!F7<=0,'GESTION A'!A7,\" \")","v":" "},{"$f":"IF('GESTION A'!F7<=0,'GESTION A'!B7,\" \")","v":" "},{"$f":"IF('GESTION A'!F7<=0,'GESTION A'!C7,\" \" )","v":" "},{"$f":"IF('GESTION A'!F7<=0,'GESTION A'!D7,\" \")","v":" "}]
[{"$f":"IF('GESTION A'!F8<=0,'GESTION A'!A8,\" \")","v":" "},{"$f":"IF('GESTION A'!F8<=0,'GESTION A'!B8,\" \")","v":" "},{"$f":"IF('GESTION A'!F8<=0,'GESTION A'!C8,\" \" )","v":" "},{"$f":"IF('GESTION A'!F8<=0,'GESTION A'!D8,\" \")","v":" "}]
[{"$f":"IF('GESTION A'!F10<=0,'GESTION A'!A10,\" \")","v":" "},{"$f":"IF('GESTION A'!F10<=0,'GESTION A'!B10,\" \")","v":" "},{"$f":"IF('GESTION A'!F10<=0,'GESTION A'!C10,\" \" )","v":" "},{"$f":"IF('GESTION A'!F10<=0,'GESTION A'!D10,\" \")","v":" "}]
[{"$f":"IF('GESTION A'!F11<=0,'GESTION A'!A11,\" \")","v":" "},{"$f":"IF('GESTION A'!F11<=0,'GESTION A'!B11,\" \")","v":" "},{"$f":"IF('GESTION A'!F11<=0,'GESTION A'!C11,\" \" )","v":" "},{"$f":"IF('GESTION A'!F11<=0,'GESTION A'!D11,\" \")","v":" "}]
[{"$f":"IF('GESTION A'!F12<=0,'GESTION A'!A12,\" \")","v":" "},{"$f":"IF('GESTION A'!F12<=0,'GESTION A'!B12,\" \")","v":" "},{"$f":"IF('GESTION A'!F12<=0,'GESTION A'!C12,\" \" )","v":" "},{"$f":"IF('GESTION A'!F12<=0,'GESTION A'!D12,\" \")","v":" "}]
[{"$f":"IF('GESTION A'!F13<=0,'GESTION A'!A13,\" \")","v":" "},{"$f":"IF('GESTION A'!F13<=0,'GESTION A'!B13,\" \")","v":" "},{"$f":"IF('GESTION A'!F13<=0,'GESTION A'!C13,\" \" )","v":" "},{"$f":"IF('GESTION A'!F13<=0,'GESTION A'!D13,\" \")","v":" "}]
[{"$f":"IF('GESTION A'!F14<=0,'GESTION A'!A14,\" \")","v":"A0109"},{"$f":"IF('GESTION A'!F14<=0,'GESTION A'!B14,\" \")","v":"SIRUGUE"},{"$f":"IF('GESTION A'!F14<=0,'GESTION A'!C14,\" \" )","v":"M40"},{"$f":"IF('GESTION A'!F14<=0,'GESTION A'!D14,\" \")","v":"EBAUCHE SCS"}]
[{"$f":"IF('GESTION A'!F15<=0,'GESTION A'!A15,\" \")","v":" "},{"$f":"IF('GESTION A'!F15<=0,'GESTION A'!B15,\" \")","v":" "},{"$f":"IF('GESTION A'!F15<=0,'GESTION A'!C15,\" \" )","v":" "},{"$f":"IF('GESTION A'!F15<=0,'GESTION A'!D15,\" \")","v":" "}]
[{"$f":"IF('GESTION A'!F16<=0,'GESTION A'!A16,\" \")","v":" "},{"$f":"IF('GESTION A'!F16<=0,'GESTION A'!B16,\" \")","v":" "},{"$f":"IF('GESTION A'!F16<=0,'GESTION A'!C16,\" \" )","v":" "},{"$f":"IF('GESTION A'!F16<=0,'GESTION A'!D16,\" \")","v":" "}]
[{"$f":"IF('GESTION A'!F17<=0,'GESTION A'!A17,\" \")","v":" "},{"$f":"IF('GESTION A'!F17<=0,'GESTION A'!B17,\" \")","v":" "},{"$f":"IF('GESTION A'!F17<=0,'GESTION A'!C17,\" \" )","v":" "},{"$f":"IF('GESTION A'!F17<=0,'GESTION A'!D17,\" \")","v":" "}]
[{"$f":"IF('GESTION A'!F18<=0,'GESTION A'!A18,\" \")","v":" "},{"$f":"IF('GESTION A'!F18<=0,'GESTION A'!B18,\" \")","v":" "},{"$f":"IF('GESTION A'!F18<=0,'GESTION A'!C18,\" \" )","v":" "},{"$f":"IF('GESTION A'!F18<=0,'GESTION A'!D18,\" \")","v":" "}]
[{"$f":"IF('GESTION A'!F19<=0,'GESTION A'!A19,\" \")","v":" "},{"$f":"IF('GESTION A'!F19<=0,'GESTION A'!B19,\" \")","v":" "},{"$f":"IF('GESTION A'!F19<=0,'GESTION A'!C19,\" \" )","v":" "},{"$f":"IF('GESTION A'!F19<=0,'GESTION A'!D19,\" \")","v":" "}]
[{"$f":"IF('GESTION A'!F20<=0,'GESTION A'!A20,\" \")","v":" "},{"$f":"IF('GESTION A'!F20<=0,'GESTION A'!B20,\" \")","v":" "},{"$f":"IF('GESTION A'!F20<=0,'GESTION A'!C20,\" \" )","v":" "},{"$f":"IF('GESTION A'!F20<=0,'GESTION A'!D20,\" \")","v":" "}]
[{"$f":"IF('GESTION A'!F21<=0,'GESTION A'!A21,\" \")","v":" "},{"$f":"IF('GESTION A'!F21<=0,'GESTION A'!B21,\" \")","v":" "},{"$f":"IF('GESTION A'!F21<=0,'GESTION A'!C21,\" \" )","v":" "},{"$f":"IF('GESTION A'!F21<=0,'GESTION A'!D21,\" \")","v":" "}]
[{"$f":"IF('GESTION A'!F22<=0,'GESTION A'!A22,\" \")","v":" "},{"$f":"IF('GESTION A'!F22<=0,'GESTION A'!B22,\" \")","v":" "},{"$f":"IF('GESTION A'!F22<=0,'GESTION A'!C22,\" \" )","v":" "},{"$f":"IF('GESTION A'!F22<=0,'GESTION A'!D22,\" \")","v":" "}]
[{"$f":"IF('GESTION A'!F23<=0,'GESTION A'!A23,\" \")","v":" "},{"$f":"IF('GESTION A'!F23<=0,'GESTION A'!B23,\" \")","v":" "},{"$f":"IF('GESTION A'!F23<=0,'GESTION A'!C23,\" \" )","v":" "},{"$f":"IF('GESTION A'!F23<=0,'GESTION A'!D23,\" \")","v":" "}]
[{"$f":"IF('GESTION A'!F24<=0,'GESTION A'!A24,\" \")","v":" "},{"$f":"IF('GESTION A'!F24<=0,'GESTION A'!B24,\" \")","v":" "},{"$f":"IF('GESTION A'!F24<=0,'GESTION A'!C24,\" \" )","v":" "},{"$f":"IF('GESTION A'!F24<=0,'GESTION A'!D24,\" \")","v":" "}]
[{"$f":"IF('GESTION A'!F25<=0,'GESTION A'!A25,\" \")","v":" "},{"$f":"IF('GESTION A'!F25<=0,'GESTION A'!B25,\" \")","v":" "},{"$f":"IF('GESTION A'!F25<=0,'GESTION A'!C25,\" \" )","v":" "},{"$f":"IF('GESTION A'!F25<=0,'GESTION A'!D25,\" \")","v":" "}]
[{"$f":"IF('GESTION A'!F26<=0,'GESTION A'!A26,\" \")","v":" "},{"$f":"IF('GESTION A'!F26<=0,'GESTION A'!B26,\" \")","v":" "},{"$f":"IF('GESTION A'!F26<=0,'GESTION A'!C26,\" \" )","v":" "},{"$f":"IF('GESTION A'!F26<=0,'GESTION A'!D26,\" \")","v":" "}]
[{"$f":"IF('GESTION A'!F27<=0,'GESTION A'!A27,\" \")","v":" "},{"$f":"IF('GESTION A'!F27<=0,'GESTION A'!B27,\" \")","v":" "},{"$f":"IF('GESTION A'!F27<=0,'GESTION A'!C27,\" \" )","v":" "},{"$f":"IF('GESTION A'!F27<=0,'GESTION A'!D27,\" \")","v":" "}]
[{"$f":"IF('GESTION A'!F28<=0,'GESTION A'!A28,\" \")","v":" "},{"$f":"IF('GESTION A'!F28<=0,'GESTION A'!B28,\" \")","v":" "},{"$f":"IF('GESTION A'!F28<=0,'GESTION A'!C28,\" \" )","v":" "},{"$f":"IF('GESTION A'!F28<=0,'GESTION A'!D28,\" \")","v":" "}]
[{"$f":"IF('GESTION A'!F29<=0,'GESTION A'!A29,\" \")","v":" "},{"$f":"IF('GESTION A'!F29<=0,'GESTION A'!B29,\" \")","v":" "},{"$f":"IF('GESTION A'!F29<=0,'GESTION A'!C29,\" \" )","v":" "},{"$f":"IF('GESTION A'!F29<=0,'GESTION A'!D29,\" \")","v":" "}]
[{"$f":"IF('GESTION A'!F31<=0,'GESTION A'!A31,\" \")","v":" "},{"$f":"IF('GESTION A'!F31<=0,'GESTION A'!B31,\" \")","v":" "},{"$f":"IF('GESTION A'!F31<=0,'GESTION A'!C31,\" \" )","v":" "},{"$f":"IF('GESTION A'!F31<=0,'GESTION A'!D31,\" \")","v":" "}]
[{"$f":"IF('GESTION A'!F32<=0,'GESTION A'!A32,\" \")","v":" "},{"$f":"IF('GESTION A'!F32<=0,'GESTION A'!B32,\" \")","v":" "},{"$f":"IF('GESTION A'!F32<=0,'GESTION A'!C32,\" \" )","v":" "},{"$f":"IF('GESTION A'!F32<=0,'GESTION A'!D32,\" \")","v":" "}]
[{"$f":"IF('GESTION A'!F33<=0,'GESTION A'!A33,\" \")","v":" "},{"$f":"IF('GESTION A'!F33<=0,'GESTION A'!B33,\" \")","v":" "},{"$f":"IF('GESTION A'!F33<=0,'GESTION A'!C33,\" \" )","v":" "},{"$f":"IF('GESTION A'!F33<=0,'GESTION A'!D33,\" \")","v":" "}]
[{"$f":"IF('GESTION A'!F34<=0,'GESTION A'!A34,\" \")","v":" "},{"$f":"IF('GESTION A'!F34<=0,'GESTION A'!B34,\" \")","v":" "},{"$f":"IF('GESTION A'!F34<=0,'GESTION A'!C34,\" \" )","v":" "},{"$f":"IF('GESTION A'!F34<=0,'GESTION A'!D34,\" \")","v":" "}]
[{"$f":"IF('GESTION A'!F35<=0,'GESTION A'!A35,\" \")","v":" "},{"$f":"IF('GESTION A'!F35<=0,'GESTION A'!B35,\" \")","v":" "},{"$f":"IF('GESTION A'!F35<=0,'GESTION A'!C35,\" \" )","v":" "},{"$f":"IF('GESTION A'!F35<=0,'GESTION A'!D35,\" \")","v":" "}]
[{"$f":"IF('GESTION A'!F36<=0,'GESTION A'!A36,\" \")","v":" "},{"$f":"IF('GESTION A'!F36<=0,'GESTION A'!B36,\" \")","v":" "},{"$f":"IF('GESTION A'!F36<=0,'GESTION A'!C36,\" \" )","v":" "},{"$f":"IF('GESTION A'!F36<=0,'GESTION A'!D36,\" \")","v":" "}]
[{"$f":"IF('GESTION A'!F37<=0,'GESTION A'!A37,\" \")","v":" "},{"$f":"IF('GESTION A'!F37<=0,'GESTION A'!B37,\" \")","v":" "},{"$f":"IF('GESTION A'!F37<=0,'GESTION A'!C37,\" \" )","v":" "},{"$f":"IF('GESTION A'!F37<=0,'GESTION A'!D37,\" \")","v":" "}]
[{"$f":"IF('GESTION A'!F38<=0,'GESTION A'!A38,\" \")","v":" "},{"$f":"IF('GESTION A'!F38<=0,'GESTION A'!B38,\" \")","v":" "},{"$f":"IF('GESTION A'!F38<=0,'GESTION A'!C38,\" \" )","v":" "},{"$f":"IF('GESTION A'!F38<=0,'GESTION A'!D38,\" \")","v":" "}]
[{"$f":"IF('GESTION A'!F39<=0,'GESTION A'!A39,\" \")","v":" "},{"$f":"IF('GESTION A'!F39<=0,'GESTION A'!B39,\" \")","v":" "},{"$f":"IF('GESTION A'!F39<=0,'GESTION A'!C39,\" \" )","v":" "},{"$f":"IF('GESTION A'!F39<=0,'GESTION A'!D39,\" \")","v":" "}]
[{"$f":"IF('GESTION A'!F40<=0,'GESTION A'!A40,\" \")","v":"A0125"},{"$f":"IF('GESTION A'!F40<=0,'GESTION A'!B40,\" \")","v":0},{"$f":"IF('GESTION A'!F40<=0,'GESTION A'!C40,\" \" )","v":0},{"$f":"IF('GESTION A'!F40<=0,'GESTION A'!D40,\" \")","v":0}]
[{"$f":"IF('GESTION A'!F41<=0,'GESTION A'!A41,\" \")","v":" "},{"$f":"IF('GESTION A'!F41<=0,'GESTION A'!B41,\" \")","v":" "},{"$f":"IF('GESTION A'!F41<=0,'GESTION A'!C41,\" \" )","v":" "},{"$f":"IF('GESTION A'!F41<=0,'GESTION A'!D41,\" \")","v":" "}]
[{"$f":"IF('GESTION A'!F43<=0,'GESTION A'!A43,\" \")","v":" "},{"$f":"IF('GESTION A'!F43<=0,'GESTION A'!B43,\" \")","v":" "},{"$f":"IF('GESTION A'!F43<=0,'GESTION A'!C43,\" \" )","v":" "},{"$f":"IF('GESTION A'!F43<=0,'GESTION A'!D43,\" \")","v":" "}]
[{"$f":"IF('GESTION A'!F44<=0,'GESTION A'!A44,\" \")","v":" "},{"$f":"IF('GESTION A'!F44<=0,'GESTION A'!B44,\" \")","v":" "},{"$f":"IF('GESTION A'!F44<=0,'GESTION A'!C44,\" \" )","v":" "},{"$f":"IF('GESTION A'!F44<=0,'GESTION A'!D44,\" \")","v":" "}]
[{"$f":"IF('GESTION A'!F45<=0,'GESTION A'!A45,\" \")","v":" "},{"$f":"IF('GESTION A'!F45<=0,'GESTION A'!B45,\" \")","v":" "},{"$f":"IF('GESTION A'!F45<=0,'GESTION A'!C45,\" \" )","v":" "},{"$f":"IF('GESTION A'!F45<=0,'GESTION A'!D45,\" \")","v":" "}]
[{"$f":"IF('GESTION A'!F46<=0,'GESTION A'!A46,\" \")","v":" "},{"$f":"IF('GESTION A'!F46<=0,'GESTION A'!B46,\" \")","v":" "},{"$f":"IF('GESTION A'!F46<=0,'GESTION A'!C46,\" \" )","v":" "},{"$f":"IF('GESTION A'!F46<=0,'GESTION A'!D46,\" \")","v":" "}]
[{"$f":"IF('GESTION A'!F47<=0,'GESTION A'!A47,\" \")","v":"A0206-A"},{"$f":"IF('GESTION A'!F47<=0,'GESTION A'!B47,\" \")","v":"SIRUGUE"},{"$f":"IF('GESTION A'!F47<=0,'GESTION A'!C47,\" \" )","v":"M70"},{"$f":"IF('GESTION A'!F47<=0,'GESTION A'!D47,\" \")","v":"EBAUCHE Ø46"}]
[{"$f":"IF('GESTION A'!F50<=0,'GESTION A'!A50,\" \")","v":" "},{"$f":"IF('GESTION A'!F50<=0,'GESTION A'!B50,\" \")","v":" "},{"$f":"IF('GESTION A'!F50<=0,'GESTION A'!C50,\" \" )","v":" "},{"$f":"IF('GESTION A'!F50<=0,'GESTION A'!D50,\" \")","v":" "}]
[{"$f":"IF('GESTION A'!F51<=0,'GESTION A'!A51,\" \")","v":" "},{"$f":"IF('GESTION A'!F51<=0,'GESTION A'!B51,\" \")","v":" "},{"$f":"IF('GESTION A'!F51<=0,'GESTION A'!C51,\" \" )","v":" "},{"$f":"IF('GESTION A'!F51<=0,'GESTION A'!D51,\" \")","v":" "}]
[{"$f":"IF('GESTION A'!F52<=0,'GESTION A'!A52,\" \")","v":" "},{"$f":"IF('GESTION A'!F52<=0,'GESTION A'!B52,\" \")","v":" "},{"$f":"IF('GESTION A'!F52<=0,'GESTION A'!C52,\" \" )","v":" "},{"$f":"IF('GESTION A'!F52<=0,'GESTION A'!D52,\" \")","v":" "}]
[{"$f":"IF('GESTION A'!F53<=0,'GESTION A'!A53,\" \")","v":" "},{"$f":"IF('GESTION A'!F53<=0,'GESTION A'!B53,\" \")","v":" "},{"$f":"IF('GESTION A'!F53<=0,'GESTION A'!C53,\" \" )","v":" "},{"$f":"IF('GESTION A'!F53<=0,'GESTION A'!D53,\" \")","v":" "}]
[{"$f":"IF('GESTION A'!F54<=0,'GESTION A'!A54,\" \")","v":" "},{"$f":"IF('GESTION A'!F54<=0,'GESTION A'!B54,\" \")","v":" "},{"$f":"IF('GESTION A'!F54<=0,'GESTION A'!C54,\" \" )","v":" "},{"$f":"IF('GESTION A'!F54<=0,'GESTION A'!D54,\" \")","v":" "}]
[{"$f":"IF('GESTION A'!F55<=0,'GESTION A'!A55,\" \")","v":" "},{"$f":"IF('GESTION A'!F55<=0,'GESTION A'!B55,\" \")","v":" "},{"$f":"IF('GESTION A'!F55<=0,'GESTION A'!C55,\" \" )","v":" "},{"$f":"IF('GESTION A'!F55<=0,'GESTION A'!D55,\" \")","v":" "}]
[{"$f":"IF('GESTION A'!F56<=0,'GESTION A'!A56,\" \")","v":" "},{"$f":"IF('GESTION A'!F56<=0,'GESTION A'!B56,\" \")","v":" "},{"$f":"IF('GESTION A'!F56<=0,'GESTION A'!C56,\" \" )","v":" "},{"$f":"IF('GESTION A'!F56<=0,'GESTION A'!D56,\" \")","v":" "}]
[{"$f":"IF('GESTION A'!F57<=0,'GESTION A'!A57,\" \")","v":" "},{"$f":"IF('GESTION A'!F57<=0,'GESTION A'!B57,\" \")","v":" "},{"$f":"IF('GESTION A'!F57<=0,'GESTION A'!C57,\" \" )","v":" "},{"$f":"IF('GESTION A'!F57<=0,'GESTION A'!D57,\" \")","v":" "}]
[{"$f":"IF('GESTION A'!F58<=0,'GESTION A'!A58,\" \")","v":" "},{"$f":"IF('GESTION A'!F58<=0,'GESTION A'!B58,\" \")","v":" "},{"$f":"IF('GESTION A'!F58<=0,'GESTION A'!C58,\" \" )","v":" "},{"$f":"IF('GESTION A'!F58<=0,'GESTION A'!D58,\" \")","v":" "}]
[{"$f":"IF('GESTION A'!F59<=0,'GESTION A'!A59,\" \")","v":" "},{"$f":"IF('GESTION A'!F59<=0,'GESTION A'!B59,\" \")","v":" "},{"$f":"IF('GESTION A'!F59<=0,'GESTION A'!C59,\" \" )","v":" "},{"$f":"IF('GESTION A'!F59<=0,'GESTION A'!D59,\" \")","v":" "}]
[{"$f":"IF('GESTION A'!F60<=0,'GESTION A'!A60,\" \")","v":" "},{"$f":"IF('GESTION A'!F60<=0,'GESTION A'!B60,\" \")","v":" "},{"$f":"IF('GESTION A'!F60<=0,'GESTION A'!C60,\" \" )","v":" "},{"$f":"IF('GESTION A'!F60<=0,'GESTION A'!D60,\" \")","v":" "}]
[{"$f":"IF('GESTION A'!F61<=0,'GESTION A'!A61,\" \")","v":" "},{"$f":"IF('GESTION A'!F61<=0,'GESTION A'!B61,\" \")","v":" "},{"$f":"IF('GESTION A'!F61<=0,'GESTION A'!C61,\" \" )","v":" "},{"$f":"IF('GESTION A'!F61<=0,'GESTION A'!D61,\" \")","v":" "}]
[{"$f":"IF('GESTION A'!F62<=0,'GESTION A'!A62,\" \")","v":" "},{"$f":"IF('GESTION A'!F62<=0,'GESTION A'!B62,\" \")","v":" "},{"$f":"IF('GESTION A'!F62<=0,'GESTION A'!C62,\" \" )","v":" "},{"$f":"IF('GESTION A'!F62<=0,'GESTION A'!D62,\" \")","v":" "}]
[{"$f":"IF('GESTION A'!F63<=0,'GESTION A'!A63,\" \")","v":" "},{"$f":"IF('GESTION A'!F63<=0,'GESTION A'!B63,\" \")","v":" "},{"$f":"IF('GESTION A'!F63<=0,'GESTION A'!C63,\" \" )","v":" "},{"$f":"IF('GESTION A'!F63<=0,'GESTION A'!D63,\" \")","v":" "}]
[{"$f":"IF('GESTION A'!F64<=0,'GESTION A'!A64,\" \")","v":" "},{"$f":"IF('GESTION A'!F64<=0,'GESTION A'!B64,\" \")","v":" "},{"$f":"IF('GESTION A'!F64<=0,'GESTION A'!C64,\" \" )","v":" "},{"$f":"IF('GESTION A'!F64<=0,'GESTION A'!D64,\" \")","v":" "}]
[{"$f":"IF('GESTION A'!F65<=0,'GESTION A'!A65,\" \")","v":" "},{"$f":"IF('GESTION A'!F65<=0,'GESTION A'!B65,\" \")","v":" "},{"$f":"IF('GESTION A'!F65<=0,'GESTION A'!C65,\" \" )","v":" "},{"$f":"IF('GESTION A'!F65<=0,'GESTION A'!D65,\" \")","v":" "}]
[{"$f":"IF('GESTION A'!F66<=0,'GESTION A'!A66,\" \")","v":" "},{"$f":"IF('GESTION A'!F66<=0,'GESTION A'!B66,\" \")","v":" "},{"$f":"IF('GESTION A'!F66<=0,'GESTION A'!C66,\" \" )","v":" "},{"$f":"IF('GESTION A'!F66<=0,'GESTION A'!D66,\" \")","v":" "}]
[{"$f":"IF('GESTION A'!F67<=0,'GESTION A'!A67,\" \")","v":" "},{"$f":"IF('GESTION A'!F67<=0,'GESTION A'!B67,\" \")","v":" "},{"$f":"IF('GESTION A'!F67<=0,'GESTION A'!C67,\" \" )","v":" "},{"$f":"IF('GESTION A'!F67<=0,'GESTION A'!D67,\" \")","v":" "}]
[{"$f":"IF('GESTION A'!F68<=0,'GESTION A'!A68,\" \")","v":" "},{"$f":"IF('GESTION A'!F68<=0,'GESTION A'!B68,\" \")","v":" "},{"$f":"IF('GESTION A'!F68<=0,'GESTION A'!C68,\" \" )","v":" "},{"$f":"IF('GESTION A'!F68<=0,'GESTION A'!D68,\" \")","v":" "}]
[{"$f":"IF('GESTION A'!F69<=0,'GESTION A'!A69,\" \")","v":" "},{"$f":"IF('GESTION A'!F69<=0,'GESTION A'!B69,\" \")","v":" "},{"$f":"IF('GESTION A'!F69<=0,'GESTION A'!C69,\" \" )","v":" "},{"$f":"IF('GESTION A'!F69<=0,'GESTION A'!D69,\" \")","v":" "}]
[{"$f":"IF('GESTION A'!F70<=0,'GESTION A'!A70,\" \")","v":" "},{"$f":"IF('GESTION A'!F70<=0,'GESTION A'!B70,\" \")","v":" "},{"$f":"IF('GESTION A'!F70<=0,'GESTION A'!C70,\" \" )","v":" "},{"$f":"IF('GESTION A'!F70<=0,'GESTION A'!D70,\" \")","v":" "}]
[{"$f":"IF('GESTION A'!F71<=0,'GESTION A'!A71,\" \")","v":" "},{"$f":"IF('GESTION A'!F71<=0,'GESTION A'!B71,\" \")","v":" "},{"$f":"IF('GESTION A'!F71<=0,'GESTION A'!C71,\" \" )","v":" "},{"$f":"IF('GESTION A'!F71<=0,'GESTION A'!D71,\" \")","v":" "}]
[{"$f":"IF('GESTION A'!F72<=0,'GESTION A'!A72,\" \")","v":" "},{"$f":"IF('GESTION A'!F72<=0,'GESTION A'!B72,\" \")","v":" "},{"$f":"IF('GESTION A'!F72<=0,'GESTION A'!C72,\" \" )","v":" "},{"$f":"IF('GESTION A'!F72<=0,'GESTION A'!D72,\" \")","v":" "}]
[{"$f":"IF('GESTION A'!F73<=0,'GESTION A'!A73,\" \")","v":" "},{"$f":"IF('GESTION A'!F73<=0,'GESTION A'!B73,\" \")","v":" "},{"$f":"IF('GESTION A'!F73<=0,'GESTION A'!C73,\" \" )","v":" "},{"$f":"IF('GESTION A'!F73<=0,'GESTION A'!D73,\" \")","v":" "}]
[{"$f":"IF('GESTION A'!F74<=0,'GESTION A'!A74,\" \")","v":" "},{"$f":"IF('GESTION A'!F74<=0,'GESTION A'!B74,\" \")","v":" "},{"$f":"IF('GESTION A'!F74<=0,'GESTION A'!C74,\" \" )","v":" "},{"$f":"IF('GESTION A'!F74<=0,'GESTION A'!D74,\" \")","v":" "}]
[{"$f":"IF('GESTION A'!F75<=0,'GESTION A'!A75,\" \")","v":" "},{"$f":"IF('GESTION A'!F75<=0,'GESTION A'!B75,\" \")","v":" "},{"$f":"IF('GESTION A'!F75<=0,'GESTION A'!C75,\" \" )","v":" "},{"$f":"IF('GESTION A'!F75<=0,'GESTION A'!D75,\" \")","v":" "}]
[{"$f":"IF('GESTION A'!F76<=0,'GESTION A'!A76,\" \")","v":" "},{"$f":"IF('GESTION A'!F76<=0,'GESTION A'!B76,\" \")","v":" "},{"$f":"IF('GESTION A'!F76<=0,'GESTION A'!C76,\" \" )","v":" "},{"$f":"IF('GESTION A'!F76<=0,'GESTION A'!D76,\" \")","v":" "}]
[{"$f":"IF('GESTION A'!F77<=0,'GESTION A'!A77,\" \")","v":" "},{"$f":"IF('GESTION A'!F77<=0,'GESTION A'!B77,\" \")","v":" "},{"$f":"IF('GESTION A'!F77<=0,'GESTION A'!C77,\" \" )","v":" "},{"$f":"IF('GESTION A'!F77<=0,'GESTION A'!D77,\" \")","v":" "}]
[{"$f":"IF('GESTION A'!F78<=0,'GESTION A'!A78,\" \")","v":" "},{"$f":"IF('GESTION A'!F78<=0,'GESTION A'!B78,\" \")","v":" "},{"$f":"IF('GESTION A'!F78<=0,'GESTION A'!C78,\" \" )","v":" "},{"$f":"IF('GESTION A'!F78<=0,'GESTION A'!D78,\" \")","v":" "}]
[{"$f":"IF('GESTION A'!F79<=0,'GESTION A'!A79,\" \")","v":" "},{"$f":"IF('GESTION A'!F79<=0,'GESTION A'!B79,\" \")","v":" "},{"$f":"IF('GESTION A'!F79<=0,'GESTION A'!C79,\" \" )","v":" "},{"$f":"IF('GESTION A'!F79<=0,'GESTION A'!D79,\" \")","v":" "}]
[{"$f":"IF('GESTION A'!F80<=0,'GESTION A'!A80,\" \")","v":" "},{"$f":"IF('GESTION A'!F80<=0,'GESTION A'!B80,\" \")","v":" "},{"$f":"IF('GESTION A'!F80<=0,'GESTION A'!C80,\" \" )","v":" "},{"$f":"IF('GESTION A'!F80<=0,'GESTION A'!D80,\" \")","v":" "}]
[{"$f":"IF('GESTION A'!F81<=0,'GESTION A'!A81,\" \")","v":" "},{"$f":"IF('GESTION A'!F81<=0,'GESTION A'!B81,\" \")","v":" "},{"$f":"IF('GESTION A'!F81<=0,'GESTION A'!C81,\" \" )","v":" "},{"$f":"IF('GESTION A'!F81<=0,'GESTION A'!D81,\" \")","v":" "}]
[{"$f":"IF('GESTION A'!F82<=0,'GESTION A'!A82,\" \")","v":" "},{"$f":"IF('GESTION A'!F82<=0,'GESTION A'!B82,\" \")","v":" "},{"$f":"IF('GESTION A'!F82<=0,'GESTION A'!C82,\" \" )","v":" "},{"$f":"IF('GESTION A'!F82<=0,'GESTION A'!D82,\" \")","v":" "}]
[{"$f":"IF('GESTION A'!F83<=0,'GESTION A'!A83,\" \")","v":" "},{"$f":"IF('GESTION A'!F83<=0,'GESTION A'!B83,\" \")","v":" "},{"$f":"IF('GESTION A'!F83<=0,'GESTION A'!C83,\" \" )","v":" "},{"$f":"IF('GESTION A'!F83<=0,'GESTION A'!D83,\" \")","v":" "}]
[{"$f":"IF('GESTION A'!F84<=0,'GESTION A'!A84,\" \")","v":" "},{"$f":"IF('GESTION A'!F84<=0,'GESTION A'!B84,\" \")","v":" "},{"$f":"IF('GESTION A'!F84<=0,'GESTION A'!C84,\" \" )","v":" "},{"$f":"IF('GESTION A'!F84<=0,'GESTION A'!D84,\" \")","v":" "}]
[{"$f":"IF('GESTION A'!F85<=0,'GESTION A'!A85,\" \")","v":" "},{"$f":"IF('GESTION A'!F85<=0,'GESTION A'!B85,\" \")","v":" "},{"$f":"IF('GESTION A'!F85<=0,'GESTION A'!C85,\" \" )","v":" "},{"$f":"IF('GESTION A'!F85<=0,'GESTION A'!D85,\" \")","v":" "}]
[{"$f":"IF('GESTION A'!F86<=0,'GESTION A'!A86,\" \")","v":" "},{"$f":"IF('GESTION A'!F86<=0,'GESTION A'!B86,\" \")","v":" "},{"$f":"IF('GESTION A'!F86<=0,'GESTION A'!C86,\" \" )","v":" "},{"$f":"IF('GESTION A'!F86<=0,'GESTION A'!D86,\" \")","v":" "}]
[{"$f":"IF('GESTION A'!F87<=0,'GESTION A'!A87,\" \")","v":" "},{"$f":"IF('GESTION A'!F87<=0,'GESTION A'!B87,\" \")","v":" "},{"$f":"IF('GESTION A'!F87<=0,'GESTION A'!C87,\" \" )","v":" "},{"$f":"IF('GESTION A'!F87<=0,'GESTION A'!D87,\" \")","v":" "}]
[{"$f":"IF('GESTION A'!F88<=0,'GESTION A'!A88,\" \")","v":" "},{"$f":"IF('GESTION A'!F88<=0,'GESTION A'!B88,\" \")","v":" "},{"$f":"IF('GESTION A'!F88<=0,'GESTION A'!C88,\" \" )","v":" "},{"$f":"IF('GESTION A'!F88<=0,'GESTION A'!D88,\" \")","v":" "}]
[{"$f":"IF('GESTION A'!F89<=0,'GESTION A'!A89,\" \")","v":" "},{"$f":"IF('GESTION A'!F89<=0,'GESTION A'!B89,\" \")","v":" "},{"$f":"IF('GESTION A'!F89<=0,'GESTION A'!C89,\" \" )","v":" "},{"$f":"IF('GESTION A'!F89<=0,'GESTION A'!D89,\" \")","v":" "}]
[{"$f":"IF('GESTION A'!F90<=0,'GESTION A'!A90,\" \")","v":" "},{"$f":"IF('GESTION A'!F90<=0,'GESTION A'!B90,\" \")","v":" "},{"$f":"IF('GESTION A'!F90<=0,'GESTION A'!C90,\" \" )","v":" "},{"$f":"IF('GESTION A'!F90<=0,'GESTION A'!D90,\" \")","v":" "}]
[{"$f":"IF('GESTION A'!F91<=0,'GESTION A'!A91,\" \")","v":" "},{"$f":"IF('GESTION A'!F91<=0,'GESTION A'!B91,\" \")","v":" "},{"$f":"IF('GESTION A'!F91<=0,'GESTION A'!C91,\" \" )","v":" "},{"$f":"IF('GESTION A'!F91<=0,'GESTION A'!D91,\" \")","v":" "}]
[{"$f":"IF('GESTION A'!F92<=0,'GESTION A'!A92,\" \")","v":" "},{"$f":"IF('GESTION A'!F92<=0,'GESTION A'!B92,\" \")","v":" "},{"$f":"IF('GESTION A'!F92<=0,'GESTION A'!C92,\" \" )","v":" "},{"$f":"IF('GESTION A'!F92<=0,'GESTION A'!D92,\" \")","v":" "}]
[{"$f":"IF('GESTION A'!F94<=0,'GESTION A'!A94,\" \")","v":" "},{"$f":"IF('GESTION A'!F94<=0,'GESTION A'!B94,\" \")","v":" "},{"$f":"IF('GESTION A'!F94<=0,'GESTION A'!C94,\" \" )","v":" "},{"$f":"IF('GESTION A'!F94<=0,'GESTION A'!D94,\" \")","v":" "}]
[{"$f":"IF('GESTION A'!F95<=0,'GESTION A'!A95,\" \")","v":" "},{"$f":"IF('GESTION A'!F95<=0,'GESTION A'!B95,\" \")","v":" "},{"$f":"IF('GESTION A'!F95<=0,'GESTION A'!C95,\" \" )","v":" "},{"$f":"IF('GESTION A'!F95<=0,'GESTION A'!D95,\" \")","v":" "}]
[{"$f":"IF('GESTION A'!F96<=0,'GESTION A'!A96,\" \")","v":"A0322-A"},{"$f":"IF('GESTION A'!F96<=0,'GESTION A'!B96,\" \")","v":"SIRUGUE"},{"$f":"IF('GESTION A'!F96<=0,'GESTION A'!C96,\" \" )","v":0},{"$f":"IF('GESTION A'!F96<=0,'GESTION A'!D96,\" \")","v":"DECHAUSSOIR"}]
[{"$f":"IF('GESTION A'!F97<=0,'GESTION A'!A97,\" \")","v":" "},{"$f":"IF('GESTION A'!F97<=0,'GESTION A'!B97,\" \")","v":" "},{"$f":"IF('GESTION A'!F97<=0,'GESTION A'!C97,\" \" )","v":" "},{"$f":"IF('GESTION A'!F97<=0,'GESTION A'!D97,\" \")","v":" "}]
[{"$f":"IF('GESTION A'!F99<=0,'GESTION A'!A99,\" \")","v":" "},{"$f":"IF('GESTION A'!F99<=0,'GESTION A'!B99,\" \")","v":" "},{"$f":"IF('GESTION A'!F99<=0,'GESTION A'!C99,\" \" )","v":" "},{"$f":"IF('GESTION A'!F99<=0,'GESTION A'!D99,\" \")","v":" "}]
[{"$f":"IF('GESTION A'!F100<=0,'GESTION A'!A100,\" \")","v":" "},{"$f":"IF('GESTION A'!F100<=0,'GESTION A'!B100,\" \")","v":" "},{"$f":"IF('GESTION A'!F100<=0,'GESTION A'!C100,\" \" )","v":" "},{"$f":"IF('GESTION A'!F100<=0,'GESTION A'!D100,\" \")","v":" "}]
[{"$f":"IF('GESTION A'!F102<=0,'GESTION A'!A102,\" \")","v":" "},{"$f":"IF('GESTION A'!F102<=0,'GESTION A'!B102,\" \")","v":" "},{"$f":"IF('GESTION A'!F102<=0,'GESTION A'!C102,\" \" )","v":" "},{"$f":"IF('GESTION A'!F102<=0,'GESTION A'!D102,\" \")","v":" "}]
[{"$f":"IF('GESTION A'!F103<=0,'GESTION A'!A103,\" \")","v":" "},{"$f":"IF('GESTION A'!F103<=0,'GESTION A'!B103,\" \")","v":" "},{"$f":"IF('GESTION A'!F103<=0,'GESTION A'!C103,\" \" )","v":" "},{"$f":"IF('GESTION A'!F103<=0,'GESTION A'!D103,\" \")","v":" "}]
[{"$f":"IF('GESTION A'!F104<=0,'GESTION A'!A104,\" \")","v":" "},{"$f":"IF('GESTION A'!F104<=0,'GESTION A'!B104,\" \")","v":" "},{"$f":"IF('GESTION A'!F104<=0,'GESTION A'!C104,\" \" )","v":" "},{"$f":"IF('GESTION A'!F104<=0,'GESTION A'!D104,\" \")","v":" "}]
[{"$f":"IF('GESTION A'!F106<=0,'GESTION A'!A106,\" \")","v":" "},{"$f":"IF('GESTION A'!F106<=0,'GESTION A'!B106,\" \")","v":" "},{"$f":"IF('GESTION A'!F106<=0,'GESTION A'!C106,\" \" )","v":" "},{"$f":"IF('GESTION A'!F106<=0,'GESTION A'!D106,\" \")","v":" "}]
[{"$f":"IF('GESTION A'!F107<=0,'GESTION A'!A107,\" \")","v":"A0402-B"},{"$f":"IF('GESTION A'!F107<=0,'GESTION A'!B107,\" \")","v":"FICEP"},{"$f":"IF('GESTION A'!F107<=0,'GESTION A'!C107,\" \" )","v":"PC28"},{"$f":"IF('GESTION A'!F107<=0,'GESTION A'!D107,\" \")","v":"EBAUCHE FRAISEE 0 ET 45°"}]
[{"$f":"IF('GESTION A'!F108<=0,'GESTION A'!A108,\" \")","v":" "},{"$f":"IF('GESTION A'!F108<=0,'GESTION A'!B108,\" \")","v":" "},{"$f":"IF('GESTION A'!F108<=0,'GESTION A'!C108,\" \" )","v":" "},{"$f":"IF('GESTION A'!F108<=0,'GESTION A'!D108,\" \")","v":" "}]
[{"$f":"IF('GESTION A'!F109<=0,'GESTION A'!A109,\" \")","v":" "},{"$f":"IF('GESTION A'!F109<=0,'GESTION A'!B109,\" \")","v":" "},{"$f":"IF('GESTION A'!F109<=0,'GESTION A'!C109,\" \" )","v":" "},{"$f":"IF('GESTION A'!F109<=0,'GESTION A'!D109,\" \")","v":" "}]
[{"$f":"IF('GESTION A'!F110<=0,'GESTION A'!A110,\" \")","v":" "},{"$f":"IF('GESTION A'!F110<=0,'GESTION A'!B110,\" \")","v":" "},{"$f":"IF('GESTION A'!F110<=0,'GESTION A'!C110,\" \" )","v":" "},{"$f":"IF('GESTION A'!F110<=0,'GESTION A'!D110,\" \")","v":" "}]
[{"$f":"IF('GESTION A'!F111<=0,'GESTION A'!A111,\" \")","v":" "},{"$f":"IF('GESTION A'!F111<=0,'GESTION A'!B111,\" \")","v":" "},{"$f":"IF('GESTION A'!F111<=0,'GESTION A'!C111,\" \" )","v":" "},{"$f":"IF('GESTION A'!F111<=0,'GESTION A'!D111,\" \")","v":" "}]
[{"$f":"IF('GESTION A'!F112<=0,'GESTION A'!A112,\" \")","v":" "},{"$f":"IF('GESTION A'!F112<=0,'GESTION A'!B112,\" \")","v":" "},{"$f":"IF('GESTION A'!F112<=0,'GESTION A'!C112,\" \" )","v":" "},{"$f":"IF('GESTION A'!F112<=0,'GESTION A'!D112,\" \")","v":" "}]
[{"$f":"IF('GESTION A'!F113<=0,'GESTION A'!A113,\" \")","v":" "},{"$f":"IF('GESTION A'!F113<=0,'GESTION A'!B113,\" \")","v":" "},{"$f":"IF('GESTION A'!F113<=0,'GESTION A'!C113,\" \" )","v":" "},{"$f":"IF('GESTION A'!F113<=0,'GESTION A'!D113,\" \")","v":" "}]
[{"$f":"IF('GESTION A'!F114<=0,'GESTION A'!A114,\" \")","v":" "},{"$f":"IF('GESTION A'!F114<=0,'GESTION A'!B114,\" \")","v":" "},{"$f":"IF('GESTION A'!F114<=0,'GESTION A'!C114,\" \" )","v":" "},{"$f":"IF('GESTION A'!F114<=0,'GESTION A'!D114,\" \")","v":" "}]
[{"$f":"IF('GESTION A'!F115<=0,'GESTION A'!A115,\" \")","v":" "},{"$f":"IF('GESTION A'!F115<=0,'GESTION A'!B115,\" \")","v":" "},{"$f":"IF('GESTION A'!F115<=0,'GESTION A'!C115,\" \" )","v":" "},{"$f":"IF('GESTION A'!F115<=0,'GESTION A'!D115,\" \")","v":" "}]
[{"$f":"IF('GESTION A'!F116<=0,'GESTION A'!A116,\" \")","v":" "},{"$f":"IF('GESTION A'!F116<=0,'GESTION A'!B116,\" \")","v":" "},{"$f":"IF('GESTION A'!F116<=0,'GESTION A'!C116,\" \" )","v":" "},{"$f":"IF('GESTION A'!F116<=0,'GESTION A'!D116,\" \")","v":" "}]
[{"$f":"IF('GESTION A'!F117<=0,'GESTION A'!A117,\" \")","v":" "},{"$f":"IF('GESTION A'!F117<=0,'GESTION A'!B117,\" \")","v":" "},{"$f":"IF('GESTION A'!F117<=0,'GESTION A'!C117,\" \" )","v":" "},{"$f":"IF('GESTION A'!F117<=0,'GESTION A'!D117,\" \")","v":" "}]
[{"$f":"IF('GESTION A'!F118<=0,'GESTION A'!A118,\" \")","v":" "},{"$f":"IF('GESTION A'!F118<=0,'GESTION A'!B118,\" \")","v":" "},{"$f":"IF('GESTION A'!F118<=0,'GESTION A'!C118,\" \" )","v":" "},{"$f":"IF('GESTION A'!F118<=0,'GESTION A'!D118,\" \")","v":" "}]
[{"$f":"IF('GESTION A'!F120<=0,'GESTION A'!A120,\" \")","v":" "},{"$f":"IF('GESTION A'!F120<=0,'GESTION A'!B120,\" \")","v":" "},{"$f":"IF('GESTION A'!F120<=0,'GESTION A'!C120,\" \" )","v":" "},{"$f":"IF('GESTION A'!F120<=0,'GESTION A'!D120,\" \")","v":" "}]
[{"$f":"IF('GESTION A'!F121<=0,'GESTION A'!A121,\" \")","v":" "},{"$f":"IF('GESTION A'!F121<=0,'GESTION A'!B121,\" \")","v":" "},{"$f":"IF('GESTION A'!F121<=0,'GESTION A'!C121,\" \" )","v":" "},{"$f":"IF('GESTION A'!F121<=0,'GESTION A'!D121,\" \")","v":" "}]
[{"$f":"IF('GESTION A'!F122<=0,'GESTION A'!A122,\" \")","v":" "},{"$f":"IF('GESTION A'!F122<=0,'GESTION A'!B122,\" \")","v":" "},{"$f":"IF('GESTION A'!F122<=0,'GESTION A'!C122,\" \" )","v":" "},{"$f":"IF('GESTION A'!F122<=0,'GESTION A'!D122,\" \")","v":" "}]
[{"$f":"IF('GESTION A'!F124<=0,'GESTION A'!A124,\" \")","v":" "},{"$f":"IF('GESTION A'!F124<=0,'GESTION A'!B124,\" \")","v":" "},{"$f":"IF('GESTION A'!F124<=0,'GESTION A'!C124,\" \" )","v":" "},{"$f":"IF('GESTION A'!F124<=0,'GESTION A'!D124,\" \")","v":" "}]
[{"$f":"IF('GESTION A'!F125<=0,'GESTION A'!A125,\" \")","v":" "},{"$f":"IF('GESTION A'!F125<=0,'GESTION A'!B125,\" \")","v":" "},{"$f":"IF('GESTION A'!F125<=0,'GESTION A'!C125,\" \" )","v":" "},{"$f":"IF('GESTION A'!F125<=0,'GESTION A'!D125,\" \")","v":" "}]
[{"$f":"IF('GESTION A'!F126<=0,'GESTION A'!A126,\" \")","v":" "},{"$f":"IF('GESTION A'!F126<=0,'GESTION A'!B126,\" \")","v":" "},{"$f":"IF('GESTION A'!F126<=0,'GESTION A'!C126,\" \" )","v":" "},{"$f":"IF('GESTION A'!F126<=0,'GESTION A'!D126,\" \")","v":" "}]
[{"$f":"IF('GESTION A'!F127<=0,'GESTION A'!A127,\" \")","v":" "},{"$f":"IF('GESTION A'!F127<=0,'GESTION A'!B127,\" \")","v":" "},{"$f":"IF('GESTION A'!F127<=0,'GESTION A'!C127,\" \" )","v":" "},{"$f":"IF('GESTION A'!F127<=0,'GESTION A'!D127,\" \")","v":" "}]
[{"$f":"IF('GESTION A'!F129<=0,'GESTION A'!A129,\" \")","v":" "},{"$f":"IF('GESTION A'!F129<=0,'GESTION A'!B129,\" \")","v":" "},{"$f":"IF('GESTION A'!F129<=0,'GESTION A'!C129,\" \" )","v":" "},{"$f":"IF('GESTION A'!F129<=0,'GESTION A'!D129,\" \")","v":" "}]
[{"$f":"IF('GESTION A'!F131<=0,'GESTION A'!A131,\" \")","v":"A0419"},{"$f":"IF('GESTION A'!F131<=0,'GESTION A'!B131,\" \")","v":0},{"$f":"IF('GESTION A'!F131<=0,'GESTION A'!C131,\" \" )","v":0},{"$f":"IF('GESTION A'!F131<=0,'GESTION A'!D131,\" \")","v":0}]
[{"$f":"IF('GESTION A'!F132<=0,'GESTION A'!A132,\" \")","v":"A0420"},{"$f":"IF('GESTION A'!F132<=0,'GESTION A'!B132,\" \")","v":0},{"$f":"IF('GESTION A'!F132<=0,'GESTION A'!C132,\" \" )","v":0},{"$f":"IF('GESTION A'!F132<=0,'GESTION A'!D132,\" \")","v":0}]
[{"$f":"IF('GESTION A'!F133<=0,'GESTION A'!A133,\" \")","v":"A0421"},{"$f":"IF('GESTION A'!F133<=0,'GESTION A'!B133,\" \")","v":0},{"$f":"IF('GESTION A'!F133<=0,'GESTION A'!C133,\" \" )","v":0},{"$f":"IF('GESTION A'!F133<=0,'GESTION A'!D133,\" \")","v":0}]
[{"$f":"IF('GESTION A'!F134<=0,'GESTION A'!A134,\" \")","v":"A0422"},{"$f":"IF('GESTION A'!F134<=0,'GESTION A'!B134,\" \")","v":0},{"$f":"IF('GESTION A'!F134<=0,'GESTION A'!C134,\" \" )","v":0},{"$f":"IF('GESTION A'!F134<=0,'GESTION A'!D134,\" \")","v":0}]
[{"$f":"IF('GESTION A'!F135<=0,'GESTION A'!A135,\" \")","v":" "},{"$f":"IF('GESTION A'!F135<=0,'GESTION A'!B135,\" \")","v":" "},{"$f":"IF('GESTION A'!F135<=0,'GESTION A'!C135,\" \" )","v":" "},{"$f":"IF('GESTION A'!F135<=0,'GESTION A'!D135,\" \")","v":" "}]
[{"$f":"IF('GESTION A'!F136<=0,'GESTION A'!A136,\" \")","v":" "},{"$f":"IF('GESTION A'!F136<=0,'GESTION A'!B136,\" \")","v":" "},{"$f":"IF('GESTION A'!F136<=0,'GESTION A'!C136,\" \" )","v":" "},{"$f":"IF('GESTION A'!F136<=0,'GESTION A'!D136,\" \")","v":" "}]
[{"$f":"IF('GESTION A'!F137<=0,'GESTION A'!A137,\" \")","v":" "},{"$f":"IF('GESTION A'!F137<=0,'GESTION A'!B137,\" \")","v":" "},{"$f":"IF('GESTION A'!F137<=0,'GESTION A'!C137,\" \" )","v":" "},{"$f":"IF('GESTION A'!F137<=0,'GESTION A'!D137,\" \")","v":" "}]
[{"$f":"IF('GESTION A'!F138<=0,'GESTION A'!A138,\" \")","v":" "},{"$f":"IF('GESTION A'!F138<=0,'GESTION A'!B138,\" \")","v":" "},{"$f":"IF('GESTION A'!F138<=0,'GESTION A'!C138,\" \" )","v":" "},{"$f":"IF('GESTION A'!F138<=0,'GESTION A'!D138,\" \")","v":" "}]
[{"$f":"IF('GESTION A'!F139<=0,'GESTION A'!A139,\" \")","v":" "},{"$f":"IF('GESTION A'!F139<=0,'GESTION A'!B139,\" \")","v":" "},{"$f":"IF('GESTION A'!F139<=0,'GESTION A'!C139,\" \" )","v":" "},{"$f":"IF('GESTION A'!F139<=0,'GESTION A'!D139,\" \")","v":" "}]
[{"$f":"IF('GESTION A'!F140<=0,'GESTION A'!A140,\" \")","v":" "},{"$f":"IF('GESTION A'!F140<=0,'GESTION A'!B140,\" \")","v":" "},{"$f":"IF('GESTION A'!F140<=0,'GESTION A'!C140,\" \" )","v":" "},{"$f":"IF('GESTION A'!F140<=0,'GESTION A'!D140,\" \")","v":" "}]
[{"$f":"IF('GESTION A'!F141<=0,'GESTION A'!A141,\" \")","v":" "},{"$f":"IF('GESTION A'!F141<=0,'GESTION A'!B141,\" \")","v":" "},{"$f":"IF('GESTION A'!F141<=0,'GESTION A'!C141,\" \" )","v":" "},{"$f":"IF('GESTION A'!F141<=0,'GESTION A'!D141,\" \")","v":" "}]
[{"$f":"IF('GESTION A'!F142<=0,'GESTION A'!A142,\" \")","v":"A0502-B"},{"$f":"IF('GESTION A'!F142<=0,'GESTION A'!B142,\" \")","v":"PEDDY"},{"$f":"IF('GESTION A'!F142<=0,'GESTION A'!C142,\" \" )","v":"PN4"},{"$f":"IF('GESTION A'!F142<=0,'GESTION A'!D142,\" \")","v":"EBAUCHE FRAISEE L85"}]
[{"$f":"IF('GESTION A'!F144<=0,'GESTION A'!A144,\" \")","v":" "},{"$f":"IF('GESTION A'!F144<=0,'GESTION A'!B144,\" \")","v":" "},{"$f":"IF('GESTION A'!F144<=0,'GESTION A'!C144,\" \" )","v":" "},{"$f":"IF('GESTION A'!F144<=0,'GESTION A'!D144,\" \")","v":" "}]
[{"$f":"IF('GESTION A'!#REF!<=0,'GESTION A'!#REF!,\" \")","v":{"$error":"#REF!"}},{"$f":"IF('GESTION A'!#REF!<=0,'GESTION A'!#REF!,\" \")","v":{"$error":"#REF!"}},{"$f":"IF('GESTION A'!#REF!<=0,'GESTION A'!#REF!,\" \" )","v":{"$error":"#REF!"}},{"$f":"IF('GESTION A'!#REF!<=0,'GESTION A'!#REF!,\" \")","v":{"$error":"#REF!"}}]
[{"$f":"IF('GESTION A'!F146<=0,'GESTION A'!A146,\" \")","v":" "},{"$f":"IF('GESTION A'!F146<=0,'GESTION A'!B146,\" \")","v":" "},{"$f":"IF('GESTION A'!F146<=0,'GESTION A'!C146,\" \" )","v":" "},{"$f":"IF('GESTION A'!F146<=0,'GESTION A'!D146,\" \")","v":" "}]
[{"$f":"IF('GESTION A'!F147<=0,'GESTION A'!A147,\" \")","v":"A0505-A"},{"$f":"IF('GESTION A'!F147<=0,'GESTION A'!B147,\" \")","v":"PEDDY"},{"$f":"IF('GESTION A'!F147<=0,'GESTION A'!C147,\" \" )","v":"PN5"},{"$f":"IF('GESTION A'!F147<=0,'GESTION A'!D147,\" \")","v":"EBAUCHE FRAISEE 31,5"}]
[{"$f":"IF('GESTION A'!F149<=0,'GESTION A'!A149,\" \")","v":" "},{"$f":"IF('GESTION A'!F149<=0,'GESTION A'!B149,\" \")","v":" "},{"$f":"IF('GESTION A'!F149<=0,'GESTION A'!C149,\" \" )","v":" "},{"$f":"IF('GESTION A'!F149<=0,'GESTION A'!D149,\" \")","v":" "}]
[{"$f":"IF('GESTION A'!F150<=0,'GESTION A'!A150,\" \")","v":" "},{"$f":"IF('GESTION A'!F150<=0,'GESTION A'!B150,\" \")","v":" "},{"$f":"IF('GESTION A'!F150<=0,'GESTION A'!C150,\" \" )","v":" "},{"$f":"IF('GESTION A'!F150<=0,'GESTION A'!D150,\" \")","v":" "}]
[{"$f":"IF('GESTION A'!F151<=0,'GESTION A'!A151,\" \")","v":" "},{"$f":"IF('GESTION A'!F151<=0,'GESTION A'!B151,\" \")","v":" "},{"$f":"IF('GESTION A'!F151<=0,'GESTION A'!C151,\" \" )","v":" "},{"$f":"IF('GESTION A'!F151<=0,'GESTION A'!D151,\" \")","v":" "}]
[{"$f":"IF('GESTION A'!F153<=0,'GESTION A'!A153,\" \")","v":" "},{"$f":"IF('GESTION A'!F153<=0,'GESTION A'!B153,\" \")","v":" "},{"$f":"IF('GESTION A'!F153<=0,'GESTION A'!C153,\" \" )","v":" "},{"$f":"IF('GESTION A'!F153<=0,'GESTION A'!D153,\" \")","v":" "}]
[{"$f":"IF('GESTION A'!F154<=0,'GESTION A'!A154,\" \")","v":" "},{"$f":"IF('GESTION A'!F154<=0,'GESTION A'!B154,\" \")","v":" "},{"$f":"IF('GESTION A'!F154<=0,'GESTION A'!C154,\" \" )","v":" "},{"$f":"IF('GESTION A'!F154<=0,'GESTION A'!D154,\" \")","v":" "}]
[{"$f":"IF('GESTION A'!F155<=0,'GESTION A'!A155,\" \")","v":" "},{"$f":"IF('GESTION A'!F155<=0,'GESTION A'!B155,\" \")","v":" "},{"$f":"IF('GESTION A'!F155<=0,'GESTION A'!C155,\" \" )","v":" "},{"$f":"IF('GESTION A'!F155<=0,'GESTION A'!D155,\" \")","v":" "}]
[{"$f":"IF('GESTION A'!F156<=0,'GESTION A'!A156,\" \")","v":" "},{"$f":"IF('GESTION A'!F156<=0,'GESTION A'!B156,\" \")","v":" "},{"$f":"IF('GESTION A'!F156<=0,'GESTION A'!C156,\" \" )","v":" "},{"$f":"IF('GESTION A'!F156<=0,'GESTION A'!D156,\" \")","v":" "}]
[{"$f":"IF('GESTION A'!F157<=0,'GESTION A'!A157,\" \")","v":" "},{"$f":"IF('GESTION A'!F157<=0,'GESTION A'!B157,\" \")","v":" "},{"$f":"IF('GESTION A'!F157<=0,'GESTION A'!C157,\" \" )","v":" "},{"$f":"IF('GESTION A'!F157<=0,'GESTION A'!D157,\" \")","v":" "}]
[{"$f":"IF('GESTION A'!F159<=0,'GESTION A'!A159,\" \")","v":" "},{"$f":"IF('GESTION A'!F159<=0,'GESTION A'!B159,\" \")","v":" "},{"$f":"IF('GESTION A'!F159<=0,'GESTION A'!C159,\" \" )","v":" "},{"$f":"IF('GESTION A'!F159<=0,'GESTION A'!D159,\" \")","v":" "}]
[{"$f":"IF('GESTION A'!F160<=0,'GESTION A'!A160,\" \")","v":" "},{"$f":"IF('GESTION A'!F160<=0,'GESTION A'!B160,\" \")","v":" "},{"$f":"IF('GESTION A'!F160<=0,'GESTION A'!C160,\" \" )","v":" "},{"$f":"IF('GESTION A'!F160<=0,'GESTION A'!D160,\" \")","v":" "}]
[{"$f":"IF('GESTION A'!F162<=0,'GESTION A'!A162,\" \")","v":" "},{"$f":"IF('GESTION A'!F162<=0,'GESTION A'!B162,\" \")","v":" "},{"$f":"IF('GESTION A'!F162<=0,'GESTION A'!C162,\" \" )","v":" "},{"$f":"IF('GESTION A'!F162<=0,'GESTION A'!D162,\" \")","v":" "}]
[{"$f":"IF('GESTION A'!F163<=0,'GESTION A'!A163,\" \")","v":" "},{"$f":"IF('GESTION A'!F163<=0,'GESTION A'!B163,\" \")","v":" "},{"$f":"IF('GESTION A'!F163<=0,'GESTION A'!C163,\" \" )","v":" "},{"$f":"IF('GESTION A'!F163<=0,'GESTION A'!D163,\" \")","v":" "}]
[{"$f":"IF('GESTION A'!F164<=0,'GESTION A'!A164,\" \")","v":" "},{"$f":"IF('GESTION A'!F164<=0,'GESTION A'!B164,\" \")","v":" "},{"$f":"IF('GESTION A'!F164<=0,'GESTION A'!C164,\" \" )","v":" "},{"$f":"IF('GESTION A'!F164<=0,'GESTION A'!D164,\" \")","v":" "}]
[{"$f":"IF('GESTION A'!F165<=0,'GESTION A'!A165,\" \")","v":" "},{"$f":"IF('GESTION A'!F165<=0,'GESTION A'!B165,\" \")","v":" "},{"$f":"IF('GESTION A'!F165<=0,'GESTION A'!C165,\" \" )","v":" "},{"$f":"IF('GESTION A'!F165<=0,'GESTION A'!D165,\" \")","v":" "}]
[{"$f":"IF('GESTION A'!F166<=0,'GESTION A'!A166,\" \")","v":" "},{"$f":"IF('GESTION A'!F166<=0,'GESTION A'!B166,\" \")","v":" "},{"$f":"IF('GESTION A'!F166<=0,'GESTION A'!C166,\" \" )","v":" "},{"$f":"IF('GESTION A'!F166<=0,'GESTION A'!D166,\" \")","v":" "}]
[{"$f":"IF('GESTION A'!F169<=0,'GESTION A'!A169,\" \")","v":" "},{"$f":"IF('GESTION A'!F169<=0,'GESTION A'!B169,\" \")","v":" "},{"$f":"IF('GESTION A'!F169<=0,'GESTION A'!C169,\" \" )","v":" "},{"$f":"IF('GESTION A'!F169<=0,'GESTION A'!D169,\" \")","v":" "}]
[{"$f":"IF('GESTION A'!F170<=0,'GESTION A'!A170,\" \")","v":" "},{"$f":"IF('GESTION A'!F170<=0,'GESTION A'!B170,\" \")","v":" "},{"$f":"IF('GESTION A'!F170<=0,'GESTION A'!C170,\" \" )","v":" "},{"$f":"IF('GESTION A'!F170<=0,'GESTION A'!D170,\" \")","v":" "}]
[{"$f":"IF('GESTION A'!F171<=0,'GESTION A'!A171,\" \")","v":" "},{"$f":"IF('GESTION A'!F171<=0,'GESTION A'!B171,\" \")","v":" "},{"$f":"IF('GESTION A'!F171<=0,'GESTION A'!C171,\" \" )","v":" "},{"$f":"IF('GESTION A'!F171<=0,'GESTION A'!D171,\" \")","v":" "}]
[{"$f":"IF('GESTION A'!F172<=0,'GESTION A'!A172,\" \")","v":" "},{"$f":"IF('GESTION A'!F172<=0,'GESTION A'!B172,\" \")","v":" "},{"$f":"IF('GESTION A'!F172<=0,'GESTION A'!C172,\" \" )","v":" "},{"$f":"IF('GESTION A'!F172<=0,'GESTION A'!D172,\" \")","v":" "}]
[{"$f":"IF('GESTION A'!F173<=0,'GESTION A'!A173,\" \")","v":" "},{"$f":"IF('GESTION A'!F173<=0,'GESTION A'!B173,\" \")","v":" "},{"$f":"IF('GESTION A'!F173<=0,'GESTION A'!C173,\" \" )","v":" "},{"$f":"IF('GESTION A'!F173<=0,'GESTION A'!D173,\" \")","v":" "}]
[{"$f":"IF('GESTION A'!F174<=0,'GESTION A'!A174,\" \")","v":" "},{"$f":"IF('GESTION A'!F174<=0,'GESTION A'!B174,\" \")","v":" "},{"$f":"IF('GESTION A'!F174<=0,'GESTION A'!C174,\" \" )","v":" "},{"$f":"IF('GESTION A'!F174<=0,'GESTION A'!D174,\" \")","v":" "}]
[{"$f":"IF('GESTION A'!F175<=0,'GESTION A'!A175,\" \")","v":" "},{"$f":"IF('GESTION A'!F175<=0,'GESTION A'!B175,\" \")","v":" "},{"$f":"IF('GESTION A'!F175<=0,'GESTION A'!C175,\" \" )","v":" "},{"$f":"IF('GESTION A'!F175<=0,'GESTION A'!D175,\" \")","v":" "}]
[{"$f":"IF('GESTION A'!F176<=0,'GESTION A'!A176,\" \")","v":" "},{"$f":"IF('GESTION A'!F176<=0,'GESTION A'!B176,\" \")","v":" "},{"$f":"IF('GESTION A'!F176<=0,'GESTION A'!C176,\" \" )","v":" "},{"$f":"IF('GESTION A'!F176<=0,'GESTION A'!D176,\" \")","v":" "}]
[{"$f":"IF('GESTION A'!F177<=0,'GESTION A'!A177,\" \")","v":" "},{"$f":"IF('GESTION A'!F177<=0,'GESTION A'!B177,\" \")","v":" "},{"$f":"IF('GESTION A'!F177<=0,'GESTION A'!C177,\" \" )","v":" "},{"$f":"IF('GESTION A'!F177<=0,'GESTION A'!D177,\" \")","v":" "}]
[{"$f":"IF('GESTION A'!F178<=0,'GESTION A'!A178,\" \")","v":" "},{"$f":"IF('GESTION A'!F178<=0,'GESTION A'!B178,\" \")","v":" "},{"$f":"IF('GESTION A'!F178<=0,'GESTION A'!C178,\" \" )","v":" "},{"$f":"IF('GESTION A'!F178<=0,'GESTION A'!D178,\" \")","v":" "}]
[{"$f":"IF('GESTION A'!F179<=0,'GESTION A'!A179,\" \")","v":" "},{"$f":"IF('GESTION A'!F179<=0,'GESTION A'!B179,\" \")","v":" "},{"$f":"IF('GESTION A'!F179<=0,'GESTION A'!C179,\" \" )","v":" "},{"$f":"IF('GESTION A'!F179<=0,'GESTION A'!D179,\" \")","v":" "}]
[{"$f":"IF('GESTION A'!F180<=0,'GESTION A'!A180,\" \")","v":" "},{"$f":"IF('GESTION A'!F180<=0,'GESTION A'!B180,\" \")","v":" "},{"$f":"IF('GESTION A'!F180<=0,'GESTION A'!C180,\" \" )","v":" "},{"$f":"IF('GESTION A'!F180<=0,'GESTION A'!D180,\" \")","v":" "}]
[{"$f":"IF('GESTION A'!F181<=0,'GESTION A'!A181,\" \")","v":" "},{"$f":"IF('GESTION A'!F181<=0,'GESTION A'!B181,\" \")","v":" "},{"$f":"IF('GESTION A'!F181<=0,'GESTION A'!C181,\" \" )","v":" "},{"$f":"IF('GESTION A'!F181<=0,'GESTION A'!D181,\" \")","v":" "}]
[{"$f":"IF('GESTION A'!F182<=0,'GESTION A'!A182,\" \")","v":" "},{"$f":"IF('GESTION A'!F182<=0,'GESTION A'!B182,\" \")","v":" "},{"$f":"IF('GESTION A'!F182<=0,'GESTION A'!C182,\" \" )","v":" "},{"$f":"IF('GESTION A'!F182<=0,'GESTION A'!D182,\" \")","v":" "}]
[{"$f":"IF('GESTION A'!F183<=0,'GESTION A'!A183,\" \")","v":" "},{"$f":"IF('GESTION A'!F183<=0,'GESTION A'!B183,\" \")","v":" "},{"$f":"IF('GESTION A'!F183<=0,'GESTION A'!C183,\" \" )","v":" "},{"$f":"IF('GESTION A'!F183<=0,'GESTION A'!D183,\" \")","v":" "}]
[{"$f":"IF('GESTION A'!F184<=0,'GESTION A'!A184,\" \")","v":" "},{"$f":"IF('GESTION A'!F184<=0,'GESTION A'!B184,\" \")","v":" "},{"$f":"IF('GESTION A'!F184<=0,'GESTION A'!C184,\" \" )","v":" "},{"$f":"IF('GESTION A'!F184<=0,'GESTION A'!D184,\" \")","v":" "}]
[{"$f":"IF('GESTION A'!F185<=0,'GESTION A'!A185,\" \")","v":" "},{"$f":"IF('GESTION A'!F185<=0,'GESTION A'!B185,\" \")","v":" "},{"$f":"IF('GESTION A'!F185<=0,'GESTION A'!C185,\" \" )","v":" "},{"$f":"IF('GESTION A'!F185<=0,'GESTION A'!D185,\" \")","v":" "}]
[{"$f":"IF('GESTION A'!F186<=0,'GESTION A'!A186,\" \")","v":" "},{"$f":"IF('GESTION A'!F186<=0,'GESTION A'!B186,\" \")","v":" "},{"$f":"IF('GESTION A'!F186<=0,'GESTION A'!C186,\" \" )","v":" "},{"$f":"IF('GESTION A'!F186<=0,'GESTION A'!D186,\" \")","v":" "}]
[{"$f":"IF('GESTION A'!F187<=0,'GESTION A'!A187,\" \")","v":"A0605-A"},{"$f":"IF('GESTION A'!F187<=0,'GESTION A'!B187,\" \")","v":0},{"$f":"IF('GESTION A'!F187<=0,'GESTION A'!C187,\" \" )","v":0},{"$f":"IF('GESTION A'!F187<=0,'GESTION A'!D187,\" \")","v":0}]
[{"$f":"IF('GESTION A'!F188<=0,'GESTION A'!A188,\" \")","v":" "},{"$f":"IF('GESTION A'!F188<=0,'GESTION A'!B188,\" \")","v":" "},{"$f":"IF('GESTION A'!F188<=0,'GESTION A'!C188,\" \" )","v":" "},{"$f":"IF('GESTION A'!F188<=0,'GESTION A'!D188,\" \")","v":" "}]
[{"$f":"IF('GESTION A'!F189<=0,'GESTION A'!A189,\" \")","v":" "},{"$f":"IF('GESTION A'!F189<=0,'GESTION A'!B189,\" \")","v":" "},{"$f":"IF('GESTION A'!F189<=0,'GESTION A'!C189,\" \" )","v":" "},{"$f":"IF('GESTION A'!F189<=0,'GESTION A'!D189,\" \")","v":" "}]
[{"$f":"IF('GESTION A'!F190<=0,'GESTION A'!A190,\" \")","v":" "},{"$f":"IF('GESTION A'!F190<=0,'GESTION A'!B190,\" \")","v":" "},{"$f":"IF('GESTION A'!F190<=0,'GESTION A'!C190,\" \" )","v":" "},{"$f":"IF('GESTION A'!F190<=0,'GESTION A'!D190,\" \")","v":" "}]
[{"$f":"IF('GESTION A'!F191<=0,'GESTION A'!A191,\" \")","v":" "},{"$f":"IF('GESTION A'!F191<=0,'GESTION A'!B191,\" \")","v":" "},{"$f":"IF('GESTION A'!F191<=0,'GESTION A'!C191,\" \" )","v":" "},{"$f":"IF('GESTION A'!F191<=0,'GESTION A'!D191,\" \")","v":" "}]
[{"$f":"IF('GESTION A'!F192<=0,'GESTION A'!A192,\" \")","v":" "},{"$f":"IF('GESTION A'!F192<=0,'GESTION A'!B192,\" \")","v":" "},{"$f":"IF('GESTION A'!F192<=0,'GESTION A'!C192,\" \" )","v":" "},{"$f":"IF('GESTION A'!F192<=0,'GESTION A'!D192,\" \")","v":" "}]
[{"$f":"IF('GESTION A'!F193<=0,'GESTION A'!A193,\" \")","v":" "},{"$f":"IF('GESTION A'!F193<=0,'GESTION A'!B193,\" \")","v":" "},{"$f":"IF('GESTION A'!F193<=0,'GESTION A'!C193,\" \" )","v":" "},{"$f":"IF('GESTION A'!F193<=0,'GESTION A'!D193,\" \")","v":" "}]
[{"$f":"IF('GESTION A'!F194<=0,'GESTION A'!A194,\" \")","v":" "},{"$f":"IF('GESTION A'!F194<=0,'GESTION A'!B194,\" \")","v":" "},{"$f":"IF('GESTION A'!F194<=0,'GESTION A'!C194,\" \" )","v":" "},{"$f":"IF('GESTION A'!F194<=0,'GESTION A'!D194,\" \")","v":" "}]
[{"$f":"IF('GESTION A'!F195<=0,'GESTION A'!A195,\" \")","v":" "},{"$f":"IF('GESTION A'!F195<=0,'GESTION A'!B195,\" \")","v":" "},{"$f":"IF('GESTION A'!F195<=0,'GESTION A'!C195,\" \" )","v":" "},{"$f":"IF('GESTION A'!F195<=0,'GESTION A'!D195,\" \")","v":" "}]
[{"$f":"IF('GESTION A'!F196<=0,'GESTION A'!A196,\" \")","v":" "},{"$f":"IF('GESTION A'!F196<=0,'GESTION A'!B196,\" \")","v":" "},{"$f":"IF('GESTION A'!F196<=0,'GESTION A'!C196,\" \" )","v":" "},{"$f":"IF('GESTION A'!F196<=0,'GESTION A'!D196,\" \")","v":" "}]
[{"$f":"IF('GESTION A'!F197<=0,'GESTION A'!A197,\" \")","v":"A0611"},{"$f":"IF('GESTION A'!F197<=0,'GESTION A'!B197,\" \")","v":"PEDDY"},{"$f":"IF('GESTION A'!F197<=0,'GESTION A'!C197,\" \" )","v":"MN2"},{"$f":"IF('GESTION A'!F197<=0,'GESTION A'!D197,\" \")","v":"EBAUCHE FRAISEE PERCEE 0° ET 90°"}]
[{"$f":"IF('GESTION A'!F199<=0,'GESTION A'!A199,\" \")","v":0},{"$f":"IF('GESTION A'!F199<=0,'GESTION A'!B199,\" \")","v":0},{"$f":"IF('GESTION A'!F199<=0,'GESTION A'!C199,\" \" )","v":0},{"$f":"IF('GESTION A'!F199<=0,'GESTION A'!D199,\" \")","v":0}]
[{"$f":"IF('GESTION A'!F200<=0,'GESTION A'!A200,\" \")","v":" "},{"$f":"IF('GESTION A'!F200<=0,'GESTION A'!B200,\" \")","v":" "},{"$f":"IF('GESTION A'!F200<=0,'GESTION A'!C200,\" \" )","v":" "},{"$f":"IF('GESTION A'!F200<=0,'GESTION A'!D200,\" \")","v":" "}]
[{"$f":"IF('GESTION A'!F201<=0,'GESTION A'!A201,\" \")","v":" "},{"$f":"IF('GESTION A'!F201<=0,'GESTION A'!B201,\" \")","v":" "},{"$f":"IF('GESTION A'!F201<=0,'GESTION A'!C201,\" \" )","v":" "},{"$f":"IF('GESTION A'!F201<=0,'GESTION A'!D201,\" \")","v":" "}]
[{"$f":"IF('GESTION A'!F203<=0,'GESTION A'!A203,\" \")","v":" "},{"$f":"IF('GESTION A'!F203<=0,'GESTION A'!B203,\" \")","v":" "},{"$f":"IF('GESTION A'!F203<=0,'GESTION A'!C203,\" \" )","v":" "},{"$f":"IF('GESTION A'!F203<=0,'GESTION A'!D203,\" \")","v":" "}]
[{"$f":"IF('GESTION A'!F205<=0,'GESTION A'!A205,\" \")","v":" "},{"$f":"IF('GESTION A'!F205<=0,'GESTION A'!B205,\" \")","v":" "},{"$f":"IF('GESTION A'!F205<=0,'GESTION A'!C205,\" \" )","v":" "},{"$f":"IF('GESTION A'!F205<=0,'GESTION A'!D205,\" \")","v":" "}]
[{"$f":"IF('GESTION A'!F207<=0,'GESTION A'!A207,\" \")","v":" "},{"$f":"IF('GESTION A'!F207<=0,'GESTION A'!B207,\" \")","v":" "},{"$f":"IF('GESTION A'!F207<=0,'GESTION A'!C207,\" \" )","v":" "},{"$f":"IF('GESTION A'!F207<=0,'GESTION A'!D207,\" \")","v":" "}]
[{"$f":"IF('GESTION A'!F209<=0,'GESTION A'!A209,\" \")","v":" "},{"$f":"IF('GESTION A'!F209<=0,'GESTION A'!B209,\" \")","v":" "},{"$f":"IF('GESTION A'!F209<=0,'GESTION A'!C209,\" \" )","v":" "},{"$f":"IF('GESTION A'!F209<=0,'GESTION A'!D209,\" \")","v":" "}]
[{"$f":"IF('GESTION A'!F210<=0,'GESTION A'!A210,\" \")","v":" "},{"$f":"IF('GESTION A'!F210<=0,'GESTION A'!B210,\" \")","v":" "},{"$f":"IF('GESTION A'!F210<=0,'GESTION A'!C210,\" \" )","v":" "},{"$f":"IF('GESTION A'!F210<=0,'GESTION A'!D210,\" \")","v":" "}]
[{"$f":"IF('GESTION A'!F211<=0,'GESTION A'!A211,\" \")","v":" "},{"$f":"IF('GESTION A'!F211<=0,'GESTION A'!B211,\" \")","v":" "},{"$f":"IF('GESTION A'!F211<=0,'GESTION A'!C211,\" \" )","v":" "},{"$f":"IF('GESTION A'!F211<=0,'GESTION A'!D211,\" \")","v":" "}]
[{"$f":"IF('GESTION A'!F212<=0,'GESTION A'!A212,\" \")","v":" "},{"$f":"IF('GESTION A'!F212<=0,'GESTION A'!B212,\" \")","v":" "},{"$f":"IF('GESTION A'!F212<=0,'GESTION A'!C212,\" \" )","v":" "},{"$f":"IF('GESTION A'!F212<=0,'GESTION A'!D212,\" \")","v":" "}]
[{"$f":"IF('GESTION A'!F213<=0,'GESTION A'!A213,\" \")","v":" "},{"$f":"IF('GESTION A'!F213<=0,'GESTION A'!B213,\" \")","v":" "},{"$f":"IF('GESTION A'!F213<=0,'GESTION A'!C213,\" \" )","v":" "},{"$f":"IF('GESTION A'!F213<=0,'GESTION A'!D213,\" \")","v":" "}]
[{"$f":"IF('GESTION A'!F214<=0,'GESTION A'!A214,\" \")","v":"A0622"},{"$f":"IF('GESTION A'!F214<=0,'GESTION A'!B214,\" \")","v":"PEDDY"},{"$f":"IF('GESTION A'!F214<=0,'GESTION A'!C214,\" \" )","v":"MN4"},{"$f":"IF('GESTION A'!F214<=0,'GESTION A'!D214,\" \")","v":"EBAUCHE FRAISEE PERCEE"}]
[{"$f":"IF('GESTION A'!F215<=0,'GESTION A'!A215,\" \")","v":" "},{"$f":"IF('GESTION A'!F215<=0,'GESTION A'!B215,\" \")","v":" "},{"$f":"IF('GESTION A'!F215<=0,'GESTION A'!C215,\" \" )","v":" "},{"$f":"IF('GESTION A'!F215<=0,'GESTION A'!D215,\" \")","v":" "}]
[{"$f":"IF('GESTION A'!F216<=0,'GESTION A'!A216,\" \")","v":" "},{"$f":"IF('GESTION A'!F216<=0,'GESTION A'!B216,\" \")","v":" "},{"$f":"IF('GESTION A'!F216<=0,'GESTION A'!C216,\" \" )","v":" "},{"$f":"IF('GESTION A'!F216<=0,'GESTION A'!D216,\" \")","v":" "}]
[{"$f":"IF('GESTION A'!F217<=0,'GESTION A'!A217,\" \")","v":" "},{"$f":"IF('GESTION A'!F217<=0,'GESTION A'!B217,\" \")","v":" "},{"$f":"IF('GESTION A'!F217<=0,'GESTION A'!C217,\" \" )","v":" "},{"$f":"IF('GESTION A'!F217<=0,'GESTION A'!D217,\" \")","v":" "}]
[{"$f":"IF('GESTION A'!F218<=0,'GESTION A'!A218,\" \")","v":"A0701"},{"$f":"IF('GESTION A'!F218<=0,'GESTION A'!B218,\" \")","v":"PEDDY"},{"$f":"IF('GESTION A'!F218<=0,'GESTION A'!C218,\" \" )","v":"MN6"},{"$f":"IF('GESTION A'!F218<=0,'GESTION A'!D218,\" \")","v":"EBAUCHE MATRICE DEGAGEE"}]
[{"$f":"IF('GESTION A'!F219<=0,'GESTION A'!A219,\" \")","v":" "},{"$f":"IF('GESTION A'!F219<=0,'GESTION A'!B219,\" \")","v":" "},{"$f":"IF('GESTION A'!F219<=0,'GESTION A'!C219,\" \" )","v":" "},{"$f":"IF('GESTION A'!F219<=0,'GESTION A'!D219,\" \")","v":" "}]
[{"$f":"IF('GESTION A'!F220<=0,'GESTION A'!A220,\" \")","v":" "},{"$f":"IF('GESTION A'!F220<=0,'GESTION A'!B220,\" \")","v":" "},{"$f":"IF('GESTION A'!F220<=0,'GESTION A'!C220,\" \" )","v":" "},{"$f":"IF('GESTION A'!F220<=0,'GESTION A'!D220,\" \")","v":" "}]
[{"$f":"IF('GESTION A'!F221<=0,'GESTION A'!A221,\" \")","v":" "},{"$f":"IF('GESTION A'!F221<=0,'GESTION A'!B221,\" \")","v":" "},{"$f":"IF('GESTION A'!F221<=0,'GESTION A'!C221,\" \" )","v":" "},{"$f":"IF('GESTION A'!F221<=0,'GESTION A'!D221,\" \")","v":" "}]
[{"$f":"IF('GESTION A'!F222<=0,'GESTION A'!A222,\" \")","v":" "},{"$f":"IF('GESTION A'!F222<=0,'GESTION A'!B222,\" \")","v":" "},{"$f":"IF('GESTION A'!F222<=0,'GESTION A'!C222,\" \" )","v":" "},{"$f":"IF('GESTION A'!F222<=0,'GESTION A'!D222,\" \")","v":" "}]
[{"$f":"IF('GESTION A'!F223<=0,'GESTION A'!A223,\" \")","v":" "},{"$f":"IF('GESTION A'!F223<=0,'GESTION A'!B223,\" \")","v":" "},{"$f":"IF('GESTION A'!F223<=0,'GESTION A'!C223,\" \" )","v":" "},{"$f":"IF('GESTION A'!F223<=0,'GESTION A'!D223,\" \")","v":" "}]
[{"$f":"IF('GESTION A'!F224<=0,'GESTION A'!A224,\" \")","v":" "},{"$f":"IF('GESTION A'!F224<=0,'GESTION A'!B224,\" \")","v":" "},{"$f":"IF('GESTION A'!F224<=0,'GESTION A'!C224,\" \" )","v":" "},{"$f":"IF('GESTION A'!F224<=0,'GESTION A'!D224,\" \")","v":" "}]
[{"$f":"IF('GESTION A'!F225<=0,'GESTION A'!A225,\" \")","v":"A0708"},{"$f":"IF('GESTION A'!F225<=0,'GESTION A'!B225,\" \")","v":"PEDDY"},{"$f":"IF('GESTION A'!F225<=0,'GESTION A'!C225,\" \" )","v":"MN6"},{"$f":"IF('GESTION A'!F225<=0,'GESTION A'!D225,\" \")","v":"EBAUCHE Ø90 H70"}]
[{"$f":"IF('GESTION A'!F226<=0,'GESTION A'!A226,\" \")","v":" "},{"$f":"IF('GESTION A'!F226<=0,'GESTION A'!B226,\" \")","v":" "},{"$f":"IF('GESTION A'!F226<=0,'GESTION A'!C226,\" \" )","v":" "},{"$f":"IF('GESTION A'!F226<=0,'GESTION A'!D226,\" \")","v":" "}]
[{"$f":"IF('GESTION A'!F227<=0,'GESTION A'!A227,\" \")","v":" "},{"$f":"IF('GESTION A'!F227<=0,'GESTION A'!B227,\" \")","v":" "},{"$f":"IF('GESTION A'!F227<=0,'GESTION A'!C227,\" \" )","v":" "},{"$f":"IF('GESTION A'!F227<=0,'GESTION A'!D227,\" \")","v":" "}]
[{"$f":"IF('GESTION A'!F228<=0,'GESTION A'!A228,\" \")","v":" "},{"$f":"IF('GESTION A'!F228<=0,'GESTION A'!B228,\" \")","v":" "},{"$f":"IF('GESTION A'!F228<=0,'GESTION A'!C228,\" \" )","v":" "},{"$f":"IF('GESTION A'!F228<=0,'GESTION A'!D228,\" \")","v":" "}]
[{"$f":"IF('GESTION A'!F229<=0,'GESTION A'!A229,\" \")","v":"A0711-A"},{"$f":"IF('GESTION A'!F229<=0,'GESTION A'!B229,\" \")","v":"PEDDY"},{"$f":"IF('GESTION A'!F229<=0,'GESTION A'!C229,\" \" )","v":"POINCON 272"},{"$f":"IF('GESTION A'!F229<=0,'GESTION A'!D229,\" \")","v":"EBAUCHE"}]
[{"$f":"IF('GESTION A'!F231<=0,'GESTION A'!A231,\" \")","v":" "},{"$f":"IF('GESTION A'!F231<=0,'GESTION A'!B231,\" \")","v":" "},{"$f":"IF('GESTION A'!F231<=0,'GESTION A'!C231,\" \" )","v":" "},{"$f":"IF('GESTION A'!F231<=0,'GESTION A'!D231,\" \")","v":" "}]
[{"$f":"IF('GESTION A'!F233<=0,'GESTION A'!A233,\" \")","v":"A0713"},{"$f":"IF('GESTION A'!F233<=0,'GESTION A'!B233,\" \")","v":"PEDDY"},{"$f":"IF('GESTION A'!F233<=0,'GESTION A'!C233,\" \" )","v":"MN3"},{"$f":"IF('GESTION A'!F233<=0,'GESTION A'!D233,\" \")","v":"EBAUCHE FRAISEE DEGAGEE PERCEE Ø3 2 REPERES 0° 90°"}]
[{"$f":"IF('GESTION A'!F234<=0,'GESTION A'!A234,\" \")","v":" "},{"$f":"IF('GESTION A'!F234<=0,'GESTION A'!B234,\" \")","v":" "},{"$f":"IF('GESTION A'!F234<=0,'GESTION A'!C234,\" \" )","v":" "},{"$f":"IF('GESTION A'!F234<=0,'GESTION A'!D234,\" \")","v":" "}]
[{"$f":"IF('GESTION A'!F236<=0,'GESTION A'!A236,\" \")","v":" "},{"$f":"IF('GESTION A'!F236<=0,'GESTION A'!B236,\" \")","v":" "},{"$f":"IF('GESTION A'!F236<=0,'GESTION A'!C236,\" \" )","v":" "},{"$f":"IF('GESTION A'!F236<=0,'GESTION A'!D236,\" \")","v":" "}]
[{"$f":"IF('GESTION A'!F237<=0,'GESTION A'!A237,\" \")","v":"A0716"},{"$f":"IF('GESTION A'!F237<=0,'GESTION A'!B237,\" \")","v":0},{"$f":"IF('GESTION A'!F237<=0,'GESTION A'!C237,\" \" )","v":0},{"$f":"IF('GESTION A'!F237<=0,'GESTION A'!D237,\" \")","v":0}]
[{"$f":"IF('GESTION A'!F238<=0,'GESTION A'!A238,\" \")","v":"A0717"},{"$f":"IF('GESTION A'!F238<=0,'GESTION A'!B238,\" \")","v":0},{"$f":"IF('GESTION A'!F238<=0,'GESTION A'!C238,\" \" )","v":0},{"$f":"IF('GESTION A'!F238<=0,'GESTION A'!D238,\" \")","v":0}]
[{"$f":"IF('GESTION A'!F239<=0,'GESTION A'!A239,\" \")","v":"A0718"},{"$f":"IF('GESTION A'!F239<=0,'GESTION A'!B239,\" \")","v":0},{"$f":"IF('GESTION A'!F239<=0,'GESTION A'!C239,\" \" )","v":0},{"$f":"IF('GESTION A'!F239<=0,'GESTION A'!D239,\" \")","v":0}]
[{"$f":"IF('GESTION A'!F240<=0,'GESTION A'!A240,\" \")","v":"A0719"},{"$f":"IF('GESTION A'!F240<=0,'GESTION A'!B240,\" \")","v":0},{"$f":"IF('GESTION A'!F240<=0,'GESTION A'!C240,\" \" )","v":0},{"$f":"IF('GESTION A'!F240<=0,'GESTION A'!D240,\" \")","v":0}]
[{"$f":"IF('GESTION A'!F241<=0,'GESTION A'!A241,\" \")","v":"A0720"},{"$f":"IF('GESTION A'!F241<=0,'GESTION A'!B241,\" \")","v":0},{"$f":"IF('GESTION A'!F241<=0,'GESTION A'!C241,\" \" )","v":0},{"$f":"IF('GESTION A'!F241<=0,'GESTION A'!D241,\" \")","v":0}]
[{"$f":"IF('GESTION A'!F242<=0,'GESTION A'!A242,\" \")","v":"A0721"},{"$f":"IF('GESTION A'!F242<=0,'GESTION A'!B242,\" \")","v":0},{"$f":"IF('GESTION A'!F242<=0,'GESTION A'!C242,\" \" )","v":0},{"$f":"IF('GESTION A'!F242<=0,'GESTION A'!D242,\" \")","v":0}]
[{"$f":"IF('GESTION A'!F243<=0,'GESTION A'!A243,\" \")","v":"A0722"},{"$f":"IF('GESTION A'!F243<=0,'GESTION A'!B243,\" \")","v":0},{"$f":"IF('GESTION A'!F243<=0,'GESTION A'!C243,\" \" )","v":0},{"$f":"IF('GESTION A'!F243<=0,'GESTION A'!D243,\" \")","v":0}]
[{"$f":"IF('GESTION A'!F244<=0,'GESTION A'!A244,\" \")","v":" "},{"$f":"IF('GESTION A'!F244<=0,'GESTION A'!B244,\" \")","v":" "},{"$f":"IF('GESTION A'!F244<=0,'GESTION A'!C244,\" \" )","v":" "},{"$f":"IF('GESTION A'!F244<=0,'GESTION A'!D244,\" \")","v":" "}]
[{"$f":"IF('GESTION A'!F245<=0,'GESTION A'!A245,\" \")","v":" "},{"$f":"IF('GESTION A'!F245<=0,'GESTION A'!B245,\" \")","v":" "},{"$f":"IF('GESTION A'!F245<=0,'GESTION A'!C245,\" \" )","v":" "},{"$f":"IF('GESTION A'!F245<=0,'GESTION A'!D245,\" \")","v":" "}]
[{"$f":"IF('GESTION A'!F246<=0,'GESTION A'!A246,\" \")","v":" "},{"$f":"IF('GESTION A'!F246<=0,'GESTION A'!B246,\" \")","v":" "},{"$f":"IF('GESTION A'!F246<=0,'GESTION A'!C246,\" \" )","v":" "},{"$f":"IF('GESTION A'!F246<=0,'GESTION A'!D246,\" \")","v":" "}]
[{"$f":"IF('GESTION A'!F247<=0,'GESTION A'!A247,\" \")","v":" "},{"$f":"IF('GESTION A'!F247<=0,'GESTION A'!B247,\" \")","v":" "},{"$f":"IF('GESTION A'!F247<=0,'GESTION A'!C247,\" \" )","v":" "},{"$f":"IF('GESTION A'!F247<=0,'GESTION A'!D247,\" \")","v":" "}]
[{"$f":"IF('GESTION A'!F248<=0,'GESTION A'!A248,\" \")","v":" "},{"$f":"IF('GESTION A'!F248<=0,'GESTION A'!B248,\" \")","v":" "},{"$f":"IF('GESTION A'!F248<=0,'GESTION A'!C248,\" \" )","v":" "},{"$f":"IF('GESTION A'!F248<=0,'GESTION A'!D248,\" \")","v":" "}]
[{"$f":"IF('GESTION A'!F249<=0,'GESTION A'!A249,\" \")","v":" "},{"$f":"IF('GESTION A'!F249<=0,'GESTION A'!B249,\" \")","v":" "},{"$f":"IF('GESTION A'!F249<=0,'GESTION A'!C249,\" \" )","v":" "},{"$f":"IF('GESTION A'!F249<=0,'GESTION A'!D249,\" \")","v":" "}]
[{"$f":"IF('GESTION A'!F250<=0,'GESTION A'!A250,\" \")","v":" "},{"$f":"IF('GESTION A'!F250<=0,'GESTION A'!B250,\" \")","v":" "},{"$f":"IF('GESTION A'!F250<=0,'GESTION A'!C250,\" \" )","v":" "},{"$f":"IF('GESTION A'!F250<=0,'GESTION A'!D250,\" \")","v":" "}]
[{"$f":"IF('GESTION A'!F251<=0,'GESTION A'!A251,\" \")","v":" "},{"$f":"IF('GESTION A'!F251<=0,'GESTION A'!B251,\" \")","v":" "},{"$f":"IF('GESTION A'!F251<=0,'GESTION A'!C251,\" \" )","v":" "},{"$f":"IF('GESTION A'!F251<=0,'GESTION A'!D251,\" \")","v":" "}]
[{"$f":"IF('GESTION A'!F252<=0,'GESTION A'!A252,\" \")","v":" "},{"$f":"IF('GESTION A'!F252<=0,'GESTION A'!B252,\" \")","v":" "},{"$f":"IF('GESTION A'!F252<=0,'GESTION A'!C252,\" \" )","v":" "},{"$f":"IF('GESTION A'!F252<=0,'GESTION A'!D252,\" \")","v":" "}]
[{"$f":"IF('GESTION A'!F253<=0,'GESTION A'!A253,\" \")","v":" "},{"$f":"IF('GESTION A'!F253<=0,'GESTION A'!B253,\" \")","v":" "},{"$f":"IF('GESTION A'!F253<=0,'GESTION A'!C253,\" \" )","v":" "},{"$f":"IF('GESTION A'!F253<=0,'GESTION A'!D253,\" \")","v":" "}]
[{"$f":"IF('GESTION A'!F254<=0,'GESTION A'!A254,\" \")","v":" "},{"$f":"IF('GESTION A'!F254<=0,'GESTION A'!B254,\" \")","v":" "},{"$f":"IF('GESTION A'!F254<=0,'GESTION A'!C254,\" \" )","v":" "},{"$f":"IF('GESTION A'!F254<=0,'GESTION A'!D254,\" \")","v":" "}]
[{"$f":"IF('GESTION A'!F255<=0,'GESTION A'!A255,\" \")","v":" "},{"$f":"IF('GESTION A'!F255<=0,'GESTION A'!B255,\" \")","v":" "},{"$f":"IF('GESTION A'!F255<=0,'GESTION A'!C255,\" \" )","v":" "},{"$f":"IF('GESTION A'!F255<=0,'GESTION A'!D255,\" \")","v":" "}]
[{"$f":"IF('GESTION A'!F256<=0,'GESTION A'!A256,\" \")","v":" "},{"$f":"IF('GESTION A'!F256<=0,'GESTION A'!B256,\" \")","v":" "},{"$f":"IF('GESTION A'!F256<=0,'GESTION A'!C256,\" \" )","v":" "},{"$f":"IF('GESTION A'!F256<=0,'GESTION A'!D256,\" \")","v":" "}]
[{"$f":"IF('GESTION A'!F257<=0,'GESTION A'!A257,\" \")","v":" "},{"$f":"IF('GESTION A'!F257<=0,'GESTION A'!B257,\" \")","v":" "},{"$f":"IF('GESTION A'!F257<=0,'GESTION A'!C257,\" \" )","v":" "},{"$f":"IF('GESTION A'!F257<=0,'GESTION A'!D257,\" \")","v":" "}]
[{"$f":"IF('GESTION A'!F258<=0,'GESTION A'!A258,\" \")","v":" "},{"$f":"IF('GESTION A'!F258<=0,'GESTION A'!B258,\" \")","v":" "},{"$f":"IF('GESTION A'!F258<=0,'GESTION A'!C258,\" \" )","v":" "},{"$f":"IF('GESTION A'!F258<=0,'GESTION A'!D258,\" \")","v":" "}]
[{"$f":"IF('GESTION A'!#REF!<=0,'GESTION A'!#REF!,\" \")","v":{"$error":"#REF!"}},{"$f":"IF('GESTION A'!#REF!<=0,'GESTION A'!#REF!,\" \")","v":{"$error":"#REF!"}},{"$f":"IF('GESTION A'!#REF!<=0,'GESTION A'!#REF!,\" \" )","v":{"$error":"#REF!"}},{"$f":"IF('GESTION A'!#REF!<=0,'GESTION A'!#REF!,\" \")","v":{"$error":"#REF!"}}]
[{"$f":"IF('GESTION A'!F259<=0,'GESTION A'!A259,\" \")","v":" "},{"$f":"IF('GESTION A'!F259<=0,'GESTION A'!B259,\" \")","v":" "},{"$f":"IF('GESTION A'!F259<=0,'GESTION A'!C259,\" \" )","v":" "},{"$f":"IF('GESTION A'!F259<=0,'GESTION A'!D259,\" \")","v":" "}]
[{"$f":"IF('GESTION A'!F263<=0,'GESTION A'!A263,\" \")","v":" "},{"$f":"IF('GESTION A'!F263<=0,'GESTION A'!B263,\" \")","v":" "},{"$f":"IF('GESTION A'!F263<=0,'GESTION A'!C263,\" \" )","v":" "},{"$f":"IF('GESTION A'!F263<=0,'GESTION A'!D263,\" \")","v":" "}]
[{"$f":"IF('GESTION A'!F266<=0,'GESTION A'!A266,\" \")","v":" "},{"$f":"IF('GESTION A'!F266<=0,'GESTION A'!B266,\" \")","v":" "},{"$f":"IF('GESTION A'!F266<=0,'GESTION A'!C266,\" \" )","v":" "},{"$f":"IF('GESTION A'!F266<=0,'GESTION A'!D266,\" \")","v":" "}]
[{"$f":"IF('GESTION A'!F267<=0,'GESTION A'!A267,\" \")","v":" "},{"$f":"IF('GESTION A'!F267<=0,'GESTION A'!B267,\" \")","v":" "},{"$f":"IF('GESTION A'!F267<=0,'GESTION A'!C267,\" \" )","v":" "},{"$f":"IF('GESTION A'!F267<=0,'GESTION A'!D267,\" \")","v":" "}]
[{"$f":"IF('GESTION A'!F268<=0,'GESTION A'!A268,\" \")","v":"A0813"},{"$f":"IF('GESTION A'!F268<=0,'GESTION A'!B268,\" \")","v":"GEKA"},{"$f":"IF('GESTION A'!F268<=0,'GESTION A'!C268,\" \" )","v":"GN8/40"},{"$f":"IF('GESTION A'!F268<=0,'GESTION A'!D268,\" \")","v":"EBAUCHE FRAISEE 0 ET 45°"}]
[{"$f":"IF('GESTION A'!F269<=0,'GESTION A'!A269,\" \")","v":" "},{"$f":"IF('GESTION A'!F269<=0,'GESTION A'!B269,\" \")","v":" "},{"$f":"IF('GESTION A'!F269<=0,'GESTION A'!C269,\" \" )","v":" "},{"$f":"IF('GESTION A'!F269<=0,'GESTION A'!D269,\" \")","v":" "}]
[{"$f":"IF('GESTION A'!F270<=0,'GESTION A'!A270,\" \")","v":" "},{"$f":"IF('GESTION A'!F270<=0,'GESTION A'!B270,\" \")","v":" "},{"$f":"IF('GESTION A'!F270<=0,'GESTION A'!C270,\" \" )","v":" "},{"$f":"IF('GESTION A'!F270<=0,'GESTION A'!D270,\" \")","v":" "}]
[{"$f":"IF('GESTION A'!F271<=0,'GESTION A'!A271,\" \")","v":"A0816"},{"$f":"IF('GESTION A'!F271<=0,'GESTION A'!B271,\" \")","v":0},{"$f":"IF('GESTION A'!F271<=0,'GESTION A'!C271,\" \" )","v":0},{"$f":"IF('GESTION A'!F271<=0,'GESTION A'!D271,\" \")","v":0}]
[{"$f":"IF('GESTION A'!F272<=0,'GESTION A'!A272,\" \")","v":" "},{"$f":"IF('GESTION A'!F272<=0,'GESTION A'!B272,\" \")","v":" "},{"$f":"IF('GESTION A'!F272<=0,'GESTION A'!C272,\" \" )","v":" "},{"$f":"IF('GESTION A'!F272<=0,'GESTION A'!D272,\" \")","v":" "}]
[{"$f":"IF('GESTION A'!F273<=0,'GESTION A'!A273,\" \")","v":"A0818"},{"$f":"IF('GESTION A'!F273<=0,'GESTION A'!B273,\" \")","v":0},{"$f":"IF('GESTION A'!F273<=0,'GESTION A'!C273,\" \" )","v":0},{"$f":"IF('GESTION A'!F273<=0,'GESTION A'!D273,\" \")","v":0}]
[{"$f":"IF('GESTION A'!F274<=0,'GESTION A'!A274,\" \")","v":"A0819"},{"$f":"IF('GESTION A'!F274<=0,'GESTION A'!B274,\" \")","v":0},{"$f":"IF('GESTION A'!F274<=0,'GESTION A'!C274,\" \" )","v":0},{"$f":"IF('GESTION A'!F274<=0,'GESTION A'!D274,\" \")","v":0}]
[{"$f":"IF('GESTION A'!F275<=0,'GESTION A'!A275,\" \")","v":" "},{"$f":"IF('GESTION A'!F275<=0,'GESTION A'!B275,\" \")","v":" "},{"$f":"IF('GESTION A'!F275<=0,'GESTION A'!C275,\" \" )","v":" "},{"$f":"IF('GESTION A'!F275<=0,'GESTION A'!D275,\" \")","v":" "}]
[{"$f":"IF('GESTION A'!F276<=0,'GESTION A'!A276,\" \")","v":"A0821"},{"$f":"IF('GESTION A'!F276<=0,'GESTION A'!B276,\" \")","v":"GEKA"},{"$f":"IF('GESTION A'!F276<=0,'GESTION A'!C276,\" \" )","v":0},{"$f":"IF('GESTION A'!F276<=0,'GESTION A'!D276,\" \")","v":0}]
[{"$f":"IF('GESTION A'!F277<=0,'GESTION A'!A277,\" \")","v":" "},{"$f":"IF('GESTION A'!F277<=0,'GESTION A'!B277,\" \")","v":" "},{"$f":"IF('GESTION A'!F277<=0,'GESTION A'!C277,\" \" )","v":" "},{"$f":"IF('GESTION A'!F277<=0,'GESTION A'!D277,\" \")","v":" "}]
[{"$f":"IF('GESTION A'!F278<=0,'GESTION A'!A278,\" \")","v":" "},{"$f":"IF('GESTION A'!F278<=0,'GESTION A'!B278,\" \")","v":" "},{"$f":"IF('GESTION A'!F278<=0,'GESTION A'!C278,\" \" )","v":" "},{"$f":"IF('GESTION A'!F278<=0,'GESTION A'!D278,\" \")","v":" "}]
[{"$f":"IF('GESTION A'!F279<=0,'GESTION A'!A279,\" \")","v":" "},{"$f":"IF('GESTION A'!F279<=0,'GESTION A'!B279,\" \")","v":" "},{"$f":"IF('GESTION A'!F279<=0,'GESTION A'!C279,\" \" )","v":" "},{"$f":"IF('GESTION A'!F279<=0,'GESTION A'!D279,\" \")","v":" "}]
[{"$f":"IF('GESTION A'!F280<=0,'GESTION A'!A280,\" \")","v":"A0824"},{"$f":"IF('GESTION A'!F280<=0,'GESTION A'!B280,\" \")","v":"GEKA"},{"$f":"IF('GESTION A'!F280<=0,'GESTION A'!C280,\" \" )","v":0},{"$f":"IF('GESTION A'!F280<=0,'GESTION A'!D280,\" \")","v":0}]
[{"$f":"IF('GESTION A'!F281<=0,'GESTION A'!A281,\" \")","v":" "},{"$f":"IF('GESTION A'!F281<=0,'GESTION A'!B281,\" \")","v":" "},{"$f":"IF('GESTION A'!F281<=0,'GESTION A'!C281,\" \" )","v":" "},{"$f":"IF('GESTION A'!F281<=0,'GESTION A'!D281,\" \")","v":" "}]
[{"$f":"IF('GESTION A'!F282<=0,'GESTION A'!A282,\" \")","v":" "},{"$f":"IF('GESTION A'!F282<=0,'GESTION A'!B282,\" \")","v":" "},{"$f":"IF('GESTION A'!F282<=0,'GESTION A'!C282,\" \" )","v":" "},{"$f":"IF('GESTION A'!F282<=0,'GESTION A'!D282,\" \")","v":" "}]
[{"$f":"IF('GESTION A'!F283<=0,'GESTION A'!A283,\" \")","v":" "},{"$f":"IF('GESTION A'!F283<=0,'GESTION A'!B283,\" \")","v":" "},{"$f":"IF('GESTION A'!F283<=0,'GESTION A'!C283,\" \" )","v":" "},{"$f":"IF('GESTION A'!F283<=0,'GESTION A'!D283,\" \")","v":" "}]
[{"$f":"IF('GESTION A'!F284<=0,'GESTION A'!A284,\" \")","v":" "},{"$f":"IF('GESTION A'!F284<=0,'GESTION A'!B284,\" \")","v":" "},{"$f":"IF('GESTION A'!F284<=0,'GESTION A'!C284,\" \" )","v":" "},{"$f":"IF('GESTION A'!F284<=0,'GESTION A'!D284,\" \")","v":" "}]
[{"$f":"IF('GESTION A'!F285<=0,'GESTION A'!A285,\" \")","v":"A0904"},{"$f":"IF('GESTION A'!F285<=0,'GESTION A'!B285,\" \")","v":"GEKA"},{"$f":"IF('GESTION A'!F285<=0,'GESTION A'!C285,\" \" )","v":"GN12A"},{"$f":"IF('GESTION A'!F285<=0,'GESTION A'!D285,\" \")","v":"EBAUCHE FRAISEE"}]
[{"$f":"IF('GESTION A'!F286<=0,'GESTION A'!A286,\" \")","v":"A0905"},{"$f":"IF('GESTION A'!F286<=0,'GESTION A'!B286,\" \")","v":"GEKA"},{"$f":"IF('GESTION A'!F286<=0,'GESTION A'!C286,\" \" )","v":"GN12A"},{"$f":"IF('GESTION A'!F286<=0,'GESTION A'!D286,\" \")","v":0}]
[{"$f":"IF('GESTION A'!F287<=0,'GESTION A'!A287,\" \")","v":" "},{"$f":"IF('GESTION A'!F287<=0,'GESTION A'!B287,\" \")","v":" "},{"$f":"IF('GESTION A'!F287<=0,'GESTION A'!C287,\" \" )","v":" "},{"$f":"IF('GESTION A'!F287<=0,'GESTION A'!D287,\" \")","v":" "}]
[{"$f":"IF('GESTION A'!F288<=0,'GESTION A'!A288,\" \")","v":"A0907"},{"$f":"IF('GESTION A'!F288<=0,'GESTION A'!B288,\" \")","v":"GEKA"},{"$f":"IF('GESTION A'!F288<=0,'GESTION A'!C288,\" \" )","v":"GN12A"},{"$f":"IF('GESTION A'!F288<=0,'GESTION A'!D288,\" \")","v":0}]
[{"$f":"IF('GESTION A'!F289<=0,'GESTION A'!A289,\" \")","v":" "},{"$f":"IF('GESTION A'!F289<=0,'GESTION A'!B289,\" \")","v":" "},{"$f":"IF('GESTION A'!F289<=0,'GESTION A'!C289,\" \" )","v":" "},{"$f":"IF('GESTION A'!F289<=0,'GESTION A'!D289,\" \")","v":" "}]
[{"$f":"IF('GESTION A'!F290<=0,'GESTION A'!A290,\" \")","v":" "},{"$f":"IF('GESTION A'!F290<=0,'GESTION A'!B290,\" \")","v":" "},{"$f":"IF('GESTION A'!F290<=0,'GESTION A'!C290,\" \" )","v":" "},{"$f":"IF('GESTION A'!F290<=0,'GESTION A'!D290,\" \")","v":" "}]
[{"$f":"IF('GESTION A'!F291<=0,'GESTION A'!A291,\" \")","v":" "},{"$f":"IF('GESTION A'!F291<=0,'GESTION A'!B291,\" \")","v":" "},{"$f":"IF('GESTION A'!F291<=0,'GESTION A'!C291,\" \" )","v":" "},{"$f":"IF('GESTION A'!F291<=0,'GESTION A'!D291,\" \")","v":" "}]
[{"$f":"IF('GESTION A'!F292<=0,'GESTION A'!A292,\" \")","v":" "},{"$f":"IF('GESTION A'!F292<=0,'GESTION A'!B292,\" \")","v":" "},{"$f":"IF('GESTION A'!F292<=0,'GESTION A'!C292,\" \" )","v":" "},{"$f":"IF('GESTION A'!F292<=0,'GESTION A'!D292,\" \")","v":" "}]
[{"$f":"IF('GESTION A'!F293<=0,'GESTION A'!A293,\" \")","v":"A0912"},{"$f":"IF('GESTION A'!F293<=0,'GESTION A'!B293,\" \")","v":0},{"$f":"IF('GESTION A'!F293<=0,'GESTION A'!C293,\" \" )","v":0},{"$f":"IF('GESTION A'!F293<=0,'GESTION A'!D293,\" \")","v":0}]
[{"$f":"IF('GESTION A'!F294<=0,'GESTION A'!A294,\" \")","v":" "},{"$f":"IF('GESTION A'!F294<=0,'GESTION A'!B294,\" \")","v":" "},{"$f":"IF('GESTION A'!F294<=0,'GESTION A'!C294,\" \" )","v":" "},{"$f":"IF('GESTION A'!F294<=0,'GESTION A'!D294,\" \")","v":" "}]
[{"$f":"IF('GESTION A'!F295<=0,'GESTION A'!A295,\" \")","v":"A0914"},{"$f":"IF('GESTION A'!F295<=0,'GESTION A'!B295,\" \")","v":0},{"$f":"IF('GESTION A'!F295<=0,'GESTION A'!C295,\" \" )","v":0},{"$f":"IF('GESTION A'!F295<=0,'GESTION A'!D295,\" \")","v":0}]
[{"$f":"IF('GESTION A'!F296<=0,'GESTION A'!A296,\" \")","v":" "},{"$f":"IF('GESTION A'!F296<=0,'GESTION A'!B296,\" \")","v":" "},{"$f":"IF('GESTION A'!F296<=0,'GESTION A'!C296,\" \" )","v":" "},{"$f":"IF('GESTION A'!F296<=0,'GESTION A'!D296,\" \")","v":" "}]
[{"$f":"IF('GESTION A'!F297<=0,'GESTION A'!A297,\" \")","v":" "},{"$f":"IF('GESTION A'!F297<=0,'GESTION A'!B297,\" \")","v":" "},{"$f":"IF('GESTION A'!F297<=0,'GESTION A'!C297,\" \" )","v":" "},{"$f":"IF('GESTION A'!F297<=0,'GESTION A'!D297,\" \")","v":" "}]
[{"$f":"IF('GESTION A'!F298<=0,'GESTION A'!A298,\" \")","v":"A0917"},{"$f":"IF('GESTION A'!F298<=0,'GESTION A'!B298,\" \")","v":0},{"$f":"IF('GESTION A'!F298<=0,'GESTION A'!C298,\" \" )","v":0},{"$f":"IF('GESTION A'!F298<=0,'GESTION A'!D298,\" \")","v":0}]
[{"$f":"IF('GESTION A'!F299<=0,'GESTION A'!A299,\" \")","v":" "},{"$f":"IF('GESTION A'!F299<=0,'GESTION A'!B299,\" \")","v":" "},{"$f":"IF('GESTION A'!F299<=0,'GESTION A'!C299,\" \" )","v":" "},{"$f":"IF('GESTION A'!F299<=0,'GESTION A'!D299,\" \")","v":" "}]
[{"$f":"IF('GESTION A'!F300<=0,'GESTION A'!A300,\" \")","v":" "},{"$f":"IF('GESTION A'!F300<=0,'GESTION A'!B300,\" \")","v":" "},{"$f":"IF('GESTION A'!F300<=0,'GESTION A'!C300,\" \" )","v":" "},{"$f":"IF('GESTION A'!F300<=0,'GESTION A'!D300,\" \")","v":" "}]
[{"$f":"IF('GESTION A'!F301<=0,'GESTION A'!A301,\" \")","v":" "},{"$f":"IF('GESTION A'!F301<=0,'GESTION A'!B301,\" \")","v":" "},{"$f":"IF('GESTION A'!F301<=0,'GESTION A'!C301,\" \" )","v":" "},{"$f":"IF('GESTION A'!F301<=0,'GESTION A'!D301,\" \")","v":" "}]
[{"$f":"IF('GESTION A'!F302<=0,'GESTION A'!A302,\" \")","v":" "},{"$f":"IF('GESTION A'!F302<=0,'GESTION A'!B302,\" \")","v":" "},{"$f":"IF('GESTION A'!F302<=0,'GESTION A'!C302,\" \" )","v":" "},{"$f":"IF('GESTION A'!F302<=0,'GESTION A'!D302,\" \")","v":" "}]
[{"$f":"IF('GESTION A'!F303<=0,'GESTION A'!A303,\" \")","v":"A0922"},{"$f":"IF('GESTION A'!F303<=0,'GESTION A'!B303,\" \")","v":0},{"$f":"IF('GESTION A'!F303<=0,'GESTION A'!C303,\" \" )","v":0},{"$f":"IF('GESTION A'!F303<=0,'GESTION A'!D303,\" \")","v":0}]
[{"$f":"IF('GESTION A'!F304<=0,'GESTION A'!A304,\" \")","v":"A0923"},{"$f":"IF('GESTION A'!F304<=0,'GESTION A'!B304,\" \")","v":0},{"$f":"IF('GESTION A'!F304<=0,'GESTION A'!C304,\" \" )","v":0},{"$f":"IF('GESTION A'!F304<=0,'GESTION A'!D304,\" \")","v":0}]
[{"$f":"IF('GESTION A'!F305<=0,'GESTION A'!A305,\" \")","v":"A0924"},{"$f":"IF('GESTION A'!F305<=0,'GESTION A'!B305,\" \")","v":0},{"$f":"IF('GESTION A'!F305<=0,'GESTION A'!C305,\" \" )","v":0},{"$f":"IF('GESTION A'!F305<=0,'GESTION A'!D305,\" \")","v":0}]
[{"$f":"IF('GESTION A'!F306<=0,'GESTION A'!A306,\" \")","v":"A0925"},{"$f":"IF('GESTION A'!F306<=0,'GESTION A'!B306,\" \")","v":0},{"$f":"IF('GESTION A'!F306<=0,'GESTION A'!C306,\" \" )","v":0},{"$f":"IF('GESTION A'!F306<=0,'GESTION A'!D306,\" \")","v":0}]
[{"$f":"IF('GESTION A'!F307<=0,'GESTION A'!A307,\" \")","v":" "},{"$f":"IF('GESTION A'!F307<=0,'GESTION A'!B307,\" \")","v":" "},{"$f":"IF('GESTION A'!F307<=0,'GESTION A'!C307,\" \" )","v":" "},{"$f":"IF('GESTION A'!F307<=0,'GESTION A'!D307,\" \")","v":" "}]
[{"$f":"IF('GESTION A'!F308<=0,'GESTION A'!A308,\" \")","v":"A1002"},{"$f":"IF('GESTION A'!F308<=0,'GESTION A'!B308,\" \")","v":"GEKA"},{"$f":"IF('GESTION A'!F308<=0,'GESTION A'!C308,\" \" )","v":0},{"$f":"IF('GESTION A'!F308<=0,'GESTION A'!D308,\" \")","v":0}]
[{"$f":"IF('GESTION A'!F310<=0,'GESTION A'!A310,\" \")","v":" "},{"$f":"IF('GESTION A'!F310<=0,'GESTION A'!B310,\" \")","v":" "},{"$f":"IF('GESTION A'!F310<=0,'GESTION A'!C310,\" \" )","v":" "},{"$f":"IF('GESTION A'!F310<=0,'GESTION A'!D310,\" \")","v":" "}]
[{"$f":"IF('GESTION A'!F311<=0,'GESTION A'!A311,\" \")","v":" "},{"$f":"IF('GESTION A'!F311<=0,'GESTION A'!B311,\" \")","v":" "},{"$f":"IF('GESTION A'!F311<=0,'GESTION A'!C311,\" \" )","v":" "},{"$f":"IF('GESTION A'!F311<=0,'GESTION A'!D311,\" \")","v":" "}]
[{"$f":"IF('GESTION A'!F312<=0,'GESTION A'!A312,\" \")","v":"A1005"},{"$f":"IF('GESTION A'!F312<=0,'GESTION A'!B312,\" \")","v":"GEKA"},{"$f":"IF('GESTION A'!F312<=0,'GESTION A'!C312,\" \" )","v":"GM8"},{"$f":"IF('GESTION A'!F312<=0,'GESTION A'!D312,\" \")","v":"EBAUCHE CARRE 0° ET 90°"}]
[{"$f":"IF('GESTION A'!F313<=0,'GESTION A'!A313,\" \")","v":" "},{"$f":"IF('GESTION A'!F313<=0,'GESTION A'!B313,\" \")","v":" "},{"$f":"IF('GESTION A'!F313<=0,'GESTION A'!C313,\" \" )","v":" "},{"$f":"IF('GESTION A'!F313<=0,'GESTION A'!D313,\" \")","v":" "}]
[{"$f":"IF('GESTION A'!F314<=0,'GESTION A'!A314,\" \")","v":"A1007"},{"$f":"IF('GESTION A'!F314<=0,'GESTION A'!B314,\" \")","v":"GEKA"},{"$f":"IF('GESTION A'!F314<=0,'GESTION A'!C314,\" \" )","v":"GM8"},{"$f":"IF('GESTION A'!F314<=0,'GESTION A'!D314,\" \")","v":"EBAUCHE EXCENTREE"}]
[{"$f":"IF('GESTION A'!F315<=0,'GESTION A'!A315,\" \")","v":" "},{"$f":"IF('GESTION A'!F315<=0,'GESTION A'!B315,\" \")","v":" "},{"$f":"IF('GESTION A'!F315<=0,'GESTION A'!C315,\" \" )","v":" "},{"$f":"IF('GESTION A'!F315<=0,'GESTION A'!D315,\" \")","v":" "}]
[{"$f":"IF('GESTION A'!F316<=0,'GESTION A'!A316,\" \")","v":" "},{"$f":"IF('GESTION A'!F316<=0,'GESTION A'!B316,\" \")","v":" "},{"$f":"IF('GESTION A'!F316<=0,'GESTION A'!C316,\" \" )","v":" "},{"$f":"IF('GESTION A'!F316<=0,'GESTION A'!D316,\" \")","v":" "}]
[{"$f":"IF('GESTION A'!F317<=0,'GESTION A'!A317,\" \")","v":" "},{"$f":"IF('GESTION A'!F317<=0,'GESTION A'!B317,\" \")","v":" "},{"$f":"IF('GESTION A'!F317<=0,'GESTION A'!C317,\" \" )","v":" "},{"$f":"IF('GESTION A'!F317<=0,'GESTION A'!D317,\" \")","v":" "}]
[{"$f":"IF('GESTION A'!F318<=0,'GESTION A'!A318,\" \")","v":" "},{"$f":"IF('GESTION A'!F318<=0,'GESTION A'!B318,\" \")","v":" "},{"$f":"IF('GESTION A'!F318<=0,'GESTION A'!C318,\" \" )","v":" "},{"$f":"IF('GESTION A'!F318<=0,'GESTION A'!D318,\" \")","v":" "}]
[{"$f":"IF('GESTION A'!F319<=0,'GESTION A'!A319,\" \")","v":" "},{"$f":"IF('GESTION A'!F319<=0,'GESTION A'!B319,\" \")","v":" "},{"$f":"IF('GESTION A'!F319<=0,'GESTION A'!C319,\" \" )","v":" "},{"$f":"IF('GESTION A'!F319<=0,'GESTION A'!D319,\" \")","v":" "}]
[{"$f":"IF('GESTION A'!F320<=0,'GESTION A'!A320,\" \")","v":" "},{"$f":"IF('GESTION A'!F320<=0,'GESTION A'!B320,\" \")","v":" "},{"$f":"IF('GESTION A'!F320<=0,'GESTION A'!C320,\" \" )","v":" "},{"$f":"IF('GESTION A'!F320<=0,'GESTION A'!D320,\" \")","v":" "}]
[{"$f":"IF('GESTION A'!F321<=0,'GESTION A'!A321,\" \")","v":" "},{"$f":"IF('GESTION A'!F321<=0,'GESTION A'!B321,\" \")","v":" "},{"$f":"IF('GESTION A'!F321<=0,'GESTION A'!C321,\" \" )","v":" "},{"$f":"IF('GESTION A'!F321<=0,'GESTION A'!D321,\" \")","v":" "}]
[{"$f":"IF('GESTION A'!F322<=0,'GESTION A'!A322,\" \")","v":" "},{"$f":"IF('GESTION A'!F322<=0,'GESTION A'!B322,\" \")","v":" "},{"$f":"IF('GESTION A'!F322<=0,'GESTION A'!C322,\" \" )","v":" "},{"$f":"IF('GESTION A'!F322<=0,'GESTION A'!D322,\" \")","v":" "}]
[{"$f":"IF('GESTION A'!F323<=0,'GESTION A'!A323,\" \")","v":" "},{"$f":"IF('GESTION A'!F323<=0,'GESTION A'!B323,\" \")","v":" "},{"$f":"IF('GESTION A'!F323<=0,'GESTION A'!C323,\" \" )","v":" "},{"$f":"IF('GESTION A'!F323<=0,'GESTION A'!D323,\" \")","v":" "}]
[{"$f":"IF('GESTION A'!F324<=0,'GESTION A'!A324,\" \")","v":"A1015"},{"$f":"IF('GESTION A'!F324<=0,'GESTION A'!B324,\" \")","v":"GEKA"},{"$f":"IF('GESTION A'!F324<=0,'GESTION A'!C324,\" \" )","v":"GM11"},{"$f":"IF('GESTION A'!F324<=0,'GESTION A'!D324,\" \")","v":"EBAUCHE"}]
[{"$f":"IF('GESTION A'!F325<=0,'GESTION A'!A325,\" \")","v":" "},{"$f":"IF('GESTION A'!F325<=0,'GESTION A'!B325,\" \")","v":" "},{"$f":"IF('GESTION A'!F325<=0,'GESTION A'!C325,\" \" )","v":" "},{"$f":"IF('GESTION A'!F325<=0,'GESTION A'!D325,\" \")","v":" "}]
[{"$f":"IF('GESTION A'!F326<=0,'GESTION A'!A326,\" \")","v":" "},{"$f":"IF('GESTION A'!F326<=0,'GESTION A'!B326,\" \")","v":" "},{"$f":"IF('GESTION A'!F326<=0,'GESTION A'!C326,\" \" )","v":" "},{"$f":"IF('GESTION A'!F326<=0,'GESTION A'!D326,\" \")","v":" "}]
[{"$f":"IF('GESTION A'!F327<=0,'GESTION A'!A327,\" \")","v":" "},{"$f":"IF('GESTION A'!F327<=0,'GESTION A'!B327,\" \")","v":" "},{"$f":"IF('GESTION A'!F327<=0,'GESTION A'!C327,\" \" )","v":" "},{"$f":"IF('GESTION A'!F327<=0,'GESTION A'!D327,\" \")","v":" "}]
[{"$f":"IF('GESTION A'!F328<=0,'GESTION A'!A328,\" \")","v":"A1018"},{"$f":"IF('GESTION A'!F328<=0,'GESTION A'!B328,\" \")","v":"GEKA"},{"$f":"IF('GESTION A'!F328<=0,'GESTION A'!C328,\" \" )","v":"GM12"},{"$f":"IF('GESTION A'!F328<=0,'GESTION A'!D328,\" \")","v":"EBAUCHE"}]
[{"$f":"IF('GESTION A'!F329<=0,'GESTION A'!A329,\" \")","v":"A1019"},{"$f":"IF('GESTION A'!F329<=0,'GESTION A'!B329,\" \")","v":"GEKA"},{"$f":"IF('GESTION A'!F329<=0,'GESTION A'!C329,\" \" )","v":"GM12"},{"$f":"IF('GESTION A'!F329<=0,'GESTION A'!D329,\" \")","v":"EBAUCHE FRAISEE PERCEE"}]
[{"$f":"IF('GESTION A'!F330<=0,'GESTION A'!A330,\" \")","v":" "},{"$f":"IF('GESTION A'!F330<=0,'GESTION A'!B330,\" \")","v":" "},{"$f":"IF('GESTION A'!F330<=0,'GESTION A'!C330,\" \" )","v":" "},{"$f":"IF('GESTION A'!F330<=0,'GESTION A'!D330,\" \")","v":" "}]
[{"$f":"IF('GESTION A'!F331<=0,'GESTION A'!A331,\" \")","v":" "},{"$f":"IF('GESTION A'!F331<=0,'GESTION A'!B331,\" \")","v":" "},{"$f":"IF('GESTION A'!F331<=0,'GESTION A'!C331,\" \" )","v":" "},{"$f":"IF('GESTION A'!F331<=0,'GESTION A'!D331,\" \")","v":" "}]
[{"$f":"IF('GESTION A'!F332<=0,'GESTION A'!A332,\" \")","v":"A1022"},{"$f":"IF('GESTION A'!F332<=0,'GESTION A'!B332,\" \")","v":"GEKA"},{"$f":"IF('GESTION A'!F332<=0,'GESTION A'!C332,\" \" )","v":"GM13"},{"$f":"IF('GESTION A'!F332<=0,'GESTION A'!D332,\" \")","v":"EBAUCHE PERCEE"}]
[{"$f":"IF('GESTION A'!F333<=0,'GESTION A'!A333,\" \")","v":"A1023-A"},{"$f":"IF('GESTION A'!F333<=0,'GESTION A'!B333,\" \")","v":"GEKA"},{"$f":"IF('GESTION A'!F333<=0,'GESTION A'!C333,\" \" )","v":"GM11"},{"$f":"IF('GESTION A'!F333<=0,'GESTION A'!D333,\" \")","v":"EBAUCHE 1/4 ROND"}]
[{"$f":"IF('GESTION A'!F334<=0,'GESTION A'!A334,\" \")","v":" "},{"$f":"IF('GESTION A'!F334<=0,'GESTION A'!B334,\" \")","v":" "},{"$f":"IF('GESTION A'!F334<=0,'GESTION A'!C334,\" \" )","v":" "},{"$f":"IF('GESTION A'!F334<=0,'GESTION A'!D334,\" \")","v":" "}]
[{"$f":"IF('GESTION A'!F335<=0,'GESTION A'!A335,\" \")","v":" "},{"$f":"IF('GESTION A'!F335<=0,'GESTION A'!B335,\" \")","v":" "},{"$f":"IF('GESTION A'!F335<=0,'GESTION A'!C335,\" \" )","v":" "},{"$f":"IF('GESTION A'!F335<=0,'GESTION A'!D335,\" \")","v":" "}]
[{"$f":"IF('GESTION A'!F336<=0,'GESTION A'!A336,\" \")","v":"A1025"},{"$f":"IF('GESTION A'!F336<=0,'GESTION A'!B336,\" \")","v":0},{"$f":"IF('GESTION A'!F336<=0,'GESTION A'!C336,\" \" )","v":0},{"$f":"IF('GESTION A'!F336<=0,'GESTION A'!D336,\" \")","v":0}]
[{"$f":"IF('GESTION A'!F337<=0,'GESTION A'!A337,\" \")","v":" "},{"$f":"IF('GESTION A'!F337<=0,'GESTION A'!B337,\" \")","v":" "},{"$f":"IF('GESTION A'!F337<=0,'GESTION A'!C337,\" \" )","v":" "},{"$f":"IF('GESTION A'!F337<=0,'GESTION A'!D337,\" \")","v":" "}]
[{"$f":"IF('GESTION A'!F339<=0,'GESTION A'!A339,\" \")","v":" "},{"$f":"IF('GESTION A'!F339<=0,'GESTION A'!B339,\" \")","v":" "},{"$f":"IF('GESTION A'!F339<=0,'GESTION A'!C339,\" \" )","v":" "},{"$f":"IF('GESTION A'!F339<=0,'GESTION A'!D339,\" \")","v":" "}]
[{"$f":"IF('GESTION A'!F341<=0,'GESTION A'!A341,\" \")","v":" "},{"$f":"IF('GESTION A'!F341<=0,'GESTION A'!B341,\" \")","v":" "},{"$f":"IF('GESTION A'!F341<=0,'GESTION A'!C341,\" \" )","v":" "},{"$f":"IF('GESTION A'!F341<=0,'GESTION A'!D341,\" \")","v":" "}]
[{"$f":"IF('GESTION A'!F343<=0,'GESTION A'!A343,\" \")","v":"A1104-A"},{"$f":"IF('GESTION A'!F343<=0,'GESTION A'!B343,\" \")","v":0},{"$f":"IF('GESTION A'!F343<=0,'GESTION A'!C343,\" \" )","v":0},{"$f":"IF('GESTION A'!F343<=0,'GESTION A'!D343,\" \")","v":0}]
[{"$f":"IF('GESTION A'!F345<=0,'GESTION A'!A345,\" \")","v":" "},{"$f":"IF('GESTION A'!F345<=0,'GESTION A'!B345,\" \")","v":" "},{"$f":"IF('GESTION A'!F345<=0,'GESTION A'!C345,\" \" )","v":" "},{"$f":"IF('GESTION A'!F345<=0,'GESTION A'!D345,\" \")","v":" "}]
[{"$f":"IF('GESTION A'!F347<=0,'GESTION A'!A347,\" \")","v":" "},{"$f":"IF('GESTION A'!F347<=0,'GESTION A'!B347,\" \")","v":" "},{"$f":"IF('GESTION A'!F347<=0,'GESTION A'!C347,\" \" )","v":" "},{"$f":"IF('GESTION A'!F347<=0,'GESTION A'!D347,\" \")","v":" "}]
[{"$f":"IF('GESTION A'!F349<=0,'GESTION A'!A349,\" \")","v":" "},{"$f":"IF('GESTION A'!F349<=0,'GESTION A'!B349,\" \")","v":" "},{"$f":"IF('GESTION A'!F349<=0,'GESTION A'!C349,\" \" )","v":" "},{"$f":"IF('GESTION A'!F349<=0,'GESTION A'!D349,\" \")","v":" "}]
[{"$f":"IF('GESTION A'!F351<=0,'GESTION A'!A351,\" \")","v":"A1108-A"},{"$f":"IF('GESTION A'!F351<=0,'GESTION A'!B351,\" \")","v":"ROUYER RC"},{"$f":"IF('GESTION A'!F351<=0,'GESTION A'!C351,\" \" )","v":"C18"},{"$f":"IF('GESTION A'!F351<=0,'GESTION A'!D351,\" \")","v":"EBAUCHE SUPERIEUR 2 REPERES"}]
[{"$f":"IF('GESTION A'!F353<=0,'GESTION A'!A353,\" \")","v":" "},{"$f":"IF('GESTION A'!F353<=0,'GESTION A'!B353,\" \")","v":" "},{"$f":"IF('GESTION A'!F353<=0,'GESTION A'!C353,\" \" )","v":" "},{"$f":"IF('GESTION A'!F353<=0,'GESTION A'!D353,\" \")","v":" "}]
[{"$f":"IF('GESTION A'!F355<=0,'GESTION A'!A355,\" \")","v":" "},{"$f":"IF('GESTION A'!F355<=0,'GESTION A'!B355,\" \")","v":" "},{"$f":"IF('GESTION A'!F355<=0,'GESTION A'!C355,\" \" )","v":" "},{"$f":"IF('GESTION A'!F355<=0,'GESTION A'!D355,\" \")","v":" "}]
[{"$f":"IF('GESTION A'!F357<=0,'GESTION A'!A357,\" \")","v":"A1111-A"},{"$f":"IF('GESTION A'!F357<=0,'GESTION A'!B357,\" \")","v":"ROUYER RC"},{"$f":"IF('GESTION A'!F357<=0,'GESTION A'!C357,\" \" )","v":"C22"},{"$f":"IF('GESTION A'!F357<=0,'GESTION A'!D357,\" \")","v":"EBAUCHE 2 REPERES"}]
[{"$f":"IF('GESTION A'!F359<=0,'GESTION A'!A359,\" \")","v":" "},{"$f":"IF('GESTION A'!F359<=0,'GESTION A'!B359,\" \")","v":" "},{"$f":"IF('GESTION A'!F359<=0,'GESTION A'!C359,\" \" )","v":" "},{"$f":"IF('GESTION A'!F359<=0,'GESTION A'!D359,\" \")","v":" "}]
[{"$f":"IF('GESTION A'!F362<=0,'GESTION A'!A362,\" \")","v":"A1113-B"},{"$f":"IF('GESTION A'!F362<=0,'GESTION A'!B362,\" \")","v":"ROUYER RC"},{"$f":"IF('GESTION A'!F362<=0,'GESTION A'!C362,\" \" )","v":"M22"},{"$f":"IF('GESTION A'!F362<=0,'GESTION A'!D362,\" \")","v":"EBAUCHE"}]
[{"$f":"IF('GESTION A'!F363<=0,'GESTION A'!A363,\" \")","v":" "},{"$f":"IF('GESTION A'!F363<=0,'GESTION A'!B363,\" \")","v":" "},{"$f":"IF('GESTION A'!F363<=0,'GESTION A'!C363,\" \" )","v":" "},{"$f":"IF('GESTION A'!F363<=0,'GESTION A'!D363,\" \")","v":" "}]
[{"$f":"IF('GESTION A'!F365<=0,'GESTION A'!A365,\" \")","v":" "},{"$f":"IF('GESTION A'!F365<=0,'GESTION A'!B365,\" \")","v":" "},{"$f":"IF('GESTION A'!F365<=0,'GESTION A'!C365,\" \" )","v":" "},{"$f":"IF('GESTION A'!F365<=0,'GESTION A'!D365,\" \")","v":" "}]
[{"$f":"IF('GESTION A'!F367<=0,'GESTION A'!A367,\" \")","v":" "},{"$f":"IF('GESTION A'!F367<=0,'GESTION A'!B367,\" \")","v":" "},{"$f":"IF('GESTION A'!F367<=0,'GESTION A'!C367,\" \" )","v":" "},{"$f":"IF('GESTION A'!F367<=0,'GESTION A'!D367,\" \")","v":" "}]
[{"$f":"IF('GESTION A'!F369<=0,'GESTION A'!A369,\" \")","v":"A1117-A"},{"$f":"IF('GESTION A'!F369<=0,'GESTION A'!B369,\" \")","v":"ROUYER RC"},{"$f":"IF('GESTION A'!F369<=0,'GESTION A'!C369,\" \" )","v":"M34"},{"$f":"IF('GESTION A'!F369<=0,'GESTION A'!D369,\" \")","v":"EBAUCHE"}]
[{"$f":"IF('GESTION A'!F371<=0,'GESTION A'!A371,\" \")","v":" "},{"$f":"IF('GESTION A'!F371<=0,'GESTION A'!B371,\" \")","v":" "},{"$f":"IF('GESTION A'!F371<=0,'GESTION A'!C371,\" \" )","v":" "},{"$f":"IF('GESTION A'!F371<=0,'GESTION A'!D371,\" \")","v":" "}]
[{"$f":"IF('GESTION A'!F373<=0,'GESTION A'!A373,\" \")","v":"A1119-A"},{"$f":"IF('GESTION A'!F373<=0,'GESTION A'!B373,\" \")","v":"ROUYER RC"},{"$f":"IF('GESTION A'!F373<=0,'GESTION A'!C373,\" \" )","v":"M40"},{"$f":"IF('GESTION A'!F373<=0,'GESTION A'!D373,\" \")","v":"EBAUCHE"}]
[{"$f":"IF('GESTION A'!F375<=0,'GESTION A'!A375,\" \")","v":" "},{"$f":"IF('GESTION A'!F375<=0,'GESTION A'!B375,\" \")","v":" "},{"$f":"IF('GESTION A'!F375<=0,'GESTION A'!C375,\" \" )","v":" "},{"$f":"IF('GESTION A'!F375<=0,'GESTION A'!D375,\" \")","v":" "}]
[{"$f":"IF('GESTION A'!F377<=0,'GESTION A'!A377,\" \")","v":" "},{"$f":"IF('GESTION A'!F377<=0,'GESTION A'!B377,\" \")","v":" "},{"$f":"IF('GESTION A'!F377<=0,'GESTION A'!C377,\" \" )","v":" "},{"$f":"IF('GESTION A'!F377<=0,'GESTION A'!D377,\" \")","v":" "}]
[{"$f":"IF('GESTION A'!F379<=0,'GESTION A'!A379,\" \")","v":" "},{"$f":"IF('GESTION A'!F379<=0,'GESTION A'!B379,\" \")","v":" "},{"$f":"IF('GESTION A'!F379<=0,'GESTION A'!C379,\" \" )","v":" "},{"$f":"IF('GESTION A'!F379<=0,'GESTION A'!D379,\" \")","v":" "}]
[{"$f":"IF('GESTION A'!F380<=0,'GESTION A'!A380,\" \")","v":"A1123"},{"$f":"IF('GESTION A'!F380<=0,'GESTION A'!B380,\" \")","v":"ROUYER RC"},{"$f":"IF('GESTION A'!F380<=0,'GESTION A'!C380,\" \" )","v":"M47"},{"$f":"IF('GESTION A'!F380<=0,'GESTION A'!D380,\" \")","v":0}]
[{"$f":"IF('GESTION A'!F381<=0,'GESTION A'!A381,\" \")","v":"A1124"},{"$f":"IF('GESTION A'!F381<=0,'GESTION A'!B381,\" \")","v":0},{"$f":"IF('GESTION A'!F381<=0,'GESTION A'!C381,\" \" )","v":0},{"$f":"IF('GESTION A'!F381<=0,'GESTION A'!D381,\" \")","v":0}]
[{"$f":"IF('GESTION A'!F382<=0,'GESTION A'!A382,\" \")","v":"A1125"},{"$f":"IF('GESTION A'!F382<=0,'GESTION A'!B382,\" \")","v":0},{"$f":"IF('GESTION A'!F382<=0,'GESTION A'!C382,\" \" )","v":0},{"$f":"IF('GESTION A'!F382<=0,'GESTION A'!D382,\" \")","v":0}]
[{"$f":"IF('GESTION A'!F383<=0,'GESTION A'!A383,\" \")","v":"A1201"},{"$f":"IF('GESTION A'!F383<=0,'GESTION A'!B383,\" \")","v":"BOUTILLON"},{"$f":"IF('GESTION A'!F383<=0,'GESTION A'!C383,\" \" )","v":"PN1"},{"$f":"IF('GESTION A'!F383<=0,'GESTION A'!D383,\" \")","v":"EBAUCHE"}]
[{"$f":"IF('GESTION A'!F384<=0,'GESTION A'!A384,\" \")","v":"A1202"},{"$f":"IF('GESTION A'!F384<=0,'GESTION A'!B384,\" \")","v":"BOUTILLON"},{"$f":"IF('GESTION A'!F384<=0,'GESTION A'!C384,\" \" )","v":"PN1"},{"$f":"IF('GESTION A'!F384<=0,'GESTION A'!D384,\" \")","v":"EBAUCHE FRAISEE"}]
[{"$f":"IF('GESTION A'!F385<=0,'GESTION A'!A385,\" \")","v":"A1203-A"},{"$f":"IF('GESTION A'!F385<=0,'GESTION A'!B385,\" \")","v":"BOUTILLON"},{"$f":"IF('GESTION A'!F385<=0,'GESTION A'!C385,\" \" )","v":"PN2"},{"$f":"IF('GESTION A'!F385<=0,'GESTION A'!D385,\" \")","v":"EBAUCHE"}]
[{"$f":"IF('GESTION A'!F386<=0,'GESTION A'!A386,\" \")","v":"A1203-B"},{"$f":"IF('GESTION A'!F386<=0,'GESTION A'!B386,\" \")","v":"BOUTILLON"},{"$f":"IF('GESTION A'!F386<=0,'GESTION A'!C386,\" \" )","v":"PN2"},{"$f":"IF('GESTION A'!F386<=0,'GESTION A'!D386,\" \")","v":"EBAUCHE FRAISEE"}]
[{"$f":"IF('GESTION A'!F387<=0,'GESTION A'!A387,\" \")","v":"A1204"},{"$f":"IF('GESTION A'!F387<=0,'GESTION A'!B387,\" \")","v":"BOUTILLON"},{"$f":"IF('GESTION A'!F387<=0,'GESTION A'!C387,\" \" )","v":"PN3"},{"$f":"IF('GESTION A'!F387<=0,'GESTION A'!D387,\" \")","v":"EBAUCHE"}]
[{"$f":"IF('GESTION A'!F388<=0,'GESTION A'!A388,\" \")","v":" "},{"$f":"IF('GESTION A'!F388<=0,'GESTION A'!B388,\" \")","v":" "},{"$f":"IF('GESTION A'!F388<=0,'GESTION A'!C388,\" \" )","v":" "},{"$f":"IF('GESTION A'!F388<=0,'GESTION A'!D388,\" \")","v":" "}]
[{"$f":"IF('GESTION A'!F389<=0,'GESTION A'!A389,\" \")","v":" "},{"$f":"IF('GESTION A'!F389<=0,'GESTION A'!B389,\" \")","v":" "},{"$f":"IF('GESTION A'!F389<=0,'GESTION A'!C389,\" \" )","v":" "},{"$f":"IF('GESTION A'!F389<=0,'GESTION A'!D389,\" \")","v":" "}]
[{"$f":"IF('GESTION A'!F390<=0,'GESTION A'!A390,\" \")","v":" "},{"$f":"IF('GESTION A'!F390<=0,'GESTION A'!B390,\" \")","v":" "},{"$f":"IF('GESTION A'!F390<=0,'GESTION A'!C390,\" \" )","v":" "},{"$f":"IF('GESTION A'!F390<=0,'GESTION A'!D390,\" \")","v":" "}]
[{"$f":"IF('GESTION A'!F391<=0,'GESTION A'!A391,\" \")","v":" "},{"$f":"IF('GESTION A'!F391<=0,'GESTION A'!B391,\" \")","v":" "},{"$f":"IF('GESTION A'!F391<=0,'GESTION A'!C391,\" \" )","v":" "},{"$f":"IF('GESTION A'!F391<=0,'GESTION A'!D391,\" \")","v":" "}]
[{"$f":"IF('GESTION A'!F392<=0,'GESTION A'!A392,\" \")","v":" "},{"$f":"IF('GESTION A'!F392<=0,'GESTION A'!B392,\" \")","v":" "},{"$f":"IF('GESTION A'!F392<=0,'GESTION A'!C392,\" \" )","v":" "},{"$f":"IF('GESTION A'!F392<=0,'GESTION A'!D392,\" \")","v":" "}]
[{"$f":"IF('GESTION A'!F393<=0,'GESTION A'!A393,\" \")","v":" "},{"$f":"IF('GESTION A'!F393<=0,'GESTION A'!B393,\" \")","v":" "},{"$f":"IF('GESTION A'!F393<=0,'GESTION A'!C393,\" \" )","v":" "},{"$f":"IF('GESTION A'!F393<=0,'GESTION A'!D393,\" \")","v":" "}]
[{"$f":"IF('GESTION A'!F394<=0,'GESTION A'!A394,\" \")","v":" "},{"$f":"IF('GESTION A'!F394<=0,'GESTION A'!B394,\" \")","v":" "},{"$f":"IF('GESTION A'!F394<=0,'GESTION A'!C394,\" \" )","v":" "},{"$f":"IF('GESTION A'!F394<=0,'GESTION A'!D394,\" \")","v":" "}]
[{"$f":"IF('GESTION A'!F395<=0,'GESTION A'!A395,\" \")","v":"A1212"},{"$f":"IF('GESTION A'!F395<=0,'GESTION A'!B395,\" \")","v":"BOUTILLON"},{"$f":"IF('GESTION A'!F395<=0,'GESTION A'!C395,\" \" )","v":"M24"},{"$f":"IF('GESTION A'!F395<=0,'GESTION A'!D395,\" \")","v":"EBAUCHE"}]
[{"$f":"IF('GESTION A'!F396<=0,'GESTION A'!A396,\" \")","v":"A1213"},{"$f":"IF('GESTION A'!F396<=0,'GESTION A'!B396,\" \")","v":"BOUTILLON"},{"$f":"IF('GESTION A'!F396<=0,'GESTION A'!C396,\" \" )","v":"M24"},{"$f":"IF('GESTION A'!F396<=0,'GESTION A'!D396,\" \")","v":"EBAUCHE PERCEE"}]
[{"$f":"IF('GESTION A'!F397<=0,'GESTION A'!A397,\" \")","v":" "},{"$f":"IF('GESTION A'!F397<=0,'GESTION A'!B397,\" \")","v":" "},{"$f":"IF('GESTION A'!F397<=0,'GESTION A'!C397,\" \" )","v":" "},{"$f":"IF('GESTION A'!F397<=0,'GESTION A'!D397,\" \")","v":" "}]
[{"$f":"IF('GESTION A'!F398<=0,'GESTION A'!A398,\" \")","v":" "},{"$f":"IF('GESTION A'!F398<=0,'GESTION A'!B398,\" \")","v":" "},{"$f":"IF('GESTION A'!F398<=0,'GESTION A'!C398,\" \" )","v":" "},{"$f":"IF('GESTION A'!F398<=0,'GESTION A'!D398,\" \")","v":" "}]
[{"$f":"IF('GESTION A'!F399<=0,'GESTION A'!A399,\" \")","v":" "},{"$f":"IF('GESTION A'!F399<=0,'GESTION A'!B399,\" \")","v":" "},{"$f":"IF('GESTION A'!F399<=0,'GESTION A'!C399,\" \" )","v":" "},{"$f":"IF('GESTION A'!F399<=0,'GESTION A'!D399,\" \")","v":" "}]
[{"$f":"IF('GESTION A'!F400<=0,'GESTION A'!A400,\" \")","v":" "},{"$f":"IF('GESTION A'!F400<=0,'GESTION A'!B400,\" \")","v":" "},{"$f":"IF('GESTION A'!F400<=0,'GESTION A'!C400,\" \" )","v":" "},{"$f":"IF('GESTION A'!F400<=0,'GESTION A'!D400,\" \")","v":" "}]
[{"$f":"IF('GESTION A'!F401<=0,'GESTION A'!A401,\" \")","v":" "},{"$f":"IF('GESTION A'!F401<=0,'GESTION A'!B401,\" \")","v":" "},{"$f":"IF('GESTION A'!F401<=0,'GESTION A'!C401,\" \" )","v":" "},{"$f":"IF('GESTION A'!F401<=0,'GESTION A'!D401,\" \")","v":" "}]
[{"$f":"IF('GESTION A'!F402<=0,'GESTION A'!A402,\" \")","v":" "},{"$f":"IF('GESTION A'!F402<=0,'GESTION A'!B402,\" \")","v":" "},{"$f":"IF('GESTION A'!F402<=0,'GESTION A'!C402,\" \" )","v":" "},{"$f":"IF('GESTION A'!F402<=0,'GESTION A'!D402,\" \")","v":" "}]
[{"$f":"IF('GESTION A'!F403<=0,'GESTION A'!A403,\" \")","v":" "},{"$f":"IF('GESTION A'!F403<=0,'GESTION A'!B403,\" \")","v":" "},{"$f":"IF('GESTION A'!F403<=0,'GESTION A'!C403,\" \" )","v":" "},{"$f":"IF('GESTION A'!F403<=0,'GESTION A'!D403,\" \")","v":" "}]
[{"$f":"IF('GESTION A'!F404<=0,'GESTION A'!A404,\" \")","v":" "},{"$f":"IF('GESTION A'!F404<=0,'GESTION A'!B404,\" \")","v":" "},{"$f":"IF('GESTION A'!F404<=0,'GESTION A'!C404,\" \" )","v":" "},{"$f":"IF('GESTION A'!F404<=0,'GESTION A'!D404,\" \")","v":" "}]
[{"$f":"IF('GESTION A'!F405<=0,'GESTION A'!A405,\" \")","v":" "},{"$f":"IF('GESTION A'!F405<=0,'GESTION A'!B405,\" \")","v":" "},{"$f":"IF('GESTION A'!F405<=0,'GESTION A'!C405,\" \" )","v":" "},{"$f":"IF('GESTION A'!F405<=0,'GESTION A'!D405,\" \")","v":" "}]
[{"$f":"IF('GESTION A'!F406<=0,'GESTION A'!A406,\" \")","v":" "},{"$f":"IF('GESTION A'!F406<=0,'GESTION A'!B406,\" \")","v":" "},{"$f":"IF('GESTION A'!F406<=0,'GESTION A'!C406,\" \" )","v":" "},{"$f":"IF('GESTION A'!F406<=0,'GESTION A'!D406,\" \")","v":" "}]
[{"$f":"IF('GESTION A'!F407<=0,'GESTION A'!A407,\" \")","v":"A1224"},{"$f":"IF('GESTION A'!F407<=0,'GESTION A'!B407,\" \")","v":0},{"$f":"IF('GESTION A'!F407<=0,'GESTION A'!C407,\" \" )","v":0},{"$f":"IF('GESTION A'!F407<=0,'GESTION A'!D407,\" \")","v":0}]
[{"$f":"IF('GESTION A'!F408<=0,'GESTION A'!A408,\" \")","v":"A1225"},{"$f":"IF('GESTION A'!F408<=0,'GESTION A'!B408,\" \")","v":0},{"$f":"IF('GESTION A'!F408<=0,'GESTION A'!C408,\" \" )","v":0},{"$f":"IF('GESTION A'!F408<=0,'GESTION A'!D408,\" \")","v":0}]
[{"$f":"IF('GESTION A'!F409<=0,'GESTION A'!A409,\" \")","v":" "},{"$f":"IF('GESTION A'!F409<=0,'GESTION A'!B409,\" \")","v":" "},{"$f":"IF('GESTION A'!F409<=0,'GESTION A'!C409,\" \" )","v":" "},{"$f":"IF('GESTION A'!F409<=0,'GESTION A'!D409,\" \")","v":" "}]
[{"$f":"IF('GESTION A'!F415<=0,'GESTION A'!A415,\" \")","v":" "},{"$f":"IF('GESTION A'!F415<=0,'GESTION A'!B415,\" \")","v":" "},{"$f":"IF('GESTION A'!F415<=0,'GESTION A'!C415,\" \" )","v":" "},{"$f":"IF('GESTION A'!F415<=0,'GESTION A'!D415,\" \")","v":" "}]
[{"$f":"IF('GESTION A'!F417<=0,'GESTION A'!A417,\" \")","v":" "},{"$f":"IF('GESTION A'!F417<=0,'GESTION A'!B417,\" \")","v":" "},{"$f":"IF('GESTION A'!F417<=0,'GESTION A'!C417,\" \" )","v":" "},{"$f":"IF('GESTION A'!F417<=0,'GESTION A'!D417,\" \")","v":" "}]
[{"$f":"IF('GESTION A'!F419<=0,'GESTION A'!A419,\" \")","v":" "},{"$f":"IF('GESTION A'!F419<=0,'GESTION A'!B419,\" \")","v":" "},{"$f":"IF('GESTION A'!F419<=0,'GESTION A'!C419,\" \" )","v":" "},{"$f":"IF('GESTION A'!F419<=0,'GESTION A'!D419,\" \")","v":" "}]
[{"$f":"IF('GESTION A'!F420<=0,'GESTION A'!A420,\" \")","v":"A1305"},{"$f":"IF('GESTION A'!F420<=0,'GESTION A'!B420,\" \")","v":"ABL"},{"$f":"IF('GESTION A'!F420<=0,'GESTION A'!C420,\" \" )","v":"M32"},{"$f":"IF('GESTION A'!F420<=0,'GESTION A'!D420,\" \")","v":"EBAUCHE Ø32 L32"}]
[{"$f":"IF('GESTION A'!F421<=0,'GESTION A'!A421,\" \")","v":" "},{"$f":"IF('GESTION A'!F421<=0,'GESTION A'!B421,\" \")","v":" "},{"$f":"IF('GESTION A'!F421<=0,'GESTION A'!C421,\" \" )","v":" "},{"$f":"IF('GESTION A'!F421<=0,'GESTION A'!D421,\" \")","v":" "}]
[{"$f":"IF('GESTION A'!F422<=0,'GESTION A'!A422,\" \")","v":" "},{"$f":"IF('GESTION A'!F422<=0,'GESTION A'!B422,\" \")","v":" "},{"$f":"IF('GESTION A'!F422<=0,'GESTION A'!C422,\" \" )","v":" "},{"$f":"IF('GESTION A'!F422<=0,'GESTION A'!D422,\" \")","v":" "}]
[{"$f":"IF('GESTION A'!F423<=0,'GESTION A'!A423,\" \")","v":" "},{"$f":"IF('GESTION A'!F423<=0,'GESTION A'!B423,\" \")","v":" "},{"$f":"IF('GESTION A'!F423<=0,'GESTION A'!C423,\" \" )","v":" "},{"$f":"IF('GESTION A'!F423<=0,'GESTION A'!D423,\" \")","v":" "}]
[{"$f":"IF('GESTION A'!F424<=0,'GESTION A'!A424,\" \")","v":"A1308-A"},{"$f":"IF('GESTION A'!F424<=0,'GESTION A'!B424,\" \")","v":"ABL - PROFEL"},{"$f":"IF('GESTION A'!F424<=0,'GESTION A'!C424,\" \" )","v":"T22 MATRICE Ø31,7"},{"$f":"IF('GESTION A'!F424<=0,'GESTION A'!D424,\" \")","v":"EBAUCHE"}]
[{"$f":"IF('GESTION A'!F425<=0,'GESTION A'!A425,\" \")","v":"A1308-B"},{"$f":"IF('GESTION A'!F425<=0,'GESTION A'!B425,\" \")","v":"ABL - PROFEL"},{"$f":"IF('GESTION A'!F425<=0,'GESTION A'!C425,\" \" )","v":"T22 MATRICE Ø31,7"},{"$f":"IF('GESTION A'!F425<=0,'GESTION A'!D425,\" \")","v":"EBAUCHE FRAISEE PERCEE 0° ET 90°"}]
[{"$f":"IF('GESTION A'!F426<=0,'GESTION A'!A426,\" \")","v":"A1309-A"},{"$f":"IF('GESTION A'!F426<=0,'GESTION A'!B426,\" \")","v":"ABL - PROFEL"},{"$f":"IF('GESTION A'!F426<=0,'GESTION A'!C426,\" \" )","v":"T32 MATRICE Ø54"},{"$f":"IF('GESTION A'!F426<=0,'GESTION A'!D426,\" \")","v":"EBAUCHE"}]
[{"$f":"IF('GESTION A'!F427<=0,'GESTION A'!A427,\" \")","v":"A1309-B"},{"$f":"IF('GESTION A'!F427<=0,'GESTION A'!B427,\" \")","v":"ABL - PROFEL"},{"$f":"IF('GESTION A'!F427<=0,'GESTION A'!C427,\" \" )","v":"T32 MATRICE Ø54"},{"$f":"IF('GESTION A'!F427<=0,'GESTION A'!D427,\" \")","v":"EBAUCHE FRAISEE PERCEE 0° ET 90°"}]
[{"$f":"IF('GESTION A'!F428<=0,'GESTION A'!A428,\" \")","v":"A1310"},{"$f":"IF('GESTION A'!F428<=0,'GESTION A'!B428,\" \")","v":"ABL - PROFEL"},{"$f":"IF('GESTION A'!F428<=0,'GESTION A'!C428,\" \" )","v":"PA5000 POINCON"},{"$f":"IF('GESTION A'!F428<=0,'GESTION A'!D428,\" \")","v":"EBAUCHE FRAISEE"}]
[{"$f":"IF('GESTION A'!F429<=0,'GESTION A'!A429,\" \")","v":"A1311-A"},{"$f":"IF('GESTION A'!F429<=0,'GESTION A'!B429,\" \")","v":"ABL - PROFEL"},{"$f":"IF('GESTION A'!F429<=0,'GESTION A'!C429,\" \" )","v":"PA5000 MATRICE Ø38,1"},{"$f":"IF('GESTION A'!F429<=0,'GESTION A'!D429,\" \")","v":"EBAUCHE"}]
[{"$f":"IF('GESTION A'!F430<=0,'GESTION A'!A430,\" \")","v":"A1311-B"},{"$f":"IF('GESTION A'!F430<=0,'GESTION A'!B430,\" \")","v":"ABL - PROFEL"},{"$f":"IF('GESTION A'!F430<=0,'GESTION A'!C430,\" \" )","v":"PA5000 MATRICE Ø38,1"},{"$f":"IF('GESTION A'!F430<=0,'GESTION A'!D430,\" \")","v":"EBAUCHE FRAISEE PERCEE 0° ET 90°"}]
[{"$f":"IF('GESTION A'!F431<=0,'GESTION A'!A431,\" \")","v":" "},{"$f":"IF('GESTION A'!F431<=0,'GESTION A'!B431,\" \")","v":" "},{"$f":"IF('GESTION A'!F431<=0,'GESTION A'!C431,\" \" )","v":" "},{"$f":"IF('GESTION A'!F431<=0,'GESTION A'!D431,\" \")","v":" "}]
[{"$f":"IF('GESTION A'!F432<=0,'GESTION A'!A432,\" \")","v":" "},{"$f":"IF('GESTION A'!F432<=0,'GESTION A'!B432,\" \")","v":" "},{"$f":"IF('GESTION A'!F432<=0,'GESTION A'!C432,\" \" )","v":" "},{"$f":"IF('GESTION A'!F432<=0,'GESTION A'!D432,\" \")","v":" "}]
[{"$f":"IF('GESTION A'!F433<=0,'GESTION A'!A433,\" \")","v":" "},{"$f":"IF('GESTION A'!F433<=0,'GESTION A'!B433,\" \")","v":" "},{"$f":"IF('GESTION A'!F433<=0,'GESTION A'!C433,\" \" )","v":" "},{"$f":"IF('GESTION A'!F433<=0,'GESTION A'!D433,\" \")","v":" "}]
[{"$f":"IF('GESTION A'!F434<=0,'GESTION A'!A434,\" \")","v":"A1315"},{"$f":"IF('GESTION A'!F434<=0,'GESTION A'!B434,\" \")","v":"PROFEL"},{"$f":"IF('GESTION A'!F434<=0,'GESTION A'!C434,\" \" )","v":"CORPS 25"},{"$f":"IF('GESTION A'!F434<=0,'GESTION A'!D434,\" \")","v":"EBAUCHE"}]
[{"$f":"IF('GESTION A'!F435<=0,'GESTION A'!A435,\" \")","v":"A1316"},{"$f":"IF('GESTION A'!F435<=0,'GESTION A'!B435,\" \")","v":"PROFEL"},{"$f":"IF('GESTION A'!F435<=0,'GESTION A'!C435,\" \" )","v":"CORPS 25"},{"$f":"IF('GESTION A'!F435<=0,'GESTION A'!D435,\" \")","v":"EBAUCHE"}]
[{"$f":"IF('GESTION A'!F436<=0,'GESTION A'!A436,\" \")","v":" "},{"$f":"IF('GESTION A'!F436<=0,'GESTION A'!B436,\" \")","v":" "},{"$f":"IF('GESTION A'!F436<=0,'GESTION A'!C436,\" \" )","v":" "},{"$f":"IF('GESTION A'!F436<=0,'GESTION A'!D436,\" \")","v":" "}]
[{"$f":"IF('GESTION A'!F437<=0,'GESTION A'!A437,\" \")","v":" "},{"$f":"IF('GESTION A'!F437<=0,'GESTION A'!B437,\" \")","v":" "},{"$f":"IF('GESTION A'!F437<=0,'GESTION A'!C437,\" \" )","v":" "},{"$f":"IF('GESTION A'!F437<=0,'GESTION A'!D437,\" \")","v":" "}]
[{"$f":"IF('GESTION A'!F438<=0,'GESTION A'!A438,\" \")","v":"A1319"},{"$f":"IF('GESTION A'!F438<=0,'GESTION A'!B438,\" \")","v":"PROFEL"},{"$f":"IF('GESTION A'!F438<=0,'GESTION A'!C438,\" \" )","v":"M38"},{"$f":"IF('GESTION A'!F438<=0,'GESTION A'!D438,\" \")","v":"EBAUCHE"}]
[{"$f":"IF('GESTION A'!F439<=0,'GESTION A'!A439,\" \")","v":"A1320"},{"$f":"IF('GESTION A'!F439<=0,'GESTION A'!B439,\" \")","v":"PROFEL"},{"$f":"IF('GESTION A'!F439<=0,'GESTION A'!C439,\" \" )","v":"M38"},{"$f":"IF('GESTION A'!F439<=0,'GESTION A'!D439,\" \")","v":"EBAUCHE PERCEE 2 REPERES 0° ET 90°"}]
[{"$f":"IF('GESTION A'!F440<=0,'GESTION A'!A440,\" \")","v":" "},{"$f":"IF('GESTION A'!F440<=0,'GESTION A'!B440,\" \")","v":" "},{"$f":"IF('GESTION A'!F440<=0,'GESTION A'!C440,\" \" )","v":" "},{"$f":"IF('GESTION A'!F440<=0,'GESTION A'!D440,\" \")","v":" "}]
[{"$f":"IF('GESTION A'!F441<=0,'GESTION A'!A441,\" \")","v":" "},{"$f":"IF('GESTION A'!F441<=0,'GESTION A'!B441,\" \")","v":" "},{"$f":"IF('GESTION A'!F441<=0,'GESTION A'!C441,\" \" )","v":" "},{"$f":"IF('GESTION A'!F441<=0,'GESTION A'!D441,\" \")","v":" "}]
[{"$f":"IF('GESTION A'!F442<=0,'GESTION A'!A442,\" \")","v":"A1323"},{"$f":"IF('GESTION A'!F442<=0,'GESTION A'!B442,\" \")","v":"PROFEL"},{"$f":"IF('GESTION A'!F442<=0,'GESTION A'!C442,\" \" )","v":"M48"},{"$f":"IF('GESTION A'!F442<=0,'GESTION A'!D442,\" \")","v":"EBAUCHE PERCEE 2 REPERES 0° ET 90°"}]
[{"$f":"IF('GESTION A'!F443<=0,'GESTION A'!A443,\" \")","v":" "},{"$f":"IF('GESTION A'!F443<=0,'GESTION A'!B443,\" \")","v":" "},{"$f":"IF('GESTION A'!F443<=0,'GESTION A'!C443,\" \" )","v":" "},{"$f":"IF('GESTION A'!F443<=0,'GESTION A'!D443,\" \")","v":" "}]
[{"$f":"IF('GESTION A'!F446<=0,'GESTION A'!A446,\" \")","v":" "},{"$f":"IF('GESTION A'!F446<=0,'GESTION A'!B446,\" \")","v":" "},{"$f":"IF('GESTION A'!F446<=0,'GESTION A'!C446,\" \" )","v":" "},{"$f":"IF('GESTION A'!F446<=0,'GESTION A'!D446,\" \")","v":" "}]
[{"$f":"IF('GESTION A'!F447<=0,'GESTION A'!A447,\" \")","v":0},{"$f":"IF('GESTION A'!F447<=0,'GESTION A'!B447,\" \")","v":0},{"$f":"IF('GESTION A'!F447<=0,'GESTION A'!C447,\" \" )","v":0},{"$f":"IF('GESTION A'!F447<=0,'GESTION A'!D447,\" \")","v":0}]
[{"$f":"IF('GESTION A'!F448<=0,'GESTION A'!A448,\" \")","v":0},{"$f":"IF('GESTION A'!F448<=0,'GESTION A'!B448,\" \")","v":0},{"$f":"IF('GESTION A'!F448<=0,'GESTION A'!C448,\" \" )","v":0},{"$f":"IF('GESTION A'!F448<=0,'GESTION A'!D448,\" \")","v":0}]
[{"$f":"IF('GESTION A'!F449<=0,'GESTION A'!A449,\" \")","v":0},{"$f":"IF('GESTION A'!F449<=0,'GESTION A'!B449,\" \")","v":0},{"$f":"IF('GESTION A'!F449<=0,'GESTION A'!C449,\" \" )","v":0},{"$f":"IF('GESTION A'!F449<=0,'GESTION A'!D449,\" \")","v":0}]
[{"$f":"IF('GESTION A'!F450<=0,'GESTION A'!A450,\" \")","v":0},{"$f":"IF('GESTION A'!F450<=0,'GESTION A'!B450,\" \")","v":0},{"$f":"IF('GESTION A'!F450<=0,'GESTION A'!C450,\" \" )","v":0},{"$f":"IF('GESTION A'!F450<=0,'GESTION A'!D450,\" \")","v":0}]
[{"$f":"IF('GESTION A'!F451<=0,'GESTION A'!A451,\" \")","v":0},{"$f":"IF('GESTION A'!F451<=0,'GESTION A'!B451,\" \")","v":0},{"$f":"IF('GESTION A'!F451<=0,'GESTION A'!C451,\" \" )","v":0},{"$f":"IF('GESTION A'!F451<=0,'GESTION A'!D451,\" \")","v":0}]
[{"$f":"IF('GESTION A'!F452<=0,'GESTION A'!A452,\" \")","v":0},{"$f":"IF('GESTION A'!F452<=0,'GESTION A'!B452,\" \")","v":0},{"$f":"IF('GESTION A'!F452<=0,'GESTION A'!C452,\" \" )","v":0},{"$f":"IF('GESTION A'!F452<=0,'GESTION A'!D452,\" \")","v":0}]
[{"$f":"IF('GESTION A'!F453<=0,'GESTION A'!A453,\" \")","v":0},{"$f":"IF('GESTION A'!F453<=0,'GESTION A'!B453,\" \")","v":0},{"$f":"IF('GESTION A'!F453<=0,'GESTION A'!C453,\" \" )","v":0},{"$f":"IF('GESTION A'!F453<=0,'GESTION A'!D453,\" \")","v":0}]
[{"$f":"IF('GESTION A'!F454<=0,'GESTION A'!A454,\" \")","v":0},{"$f":"IF('GESTION A'!F454<=0,'GESTION A'!B454,\" \")","v":0},{"$f":"IF('GESTION A'!F454<=0,'GESTION A'!C454,\" \" )","v":0},{"$f":"IF('GESTION A'!F454<=0,'GESTION A'!D454,\" \")","v":0}]
[{"$f":"IF('GESTION A'!F455<=0,'GESTION A'!A455,\" \")","v":0},{"$f":"IF('GESTION A'!F455<=0,'GESTION A'!B455,\" \")","v":0},{"$f":"IF('GESTION A'!F455<=0,'GESTION A'!C455,\" \" )","v":0},{"$f":"IF('GESTION A'!F455<=0,'GESTION A'!D455,\" \")","v":0}]
[{"$f":"IF('GESTION A'!F456<=0,'GESTION A'!A456,\" \")","v":0},{"$f":"IF('GESTION A'!F456<=0,'GESTION A'!B456,\" \")","v":0},{"$f":"IF('GESTION A'!F456<=0,'GESTION A'!C456,\" \" )","v":0},{"$f":"IF('GESTION A'!F456<=0,'GESTION A'!D456,\" \")","v":0}]
[{"$f":"IF('GESTION A'!F457<=0,'GESTION A'!A457,\" \")","v":0},{"$f":"IF('GESTION A'!F457<=0,'GESTION A'!B457,\" \")","v":0},{"$f":"IF('GESTION A'!F457<=0,'GESTION A'!C457,\" \" )","v":0},{"$f":"IF('GESTION A'!F457<=0,'GESTION A'!D457,\" \")","v":0}]
[{"$f":"IF('GESTION A'!F458<=0,'GESTION A'!A458,\" \")","v":0},{"$f":"IF('GESTION A'!F458<=0,'GESTION A'!B458,\" \")","v":0},{"$f":"IF('GESTION A'!F458<=0,'GESTION A'!C458,\" \" )","v":0},{"$f":"IF('GESTION A'!F458<=0,'GESTION A'!D458,\" \")","v":0}]
[{"$f":"IF('GESTION A'!F459<=0,'GESTION A'!A459,\" \")","v":0},{"$f":"IF('GESTION A'!F459<=0,'GESTION A'!B459,\" \")","v":0},{"$f":"IF('GESTION A'!F459<=0,'GESTION A'!C459,\" \" )","v":0},{"$f":"IF('GESTION A'!F459<=0,'GESTION A'!D459,\" \")","v":0}]
[{"$f":"IF('GESTION A'!F460<=0,'GESTION A'!A460,\" \")","v":0},{"$f":"IF('GESTION A'!F460<=0,'GESTION A'!B460,\" \")","v":0},{"$f":"IF('GESTION A'!F460<=0,'GESTION A'!C460,\" \" )","v":0},{"$f":"IF('GESTION A'!F460<=0,'GESTION A'!D460,\" \")","v":0}]
[{"$f":"IF('GESTION A'!F461<=0,'GESTION A'!A461,\" \")","v":0},{"$f":"IF('GESTION A'!F461<=0,'GESTION A'!B461,\" \")","v":0},{"$f":"IF('GESTION A'!F461<=0,'GESTION A'!C461,\" \" )","v":0},{"$f":"IF('GESTION A'!F461<=0,'GESTION A'!D461,\" \")","v":0}]
[{"$f":"IF('GESTION A'!F462<=0,'GESTION A'!A462,\" \")","v":0},{"$f":"IF('GESTION A'!F462<=0,'GESTION A'!B462,\" \")","v":0},{"$f":"IF('GESTION A'!F462<=0,'GESTION A'!C462,\" \" )","v":0},{"$f":"IF('GESTION A'!F462<=0,'GESTION A'!D462,\" \")","v":0}]
[{"$f":"IF('GESTION A'!F463<=0,'GESTION A'!A463,\" \")","v":0},{"$f":"IF('GESTION A'!F463<=0,'GESTION A'!B463,\" \")","v":0},{"$f":"IF('GESTION A'!F463<=0,'GESTION A'!C463,\" \" )","v":0},{"$f":"IF('GESTION A'!F463<=0,'GESTION A'!D463,\" \")","v":0}]

{"sheet":"VIDES B","index":4,"n_rows":400,"n_cols":4,"rows_kept":400,"cut":false,"hidden":false,"merged":[[0,5,0,9],[0,0,0,3]]}
["EMPLACEMENTS VIDES ETAGERE B"]
[]
[]
["ADRESSES","MACHINES","REFERENCE","DESIGNATION"]
[{"$f":"IF('GESTION B'!F4<=0,'GESTION B'!A4,\" \")","v":" "},{"$f":"IF('GESTION B'!F4<=0,'GESTION B'!B4,\" \")","v":" "},{"$f":"IF('GESTION B'!F4>=0,'GESTION B'!C4,\" \")","v":9001},{"$f":"IF('GESTION B'!F4>=0,'GESTION B'!D4,\" \")","v":"EBAUCHE FRAISEE"}]
[{"$f":"IF('GESTION B'!F7<=0,'GESTION B'!A7,\" \")","v":" "},{"$f":"IF('GESTION B'!F7<=0,'GESTION B'!B7,\" \")","v":" "},{"$f":"IF('GESTION B'!F7>=0,'GESTION B'!C7,\" \")","v":9001},{"$f":"IF('GESTION B'!F7>=0,'GESTION B'!D7,\" \")","v":"EBAUCHE FRAISEE L71"}]
[{"$f":"IF('GESTION B'!F8<=0,'GESTION B'!A8,\" \")","v":" "},{"$f":"IF('GESTION B'!F8<=0,'GESTION B'!B8,\" \")","v":" "},{"$f":"IF('GESTION B'!F8>=0,'GESTION B'!C8,\" \")","v":9001},{"$f":"IF('GESTION B'!F8>=0,'GESTION B'!D8,\" \")","v":"EBAUCHE FRAISEE L80"}]
[{"$f":"IF('GESTION B'!F9<=0,'GESTION B'!A9,\" \")","v":" "},{"$f":"IF('GESTION B'!F9<=0,'GESTION B'!B9,\" \")","v":" "},{"$f":"IF('GESTION B'!F9>=0,'GESTION B'!C9,\" \")","v":9001},{"$f":"IF('GESTION B'!F9>=0,'GESTION B'!D9,\" \")","v":"EBAUCHE FRAISEE L97"}]
[{"$f":"IF('GESTION B'!F10<=0,'GESTION B'!A10,\" \")","v":" "},{"$f":"IF('GESTION B'!F10<=0,'GESTION B'!B10,\" \")","v":" "},{"$f":"IF('GESTION B'!F10>=0,'GESTION B'!C10,\" \")","v":9004},{"$f":"IF('GESTION B'!F10>=0,'GESTION B'!D10,\" \")","v":"EBAUCHE FRAISEE"}]
[{"$f":"IF('GESTION B'!F11<=0,'GESTION B'!A11,\" \")","v":" "},{"$f":"IF('GESTION B'!F11<=0,'GESTION B'!B11,\" \")","v":" "},{"$f":"IF('GESTION B'!F11>=0,'GESTION B'!C11,\" \")","v":9004},{"$f":"IF('GESTION B'!F11>=0,'GESTION B'!D11,\" \")","v":"EBAUCHE FRAISEE"}]
[{"$f":"IF('GESTION B'!F12<=0,'GESTION B'!A12,\" \")","v":"B0106-A"},{"$f":"IF('GESTION B'!F12<=0,'GESTION B'!B12,\" \")","v":"KINGSLAND"},{"$f":"IF('GESTION B'!F12>=0,'GESTION B'!C12,\" \")","v":9004},{"$f":"IF('GESTION B'!F12>=0,'GESTION B'!D12,\" \")","v":"EBAUCHE FRAISEE L80"}]
[{"$f":"IF('GESTION B'!F13<=0,'GESTION B'!A13,\" \")","v":"B0106-B"},{"$f":"IF('GESTION B'!F13<=0,'GESTION B'!B13,\" \")","v":"KINGSLAND"},{"$f":"IF('GESTION B'!F13>=0,'GESTION B'!C13,\" \")","v":9004},{"$f":"IF('GESTION B'!F13>=0,'GESTION B'!D13,\" \")","v":"EBAUCHE FRAISEE L120"}]
[{"$f":"IF('GESTION B'!F14<=0,'GESTION B'!A14,\" \")","v":" "},{"$f":"IF('GESTION B'!F14<=0,'GESTION B'!B14,\" \")","v":" "},{"$f":"IF('GESTION B'!F14>=0,'GESTION B'!C14,\" \")","v":9004},{"$f":"IF('GESTION B'!F14>=0,'GESTION B'!D14,\" \")","v":"EBAUCHE FRAISEE L140"}]
[{"$f":"IF('GESTION B'!F15<=0,'GESTION B'!A15,\" \")","v":"B0107"},{"$f":"IF('GESTION B'!F15<=0,'GESTION B'!B15,\" \")","v":"KINGSLAND"},{"$f":"IF('GESTION B'!F15>=0,'GESTION B'!C15,\" \")","v":9007},{"$f":"IF('GESTION B'!F15>=0,'GESTION B'!D15,\" \")","v":"EBAUCHE FRAISEE"}]
[{"$f":"IF('GESTION B'!F16<=0,'GESTION B'!A16,\" \")","v":" "},{"$f":"IF('GESTION B'!F16<=0,'GESTION B'!B16,\" \")","v":" "},{"$f":"IF('GESTION B'!F16>=0,'GESTION B'!C16,\" \")","v":9007},{"$f":"IF('GESTION B'!F16>=0,'GESTION B'!D16,\" \")","v":"EBAUCHE FRAISEE"}]
[{"$f":"IF('GESTION B'!F17<=0,'GESTION B'!A17,\" \")","v":" "},{"$f":"IF('GESTION B'!F17<=0,'GESTION B'!B17,\" \")","v":" "},{"$f":"IF('GESTION B'!F17>=0,'GESTION B'!C17,\" \")","v":9006},{"$f":"IF('GESTION B'!F17>=0,'GESTION B'!D17,\" \")","v":"EBAUCHE FRAISEE"}]
[{"$f":"IF('GESTION B'!F18<=0,'GESTION B'!A18,\" \")","v":"B0110"},{"$f":"IF('GESTION B'!F18<=0,'GESTION B'!B18,\" \")","v":"KINGSLAND"},{"$f":"IF('GESTION B'!F18>=0,'GESTION B'!C18,\" \")","v":9006},{"$f":"IF('GESTION B'!F18>=0,'GESTION B'!D18,\" \")","v":"EBAUCHE FRAISEE"}]
[{"$f":"IF('GESTION B'!F19<=0,'GESTION B'!A19,\" \")","v":" "},{"$f":"IF('GESTION B'!F19<=0,'GESTION B'!B19,\" \")","v":" "},{"$f":"IF('GESTION B'!F19>=0,'GESTION B'!C19,\" \")","v":9009},{"$f":"IF('GESTION B'!F19>=0,'GESTION B'!D19,\" \")","v":"EBAUCHE FRAISEE"}]
[{"$f":"IF('GESTION B'!F20<=0,'GESTION B'!A20,\" \")","v":"B0112"},{"$f":"IF('GESTION B'!F20<=0,'GESTION B'!B20,\" \")","v":"KINGSLAND"},{"$f":"IF('GESTION B'!F20>=0,'GESTION B'!C20,\" \")","v":9009},{"$f":"IF('GESTION B'!F20>=0,'GESTION B'!D20,\" \")","v":"EBAUCHE FRAISEE"}]
[{"$f":"IF('GESTION B'!F21<=0,'GESTION B'!A21,\" \")","v":"B0113-A"},{"$f":"IF('GESTION B'!F21<=0,'GESTION B'!B21,\" \")","v":"KINGSLAND"},{"$f":"IF('GESTION B'!F21>=0,'GESTION B'!C21,\" \")","v":9006},{"$f":"IF('GESTION B'!F21>=0,'GESTION B'!D21,\" \")","v":"EBAUCHE FRAISEE L…"}]
[{"$f":"IF('GESTION B'!F22<=0,'GESTION B'!A22,\" \")","v":" "},{"$f":"IF('GESTION B'!F22<=0,'GESTION B'!B22,\" \")","v":" "},{"$f":"IF('GESTION B'!F22>=0,'GESTION B'!C22,\" \")","v":9009},{"$f":"IF('GESTION B'!F22>=0,'GESTION B'!D22,\" \")","v":"EBAUCHE FRAISEE L…"}]
[{"$f":"IF('GESTION B'!F23<=0,'GESTION B'!A23,\" \")","v":" "},{"$f":"IF('GESTION B'!F23<=0,'GESTION B'!B23,\" \")","v":" "},{"$f":"IF('GESTION B'!F23>=0,'GESTION B'!C23,\" \")","v":9010},{"$f":"IF('GESTION B'!F23>=0,'GESTION B'!D23,\" \")","v":"EBAUCHE FRAISEE"}]
[{"$f":"IF('GESTION B'!F24<=0,'GESTION B'!A24,\" \")","v":" "},{"$f":"IF('GESTION B'!F24<=0,'GESTION B'!B24,\" \")","v":" "},{"$f":"IF('GESTION B'!F24>=0,'GESTION B'!C24,\" \")","v":9010},{"$f":"IF('GESTION B'!F24>=0,'GESTION B'!D24,\" \")","v":"EBAUCHE FRAISEE L70"}]
[{"$f":"IF('GESTION B'!F25<=0,'GESTION B'!A25,\" \")","v":" "},{"$f":"IF('GESTION B'!F25<=0,'GESTION B'!B25,\" \")","v":" "},{"$f":"IF('GESTION B'!F25>=0,'GESTION B'!C25,\" \")","v":9010},{"$f":"IF('GESTION B'!F25>=0,'GESTION B'!D25,\" \")","v":"EBAUCHE NON TOURNEE"}]
[{"$f":"IF('GESTION B'!F26<=0,'GESTION B'!A26,\" \")","v":" "},{"$f":"IF('GESTION B'!F26<=0,'GESTION B'!B26,\" \")","v":" "},{"$f":"IF('GESTION B'!F26>=0,'GESTION B'!C26,\" \")","v":9010},{"$f":"IF('GESTION B'!F26>=0,'GESTION B'!D26,\" \")","v":"EBAUCHE NON TOURNEE"}]
[{"$f":"IF('GESTION B'!F27<=0,'GESTION B'!A27,\" \")","v":" "},{"$f":"IF('GESTION B'!F27<=0,'GESTION B'!B27,\" \")","v":" "},{"$f":"IF('GESTION B'!F27>=0,'GESTION B'!C27,\" \")","v":9010},{"$f":"IF('GESTION B'!F27>=0,'GESTION B'!D27,\" \")","v":"EBAUCHE NON TOURNEE"}]
[{"$f":"IF('GESTION B'!F28<=0,'GESTION B'!A28,\" \")","v":" "},{"$f":"IF('GESTION B'!F28<=0,'GESTION B'!B28,\" \")","v":" "},{"$f":"IF('GESTION B'!F28>=0,'GESTION B'!C28,\" \")","v":9011},{"$f":"IF('GESTION B'!F28>=0,'GESTION B'!D28,\" \")","v":"EBAUCHE FRAISEE"}]
[{"$f":"IF('GESTION B'!F31<=0,'GESTION B'!A31,\" \")","v":" "},{"$f":"IF('GESTION B'!F31<=0,'GESTION B'!B31,\" \")","v":" "},{"$f":"IF('GESTION B'!F31>=0,'GESTION B'!C31,\" \")","v":9011},{"$f":"IF('GESTION B'!F31>=0,'GESTION B'!D31,\" \")","v":"EBAUCHE FRAISEE"}]
[{"$f":"IF('GESTION B'!F32<=0,'GESTION B'!A32,\" \")","v":" "},{"$f":"IF('GESTION B'!F32<=0,'GESTION B'!B32,\" \")","v":" "},{"$f":"IF('GESTION B'!F32>=0,'GESTION B'!C32,\" \")","v":9011},{"$f":"IF('GESTION B'!F32>=0,'GESTION B'!D32,\" \")","v":"EBAUCHE NON TOURNEE"}]
[{"$f":"IF('GESTION B'!F33<=0,'GESTION B'!A33,\" \")","v":" "},{"$f":"IF('GESTION B'!F33<=0,'GESTION B'!B33,\" \")","v":" "},{"$f":"IF('GESTION B'!F33>=0,'GESTION B'!C33,\" \")","v":9011},{"$f":"IF('GESTION B'!F33>=0,'GESTION B'!D33,\" \")","v":"EBAUCHE NON TOURNEE"}]
[{"$f":"IF('GESTION B'!F34<=0,'GESTION B'!A34,\" \")","v":" "},{"$f":"IF('GESTION B'!F34<=0,'GESTION B'!B34,\" \")","v":" "},{"$f":"IF('GESTION B'!F34>=0,'GESTION B'!C34,\" \")","v":9011},{"$f":"IF('GESTION B'!F34>=0,'GESTION B'!D34,\" \")","v":"EBAUCHE NON TOURNEE"}]
[{"$f":"IF('GESTION B'!F35<=0,'GESTION B'!A35,\" \")","v":" "},{"$f":"IF('GESTION B'!F35<=0,'GESTION B'!B35,\" \")","v":" "},{"$f":"IF('GESTION B'!F35>=0,'GESTION B'!C35,\" \")","v":9011},{"$f":"IF('GESTION B'!F35>=0,'GESTION B'!D35,\" \")","v":"EBAUCHE NON TOURNEE"}]
[{"$f":"IF('GESTION B'!F36<=0,'GESTION B'!A36,\" \")","v":"B0125"},{"$f":"IF('GESTION B'!F36<=0,'GESTION B'!B36,\" \")","v":0},{"$f":"IF('GESTION B'!F36>=0,'GESTION B'!C36,\" \")","v":0},{"$f":"IF('GESTION B'!F36>=0,'GESTION B'!D36,\" \")","v":0}]
[{"$f":"IF('GESTION B'!F37<=0,'GESTION B'!A37,\" \")","v":" "},{"$f":"IF('GESTION B'!F37<=0,'GESTION B'!B37,\" \")","v":" "},{"$f":"IF('GESTION B'!F37>=0,'GESTION B'!C37,\" \")","v":9020},{"$f":"IF('GESTION B'!F37>=0,'GESTION B'!D37,\" \")","v":"EBAUCHE"}]
[{"$f":"IF('GESTION B'!F39<=0,'GESTION B'!A39,\" \")","v":" "},{"$f":"IF('GESTION B'!F39<=0,'GESTION B'!B39,\" \")","v":" "},{"$f":"IF('GESTION B'!F39>=0,'GESTION B'!C39,\" \")","v":9022},{"$f":"IF('GESTION B'!F39>=0,'GESTION B'!D39,\" \")","v":"EBAUCHE"}]
[{"$f":"IF('GESTION B'!F40<=0,'GESTION B'!A40,\" \")","v":" "},{"$f":"IF('GESTION B'!F40<=0,'GESTION B'!B40,\" \")","v":" "},{"$f":"IF('GESTION B'!F40>=0,'GESTION B'!C40,\" \")","v":9022},{"$f":"IF('GESTION B'!F40>=0,'GESTION B'!D40,\" \")","v":"EBAUCHE FRAISEE PERCEE"}]
[{"$f":"IF('GESTION B'!F41<=0,'GESTION B'!A41,\" \")","v":" "},{"$f":"IF('GESTION B'!F41<=0,'GESTION B'!B41,\" \")","v":" "},{"$f":"IF('GESTION B'!F41>=0,'GESTION B'!C41,\" \")","v":9023},{"$f":"IF('GESTION B'!F41>=0,'GESTION B'!D41,\" \")","v":"EBAUCHE"}]
[{"$f":"IF('GESTION B'!F42<=0,'GESTION B'!A42,\" \")","v":" "},{"$f":"IF('GESTION B'!F42<=0,'GESTION B'!B42,\" \")","v":" "},{"$f":"IF('GESTION B'!F42>=0,'GESTION B'!C42,\" \")","v":9023},{"$f":"IF('GESTION B'!F42>=0,'GESTION B'!D42,\" \")","v":"EBAUCHE DEPORTEE"}]
[{"$f":"IF('GESTION B'!F43<=0,'GESTION B'!A43,\" \")","v":" "},{"$f":"IF('GESTION B'!F43<=0,'GESTION B'!B43,\" \")","v":" "},{"$f":"IF('GESTION B'!F43>=0,'GESTION B'!C43,\" \")","v":9023},{"$f":"IF('GESTION B'!F43>=0,'GESTION B'!D43,\" \")","v":"EBAUCHE PERCEE Ø20"}]
[{"$f":"IF('GESTION B'!F44<=0,'GESTION B'!A44,\" \")","v":" "},{"$f":"IF('GESTION B'!F44<=0,'GESTION B'!B44,\" \")","v":" "},{"$f":"IF('GESTION B'!F44>=0,'GESTION B'!C44,\" \")","v":9023},{"$f":"IF('GESTION B'!F44>=0,'GESTION B'!D44,\" \")","v":"EBAUCHE FRAISEE PERCEE"}]
[{"$f":"IF('GESTION B'!F45<=0,'GESTION B'!A45,\" \")","v":" "},{"$f":"IF('GESTION B'!F45<=0,'GESTION B'!B45,\" \")","v":" "},{"$f":"IF('GESTION B'!F45>=0,'GESTION B'!C45,\" \")","v":9023},{"$f":"IF('GESTION B'!F45>=0,'GESTION B'!D45,\" \")","v":"EBAUCHE FRAISEE PERCEE"}]
[{"$f":"IF('GESTION B'!F46<=0,'GESTION B'!A46,\" \")","v":"B0208"},{"$f":"IF('GESTION B'!F46<=0,'GESTION B'!B46,\" \")","v":"KINGSLAND"},{"$f":"IF('GESTION B'!F46>=0,'GESTION B'!C46,\" \")","v":9023},{"$f":"IF('GESTION B'!F46>=0,'GESTION B'!D46,\" \")","v":"EBAUCHE FRAISEE PERCEE"}]
[{"$f":"IF('GESTION B'!F47<=0,'GESTION B'!A47,\" \")","v":"B0209"},{"$f":"IF('GESTION B'!F47<=0,'GESTION B'!B47,\" \")","v":"KINGSLAND"},{"$f":"IF('GESTION B'!F47>=0,'GESTION B'!C47,\" \")","v":9023},{"$f":"IF('GESTION B'!F47>=0,'GESTION B'!D47,\" \")","v":"EBAUCHE FRAISEE PERCEE"}]
[{"$f":"IF('GESTION B'!F48<=0,'GESTION B'!A48,\" \")","v":"B0210"},{"$f":"IF('GESTION B'!F48<=0,'GESTION B'!B48,\" \")","v":"KINGSLAND"},{"$f":"IF('GESTION B'!F48>=0,'GESTION B'!C48,\" \")","v":9023},{"$f":"IF('GESTION B'!F48>=0,'GESTION B'!D48,\" \")","v":"EBAUCHE FRAISEE PERCEE Ø3"}]
[{"$f":"IF('GESTION B'!F49<=0,'GESTION B'!A49,\" \")","v":" "},{"$f":"IF('GESTION B'!F49<=0,'GESTION B'!B49,\" \")","v":" "},{"$f":"IF('GESTION B'!F49>=0,'GESTION B'!C49,\" \")","v":9023},{"$f":"IF('GESTION B'!F49>=0,'GESTION B'!D49,\" \")","v":"EBAUCHE TOUT VENANT"}]
[{"$f":"IF('GESTION B'!F50<=0,'GESTION B'!A50,\" \")","v":" "},{"$f":"IF('GESTION B'!F50<=0,'GESTION B'!B50,\" \")","v":" "},{"$f":"IF('GESTION B'!F50>=0,'GESTION B'!C50,\" \")","v":9023},{"$f":"IF('GESTION B'!F50>=0,'GESTION B'!D50,\" \")","v":"EBAUCHE 1/4 ROND"}]
[{"$f":"IF('GESTION B'!F51<=0,'GESTION B'!A51,\" \")","v":"B0213"},{"$f":"IF('GESTION B'!F51<=0,'GESTION B'!B51,\" \")","v":"KINGSLAND"},{"$f":"IF('GESTION B'!F51>=0,'GESTION B'!C51,\" \")","v":9024},{"$f":"IF('GESTION B'!F51>=0,'GESTION B'!D51,\" \")","v":"EBAUCHE"}]
[{"$f":"IF('GESTION B'!F52<=0,'GESTION B'!A52,\" \")","v":" "},{"$f":"IF('GESTION B'!F52<=0,'GESTION B'!B52,\" \")","v":" "},{"$f":"IF('GESTION B'!F52>=0,'GESTION B'!C52,\" \")","v":9024},{"$f":"IF('GESTION B'!F52>=0,'GESTION B'!D52,\" \")","v":"EBAUCHE"}]
[{"$f":"IF('GESTION B'!F53<=0,'GESTION B'!A53,\" \")","v":" "},{"$f":"IF('GESTION B'!F53<=0,'GESTION B'!B53,\" \")","v":" "},{"$f":"IF('GESTION B'!F53>=0,'GESTION B'!C53,\" \")","v":9025},{"$f":"IF('GESTION B'!F53>=0,'GESTION B'!D53,\" \")","v":"EBAUCHE"}]
[{"$f":"IF('GESTION B'!F54<=0,'GESTION B'!A54,\" \")","v":" "},{"$f":"IF('GESTION B'!F54<=0,'GESTION B'!B54,\" \")","v":" "},{"$f":"IF('GESTION B'!F54>=0,'GESTION B'!C54,\" \")","v":9025},{"$f":"IF('GESTION B'!F54>=0,'GESTION B'!D54,\" \")","v":"EBAUCHE"}]
[{"$f":"IF('GESTION B'!F55<=0,'GESTION B'!A55,\" \")","v":" "},{"$f":"IF('GESTION B'!F55<=0,'GESTION B'!B55,\" \")","v":" "},{"$f":"IF('GESTION B'!F55>=0,'GESTION B'!C55,\" \")","v":9025},{"$f":"IF('GESTION B'!F55>=0,'GESTION B'!D55,\" \")","v":"EBAUCHE FRAISEE PERCEE"}]
[{"$f":"IF('GESTION B'!F56<=0,'GESTION B'!A56,\" \")","v":" "},{"$f":"IF('GESTION B'!F56<=0,'GESTION B'!B56,\" \")","v":" "},{"$f":"IF('GESTION B'!F56>=0,'GESTION B'!C56,\" \")","v":9023},{"$f":"IF('GESTION B'!F56>=0,'GESTION B'!D56,\" \")","v":"EBAUCHE PERCEE Ø48 2 PLATS 0° et 90°"}]
[{"$f":"IF('GESTION B'!F57<=0,'GESTION B'!A57,\" \")","v":"B0219"},{"$f":"IF('GESTION B'!F57<=0,'GESTION B'!B57,\" \")","v":0},{"$f":"IF('GESTION B'!F57>=0,'GESTION B'!C57,\" \")","v":0},{"$f":"IF('GESTION B'!F57>=0,'GESTION B'!D57,\" \")","v":0}]
[{"$f":"IF('GESTION B'!F58<=0,'GESTION B'!A58,\" \")","v":"B0220"},{"$f":"IF('GESTION B'!F58<=0,'GESTION B'!B58,\" \")","v":0},{"$f":"IF('GESTION B'!F58>=0,'GESTION B'!C58,\" \")","v":0},{"$f":"IF('GESTION B'!F58>=0,'GESTION B'!D58,\" \")","v":0}]
[{"$f":"IF('GESTION B'!F59<=0,'GESTION B'!A59,\" \")","v":"B0221"},{"$f":"IF('GESTION B'!F59<=0,'GESTION B'!B59,\" \")","v":0},{"$f":"IF('GESTION B'!F59>=0,'GESTION B'!C59,\" \")","v":0},{"$f":"IF('GESTION B'!F59>=0,'GESTION B'!D59,\" \")","v":0}]
[{"$f":"IF('GESTION B'!F60<=0,'GESTION B'!A60,\" \")","v":"B0222"},{"$f":"IF('GESTION B'!F60<=0,'GESTION B'!B60,\" \")","v":0},{"$f":"IF('GESTION B'!F60>=0,'GESTION B'!C60,\" \")","v":0},{"$f":"IF('GESTION B'!F60>=0,'GESTION B'!D60,\" \")","v":0}]
[{"$f":"IF('GESTION B'!F61<=0,'GESTION B'!A61,\" \")","v":"B0223"},{"$f":"IF('GESTION B'!F61<=0,'GESTION B'!B61,\" \")","v":0},{"$f":"IF('GESTION B'!F61>=0,'GESTION B'!C61,\" \")","v":0},{"$f":"IF('GESTION B'!F61>=0,'GESTION B'!D61,\" \")","v":0}]
[{"$f":"IF('GESTION B'!F62<=0,'GESTION B'!A62,\" \")","v":"B0224"},{"$f":"IF('GESTION B'!F62<=0,'GESTION B'!B62,\" \")","v":0},{"$f":"IF('GESTION B'!F62>=0,'GESTION B'!C62,\" \")","v":0},{"$f":"IF('GESTION B'!F62>=0,'GESTION B'!D62,\" \")","v":0}]
[{"$f":"IF('GESTION B'!F63<=0,'GESTION B'!A63,\" \")","v":"B0225"},{"$f":"IF('GESTION B'!F63<=0,'GESTION B'!B63,\" \")","v":0},{"$f":"IF('GESTION B'!F63>=0,'GESTION B'!C63,\" \")","v":0},{"$f":"IF('GESTION B'!F63>=0,'GESTION B'!D63,\" \")","v":0}]
[{"$f":"IF('GESTION B'!F64<=0,'GESTION B'!A64,\" \")","v":" "},{"$f":"IF('GESTION B'!F64<=0,'GESTION B'!B64,\" \")","v":" "},{"$f":"IF('GESTION B'!F64>=0,'GESTION B'!C64,\" \")","v":"GR2"},{"$f":"IF('GESTION B'!F64>=0,'GESTION B'!D64,\" \")","v":"EBAUCHE FRAISEE"}]
[{"$f":"IF('GESTION B'!F65<=0,'GESTION B'!A65,\" \")","v":"B0302"},{"$f":"IF('GESTION B'!F65<=0,'GESTION B'!B65,\" \")","v":"MUBEA"},{"$f":"IF('GESTION B'!F65>=0,'GESTION B'!C65,\" \")","v":"GR2"},{"$f":"IF('GESTION B'!F65>=0,'GESTION B'!D65,\" \")","v":"EBAUCHE FRAISEE"}]
[{"$f":"IF('GESTION B'!F66<=0,'GESTION B'!A66,\" \")","v":"B0303"},{"$f":"IF('GESTION B'!F66<=0,'GESTION B'!B66,\" \")","v":"MUBEA"},{"$f":"IF('GESTION B'!F66>=0,'GESTION B'!C66,\" \")","v":"GR2"},{"$f":"IF('GESTION B'!F66>=0,'GESTION B'!D66,\" \")","v":"EBAUCHE FRAISEE"}]
[{"$f":"IF('GESTION B'!F67<=0,'GESTION B'!A67,\" \")","v":"B0304-A"},{"$f":"IF('GESTION B'!F67<=0,'GESTION B'!B67,\" \")","v":"MUBEA"},{"$f":"IF('GESTION B'!F67>=0,'GESTION B'!C67,\" \")","v":"GR2"},{"$f":"IF('GESTION B'!F67>=0,'GESTION B'!D67,\" \")","v":"EBAUCHE FRAISEE 0 ET 45°"}]
[{"$f":"IF('GESTION B'!F68<=0,'GESTION B'!A68,\" \")","v":"B0304-B"},{"$f":"IF('GESTION B'!F68<=0,'GESTION B'!B68,\" \")","v":"MUBEA"},{"$f":"IF('GESTION B'!F68>=0,'GESTION B'!C68,\" \")","v":"GR2"},{"$f":"IF('GESTION B'!F68>=0,'GESTION B'!D68,\" \")","v":0}]
[{"$f":"IF('GESTION B'!F69<=0,'GESTION B'!A69,\" \")","v":" "},{"$f":"IF('GESTION B'!F69<=0,'GESTION B'!B69,\" \")","v":" "},{"$f":"IF('GESTION B'!F69>=0,'GESTION B'!C69,\" \")","v":"GR2"},{"$f":"IF('GESTION B'!F69>=0,'GESTION B'!D69,\" \")","v":"EBAUCHE FRAISEE L85"}]
[{"$f":"IF('GESTION B'!F70<=0,'GESTION B'!A70,\" \")","v":" "},{"$f":"IF('GESTION B'!F70<=0,'GESTION B'!B70,\" \")","v":" "},{"$f":"IF('GESTION B'!F70>=0,'GESTION B'!C70,\" \")","v":"GR2"},{"$f":"IF('GESTION B'!F70>=0,'GESTION B'!D70,\" \")","v":"EBAUCHE FRAISEE L95"}]
[{"$f":"IF('GESTION B'!F71<=0,'GESTION B'!A71,\" \")","v":" "},{"$f":"IF('GESTION B'!F71<=0,'GESTION B'!B71,\" \")","v":" "},{"$f":"IF('GESTION B'!F71>=0,'GESTION B'!C71,\" \")","v":"GR2"},{"$f":"IF('GESTION B'!F71>=0,'GESTION B'!D71,\" \")","v":"EBAUCHE FRAISEE L90"}]
[{"$f":"IF('GESTION B'!F73<=0,'GESTION B'!A73,\" \")","v":"B0306"},{"$f":"IF('GESTION B'!F73<=0,'GESTION B'!B73,\" \")","v":"MUBEA"},{"$f":"IF('GESTION B'!F73>=0,'GESTION B'!C73,\" \")","v":"GR2"},{"$f":"IF('GESTION B'!F73>=0,'GESTION B'!D73,\" \")","v":"CANON EUROPEEN"}]
[{"$f":"IF('GESTION B'!F74<=0,'GESTION B'!A74,\" \")","v":" "},{"$f":"IF('GESTION B'!F74<=0,'GESTION B'!B74,\" \")","v":" "},{"$f":"IF('GESTION B'!F74>=0,'GESTION B'!C74,\" \")","v":"GR2"},{"$f":"IF('GESTION B'!F74>=0,'GESTION B'!D74,\" \")","v":"EBAUCHE FRAISEE EXCENTREE"}]
[{"$f":"IF('GESTION B'!F75<=0,'GESTION B'!A75,\" \")","v":" "},{"$f":"IF('GESTION B'!F75<=0,'GESTION B'!B75,\" \")","v":" "},{"$f":"IF('GESTION B'!F75>=0,'GESTION B'!C75,\" \")","v":"GR2"},{"$f":"IF('GESTION B'!F75>=0,'GESTION B'!D75,\" \")","v":"EBAUCHE FRAISEE SUPERIEUR Ø55"}]
[{"$f":"IF('GESTION B'!F76<=0,'GESTION B'!A76,\" \")","v":" "},{"$f":"IF('GESTION B'!F76<=0,'GESTION B'!B76,\" \")","v":" "},{"$f":"IF('GESTION B'!F76>=0,'GESTION B'!C76,\" \")","v":"GR2"},{"$f":"IF('GESTION B'!F76>=0,'GESTION B'!D76,\" \")","v":"EBAUCHE FRAISEE SUPERIEUR Ø60"}]
[{"$f":"IF('GESTION B'!F78<=0,'GESTION B'!A78,\" \")","v":" "},{"$f":"IF('GESTION B'!F78<=0,'GESTION B'!B78,\" \")","v":" "},{"$f":"IF('GESTION B'!F78>=0,'GESTION B'!C78,\" \")","v":"GR2"},{"$f":"IF('GESTION B'!F78>=0,'GESTION B'!D78,\" \")","v":"EBAUCHE PERCEE D6"}]
[{"$f":"IF('GESTION B'!F79<=0,'GESTION B'!A79,\" \")","v":" "},{"$f":"IF('GESTION B'!F79<=0,'GESTION B'!B79,\" \")","v":" "},{"$f":"IF('GESTION B'!F79>=0,'GESTION B'!C79,\" \")","v":"GR3"},{"$f":"IF('GESTION B'!F79>=0,'GESTION B'!D79,\" \")","v":"EBAUCHE FRAISEE"}]
[{"$f":"IF('GESTION B'!F80<=0,'GESTION B'!A80,\" \")","v":" "},{"$f":"IF('GESTION B'!F80<=0,'GESTION B'!B80,\" \")","v":" "},{"$f":"IF('GESTION B'!F80>=0,'GESTION B'!C80,\" \")","v":"GR3"},{"$f":"IF('GESTION B'!F80>=0,'GESTION B'!D80,\" \")","v":"EBAUCHE FRAISEE"}]
[{"$f":"IF('GESTION B'!F81<=0,'GESTION B'!A81,\" \")","v":"B0312"},{"$f":"IF('GESTION B'!F81<=0,'GESTION B'!B81,\" \")","v":"MUBEA"},{"$f":"IF('GESTION B'!F81>=0,'GESTION B'!C81,\" \")","v":"GR3"},{"$f":"IF('GESTION B'!F81>=0,'GESTION B'!D81,\" \")","v":"EBAUCHE FRAISEE"}]
[{"$f":"IF('GESTION B'!F82<=0,'GESTION B'!A82,\" \")","v":" "},{"$f":"IF('GESTION B'!F82<=0,'GESTION B'!B82,\" \")","v":" "},{"$f":"IF('GESTION B'!F82>=0,'GESTION B'!C82,\" \")","v":"GR3"},{"$f":"IF('GESTION B'!F82>=0,'GESTION B'!D82,\" \")","v":"EBAUCHE FRAISEE 0 ET 45°"}]
[{"$f":"IF('GESTION B'!F83<=0,'GESTION B'!A83,\" \")","v":"B0314"},{"$f":"IF('GESTION B'!F83<=0,'GESTION B'!B83,\" \")","v":"MUBEA"},{"$f":"IF('GESTION B'!F83>=0,'GESTION B'!C83,\" \")","v":"GR3"},{"$f":"IF('GESTION B'!F83>=0,'GESTION B'!D83,\" \")","v":"EBAUCHE FRAISEE L……."}]
[{"$f":"IF('GESTION B'!F84<=0,'GESTION B'!A84,\" \")","v":" "},{"$f":"IF('GESTION B'!F84<=0,'GESTION B'!B84,\" \")","v":" "},{"$f":"IF('GESTION B'!F84>=0,'GESTION B'!C84,\" \")","v":"GR3"},{"$f":"IF('GESTION B'!F84>=0,'GESTION B'!D84,\" \")","v":"EBAUCHE FRAISEE EXCENTREE"}]
[{"$f":"IF('GESTION B'!F85<=0,'GESTION B'!A85,\" \")","v":" "},{"$f":"IF('GESTION B'!F85<=0,'GESTION B'!B85,\" \")","v":" "},{"$f":"IF('GESTION B'!F85>=0,'GESTION B'!C85,\" \")","v":"GR4"},{"$f":"IF('GESTION B'!F85>=0,'GESTION B'!D85,\" \")","v":"EBAUCHE FRAISEE"}]
[{"$f":"IF('GESTION B'!F86<=0,'GESTION B'!A86,\" \")","v":"B0317"},{"$f":"IF('GESTION B'!F86<=0,'GESTION B'!B86,\" \")","v":"MUBEA"},{"$f":"IF('GESTION B'!F86>=0,'GESTION B'!C86,\" \")","v":"GR4"},{"$f":"IF('GESTION B'!F86>=0,'GESTION B'!D86,\" \")","v":"EBAUCHE FRAISEE"}]
[{"$f":"IF('GESTION B'!F87<=0,'GESTION B'!A87,\" \")","v":"B0318"},{"$f":"IF('GESTION B'!F87<=0,'GESTION B'!B87,\" \")","v":"MUBEA"},{"$f":"IF('GESTION B'!F87>=0,'GESTION B'!C87,\" \")","v":"GR4"},{"$f":"IF('GESTION B'!F87>=0,'GESTION B'!D87,\" \")","v":"EBAUCHE FRAISEE"}]
[{"$f":"IF('GESTION B'!F88<=0,'GESTION B'!A88,\" \")","v":"B0319"},{"$f":"IF('GESTION B'!F88<=0,'GESTION B'!B88,\" \")","v":"MUBEA"},{"$f":"IF('GESTION B'!F88>=0,'GESTION B'!C88,\" \")","v":"GR4"},{"$f":"IF('GESTION B'!F88>=0,'GESTION B'!D88,\" \")","v":"EBAUCHE FRAISEE 0 ET 45°"}]
[{"$f":"IF('GESTION B'!F89<=0,'GESTION B'!A89,\" \")","v":" "},{"$f":"IF('GESTION B'!F89<=0,'GESTION B'!B89,\" \")","v":" "},{"$f":"IF('GESTION B'!F89>=0,'GESTION B'!C89,\" \")","v":"GR4"},{"$f":"IF('GESTION B'!F89>=0,'GESTION B'!D89,\" \")","v":"EBAUCHE FRAISEE EXCENTREE"}]
[{"$f":"IF('GESTION B'!F90<=0,'GESTION B'!A90,\" \")","v":" "},{"$f":"IF('GESTION B'!F90<=0,'GESTION B'!B90,\" \")","v":" "},{"$f":"IF('GESTION B'!F90>=0,'GESTION B'!C90,\" \")","v":"GR4"},{"$f":"IF('GESTION B'!F90>=0,'GESTION B'!D90,\" \")","v":"EBAUCHE FRAISEE L90"}]
[{"$f":"IF('GESTION B'!F91<=0,'GESTION B'!A91,\" \")","v":" "},{"$f":"IF('GESTION B'!F91<=0,'GESTION B'!B91,\" \")","v":" "},{"$f":"IF('GESTION B'!F91>=0,'GESTION B'!C91,\" \")","v":"GR4"},{"$f":"IF('GESTION B'!F91>=0,'GESTION B'!D91,\" \")","v":"EBAUCHE FRAISEE L100"}]
[{"$f":"IF('GESTION B'!F92<=0,'GESTION B'!A92,\" \")","v":" "},{"$f":"IF('GESTION B'!F92<=0,'GESTION B'!B92,\" \")","v":" "},{"$f":"IF('GESTION B'!F92>=0,'GESTION B'!C92,\" \")","v":"GR4"},{"$f":"IF('GESTION B'!F92>=0,'GESTION B'!D92,\" \")","v":"EBAUCHE FRAISEE L110"}]
[{"$f":"IF('GESTION B'!F93<=0,'GESTION B'!A93,\" \")","v":" "},{"$f":"IF('GESTION B'!F93<=0,'GESTION B'!B93,\" \")","v":" "},{"$f":"IF('GESTION B'!F93>=0,'GESTION B'!C93,\" \")","v":"GR4"},{"$f":"IF('GESTION B'!F93>=0,'GESTION B'!D93,\" \")","v":"EBAUCHE FRAISEE L130"}]
[{"$f":"IF('GESTION B'!F94<=0,'GESTION B'!A94,\" \")","v":"B0322"},{"$f":"IF('GESTION B'!F94<=0,'GESTION B'!B94,\" \")","v":0},{"$f":"IF('GESTION B'!F94>=0,'GESTION B'!C94,\" \")","v":0},{"$f":"IF('GESTION B'!F94>=0,'GESTION B'!D94,\" \")","v":0}]
[{"$f":"IF('GESTION B'!F95<=0,'GESTION B'!A95,\" \")","v":"B0323"},{"$f":"IF('GESTION B'!F95<=0,'GESTION B'!B95,\" \")","v":0},{"$f":"IF('GESTION B'!F95>=0,'GESTION B'!C95,\" \")","v":0},{"$f":"IF('GESTION B'!F95>=0,'GESTION B'!D95,\" \")","v":0}]
[{"$f":"IF('GESTION B'!F96<=0,'GESTION B'!A96,\" \")","v":"B0324"},{"$f":"IF('GESTION B'!F96<=0,'GESTION B'!B96,\" \")","v":0},{"$f":"IF('GESTION B'!F96>=0,'GESTION B'!C96,\" \")","v":0},{"$f":"IF('GESTION B'!F96>=0,'GESTION B'!D96,\" \")","v":0}]
[{"$f":"IF('GESTION B'!F97<=0,'GESTION B'!A97,\" \")","v":"B0325"},{"$f":"IF('GESTION B'!F97<=0,'GESTION B'!B97,\" \")","v":0},{"$f":"IF('GESTION B'!F97>=0,'GESTION B'!C97,\" \")","v":0},{"$f":"IF('GESTION B'!F97>=0,'GESTION B'!D97,\" \")","v":0}]
[{"$f":"IF('GESTION B'!F98<=0,'GESTION B'!A98,\" \")","v":" "},{"$f":"IF('GESTION B'!F98<=0,'GESTION B'!B98,\" \")","v":" "},{"$f":"IF('GESTION B'!F98>=0,'GESTION B'!C98,\" \")","v":"ED50"},{"$f":"IF('GESTION B'!F98>=0,'GESTION B'!D98,\" \")","v":"CORPS 80 1 ENCOCHE"}]
[{"$f":"IF('GESTION B'!F99<=0,'GESTION B'!A99,\" \")","v":" "},{"$f":"IF('GESTION B'!F99<=0,'GESTION B'!B99,\" \")","v":" "},{"$f":"IF('GESTION B'!F99>=0,'GESTION B'!C99,\" \")","v":"ED50"},{"$f":"IF('GESTION B'!F99>=0,'GESTION B'!D99,\" \")","v":"CORPS 80 2 ENCOCHES"}]
[{"$f":"IF('GESTION B'!F100<=0,'GESTION B'!A100,\" \")","v":" "},{"$f":"IF('GESTION B'!F100<=0,'GESTION B'!B100,\" \")","v":" "},{"$f":"IF('GESTION B'!F100>=0,'GESTION B'!C100,\" \")","v":"ED50"},{"$f":"IF('GESTION B'!F100>=0,'GESTION B'!D100,\" \")","v":"CORPS 101 1 ENCOCHE"}]
[{"$f":"IF('GESTION B'!F101<=0,'GESTION B'!A101,\" \")","v":" "},{"$f":"IF('GESTION B'!F101<=0,'GESTION B'!B101,\" \")","v":" "},{"$f":"IF('GESTION B'!F101>=0,'GESTION B'!C101,\" \")","v":"ED50"},{"$f":"IF('GESTION B'!F101>=0,'GESTION B'!D101,\" \")","v":"CORPS 101 2 ENCOCHES"}]
[{"$f":"IF('GESTION B'!F102<=0,'GESTION B'!A102,\" \")","v":" "},{"$f":"IF('GESTION B'!F102<=0,'GESTION B'!B102,\" \")","v":" "},{"$f":"IF('GESTION B'!F102>=0,'GESTION B'!C102,\" \")","v":"ED50"},{"$f":"IF('GESTION B'!F102>=0,'GESTION B'!D102,\" \")","v":"CORPS 101 2 ENCOCHES"}]
[{"$f":"IF('GESTION B'!F103<=0,'GESTION B'!A103,\" \")","v":" "},{"$f":"IF('GESTION B'!F103<=0,'GESTION B'!B103,\" \")","v":" "},{"$f":"IF('GESTION B'!F103>=0,'GESTION B'!C103,\" \")","v":"M45"},{"$f":"IF('GESTION B'!F103>=0,'GESTION B'!D103,\" \")","v":"EBAUCHE EXCENTREE"}]
[{"$f":"IF('GESTION B'!F105<=0,'GESTION B'!A105,\" \")","v":" "},{"$f":"IF('GESTION B'!F105<=0,'GESTION B'!B105,\" \")","v":" "},{"$f":"IF('GESTION B'!F105>=0,'GESTION B'!C105,\" \")","v":"M30"},{"$f":"IF('GESTION B'!F105>=0,'GESTION B'!D105,\" \")","v":"EBAUCHE PERCEE 2 REPERES 0° ET 90°"}]
[{"$f":"IF('GESTION B'!F106<=0,'GESTION B'!A106,\" \")","v":" "},{"$f":"IF('GESTION B'!F106<=0,'GESTION B'!B106,\" \")","v":" "},{"$f":"IF('GESTION B'!F106>=0,'GESTION B'!C106,\" \")","v":"M30"},{"$f":"IF('GESTION B'!F106>=0,'GESTION B'!D106,\" \")","v":"EBAUCHE PERCEE D3 2 REPERES 0° ET 90°"}]
[{"$f":"IF('GESTION B'!F108<=0,'GESTION B'!A108,\" \")","v":" "},{"$f":"IF('GESTION B'!F108<=0,'GESTION B'!B108,\" \")","v":" "},{"$f":"IF('GESTION B'!F108>=0,'GESTION B'!C108,\" \")","v":"M45"},{"$f":"IF('GESTION B'!F108>=0,'GESTION B'!D108,\" \")","v":"EBAUCHE"}]
[{"$f":"IF('GESTION B'!F110<=0,'GESTION B'!A110,\" \")","v":"B0410"},{"$f":"IF('GESTION B'!F110<=0,'GESTION B'!B110,\" \")","v":"MUBEA"},{"$f":"IF('GESTION B'!F110>=0,'GESTION B'!C110,\" \")","v":"M45"},{"$f":"IF('GESTION B'!F110>=0,'GESTION B'!D110,\" \")","v":"EBAUCHE PERCEE 2 REPERES 0° ET 90°"}]
[{"$f":"IF('GESTION B'!F111<=0,'GESTION B'!A111,\" \")","v":" "},{"$f":"IF('GESTION B'!F111<=0,'GESTION B'!B111,\" \")","v":" "},{"$f":"IF('GESTION B'!F111>=0,'GESTION B'!C111,\" \")","v":"M45"},{"$f":"IF('GESTION B'!F111>=0,'GESTION B'!D111,\" \")","v":"EBAUCHE PERCEE 2 REPERES 0° ET 90°"}]
[{"$f":"IF('GESTION B'!F112<=0,'GESTION B'!A112,\" \")","v":"B0412-A"},{"$f":"IF('GESTION B'!F112<=0,'GESTION B'!B112,\" \")","v":"MUBEA"},{"$f":"IF('GESTION B'!F112>=0,'GESTION B'!C112,\" \")","v":"M45"},{"$f":"IF('GESTION B'!F112>=0,'GESTION B'!D112,\" \")","v":"EBAUCHE PERCEE 4 REPERES"}]
[{"$f":"IF('GESTION B'!F114<=0,'GESTION B'!A114,\" \")","v":" "},{"$f":"IF('GESTION B'!F114<=0,'GESTION B'!B114,\" \")","v":" "},{"$f":"IF('GESTION B'!F114>=0,'GESTION B'!C114,\" \")","v":"M45"},{"$f":"IF('GESTION B'!F114>=0,'GESTION B'!D114,\" \")","v":"EBAUCHE 3 REPERES 0° 45° 90° "}]
[{"$f":"IF('GESTION B'!F115<=0,'GESTION B'!A115,\" \")","v":" "},{"$f":"IF('GESTION B'!F115<=0,'GESTION B'!B115,\" \")","v":" "},{"$f":"IF('GESTION B'!F115>=0,'GESTION B'!C115,\" \")","v":"M45"},{"$f":"IF('GESTION B'!F115>=0,'GESTION B'!D115,\" \")","v":"EBAUCHE PERCEE D3 3 REPERES 0° 45° 90°"}]
[{"$f":"IF('GESTION B'!F116<=0,'GESTION B'!A116,\" \")","v":" "},{"$f":"IF('GESTION B'!F116<=0,'GESTION B'!B116,\" \")","v":" "},{"$f":"IF('GESTION B'!F116>=0,'GESTION B'!C116,\" \")","v":"M45"},{"$f":"IF('GESTION B'!F116>=0,'GESTION B'!D116,\" \")","v":"EBAUCHE PERCEE D3 2 REPERES 0° ET 90°"}]
[{"$f":"IF('GESTION B'!F117<=0,'GESTION B'!A117,\" \")","v":" "},{"$f":"IF('GESTION B'!F117<=0,'GESTION B'!B117,\" \")","v":" "},{"$f":"IF('GESTION B'!F117>=0,'GESTION B'!C117,\" \")","v":"M45"},{"$f":"IF('GESTION B'!F117>=0,'GESTION B'!D117,\" \")","v":"EBAUCHE 1/4 ROND"}]
[{"$f":"IF('GESTION B'!F119<=0,'GESTION B'!A119,\" \")","v":" "},{"$f":"IF('GESTION B'!F119<=0,'GESTION B'!B119,\" \")","v":" "},{"$f":"IF('GESTION B'!F119>=0,'GESTION B'!C119,\" \")","v":"M45"},{"$f":"IF('GESTION B'!F119>=0,'GESTION B'!D119,\" \")","v":"EBAUCHE IPN "}]
[{"$f":"IF('GESTION B'!#REF!<=0,'GESTION B'!#REF!,\" \")","v":{"$error":"#REF!"}},{"$f":"IF('GESTION B'!#REF!<=0,'GESTION B'!#REF!,\" \")","v":{"$error":"#REF!"}},{"$f":"IF('GESTION B'!#REF!>=0,'GESTION B'!#REF!,\" \")","v":{"$error":"#REF!"}},{"$f":"IF('GESTION B'!#REF!>=0,'GESTION B'!#REF!,\" \")","v":{"$error":"#REF!"}}]
[{"$f":"IF('GESTION B'!F120<=0,'GESTION B'!A120,\" \")","v":" "},{"$f":"IF('GESTION B'!F120<=0,'GESTION B'!B120,\" \")","v":" "},{"$f":"IF('GESTION B'!F120>=0,'GESTION B'!C120,\" \")","v":"M45"},{"$f":"IF('GESTION B'!F120>=0,'GESTION B'!D120,\" \")","v":"EBAUCHE UPN FRAISEE"}]
[{"$f":"IF('GESTION B'!F121<=0,'GESTION B'!A121,\" \")","v":" "},{"$f":"IF('GESTION B'!F121<=0,'GESTION B'!B121,\" \")","v":" "},{"$f":"IF('GESTION B'!F121>=0,'GESTION B'!C121,\" \")","v":"M45"},{"$f":"IF('GESTION B'!F121>=0,'GESTION B'!D121,\" \")","v":"EBAUCHE IPN FRAISEE"}]
[{"$f":"IF('GESTION B'!F122<=0,'GESTION B'!A122,\" \")","v":"B0418"},{"$f":"IF('GESTION B'!F122<=0,'GESTION B'!B122,\" \")","v":"MUBEA"},{"$f":"IF('GESTION B'!F122>=0,'GESTION B'!C122,\" \")","v":"M60"},{"$f":"IF('GESTION B'!F122>=0,'GESTION B'!D122,\" \")","v":"EBAUCHE"}]
[{"$f":"IF('GESTION B'!F123<=0,'GESTION B'!A123,\" \")","v":"B0419"},{"$f":"IF('GESTION B'!F123<=0,'GESTION B'!B123,\" \")","v":"MUBEA"},{"$f":"IF('GESTION B'!F123>=0,'GESTION B'!C123,\" \")","v":"M60"},{"$f":"IF('GESTION B'!F123>=0,'GESTION B'!D123,\" \")","v":"EBAUCHE"}]
[{"$f":"IF('GESTION B'!F124<=0,'GESTION B'!A124,\" \")","v":" "},{"$f":"IF('GESTION B'!F124<=0,'GESTION B'!B124,\" \")","v":" "},{"$f":"IF('GESTION B'!F124>=0,'GESTION B'!C124,\" \")","v":"M60"},{"$f":"IF('GESTION B'!F124>=0,'GESTION B'!D124,\" \")","v":"EBAUCHE PERCEE 2 REPERES 0° ET 90°"}]
[{"$f":"IF('GESTION B'!F125<=0,'GESTION B'!A125,\" \")","v":"B0421"},{"$f":"IF('GESTION B'!F125<=0,'GESTION B'!B125,\" \")","v":"MUBEA"},{"$f":"IF('GESTION B'!F125>=0,'GESTION B'!C125,\" \")","v":"M60"},{"$f":"IF('GESTION B'!F125>=0,'GESTION B'!D125,\" \")","v":"EBAUCHE PERCEE 2 REPERES 0° ET 90°"}]
[{"$f":"IF('GESTION B'!F126<=0,'GESTION B'!A126,\" \")","v":" "},{"$f":"IF('GESTION B'!F126<=0,'GESTION B'!B126,\" \")","v":" "},{"$f":"IF('GESTION B'!F126>=0,'GESTION B'!C126,\" \")","v":"M60"},{"$f":"IF('GESTION B'!F126>=0,'GESTION B'!D126,\" \")","v":"EBAUCHE PERCEE 2 REPERES 0° ET 90°"}]
[{"$f":"IF('GESTION B'!F127<=0,'GESTION B'!A127,\" \")","v":" "},{"$f":"IF('GESTION B'!F127<=0,'GESTION B'!B127,\" \")","v":" "},{"$f":"IF('GESTION B'!F127>=0,'GESTION B'!C127,\" \")","v":"M60"},{"$f":"IF('GESTION B'!F127>=0,'GESTION B'!D127,\" \")","v":"EBAUCHE 3 REPERES 0° 45° 90° "}]
[{"$f":"IF('GESTION B'!F128<=0,'GESTION B'!A128,\" \")","v":" "},{"$f":"IF('GESTION B'!F128<=0,'GESTION B'!B128,\" \")","v":" "},{"$f":"IF('GESTION B'!F128>=0,'GESTION B'!C128,\" \")","v":"M60"},{"$f":"IF('GESTION B'!F128>=0,'GESTION B'!D128,\" \")","v":"EBAUCHE EXCENTREE"}]
[{"$f":"IF('GESTION B'!F130<=0,'GESTION B'!A130,\" \")","v":" "},{"$f":"IF('GESTION B'!F130<=0,'GESTION B'!B130,\" \")","v":" "},{"$f":"IF('GESTION B'!F130>=0,'GESTION B'!C130,\" \")","v":"M60"},{"$f":"IF('GESTION B'!F130>=0,'GESTION B'!D130,\" \")","v":"EBAUCHE 1/4 ROND"}]
[{"$f":"IF('GESTION B'!F132<=0,'GESTION B'!A132,\" \")","v":" "},{"$f":"IF('GESTION B'!F132<=0,'GESTION B'!B132,\" \")","v":" "},{"$f":"IF('GESTION B'!F132>=0,'GESTION B'!C132,\" \")","v":"M60"},{"$f":"IF('GESTION B'!F132>=0,'GESTION B'!D132,\" \")","v":"EBAUCHE  PERCEE D3"}]
[{"$f":"IF('GESTION B'!F134<=0,'GESTION B'!A134,\" \")","v":"B0502-B"},{"$f":"IF('GESTION B'!F134<=0,'GESTION B'!B134,\" \")","v":"MUBEA"},{"$f":"IF('GESTION B'!F134>=0,'GESTION B'!C134,\" \")","v":"P. N°4"},{"$f":"IF('GESTION B'!F134>=0,'GESTION B'!D134,\" \")","v":"EBAUCHE FRAISEE Ø26,2 L85"}]
[{"$f":"IF('GESTION B'!F135<=0,'GESTION B'!A135,\" \")","v":" "},{"$f":"IF('GESTION B'!F135<=0,'GESTION B'!B135,\" \")","v":" "},{"$f":"IF('GESTION B'!F135>=0,'GESTION B'!C135,\" \")","v":"M80"},{"$f":"IF('GESTION B'!F135>=0,'GESTION B'!D135,\" \")","v":"EBAUCHE PERCEE 2 REPERES 0° ET 90°"}]
[{"$f":"IF('GESTION B'!F136<=0,'GESTION B'!A136,\" \")","v":"B0504"},{"$f":"IF('GESTION B'!F136<=0,'GESTION B'!B136,\" \")","v":"MUBEA"},{"$f":"IF('GESTION B'!F136>=0,'GESTION B'!C136,\" \")","v":"M80"},{"$f":"IF('GESTION B'!F136>=0,'GESTION B'!D136,\" \")","v":"EBAUCHE PERCEE 2 REPERES 0° ET 90°"}]
[{"$f":"IF('GESTION B'!F137<=0,'GESTION B'!A137,\" \")","v":" "},{"$f":"IF('GESTION B'!F137<=0,'GESTION B'!B137,\" \")","v":" "},{"$f":"IF('GESTION B'!F137>=0,'GESTION B'!C137,\" \")","v":"M80"},{"$f":"IF('GESTION B'!F137>=0,'GESTION B'!D137,\" \")","v":"EBAUCHE 2 REPERES 0° ET 45°"}]
[{"$f":"IF('GESTION B'!F138<=0,'GESTION B'!A138,\" \")","v":"B0506"},{"$f":"IF('GESTION B'!F138<=0,'GESTION B'!B138,\" \")","v":"MUBEA"},{"$f":"IF('GESTION B'!F138>=0,'GESTION B'!C138,\" \")","v":"M80"},{"$f":"IF('GESTION B'!F138>=0,'GESTION B'!D138,\" \")","v":"EBAUCHE"}]
[{"$f":"IF('GESTION B'!F139<=0,'GESTION B'!A139,\" \")","v":" "},{"$f":"IF('GESTION B'!F139<=0,'GESTION B'!B139,\" \")","v":" "},{"$f":"IF('GESTION B'!F139>=0,'GESTION B'!C139,\" \")","v":"M80"},{"$f":"IF('GESTION B'!F139>=0,'GESTION B'!D139,\" \")","v":"EBAUCHE 3 REPERES 0° 45° 90° "}]
[{"$f":"IF('GESTION B'!F140<=0,'GESTION B'!A140,\" \")","v":" "},{"$f":"IF('GESTION B'!F140<=0,'GESTION B'!B140,\" \")","v":" "},{"$f":"IF('GESTION B'!F140>=0,'GESTION B'!C140,\" \")","v":"M80"},{"$f":"IF('GESTION B'!F140>=0,'GESTION B'!D140,\" \")","v":"EBAUCHE 1/4 ROND"}]
[{"$f":"IF('GESTION B'!F141<=0,'GESTION B'!A141,\" \")","v":" "},{"$f":"IF('GESTION B'!F141<=0,'GESTION B'!B141,\" \")","v":" "},{"$f":"IF('GESTION B'!F141>=0,'GESTION B'!C141,\" \")","v":"M110"},{"$f":"IF('GESTION B'!F141>=0,'GESTION B'!D141,\" \")","v":"EBAUCHE"}]
[{"$f":"IF('GESTION B'!F142<=0,'GESTION B'!A142,\" \")","v":" "},{"$f":"IF('GESTION B'!F142<=0,'GESTION B'!B142,\" \")","v":" "},{"$f":"IF('GESTION B'!F142>=0,'GESTION B'!C142,\" \")","v":"M110"},{"$f":"IF('GESTION B'!F142>=0,'GESTION B'!D142,\" \")","v":"EBAUCHE PERCEE"}]
[{"$f":"IF('GESTION B'!F143<=0,'GESTION B'!A143,\" \")","v":" "},{"$f":"IF('GESTION B'!F143<=0,'GESTION B'!B143,\" \")","v":" "},{"$f":"IF('GESTION B'!F143>=0,'GESTION B'!C143,\" \")","v":"M150"},{"$f":"IF('GESTION B'!F143>=0,'GESTION B'!D143,\" \")","v":"EBAUCHE"}]
[{"$f":"IF('GESTION B'!F144<=0,'GESTION B'!A144,\" \")","v":" "},{"$f":"IF('GESTION B'!F144<=0,'GESTION B'!B144,\" \")","v":" "},{"$f":"IF('GESTION B'!F144>=0,'GESTION B'!C144,\" \")","v":"M150"},{"$f":"IF('GESTION B'!F144>=0,'GESTION B'!D144,\" \")","v":"EBAUCHE"}]
[{"$f":"IF('GESTION B'!F145<=0,'GESTION B'!A145,\" \")","v":"B0513"},{"$f":"IF('GESTION B'!F145<=0,'GESTION B'!B145,\" \")","v":0},{"$f":"IF('GESTION B'!F145>=0,'GESTION B'!C145,\" \")","v":0},{"$f":"IF('GESTION B'!F145>=0,'GESTION B'!D145,\" \")","v":0}]
[{"$f":"IF('GESTION B'!F146<=0,'GESTION B'!A146,\" \")","v":"B0514"},{"$f":"IF('GESTION B'!F146<=0,'GESTION B'!B146,\" \")","v":0},{"$f":"IF('GESTION B'!F146>=0,'GESTION B'!C146,\" \")","v":0},{"$f":"IF('GESTION B'!F146>=0,'GESTION B'!D146,\" \")","v":0}]
[{"$f":"IF('GESTION B'!F147<=0,'GESTION B'!A147,\" \")","v":"B0515"},{"$f":"IF('GESTION B'!F147<=0,'GESTION B'!B147,\" \")","v":0},{"$f":"IF('GESTION B'!F147>=0,'GESTION B'!C147,\" \")","v":0},{"$f":"IF('GESTION B'!F147>=0,'GESTION B'!D147,\" \")","v":0}]
[{"$f":"IF('GESTION B'!F148<=0,'GESTION B'!A148,\" \")","v":"B0516"},{"$f":"IF('GESTION B'!F148<=0,'GESTION B'!B148,\" \")","v":0},{"$f":"IF('GESTION B'!F148>=0,'GESTION B'!C148,\" \")","v":0},{"$f":"IF('GESTION B'!F148>=0,'GESTION B'!D148,\" \")","v":0}]
[{"$f":"IF('GESTION B'!F149<=0,'GESTION B'!A149,\" \")","v":"B0517"},{"$f":"IF('GESTION B'!F149<=0,'GESTION B'!B149,\" \")","v":0},{"$f":"IF('GESTION B'!F149>=0,'GESTION B'!C149,\" \")","v":0},{"$f":"IF('GESTION B'!F149>=0,'GESTION B'!D149,\" \")","v":0}]
[{"$f":"IF('GESTION B'!F150<=0,'GESTION B'!A150,\" \")","v":"B0518"},{"$f":"IF('GESTION B'!F150<=0,'GESTION B'!B150,\" \")","v":0},{"$f":"IF('GESTION B'!F150>=0,'GESTION B'!C150,\" \")","v":0},{"$f":"IF('GESTION B'!F150>=0,'GESTION B'!D150,\" \")","v":0}]
[{"$f":"IF('GESTION B'!F151<=0,'GESTION B'!A151,\" \")","v":"B0519"},{"$f":"IF('GESTION B'!F151<=0,'GESTION B'!B151,\" \")","v":0},{"$f":"IF('GESTION B'!F151>=0,'GESTION B'!C151,\" \")","v":0},{"$f":"IF('GESTION B'!F151>=0,'GESTION B'!D151,\" \")","v":0}]
[{"$f":"IF('GESTION B'!F152<=0,'GESTION B'!A152,\" \")","v":"B0520"},{"$f":"IF('GESTION B'!F152<=0,'GESTION B'!B152,\" \")","v":0},{"$f":"IF('GESTION B'!F152>=0,'GESTION B'!C152,\" \")","v":0},{"$f":"IF('GESTION B'!F152>=0,'GESTION B'!D152,\" \")","v":0}]
[{"$f":"IF('GESTION B'!F153<=0,'GESTION B'!A153,\" \")","v":"B0521"},{"$f":"IF('GESTION B'!F153<=0,'GESTION B'!B153,\" \")","v":0},{"$f":"IF('GESTION B'!F153>=0,'GESTION B'!C153,\" \")","v":0},{"$f":"IF('GESTION B'!F153>=0,'GESTION B'!D153,\" \")","v":0}]
[{"$f":"IF('GESTION B'!F154<=0,'GESTION B'!A154,\" \")","v":"B0522"},{"$f":"IF('GESTION B'!F154<=0,'GESTION B'!B154,\" \")","v":0},{"$f":"IF('GESTION B'!F154>=0,'GESTION B'!C154,\" \")","v":0},{"$f":"IF('GESTION B'!F154>=0,'GESTION B'!D154,\" \")","v":0}]
[{"$f":"IF('GESTION B'!F155<=0,'GESTION B'!A155,\" \")","v":"B0523"},{"$f":"IF('GESTION B'!F155<=0,'GESTION B'!B155,\" \")","v":0},{"$f":"IF('GESTION B'!F155>=0,'GESTION B'!C155,\" \")","v":0},{"$f":"IF('GESTION B'!F155>=0,'GESTION B'!D155,\" \")","v":0}]
[{"$f":"IF('GESTION B'!F156<=0,'GESTION B'!A156,\" \")","v":"B0524"},{"$f":"IF('GESTION B'!F156<=0,'GESTION B'!B156,\" \")","v":0},{"$f":"IF('GESTION B'!F156>=0,'GESTION B'!C156,\" \")","v":0},{"$f":"IF('GESTION B'!F156>=0,'GESTION B'!D156,\" \")","v":0}]
[{"$f":"IF('GESTION B'!F157<=0,'GESTION B'!A157,\" \")","v":"B0525"},{"$f":"IF('GESTION B'!F157<=0,'GESTION B'!B157,\" \")","v":0},{"$f":"IF('GESTION B'!F157>=0,'GESTION B'!C157,\" \")","v":0},{"$f":"IF('GESTION B'!F157>=0,'GESTION B'!D157,\" \")","v":0}]
[{"$f":"IF('GESTION B'!F158<=0,'GESTION B'!A158,\" \")","v":" "},{"$f":"IF('GESTION B'!F158<=0,'GESTION B'!B158,\" \")","v":" "},{"$f":"IF('GESTION B'!F158>=0,'GESTION B'!C158,\" \")","v":"GR3"},{"$f":"IF('GESTION B'!F158>=0,'GESTION B'!D158,\" \")","v":"SOUS TIGE 60"}]
[{"$f":"IF('GESTION B'!F159<=0,'GESTION B'!A159,\" \")","v":" "},{"$f":"IF('GESTION B'!F159<=0,'GESTION B'!B159,\" \")","v":" "},{"$f":"IF('GESTION B'!F159>=0,'GESTION B'!C159,\" \")","v":"GR2"},{"$f":"IF('GESTION B'!F159>=0,'GESTION B'!D159,\" \")","v":"SOUS TIGE 65"}]
[{"$f":"IF('GESTION B'!F160<=0,'GESTION B'!A160,\" \")","v":" "},{"$f":"IF('GESTION B'!F160<=0,'GESTION B'!B160,\" \")","v":" "},{"$f":"IF('GESTION B'!F160>=0,'GESTION B'!C160,\" \")","v":"GR2"},{"$f":"IF('GESTION B'!F160>=0,'GESTION B'!D160,\" \")","v":"SOUS TIGE 100"}]
[{"$f":"IF('GESTION B'!F161<=0,'GESTION B'!A161,\" \")","v":" "},{"$f":"IF('GESTION B'!F161<=0,'GESTION B'!B161,\" \")","v":" "},{"$f":"IF('GESTION B'!F161>=0,'GESTION B'!C161,\" \")","v":"GR4"},{"$f":"IF('GESTION B'!F161>=0,'GESTION B'!D161,\" \")","v":"SOUS TIGE 65"}]
[{"$f":"IF('GESTION B'!F162<=0,'GESTION B'!A162,\" \")","v":" "},{"$f":"IF('GESTION B'!F162<=0,'GESTION B'!B162,\" \")","v":" "},{"$f":"IF('GESTION B'!F162>=0,'GESTION B'!C162,\" \")","v":"C10"},{"$f":"IF('GESTION B'!F162>=0,'GESTION B'!D162,\" \")","v":"EBAUCHE"}]
[{"$f":"IF('GESTION B'!F163<=0,'GESTION B'!A163,\" \")","v":" "},{"$f":"IF('GESTION B'!F163<=0,'GESTION B'!B163,\" \")","v":" "},{"$f":"IF('GESTION B'!F163>=0,'GESTION B'!C163,\" \")","v":"C15"},{"$f":"IF('GESTION B'!F163>=0,'GESTION B'!D163,\" \")","v":"EBAUCHE 1 REPERE"}]
[{"$f":"IF('GESTION B'!F164<=0,'GESTION B'!A164,\" \")","v":" "},{"$f":"IF('GESTION B'!F164<=0,'GESTION B'!B164,\" \")","v":" "},{"$f":"IF('GESTION B'!F164>=0,'GESTION B'!C164,\" \")","v":"C15"},{"$f":"IF('GESTION B'!F164>=0,'GESTION B'!D164,\" \")","v":"EBAUCHE 2 REPERES"}]
[{"$f":"IF('GESTION B'!F165<=0,'GESTION B'!A165,\" \")","v":" "},{"$f":"IF('GESTION B'!F165<=0,'GESTION B'!B165,\" \")","v":" "},{"$f":"IF('GESTION B'!F165>=0,'GESTION B'!C165,\" \")","v":"C15"},{"$f":"IF('GESTION B'!F165>=0,'GESTION B'!D165,\" \")","v":"EBAUCHE SUPERIEUR Ø20 1 REPERE"}]
[{"$f":"IF('GESTION B'!F166<=0,'GESTION B'!A166,\" \")","v":"B0606-B"},{"$f":"IF('GESTION B'!F166<=0,'GESTION B'!B166,\" \")","v":"MUBEA"},{"$f":"IF('GESTION B'!F166>=0,'GESTION B'!C166,\" \")","v":"C15"},{"$f":"IF('GESTION B'!F166>=0,'GESTION B'!D166,\" \")","v":"EBAUCHE SUPERIEUR Ø20 2 REPERES"}]
[{"$f":"IF('GESTION B'!F167<=0,'GESTION B'!A167,\" \")","v":" "},{"$f":"IF('GESTION B'!F167<=0,'GESTION B'!B167,\" \")","v":" "},{"$f":"IF('GESTION B'!F167>=0,'GESTION B'!C167,\" \")","v":"C15"},{"$f":"IF('GESTION B'!F167>=0,'GESTION B'!D167,\" \")","v":"EBAUCHE SUPERIEUR Ø30 1 REPERE"}]
[{"$f":"IF('GESTION B'!F168<=0,'GESTION B'!A168,\" \")","v":" "},{"$f":"IF('GESTION B'!F168<=0,'GESTION B'!B168,\" \")","v":" "},{"$f":"IF('GESTION B'!F168>=0,'GESTION B'!C168,\" \")","v":"C15"},{"$f":"IF('GESTION B'!F168>=0,'GESTION B'!D168,\" \")","v":"EBAUCHE SUPERIEUR Ø30 2 REPERES"}]
[{"$f":"IF('GESTION B'!F169<=0,'GESTION B'!A169,\" \")","v":"B0608"},{"$f":"IF('GESTION B'!F169<=0,'GESTION B'!B169,\" \")","v":"MUBEA"},{"$f":"IF('GESTION B'!F169>=0,'GESTION B'!C169,\" \")","v":"C15"},{"$f":"IF('GESTION B'!F169>=0,'GESTION B'!D169,\" \")","v":"MIXTE"}]
[{"$f":"IF('GESTION B'!F170<=0,'GESTION B'!A170,\" \")","v":" "},{"$f":"IF('GESTION B'!F170<=0,'GESTION B'!B170,\" \")","v":" "},{"$f":"IF('GESTION B'!F170>=0,'GESTION B'!C170,\" \")","v":"C20"},{"$f":"IF('GESTION B'!F170>=0,'GESTION B'!D170,\" \")","v":"EBAUCHE SUPERIEUR Ø20 1 REPERE"}]
[{"$f":"IF('GESTION B'!F171<=0,'GESTION B'!A171,\" \")","v":" "},{"$f":"IF('GESTION B'!F171<=0,'GESTION B'!B171,\" \")","v":" "},{"$f":"IF('GESTION B'!F171>=0,'GESTION B'!C171,\" \")","v":"C20"},{"$f":"IF('GESTION B'!F171>=0,'GESTION B'!D171,\" \")","v":"EBAUCHE SUPERIEUR Ø20 2 REPERES"}]
[{"$f":"IF('GESTION B'!F173<=0,'GESTION B'!A173,\" \")","v":" "},{"$f":"IF('GESTION B'!F173<=0,'GESTION B'!B173,\" \")","v":" "},{"$f":"IF('GESTION B'!F173>=0,'GESTION B'!C173,\" \")","v":"TRI"},{"$f":"IF('GESTION B'!F173>=0,'GESTION B'!D173,\" \")","v":"EBAUCHE FRAISEE"}]
[{"$f":"IF('GESTION B'!F174<=0,'GESTION B'!A174,\" \")","v":" "},{"$f":"IF('GESTION B'!F174<=0,'GESTION B'!B174,\" \")","v":" "},{"$f":"IF('GESTION B'!F174>=0,'GESTION B'!C174,\" \")","v":"RP4"},{"$f":"IF('GESTION B'!F174>=0,'GESTION B'!D174,\" \")","v":"EBAUCHE"}]
[{"$f":"IF('GESTION B'!F175<=0,'GESTION B'!A175,\" \")","v":" "},{"$f":"IF('GESTION B'!F175<=0,'GESTION B'!B175,\" \")","v":" "},{"$f":"IF('GESTION B'!F175>=0,'GESTION B'!C175,\" \")","v":"RP4"},{"$f":"IF('GESTION B'!F175>=0,'GESTION B'!D175,\" \")","v":"EBAUCHE FRAISEE"}]
[{"$f":"IF('GESTION B'!F176<=0,'GESTION B'!A176,\" \")","v":" "},{"$f":"IF('GESTION B'!F176<=0,'GESTION B'!B176,\" \")","v":" "},{"$f":"IF('GESTION B'!F176>=0,'GESTION B'!C176,\" \")","v":"RP5"},{"$f":"IF('GESTION B'!F176>=0,'GESTION B'!D176,\" \")","v":"EBAUCHE"}]
[{"$f":"IF('GESTION B'!F177<=0,'GESTION B'!A177,\" \")","v":"B0612-B"},{"$f":"IF('GESTION B'!F177<=0,'GESTION B'!B177,\" \")","v":"MUBEA/SUNRISE"},{"$f":"IF('GESTION B'!F177>=0,'GESTION B'!C177,\" \")","v":"RP5"},{"$f":"IF('GESTION B'!F177>=0,'GESTION B'!D177,\" \")","v":"EBAUCHE FRAISEE"}]
[{"$f":"IF('GESTION B'!F178<=0,'GESTION B'!A178,\" \")","v":"B0613"},{"$f":"IF('GESTION B'!F178<=0,'GESTION B'!B178,\" \")","v":"MUBEA/SUNRISE"},{"$f":"IF('GESTION B'!F178>=0,'GESTION B'!C178,\" \")","v":"RP6"},{"$f":"IF('GESTION B'!F178>=0,'GESTION B'!D178,\" \")","v":"EBAUCHE"}]
[{"$f":"IF('GESTION B'!F179<=0,'GESTION B'!A179,\" \")","v":" "},{"$f":"IF('GESTION B'!F179<=0,'GESTION B'!B179,\" \")","v":" "},{"$f":"IF('GESTION B'!F179>=0,'GESTION B'!C179,\" \")","v":"RP6"},{"$f":"IF('GESTION B'!F179>=0,'GESTION B'!D179,\" \")","v":"EBAUCHE FRAISEE"}]
[{"$f":"IF('GESTION B'!F180<=0,'GESTION B'!A180,\" \")","v":" "},{"$f":"IF('GESTION B'!F180<=0,'GESTION B'!B180,\" \")","v":" "},{"$f":"IF('GESTION B'!F180>=0,'GESTION B'!C180,\" \")","v":"RP8"},{"$f":"IF('GESTION B'!F180>=0,'GESTION B'!D180,\" \")","v":"EBAUCHE"}]
[{"$f":"IF('GESTION B'!F181<=0,'GESTION B'!A181,\" \")","v":" "},{"$f":"IF('GESTION B'!F181<=0,'GESTION B'!B181,\" \")","v":" "},{"$f":"IF('GESTION B'!F181>=0,'GESTION B'!C181,\" \")","v":"RP8"},{"$f":"IF('GESTION B'!F181>=0,'GESTION B'!D181,\" \")","v":"EBAUCHE FRAISEE"}]
[{"$f":"IF('GESTION B'!F182<=0,'GESTION B'!A182,\" \")","v":" "},{"$f":"IF('GESTION B'!F182<=0,'GESTION B'!B182,\" \")","v":" "},{"$f":"IF('GESTION B'!F182>=0,'GESTION B'!C182,\" \")","v":"GP-P01-075-3"},{"$f":"IF('GESTION B'!F182>=0,'GESTION B'!D182,\" \")","v":"EBAUCHE"}]
[{"$f":"IF('GESTION B'!F183<=0,'GESTION B'!A183,\" \")","v":" "},{"$f":"IF('GESTION B'!F183<=0,'GESTION B'!B183,\" \")","v":" "},{"$f":"IF('GESTION B'!F183>=0,'GESTION B'!C183,\" \")","v":"GP-P01-075-3"},{"$f":"IF('GESTION B'!F183>=0,'GESTION B'!D183,\" \")","v":"EBAUCHE"}]
[{"$f":"IF('GESTION B'!F184<=0,'GESTION B'!A184,\" \")","v":" "},{"$f":"IF('GESTION B'!F184<=0,'GESTION B'!B184,\" \")","v":" "},{"$f":"IF('GESTION B'!F184>=0,'GESTION B'!C184,\" \")","v":"GP-P01-075-3"},{"$f":"IF('GESTION B'!F184>=0,'GESTION B'!D184,\" \")","v":"EBAUCHE FRAISEE"}]
[{"$f":"IF('GESTION B'!F185<=0,'GESTION B'!A185,\" \")","v":" "},{"$f":"IF('GESTION B'!F185<=0,'GESTION B'!B185,\" \")","v":" "},{"$f":"IF('GESTION B'!F185>=0,'GESTION B'!C185,\" \")","v":"GP-P01-075-3"},{"$f":"IF('GESTION B'!F185>=0,'GESTION B'!D185,\" \")","v":"EBAUCHE FRAISEE"}]
[{"$f":"IF('GESTION B'!F186<=0,'GESTION B'!A186,\" \")","v":" "},{"$f":"IF('GESTION B'!F186<=0,'GESTION B'!B186,\" \")","v":" "},{"$f":"IF('GESTION B'!F186>=0,'GESTION B'!C186,\" \")","v":"GP-P01-100-3"},{"$f":"IF('GESTION B'!F186>=0,'GESTION B'!D186,\" \")","v":"EBAUCHE"}]
[{"$f":"IF('GESTION B'!F187<=0,'GESTION B'!A187,\" \")","v":" "},{"$f":"IF('GESTION B'!F187<=0,'GESTION B'!B187,\" \")","v":" "},{"$f":"IF('GESTION B'!F187>=0,'GESTION B'!C187,\" \")","v":"GP-P01-100-3"},{"$f":"IF('GESTION B'!F187>=0,'GESTION B'!D187,\" \")","v":"EBAUCHE"}]
[{"$f":"IF('GESTION B'!F188<=0,'GESTION B'!A188,\" \")","v":" "},{"$f":"IF('GESTION B'!F188<=0,'GESTION B'!B188,\" \")","v":" "},{"$f":"IF('GESTION B'!F188>=0,'GESTION B'!C188,\" \")","v":"GP-P01-100-3"},{"$f":"IF('GESTION B'!F188>=0,'GESTION B'!D188,\" \")","v":"EBAUCHE FRAISEE L90"}]
[{"$f":"IF('GESTION B'!F189<=0,'GESTION B'!A189,\" \")","v":" "},{"$f":"IF('GESTION B'!F189<=0,'GESTION B'!B189,\" \")","v":" "},{"$f":"IF('GESTION B'!F189>=0,'GESTION B'!C189,\" \")","v":"GP-P01-075-3"},{"$f":"IF('GESTION B'!F189>=0,'GESTION B'!D189,\" \")","v":"EBAUCHE AUDINOX"}]
[{"$f":"IF('GESTION B'!F190<=0,'GESTION B'!A190,\" \")","v":"B0625"},{"$f":"IF('GESTION B'!F190<=0,'GESTION B'!B190,\" \")","v":0},{"$f":"IF('GESTION B'!F190>=0,'GESTION B'!C190,\" \")","v":0},{"$f":"IF('GESTION B'!F190>=0,'GESTION B'!D190,\" \")","v":0}]
[{"$f":"IF('GESTION B'!F191<=0,'GESTION B'!A191,\" \")","v":"B0701-A"},{"$f":"IF('GESTION B'!F191<=0,'GESTION B'!B191,\" \")","v":"VERNET"},{"$f":"IF('GESTION B'!F191>=0,'GESTION B'!C191,\" \")","v":"P. N°1"},{"$f":"IF('GESTION B'!F191>=0,'GESTION B'!D191,\" \")","v":"EBAUCHE FRAISEE L4"}]
[{"$f":"IF('GESTION B'!F192<=0,'GESTION B'!A192,\" \")","v":" "},{"$f":"IF('GESTION B'!F192<=0,'GESTION B'!B192,\" \")","v":" "},{"$f":"IF('GESTION B'!F192>=0,'GESTION B'!C192,\" \")","v":"P. N°2"},{"$f":"IF('GESTION B'!F192>=0,'GESTION B'!D192,\" \")","v":"EBAUCHE FRAISEE L4"}]
[{"$f":"IF('GESTION B'!F193<=0,'GESTION B'!A193,\" \")","v":" "},{"$f":"IF('GESTION B'!F193<=0,'GESTION B'!B193,\" \")","v":" "},{"$f":"IF('GESTION B'!F193>=0,'GESTION B'!C193,\" \")","v":"P. N°3"},{"$f":"IF('GESTION B'!F193>=0,'GESTION B'!D193,\" \")","v":"EBAUCHE FRAISEE L4"}]
[{"$f":"IF('GESTION B'!F195<=0,'GESTION B'!A195,\" \")","v":" "},{"$f":"IF('GESTION B'!F195<=0,'GESTION B'!B195,\" \")","v":" "},{"$f":"IF('GESTION B'!F195>=0,'GESTION B'!C195,\" \")","v":"P. N°4"},{"$f":"IF('GESTION B'!F195>=0,'GESTION B'!D195,\" \")","v":"EBAUCHE FRAISEE L4"}]
[{"$f":"IF('GESTION B'!F197<=0,'GESTION B'!A197,\" \")","v":" "},{"$f":"IF('GESTION B'!F197<=0,'GESTION B'!B197,\" \")","v":" "},{"$f":"IF('GESTION B'!F197>=0,'GESTION B'!C197,\" \")","v":"P. N°4"},{"$f":"IF('GESTION B'!F197>=0,'GESTION B'!D197,\" \")","v":"EBAUCHE FRAISEE CROIX L8"}]
[{"$f":"IF('GESTION B'!F198<=0,'GESTION B'!A198,\" \")","v":" "},{"$f":"IF('GESTION B'!F198<=0,'GESTION B'!B198,\" \")","v":" "},{"$f":"IF('GESTION B'!F198>=0,'GESTION B'!C198,\" \")","v":"P. N°4"},{"$f":"IF('GESTION B'!F198>=0,'GESTION B'!D198,\" \")","v":"EBAUCHE FRAISEE ERGOT 8 AVEC MOUCHE Ø33"}]
[{"$f":"IF('GESTION B'!F200<=0,'GESTION B'!A200,\" \")","v":" "},{"$f":"IF('GESTION B'!F200<=0,'GESTION B'!B200,\" \")","v":" "},{"$f":"IF('GESTION B'!F200>=0,'GESTION B'!C200,\" \")","v":"P. N°4"},{"$f":"IF('GESTION B'!F200>=0,'GESTION B'!D200,\" \")","v":"EBAUCHE FRAISEE ERGOT 8 AVEC MOUCHE"}]
[{"$f":"IF('GESTION B'!F201<=0,'GESTION B'!A201,\" \")","v":" "},{"$f":"IF('GESTION B'!F201<=0,'GESTION B'!B201,\" \")","v":" "},{"$f":"IF('GESTION B'!F201>=0,'GESTION B'!C201,\" \")","v":"P. N°1 PG80"},{"$f":"IF('GESTION B'!F201>=0,'GESTION B'!D201,\" \")","v":"EBAUCHE FRAISEE L8"}]
[{"$f":"IF('GESTION B'!F202<=0,'GESTION B'!A202,\" \")","v":" "},{"$f":"IF('GESTION B'!F202<=0,'GESTION B'!B202,\" \")","v":" "},{"$f":"IF('GESTION B'!F202>=0,'GESTION B'!C202,\" \")","v":"P. N°1 PG80"},{"$f":"IF('GESTION B'!F202>=0,'GESTION B'!D202,\" \")","v":"EBAUCHE FRAISEE ERGOT 8 SANS MOUCHE"}]
[{"$f":"IF('GESTION B'!F203<=0,'GESTION B'!A203,\" \")","v":" "},{"$f":"IF('GESTION B'!F203<=0,'GESTION B'!B203,\" \")","v":" "},{"$f":"IF('GESTION B'!F203>=0,'GESTION B'!C203,\" \")","v":"P. N°1 PG80"},{"$f":"IF('GESTION B'!F203>=0,'GESTION B'!D203,\" \")","v":"EBAUCHE FRAISEE CROIX L8"}]
[{"$f":"IF('GESTION B'!F204<=0,'GESTION B'!A204,\" \")","v":" "},{"$f":"IF('GESTION B'!F204<=0,'GESTION B'!B204,\" \")","v":" "},{"$f":"IF('GESTION B'!F204>=0,'GESTION B'!C204,\" \")","v":"P. N°1 PG116/MAP AMB"},{"$f":"IF('GESTION B'!F204>=0,'GESTION B'!D204,\" \")","v":"EBAUCHE FRAISEE ERGOT 8 AVEC MOUCHE"}]
[{"$f":"IF('GESTION B'!F205<=0,'GESTION B'!A205,\" \")","v":" "},{"$f":"IF('GESTION B'!F205<=0,'GESTION B'!B205,\" \")","v":" "},{"$f":"IF('GESTION B'!F205>=0,'GESTION B'!C205,\" \")","v":"P. N°1 PG116/MAP AME"},{"$f":"IF('GESTION B'!F205>=0,'GESTION B'!D205,\" \")","v":"EBAUCHE FRAISEE CROIX L8"}]
[{"$f":"IF('GESTION B'!F206<=0,'GESTION B'!A206,\" \")","v":" "},{"$f":"IF('GESTION B'!F206<=0,'GESTION B'!B206,\" \")","v":" "},{"$f":"IF('GESTION B'!F206>=0,'GESTION B'!C206,\" \")","v":"P. N°1 PG116/MAP AME"},{"$f":"IF('GESTION B'!F206>=0,'GESTION B'!D206,\" \")","v":"EBAUCHE FRAISEE ERGOT 8 SANS MOUCHE"}]
[{"$f":"IF('GESTION B'!F207<=0,'GESTION B'!A207,\" \")","v":" "},{"$f":"IF('GESTION B'!F207<=0,'GESTION B'!B207,\" \")","v":" "},{"$f":"IF('GESTION B'!F207>=0,'GESTION B'!C207,\" \")","v":"P. N°2 PG116/MAP AME"},{"$f":"IF('GESTION B'!F207>=0,'GESTION B'!D207,\" \")","v":"EBAUCHE FRAISEE ERGOT 8 SANS MOUCHE"}]
[{"$f":"IF('GESTION B'!F208<=0,'GESTION B'!A208,\" \")","v":" "},{"$f":"IF('GESTION B'!F208<=0,'GESTION B'!B208,\" \")","v":" "},{"$f":"IF('GESTION B'!F208>=0,'GESTION B'!C208,\" \")","v":"P. N°4"},{"$f":"IF('GESTION B'!F208>=0,'GESTION B'!D208,\" \")","v":"EBAUCHE FRAISEE L8"}]
[{"$f":"IF('GESTION B'!F209<=0,'GESTION B'!A209,\" \")","v":" "},{"$f":"IF('GESTION B'!F209<=0,'GESTION B'!B209,\" \")","v":" "},{"$f":"IF('GESTION B'!F209>=0,'GESTION B'!C209,\" \")","v":"P. N°1 PG116/MAP AME"},{"$f":"IF('GESTION B'!F209>=0,'GESTION B'!D209,\" \")","v":"EBAUCHE FRAISEE L8"}]
[{"$f":"IF('GESTION B'!F210<=0,'GESTION B'!A210,\" \")","v":"B0715"},{"$f":"IF('GESTION B'!F210<=0,'GESTION B'!B210,\" \")","v":0},{"$f":"IF('GESTION B'!F210>=0,'GESTION B'!C210,\" \")","v":0},{"$f":"IF('GESTION B'!F210>=0,'GESTION B'!D210,\" \")","v":0}]
[{"$f":"IF('GESTION B'!F211<=0,'GESTION B'!A211,\" \")","v":"B0716"},{"$f":"IF('GESTION B'!F211<=0,'GESTION B'!B211,\" \")","v":0},{"$f":"IF('GESTION B'!F211>=0,'GESTION B'!C211,\" \")","v":0},{"$f":"IF('GESTION B'!F211>=0,'GESTION B'!D211,\" \")","v":0}]
[{"$f":"IF('GESTION B'!F212<=0,'GESTION B'!A212,\" \")","v":" "},{"$f":"IF('GESTION B'!F212<=0,'GESTION B'!B212,\" \")","v":" "},{"$f":"IF('GESTION B'!F212>=0,'GESTION B'!C212,\" \")","v":"PED 30"},{"$f":"IF('GESTION B'!F212>=0,'GESTION B'!D212,\" \")","v":"EBAUCHE  \u009d\u009dØ75 FRAISE 0° ET 90°"}]
[{"$f":"IF('GESTION B'!F213<=0,'GESTION B'!A213,\" \")","v":" "},{"$f":"IF('GESTION B'!F213<=0,'GESTION B'!B213,\" \")","v":" "},{"$f":"IF('GESTION B'!F213>=0,'GESTION B'!C213,\" \")","v":"PED 30"},{"$f":"IF('GESTION B'!F213>=0,'GESTION B'!D213,\" \")","v":"Ø50 FRAISEE 0° ET 90°"}]
[{"$f":"IF('GESTION B'!F214<=0,'GESTION B'!A214,\" \")","v":" "},{"$f":"IF('GESTION B'!F214<=0,'GESTION B'!B214,\" \")","v":" "},{"$f":"IF('GESTION B'!F214>=0,'GESTION B'!C214,\" \")","v":"PED 30"},{"$f":"IF('GESTION B'!F214>=0,'GESTION B'!D214,\" \")","v":"EBAUCHE  \u009d\u009dØ80 FRAISE 0° ET 90°"}]
[{"$f":"IF('GESTION B'!F215<=0,'GESTION B'!A215,\" \")","v":" "},{"$f":"IF('GESTION B'!F215<=0,'GESTION B'!B215,\" \")","v":" "},{"$f":"IF('GESTION B'!F215>=0,'GESTION B'!C215,\" \")","v":"PED 30"},{"$f":"IF('GESTION B'!F215>=0,'GESTION B'!D215,\" \")","v":"EBAUCHE  \u009d\u009dØ80 FRAISE 0° ET 90°"}]
[{"$f":"IF('GESTION B'!F216<=0,'GESTION B'!A216,\" \")","v":"B0721"},{"$f":"IF('GESTION B'!F216<=0,'GESTION B'!B216,\" \")","v":"VERNET"},{"$f":"IF('GESTION B'!F216>=0,'GESTION B'!C216,\" \")","v":"PED 30"},{"$f":"IF('GESTION B'!F216>=0,'GESTION B'!D216,\" \")","v":"Ø98"}]
[{"$f":"IF('GESTION B'!F217<=0,'GESTION B'!A217,\" \")","v":" "},{"$f":"IF('GESTION B'!F217<=0,'GESTION B'!B217,\" \")","v":" "},{"$f":"IF('GESTION B'!F217>=0,'GESTION B'!C217,\" \")","v":"PED 25"},{"$f":"IF('GESTION B'!F217>=0,'GESTION B'!D217,\" \")","v":"EBAUCHE"}]
[{"$f":"IF('GESTION B'!F218<=0,'GESTION B'!A218,\" \")","v":" "},{"$f":"IF('GESTION B'!F218<=0,'GESTION B'!B218,\" \")","v":" "},{"$f":"IF('GESTION B'!F218>=0,'GESTION B'!C218,\" \")","v":"PG 41 "},{"$f":"IF('GESTION B'!F218>=0,'GESTION B'!D218,\" \")","v":"EBAUCHE"}]
[{"$f":"IF('GESTION B'!F219<=0,'GESTION B'!A219,\" \")","v":"B0723"},{"$f":"IF('GESTION B'!F219<=0,'GESTION B'!B219,\" \")","v":0},{"$f":"IF('GESTION B'!F219>=0,'GESTION B'!C219,\" \")","v":0},{"$f":"IF('GESTION B'!F219>=0,'GESTION B'!D219,\" \")","v":0}]
[{"$f":"IF('GESTION B'!F220<=0,'GESTION B'!A220,\" \")","v":" "},{"$f":"IF('GESTION B'!F220<=0,'GESTION B'!B220,\" \")","v":" "},{"$f":"IF('GESTION B'!F220>=0,'GESTION B'!C220,\" \")","v":"TIRANT PORTE MATRICE"},{"$f":"IF('GESTION B'!F220>=0,'GESTION B'!D220,\" \")","v":"M14"}]
[{"$f":"IF('GESTION B'!F221<=0,'GESTION B'!A221,\" \")","v":" "},{"$f":"IF('GESTION B'!F221<=0,'GESTION B'!B221,\" \")","v":" "},{"$f":"IF('GESTION B'!F221>=0,'GESTION B'!C221,\" \")","v":"DEVETISSEUR "},{"$f":"IF('GESTION B'!F221>=0,'GESTION B'!D221,\" \")","v":"TIRANT DROIT"}]
[{"$f":"IF('GESTION B'!F222<=0,'GESTION B'!A222,\" \")","v":" "},{"$f":"IF('GESTION B'!F222<=0,'GESTION B'!B222,\" \")","v":" "},{"$f":"IF('GESTION B'!F222>=0,'GESTION B'!C222,\" \")","v":"DEVETISSEUR "},{"$f":"IF('GESTION B'!F222>=0,'GESTION B'!D222,\" \")","v":"MOLETTE DROITE"}]
[{"$f":"IF('GESTION B'!F223<=0,'GESTION B'!A223,\" \")","v":" "},{"$f":"IF('GESTION B'!F223<=0,'GESTION B'!B223,\" \")","v":" "},{"$f":"IF('GESTION B'!F223>=0,'GESTION B'!C223,\" \")","v":"DEVETISSEUR "},{"$f":"IF('GESTION B'!F223>=0,'GESTION B'!D223,\" \")","v":"TIRANT GAUCHE"}]
[{"$f":"IF('GESTION B'!F224<=0,'GESTION B'!A224,\" \")","v":" "},{"$f":"IF('GESTION B'!F224<=0,'GESTION B'!B224,\" \")","v":" "},{"$f":"IF('GESTION B'!F224>=0,'GESTION B'!C224,\" \")","v":"DEVETISSEUR "},{"$f":"IF('GESTION B'!F224>=0,'GESTION B'!D224,\" \")","v":"MOLETTE GAUCHE "}]
[{"$f":"IF('GESTION B'!F225<=0,'GESTION B'!A225,\" \")","v":"B0801-A"},{"$f":"IF('GESTION B'!F225<=0,'GESTION B'!B225,\" \")","v":"VERNET"},{"$f":"IF('GESTION B'!F225>=0,'GESTION B'!C225,\" \")","v":"M25"},{"$f":"IF('GESTION B'!F225>=0,'GESTION B'!D225,\" \")","v":"EBAUCHE"}]
[{"$f":"IF('GESTION B'!F226<=0,'GESTION B'!A226,\" \")","v":"B0801-B"},{"$f":"IF('GESTION B'!F226<=0,'GESTION B'!B226,\" \")","v":"VERNET"},{"$f":"IF('GESTION B'!F226>=0,'GESTION B'!C226,\" \")","v":"M25"},{"$f":"IF('GESTION B'!F226>=0,'GESTION B'!D226,\" \")","v":"EBAUCHE PERCEE"}]
[{"$f":"IF('GESTION B'!F227<=0,'GESTION B'!A227,\" \")","v":" "},{"$f":"IF('GESTION B'!F227<=0,'GESTION B'!B227,\" \")","v":" "},{"$f":"IF('GESTION B'!F227>=0,'GESTION B'!C227,\" \")","v":"M25"},{"$f":"IF('GESTION B'!F227>=0,'GESTION B'!D227,\" \")","v":"EBAUCHE FRAISEE PERCEE 0° ET 90°"}]
[{"$f":"IF('GESTION B'!F228<=0,'GESTION B'!A228,\" \")","v":" "},{"$f":"IF('GESTION B'!F228<=0,'GESTION B'!B228,\" \")","v":" "},{"$f":"IF('GESTION B'!F228>=0,'GESTION B'!C228,\" \")","v":"M30"},{"$f":"IF('GESTION B'!F228>=0,'GESTION B'!D228,\" \")","v":"EBAUCHE PERCEE"}]
[{"$f":"IF('GESTION B'!F229<=0,'GESTION B'!A229,\" \")","v":" "},{"$f":"IF('GESTION B'!F229<=0,'GESTION B'!B229,\" \")","v":" "},{"$f":"IF('GESTION B'!F229>=0,'GESTION B'!C229,\" \")","v":"M30"},{"$f":"IF('GESTION B'!F229>=0,'GESTION B'!D229,\" \")","v":"EBAUCHE FRAISEE PERCEE 0° ET 90°"}]
[{"$f":"IF('GESTION B'!F230<=0,'GESTION B'!A230,\" \")","v":" "},{"$f":"IF('GESTION B'!F230<=0,'GESTION B'!B230,\" \")","v":" "},{"$f":"IF('GESTION B'!F230>=0,'GESTION B'!C230,\" \")","v":"M30"},{"$f":"IF('GESTION B'!F230>=0,'GESTION B'!D230,\" \")","v":"EBAUCHE FRAISEE PERCEE 0° ET 90°"}]
[{"$f":"IF('GESTION B'!F231<=0,'GESTION B'!A231,\" \")","v":" "},{"$f":"IF('GESTION B'!F231<=0,'GESTION B'!B231,\" \")","v":" "},{"$f":"IF('GESTION B'!F231>=0,'GESTION B'!C231,\" \")","v":"M30"},{"$f":"IF('GESTION B'!F231>=0,'GESTION B'!D231,\" \")","v":"EBAUCHE FRAISEE PERCEE Ø3"}]
[{"$f":"IF('GESTION B'!F232<=0,'GESTION B'!A232,\" \")","v":" "},{"$f":"IF('GESTION B'!F232<=0,'GESTION B'!B232,\" \")","v":" "},{"$f":"IF('GESTION B'!F232>=0,'GESTION B'!C232,\" \")","v":"M35"},{"$f":"IF('GESTION B'!F232>=0,'GESTION B'!D232,\" \")","v":"EBAUCHE PERCEE \u009dØ19"}]
[{"$f":"IF('GESTION B'!F233<=0,'GESTION B'!A233,\" \")","v":" "},{"$f":"IF('GESTION B'!F233<=0,'GESTION B'!B233,\" \")","v":" "},{"$f":"IF('GESTION B'!F233>=0,'GESTION B'!C233,\" \")","v":"M35"},{"$f":"IF('GESTION B'!F233>=0,'GESTION B'!D233,\" \")","v":"EBAUCHE FRAISEE PERCEE 0° ET 90°"}]
[{"$f":"IF('GESTION B'!F234<=0,'GESTION B'!A234,\" \")","v":"B0807"},{"$f":"IF('GESTION B'!F234<=0,'GESTION B'!B234,\" \")","v":"VERNET"},{"$f":"IF('GESTION B'!F234>=0,'GESTION B'!C234,\" \")","v":"M35"},{"$f":"IF('GESTION B'!F234>=0,'GESTION B'!D234,\" \")","v":"EBAUCHE FRAISEE PERCEE Ø3 0° ET 90°"}]
[{"$f":"IF('GESTION B'!F235<=0,'GESTION B'!A235,\" \")","v":" "},{"$f":"IF('GESTION B'!F235<=0,'GESTION B'!B235,\" \")","v":" "},{"$f":"IF('GESTION B'!F235>=0,'GESTION B'!C235,\" \")","v":"M45"},{"$f":"IF('GESTION B'!F235>=0,'GESTION B'!D235,\" \")","v":"EBAUCHE"}]
[{"$f":"IF('GESTION B'!F236<=0,'GESTION B'!A236,\" \")","v":" "},{"$f":"IF('GESTION B'!F236<=0,'GESTION B'!B236,\" \")","v":" "},{"$f":"IF('GESTION B'!F236>=0,'GESTION B'!C236,\" \")","v":"M45"},{"$f":"IF('GESTION B'!F236>=0,'GESTION B'!D236,\" \")","v":"EBAUCHE FRAISEE PERCEE 0° ET 90°"}]
[{"$f":"IF('GESTION B'!F237<=0,'GESTION B'!A237,\" \")","v":" "},{"$f":"IF('GESTION B'!F237<=0,'GESTION B'!B237,\" \")","v":" "},{"$f":"IF('GESTION B'!F237>=0,'GESTION B'!C237,\" \")","v":"M45"},{"$f":"IF('GESTION B'!F237>=0,'GESTION B'!D237,\" \")","v":"EBAUCHE FRAISEE PERCEE Ø3 0° ET 90°"}]
[{"$f":"IF('GESTION B'!F238<=0,'GESTION B'!A238,\" \")","v":" "},{"$f":"IF('GESTION B'!F238<=0,'GESTION B'!B238,\" \")","v":" "},{"$f":"IF('GESTION B'!F238>=0,'GESTION B'!C238,\" \")","v":"M45"},{"$f":"IF('GESTION B'!F238>=0,'GESTION B'!D238,\" \")","v":"EBAUCHE PERCEE"}]
[{"$f":"IF('GESTION B'!F239<=0,'GESTION B'!A239,\" \")","v":" "},{"$f":"IF('GESTION B'!F239<=0,'GESTION B'!B239,\" \")","v":" "},{"$f":"IF('GESTION B'!F239>=0,'GESTION B'!C239,\" \")","v":"M55"},{"$f":"IF('GESTION B'!F239>=0,'GESTION B'!D239,\" \")","v":"EBAUCHE"}]
[{"$f":"IF('GESTION B'!F240<=0,'GESTION B'!A240,\" \")","v":" "},{"$f":"IF('GESTION B'!F240<=0,'GESTION B'!B240,\" \")","v":" "},{"$f":"IF('GESTION B'!F240>=0,'GESTION B'!C240,\" \")","v":"M55"},{"$f":"IF('GESTION B'!F240>=0,'GESTION B'!D240,\" \")","v":"EBAUCHE FRAISEE PERCEE 0° ET 90°"}]
[{"$f":"IF('GESTION B'!F241<=0,'GESTION B'!A241,\" \")","v":" "},{"$f":"IF('GESTION B'!F241<=0,'GESTION B'!B241,\" \")","v":" "},{"$f":"IF('GESTION B'!F241>=0,'GESTION B'!C241,\" \")","v":"M55"},{"$f":"IF('GESTION B'!F241>=0,'GESTION B'!D241,\" \")","v":"EBAUCHE FRAISEE PERCEE Ø3 0° ET 90°"}]
[{"$f":"IF('GESTION B'!F242<=0,'GESTION B'!A242,\" \")","v":" "},{"$f":"IF('GESTION B'!F242<=0,'GESTION B'!B242,\" \")","v":" "},{"$f":"IF('GESTION B'!F242>=0,'GESTION B'!C242,\" \")","v":"M55"},{"$f":"IF('GESTION B'!F242>=0,'GESTION B'!D242,\" \")","v":"EBAUCHE 1 REPERE"}]
[{"$f":"IF('GESTION B'!F243<=0,'GESTION B'!A243,\" \")","v":" "},{"$f":"IF('GESTION B'!F243<=0,'GESTION B'!B243,\" \")","v":" "},{"$f":"IF('GESTION B'!F243>=0,'GESTION B'!C243,\" \")","v":"M70"},{"$f":"IF('GESTION B'!F243>=0,'GESTION B'!D243,\" \")","v":"EBAUCHE"}]
[{"$f":"IF('GESTION B'!F244<=0,'GESTION B'!A244,\" \")","v":"B0817"},{"$f":"IF('GESTION B'!F244<=0,'GESTION B'!B244,\" \")","v":"VERNET"},{"$f":"IF('GESTION B'!F244>=0,'GESTION B'!C244,\" \")","v":"M70"},{"$f":"IF('GESTION B'!F244>=0,'GESTION B'!D244,\" \")","v":"EBAUCHE FRAISEE PERCEE"}]
[{"$f":"IF('GESTION B'!F245<=0,'GESTION B'!A245,\" \")","v":" "},{"$f":"IF('GESTION B'!F245<=0,'GESTION B'!B245,\" \")","v":" "},{"$f":"IF('GESTION B'!F245>=0,'GESTION B'!C245,\" \")","v":"M90"},{"$f":"IF('GESTION B'!F245>=0,'GESTION B'!D245,\" \")","v":"EBAUCHE"}]
[{"$f":"IF('GESTION B'!F246<=0,'GESTION B'!A246,\" \")","v":"B0819"},{"$f":"IF('GESTION B'!F246<=0,'GESTION B'!B246,\" \")","v":"VERNET"},{"$f":"IF('GESTION B'!F246>=0,'GESTION B'!C246,\" \")","v":"M90"},{"$f":"IF('GESTION B'!F246>=0,'GESTION B'!D246,\" \")","v":"EBAUCHE FRAISEE PERCEE"}]
[{"$f":"IF('GESTION B'!F248<=0,'GESTION B'!A248,\" \")","v":" "},{"$f":"IF('GESTION B'!F248<=0,'GESTION B'!B248,\" \")","v":" "},{"$f":"IF('GESTION B'!F248>=0,'GESTION B'!C248,\" \")","v":"M100"},{"$f":"IF('GESTION B'!F248>=0,'GESTION B'!D248,\" \")","v":"EBAUCHE"}]
[{"$f":"IF('GESTION B'!F249<=0,'GESTION B'!A249,\" \")","v":"B0821"},{"$f":"IF('GESTION B'!F249<=0,'GESTION B'!B249,\" \")","v":"VERNET"},{"$f":"IF('GESTION B'!F249>=0,'GESTION B'!C249,\" \")","v":"M100"},{"$f":"IF('GESTION B'!F249>=0,'GESTION B'!D249,\" \")","v":"EBAUCHE PERCEE"}]
[{"$f":"IF('GESTION B'!F250<=0,'GESTION B'!A250,\" \")","v":"B0822"},{"$f":"IF('GESTION B'!F250<=0,'GESTION B'!B250,\" \")","v":0},{"$f":"IF('GESTION B'!F250>=0,'GESTION B'!C250,\" \")","v":0},{"$f":"IF('GESTION B'!F250>=0,'GESTION B'!D250,\" \")","v":0}]
[{"$f":"IF('GESTION B'!F251<=0,'GESTION B'!A251,\" \")","v":"B0823"},{"$f":"IF('GESTION B'!F251<=0,'GESTION B'!B251,\" \")","v":0},{"$f":"IF('GESTION B'!F251>=0,'GESTION B'!C251,\" \")","v":0},{"$f":"IF('GESTION B'!F251>=0,'GESTION B'!D251,\" \")","v":0}]
[{"$f":"IF('GESTION B'!F252<=0,'GESTION B'!A252,\" \")","v":"B0824"},{"$f":"IF('GESTION B'!F252<=0,'GESTION B'!B252,\" \")","v":0},{"$f":"IF('GESTION B'!F252>=0,'GESTION B'!C252,\" \")","v":0},{"$f":"IF('GESTION B'!F252>=0,'GESTION B'!D252,\" \")","v":0}]
[{"$f":"IF('GESTION B'!F253<=0,'GESTION B'!A253,\" \")","v":"B0825"},{"$f":"IF('GESTION B'!F253<=0,'GESTION B'!B253,\" \")","v":0},{"$f":"IF('GESTION B'!F253>=0,'GESTION B'!C253,\" \")","v":0},{"$f":"IF('GESTION B'!F253>=0,'GESTION B'!D253,\" \")","v":0}]
[{"$f":"IF('GESTION B'!F254<=0,'GESTION B'!A254,\" \")","v":" "},{"$f":"IF('GESTION B'!F254<=0,'GESTION B'!B254,\" \")","v":" "},{"$f":"IF('GESTION B'!F254>=0,'GESTION B'!C254,\" \")","v":"VP M20 H6"},{"$f":"IF('GESTION B'!F254>=0,'GESTION B'!D254,\" \")","v":"EBAUCHE"}]
[{"$f":"IF('GESTION B'!F255<=0,'GESTION B'!A255,\" \")","v":"B0901-B"},{"$f":"IF('GESTION B'!F255<=0,'GESTION B'!B255,\" \")","v":"VERNET"},{"$f":"IF('GESTION B'!F255>=0,'GESTION B'!C255,\" \")","v":"VP M20 H6"},{"$f":"IF('GESTION B'!F255>=0,'GESTION B'!D255,\" \")","v":"EBAUCHE FRAISEE"}]
[{"$f":"IF('GESTION B'!F256<=0,'GESTION B'!A256,\" \")","v":" "},{"$f":"IF('GESTION B'!F256<=0,'GESTION B'!B256,\" \")","v":" "},{"$f":"IF('GESTION B'!F256>=0,'GESTION B'!C256,\" \")","v":"VP M24 H7"},{"$f":"IF('GESTION B'!F256>=0,'GESTION B'!D256,\" \")","v":"EBAUCHE"}]
[{"$f":"IF('GESTION B'!F257<=0,'GESTION B'!A257,\" \")","v":" "},{"$f":"IF('GESTION B'!F257<=0,'GESTION B'!B257,\" \")","v":" "},{"$f":"IF('GESTION B'!F257>=0,'GESTION B'!C257,\" \")","v":"VP M24 H7"},{"$f":"IF('GESTION B'!F257>=0,'GESTION B'!D257,\" \")","v":"EBAUCHE FRAISEE"}]
[{"$f":"IF('GESTION B'!F258<=0,'GESTION B'!A258,\" \")","v":" "},{"$f":"IF('GESTION B'!F258<=0,'GESTION B'!B258,\" \")","v":" "},{"$f":"IF('GESTION B'!F258>=0,'GESTION B'!C258,\" \")","v":"VP M32 H8"},{"$f":"IF('GESTION B'!F258>=0,'GESTION B'!D258,\" \")","v":"EBAUCHE"}]
[{"$f":"IF('GESTION B'!F259<=0,'GESTION B'!A259,\" \")","v":" "},{"$f":"IF('GESTION B'!F259<=0,'GESTION B'!B259,\" \")","v":" "},{"$f":"IF('GESTION B'!F259>=0,'GESTION B'!C259,\" \")","v":"VP M38 H9"},{"$f":"IF('GESTION B'!F259>=0,'GESTION B'!D259,\" \")","v":"EBAUCHE"}]
[{"$f":"IF('GESTION B'!F260<=0,'GESTION B'!A260,\" \")","v":" "},{"$f":"IF('GESTION B'!F260<=0,'GESTION B'!B260,\" \")","v":" "},{"$f":"IF('GESTION B'!F260>=0,'GESTION B'!C260,\" \")","v":"VP M38 H10"},{"$f":"IF('GESTION B'!F260>=0,'GESTION B'!D260,\" \")","v":"EBAUCHE"}]
[{"$f":"IF('GESTION B'!F261<=0,'GESTION B'!A261,\" \")","v":"B0903-A"},{"$f":"IF('GESTION B'!F261<=0,'GESTION B'!B261,\" \")","v":"VERNET"},{"$f":"IF('GESTION B'!F261>=0,'GESTION B'!C261,\" \")","v":"VP M43 H10"},{"$f":"IF('GESTION B'!F261>=0,'GESTION B'!D261,\" \")","v":"EBAUCHE"}]
[{"$f":"IF('GESTION B'!F263<=0,'GESTION B'!A263,\" \")","v":"B0904-A"},{"$f":"IF('GESTION B'!F263<=0,'GESTION B'!B263,\" \")","v":"VERNET"},{"$f":"IF('GESTION B'!F263>=0,'GESTION B'!C263,\" \")","v":"VP derniere  generation M24"},{"$f":"IF('GESTION B'!F263>=0,'GESTION B'!D263,\" \")","v":"EBAUCHE"}]
[{"$f":"IF('GESTION B'!F264<=0,'GESTION B'!A264,\" \")","v":"B0904-B"},{"$f":"IF('GESTION B'!F264<=0,'GESTION B'!B264,\" \")","v":"VERNET"},{"$f":"IF('GESTION B'!F264>=0,'GESTION B'!C264,\" \")","v":"VP derniere  generation M32"},{"$f":"IF('GESTION B'!F264>=0,'GESTION B'!D264,\" \")","v":"EBAUCHE"}]
[{"$f":"IF('GESTION B'!F265<=0,'GESTION B'!A265,\" \")","v":"B0905-A"},{"$f":"IF('GESTION B'!F265<=0,'GESTION B'!B265,\" \")","v":"VERNET"},{"$f":"IF('GESTION B'!F265>=0,'GESTION B'!C265,\" \")","v":"VP derniere  generation M38"},{"$f":"IF('GESTION B'!F265>=0,'GESTION B'!D265,\" \")","v":"EBAUCHE"}]
[{"$f":"IF('GESTION B'!F266<=0,'GESTION B'!A266,\" \")","v":"B0905-B"},{"$f":"IF('GESTION B'!F266<=0,'GESTION B'!B266,\" \")","v":"VERNET"},{"$f":"IF('GESTION B'!F266>=0,'GESTION B'!C266,\" \")","v":0},{"$f":"IF('GESTION B'!F266>=0,'GESTION B'!D266,\" \")","v":0}]
[{"$f":"IF('GESTION B'!F269<=0,'GESTION B'!A269,\" \")","v":" "},{"$f":"IF('GESTION B'!F269<=0,'GESTION B'!B269,\" \")","v":" "},{"$f":"IF('GESTION B'!F269>=0,'GESTION B'!C269,\" \")","v":"VP derniere  generation M48"},{"$f":"IF('GESTION B'!F269>=0,'GESTION B'!D269,\" \")","v":"EBAUCHE"}]
[{"$f":"IF('GESTION B'!F270<=0,'GESTION B'!A270,\" \")","v":"B0907-A"},{"$f":"IF('GESTION B'!F270<=0,'GESTION B'!B270,\" \")","v":"VERNET"},{"$f":"IF('GESTION B'!F270>=0,'GESTION B'!C270,\" \")","v":"MAP M25 "},{"$f":"IF('GESTION B'!F270>=0,'GESTION B'!D270,\" \")","v":"EBAUCHE RAINURE CIRCULAIRE"}]
[{"$f":"IF('GESTION B'!F271<=0,'GESTION B'!A271,\" \")","v":"B0907-B"},{"$f":"IF('GESTION B'!F271<=0,'GESTION B'!B271,\" \")","v":"VERNET"},{"$f":"IF('GESTION B'!F271>=0,'GESTION B'!C271,\" \")","v":"MAP M25 "},{"$f":"IF('GESTION B'!F271>=0,'GESTION B'!D271,\" \")","v":"EBAUCHE RAINURE FRAISEE"}]
[{"$f":"IF('GESTION B'!F272<=0,'GESTION B'!A272,\" \")","v":"B0907-C"},{"$f":"IF('GESTION B'!F272<=0,'GESTION B'!B272,\" \")","v":"VERNET"},{"$f":"IF('GESTION B'!F272>=0,'GESTION B'!C272,\" \")","v":"MAP M25 "},{"$f":"IF('GESTION B'!F272>=0,'GESTION B'!D272,\" \")","v":"EBAUCHE RAINURE FRAISEE 0° ET 90°"}]
[{"$f":"IF('GESTION B'!F273<=0,'GESTION B'!A273,\" \")","v":"B0908-A"},{"$f":"IF('GESTION B'!F273<=0,'GESTION B'!B273,\" \")","v":"VERNET"},{"$f":"IF('GESTION B'!F273>=0,'GESTION B'!C273,\" \")","v":"MAP M35"},{"$f":"IF('GESTION B'!F273>=0,'GESTION B'!D273,\" \")","v":"EBAUCHE RAINURE CIRCULAIRE"}]
[{"$f":"IF('GESTION B'!F274<=0,'GESTION B'!A274,\" \")","v":"B0908-B"},{"$f":"IF('GESTION B'!F274<=0,'GESTION B'!B274,\" \")","v":"VERNET"},{"$f":"IF('GESTION B'!F274>=0,'GESTION B'!C274,\" \")","v":"MAP M35"},{"$f":"IF('GESTION B'!F274>=0,'GESTION B'!D274,\" \")","v":"EBAUCHE RAINURE FRAISEE"}]
[{"$f":"IF('GESTION B'!F275<=0,'GESTION B'!A275,\" \")","v":"B0908-C"},{"$f":"IF('GESTION B'!F275<=0,'GESTION B'!B275,\" \")","v":"VERNET"},{"$f":"IF('GESTION B'!F275>=0,'GESTION B'!C275,\" \")","v":"MAP M35"},{"$f":"IF('GESTION B'!F275>=0,'GESTION B'!D275,\" \")","v":"EBAUCHE RAINURE FRAISEE 0° ET 90°"}]
[{"$f":"IF('GESTION B'!F276<=0,'GESTION B'!A276,\" \")","v":" "},{"$f":"IF('GESTION B'!F276<=0,'GESTION B'!B276,\" \")","v":" "},{"$f":"IF('GESTION B'!F276>=0,'GESTION B'!C276,\" \")","v":"MAP M42"},{"$f":"IF('GESTION B'!F276>=0,'GESTION B'!D276,\" \")","v":"EBAUCHE RAINURE CIRCULAIRE"}]
[{"$f":"IF('GESTION B'!F277<=0,'GESTION B'!A277,\" \")","v":" "},{"$f":"IF('GESTION B'!F277<=0,'GESTION B'!B277,\" \")","v":" "},{"$f":"IF('GESTION B'!F277>=0,'GESTION B'!C277,\" \")","v":"MAP M42"},{"$f":"IF('GESTION B'!F277>=0,'GESTION B'!D277,\" \")","v":"EBAUCHE RAINURE FRAISEE 1 RAINURE"}]
[{"$f":"IF('GESTION B'!F278<=0,'GESTION B'!A278,\" \")","v":" "},{"$f":"IF('GESTION B'!F278<=0,'GESTION B'!B278,\" \")","v":" "},{"$f":"IF('GESTION B'!F278>=0,'GESTION B'!C278,\" \")","v":"MAP M42"},{"$f":"IF('GESTION B'!F278>=0,'GESTION B'!D278,\" \")","v":"EBAUCHE RAINURE FRAISEE PERCEE 0° ET 45° "}]
[{"$f":"IF('GESTION B'!F279<=0,'GESTION B'!A279,\" \")","v":" "},{"$f":"IF('GESTION B'!F279<=0,'GESTION B'!B279,\" \")","v":" "},{"$f":"IF('GESTION B'!F279>=0,'GESTION B'!C279,\" \")","v":"MAP M42"},{"$f":"IF('GESTION B'!F279>=0,'GESTION B'!D279,\" \")","v":"EBAUCHE RAINURE FRAISEE PERCEE 0° ET 90° "}]
[{"$f":"IF('GESTION B'!F280<=0,'GESTION B'!A280,\" \")","v":" "},{"$f":"IF('GESTION B'!F280<=0,'GESTION B'!B280,\" \")","v":" "},{"$f":"IF('GESTION B'!F280>=0,'GESTION B'!C280,\" \")","v":"MAP M55"},{"$f":"IF('GESTION B'!F280>=0,'GESTION B'!D280,\" \")","v":"EBAUCHE RAINURE FRAISEE"}]
[{"$f":"IF('GESTION B'!F281<=0,'GESTION B'!A281,\" \")","v":" "},{"$f":"IF('GESTION B'!F281<=0,'GESTION B'!B281,\" \")","v":" "},{"$f":"IF('GESTION B'!F281>=0,'GESTION B'!C281,\" \")","v":"MAP M55"},{"$f":"IF('GESTION B'!F281>=0,'GESTION B'!D281,\" \")","v":"EBAUCHE RAINURE FRAISEE 0° ET 90°"}]
[{"$f":"IF('GESTION B'!F282<=0,'GESTION B'!A282,\" \")","v":" "},{"$f":"IF('GESTION B'!F282<=0,'GESTION B'!B282,\" \")","v":" "},{"$f":"IF('GESTION B'!F282>=0,'GESTION B'!C282,\" \")","v":"MAP M55"},{"$f":"IF('GESTION B'!F282>=0,'GESTION B'!D282,\" \")","v":"EBAUCHE RAINURE FRAISEE PERCEE 0° ET 90° "}]
[{"$f":"IF('GESTION B'!F284<=0,'GESTION B'!A284,\" \")","v":" "},{"$f":"IF('GESTION B'!F284<=0,'GESTION B'!B284,\" \")","v":" "},{"$f":"IF('GESTION B'!F284>=0,'GESTION B'!C284,\" \")","v":"PG M55"},{"$f":"IF('GESTION B'!F284>=0,'GESTION B'!D284,\" \")","v":"EBAUCHE"}]
[{"$f":"IF('GESTION B'!F286<=0,'GESTION B'!A286,\" \")","v":" "},{"$f":"IF('GESTION B'!F286<=0,'GESTION B'!B286,\" \")","v":" "},{"$f":"IF('GESTION B'!F286>=0,'GESTION B'!C286,\" \")","v":"PG M55"},{"$f":"IF('GESTION B'!F286>=0,'GESTION B'!D286,\" \")","v":"EBAUCHE FRAISEE PERCEE Ø36 0° ET 90°"}]
[{"$f":"IF('GESTION B'!F287<=0,'GESTION B'!A287,\" \")","v":" "},{"$f":"IF('GESTION B'!F287<=0,'GESTION B'!B287,\" \")","v":" "},{"$f":"IF('GESTION B'!F287>=0,'GESTION B'!C287,\" \")","v":"PG M55"},{"$f":"IF('GESTION B'!F287>=0,'GESTION B'!D287,\" \")","v":"EBAUCHE PERCEE Ø31"}]
[{"$f":"IF('GESTION B'!F289<=0,'GESTION B'!A289,\" \")","v":" "},{"$f":"IF('GESTION B'!F289<=0,'GESTION B'!B289,\" \")","v":" "},{"$f":"IF('GESTION B'!F289>=0,'GESTION B'!C289,\" \")","v":"MAP M55"},{"$f":"IF('GESTION B'!F289>=0,'GESTION B'!D289,\" \")","v":"EBAUCHE FRAISEE"}]
[{"$f":"IF('GESTION B'!F291<=0,'GESTION B'!A291,\" \")","v":" "},{"$f":"IF('GESTION B'!F291<=0,'GESTION B'!B291,\" \")","v":" "},{"$f":"IF('GESTION B'!F291>=0,'GESTION B'!C291,\" \")","v":"MAP M70"},{"$f":"IF('GESTION B'!F291>=0,'GESTION B'!D291,\" \")","v":"EBAUCHE"}]
[{"$f":"IF('GESTION B'!F292<=0,'GESTION B'!A292,\" \")","v":" "},{"$f":"IF('GESTION B'!F292<=0,'GESTION B'!B292,\" \")","v":" "},{"$f":"IF('GESTION B'!F292>=0,'GESTION B'!C292,\" \")","v":"PG M70"},{"$f":"IF('GESTION B'!F292>=0,'GESTION B'!D292,\" \")","v":"EBAUCHE"}]
[{"$f":"IF('GESTION B'!F293<=0,'GESTION B'!A293,\" \")","v":"B0920-A"},{"$f":"IF('GESTION B'!F293<=0,'GESTION B'!B293,\" \")","v":"VERNET"},{"$f":"IF('GESTION B'!F293>=0,'GESTION B'!C293,\" \")","v":0},{"$f":"IF('GESTION B'!F293>=0,'GESTION B'!D293,\" \")","v":0}]
[{"$f":"IF('GESTION B'!F295<=0,'GESTION B'!A295,\" \")","v":" "},{"$f":"IF('GESTION B'!F295<=0,'GESTION B'!B295,\" \")","v":" "},{"$f":"IF('GESTION B'!F295>=0,'GESTION B'!C295,\" \")","v":"RETIS"},{"$f":"IF('GESTION B'!F295>=0,'GESTION B'!D295,\" \")","v":"M55 EBAUCHE PERCEE 2 REPERES 0° et 90°"}]
[{"$f":"IF('GESTION B'!F296<=0,'GESTION B'!A296,\" \")","v":"B0922"},{"$f":"IF('GESTION B'!F296<=0,'GESTION B'!B296,\" \")","v":0},{"$f":"IF('GESTION B'!F296>=0,'GESTION B'!C296,\" \")","v":0},{"$f":"IF('GESTION B'!F296>=0,'GESTION B'!D296,\" \")","v":0}]
[{"$f":"IF('GESTION B'!F297<=0,'GESTION B'!A297,\" \")","v":"B0923"},{"$f":"IF('GESTION B'!F297<=0,'GESTION B'!B297,\" \")","v":0},{"$f":"IF('GESTION B'!F297>=0,'GESTION B'!C297,\" \")","v":0},{"$f":"IF('GESTION B'!F297>=0,'GESTION B'!D297,\" \")","v":0}]
[{"$f":"IF('GESTION B'!F298<=0,'GESTION B'!A298,\" \")","v":"B0924"},{"$f":"IF('GESTION B'!F298<=0,'GESTION B'!B298,\" \")","v":0},{"$f":"IF('GESTION B'!F298>=0,'GESTION B'!C298,\" \")","v":0},{"$f":"IF('GESTION B'!F298>=0,'GESTION B'!D298,\" \")","v":0}]
[{"$f":"IF('GESTION B'!F299<=0,'GESTION B'!A299,\" \")","v":"B0925"},{"$f":"IF('GESTION B'!F299<=0,'GESTION B'!B299,\" \")","v":0},{"$f":"IF('GESTION B'!F299>=0,'GESTION B'!C299,\" \")","v":0},{"$f":"IF('GESTION B'!F299>=0,'GESTION B'!D299,\" \")","v":0}]
[{"$f":"IF('GESTION B'!F300<=0,'GESTION B'!A300,\" \")","v":" "},{"$f":"IF('GESTION B'!F300<=0,'GESTION B'!B300,\" \")","v":" "},{"$f":"IF('GESTION B'!F300>=0,'GESTION B'!C300,\" \")","v":"P24"},{"$f":"IF('GESTION B'!F300>=0,'GESTION B'!D300,\" \")","v":"CORPS Ø24 PERCE 1 TROU Ø3"}]
[{"$f":"IF('GESTION B'!F301<=0,'GESTION B'!A301,\" \")","v":" "},{"$f":"IF('GESTION B'!F301<=0,'GESTION B'!B301,\" \")","v":" "},{"$f":"IF('GESTION B'!F301>=0,'GESTION B'!C301,\" \")","v":"P24"},{"$f":"IF('GESTION B'!F301>=0,'GESTION B'!D301,\" \")","v":"CORPS Ø24 PERCE 1 TROU Ø3"}]
[{"$f":"IF('GESTION B'!F302<=0,'GESTION B'!A302,\" \")","v":"B1003"},{"$f":"IF('GESTION B'!F302<=0,'GESTION B'!B302,\" \")","v":"IMAC SELFER ALFRA"},{"$f":"IF('GESTION B'!F302>=0,'GESTION B'!C302,\" \")","v":"P25"},{"$f":"IF('GESTION B'!F302>=0,'GESTION B'!D302,\" \")","v":"CORPS Ø25 PERCE 1 TROU Ø3"}]
[{"$f":"IF('GESTION B'!F303<=0,'GESTION B'!A303,\" \")","v":"B1004"},{"$f":"IF('GESTION B'!F303<=0,'GESTION B'!B303,\" \")","v":"IMAC SELFER ALFRA"},{"$f":"IF('GESTION B'!F303>=0,'GESTION B'!C303,\" \")","v":"P26"},{"$f":"IF('GESTION B'!F303>=0,'GESTION B'!D303,\" \")","v":"CORPS Ø26 PERCE 1 TROU Ø3"}]
[{"$f":"IF('GESTION B'!F304<=0,'GESTION B'!A304,\" \")","v":" "},{"$f":"IF('GESTION B'!F304<=0,'GESTION B'!B304,\" \")","v":" "},{"$f":"IF('GESTION B'!F304>=0,'GESTION B'!C304,\" \")","v":"P24 SUPERIEUR Ø30"},{"$f":"IF('GESTION B'!F304>=0,'GESTION B'!D304,\" \")","v":"CORPS Ø24 PERCE 1 TROU Ø3"}]
[{"$f":"IF('GESTION B'!F305<=0,'GESTION B'!A305,\" \")","v":" "},{"$f":"IF('GESTION B'!F305<=0,'GESTION B'!B305,\" \")","v":" "},{"$f":"IF('GESTION B'!F305>=0,'GESTION B'!C305,\" \")","v":"P24 EXCENTRE"},{"$f":"IF('GESTION B'!F305>=0,'GESTION B'!D305,\" \")","v":"CORPS Ø24 PERCE 4 TROUS Ø3"}]
[{"$f":"IF('GESTION B'!F306<=0,'GESTION B'!A306,\" \")","v":" "},{"$f":"IF('GESTION B'!F306<=0,'GESTION B'!B306,\" \")","v":" "},{"$f":"IF('GESTION B'!F306>=0,'GESTION B'!C306,\" \")","v":"P40"},{"$f":"IF('GESTION B'!F306>=0,'GESTION B'!D306,\" \")","v":"EBAUCHE 2 REPERES"}]
[{"$f":"IF('GESTION B'!F307<=0,'GESTION B'!A307,\" \")","v":" "},{"$f":"IF('GESTION B'!F307<=0,'GESTION B'!B307,\" \")","v":" "},{"$f":"IF('GESTION B'!F307>=0,'GESTION B'!C307,\" \")","v":"P40"},{"$f":"IF('GESTION B'!F307>=0,'GESTION B'!D307,\" \")","v":"EBAUCHE SUPERIEUR TREMPEE"}]
[{"$f":"IF('GESTION B'!F308<=0,'GESTION B'!A308,\" \")","v":" "},{"$f":"IF('GESTION B'!F308<=0,'GESTION B'!B308,\" \")","v":" "},{"$f":"IF('GESTION B'!F308>=0,'GESTION B'!C308,\" \")","v":"P70"},{"$f":"IF('GESTION B'!F308>=0,'GESTION B'!D308,\" \")","v":"EBAUCHE 2 REPERES"}]
[{"$f":"IF('GESTION B'!F309<=0,'GESTION B'!A309,\" \")","v":" "},{"$f":"IF('GESTION B'!F309<=0,'GESTION B'!B309,\" \")","v":" "},{"$f":"IF('GESTION B'!F309>=0,'GESTION B'!C309,\" \")","v":"P70"},{"$f":"IF('GESTION B'!F309>=0,'GESTION B'!D309,\" \")","v":"EBAUCHE SUPERIEUR TREMPEE"}]
[{"$f":"IF('GESTION B'!F311<=0,'GESTION B'!A311,\" \")","v":" "},{"$f":"IF('GESTION B'!F311<=0,'GESTION B'!B311,\" \")","v":" "},{"$f":"IF('GESTION B'!F311>=0,'GESTION B'!C311,\" \")","v":"M42"},{"$f":"IF('GESTION B'!F311>=0,'GESTION B'!D311,\" \")","v":"EBAUCHE 1 REPERE ALESEE Ø30"}]
[{"$f":"IF('GESTION B'!F312<=0,'GESTION B'!A312,\" \")","v":" "},{"$f":"IF('GESTION B'!F312<=0,'GESTION B'!B312,\" \")","v":" "},{"$f":"IF('GESTION B'!F312>=0,'GESTION B'!C312,\" \")","v":"M54"},{"$f":"IF('GESTION B'!F312>=0,'GESTION B'!D312,\" \")","v":"EBAUCHE PERCEE \u009dØ32 à RECTIFIER"}]
[{"$f":"IF('GESTION B'!F314<=0,'GESTION B'!A314,\" \")","v":" "},{"$f":"IF('GESTION B'!F314<=0,'GESTION B'!B314,\" \")","v":" "},{"$f":"IF('GESTION B'!F314>=0,'GESTION B'!C314,\" \")","v":"M42"},{"$f":"IF('GESTION B'!F314>=0,'GESTION B'!D314,\" \")","v":"EBAUCHE"}]
[{"$f":"IF('GESTION B'!F315<=0,'GESTION B'!A315,\" \")","v":" "},{"$f":"IF('GESTION B'!F315<=0,'GESTION B'!B315,\" \")","v":" "},{"$f":"IF('GESTION B'!F315>=0,'GESTION B'!C315,\" \")","v":"M42"},{"$f":"IF('GESTION B'!F315>=0,'GESTION B'!D315,\" \")","v":"EBAUCHE PERCEE Ø16"}]
[{"$f":"IF('GESTION B'!F316<=0,'GESTION B'!A316,\" \")","v":" "},{"$f":"IF('GESTION B'!F316<=0,'GESTION B'!B316,\" \")","v":" "},{"$f":"IF('GESTION B'!F316>=0,'GESTION B'!C316,\" \")","v":"M42"},{"$f":"IF('GESTION B'!F316>=0,'GESTION B'!D316,\" \")","v":"EBAUCHE PERCEE Ø16"}]
[{"$f":"IF('GESTION B'!F317<=0,'GESTION B'!A317,\" \")","v":" "},{"$f":"IF('GESTION B'!F317<=0,'GESTION B'!B317,\" \")","v":" "},{"$f":"IF('GESTION B'!F317>=0,'GESTION B'!C317,\" \")","v":"M42"},{"$f":"IF('GESTION B'!F317>=0,'GESTION B'!D317,\" \")","v":"EBAUCHE PERCEE Ø26 2 REPERES 0° - 90°"}]
[{"$f":"IF('GESTION B'!F318<=0,'GESTION B'!A318,\" \")","v":" "},{"$f":"IF('GESTION B'!F318<=0,'GESTION B'!B318,\" \")","v":" "},{"$f":"IF('GESTION B'!F318>=0,'GESTION B'!C318,\" \")","v":"M42"},{"$f":"IF('GESTION B'!F318>=0,'GESTION B'!D318,\" \")","v":"EBAUCHE PERCEE 1 REPERE FACE INCLINEE"}]
[{"$f":"IF('GESTION B'!F319<=0,'GESTION B'!A319,\" \")","v":" "},{"$f":"IF('GESTION B'!F319<=0,'GESTION B'!B319,\" \")","v":" "},{"$f":"IF('GESTION B'!F319>=0,'GESTION B'!C319,\" \")","v":"M42"},{"$f":"IF('GESTION B'!F319>=0,'GESTION B'!D319,\" \")","v":"EBAUCHE PERCEE 1 REPERE FACE INCLINEE"}]
[{"$f":"IF('GESTION B'!F320<=0,'GESTION B'!A320,\" \")","v":" "},{"$f":"IF('GESTION B'!F320<=0,'GESTION B'!B320,\" \")","v":" "},{"$f":"IF('GESTION B'!F320>=0,'GESTION B'!C320,\" \")","v":"M40"},{"$f":"IF('GESTION B'!F320>=0,'GESTION B'!D320,\" \")","v":"EBAUCHE PERCEE Ø35 2 REPERES 0° ET 90°"}]
[{"$f":"IF('GESTION B'!F321<=0,'GESTION B'!A321,\" \")","v":" "},{"$f":"IF('GESTION B'!F321<=0,'GESTION B'!B321,\" \")","v":" "},{"$f":"IF('GESTION B'!F321>=0,'GESTION B'!C321,\" \")","v":"M42"},{"$f":"IF('GESTION B'!F321>=0,'GESTION B'!D321,\" \")","v":"EBAUCHE TREMPEE RECTIFIEE Ø29"}]
[{"$f":"IF('GESTION B'!F324<=0,'GESTION B'!A324,\" \")","v":"B1021-B"},{"$f":"IF('GESTION B'!F324<=0,'GESTION B'!B324,\" \")","v":0},{"$f":"IF('GESTION B'!F324>=0,'GESTION B'!C324,\" \")","v":0},{"$f":"IF('GESTION B'!F324>=0,'GESTION B'!D324,\" \")","v":0}]
[{"$f":"IF('GESTION B'!F325<=0,'GESTION B'!A325,\" \")","v":" "},{"$f":"IF('GESTION B'!F325<=0,'GESTION B'!B325,\" \")","v":" "},{"$f":"IF('GESTION B'!F325>=0,'GESTION B'!C325,\" \")","v":"P70"},{"$f":"IF('GESTION B'!F325>=0,'GESTION B'!D325,\" \")","v":"EBAUCHE TREMPEE"}]
[{"$f":"IF('GESTION B'!F326<=0,'GESTION B'!A326,\" \")","v":"B1023"},{"$f":"IF('GESTION B'!F326<=0,'GESTION B'!B326,\" \")","v":0},{"$f":"IF('GESTION B'!F326>=0,'GESTION B'!C326,\" \")","v":0},{"$f":"IF('GESTION B'!F326>=0,'GESTION B'!D326,\" \")","v":0}]
[{"$f":"IF('GESTION B'!F327<=0,'GESTION B'!A327,\" \")","v":"B1024"},{"$f":"IF('GESTION B'!F327<=0,'GESTION B'!B327,\" \")","v":0},{"$f":"IF('GESTION B'!F327>=0,'GESTION B'!C327,\" \")","v":0},{"$f":"IF('GESTION B'!F327>=0,'GESTION B'!D327,\" \")","v":0}]
[{"$f":"IF('GESTION B'!F328<=0,'GESTION B'!A328,\" \")","v":"B1025"},{"$f":"IF('GESTION B'!F328<=0,'GESTION B'!B328,\" \")","v":0},{"$f":"IF('GESTION B'!F328>=0,'GESTION B'!C328,\" \")","v":0},{"$f":"IF('GESTION B'!F328>=0,'GESTION B'!D328,\" \")","v":0}]
[{"$f":"IF('GESTION B'!F329<=0,'GESTION B'!A329,\" \")","v":" "},{"$f":"IF('GESTION B'!F329<=0,'GESTION B'!B329,\" \")","v":" "},{"$f":"IF('GESTION B'!F329>=0,'GESTION B'!C329,\" \")","v":"POINCON MN1"},{"$f":"IF('GESTION B'!F329>=0,'GESTION B'!D329,\" \")","v":"EBAUCHE FRAISEE"}]
[{"$f":"IF('GESTION B'!F330<=0,'GESTION B'!A330,\" \")","v":"B1102"},{"$f":"IF('GESTION B'!F330<=0,'GESTION B'!B330,\" \")","v":"ALPHYDRO"},{"$f":"IF('GESTION B'!F330>=0,'GESTION B'!C330,\" \")","v":"POINCON MN2"},{"$f":"IF('GESTION B'!F330>=0,'GESTION B'!D330,\" \")","v":"EBAUCHE FRAISEE"}]
[{"$f":"IF('GESTION B'!F331<=0,'GESTION B'!A331,\" \")","v":"B1103"},{"$f":"IF('GESTION B'!F331<=0,'GESTION B'!B331,\" \")","v":"ALPHYDRO"},{"$f":"IF('GESTION B'!F331>=0,'GESTION B'!C331,\" \")","v":"POINCON MN3"},{"$f":"IF('GESTION B'!F331>=0,'GESTION B'!D331,\" \")","v":"EBAUCHE FRAISEE"}]
[{"$f":"IF('GESTION B'!F332<=0,'GESTION B'!A332,\" \")","v":" "},{"$f":"IF('GESTION B'!F332<=0,'GESTION B'!B332,\" \")","v":" "},{"$f":"IF('GESTION B'!F332>=0,'GESTION B'!C332,\" \")","v":"POINCON AM"},{"$f":"IF('GESTION B'!F332>=0,'GESTION B'!D332,\" \")","v":"EBAUCHE FRAISEE"}]
[{"$f":"IF('GESTION B'!F333<=0,'GESTION B'!A333,\" \")","v":" "},{"$f":"IF('GESTION B'!F333<=0,'GESTION B'!B333,\" \")","v":" "},{"$f":"IF('GESTION B'!F333>=0,'GESTION B'!C333,\" \")","v":"POINCON SP"},{"$f":"IF('GESTION B'!F333>=0,'GESTION B'!D333,\" \")","v":"EBAUCHE"}]
[{"$f":"IF('GESTION B'!F335<=0,'GESTION B'!A335,\" \")","v":" "},{"$f":"IF('GESTION B'!F335<=0,'GESTION B'!B335,\" \")","v":" "},{"$f":"IF('GESTION B'!F335>=0,'GESTION B'!C335,\" \")","v":"MATRICE MN1"},{"$f":"IF('GESTION B'!F335>=0,'GESTION B'!D335,\" \")","v":"EBAUCHE"}]
[{"$f":"IF('GESTION B'!F336<=0,'GESTION B'!A336,\" \")","v":" "},{"$f":"IF('GESTION B'!F336<=0,'GESTION B'!B336,\" \")","v":" "},{"$f":"IF('GESTION B'!F336>=0,'GESTION B'!C336,\" \")","v":"MATRICE MN1"},{"$f":"IF('GESTION B'!F336>=0,'GESTION B'!D336,\" \")","v":"EBAUCHE PERCEE Ø16"}]
[{"$f":"IF('GESTION B'!F337<=0,'GESTION B'!A337,\" \")","v":" "},{"$f":"IF('GESTION B'!F337<=0,'GESTION B'!B337,\" \")","v":" "},{"$f":"IF('GESTION B'!F337>=0,'GESTION B'!C337,\" \")","v":"MATRICE MN1"},{"$f":"IF('GESTION B'!F337>=0,'GESTION B'!D337,\" \")","v":"EBAUCHE PERCEE Ø16"}]
[{"$f":"IF('GESTION B'!F338<=0,'GESTION B'!A338,\" \")","v":" "},{"$f":"IF('GESTION B'!F338<=0,'GESTION B'!B338,\" \")","v":" "},{"$f":"IF('GESTION B'!F338>=0,'GESTION B'!C338,\" \")","v":"MATRICE MN1"},{"$f":"IF('GESTION B'!F338>=0,'GESTION B'!D338,\" \")","v":"EBAUCHE PERCEE Ø30 4 REPERES"}]
[{"$f":"IF('GESTION B'!F339<=0,'GESTION B'!A339,\" \")","v":" "},{"$f":"IF('GESTION B'!F339<=0,'GESTION B'!B339,\" \")","v":" "},{"$f":"IF('GESTION B'!F339>=0,'GESTION B'!C339,\" \")","v":"MATRICE MN1"},{"$f":"IF('GESTION B'!F339>=0,'GESTION B'!D339,\" \")","v":"EBAUCHE FRAISEE 2 ENCOCHES 0 ET 180°"}]
[{"$f":"IF('GESTION B'!F340<=0,'GESTION B'!A340,\" \")","v":"B1111"},{"$f":"IF('GESTION B'!F340<=0,'GESTION B'!B340,\" \")","v":0},{"$f":"IF('GESTION B'!F340>=0,'GESTION B'!C340,\" \")","v":0},{"$f":"IF('GESTION B'!F340>=0,'GESTION B'!D340,\" \")","v":0}]
[{"$f":"IF('GESTION B'!F341<=0,'GESTION B'!A341,\" \")","v":"B1112"},{"$f":"IF('GESTION B'!F341<=0,'GESTION B'!B341,\" \")","v":0},{"$f":"IF('GESTION B'!F341>=0,'GESTION B'!C341,\" \")","v":0},{"$f":"IF('GESTION B'!F341>=0,'GESTION B'!D341,\" \")","v":0}]
[{"$f":"IF('GESTION B'!F342<=0,'GESTION B'!A342,\" \")","v":" "},{"$f":"IF('GESTION B'!F342<=0,'GESTION B'!B342,\" \")","v":" "},{"$f":"IF('GESTION B'!F342>=0,'GESTION B'!C342,\" \")","v":"M50,8"},{"$f":"IF('GESTION B'!F342>=0,'GESTION B'!D342,\" \")","v":"EBAUCHE 1 REPERE"}]
[{"$f":"IF('GESTION B'!F343<=0,'GESTION B'!A343,\" \")","v":" "},{"$f":"IF('GESTION B'!F343<=0,'GESTION B'!B343,\" \")","v":" "},{"$f":"IF('GESTION B'!F343>=0,'GESTION B'!C343,\" \")","v":"M50,8"},{"$f":"IF('GESTION B'!F343>=0,'GESTION B'!D343,\" \")","v":"EBAUCHE 2 REPERES"}]
[{"$f":"IF('GESTION B'!F345<=0,'GESTION B'!A345,\" \")","v":" "},{"$f":"IF('GESTION B'!F345<=0,'GESTION B'!B345,\" \")","v":" "},{"$f":"IF('GESTION B'!F345>=0,'GESTION B'!C345,\" \")","v":"M50,8"},{"$f":"IF('GESTION B'!F345>=0,'GESTION B'!D345,\" \")","v":"EBAUCHE 3 REPERES 0° 45° 90° "}]
[{"$f":"IF('GESTION B'!F346<=0,'GESTION B'!A346,\" \")","v":" "},{"$f":"IF('GESTION B'!F346<=0,'GESTION B'!B346,\" \")","v":" "},{"$f":"IF('GESTION B'!F346>=0,'GESTION B'!C346,\" \")","v":"M79,5"},{"$f":"IF('GESTION B'!F346>=0,'GESTION B'!D346,\" \")","v":"EBAUCHE"}]
[{"$f":"IF('GESTION B'!F347<=0,'GESTION B'!A347,\" \")","v":" "},{"$f":"IF('GESTION B'!F347<=0,'GESTION B'!B347,\" \")","v":" "},{"$f":"IF('GESTION B'!F347>=0,'GESTION B'!C347,\" \")","v":"M79,5"},{"$f":"IF('GESTION B'!F347>=0,'GESTION B'!D347,\" \")","v":"EBAUCHE PERCEE 2 REPERES 0° ET 90°"}]
[{"$f":"IF('GESTION B'!F348<=0,'GESTION B'!A348,\" \")","v":" "},{"$f":"IF('GESTION B'!F348<=0,'GESTION B'!B348,\" \")","v":" "},{"$f":"IF('GESTION B'!F348>=0,'GESTION B'!C348,\" \")","v":"M120"},{"$f":"IF('GESTION B'!F348>=0,'GESTION B'!D348,\" \")","v":"EBAUCHE"}]
[{"$f":"IF('GESTION B'!F349<=0,'GESTION B'!A349,\" \")","v":" "},{"$f":"IF('GESTION B'!F349<=0,'GESTION B'!B349,\" \")","v":" "},{"$f":"IF('GESTION B'!F349>=0,'GESTION B'!C349,\" \")","v":"M120"},{"$f":"IF('GESTION B'!F349>=0,'GESTION B'!D349,\" \")","v":"EBAUCHE"}]
[{"$f":"IF('GESTION B'!F350<=0,'GESTION B'!A350,\" \")","v":" "},{"$f":"IF('GESTION B'!F350<=0,'GESTION B'!B350,\" \")","v":" "},{"$f":"IF('GESTION B'!F350>=0,'GESTION B'!C350,\" \")","v":"M120"},{"$f":"IF('GESTION B'!F350>=0,'GESTION B'!D350,\" \")","v":"EBAUCHE FRAISEE PERCEE"}]
[{"$f":"IF('GESTION B'!F352<=0,'GESTION B'!A352,\" \")","v":" "},{"$f":"IF('GESTION B'!F352<=0,'GESTION B'!B352,\" \")","v":" "},{"$f":"IF('GESTION B'!F352>=0,'GESTION B'!C352,\" \")","v":"C52"},{"$f":"IF('GESTION B'!F352>=0,'GESTION B'!D352,\" \")","v":"EBAUCHE PERCEE"}]
[{"$f":"IF('GESTION B'!F353<=0,'GESTION B'!A353,\" \")","v":"B1122"},{"$f":"IF('GESTION B'!F353<=0,'GESTION B'!B353,\" \")","v":0},{"$f":"IF('GESTION B'!F353>=0,'GESTION B'!C353,\" \")","v":0},{"$f":"IF('GESTION B'!F353>=0,'GESTION B'!D353,\" \")","v":0}]
[{"$f":"IF('GESTION B'!F354<=0,'GESTION B'!A354,\" \")","v":" "},{"$f":"IF('GESTION B'!F354<=0,'GESTION B'!B354,\" \")","v":" "},{"$f":"IF('GESTION B'!F354>=0,'GESTION B'!C354,\" \")","v":"C52"},{"$f":"IF('GESTION B'!F354>=0,'GESTION B'!D354,\" \")","v":"SOUS TIGE 108"}]
[{"$f":"IF('GESTION B'!F355<=0,'GESTION B'!A355,\" \")","v":" "},{"$f":"IF('GESTION B'!F355<=0,'GESTION B'!B355,\" \")","v":" "},{"$f":"IF('GESTION B'!F355>=0,'GESTION B'!C355,\" \")","v":"C52"},{"$f":"IF('GESTION B'!F355>=0,'GESTION B'!D355,\" \")","v":"EBAUCHE FRAISEE"}]
[{"$f":"IF('GESTION B'!F356<=0,'GESTION B'!A356,\" \")","v":"B1125"},{"$f":"IF('GESTION B'!F356<=0,'GESTION B'!B356,\" \")","v":0},{"$f":"IF('GESTION B'!F356>=0,'GESTION B'!C356,\" \")","v":0},{"$f":"IF('GESTION B'!F356>=0,'GESTION B'!D356,\" \")","v":0}]
[{"$f":"IF('GESTION B'!F357<=0,'GESTION B'!A357,\" \")","v":" "},{"$f":"IF('GESTION B'!F357<=0,'GESTION B'!B357,\" \")","v":" "},{"$f":"IF('GESTION B'!F357>=0,'GESTION B'!C357,\" \")","v":"C22"},{"$f":"IF('GESTION B'!F357>=0,'GESTION B'!D357,\" \")","v":"EBAUCHE FRAISEE"}]
[{"$f":"IF('GESTION B'!F359<=0,'GESTION B'!A359,\" \")","v":"B1202"},{"$f":"IF('GESTION B'!F359<=0,'GESTION B'!B359,\" \")","v":0},{"$f":"IF('GESTION B'!F359>=0,'GESTION B'!C359,\" \")","v":0},{"$f":"IF('GESTION B'!F359>=0,'GESTION B'!D359,\" \")","v":0}]
[{"$f":"IF('GESTION B'!F360<=0,'GESTION B'!A360,\" \")","v":" "},{"$f":"IF('GESTION B'!F360<=0,'GESTION B'!B360,\" \")","v":" "},{"$f":"IF('GESTION B'!F360>=0,'GESTION B'!C360,\" \")","v":"C20"},{"$f":"IF('GESTION B'!F360>=0,'GESTION B'!D360,\" \")","v":"EBAUCHE FRAISEE 2 ENCOCHES"}]
[{"$f":"IF('GESTION B'!F363<=0,'GESTION B'!A363,\" \")","v":" "},{"$f":"IF('GESTION B'!F363<=0,'GESTION B'!B363,\" \")","v":" "},{"$f":"IF('GESTION B'!F363>=0,'GESTION B'!C363,\" \")","v":"M45"},{"$f":"IF('GESTION B'!F363>=0,'GESTION B'!D363,\" \")","v":"EBAUCHE PERCEE 2 REPERES 0° ET 90°"}]
[{"$f":"IF('GESTION B'!F365<=0,'GESTION B'!A365,\" \")","v":" "},{"$f":"IF('GESTION B'!F365<=0,'GESTION B'!B365,\" \")","v":" "},{"$f":"IF('GESTION B'!F365>=0,'GESTION B'!C365,\" \")","v":"C35"},{"$f":"IF('GESTION B'!F365>=0,'GESTION B'!D365,\" \")","v":"EBAUCHE PERCEE GOUPILLE Ø5  0° ET 90°"}]
[{"$f":"IF('GESTION B'!F366<=0,'GESTION B'!A366,\" \")","v":" "},{"$f":"IF('GESTION B'!F366<=0,'GESTION B'!B366,\" \")","v":" "},{"$f":"IF('GESTION B'!F366>=0,'GESTION B'!C366,\" \")","v":"M65"},{"$f":"IF('GESTION B'!F366>=0,'GESTION B'!D366,\" \")","v":"EBAUCHE PERCEE Ø38 FRAISEE 1 REPERE"}]
[{"$f":"IF('GESTION B'!F367<=0,'GESTION B'!A367,\" \")","v":" "},{"$f":"IF('GESTION B'!F367<=0,'GESTION B'!B367,\" \")","v":" "},{"$f":"IF('GESTION B'!F367>=0,'GESTION B'!C367,\" \")","v":"5012836-189"},{"$f":"IF('GESTION B'!F367>=0,'GESTION B'!D367,\" \")","v":"EBAUCHE"}]
[{"$f":"IF('GESTION B'!F369<=0,'GESTION B'!A369,\" \")","v":" "},{"$f":"IF('GESTION B'!F369<=0,'GESTION B'!B369,\" \")","v":" "},{"$f":"IF('GESTION B'!F369>=0,'GESTION B'!C369,\" \")","v":"5013058-P14"},{"$f":"IF('GESTION B'!F369>=0,'GESTION B'!D369,\" \")","v":"EBAUCHE"}]
[{"$f":"IF('GESTION B'!F371<=0,'GESTION B'!A371,\" \")","v":"B1209"},{"$f":"IF('GESTION B'!F371<=0,'GESTION B'!B371,\" \")","v":0},{"$f":"IF('GESTION B'!F371>=0,'GESTION B'!C371,\" \")","v":0},{"$f":"IF('GESTION B'!F371>=0,'GESTION B'!D371,\" \")","v":0}]
[{"$f":"IF('GESTION B'!F372<=0,'GESTION B'!A372,\" \")","v":"B1210"},{"$f":"IF('GESTION B'!F372<=0,'GESTION B'!B372,\" \")","v":0},{"$f":"IF('GESTION B'!F372>=0,'GESTION B'!C372,\" \")","v":0},{"$f":"IF('GESTION B'!F372>=0,'GESTION B'!D372,\" \")","v":0}]
[{"$f":"IF('GESTION B'!F373<=0,'GESTION B'!A373,\" \")","v":"B1211"},{"$f":"IF('GESTION B'!F373<=0,'GESTION B'!B373,\" \")","v":0},{"$f":"IF('GESTION B'!F373>=0,'GESTION B'!C373,\" \")","v":0},{"$f":"IF('GESTION B'!F373>=0,'GESTION B'!D373,\" \")","v":0}]
[{"$f":"IF('GESTION B'!F374<=0,'GESTION B'!A374,\" \")","v":"B1212"},{"$f":"IF('GESTION B'!F374<=0,'GESTION B'!B374,\" \")","v":0},{"$f":"IF('GESTION B'!F374>=0,'GESTION B'!C374,\" \")","v":0},{"$f":"IF('GESTION B'!F374>=0,'GESTION B'!D374,\" \")","v":0}]
[{"$f":"IF('GESTION B'!F375<=0,'GESTION B'!A375,\" \")","v":"B1213"},{"$f":"IF('GESTION B'!F375<=0,'GESTION B'!B375,\" \")","v":0},{"$f":"IF('GESTION B'!F375>=0,'GESTION B'!C375,\" \")","v":0},{"$f":"IF('GESTION B'!F375>=0,'GESTION B'!D375,\" \")","v":0}]
[{"$f":"IF('GESTION B'!F376<=0,'GESTION B'!A376,\" \")","v":"B1214"},{"$f":"IF('GESTION B'!F376<=0,'GESTION B'!B376,\" \")","v":0},{"$f":"IF('GESTION B'!F376>=0,'GESTION B'!C376,\" \")","v":0},{"$f":"IF('GESTION B'!F376>=0,'GESTION B'!D376,\" \")","v":0}]
[{"$f":"IF('GESTION B'!F377<=0,'GESTION B'!A377,\" \")","v":"B1215"},{"$f":"IF('GESTION B'!F377<=0,'GESTION B'!B377,\" \")","v":0},{"$f":"IF('GESTION B'!F377>=0,'GESTION B'!C377,\" \")","v":0},{"$f":"IF('GESTION B'!F377>=0,'GESTION B'!D377,\" \")","v":0}]
[{"$f":"IF('GESTION B'!F378<=0,'GESTION B'!A378,\" \")","v":"B1216"},{"$f":"IF('GESTION B'!F378<=0,'GESTION B'!B378,\" \")","v":0},{"$f":"IF('GESTION B'!F378>=0,'GESTION B'!C378,\" \")","v":0},{"$f":"IF('GESTION B'!F378>=0,'GESTION B'!D378,\" \")","v":0}]
[{"$f":"IF('GESTION B'!F379<=0,'GESTION B'!A379,\" \")","v":"B1217"},{"$f":"IF('GESTION B'!F379<=0,'GESTION B'!B379,\" \")","v":0},{"$f":"IF('GESTION B'!F379>=0,'GESTION B'!C379,\" \")","v":0},{"$f":"IF('GESTION B'!F379>=0,'GESTION B'!D379,\" \")","v":0}]
[{"$f":"IF('GESTION B'!F380<=0,'GESTION B'!A380,\" \")","v":"B1218"},{"$f":"IF('GESTION B'!F380<=0,'GESTION B'!B380,\" \")","v":0},{"$f":"IF('GESTION B'!F380>=0,'GESTION B'!C380,\" \")","v":0},{"$f":"IF('GESTION B'!F380>=0,'GESTION B'!D380,\" \")","v":0}]
[{"$f":"IF('GESTION B'!F381<=0,'GESTION B'!A381,\" \")","v":"B1219"},{"$f":"IF('GESTION B'!F381<=0,'GESTION B'!B381,\" \")","v":0},{"$f":"IF('GESTION B'!F381>=0,'GESTION B'!C381,\" \")","v":0},{"$f":"IF('GESTION B'!F381>=0,'GESTION B'!D381,\" \")","v":0}]
[{"$f":"IF('GESTION B'!F382<=0,'GESTION B'!A382,\" \")","v":"B1220"},{"$f":"IF('GESTION B'!F382<=0,'GESTION B'!B382,\" \")","v":0},{"$f":"IF('GESTION B'!F382>=0,'GESTION B'!C382,\" \")","v":0},{"$f":"IF('GESTION B'!F382>=0,'GESTION B'!D382,\" \")","v":0}]
[{"$f":"IF('GESTION B'!F383<=0,'GESTION B'!A383,\" \")","v":"B1221"},{"$f":"IF('GESTION B'!F383<=0,'GESTION B'!B383,\" \")","v":0},{"$f":"IF('GESTION B'!F383>=0,'GESTION B'!C383,\" \")","v":0},{"$f":"IF('GESTION B'!F383>=0,'GESTION B'!D383,\" \")","v":0}]
[{"$f":"IF('GESTION B'!F384<=0,'GESTION B'!A384,\" \")","v":"B1222"},{"$f":"IF('GESTION B'!F384<=0,'GESTION B'!B384,\" \")","v":0},{"$f":"IF('GESTION B'!F384>=0,'GESTION B'!C384,\" \")","v":0},{"$f":"IF('GESTION B'!F384>=0,'GESTION B'!D384,\" \")","v":0}]
[{"$f":"IF('GESTION B'!F385<=0,'GESTION B'!A385,\" \")","v":"B1223"},{"$f":"IF('GESTION B'!F385<=0,'GESTION B'!B385,\" \")","v":0},{"$f":"IF('GESTION B'!F385>=0,'GESTION B'!C385,\" \")","v":0},{"$f":"IF('GESTION B'!F385>=0,'GESTION B'!D385,\" \")","v":0}]
[{"$f":"IF('GESTION B'!F386<=0,'GESTION B'!A386,\" \")","v":"B1224"},{"$f":"IF('GESTION B'!F386<=0,'GESTION B'!B386,\" \")","v":0},{"$f":"IF('GESTION B'!F386>=0,'GESTION B'!C386,\" \")","v":0},{"$f":"IF('GESTION B'!F386>=0,'GESTION B'!D386,\" \")","v":0}]
[{"$f":"IF('GESTION B'!F388<=0,'GESTION B'!A388,\" \")","v":" "},{"$f":"IF('GESTION B'!F388<=0,'GESTION B'!B388,\" \")","v":" "},{"$f":"IF('GESTION B'!F388>=0,'GESTION B'!C388,\" \")","v":"MT3040"},{"$f":"IF('GESTION B'!F388>=0,'GESTION B'!D388,\" \")","v":"EBAUCHE"}]
[{"$f":"IF('GESTION B'!F389<=0,'GESTION B'!A389,\" \")","v":" "},{"$f":"IF('GESTION B'!F389<=0,'GESTION B'!B389,\" \")","v":" "},{"$f":"IF('GESTION B'!F389>=0,'GESTION B'!C389,\" \")","v":"GN13"},{"$f":"IF('GESTION B'!F389>=0,'GESTION B'!D389,\" \")","v":"CONE REDUCTION EBAUCHE"}]
[{"$f":"IF('GESTION B'!F390<=0,'GESTION B'!A390,\" \")","v":" "},{"$f":"IF('GESTION B'!F390<=0,'GESTION B'!B390,\" \")","v":" "},{"$f":"IF('GESTION B'!F390>=0,'GESTION B'!C390,\" \")","v":"GN13"},{"$f":"IF('GESTION B'!F390>=0,'GESTION B'!D390,\" \")","v":"CONE REDUCTION EBAUCHE"}]
[{"$f":"IF('GESTION B'!F391<=0,'GESTION B'!A391,\" \")","v":" "},{"$f":"IF('GESTION B'!F391<=0,'GESTION B'!B391,\" \")","v":" "},{"$f":"IF('GESTION B'!F391>=0,'GESTION B'!C391,\" \")","v":"PN11"},{"$f":"IF('GESTION B'!F391>=0,'GESTION B'!D391,\" \")","v":"CONE REDUCTION EBAUCHE"}]
[{"$f":"IF('GESTION B'!F392<=0,'GESTION B'!A392,\" \")","v":" "},{"$f":"IF('GESTION B'!F392<=0,'GESTION B'!B392,\" \")","v":" "},{"$f":"IF('GESTION B'!F392>=0,'GESTION B'!C392,\" \")","v":"PN11"},{"$f":"IF('GESTION B'!F392>=0,'GESTION B'!D392,\" \")","v":"CONE REDUCTION EBAUCHE"}]
[{"$f":"IF('GESTION B'!F393<=0,'GESTION B'!A393,\" \")","v":" "},{"$f":"IF('GESTION B'!F393<=0,'GESTION B'!B393,\" \")","v":" "},{"$f":"IF('GESTION B'!F393>=0,'GESTION B'!C393,\" \")","v":"5012836 - 102"},{"$f":"IF('GESTION B'!F393>=0,'GESTION B'!D393,\" \")","v":"CONE REDUCTION EBAUCHE"}]
[{"$f":"IF('GESTION B'!F394<=0,'GESTION B'!A394,\" \")","v":" "},{"$f":"IF('GESTION B'!F394<=0,'GESTION B'!B394,\" \")","v":" "},{"$f":"IF('GESTION B'!F394>=0,'GESTION B'!C394,\" \")","v":"5012836 - 101"},{"$f":"IF('GESTION B'!F394>=0,'GESTION B'!D394,\" \")","v":"REDUCTION MATRICE"}]
[{"$f":"IF('GESTION B'!F395<=0,'GESTION B'!A395,\" \")","v":" "},{"$f":"IF('GESTION B'!F395<=0,'GESTION B'!B395,\" \")","v":" "},{"$f":"IF('GESTION B'!F395>=0,'GESTION B'!C395,\" \")","v":"Ø113X26,5"},{"$f":"IF('GESTION B'!F395>=0,'GESTION B'!D395,\" \")","v":"EBAUCHE"}]
[{"$f":"IF('GESTION B'!F396<=0,'GESTION B'!A396,\" \")","v":" "},{"$f":"IF('GESTION B'!F396<=0,'GESTION B'!B396,\" \")","v":" "},{"$f":"IF('GESTION B'!F396>=0,'GESTION B'!C396,\" \")","v":"Ø113XDIVERS"},{"$f":"IF('GESTION B'!F396>=0,'GESTION B'!D396,\" \")","v":"EBAUCHE"}]
[{"$f":"IF('GESTION B'!F397<=0,'GESTION B'!A397,\" \")","v":" "},{"$f":"IF('GESTION B'!F397<=0,'GESTION B'!B397,\" \")","v":" "},{"$f":"IF('GESTION B'!F397>=0,'GESTION B'!C397,\" \")","v":"M44"},{"$f":"IF('GESTION B'!F397>=0,'GESTION B'!D397,\" \")","v":"EBAUCHE PERCEE Ø23,5 2 REPERES 4 et 5"}]
[{"$f":"IF('GESTION B'!F399<=0,'GESTION B'!A399,\" \")","v":" "},{"$f":"IF('GESTION B'!F399<=0,'GESTION B'!B399,\" \")","v":" "},{"$f":"IF('GESTION B'!F399>=0,'GESTION B'!C399,\" \")","v":"P NUM C30"},{"$f":"IF('GESTION B'!F399>=0,'GESTION B'!D399,\" \")","v":"EBAUCHE Ø21,5 FRAISEE L 6 + GOUPILLAGE"}]
[{"$f":"IF('GESTION B'!F400<=0,'GESTION B'!A400,\" \")","v":" "},{"$f":"IF('GESTION B'!F400<=0,'GESTION B'!B400,\" \")","v":" "},{"$f":"IF('GESTION B'!F400>=0,'GESTION B'!C400,\" \")","v":"P NUM C30"},{"$f":"IF('GESTION B'!F400>=0,'GESTION B'!D400,\" \")","v":"EBAUCHE Ø29 FRAISEE L 6 + GOUPILLAGE"}]
[{"$f":"IF('GESTION B'!F401<=0,'GESTION B'!A401,\" \")","v":"B1312"},{"$f":"IF('GESTION B'!F401<=0,'GESTION B'!B401,\" \")","v":0},{"$f":"IF('GESTION B'!F401>=0,'GESTION B'!C401,\" \")","v":0},{"$f":"IF('GESTION B'!F401>=0,'GESTION B'!D401,\" \")","v":0}]
[{"$f":"IF('GESTION B'!F402<=0,'GESTION B'!A402,\" \")","v":"B1313"},{"$f":"IF('GESTION B'!F402<=0,'GESTION B'!B402,\" \")","v":0},{"$f":"IF('GESTION B'!F402>=0,'GESTION B'!C402,\" \")","v":0},{"$f":"IF('GESTION B'!F402>=0,'GESTION B'!D402,\" \")","v":0}]
[{"$f":"IF('GESTION B'!F403<=0,'GESTION B'!A403,\" \")","v":"B1314"},{"$f":"IF('GESTION B'!F403<=0,'GESTION B'!B403,\" \")","v":0},{"$f":"IF('GESTION B'!F403>=0,'GESTION B'!C403,\" \")","v":0},{"$f":"IF('GESTION B'!F403>=0,'GESTION B'!D403,\" \")","v":0}]
[{"$f":"IF('GESTION B'!F404<=0,'GESTION B'!A404,\" \")","v":" "},{"$f":"IF('GESTION B'!F404<=0,'GESTION B'!B404,\" \")","v":" "},{"$f":"IF('GESTION B'!F404>=0,'GESTION B'!C404,\" \")","v":"C31,5"},{"$f":"IF('GESTION B'!F404>=0,'GESTION B'!D404,\" \")","v":"EBAUCHE FRAISEE"}]
[{"$f":"IF('GESTION B'!F406<=0,'GESTION B'!A406,\" \")","v":"B1316"},{"$f":"IF('GESTION B'!F406<=0,'GESTION B'!B406,\" \")","v":0},{"$f":"IF('GESTION B'!F406>=0,'GESTION B'!C406,\" \")","v":0},{"$f":"IF('GESTION B'!F406>=0,'GESTION B'!D406,\" \")","v":0}]
[{"$f":"IF('GESTION B'!F407<=0,'GESTION B'!A407,\" \")","v":"B1317"},{"$f":"IF('GESTION B'!F407<=0,'GESTION B'!B407,\" \")","v":0},{"$f":"IF('GESTION B'!F407>=0,'GESTION B'!C407,\" \")","v":0},{"$f":"IF('GESTION B'!F407>=0,'GESTION B'!D407,\" \")","v":0}]
[{"$f":"IF('GESTION B'!F408<=0,'GESTION B'!A408,\" \")","v":"B1318"},{"$f":"IF('GESTION B'!F408<=0,'GESTION B'!B408,\" \")","v":0},{"$f":"IF('GESTION B'!F408>=0,'GESTION B'!C408,\" \")","v":0},{"$f":"IF('GESTION B'!F408>=0,'GESTION B'!D408,\" \")","v":0}]
[{"$f":"IF('GESTION B'!F409<=0,'GESTION B'!A409,\" \")","v":"B1319"},{"$f":"IF('GESTION B'!F409<=0,'GESTION B'!B409,\" \")","v":0},{"$f":"IF('GESTION B'!F409>=0,'GESTION B'!C409,\" \")","v":0},{"$f":"IF('GESTION B'!F409>=0,'GESTION B'!D409,\" \")","v":0}]
[{"$f":"IF('GESTION B'!F410<=0,'GESTION B'!A410,\" \")","v":"B1320"},{"$f":"IF('GESTION B'!F410<=0,'GESTION B'!B410,\" \")","v":0},{"$f":"IF('GESTION B'!F410>=0,'GESTION B'!C410,\" \")","v":0},{"$f":"IF('GESTION B'!F410>=0,'GESTION B'!D410,\" \")","v":0}]
[{"$f":"IF('GESTION B'!F411<=0,'GESTION B'!A411,\" \")","v":"B1321"},{"$f":"IF('GESTION B'!F411<=0,'GESTION B'!B411,\" \")","v":0},{"$f":"IF('GESTION B'!F411>=0,'GESTION B'!C411,\" \")","v":0},{"$f":"IF('GESTION B'!F411>=0,'GESTION B'!D411,\" \")","v":0}]
[{"$f":"IF('GESTION B'!F412<=0,'GESTION B'!A412,\" \")","v":"B1322"},{"$f":"IF('GESTION B'!F412<=0,'GESTION B'!B412,\" \")","v":0},{"$f":"IF('GESTION B'!F412>=0,'GESTION B'!C412,\" \")","v":0},{"$f":"IF('GESTION B'!F412>=0,'GESTION B'!D412,\" \")","v":0}]
[{"$f":"IF('GESTION B'!F413<=0,'GESTION B'!A413,\" \")","v":"B1323"},{"$f":"IF('GESTION B'!F413<=0,'GESTION B'!B413,\" \")","v":0},{"$f":"IF('GESTION B'!F413>=0,'GESTION B'!C413,\" \")","v":0},{"$f":"IF('GESTION B'!F413>=0,'GESTION B'!D413,\" \")","v":0}]
[{"$f":"IF('GESTION B'!F414<=0,'GESTION B'!A414,\" \")","v":"B1324"},{"$f":"IF('GESTION B'!F414<=0,'GESTION B'!B414,\" \")","v":0},{"$f":"IF('GESTION B'!F414>=0,'GESTION B'!C414,\" \")","v":0},{"$f":"IF('GESTION B'!F414>=0,'GESTION B'!D414,\" \")","v":0}]
[{"$f":"IF('GESTION B'!F415<=0,'GESTION B'!A415,\" \")","v":"B1325"},{"$f":"IF('GESTION B'!F415<=0,'GESTION B'!B415,\" \")","v":0},{"$f":"IF('GESTION B'!F415>=0,'GESTION B'!C415,\" \")","v":0},{"$f":"IF('GESTION B'!F415>=0,'GESTION B'!D415,\" \")","v":0}]
[{"$f":"IF('GESTION B'!F416<=0,'GESTION B'!A416,\" \")","v":0},{"$f":"IF('GESTION B'!F416<=0,'GESTION B'!B416,\" \")","v":0},{"$f":"IF('GESTION B'!F416>=0,'GESTION B'!C416,\" \")","v":0},{"$f":"IF('GESTION B'!F416>=0,'GESTION B'!D416,\" \")","v":0}]
[{"$f":"IF('GESTION B'!F417<=0,'GESTION B'!A417,\" \")","v":0},{"$f":"IF('GESTION B'!F417<=0,'GESTION B'!B417,\" \")","v":0},{"$f":"IF('GESTION B'!F417>=0,'GESTION B'!C417,\" \")","v":0},{"$f":"IF('GESTION B'!F417>=0,'GESTION B'!D417,\" \")","v":0}]
[{"$f":"IF('GESTION B'!F418<=0,'GESTION B'!A418,\" \")","v":0},{"$f":"IF('GESTION B'!F418<=0,'GESTION B'!B418,\" \")","v":0},{"$f":"IF('GESTION B'!F418>=0,'GESTION B'!C418,\" \")","v":0},{"$f":"IF('GESTION B'!F418>=0,'GESTION B'!D418,\" \")","v":0}]
[{"$f":"IF('GESTION B'!F419<=0,'GESTION B'!A419,\" \")","v":0},{"$f":"IF('GESTION B'!F419<=0,'GESTION B'!B419,\" \")","v":0},{"$f":"IF('GESTION B'!F419>=0,'GESTION B'!C419,\" \")","v":0},{"$f":"IF('GESTION B'!F419>=0,'GESTION B'!D419,\" \")","v":0}]
[{"$f":"IF('GESTION B'!F420<=0,'GESTION B'!A420,\" \")","v":0},{"$f":"IF('GESTION B'!F420<=0,'GESTION B'!B420,\" \")","v":0},{"$f":"IF('GESTION B'!F420>=0,'GESTION B'!C420,\" \")","v":0},{"$f":"IF('GESTION B'!F420>=0,'GESTION B'!D420,\" \")","v":0}]
[{"$f":"IF('GESTION B'!F421<=0,'GESTION B'!A421,\" \")","v":0},{"$f":"IF('GESTION B'!F421<=0,'GESTION B'!B421,\" \")","v":0},{"$f":"IF('GESTION B'!F421>=0,'GESTION B'!C421,\" \")","v":0},{"$f":"IF('GESTION B'!F421>=0,'GESTION B'!D421,\" \")","v":0}]
[{"$f":"IF('GESTION B'!F422<=0,'GESTION B'!A422,\" \")","v":0},{"$f":"IF('GESTION B'!F422<=0,'GESTION B'!B422,\" \")","v":0},{"$f":"IF('GESTION B'!F422>=0,'GESTION B'!C422,\" \")","v":0},{"$f":"IF('GESTION B'!F422>=0,'GESTION B'!D422,\" \")","v":0}]
[{"$f":"IF('GESTION B'!F423<=0,'GESTION B'!A423,\" \")","v":0},{"$f":"IF('GESTION B'!F423<=0,'GESTION B'!B423,\" \")","v":0},{"$f":"IF('GESTION B'!F423>=0,'GESTION B'!C423,\" \")","v":0},{"$f":"IF('GESTION B'!F423>=0,'GESTION B'!D423,\" \")","v":0}]
[{"$f":"IF('GESTION B'!F424<=0,'GESTION B'!A424,\" \")","v":0},{"$f":"IF('GESTION B'!F424<=0,'GESTION B'!B424,\" \")","v":0},{"$f":"IF('GESTION B'!F424>=0,'GESTION B'!C424,\" \")","v":0},{"$f":"IF('GESTION B'!F424>=0,'GESTION B'!D424,\" \")","v":0}]
[{"$f":"IF('GESTION B'!F425<=0,'GESTION B'!A425,\" \")","v":0},{"$f":"IF('GESTION B'!F425<=0,'GESTION B'!B425,\" \")","v":0},{"$f":"IF('GESTION B'!F425>=0,'GESTION B'!C425,\" \")","v":0},{"$f":"IF('GESTION B'!F425>=0,'GESTION B'!D425,\" \")","v":0}]
[{"$f":"IF('GESTION B'!F426<=0,'GESTION B'!A426,\" \")","v":0},{"$f":"IF('GESTION B'!F426<=0,'GESTION B'!B426,\" \")","v":0},{"$f":"IF('GESTION B'!F426>=0,'GESTION B'!C426,\" \")","v":0},{"$f":"IF('GESTION B'!F426>=0,'GESTION B'!D426,\" \")","v":0}]
[{"$f":"IF('GESTION B'!F427<=0,'GESTION B'!A427,\" \")","v":0},{"$f":"IF('GESTION B'!F427<=0,'GESTION B'!B427,\" \")","v":0},{"$f":"IF('GESTION B'!F427>=0,'GESTION B'!C427,\" \")","v":0},{"$f":"IF('GESTION B'!F427>=0,'GESTION B'!D427,\" \")","v":0}]
[{"$f":"IF('GESTION B'!F428<=0,'GESTION B'!A428,\" \")","v":0},{"$f":"IF('GESTION B'!F428<=0,'GESTION B'!B428,\" \")","v":0},{"$f":"IF('GESTION B'!F428>=0,'GESTION B'!C428,\" \")","v":0},{"$f":"IF('GESTION B'!F428>=0,'GESTION B'!D428,\" \")","v":0}]
[{"$f":"IF('GESTION B'!F429<=0,'GESTION B'!A429,\" \")","v":0},{"$f":"IF('GESTION B'!F429<=0,'GESTION B'!B429,\" \")","v":0},{"$f":"IF('GESTION B'!F429>=0,'GESTION B'!C429,\" \")","v":0},{"$f":"IF('GESTION B'!F429>=0,'GESTION B'!D429,\" \")","v":0}]
[{"$f":"IF('GESTION B'!F430<=0,'GESTION B'!A430,\" \")","v":0},{"$f":"IF('GESTION B'!F430<=0,'GESTION B'!B430,\" \")","v":0},{"$f":"IF('GESTION B'!F430>=0,'GESTION B'!C430,\" \")","v":0},{"$f":"IF('GESTION B'!F430>=0,'GESTION B'!D430,\" \")","v":0}]
[{"$f":"IF('GESTION B'!F431<=0,'GESTION B'!A431,\" \")","v":0},{"$f":"IF('GESTION B'!F431<=0,'GESTION B'!B431,\" \")","v":0},{"$f":"IF('GESTION B'!F431>=0,'GESTION B'!C431,\" \")","v":0},{"$f":"IF('GESTION B'!F431>=0,'GESTION B'!D431,\" \")","v":0}]
[{"$f":"IF('GESTION B'!F432<=0,'GESTION B'!A432,\" \")","v":0},{"$f":"IF('GESTION B'!F432<=0,'GESTION B'!B432,\" \")","v":0},{"$f":"IF('GESTION B'!F432>=0,'GESTION B'!C432,\" \")","v":0},{"$f":"IF('GESTION B'!F432>=0,'GESTION B'!D432,\" \")","v":0}]
[{"$f":"IF('GESTION B'!F433<=0,'GESTION B'!A433,\" \")","v":0},{"$f":"IF('GESTION B'!F433<=0,'GESTION B'!B433,\" \")","v":0},{"$f":"IF('GESTION B'!F433>=0,'GESTION B'!C433,\" \")","v":0},{"$f":"IF('GESTION B'!F433>=0,'GESTION B'!D433,\" \")","v":0}]
[{"$f":"IF('GESTION B'!F434<=0,'GESTION B'!A434,\" \")","v":0},{"$f":"IF('GESTION B'!F434<=0,'GESTION B'!B434,\" \")","v":0},{"$f":"IF('GESTION B'!F434>=0,'GESTION B'!C434,\" \")","v":0},{"$f":"IF('GESTION B'!F434>=0,'GESTION B'!D434,\" \")","v":0}]
[{"$f":"IF('GESTION B'!F435<=0,'GESTION B'!A435,\" \")","v":0},{"$f":"IF('GESTION B'!F435<=0,'GESTION B'!B435,\" \")","v":0},{"$f":"IF('GESTION B'!F435>=0,'GESTION B'!C435,\" \")","v":0},{"$f":"IF('GESTION B'!F435>=0,'GESTION B'!D435,\" \")","v":0}]
[{"$f":"IF('GESTION B'!F436<=0,'GESTION B'!A436,\" \")","v":0},{"$f":"IF('GESTION B'!F436<=0,'GESTION B'!B436,\" \")","v":0},{"$f":"IF('GESTION B'!F436>=0,'GESTION B'!C436,\" \")","v":0},{"$f":"IF('GESTION B'!F436>=0,'GESTION B'!D436,\" \")","v":0}]
[{"$f":"IF('GESTION B'!F437<=0,'GESTION B'!A437,\" \")","v":0},{"$f":"IF('GESTION B'!F437<=0,'GESTION B'!B437,\" \")","v":0},{"$f":"IF('GESTION B'!F437>=0,'GESTION B'!C437,\" \")","v":0},{"$f":"IF('GESTION B'!F437>=0,'GESTION B'!D437,\" \")","v":0}]
[{"$f":"IF('GESTION B'!F438<=0,'GESTION B'!A438,\" \")","v":0},{"$f":"IF('GESTION B'!F438<=0,'GESTION B'!B438,\" \")","v":0},{"$f":"IF('GESTION B'!F438>=0,'GESTION B'!C438,\" \")","v":0},{"$f":"IF('GESTION B'!F438>=0,'GESTION B'!D438,\" \")","v":0}]
[{"$f":"IF('GESTION B'!F439<=0,'GESTION B'!A439,\" \")","v":0},{"$f":"IF('GESTION B'!F439<=0,'GESTION B'!B439,\" \")","v":0},{"$f":"IF('GESTION B'!F439>=0,'GESTION B'!C439,\" \")","v":0},{"$f":"IF('GESTION B'!F439>=0,'GESTION B'!D439,\" \")","v":0}]
[{"$f":"IF('GESTION B'!F440<=0,'GESTION B'!A440,\" \")","v":0},{"$f":"IF('GESTION B'!F440<=0,'GESTION B'!B440,\" \")","v":0},{"$f":"IF('GESTION B'!F440>=0,'GESTION B'!C440,\" \")","v":0},{"$f":"IF('GESTION B'!F440>=0,'GESTION B'!D440,\" \")","v":0}]
[{"$f":"IF('GESTION B'!F441<=0,'GESTION B'!A441,\" \")","v":0},{"$f":"IF('GESTION B'!F441<=0,'GESTION B'!B441,\" \")","v":0},{"$f":"IF('GESTION B'!F441>=0,'GESTION B'!C441,\" \")","v":0},{"$f":"IF('GESTION B'!F441>=0,'GESTION B'!D441,\" \")","v":0}]
[{"$f":"IF('GESTION B'!F442<=0,'GESTION B'!A442,\" \")","v":0},{"$f":"IF('GESTION B'!F442<=0,'GESTION B'!B442,\" \")","v":0},{"$f":"IF('GESTION B'!F442>=0,'GESTION B'!C442,\" \")","v":0},{"$f":"IF('GESTION B'!F442>=0,'GESTION B'!D442,\" \")","v":0}]

{"sheet":"MACHINES ","index":5,"n_rows":36,"n_cols":7,"rows_kept":36,"cut":false,"hidden":false,"merged":[]}
[null,null,null,null,null,null,"MACHINES"]
[null,"ABL"]
[null,"ABL - PROFEL"]
[null,"ALFRA"]
[null,"ALPHYDRO"]
[null,"BOUTILLON"]
[null,"FICEP"]
[null,"GEKA"]
[null,"GEKA/PEDDY"]
[null,"IMAC"]
[null,"IMAC SELFER ALFRA"]
[null,"KINGSLAND"]
[null,"LOPIN"]
[null,"MUBEA"]
[null,"MUBEA/SUNRISE"]
[null,"PEDDY"]
[null,"PROFEL"]
[null,"ROUYER RC"]
[null,"SELFER"]
[null,"SIRUGUE"]
[null,"SOCLAM"]
[null,"SUNRISE"]
[null,"VERNET"]
[null,"IMS"]
[null,"SOMMER"]
[null,"ARMO-EDNOR"]
[null,"PROMAT/PROFEL"]
[null,"PROMAT"]
[null,"OMERA"]
[null,"DENHEZ/RASKIN"]
[null,"SCOTCHMAN"]
[null,"EDEL"]
[null,"SUP-GRAUVRE"]
[null,"IRES"]
[null,"HUVEMA"]
[null,"REY"]

{"sheet":"REFERENCES A","index":6,"n_rows":127,"n_cols":5,"rows_kept":127,"cut":false,"hidden":false,"merged":[]}
[null,null,null,null,"REFERENCES A"]
[null,"C14"]
[null,"C18"]
[null,"C22"]
[null,"CORPS 25"]
[null,"CORPS 32"]
[null,"CORPS 40"]
[]
[null,"EM300"]
[]
[null,"GM11"]
[null,"GM10"]
[null,"GM12"]
[null,"GM13"]
[null,"GM5"]
[null,"GM8"]
[null,"GN10"]
[null,"GN11"]
[null,"GN11A"]
[null,"GN12"]
[null,"GN12A"]
[null,"GN13"]
[null,"GN13A"]
[null,"GN5/27"]
[null,"GN5/30"]
[null,"GN6"]
[null,"GN8/31"]
[null,"GN8/40"]
[null,"LPA 8D"]
[null,"M110"]
[null,"M14"]
[null,"M164"]
[null,"M20"]
[null,"M22"]
[null,"M24"]
[null,"M24"]
[null,"M26"]
[null,"M28"]
[null,"M30"]
[null,"M30"]
[null,"M31"]
[null,"M32"]
[null,"M34"]
[null,"M34"]
[null,"M35"]
[null,"M38"]
[null,"M39"]
[null,"M40"]
[null,"M41"]
[null,"M45"]
[null,"M47"]
[null,"M48"]
[null,"M50"]
[null,"M50,8 P"]
[null,"M50,8"]
[null,"M55"]
[null,"M58"]
[null,"M70"]
[null,"M70"]
[null,"M95"]
[null,"MC79,37"]
[null,"MN2"]
[null,"MN20"]
[null,"MN3"]
[null,"MN4"]
[null,"MN6"]
[]
[null,"PA3000 POINCON"]
[null,"PA5000 MATRICE Ø38,1"]
[null,"PA5000 POINCON"]
[null,"PA5046 MATRICE Ø46"]
[null,"PC10"]
[null,"PC14"]
[null,"PC16"]
[null,"PC27"]
[null,"PC28"]
[null,"PC31"]
[null,"PC32"]
[null,"PC39,5"]
[null,"PC40"]
[null,"PC40"]
[null,"PC45"]
[null,"PC46"]
[null,"PC51"]
[null,"PED"]
[null,"PED 18"]
[null,"PED 20"]
[null,"PED 22"]
[null,"PED 25"]
[null,"PED 30"]
[null,"PED 36"]
[null,"PED36"]
[null,"PEMH"]
[null,"PG6"]
[null,"PN1"]
[null,"PN11"]
[null,"PN2"]
[null,"PN3"]
[null,"PN4"]
[null,"PN4 S"]
[null,"PN5"]
[null,"PN6"]
[null,"PN7"]
[]
[null,"SC1"]
[null,"SC2"]
[null,"SC3"]
[null,"SC4"]
[]
[null,"T22 MATRICE Ø31,7"]
[null,"T32 MATRICE Ø54"]
[null,"TRA"]
[null,"TRA1"]
[null,"TRA2"]
[null,"TRA3"]
[]
[null,"MATRICE 271"]
[null,"POINCON 272"]
[]
[null,"GN8/31A"]
[null,"GN6/30"]
[null,"GN8/31 DOUBLE"]
[null,"M73"]
[null,"GN5 DOUBLE"]
[null,"TRA30x45"]
[null,"TRA36X55"]
[null,"C20"]

{"sheet":"REFERENCES B","index":7,"n_rows":140,"n_cols":11,"rows_kept":140,"cut":false,"hidden":false,"merged":[]}
[null,null,null,null,null,"REFERENCES B"]
[]
[null,9001]
[null,9004]
[null,9006]
[null,9007]
[null,9009]
[null,9010]
[null,9011]
[null,9020]
[null,9022]
[null,9023]
[null,9024]
[null,9025]
[null,9026]
[]
[null,"5012836 - 101"]
[null,"5012836 - 102"]
[]
[null,"C10"]
[null,"C15"]
[null,"C20"]
[]
[null,"DEVETISSEUR "]
[]
[null,"ED50"]
[]
[null,"GN13"]
[null,"GP-P01-075-3"]
[null,"GP-P01-100-3"]
[null,"GR2"]
[null,"GR3"]
[null,"GR4"]
[]
[null,"M100"]
[null,"M110"]
[null,"M25"]
[null,"M30"]
[null,"M30"]
[null,"M35"]
[null,"M42"]
[null,"M45"]
[null,"M45"]
[null,"M54"]
[null,"M55"]
[null,"M60"]
[null,"M70"]
[null,"M80"]
[null,"M90"]
[null,"MAP M25 "]
[null,"MAP M35"]
[null,"MAP M42"]
[null,"MAP M55"]
[null,"MATRICE MN1"]
[null,"MATRICE SP"]
[]
[null,"Ø113X26,5"]
[null,"Ø113XDIVERS"]
[]
[null,"P. N°1 PG116/MAP AME"]
[null,"P. N°1 PG80"]
[null,"P. N°2"]
[null,"P. N°2 PG116/MAP AME"]
[null,"P. N°2 PG80"]
[null,"P. N°3"]
[null,"P. N°4"]
[null,"P. N°1"]
[null,"P24"]
[null,"P24 CE"]
[null,"P24 EXCENTRE"]
[null,"P24 SUPERIEUR Ø30"]
[null,"P25"]
[null,"P26"]
[null,"P40"]
[null,"P70"]
[null,"PED 25"]
[null,"PED 30"]
[null,"PG 41 "]
[null,"PG M55"]
[null,"PG M70"]
[null,"PN11"]
[null,"POINCON AM"]
[null,"POINCON MN1"]
[null,"POINCON MN2"]
[null,"POINCON MN3"]
[null,"POINCON SP"]
[]
[null,"RP4"]
[null,"RP5"]
[null,"RP6"]
[null,"RP8"]
[]
[null,"TIRANT PORTE MATRICE"]
[null,"TRI"]
[]
[null,"VP derniere  generation M24"]
[null,"VP derniere  generation M32"]
[null,"VP derniere  generation M38"]
[null,"VP derniere  generation M43"]
[null,"VP derniere  generation M48"]
[null,"VP M20 H6"]
[null,"VP M24 H7"]
[null,"VP M32 H8"]
[null,"VP M38 H10"]
[null,"VP M38 H9"]
[null,"VP M43 H10"]
[]
[null,"M44"]
[null,"M50,8"]
[null,"M79,5"]
[null,"M120"]
[null,"M150"]
[]
[null,"C52",null,null,null,null,null,null,null,null,"VP DERNIERE GENERATION M45"]
[]
[null,"MAP M70"]
[]
[null,"C22"]
[null,"C20"]
[null,"C30"]
[null,"VP DERNIERE GENERATION M45"]
[null,"M40"]
[null,"M34 HAUTE"]
[null,"VP M43 H10"]
[null,"P. N°1 PG116/MAP AMB"]
[null,"VP M46 H10"]
[null,"RETIS"]
[null,"P NUM C30"]
[null,"C31,5"]
[null,"C39"]
[null,"C35"]
[null,"M65"]
[null,"PC8 "]
[null,"TRA3454H18"]
[null,"MT3030"]
[null,"MT3040"]
[null,"5012836-189"]
[null,"5013058-M35"]
[null,"5013058-P14"]
[null,"2013058-M35H10"]

{"sheet":"REFERENCES C","index":8,"n_rows":81,"n_cols":2,"rows_kept":81,"cut":false,"hidden":false,"merged":[]}
[]
[]
[null,"P70"]
[null,"M40"]
[null,"P40"]
[null,"5013205-38"]
[null,"5012090+"]
[null,"5013710-1"]
[null,"5013090+"]
[null,"CORPS 34"]
[null,"CORPS 28"]
[null,"P CORPS 26 Lg45"]
[null,"b"]
[null,"c"]
[null,"a"]
[null,"b"]
[null,"c"]
[null,"a"]
[null,"b"]
[null,"c"]
[null,"a"]
[null,"b"]
[null,"c"]
[null,"a"]
[null,"b"]
[null,"c"]
[null,"a"]
[null,"b"]
[null,"c"]
[null,"a"]
[null,"b"]
[null,"c"]
[null,"a"]
[null,"b"]
[null,"c"]
[null,"a"]
[null,"b"]
[null,"c"]
[null,"a"]
[null,"b"]
[null,"c"]
[null,"a"]
[null,"b"]
[null,"c"]
[null,"a"]
[null,"b"]
[null,"c"]
[null,"a"]
[null,"b"]
[null,"c"]
[null,"a"]
[null,"b"]
[null,"c"]
[null,"a"]
[null,"b"]
[null,"c"]
[null,"a"]
[null,"b"]
[null,"c"]
[null,"a"]
[null,"b"]
[null,"c"]
[null,"a"]
[null,"b"]
[null,"c"]
[null,"a"]
[null,"b"]
[null,"c"]
[null,"a"]
[null,"b"]
[null,"c"]
[null,"a"]
[null,"b"]
[null,"c"]
[null,"a"]
[null,"b"]
[null,"c"]
[null,"a"]
[null,"b"]
[null,"c"]
[null,"a"]

{"sheet":"DESIGNATIONS","index":9,"n_rows":385,"n_cols":6,"rows_kept":385,"cut":false,"hidden":false,"merged":[]}
[null,null,null,null,null,"DESIGNATIONS"]
[null,"BONNET"]
[]
[null,"CANON EUROPEEN"]
[null,"CONE REDUCTION EBAUCHE"]
[null,"CORPS 101 1 ENCOCHE"]
[null,"CORPS 101 2 ENCOCHES"]
[null,"CORPS 18 Ø50 FRAISE"]
[null,"CORPS 18 Ø50 NON FRAISE"]
[null,"CORPS 20 Ø50 FRAISE"]
[null,"CORPS 20 Ø50 FRAISE SANS POINTE"]
[null,"CORPS 20 Ø60 FRAISE"]
[null,"CORPS 20 Ø70 FRAISE H30"]
[null,"CORPS 20 Ø70 FRAISE H40"]
[null,"CORPS 20 Ø70 FRAISE SANS POINTE"]
[null,"CORPS 22 Ø100 FRAISE H30"]
[null,"CORPS 22 Ø100 FRAISE H30 SANS POINTE"]
[null,"CORPS 22 Ø100 FRAISE H40 SANS POINTE"]
[null,"CORPS 22 Ø110 FRAISE  SANS POINTE"]
[null,"CORPS 22 Ø50 FRAISE H30"]
[null,"CORPS 22 Ø50 FRAISE H40"]
[null,"CORPS 22 Ø70 FRAISE H30"]
[null,"CORPS 22 Ø70 FRAISE H40"]
[null,"CORPS 80 1 ENCOCHE"]
[null,"CORPS 80 2 ENCOCHES"]
[null,"CORPS Ø24 PERCE 1 TROU Ø3"]
[null,"CORPS Ø24 PERCE 4 TROUS Ø3"]
[null,"CORPS Ø24 PERCE 4 TROUS Ø3 EXCENTRE"]
[null,"CORPS Ø25 PERCE 1 TROU Ø3"]
[null,"CORPS Ø26 PERCE 1 TROU Ø3"]
[]
[null,"DECHAUSSOIR"]
[]
[null,"EBAUCHE"]
[null,"EBAUCHE 1 FACE"]
[null,"EBAUCHE 1 REPERE"]
[null,"EBAUCHE 1 REPERE DERVAUX"]
[null,"EBAUCHE 1 REPERE ALESEE Ø30"]
[null,"EBAUCHE 1 REPERE FACE INCLINEE"]
[null,"EBAUCHE 1/4 ROND"]
[null,"EBAUCHE 1/4 ROND  L 40"]
[null,"EBAUCHE 1/4 ROND  L 50"]
[null,"EBAUCHE 1/4 ROND  L 55"]
[null,"EBAUCHE 1/4 ROND (VIEUX)"]
[null,"EBAUCHE 2 FACES"]
[null,"EBAUCHE 2 REPERES"]
[null,"EBAUCHE 2 REPERES 0° ET 45°"]
[null,"EBAUCHE 2 REPERES 1 PLAT"]
[null,"EBAUCHE 3 REPERES 0° 45° 90° "]
[null,"EBAUCHE AUDINOX"]
[null,"EBAUCHE CARRE 0° ET 45°"]
[null,"EBAUCHE CARRE 0° ET 90°"]
[null,"EBAUCHE CE"]
[null,"EBAUCHE DEPORTEE"]
[null,"EBAUCHE ED"]
[null,"EBAUCHE EXCENTREE"]
[null,"EBAUCHE FRAISEE"]
[null,"EBAUCHE FRAISEE 0 ET 45°"]
[null,"EBAUCHE FRAISEE 0 ET 45° CLAVETTE 4 MM"]
[null,"EBAUCHE FRAISEE 0 ET 45° CLAVETTE 6 MM"]
[null,"EBAUCHE FRAISEE 0 ET 90°"]
[null,"EBAUCHE FRAISEE 0° ET 90° L32"]
[null,"EBAUCHE FRAISEE 1 ENCOCHE"]
[null,"EBAUCHE FRAISEE 2 ENCOCHES"]
[null,"EBAUCHE FRAISEE 2 ENCOCHES 0 ET 180°"]
[null,"EBAUCHE FRAISEE 26,4"]
[null,"EBAUCHE FRAISEE 27"]
[null,"EBAUCHE FRAISEE 31,5"]
[null,"EBAUCHE FRAISEE 32"]
[null,"EBAUCHE FRAISEE CLAVETTE 4 MM"]
[null,"EBAUCHE FRAISEE CLAVETTE 6 MM"]
[null,"EBAUCHE FRAISEE CORPS 27"]
[null,"EBAUCHE FRAISEE CORPS 31"]
[null,"EBAUCHE FRAISEE CORPS 41"]
[null,"EBAUCHE FRAISEE CORPS 58,5"]
[null,"EBAUCHE FRAISEE CORPS 60"]
[null,"EBAUCHE FRAISEE CROIX L4"]
[null,"EBAUCHE FRAISEE CROIX L8"]
[null,"EBAUCHE FRAISEE ERGOT 8 AVEC MOUCHE"]
[null,"EBAUCHE FRAISEE ERGOT 8 SANS MOUCHE"]
[null,"EBAUCHE FRAISEE EXCENTREE"]
[null,"EBAUCHE FRAISEE L…"]
[null,"EBAUCHE FRAISEE L100"]
[null,"EBAUCHE FRAISEE L106"]
[null,"EBAUCHE FRAISEE L110"]
[null,"EBAUCHE FRAISEE L120"]
[null,"EBAUCHE FRAISEE L130"]
[null,"EBAUCHE FRAISEE L140"]
[null,"EBAUCHE FRAISEE L4"]
[null,"EBAUCHE FRAISEE L55"]
[null,"EBAUCHE FRAISEE L 60"]
[null,"EBAUCHE FRAISEE L61"]
[null,"EBAUCHE FRAISEE L70"]
[null,"EBAUCHE FRAISEE L74"]
[null,"EBAUCHE FRAISEE L8"]
[null,"EBAUCHE FRAISEE L80"]
[null,"EBAUCHE FRAISEE L85"]
[null,"EBAUCHE FRAISEE L86"]
[null,"EBAUCHE FRAISEE L87"]
[null,"EBAUCHE FRAISEE L90"]
[null,"EBAUCHE FRAISEE L95"]
[null,"EBAUCHE FRAISEE L97"]
[null,"EBAUCHE FRAISEE NON PERCEE"]
[null,"EBAUCHE FRAISEE Ø24"]
[null,"EBAUCHE FRAISEE Ø26"]
[null,"EBAUCHE FRAISEE Ø34"]
[null,"EBAUCHE FRAISEE Ø40"]
[null,"EBAUCHE FRAISEE PERCEE"]
[null,"EBAUCHE FRAISEE PERCEE 0° ET 45°"]
[null,"EBAUCHE FRAISEE PERCEE Ø36 0° ET 90°"]
[null,"EBAUCHE FRAISEE PERCEE 0° ET 90°"]
[null,"EBAUCHE FRAISEE PERCEE 0° ET 90° L30"]
[null,"EBAUCHE FRAISEE PERCEE 0° ET 90° L32"]
[null,"EBAUCHE FRAISEE PERCEE Ø3"]
[null,"EBAUCHE FRAISEE PERCEE Ø3 0° ET 90°"]
[null,"EBAUCHE FRAISEE SANS POINTE"]
[null,"EBAUCHE FRAISEE SUPERIEUR"]
[null,"EBAUCHE FRAISEE SUPERIEUR Ø55"]
[null,"EBAUCHE FRAISEE SUPERIEUR Ø60"]
[null,"EBAUCHE IPN "]
[null,"EBAUCHE IPN FRAISEE"]
[null,"EBAUCHE MATRICE DEGAGEE"]
[null,"EBAUCHE NON FRAISEE"]
[null,"EBAUCHE NON FRAISEE Ø10"]
[null,"EBAUCHE NON FRAISEE Ø6"]
[null,"EBAUCHE NON TOURNEE"]
[null,"EBAUCHE NON TOURNEE L98"]
[null,"EBAUCHE Ø26"]
[null,"EBAUCHE Ø27"]
[null,"EBAUCHE Ø30"]
[null,"EBAUCHE Ø32 L30"]
[null,"EBAUCHE Ø32 L32"]
[null,"EBAUCHE Ø34"]
[null,"EBAUCHE Ø40"]
[null,"EBAUCHE Ø90 H70"]
[null,"EBAUCHE PERCEE"]
[null,"EBAUCHE PERCEE 1 REPERE"]
[null,"EBAUCHE PERCEE 1 REPERE FACE INCLINEE"]
[null,"EBAUCHE PERCEE 2 REPERES 0° ET 180°"]
[null,"EBAUCHE PERCEE 2 REPERES 0° ET 90°"]
[null,"EBAUCHE PERCEE 4 REPERES"]
[null,"EBAUCHE PERCEE Ø16"]
[null,"EBAUCHE PERCEE Ø20"]
[null,"EBAUCHE PERCEE Ø22"]
[null,"EBAUCHE PERCEE Ø28"]
[null,"EBAUCHE PERCEE Ø31"]
[null,"EBAUCHE PERCEE Ø35"]
[null,"EBAUCHE PERCEE Ø24 2 REPERES 0° - 90°"]
[null,"EBAUCHE PERCEE Ø26 2 REPERES 0° - 90°"]
[null,"EBAUCHE PERCEE Ø29 2 REPERES 0° - 90°"]
[null,"EBAUCHE PERCEE Ø3"]
[null,"EBAUCHE PERCEE Ø3 2 REPERES 0° ET 90°"]
[null,"EBAUCHE PERCEE Ø3 3 REPERES 0° 45° 90°"]
[null,"EBAUCHE PERCEE Ø30 4 REPERES"]
[null,"EBAUCHE RAINURE CIRCULAIRE"]
[null,"EBAUCHE RAINURE FRAISEE"]
[null,"EBAUCHE RAINURE FRAISEE 0° ET 90°"]
[null,"EBAUCHE RAINURE FRAISEE 1 RAINURE"]
[null,"EBAUCHE RAINURE FRAISEE PERCEE 0° ET 45° "]
[null,"EBAUCHE RAINURE FRAISEE PERCEE 0° ET 90° "]
[null,"EBAUCHE SCS"]
[null,"EBAUCHE SUPERIEUR"]
[null,"EBAUCHE SUPERIEUR 2 REPERES"]
[null,"EBAUCHE SUPERIEUR Ø20 "]
[null,"EBAUCHE SUPERIEUR Ø20 1 REPERE"]
[null,"EBAUCHE SUPERIEUR Ø20 2 REPERES"]
[null,"EBAUCHE SUPERIEUR Ø30 1 REPERE"]
[null,"EBAUCHE SUPERIEUR Ø30 2 REPERES"]
[null,"EBAUCHE SUPERIEUR TREMPEE"]
[null,"EBAUCHE TOUT VENANT"]
[null,"EBAUCHE UPN"]
[null,"EBAUCHE UPN FRAISEE"]
[]
[null,"M14"]
[null,"M95"]
[null,"MATRICE EBAUCHE"]
[null,"MIXTE"]
[null,"MOLETTE DROITE"]
[null,"MOLETTE GAUCHE "]
[]
[null,"N°1"]
[null,"N°3"]
[null,"N°3 CANON EUROPEEN"]
[null,"NEZ DE BROCHE Ø30"]
[]
[null,"Ø102"]
[null,"Ø102 LONGUEUR + 20MM"]
[null,"Ø110"]
[null,"Ø26"]
[null,"Ø30"]
[null,"Ø50"]
[null,"Ø50 FRAISEE 0° ET 90°"]
[null,"Ø50 LONGUEUR + 10 MM"]
[null,"Ø55"]
[null,"Ø80"]
[null,"Ø80"]
[null,"Ø90"]
[null,"Ø98"]
[]
[null,"PED 22 LONG Ø22"]
[null,"PED 22 LONG Ø40"]
[null,"POINCON EBAUCHE"]
[]
[null,"REDUCTION MATRICE"]
[]
[null,"SOUS TIGE"]
[null,"SOUS TIGE 100"]
[null,"SOUS TIGE 108"]
[null,"SOUS TIGE 60"]
[null,"SOUS TIGE 64"]
[null,"SOUS TIGE 65"]
[null,"SUPERIEUR CORPS 19,5"]
[null,"SUPERIEUR CORPS 20"]
[]
[null,"TIRANT DROIT"]
[null,"TIRANT GAUCHE"]
[null,"TIRANT PORTE MATRICE 428"]
[null,"TRA1"]
[]
[null,"Ø10"]
[null,"Ø11"]
[null,"Ø12"]
[null,"Ø13"]
[null,"Ø14"]
[null,"Ø15"]
[null,"Ø16"]
[null,"Ø17"]
[null,"Ø18"]
[null,"Ø19"]
[null,"Ø20"]
[null,"Ø22"]
[null,"Ø23"]
[null,"Ø24"]
[null,"Ø25"]
[null,"Ø30"]
[null,"Ø27"]
[null,"Ø28"]
[null,"Ø28,5"]
[null,"Ø29"]
[null,"Ø30"]
[null,"Ø31,5"]
[null,"Ø31"]
[null,"Ø32"]
[null,"Ø33"]
[null,"Ø34"]
[null,"Ø35"]
[null,"Ø28,5"]
[null,"OBLONG 12/30"]
[null,"OBLONG 14/30"]
[null,"OBLONG 16/30"]
[null,"OBLONG 18/30"]
[null,"OBLONG 20/30"]
[null,"OBLONG 22/30"]
[null,"OBLONG 18/26"]
[null,"OBLONG 22/26"]
[null,"Ø14  J1"]
[null,"Ø14,7"]
[null,"Ø17 J1"]
[null,"Ø17 RECTIF"]
[null,"Ø18 J,7"]
[null,"Ø19 RECTIF"]
[null,"Ø18 J1"]
[null,"Ø20 J1"]
[null,"Ø22 J2"]
[null,"Ø23 J1"]
[null,"Ø24 J1"]
[null,"Ø30 J1"]
[null,"Ø30 J2"]
[null,"Ø28 J1"]
[null,"Ø28 J2"]
[null,"Ø28,5 J1"]
[null,"Ø30 J1"]
[null,"Ø31,5 J1"]
[]
[null,"EBAUCHE FRAISEE 2 ENCOCHES"]
[null,"EBAUCHE FRAISEE 2 ENCOCHES SUPERIEUR 25"]
[null,"FINI"]
[]
[null,"EBAUCHE Ø46"]
[null,"EBAUCHE Ø47"]
[null,"EBAUCHE VERTICAL + HORIZONTALE REP 0° ET 90°"]
[null,"EBAUCHE EXCENTREE PERCEE"]
[null,"EBAUCHE 1/4 ROND PERCEE"]
[null,"EBAUCHE FRAISEE PERCEE Ø20,5"]
[null,"ALPS 150 EBAUCHE "]
[]
[null,"Ø22 J1"]
[null,"OBLONG 12/30 J1"]
[null,"OBLONG 14/30 J1"]
[null,"OBLONG 16/30 J1"]
[null,"OBLONG 18/30 J1"]
[null,"OBLONG 20/30 J1"]
[null,"OBLONG 22/30 J1"]
[null,"OBLONG 18/26 J1"]
[null,"OBLONG 22/26 J1"]
[null,"OBLONG 10/30"]
[null,"OBLONG 10/30 J1"]
[]
[null,"EBAUCHE FRAISEE EXCENTREE Ø32"]
[null,"EBAUCHE FRAISEE EXCENTREE Ø40"]
[null,"EBAUCHE FRAISEE L4 LONG +3 MM"]
[null,"EBAUCHE PERCEE Ø35 2 REPERES 0° ET 90°"]
[null,"PERCEE Ø22 2 REPERES 0° ET 90°"]
[]
[null,"OBLONG 8/30"]
[null,"Ø21"]
[null,"EBAUCHE FRAISEE ERGOT 8 SANS MOUCHE Ø32"]
[null,"EBAUCHE FRAISEE ERGOT 8 SANS MOUCHE Ø33"]
[null,"EBAUCHE PERCEE GOUPILLE Ø5  0° ET 90°"]
[null,"EBAUCHE FRAISEE SUPERIEUR Ø32"]
[null,"EBAUCHE PERCEE Ø25"]
[null,"EBAUCHE PERCEE Ø22"]
[null,"Ø14,7"]
[null,"Ø13 J,7"]
[null,"Ø12 J,7"]
[null,"Ø22 J,7"]
[null,"Ø23 J1"]
[null,"Ø24 J,7"]
[null,"Ø12 J,7"]
[null,"Ø10 J1"]
[null,"Ø28 J,7"]
[null,"Ø26 J1"]
[null,"Ø16 J1"]
[null,"OBLONG 12/24"]
[null,"Ø10 J7"]
[null,"T3000"]
[null,"EBAUCHE FRAISEE L65"]
[null,"EBAUCHE FRAISEE L85"]
[null,"EBAUCHE PERCEE \u009dØ32 à RECTIFIER"]
[null,"EBAUCHE PERCEE \u009dØ26"]
[null,"EBAUCHE FRAISEE 0° et 90° Ø26,4"]
[null,"EBAUCHE FRAISEE PERCEE 3 REPERES 0° -45° +45°"]
[null,"EBAUCHE FRAISEE PERCEE 3 REPERES 0° +45° +135°"]
[null,"EBAUCHE FRAISEE PERCEE 4 ENCOCHES"]
[null,"EBAUCHE FRAISEE DEGAGEE PERCEE Ø3 2 REPERES 0° 90°"]
[null,"EBAUCHE FRAISEE  PERCEE 2 REPERES 0° 90°"]
[null,"EBAUCHE FRAISEE PERCEE Ø3 2 REPERES 0° 90°"]
[null,"EBAUCHE EXCENTREE"]
[null,"EBAUCHE DEPORTEE"]
[null,"M55 EBAUCHE PERCEE 2 REPERES 0° et 90°"]
[null,"EBAUCHE TREMPEE RECTIFIEE Ø3"]
[null,"EBAUCHE TREMPEE RECTIFIEE Ø29"]
[null,"EBAUCHE PERCEE Ø23,5 2 REPERES 4 et 5"]
[null,"EBAUCHE Ø21,5 FRAISEE L 6 + GOUPILLAGE"]
[null,"EBAUCHE Ø29 FRAISEE L 6 + GOUPILLAGE"]
[null,"EBAUCHE PERCEE Ø38 FRAISEE 1 REPERE"]
[null,"EBAUCHE PERCEE Ø48 2 PLATS 0° et 90°"]
[null,"EBAUCHE FRAISEE Ø26,2 L85"]
[null,"EBAUCHE NON  FRAISEE Ø8"]
[null,"EBAUCHE PERCEE Ø34 et Ø3 2 REPERES 0° et 90°"]
[null,"EBAUCHE SUPERIEURE Ø30 2 REPERES 0° et 90°"]
[null,"EBAUCHE FRAISEE L85"]
[null,"NEZ DE BROCHE 06/22"]
[null,"NEZ DE BROCHE 04/20"]
[null,"EBAUCHE FRAISEE  PERCEE Ø36"]
[null,"EBAUCHE FRAISEE  PERCEE Ø50"]
[null,"EM17"]
[null,"EM17 EBAUCHE"]
[null,"EBAUCHE PERCEE Ø50 2 REPERES 0° et 90°"]
[null,"EBAUCHE Lg 40 TREMPEE"]
[null,"EBAUCHE Lg 45 TREMPEE"]
[null,"POINCON N°5013710-9"]
[null,"EBAUCHE PERCEE \u009dØ19"]
[null,"EBAUCHE PERCEE Ø34 +Ø3 2 REPERES 0°ET 90°"]
[null,"9023 DEPORTEE"]
[null,"EBAUCHE FRAISEE Ø32 L95"]
[null,"EBAUCHE SOUS TIGE 90 TALON"]
[null,"\u009d\u009d\u009d\u009dØ22,5"]
[null,"EBAUCHE FRAISEE L71"]
[null,"EBAUCHE FRAISEE L70"]
[null,"EBAUCHE ELECTRO"]
[null,"EBAUCHE TREMPEE"]
[null,"EBAUCHE NON FRAISEE \u009d\u009dØ8"]
[null,"EBAUCHE PERCEE \u009dØ15  L20"]
[null,"EBAUCHE FRAISEE ERGOT 8 AVEC MOUCHE Ø33"]
[null,"EBAUCHE  \u009d\u009dØ80 FRAISE 0° ET 90°"]
[null,"EBAUCHE  \u009d\u009dØ75 FRAISE 0° ET 90°"]
[null,"EBAUCHE"]
[null,"EBAUCHE SOUS TIGE Ø110 "]
[null,"EBAUCHE DEPORTEE +1 REPERE 45°"]
[null,"EBAUCHE PERCEE \u009dØ21"]
[null,"EBAUCHE FRAISEE 0 ET 90° SUPERIEUR \u009dØ30"]
[null,"EBAUCHE FRAISEE 1 REPERE"]
[null,"EBAUCHE FRAISEE LARG 6 ET 4"]
[null,"EBAUCHE PERCEE Ø50 2 REPERES 0° et 90°"]

{"sheet":"CLIENTS","index":10,"n_rows":9,"n_cols":7,"rows_kept":9,"cut":false,"hidden":false,"merged":[]}
[null,null,null,null,null,null,"CLIENTS"]
[]
[null,"MATELON"]
[null,"A0703+A0704"]
[null,"REY"]
[]
[]
[]
[null,"-"]

{"sheet":"ADRESSES A","index":11,"n_rows":470,"n_cols":7,"rows_kept":470,"cut":false,"hidden":false,"merged":[]}
[null,null,null,null,null,null,"ADRESSES A"]
[]
[null,"A0101"]
[null,"A0102"]
[null,"A0103"]
[null,"A0104"]
[null,"A0105"]
[null,"A0106-A"]
[null,"A0106-B"]
[null,"A0107"]
[null,"A0108"]
[null,"A0109"]
[null,"A0110"]
[null,"A0111-A"]
[null,"A0111-B"]
[null,"A0112-A"]
[null,"A0112-B"]
[null,"A0113"]
[null,"A0114"]
[null,"A0115"]
[null,"A0116"]
[null,"A0117"]
[null,"A0118-A"]
[null,"A0118-B"]
[null,"A0119-A"]
[null,"A0119-B"]
[null,"A0120-A"]
[null,"A0120-B"]
[null,"A0120-C"]
[null,"A0121"]
[null,"A0122-A"]
[null,"A0122-B"]
[null,"A0123"]
[null,"A0124-A"]
[null,"A0124-B"]
[null,"A0125"]
[]
[null,"A0201-A"]
[null,"A0201-B"]
[null,"A0202"]
[null,"A0203"]
[null,"A0204"]
[null,"A0205"]
[null,"A0206-A"]
[null,"A0206-B"]
[null,"A0206-C"]
[null,"A0207"]
[null,"A0208-A"]
[null,"A0208-B"]
[null,"A0209"]
[null,"A0210"]
[null,"A0211"]
[null,"A0212"]
[null,"A0213"]
[null,"A0214"]
[null,"A0215"]
[null,"A0216"]
[null,"A0217"]
[null,"A0218"]
[null,"A0219"]
[null,"A0220"]
[null,"A0221"]
[null,"A0222"]
[null,"A0223"]
[null,"A0224-A"]
[null,"A0224-B"]
[null,"A0225"]
[null,"A0301-A"]
[null,"A0301-B"]
[null,"A0302-A"]
[null,"A0302-B"]
[null,"A0303"]
[null,"A0304"]
[null,"A0305-A"]
[null,"A0305-B"]
[null,"A0306-A"]
[null,"A0306-B"]
[null,"A0307"]
[null,"A0308"]
[null,"A0309"]
[null,"A0310"]
[null,"A0311"]
[null,"A0312"]
[null,"A0313"]
[null,"A0314"]
[null,"A0315"]
[null,"A0316"]
[null,"A0317"]
[null,"A0318"]
[null,"A0319"]
[null,"A0320"]
[null,"A0321"]
[null,"A0322-A"]
[null,"A0322-B"]
[null,"A0323-A"]
[null,"A0323-B"]
[null,"A0324-A"]
[null,"A0324-B"]
[null,"A0325"]
[null,"A0401-A"]
[null,"A0401-B"]
[null,"A0401-C"]
[null,"A0402-A"]
[null,"A0402-B"]
[null,"A0403"]
[null,"A0404-A"]
[null,"A0404-B"]
[null,"A0405"]
[null,"A0406"]
[null,"A0407"]
[null,"A0408"]
[null,"A0409"]
[null,"A0410-A"]
[null,"A0410-B"]
[null,"A0411"]
[null,"A0412-A"]
[null,"A0412-B"]
[null,"A0413"]
[null,"A0414"]
[null,"A0415-A"]
[null,"A0415-B"]
[null,"A0416-A"]
[null,"A0416-B"]
[null,"A0417"]
[null,"A0418-A"]
[null,"A0418-B"]
[null,"A0418-C"]
[null,"A0419"]
[null,"A0420"]
[null,"A0421"]
[null,"A0422"]
[null,"A0423"]
[null,"A0424"]
[null,"A0425"]
[null,"A0501-A"]
[null,"A0501-B"]
[null,"A0501-C"]
[null,"A0502-A"]
[null,"A0502-B"]
[null,"A0502-C"]
[null,"A0503-A"]
[null,"A0503-B"]
[null,"A0504"]
[null,"A0504-B"]
[null,"A0505-A"]
[null,"A0505-B"]
[null,"A0506-A"]
[null,"A0506-B"]
[null,"A0507-A"]
[null,"A0507-B"]
[null,"A0508-A"]
[null,"A0508-B"]
[null,"A0508-C"]
[null,"A0508-D"]
[null,"A0508-E"]
[null,"A0508-F"]
[null,"A0509-A"]
[null,"A0509-B"]
[null,"A0509-C"]
[null,"A0510"]
[null,"A0511-A"]
[null,"A0511-B"]
[null,"A0512-A"]
[null,"A0512-B"]
[null,"A0513"]
[null,"A0514"]
[null,"A0515"]
[null,"A0516"]
[null,"A0517"]
[null,"A0518"]
[null,"A0519"]
[null,"A0520"]
[null,"A0521-A"]
[null,"A0521-B"]
[null,"A0522"]
[null,"A0523"]
[null,"A0524"]
[null,"A0525"]
[null,"A0601"]
[null,"A0602"]
[null,"A0603-A"]
[null,"A0603-B"]
[null,"A0604-A"]
[null,"A0604-B"]
[null,"A0605-A"]
[null,"A0605-B"]
[null,"A0606"]
[null,"A0607-A"]
[null,"A0607-B"]
[null,"A0608-A"]
[null,"A0608-B"]
[null,"A0609-A"]
[null,"A0609-B"]
[null,"A0610"]
[null,"A0611"]
[null,"A0612-A"]
[null,"A0612-B"]
[null,"A0613"]
[null,"A0614-A"]
[null,"A0614-B"]
[null,"A0615-A"]
[null,"A0615-B"]
[null,"A0616-A"]
[null,"A0616-B"]
[null,"A0617-A"]
[null,"A0617-B"]
[null,"A0618-A"]
[null,"A0618-B"]
[null,"A0619"]
[null,"A0620"]
[null,"A0621"]
[null,"A0622"]
[null,"A0623"]
[null,"A0624"]
[null,"A0625"]
[null,"A0701"]
[null,"A0702"]
[null,"A0703"]
[null,"A0704"]
[null,"A0705"]
[null,"A0706"]
[null,"A0707"]
[null,"A0708"]
[null,"A0709"]
[null,"A0710-A"]
[null,"A0710-B"]
[null,"A0711-A"]
[null,"A0711-B"]
[null,"A0712-A"]
[null,"A0712-B"]
[null,"A0713"]
[null,"A0714-A"]
[null,"A0714-B"]
[null,"A0715"]
[null,"A0716"]
[null,"A0717"]
[null,"A0718"]
[null,"A0719"]
[null,"A0720"]
[null,"A0721"]
[null,"A0722"]
[null,"A0723"]
[null,"A0724"]
[null,"A0725"]
[null,"A0801"]
[null,"A0802-A"]
[null,"A0802-B"]
[null,"A0803"]
[null,"A0804-A"]
[null,"A0804-B"]
[null,"A0805"]
[null,"A0806-A"]
[null,"A0806-B"]
[null,"A0807"]
[null,"A0808-A"]
[null,"A0808-B"]
[null,"A0809-B"]
[null,"A0809-A"]
[null,"A0809-B"]
[null,"A0809-C"]
[null,"A0810-A"]
[null,"A0810-B"]
[null,"A0810-C"]
[null,"A0811-A"]
[null,"A0811-B"]
[null,"A0812"]
[null,"A0813"]
[null,"A0814"]
[null,"A0815"]
[null,"A0816"]
[null,"A0817"]
[null,"A0818"]
[null,"A0819"]
[null,"A0820"]
[null,"A0821"]
[null,"A0822-A"]
[null,"A0822-B"]
[null,"A0823"]
[null,"A0824"]
[null,"A0825"]
[null,"A0901"]
[null,"A0902"]
[null,"A0903"]
[null,"A0904"]
[null,"A0905"]
[null,"A0906"]
[null,"A0907"]
[null,"A0908"]
[null,"A0909"]
[null,"A0910"]
[null,"A0911"]
[null,"A0912"]
[null,"A0913"]
[null,"A0914"]
[null,"A0915"]
[null,"A0916"]
[null,"A0917"]
[null,"A0918"]
[null,"A0919"]
[null,"A0920"]
[null,"A0921"]
[null,"A0922"]
[null,"A0923"]
[null,"A0924"]
[null,"A0925"]
[null,"A1001"]
[null,"A1002"]
[null,"A1003-A"]
[null,"A1003-B"]
[null,"A1004"]
[null,"A1005"]
[null,"A1006"]
[null,"A1007"]
[null,"A1008"]
[null,"A1009"]
[null,"A1010"]
[null,"A1011"]
[null,"A1012"]
[null,"A1013-A"]
[null,"A1013-B"]
[null,"A1013-C"]
[null,"A1014"]
[null,"A1015"]
[null,"A1016-A"]
[null,"A1016-B"]
[null,"A1017"]
[null,"A1018"]
[null,"A1019"]
[null,"A1020"]
[null,"A1021"]
[null,"A1022"]
[null,"A1023-A"]
[null,"A1023-B"]
[null,"A1024"]
[null,"A1025"]
[null,"A1101-A"]
[null,"A1101-B"]
[null,"A1102-A"]
[null,"A1102-B"]
[null,"A1103-A"]
[null,"A1103-B"]
[null,"A1104-A"]
[null,"A1104-B"]
[null,"A1105-A"]
[null,"A1105-B"]
[null,"A1106-A"]
[null,"A1106-B"]
[null,"A1107-A"]
[null,"A1107-B"]
[null,"A1108-A"]
[null,"A1108-B"]
[null,"A1109-A"]
[null,"A1109-B"]
[null,"A1110-A"]
[null,"A1110-B"]
[null,"A1111-A"]
[null,"A1111-B"]
[null,"A1112-A"]
[null,"A1112-B"]
[null,"A1113-A"]
[null,"A1113-B"]
[null,"A1114-A"]
[null,"A1114-B"]
[null,"A1115-A"]
[null,"A1115-B"]
[null,"A1116-A"]
[null,"A1116-B"]
[null,"A1117-A"]
[null,"A1117-B"]
[null,"A1118-A"]
[null,"A1118-B"]
[null,"A1119-A"]
[null,"A1119-B"]
[null,"A1120-A"]
[null,"A1120-B"]
[null,"A1121-A"]
[null,"A1121-B"]
[null,"A1122"]
[null,"A1123"]
[null,"A1124"]
[null,"A1125"]
[null,"A1201"]
[null,"A1202"]
[null,"A1203-A"]
[null,"A1203-B"]
[]
[null,"A1204"]
[null,"A1205"]
[null,"A1206"]
[null,"A1207"]
[null,"A1208"]
[null,"A1209"]
[null,"A1210"]
[null,"A1211"]
[null,"A1212"]
[null,"A1213"]
[null,"A1214"]
[null,"A1215"]
[null,"A1216"]
[null,"A1217"]
[null,"A1218"]
[null,"A1219"]
[null,"A1220"]
[null,"A1221"]
[null,"A1222"]
[null,"A1223"]
[null,"A1224"]
[null,"A1225"]
[null,"A1301-A"]
[null,"A1301-B"]
[null,"A1301-C"]
[null,"A1301-D"]
[null,"A1302-A"]
[null,"A1302-B"]
[null,"A1302-C"]
[null,"A1303-A"]
[null,"A1303-B"]
[null,"A1304"]
[null,"A1305"]
[null,"A1306-A"]
[null,"A1306-B"]
[null,"A1307"]
[null,"A1308-A"]
[null,"A1308-B"]
[null,"A1309-A"]
[null,"A1309-B"]
[null,"A1310"]
[null,"A1311-A"]
[null,"A1311-B"]
[null,"A1312"]
[null,"A1313"]
[null,"A1314"]
[null,"A1315"]
[null,"A1316"]
[null,"A1317"]
[null,"A1318"]
[null,"A1319"]
[null,"A1320"]
[null,"A1321"]
[null,"A1322"]
[null,"A1323"]
[null,"A1324-A"]
[null,"A1324-B"]
[null,"A1325-A"]
[null,"A1325-B"]
[null,"A1401"]
[null,"A1402"]
[null,"A1403"]
[null,"A1404"]
[null,"A1405"]
[null,"A1406"]
[null,"A1407"]
[null,"A1408"]
[null,"A1409"]
[null,"A1410"]
[null,"A1411"]
[null,"A1412"]
[null,"A1413"]
[null,"A1414"]
[null,"A1415"]
[null,"A1416"]
[null,"A1417"]
[null,"A1418"]
[null,"A1419"]
[null,"A1420"]
[null,"A1421"]
[null,"A1422"]
[null,"A1423"]
[null,"A1424"]
[null,"A1425"]

{"sheet":"ADRESSES B","index":12,"n_rows":1241,"n_cols":12,"rows_kept":1241,"cut":false,"hidden":false,"merged":[]}
[null,null,null,null,null,null,"ADRESSES B"]
[]
["B0101-A"]
["B0101-B"]
["B0102-A"]
["B0102-B"]
["B0103-A"]
["B0103-B"]
["B0104"]
["B0105"]
["B0106-A"]
["B0106-B"]
["B0106-C"]
["B0107"]
["B0108"]
["B0109"]
["B0110"]
["B0111"]
["B0112"]
["B0113-A"]
["B0113-B"]
["B0114"]
["B0115"]
["B0116"]
["B0117"]
["B0118"]
["B0119-A"]
["B0119-B"]
["B0119-C"]
["B0120"]
["B0121"]
["B0122"]
["B0123"]
["B0124"]
["B0125"]
[]
["B0201-A"]
["B0201-B"]
["B0202-A"]
["B0202-B"]
["B0203"]
["B0204"]
["B0205"]
["B0206"]
["B0207"]
["B0208"]
["B0209"]
["B0210"]
["B0211"]
["B0212"]
["B0213"]
["B0214"]
["B0215"]
["B0216"]
["B0217"]
["B0218"]
["B0219"]
["B0220"]
["B0221"]
["B0222"]
["B0223"]
["B0224"]
["B0225"]
[]
["B0301"]
["B0302"]
["B0303"]
["B0304-A"]
["B0304-B"]
["B0305-A"]
["B0305-B"]
["B0305-C"]
["B0305-D"]
["B0306"]
["B0307"]
["B0308-A"]
["B0308-B"]
["B0308-C"]
["B0309"]
["B0310"]
["B0311"]
["B0312"]
["B0313"]
["B0314"]
["B0315"]
["B0316"]
["B0317"]
["B0318"]
["B0319"]
["B0320"]
["B0321-A"]
["B0321-B"]
["B0321-C"]
["B0321-D"]
["B0322"]
["B0323"]
["B0324"]
["B0325"]
[]
["B0401"]
["B0402"]
["B0403"]
["B0404"]
["B0405"]
["B0406"]
["B0407-A"]
["B0407-B"]
["B0408-A"]
["B0408-B"]
["B0409-A"]
["B0409-B"]
["B0410"]
["B0411"]
["B0412-A"]
["B0412-B"]
["B0413-A"]
["B0413-B"]
["B0413-C"]
["B0414"]
["B0415-A"]
["B0415-B"]
["B0416"]
["B0417"]
["B0418"]
["B0419"]
["B0420"]
["B0421"]
["B0422"]
["B0423"]
["B0424-A"]
["B0424-B"]
["B0425-A"]
["B0425-B"]
["B0501"]
["B0502-A"]
["B0502-B"]
["B0503"]
["B0504"]
["B0505"]
["B0506"]
["B0507"]
["B0508"]
["B0509"]
["B0510"]
["B0511"]
["B0512"]
["B0513"]
["B0514"]
["B0515"]
["B0516"]
["B0517"]
["B0518"]
["B0519"]
["B0520"]
["B0521"]
["B0522"]
["B0523"]
["B0524"]
["B0525"]
[]
["B0601"]
["B0602"]
["B0603"]
["B0604"]
["B0605-A"]
["B0605-B"]
["B0606-A"]
["B0606-B"]
["B0607-A"]
["B0607-B"]
["B0608"]
["B0609-A"]
["B0609-B"]
["B0609-C"]
["B0610"]
["B0611-A"]
["B0611-B"]
["B0612-A"]
["B0612-B"]
["B0613"]
["B0614"]
["B0615"]
["B0616"]
["B0617"]
["B0618"]
["B0619"]
["B0620"]
["B0621"]
["B0622"]
["B0623"]
["B0624"]
["B0625"]
["B0701-A"]
["B0701-B"]
["B0702-A"]
["B0702-B"]
["B0703-A"]
["B0703-B"]
["B0704"]
["B0705-A"]
["B0705-B"]
["B0706"]
["B0707"]
["B0708"]
["B0709"]
["B0710"]
["B0711"]
["B0712"]
["B0713"]
["B0714"]
["B0715"]
["B0716"]
["B0717"]
["B0718"]
["B0719"]
["B0720"]
["B0721"]
["B0722-A"]
["B0722-B"]
["B0723"]
["B0724"]
["B0725"]
["B0801-A"]
["B0801-B"]
["B0801-C"]
["B0802-A"]
["B0802-B"]
["B0803"]
["B0804"]
["B0805"]
["B0806"]
["B0807"]
["B0808"]
["B0809"]
["B0810"]
["B0811"]
["B0812"]
["B0813"]
["B0814"]
["B0815"]
["B0816"]
["B0817"]
["B0818"]
["B0819"]
["B0820-A"]
["B0820-B"]
["B0821"]
["B0822"]
["B0823"]
["B0824"]
["B0825"]
["B0901-A"]
["B0901-B"]
["B0901-C"]
["B0901-D"]
["B0902-A"]
["B0902-B"]
["B0902-C"]
["B0903-A"]
["B0903-B"]
["B0904-A"]
["B0904-B"]
["B0905-A"]
["B0905-B"]
["B0905-C"]
["B0905-D"]
["B0906"]
["B0907-A"]
["B0907-B"]
["B0907-C"]
["B0908-A"]
["B0908-B"]
["B0908-C"]
["B0909"]
["B0910-A"]
["B0910-B"]
["B0910-C"]
["B0911"]
["B0912"]
["B0913-\u009d\u009dA"]
["B0913-B"]
["B0914"]
["B0915-A"]
["B0915-B"]
["B0916-A"]
["B0916-B"]
["B0917-A"]
["B0917-B"]
["B0918"]
["B0919"]
["B0920-A"]
["B0920-B"]
["B0921"]
["B0922"]
["B0923"]
["B0924"]
["B0925"]
[]
["B1001"]
["B1002"]
["B1003"]
["B1004"]
["B1005"]
["B1006"]
["B1007"]
["B1008"]
["B1009"]
["B1010-A"]
["B1010-B"]
["B1011"]
["B1012-A"]
["B1012-B"]
["B1013"]
["B1014"]
["B1015"]
["B1016"]
["B1017"]
["B1018"]
["B1019"]
["B1020-A"]
["B1020-B"]
["B1021-A"]
["B1021-B"]
["B1022"]
["B1023"]
["B1024"]
["B1025"]
[]
["B1101"]
["B1102"]
["B1103"]
["B1104"]
["B1105-A"]
["B1105-B"]
["B1106"]
["B1107"]
["B1108"]
["B1109"]
["B1110"]
["B1111"]
["B1112"]
["B1113"]
["B1114-A"]
["B1114-B"]
["B1115"]
["B1116"]
["B1117"]
["B1118"]
["B1119"]
["B1120"]
["B1121"]
["B1121-A"]
["B1121-B"]
["B1122"]
["B1123"]
["B1124"]
["B1125"]
[]
["B1201-A"]
["B1201-B"]
["B1202"]
["B1203-A"]
["B1203-B"]
["B1203-C"]
["B1204-A"]
["B1204-B"]
["B1205"]
["B1206"]
["B1207"]
["B1208-A"]
["B1208-B"]
["B1208-C"]
["B1209"]
["B1210"]
["B1211"]
["B1212"]
["B1213"]
["B1214"]
["B1215"]
["B1216"]
["B1217"]
["B1218"]
["B1219"]
["B1220"]
["B1221"]
["B1222"]
["B1223"]
["B1224"]
["B1225-A"]
["B1225-B"]
["B1301"]
["B1302"]
["B1303"]
["B1304"]
["B1305"]
["B1306"]
["B1307"]
["B1308"]
["B1309-A"]
["B1309-B"]
["B1310"]
["B1311"]
["B1312"]
["B1313"]
["B1314"]
["B1315-A"]
["B1315-B"]
["B1316"]
["B1317"]
["B1318"]
["B1319"]
["B1320"]
["B1321"]
["B1322"]
["B1323"]
["B1324"]
["B1325"]
[]
["B1401"]
["B1402"]
["B1403"]
["B1404"]
["B1405"]
["B1406"]
["B1407"]
["B1408"]
["B1409"]
["B1410"]
["B1411"]
["B1412"]
["B1413"]
["B1414"]
["B1415"]
["B1416"]
["B1417",null,null,null,null,null,null,null,null,null,null,{"$f":"25*14","v":350}]
["B1418"]
["B1419"]
["B1420"]
["B1421"]
["B1422"]
["B1423"]
["B1424"]
["B1425"]
[]
[]
[]
[]
[]
[]
[]
[]
[]
[]
[]
[]
[]
[]
[]
[]
[]
[]
[]
[]
[]
[]
[]
[]
[]
[]
[]
[]
[]
[]
[]
[]
[]
[]
[]
[]
[]
[]
[]
[]
[]
[]
[]
[]
[]
[]
[]
[]
[]
[]
[]
[]
[]
[]
[]
[]
[]
[]
[]
[]
[]
[]
[]
[]
[]
[]
[]
[]
[]
[]
[]
[]
[]
[]
[]
[]
[]
[]
[]
[]
[]
[]
[]
[]
[]
[]
[]
[]
[]
[]
[]
[]
[]
[]
[]
[]
[]
[]
[]
[]
[]
[]
[]
[]
[]
[]
[]
[]
[]
[]
[]
[]
[]
[]
[]
[]
[]
[]
[]
[]
[]
[]
[]
[]
[]
[]
[]
[]
[]
[]
[]
[]
[]
[]
[]
[]
[]
[]
[]
[]
[]
[]
[]
[]
[]
[]
[]
[]
[]
[]
[]
[]
[]
[]
[]
[]
[]
[]
[]
[]
[]
[]
[]
[]
[]
[]
[]
[]
[]
[]
[]
[]
[]
[]
[]
[]
[]
[]
[]
[]
[]
[]
[]
[]
[]
[]
[]
[]
[]
[]
[]
[]
[]
[]
[]
[]
[]
[]
[]
[]
[]
[]
[]
[]
[]
[]
[]
[]
[]
[]
[]
[]
[]
[]
[]
[]
[]
[]
[]
[]
[]
[]
[]
[]
[]
[]
[]
[]
[]
[]
[]
[]
[]
[]
[]
[]
[]
[]
[]
[]
[]
[]
[]
[]
[]
[]
[]
[]
[]
[]
[]
[]
[]
[]
[]
[]
[]
[]
[]
[]
[]
[]
[]
[]
[]
[]
[]
[]
[]
[]
[]
[]
[]
[]
[]
[]
[]
[]
[]
[]
[]
[]
[]
[]
[]
[]
[]
[]
[]
[]
[]
[]
[]
[]
[]
[]
[]
[]
[]
[]
[]
[]
[]
[]
[]
[]
[]
[]
[]
[]
[]
[]
[]
[]
[]
[]
[]
[]
[]
[]
[]
[]
[]
[]
[]
[]
[]
[]
[]
[]
[]
[]
[]
[]
[]
[]
[]
[]
[]
[]
[]
[]
[]
[]
[]
[]
[]
[]
[]
[]
[]
[]
[]
[]
[]
[]
[]
[]
[]
[]
[]
[]
[]
[]
[]
[]
[]
[]
[]
[]
[]
[]
[]
[]
[]
[]
[]
[]
[]
[]
[]
[]
[]
[]
[]
[]
[]
[]
[]
[]
[]
[]
[]
[]
[]
[]
[]
[]
[]
[]
[]
[]
[]
[]
[]
[]
[]
[]
[]
[]
[]
[]
[]
[]
[]
[]
[]
[]
[]
[]
[]
[]
[]
[]
[]
[]
[]
[]
[]
[]
[]
[]
[]
[]
[]
[]
[]
[]
[]
[]
[]
[]
[]
[]
[]
[]
[]
[]
[]
[]
[]
[]
[]
[]
[]
[]
[]
[]
[]
[]
[]
[]
[]
[]
[]
[]
[]
[]
[]
[]
[]
[]
[]
[]
[]
[]
[]
[]
[]
[]
[]
[]
[]
[]
[]
[]
[]
[]
[]
[]
[]
[]
[]
[]
[]
[]
[]
[]
[]
[]
[]
[]
[]
[]
[]
[]
[]
[]
[]
[]
[]
[]
[]
[]
[]
[]
[]
[]
[]
[]
[]
[]
[]
[]
[]
[]
[]
[]
[]
[]
[]
[]
[]
[]
[]
[]
[]
[]
[]
[]
[]
[]
[]
[]
[]
[]
[]
[]
[]
[]
[]
[]
[]
[]
[]
[]
[]
[]
[]
[]
[]
[]
[]
[]
[]
[]
[]
[]
[]
[]
[]
[]
[]
[]
[]
[]
[]
[]
[]
[]
[]
[]
[]
[]
[]
[]
[]
[]
[]
[]
[]
[]
[]
[]
[]
[]
[]
[]
[]
[]
[]
[]
[]
[]
[]
[]
[]
[]
[]
[]
[]
[]
[]
[]
[]
[]
[]
[]
[]
[]
[]
[]
[]
[]
[]
[]
[]
[]
[]
[]
[]
[]
[]
[]
[]
[]
[]
[]
[]
[]
[]
[]
[]
[]
[]
[]
[]
[]
[]
[]
[]
[]
[]
[]
[]
[]
[]
[]
[]
[]
[]
[]
[]
[]
[]
[]
[]
[]
[]
[]
[]
[]
[]
[]
[]
[]
[]
[]
[]
[]
[]
[]
[]
[]
[]
[]
[]
[]
[]
[]
[]
[]
[]
[]
[]
[]
[]
[]
[]
[]
[]
[]
[]
[]
[]
[]
[]
[]
[]
[]
[]
[]
[]
[]
[]
[]
[]
[]
[]
[]
[]
[]
[]
[]
[]
[]
[]
[]
[]
[]
[]
[]
[]
[]
[]
[]
[]
[]
[]
[]
[]
[]
[]
[]
[]
[]
[]
[]
[]
[]
[]
[]
[]
[]
[]
[]
[]
[]
[]
[]
[]
[]
[]
[]
[]
[]
[]
[]
[]
[]
[]
[]
[]
[null,"B0101"]
[null,"B0102"]
[null,"B0103"]
[null,"B0104"]
[null,"B0105"]
[null,"B0106"]
[null,"B0107"]
[null,"B0108"]
[null,"B0109"]
[null,"B0110"]
[null,"B0111"]
[null,"B0112"]
[null,"B0113"]
[null,"B0114"]
[null,"B0115"]
[null,"B0116"]
[null,"B0117"]
[null,"B0118"]
[null,"B0119"]
[null,"B0120"]
[null,"B0121"]
[null,"B0122"]
[null,"B0123"]
[null,"B0124"]
[null,"B0125"]

{"sheet":"ADRESSES C","index":13,"n_rows":173,"n_cols":7,"rows_kept":173,"cut":false,"hidden":false,"merged":[]}
[null,null,null,null,null,null,"ADRESSES C"]
[]
["C0901-A"]
["C0901-B"]
["C0902-A"]
["C0902-B"]
["C0903-A"]
["C0903-B"]
["C0904-A"]
["C0904-B"]
["C0905-A"]
["C0905-B"]
["C0906-A"]
["C0906-B"]
["C0907-A"]
["C0907-B"]
["C0908-A"]
["C0908-B"]
["C0916"]
["C0917"]
["C1001"]
["C1002"]
["C1003"]
["C1004"]
["C1005"]
["C1006"]
["C1007"]
["C1008"]
["C1009"]
["C1010"]
["C1011"]
["C1012"]
["C1013"]
["C1014"]
["C1015"]
["C1016"]
["C1017"]
["C1101"]
["C1102"]
["C1103"]
["C1104"]
["C1105"]
["C1106"]
["C1107"]
["C1108"]
["C1109"]
["C1110"]
["C1111"]
["C1112"]
["C1113"]
["C1114"]
["C1115"]
["C1116"]
["C1117"]
["C1201-A"]
["C1201-B"]
["C1202-A"]
["C1202-B"]
["C1203"]
["C1204"]
["C1205"]
["C1206"]
["C1207"]
["C1208"]
["C1209"]
["C1210"]
["C1211"]
["C1212"]
["C1213"]
["C1214"]
["C1215"]
["C1216"]
["C1217-A"]
["C1217-B"]
["C1301-A"]
["C1301-B1"]
["C1301-B2"]
["C1301-B3"]
["C1302-A"]
["C1302-B"]
["C1303-A"]
["C1303-B"]
["C1304-A"]
["C1304-B"]
["C1305-A"]
["C1305-B"]
["C1305-C"]
["C1305-D"]
["C1306-A"]
["C1306-B1"]
["C1306-B2"]
["C1307-A"]
["C1307-B1"]
["C1307-B2"]
["C1308-A"]
["C1308-B"]
["C1309-A"]
["C1309-B1"]
["C1309-B2"]
["C1310-A"]
["C1310-B"]
["C1311-A1"]
["C1311-A2"]
["C1311-B1"]
["C1311-B2"]
["C1311-B3"]
["C1311-B4"]
["C1311-B5"]
["C1312-A"]
["C1312-B"]
["C1313-A"]
["C1313-B"]
["C1314-A1"]
["C1314-A2"]
["C1314-B1"]
["C1314-B2"]
["C1315-A1"]
["C1315-A2"]
["C1315-A3"]
["C1315-A4"]
["C1315-B"]
["C1316-A"]
["C1316-B"]
["C1317-A1"]
["C1317-A2"]
["C1317-A3"]
["C1317-A4"]
["C1317-A5"]
["C1317-A6"]
["C1317-A7"]
["C1317-B"]
["C1401-A"]
["C1401-B"]
["C1401-B"]
["C1402-A"]
["C1402-B"]
["C1403-A"]
["C1403-B"]
["C1404-A"]
["C1404-B"]
["C1405-A"]
["C1405-B"]
["C1406-A"]
["C1406-B"]
["C1407-A"]
["C1407-B"]
["C1408-A"]
["C1408-B"]
["C1409-A"]
["C1409-B"]
["C1410-A"]
["C1410-B"]
["C1411-B"]
["C1411-A"]
["C1411-B"]
["C1411-C"]
["C1412-A"]
["C1412-B"]
["C1412-C"]
["C1413-A"]
["C1413-B"]
["C1414-A"]
["C1414-B1"]
["C1414-B2"]
["C1415-A"]
["C1415-B"]
["C1416-A"]
["C1416-B"]
["C1416-C"]
["C1417-A"]
["C1417-B1"]
["C1417-B2"]
["C1417-B3"]

{"sheet":"VALORISATION DES STOCKS A B C","index":14,"n_rows":17,"n_cols":8,"rows_kept":17,"cut":false,"hidden":false,"merged":[[8,9,8,11],[5,0,5,1],[6,0,6,1],[7,0,7,1],[11,0,11,1],[16,1,16,2],[15,3,17,7],[5,5,5,6],[6,5,6,6],[7,5,7,6],[11,5,11,6],[13,0,13,1],[12,0,12,1]]}
[null,null,"VALORISATION DES STOCKS A B C"]
[]
[]
[]
[]
["POIDS TOTAL A",null,{"$f":"'GESTION A'!H447","v":3820.837},"kg",null,"VALORISATION A",null,{"$f":"C6*C14","v":6877.5065999999997}]
["POIDS TOTAL B",null,{"$f":"'GESTION B'!H416","v":3428.8536819999999},"kg",null,"VALORISATION B",null,{"$f":"C7*C14","v":6171.9366276000001}]
["POIDS TOTAL C",null,{"$f":"'GESTION C'!H332","v":26.419},"kg",null,"VALORISATION C",null,{"$f":"C8*C14","v":47.554200000000002}]
[]
[]
[]
["PRIX MATIERE AU KG",null,1.5]
["COÛT M.O 20%",null,{"$f":"(C12*20)/100","v":0.3}]
["PRIX PIECE EBAUCHEE AU KG",null,{"$f":"C12+C13","v":1.8}]
[]
[null,null,null,{"$f":"SUM(H6:H8)","v":13096.997427600001}]
[null,"   VALORISATION A B C"]