{"text_format":"1","workbook":"xlsx","n_sheets":9,"sheets":["Copyright","Données","Base UEM","Option HC bleu","Tempo bleu","COMPAR","Pac","elec","Liste"],"not_rendered":{"charts":3,"images":0,"macros":0,"external_links":2,"defined_names":16,"comments":3,"pivot_tables":0},"unopened":[],"bounds":{"document_bytes":16777216,"sheet_cells":100000,"rows_first":2000,"rows_last":500,"rows_between":2000,"halvings":0,"cell_chars":16384,"cell_head_chars":4096},"cells_cut":0,"cells_raw":0,"read":"whole","date_system":"1900"}

{"sheet":"Copyright","index":0,"n_rows":12,"n_cols":1,"rows_kept":12,"cut":false,"hidden":false,"merged":[]}
["Document réalisé par Lombard Franck"]
["Lien donné par juju Sur chaleurTerre,com"]
["Modifié et adapté Par et pour w36xb2w"]
["Le 15 8 2010"]
[]
["Mot de passe W36xb2w"]
[]
["mettre à jour les tarifs dans les feuilles/ base/hc/ tempo"]
[]
["Attention Remettre la véritable taxe communale"]
["remplir la feuille elec les données se mettent a jour"]
["remplir la feuille de données pour Abonnement CTA CSPE TSPE TVA tout le reste ce calcul seul"]

{"sheet":"Données","index":1,"n_rows":54,"n_cols":16,"rows_kept":54,"cut":false,"hidden":false,"merged":[[0,0,0,7],[12,2,12,3],[3,2,3,3]]}
["Attention mettre a jour les valeurs abonnement et prix du kw"]
[]
["Puissance souscrite",null,15]
[null,null,"Hp ou HP HC"]
[null,null,"Ancien","Nouveau"]
["Consommation HP",null,0,{"$f":"E11","v":0},{"$f":"D6-C6","v":0}]
[]
[null,null,null,null,null,"% HP/HC",null,null,null,null,null,null,null,null,"calcul 2012","http://itow.fr/itow/edfbc.php"]
["Consommation HP",null,0,{"$f":"elec!K30","v":0},{"$f":"D9-C9","v":0},{"$f":"E9/E11","v":{"$error":"#DIV/0!"}}]
["Consommation HC",null,0,{"$f":"elec!K31","v":0},{"$f":"D10-C10","v":0},{"$f":"E10/E11","v":{"$error":"#DIV/0!"}}]
["Consommation totale",null,{"$f":"SUM(C9:C10)","v":0},{"$f":"SUM(D9:D10)","v":0},{"$f":"SUM(E9:E10)","v":0},{"$f":"F10+F9","v":{"$error":"#DIV/0!"}}]
[]
[null,null,"TEMPO"]
[null,null,null,"Nouveau","Somme"]
["HC",null,0,{"$f":"E11*F15","v":0},{"$f":"D15-C15","v":0},0.31]
["HP",null,0,{"$f":"E11*F16","v":0},0,0.56000000000000005,{"$f":"F16+F15","v":0.87000000000000011}]
["HC",null,0,{"$f":"E11*F17","v":0},0,0.04]
["HP",null,0,{"$f":"E6*F18","v":0},0,0.06,{"$f":"F18+F17","v":0.1}]
["HC",null,0,{"$f":"E6*F19","v":0},0,0.02]
["HP",null,0,{"$f":"E6*F20","v":0},0,0.01,{"$f":"F20+F19","v":0.03}]
[null,null,null,null,{"$f":"SUM(E15:E20)","v":0},{"$f":"SUM(F15:F20)","v":1.0000000000000002}]
[]
[]
[]
[null,null,"Période en mois"]
["Abonnement",null,12]
[null,null,"Taux TVA"]
["Abonnement","Tva réduite",5.5E-2]
["Consommation","Tva normale",0.2]
["Autres prestations","Tva normale",0.2]
{"$rows_left_out":25}
{"sheet":"Base UEM","index":2,"n_rows":79,"n_cols":7,"rows_kept":79,"cut":false,"hidden":false,"merged":[[0,3,0,5],[31,1,31,2],[3,2,3,3],[64,2,64,3],[60,2,60,3],[56,2,56,3],[3,1,4,1],[33,1,33,2]]}
[null,null,null,"Option BASE"]
["Puissance souscrite",{"$f":"Données!C3","v":15}]
[]
[null,"Puissance souscrite","Option base HT/mois"]
[null,null,"Abonnement","Prix du kWh"]
[null,3,{"$f":"A59/12","v":3.8941666666666666},{"$f":"D59","v":0.13042000000000001}]
[null,6,{"$f":"A63/12","v":6.7016666666666671},{"$f":"D63","v":0.12083000000000002}]
[null,9,{"$f":"A67/12","v":7.7333333333333334},{"$f":"D67","v":0.12192}]
[null,12,{"$f":"A71/12","v":11.995833333333332},{"$f":"D8","v":0.12192}]
[null,15,{"$f":"A75/12","v":13.860833333333334},0.12192]
[null,18,{"$f":"A79/12","v":15.872222222222222},0.12192]
[]
[]
[]
[null,null,{"$f":"TRUNC(VLOOKUP($B2,$B6:$G14,2),2)","v":13.86},{"$f":"TRUNC(VLOOKUP($B2,$B6:$G14,3),4)","v":0.12189999999999999}]
[]
[]
[]
[]
["Des taxes municipales au taux de 8% et des taxes départementales au taux de 4% basées sur 80% du montant HT "]
[]
[]
[null,null,null,{"$f":"D21","v":0}]
[]
[null,"Ancien","Nouveau","Différence","Consommation en kWh","Prix du kWh ht","Prix HT"]
["Consommation",{"$f":"Données!C6","v":0},{"$f":"Données!D6","v":0},{"$f":"C26-B26","v":0},{"$f":"D26","v":0},{"$f":"D15","v":0.12189999999999999},{"$f":"F26*E26","v":0}]
[]
[]
[]
[]
{"$rows_left_out":50}
{"sheet":"Option HC bleu","index":3,"n_rows":75,"n_cols":8,"rows_kept":75,"cut":false,"hidden":false,"merged":[[56,2,56,3],[60,2,60,3],[0,3,0,5],[3,1,4,1],[35,4,35,5],[33,1,33,2],[31,1,32,2],[3,4,3,6]]}
[null,null,null,"Option H.C"]
["Puissance souscrite",{"$f":"Données!C3","v":15}]
[]
[null,"Puissance souscrite",null,null,"Option Heures Creuses"]
[null,null,null,"Abonnement annuel","Abonnement mois","Prix du kWh HC","Prix du kWh HP"]
[null,3]
[null,6,null,{"$f":"E7*12","v":83.76},{"$f":"A59/12","v":6.98},{"$f":"D63","v":0.10596},{"$f":"D59","v":0.13}]
[null,9,null,97.924999999999997,{"$f":"A63/12","v":8.1604166666666664},{"$f":"F7","v":0.10596},{"$f":"G7","v":0.13}]
[null,12,null,152.71,{"$f":"A67/12","v":12.725833333333334},{"$f":"F8","v":0.10596},0.13]
[null,15,null,176.72,{"$f":"A71/12","v":14.726666666666667},0.10596,0.13]
[null,18,null,199.86,{"$f":"A75/12","v":16.655000000000001},0.10596,0.13]
[]
[]
[]
[null,null,null,null,{"$f":"TRUNC(VLOOKUP($B2,$B6:$G14,4),2)","v":14.72},{"$f":"TRUNC(VLOOKUP($B2,$B6:$G14,5),4)","v":0.10589999999999999},{"$f":"TRUNC(VLOOKUP($B2,$B6:$G14,6),4)","v":0.13}]
[]
[]
[]
[]
["Des taxes municipales au taux de 8% et des taxes départementales au taux de 4% basées sur 80% du montant HT "]
[]
[]
[]
[]
[null,"Ancien","Nouveau","Différence","Consommation en kWh","Prix du kWh","Prix HT"]
["Consommation HP",{"$f":"Données!C9","v":0},{"$f":"Données!E9","v":0},{"$f":"C26-B26","v":0},{"$f":"D26","v":0},{"$f":"G15","v":0.13},{"$f":"F26*E26","v":0}]
["Consommation HC",{"$f":"Données!C10","v":0},{"$f":"Données!E10","v":0},{"$f":"C27-B27","v":0},{"$f":"D27","v":0},{"$f":"F15","v":0.10589999999999999},{"$f":"F27*E27","v":0}]
["Somme",null,null,{"$f":"D27+D26","v":0},null,null,{"$f":"G27+G26","v":0},"ok"]
[]
[]
{"$rows_left_out":46}
{"sheet":"Tempo bleu","index":4,"n_rows":81,"n_cols":9,"rows_kept":81,"cut":false,"hidden":false,"merged":[[70,2,70,3],[74,2,74,3],[66,2,66,3],[3,7,3,8],[3,2,4,2],[54,2,54,3],[58,2,58,3],[62,2,62,3],[35,4,35,5],[3,1,4,1],[31,1,32,2],[33,1,33,2],[0,3,0,6],[3,3,3,4],[3,5,3,6]]}
[null,null,null,"Option tempo"]
["Puissance souscrite",{"$f":"Données!C3","v":15}]
[]
[null,"Puissance souscrite","Abonnement","Jours bleus",null,"Jours blancs",null,"Jours rouges"]
[null,null,null,"HC","HP","HC","HP","HC","HP"]
[null,9,{"$f":"A57/12","v":8.0724999999999998},{"$f":"D61","v":8.9599999999999999E-2},{"$f":"D57","v":0.1065},{"$f":"D69","v":0.1167},{"$f":"D65","v":0.13950000000000001},{"$f":"D77","v":0.18010000000000001},{"$f":"D73","v":0.42716999999999999}]
[null,12,{"$f":"A61/12","v":12.638333333333334},{"$f":"D6","v":8.9599999999999999E-2},0.1065,0.1167,0.13950000000000001,0.18010000000000001,0.42716999999999999]
[null,15,{"$f":"A65/12","v":14.585833333333333},8.9599999999999999E-2,0.1065,0.1167,0.13950000000000001,0.18010000000000001,0.42716999999999999]
[null,18,{"$f":"A69/12","v":16.461666666666666},8.9599999999999999E-2,0.1065,0.1167,0.13950000000000001,0.18010000000000001,0.42716999999999999]
[]
[]
[]
[null,null,{"$f":"TRUNC(VLOOKUP($B2,$B6:$I12,2),4)","v":14.585800000000001},{"$f":"TRUNC(VLOOKUP($B2,$B6:$I12,3),4)","v":8.9599999999999999E-2},{"$f":"TRUNC(VLOOKUP($B2,$B6:$I12,4),4)","v":0.1065},{"$f":"TRUNC(VLOOKUP($B2,$B6:$I12,5),4)","v":0.1167},{"$f":"TRUNC(VLOOKUP($B2,$B6:$I12,6),4)","v":0.13950000000000001},{"$f":"TRUNC(VLOOKUP($B2,$B6:$I12,7),4)","v":0.18010000000000001},{"$f":"TRUNC(VLOOKUP($B2,$B6:$I12,8),4)","v":0.42709999999999998}]
[]
[]
["Bleu",{"$f":"C25-B25+C26-B26","v":0},{"$f":"Données!B37","v":1.95E-2},{"$f":"B16*C16","v":0},null,"HT","TTC"]
["Blanc",{"$f":"C27-B27+C28-B28","v":0},{"$f":"Données!B$37","v":1.95E-2},{"$f":"B17*C17","v":0},null,{"$f":"SUM(D16:D18)","v":0},{"$f":"(F17*B44)+F17","v":0}]
["Rouge",{"$f":"C29-B29+C30-B30","v":0},{"$f":"Données!B$37","v":1.95E-2},{"$f":"B18*C18","v":0}]
[null,{"$f":"SUM(B16:B18)","v":0}]
["Des taxes municipales au taux de 8% et des taxes départementales au taux de 4% basées sur 80% du montant HT "]
[]
[null,{"$f":"B21+C21","v":0},null,{"$f":"D21","v":0}]
[]
[null,"Ancien","Nouveau","Différence","Consommation en kWh","Prix du kWh en €","Prix HT en €"]
["Bleu HC",0,{"$f":"Données!E15","v":0},{"$f":"C25-B25","v":0},{"$f":"D25","v":0},{"$f":"D13","v":8.9599999999999999E-2},{"$f":"F25*E25","v":0}]
["Bleu HP",{"$f":"Données!C16","v":0},{"$f":"Données!E16","v":0},0,0,{"$f":"E13","v":0.1065},0]
["Blanc HC",{"$f":"Données!C17","v":0},{"$f":"Données!E17","v":0},0,0,{"$f":"F13","v":0.1167},0]
["Blanc HP",{"$f":"Données!C18","v":0},{"$f":"Données!E18","v":0},0,0,{"$f":"G13","v":0.13950000000000001},0]
["Rouge HC",{"$f":"Données!C19","v":0},{"$f":"Données!E19","v":0},0,0,{"$f":"H13","v":0.18010000000000001},0]
["Rouge HP",{"$f":"Données!C20","v":0},{"$f":"Données!E20","v":0},0,0,{"$f":"I13","v":0.42709999999999998},0]
{"$rows_left_out":52}
{"sheet":"COMPAR","index":5,"n_rows":61,"n_cols":18,"rows_kept":61,"cut":false,"hidden":false,"merged":[[44,13,44,14],[44,15,44,16],[0,9,1,9],[0,0,0,6],[44,10,44,12],[39,10,39,12],[27,0,28,3],[31,0,32,5],[34,0,35,4]]}
["COMPARAISON TARIF UEM",null,null,null,null,null,null,107,"m2",108,"http://itow.fr/itow/edfbc.php"]
[]
[]
[null,"Réglage "]
["Mois",{"$f":"Données!C26","v":12},null,null,"Ancien relevé ",null,"Nouveau relevé",null,"PRIX TTC "]
["Puissance KW",{"$f":"Données!C3","v":15}]
[]
[]
[null,"Bleu ",{"$f":"Données!G16","v":0.87000000000000011},"HC",{"$f":"'Tempo bleu'!B25","v":0},{"$f":"(G9-E9)/$G$15","v":{"$error":"#DIV/0!"}},{"$f":"'Tempo bleu'!C25","v":0}]
[null,null,null,"HP",{"$f":"'Tempo bleu'!B26","v":0},{"$error":"#DIV/0!"},{"$f":"'Tempo bleu'!C26","v":0}]
["TEMPO","Blanc",{"$f":"Données!G18","v":0.1},"HC",{"$f":"'Tempo bleu'!B27","v":0},{"$error":"#DIV/0!"},{"$f":"'Tempo bleu'!C27","v":0}]
[null,null,null,"HP",{"$f":"'Tempo bleu'!B28","v":0},{"$error":"#DIV/0!"},{"$f":"'Tempo bleu'!C28","v":0}]
[null,"Rouge ",{"$f":"Données!G20","v":0.03},"HC",{"$f":"'Tempo bleu'!B29","v":0},{"$error":"#DIV/0!"},{"$f":"'Tempo bleu'!C29","v":0}]
[null,null,null,"HP",{"$f":"'Tempo bleu'!B30","v":0},{"$error":"#DIV/0!"},{"$f":"'Tempo bleu'!C30","v":0}]
[null,null,null,null,null,"Somme",{"$f":"SUM('Tempo bleu'!E31)","v":0}]
[null,null,null,"Autres énergie pour chauffage équivalent",null,null,null,{"$f":"IF(I16=\"non\",0,F35*G35/365*30)","v":0},"non","jours"]
[null,null,null,"Total Chauffage et équivalent",null,null,null,null,{"$f":"'Tempo bleu'!G47","v":217.25892384000002},{"$f":"I17+H16","v":217.25892384000002}]
[null,null,null,null,null,null,"Prix du Kwh Net",null,{"$f":"I17/G15","v":{"$error":"#DIV/0!"}}]
[]
[]
[null,null,null,"Autres énergie pour chauffage équivalent",null,null,null,{"$f":"H16","v":0},null,{"$f":"J16","v":"jours"}]
[null,null,null,"HC",{"$f":"'Option HC bleu'!B27","v":0},{"$f":"G22/G24","v":{"$error":"#DIV/0!"}},{"$f":"'Option HC bleu'!C27","v":0},null,{"$f":"'Option HC bleu'!G47+H21","v":226.58425744000002},{"$f":"H21+I22","v":226.58425744000002},{"$f":"I22-I17","v":9.3253335999999933}]
["OPTION HC",null,null,"HP",{"$f":"'Option HC bleu'!B26","v":0},{"$f":"G23/G24","v":{"$error":"#DIV/0!"}},{"$f":"'Option HC bleu'!C26","v":0}]
[null,null,null,null,null,{"$f":"F15","v":"Somme"},{"$f":"'Option HC bleu'!D28","v":0}]
[null,null,null,null,null,null,"Prix du Kwh Net",null,{"$f":"I22/G24","v":{"$error":"#DIV/0!"}}]
[]
[null,null,null,"Autres énergie pour chauffage équivalent",null,null,null,{"$f":"H16","v":0},null,{"$f":"J21","v":"jours"}]
["BASE UEM 2012 107M2 Chauffés ECS 300 L 2 personnes tarif 15 Kva",null,null,null,{"$f":"'Base UEM'!B26","v":0},null,{"$f":"'Base UEM'!C26","v":0},null,{"$f":"'Base UEM'!G47+H27","v":208.07029583999997},{"$f":"I28+H27","v":208.07029583999997},{"$f":"I28-I17","v":-9.1886280000000511}]
[null,null,null,null,null,null,"Prix du Kwh Net",null,{"$f":"I28/G28","v":{"$error":"#DIV/0!"}}]
[]
{"$rows_left_out":32}
{"sheet":"Pac","index":6,"n_rows":124,"n_cols":36,"rows_kept":124,"cut":false,"hidden":false,"merged":[]}
[null,null,null,null,null,null,null,null,null,null,null,null,null,null,null,null,null,null,null,"Année",2012]
[null,"ANNEES",2012,{"$f":"C2+1","v":2013},2014,2015,2016,2017,2018,2019,2020,"TOTAL","CUMUL Hp/HC","MOYENNE","Kw/j","Somme Kw/j",null,null,null,"Mois",8]
["MOIS",null,null,null,null,null,null,null,null,null,null,null,null,null,null,null,null,null,null,"Jour",29,{"$f":"IF(AND(ISNUMBER(U1),ISNUMBER(U2),ISNUMBER(U3)),\" \" & CHOOSE(WEEKDAY(DATE(U1,U2,U3),1),\"DIMANCHE\",\"LUNDI\",\"MARDI\",\"MERCREDI\",\"JEUDI\",\"VENDREDI\",\"SAMEDI\") & \" !\",\"\")","v":" MERCREDI !"},null,"Remise en route"]
[2008,null,null,null,null,null,null,null,null,null,null,null,null,null,null,null,null,null,null,null,null,{"$f":"IF(AND(ISNUMBER(U1),ISNUMBER(U2),ISNUMBER(U3)),\"C'est le \" & TODAY()-DATE(U1,U2,U3) & \"° jour depuis la réparation\" & \" !\",\"\")","v":"C'est le 2227° jour depuis la réparation !"}]
["JANVIER Hp",null,null,null,null,null,null,null,null,null,null,{"$f":"SUM(C5:K5)","v":0},null,{"$f":"AVERAGE(D5:K5)","v":{"$error":"#DIV/0!"}},{"$f":"N5/31","v":{"$error":"#DIV/0!"}},{"$f":"O5+O6","v":{"$error":"#DIV/0!"}}]
[null,null,null,null,null,null,null,null,null,null,null,0,{"$f":"+L6+L5","v":0},{"$f":"AVERAGE(D6:K6)","v":{"$error":"#DIV/0!"}},{"$f":"N6/31","v":{"$error":"#DIV/0!"}}]
["FÉVRIER Hp",null,null,null,null,null,null,null,null,null,null,0,null,{"$error":"#DIV/0!"},{"$f":"N7/28","v":{"$error":"#DIV/0!"}},{"$f":"O7+O8","v":{"$error":"#DIV/0!"}},null,null,null,{"$f":"TODAY()","v":"2018-10-04"}]
[null,null,null,null,null,null,null,null,null,null,null,0,{"$f":"L8+L7","v":0},{"$error":"#DIV/0!"},{"$f":"N8/28","v":{"$error":"#DIV/0!"}},null,null,null,null,"Nb Jour écoulé",null,{"$f":"IF(AND(ISNUMBER(U1),ISNUMBER(U2),ISNUMBER(U3)),TODAY()-DATE(U1,U2,U3),\"\")","v":2227}]
["MARS Hp",null,null,null,null,null,null,null,null,null,null,0,null,{"$error":"#DIV/0!"},{"$error":"#DIV/0!"},{"$f":"O9+O10","v":{"$error":"#DIV/0!"}}]
[null,null,null,null,null,null,null,null,null,null,null,0,{"$f":"L10+L9","v":0},{"$error":"#DIV/0!"},{"$error":"#DIV/0!"},null,null,"Année",null,365]
["AVRIL Hp",null,null,null,null,null,null,null,null,null,null,0,null,{"$error":"#DIV/0!"},{"$f":"N11/30","v":{"$error":"#DIV/0!"}},{"$f":"O11+O12","v":{"$error":"#DIV/0!"}},null,"avant le 7 6 2012",null,null,6076,1549,3.93,"h/j"]
[null,null,null,null,null,null,null,null,null,null,null,0,{"$f":"L12+L11","v":0},{"$error":"#DIV/0!"},{"$f":"N12/30","v":{"$error":"#DIV/0!"}},null,null,null,null,"Kw",null,"Heures","résistances","G"]
["MAI Hp",null,null,null,null,null,null,null,null,null,null,0,null,{"$error":"#DIV/0!"},{"$error":"#DIV/0!"},{"$f":"O13+O14","v":{"$error":"#DIV/0!"}},null,"Total PAC",null,{"$f":"L40","v":0},null,{"$f":"L33","v":0},{"$f":"L34","v":0},{"$f":"(T19)/(107*2.5*(21-15))*1000","v":{"$error":"#DIV/0!"}}]
[null,null,null,null,null,null,null,null,null,null,null,0,{"$f":"L14+L13","v":0},{"$error":"#DIV/0!"},{"$f":"N14/31","v":{"$error":"#DIV/0!"}}]
["JUIN Hp",null,null,null,null,null,null,null,null,null,null,0,null,{"$error":"#DIV/0!"},{"$f":"N15/30","v":{"$error":"#DIV/0!"}},{"$f":"O15+O16","v":{"$error":"#DIV/0!"}},null,"Kw/J",null,{"$f":"T13/V8","v":0},null,{"$f":"(V13)/V8","v":0},"h/j"]
["30 j ECS seule",null,null,null,null,null,null,null,null,null,null,0,{"$f":"L16+L15","v":0},{"$error":"#DIV/0!"},{"$f":"N16/30","v":{"$error":"#DIV/0!"}}]
["JUILLET Hp",null,null,null,null,null,null,null,null,null,null,0,null,{"$error":"#DIV/0!"},{"$error":"#DIV/0!"},{"$f":"O17+O18","v":{"$error":"#DIV/0!"}},null,"Kw/h",null,{"$f":"T15/24","v":0},null,{"$f":"V15*T10","v":0}]
["29 j ecs seule",null,null,null,null,null,null,null,null,null,null,0,{"$f":"L18+L17","v":0},{"$error":"#DIV/0!"},{"$error":"#DIV/0!"}]
["ECS AOÛT Hp",null,null,null,null,null,null,null,null,null,null,0,null,{"$f":"AVERAGE(C19:K19)","v":{"$error":"#DIV/0!"}},{"$error":"#DIV/0!"},{"$f":"O19+O20","v":{"$error":"#DIV/0!"}},null,"Kw/hmax",null,{"$f":"N5/31/24","v":{"$error":"#DIV/0!"}}]
[null,null,null,null,null,null,null,null,null,null,null,0,{"$f":"L20+L19","v":0},{"$error":"#DIV/0!"},{"$error":"#DIV/0!"}]
["SEPTEMBRE Hp",null,null,null,null,null,null,null,null,null,null,0,null,{"$error":"#DIV/0!"},{"$f":"N21/30","v":{"$error":"#DIV/0!"}},{"$f":"O21+O22","v":{"$error":"#DIV/0!"}}]
[null,null,null,null,null,null,null,null,null,null,null,0,{"$f":"L22+L21","v":0},{"$error":"#DIV/0!"},{"$f":"N22/30","v":{"$error":"#DIV/0!"}}]
["OCTOBRE Hp",null,null,null,null,null,null,null,null,null,null,0,null,{"$error":"#DIV/0!"},{"$error":"#DIV/0!"},{"$f":"O23+O24","v":{"$error":"#DIV/0!"}}]
[null,null,null,null,null,null,null,null,null,null,null,0,{"$f":"L24+L23","v":0},{"$error":"#DIV/0!"},{"$error":"#DIV/0!"}]
["NOVEMBRE Hp",null,null,null,null,null,null,null,null,null,null,0,null,{"$error":"#DIV/0!"},{"$f":"N25/30","v":{"$error":"#DIV/0!"}},{"$f":"O25+O26","v":{"$error":"#DIV/0!"}}]
[null,null,null,null,null,null,null,null,null,null,null,0,{"$f":"L26+L25","v":0},{"$error":"#DIV/0!"},{"$f":"N26/30","v":{"$error":"#DIV/0!"}}]
["DÉCEMBRE Hp",null,null,null,null,null,null,null,null,null,null,0,null,{"$error":"#DIV/0!"},{"$error":"#DIV/0!"},{"$f":"O27+O28","v":{"$error":"#DIV/0!"}}]
[null,null,null,null,null,null,null,null,null,null,null,0,{"$f":"L28+L27","v":0},{"$error":"#DIV/0!"},{"$f":"N28/31","v":{"$error":"#DIV/0!"}}]
[null,null,null,null,null,null,null,null,null,null,null,null,null,null,null,null,null,"Conso /an moyenne",null,{"$f":"T10*T15","v":0}]
["Somme HP /An",null,{"$f":"C5+C7+C9+C11+C13+C15+C17+C19+C21+C23+C25+C27","v":0},0,0,0,0,0,0,0,0]
{"$rows_left_out":95}
{"sheet":"elec","index":7,"n_rows":117,"n_cols":35,"rows_kept":117,"cut":false,"hidden":false,"merged":[[39,2,39,15]]}
[]
[null,"ANNEES",2008,{"$f":"C2+1","v":2009},{"$f":"D2+1","v":2010},2011,2012,2013,2014,{"$f":"I2+1","v":2015},{"$f":"J2+1","v":2016},{"$f":"K2+1","v":2017},2018,2019,{"$f":"N2+1","v":2020},2021,"Compteur","CUMUL","MOYENNE 2008/2010","jour"]
[null,"MOIS"]
[]
[null,"JAN Hp",null,null,null,null,null,null,null,null,null,null,null,null,null,null,{"$f":"SUM(C5:P5)","v":0},null,{"$f":"AVERAGE(C5:P5)","v":{"$error":"#DIV/0!"}},{"$f":"S5/31","v":{"$error":"#DIV/0!"}}]
[null,"hc",null,null,null,null,null,null,null,null,null,null,null,null,null,null,0,{"$f":"Q4+Q6","v":0},{"$error":"#DIV/0!"},{"$f":"S6/31","v":{"$error":"#DIV/0!"}}]
[null,"FEV Hp",null,null,null,null,null,null,null,null,null,null,null,null,null,null,0,0,{"$error":"#DIV/0!"},{"$f":"S7/28","v":{"$error":"#DIV/0!"}}]
[null,"hc",null,null,null,null,null,null,null,null,null,null,null,null,null,null,0,0,{"$error":"#DIV/0!"},{"$f":"S8/28","v":{"$error":"#DIV/0!"}}]
[null,"MAR Hp",null,null,null,null,null,null,null,null,null,null,null,null,null,null,0,0,{"$error":"#DIV/0!"},{"$error":"#DIV/0!"}]
[null,"hc",null,null,null,null,null,null,null,null,null,null,null,null,null,null,0,0,{"$error":"#DIV/0!"},{"$error":"#DIV/0!"}]
[null,"AVR Hp",null,null,null,null,null,null,null,null,null,null,null,null,null,null,0,0,{"$error":"#DIV/0!"},{"$f":"S11/30","v":{"$error":"#DIV/0!"}}]
[null,"hc",null,null,null,null,null,null,null,null,null,null,null,null,null,null,0,0,{"$error":"#DIV/0!"},{"$f":"S12/30","v":{"$error":"#DIV/0!"}}]
[null,"MAI Hp",null,null,null,null,null,null,null,null,null,null,null,null,null,null,0,0,{"$error":"#DIV/0!"},{"$error":"#DIV/0!"}]
[null,"hc",null,null,null,null,null,null,null,null,null,null,null,null,null,null,0,0,{"$error":"#DIV/0!"},{"$error":"#DIV/0!"}]
[null,"JUI hp",null,null,null,null,null,null,null,null,null,null,null,null,null,null,0,{"$f":"R13+Q15","v":0},{"$error":"#DIV/0!"},{"$f":"S15/30","v":{"$error":"#DIV/0!"}}]
[null,"hc",null,null,null,null,null,null,null,null,null,null,null,null,null,null,0,{"$f":"Q14+Q16","v":0},{"$f":"AVERAGE(D16:P16)","v":{"$error":"#DIV/0!"}},{"$f":"S16/30","v":{"$error":"#DIV/0!"}}]
[null,"JUI Hp",null,null,null,null,null,null,null,null,null,null,null,null,null,null,0,{"$f":"R15+Q17","v":0},{"$f":"AVERAGE(C17:P17)","v":{"$error":"#DIV/0!"}},{"$error":"#DIV/0!"}]
[null,"hc",null,null,null,null,null,null,null,null,null,null,null,null,null,null,0,{"$f":"Q16+Q18","v":0},{"$f":"AVERAGE(D18:P18)","v":{"$error":"#DIV/0!"}},{"$error":"#DIV/0!"}]
[null,"AOU Hp",null,null,null,null,null,null,null,null,null,null,null,null,null,null,0,{"$f":"R17+Q19","v":0},{"$f":"AVERAGE(C19:P19)","v":{"$error":"#DIV/0!"}},{"$error":"#DIV/0!"}]
[null,"hc",null,null,null,null,null,null,null,null,null,null,null,null,null,null,0,{"$f":"Q18+Q20","v":0},{"$f":"AVERAGE(D20:P20)","v":{"$error":"#DIV/0!"}},{"$error":"#DIV/0!"}]
[null,"SEP hp",null,null,null,null,null,null,null,null,null,null,null,null,null,null,0,{"$f":"R19+Q21","v":0},{"$f":"AVERAGE(C21:P21)","v":{"$error":"#DIV/0!"}},{"$f":"S21/30","v":{"$error":"#DIV/0!"}}]
[null,"hc",null,null,null,null,null,null,null,null,null,null,null,null,null,null,0,{"$f":"Q20+Q22","v":0},{"$f":"AVERAGE(D22:P22)","v":{"$error":"#DIV/0!"}},{"$f":"S22/30","v":{"$error":"#DIV/0!"}}]
[null,"OCT Hp",null,null,null,null,null,null,null,null,null,null,null,null,null,null,0,{"$f":"R21+Q23","v":0},{"$f":"AVERAGE(C23:P23)","v":{"$error":"#DIV/0!"}},{"$error":"#DIV/0!"}]
[null,"hc",null,null,null,null,null,null,null,null,null,null,null,null,null,null,0,{"$f":"Q22+Q24","v":0},{"$f":"AVERAGE(D24:P24)","v":{"$error":"#DIV/0!"}},{"$error":"#DIV/0!"}]
[null,"NOV Hp",null,null,null,null,null,null,null,null,null,null,null,null,null,null,0,{"$f":"R23+Q25","v":0},{"$f":"AVERAGE(C25:P25)","v":{"$error":"#DIV/0!"}},{"$f":"S25/30","v":{"$error":"#DIV/0!"}}]
[null,"hc",null,null,null,null,null,null,null,null,null,null,null,null,null,null,0,{"$f":"Q24+Q26","v":0},{"$f":"AVERAGE(D26:P26)","v":{"$error":"#DIV/0!"}},{"$f":"S26/30","v":{"$error":"#DIV/0!"}}]
[null,"DEC Hp",null,null,null,null,null,null,null,null,null,null,null,null,null,null,0,{"$f":"R25+Q27","v":0},{"$f":"AVERAGE(C27:P27)","v":{"$error":"#DIV/0!"}},{"$error":"#DIV/0!"}]
[null,"hc",null,null,null,null,null,null,null,null,null,null,null,null,null,null,0,{"$f":"Q26+Q28","v":0},{"$f":"AVERAGE(D28:P28)","v":{"$error":"#DIV/0!"}},{"$error":"#DIV/0!"}]
["index",null,null,null,null,null,null,null,null,null,null,null,null,null,null,null,"COMPTEUR"]
[38234,"Somme Hp",{"$f":"C27+C25+C23+C21+C19+C17+C15+C13+C11+C9+C7+C5","v":0},{"$f":"D27+D25+D23+D21+D19+D17+D15+D13+D11+D9+D7+D5","v":0},{"$f":"E27+E25+E23+E21+E19+E17+E15+E13+E11+E9+E7+E5","v":0},0,0,{"$f":"H27+H25+H23+H21+H19+H17+H15+H13+H11+H9+H7+H5","v":0},{"$f":"I27+I25+I23+I21+I19+I17+I15+I13+I11+I9+I7+I5","v":0},0,0,{"$f":"L27+L25+L23+L21+L19+L17+L15+L13+L11+L9+L7+L5","v":0},0,0,0,0,{"$f":"SUM(D27+D25)-128+A30+SUM(E30:P30)","v":38106},{"$f":"R27","v":0},{"$f":"S27+S25+S23+S21+S19+S17+S15+S13+S11+S9+S7+S5","v":{"$error":"#DIV/0!"}}]
{"$rows_left_out":88}
{"sheet":"Liste","index":8,"n_rows":96,"n_cols":8,"rows_kept":96,"cut":false,"hidden":false,"merged":[]}
["Département","DJU 18°","Temp base","Ville"]
[1,2626,-10,"01 Amberieu"]
[2,2963,-7,"02 Eparcy"]
[3,2508,-8,"03 Vichy"]
[4,3323,-8,"04 Saint André Les Alpes"]
[5,4475,-10,"Agnières En Devoluy"]
[6,3428,-8]
[7,2314,-8]
[8,3089,-10]
[9,3206,-5]
[10,2620,-10]
[11,1930,-4]
[12,2703,-6]
[13,1853,-5]
[14,2517,-7,null,null,null,null,"Calcul DJU base 18°"]
[15,3302,-8,null,null,null,null,"DJU = 18 – Tmin + Tmax / 2"]
[16,2136,-5,null,null,null,null,"Exemple pour deux jours (NJ)"]
[17,1846,-5,null,null,null,null,"Le 10/10/2005 = Tmin 8°  Tmax 12  d’où DJU  = 18 – (8 + 12 / 2) = 8"]
[18,2487,-7,null,null,null,null,"Le 11/10/2005 = Tmin 6°  Tmax 10  d’où DJU  = 18 – (6 + 10 / 2) = 8"]
[19,3200,-8,null,null,null,null,"soit au total 16 DJU (pour NJ=2) "]
[20,3022,-2]
[21,2868,-10,null,null,null,null,"Correction pour une base 21°"]
[22,2445,-4,null,null,null,null,"écart base T° = 21°-18°=3°"]
[23,3061,-8,null,null,null,null,"DJU = DJU période + (NJ * écart base T°)"]
[24,2079,-5,null,null,null,null,"DJU = 16 + ( 2 * 3)  = 22   "]
[25,3548,-12]
[26,3389,-6]
[27,2600,-7]
[28,2586,-7]
[29,2160,-4]
{"$rows_left_out":66}