{"text_format":"1","workbook":"xlsx","n_sheets":13,"sheets":["Listes","Janvier","Février","Mars","Avril","Mai","Juin","Juillet","Août","Septembre","Octobre","Novembre","Décembre"],"not_rendered":{"charts":0,"images":0,"macros":1,"external_links":0,"defined_names":3,"comments":0,"pivot_tables":0},"unopened":[],"bounds":{"document_bytes":16777216,"sheet_cells":100000,"rows_first":2000,"rows_last":500,"rows_between":2000,"halvings":0,"cell_chars":16384,"cell_head_chars":4096},"cells_cut":0,"cells_raw":0,"read":"whole","date_system":"1900"}

{"sheet":"Listes","index":0,"n_rows":28,"n_cols":3,"rows_kept":28,"cut":false,"hidden":true,"merged":[]}
["Statuts","Motifs","Grades"]
["Defense_Active","Consultation_Médecine_Générale_IAS","SDT"]
["Defense_Réserve","Consultation_Médecine_Générale_NIAS","1CL"]
["Defense_Civil_MINDEF","Visite_Médicale_Périodique","CPL"]
["Gendarmerie_Active","Expertise_Médicale_Initiale","CCH"]
["Gendarmerie_Réserve","Consultation_Aptitude_Médicale_IAS","CC1"]
["Gendarmerie_Civil_Non_MINDEF","Consultation_Aptitude_Médicale_NIAS","SGT"]
["Famille","Visite_Médicale_Périodique_SMR","SCH"]
["Autre","Soin_Infirmier_IAS","ADJ"]
[null,"Soin_Infirmier_NIAS","ADC"]
[null,"Consultation_Thérapie_Manuelle_IAS","MAJ"]
[null,"Consultation_Thérapie_Manuelle_NIAS","SLT"]
[null,"Consultation_Spécialisée_IAS","LTN"]
[null,"Consultation_Spécialisée_NIAS","CNE"]
[null,"Expertise_Droit_Commun","CDT"]
[null,"Visite_Médicale_Non_Justifiée_IAS","LCL"]
[null,"Visite_Médicale_Non_Justifiée_NIAS","COL"]
[null,"Consultation_Nutrition_IAS","GAL"]
[null,"Consultation_Nutrition_NIAS","ISG1G"]
[null,"Consultation_Gynécologie_IAS","ISG2G"]
[null,"Consultation_Gynécologie_NIAS","MED"]
[null,null,"MP"]
[null,null,"MC"]
[null,null,"MCS"]
[null,null,"GAV"]
[null,null,"GEND"]
[null,null,"MME"]
[null,null,"MR"]

{"sheet":"Janvier","index":1,"n_rows":3624,"n_cols":7,"rows_kept":3624,"cut":false,"hidden":false,"merged":[]}
["Ordre","Date","Grade","Nom","Prénom","Statut","Motif de consultation"]
[{"$f":"IF(NOT(ISBLANK(C2)),ROW(C2)-1,\"\")","v":1},{"$f":"IF(C2=\"\",\"\",IF(B2<>\"\",B2,NOW()))","v":"2018-09-24T13:39:17.800"},"SDT","AAAAA","AAAAA","Defense_Active","Consultation_Médecine_Générale_IAS"]
[{"$f":"IF(NOT(ISBLANK(C3)),ROW(C3)-1,\"\")","v":2},"2018-09-24T16:16:30.540","SDT","CCCCC","CCCCC","Defense_Active","Consultation_Médecine_Générale_IAS"]
[3,"2018-09-24T16:18:35.750","SDT","DDDDD","DDDDD","Defense_Active","Consultation_Médecine_Générale_IAS"]
["",""]
["",""]
["",""]
["",""]
["",""]
["",""]
["",""]
["",""]
["",""]
["",""]
["",""]
["",""]
["",""]
["",""]
["",""]
["",""]
["",""]
["",""]
["",""]
["",""]
["",""]
["",""]
["",""]
["",""]
["",""]
["",""]
["",""]
["",""]
["",""]
["",""]
["",""]
["",""]
["",""]
["",""]
["",""]
["",""]
["",""]
["",""]
["",""]
["",""]
["",""]
["",""]
["",""]
["",""]
["",""]
["",""]
["",""]
["",""]
["",""]
["",""]
["",""]
["",""]
["",""]
["",""]
["",""]
["",""]
["",""]
["",""]
["",""]
["",{"$f":"IF(C64=\"\",\"\",IF(B64<>\"\",B64,NOW()))","v":""}]
["",""]
[{"$f":"IF(NOT(ISBLANK(C66)),ROW(C66)-1,\"\")","v":""},""]
["",""]
["",""]
["",""]
["",""]
["",""]
["",""]
["",""]
["",""]
["",""]
["",""]
["",""]
["",""]
["",""]
["",""]
["",""]
["",""]
["",""]
["",""]
["",""]
["",""]
["",""]
["",""]
["",""]
["",""]
["",""]
["",""]
["",""]
["",""]
["",""]
["",""]
["",""]
["",""]
["",""]
["",""]
["",""]
["",""]
["",""]
["",""]
["",""]
["",""]
["",""]
["",""]
["",""]
["",""]
["",""]
["",""]
["",""]
["",""]
["",""]
["",""]
["",""]
["",""]
["",""]
["",""]
{"$rows_left_out":3505}
{"sheet":"Février","index":2,"n_rows":3627,"n_cols":7,"rows_kept":3627,"cut":false,"hidden":false,"merged":[]}
["Ordre","Date","Grade","Nom","Prénom","Statut","Motif de consultation"]
[{"$f":"IF(NOT(ISBLANK(C2)),VLOOKUP(9^9,Janvier!A2:A3624,1)+1,\"\")","v":4},{"$f":"IF(C2=\"\",\"\",IF(B2<>\"\",B2,NOW()))","v":"2018-09-24T16:19:54.510"},"SDT","EEEEE","EEEEE","Defense_Active","Consultation_Médecine_Générale_IAS"]
[{"$f":"IF(NOT(ISBLANK(C3)),ROW(C3)-1,\"\")","v":2},{"$f":"IF(C3=\"\",\"\",IF(B3<>\"\",B3,NOW()))","v":"2018-09-24T16:19:58.730"},"SDT","FFFFF","FFFFF","Defense_Active","Consultation_Médecine_Générale_IAS"]
[3,"2018-09-24T16:20:35.990","SDT","GGGGG","GGGGG","Defense_Active","Consultation_Médecine_Générale_IAS"]
[4,"2018-09-24T16:25:02.170","SDT","HHHHH","HHHHH","Defense_Active","Consultation_Médecine_Générale_IAS"]
["",""]
["",""]
["",""]
["",""]
["",""]
["",""]
["",""]
["",""]
["",""]
["",""]
["",""]
["",""]
["",""]
["",""]
["",""]
["",""]
["",""]
["",""]
["",""]
["",""]
["",""]
["",""]
["",""]
["",""]
["",""]
["",""]
["",""]
["",""]
["",""]
["",""]
["",""]
["",""]
["",""]
["",""]
["",""]
["",""]
["",""]
["",""]
["",""]
["",""]
["",""]
["",""]
["",""]
["",""]
["",""]
["",""]
["",""]
["",""]
["",""]
["",""]
["",""]
["",""]
["",""]
["",""]
["",""]
["",""]
["",""]
["",""]
["",""]
["",""]
["",""]
["",{"$f":"IF(C67=\"\",\"\",IF(B67<>\"\",B67,NOW()))","v":""}]
[{"$f":"IF(NOT(ISBLANK(C68)),ROW(C68)-1,\"\")","v":""},""]
["",""]
["",""]
["",""]
["",""]
["",""]
["",""]
["",""]
["",""]
["",""]
["",""]
["",""]
["",""]
["",""]
["",""]
["",""]
["",""]
["",""]
["",""]
["",""]
["",""]
["",""]
["",""]
["",""]
["",""]
["",""]
["",""]
["",""]
["",""]
["",""]
["",""]
["",""]
["",""]
["",""]
["",""]
["",""]
["",""]
["",""]
["",""]
["",""]
["",""]
["",""]
["",""]
["",""]
["",""]
["",""]
["",""]
["",""]
["",""]
["",""]
["",""]
["",""]
["",""]
{"$rows_left_out":3508}
{"sheet":"Mars","index":3,"n_rows":3627,"n_cols":7,"rows_kept":3627,"cut":false,"hidden":false,"merged":[]}
["Ordre","Date","Grade","Nom","Prénom","Statut","Motif de consultation"]
[{"$f":"IF(NOT(ISBLANK(C2)),VLOOKUP(9^9,Février!A2:A3627,1)+1,\"\")","v":""},{"$f":"IF(C2=\"\",\"\",IF(B2<>\"\",B2,NOW()))","v":""}]
[{"$f":"IF(NOT(ISBLANK(C3)),ROW(C3)-1,\"\")","v":""},{"$f":"IF(C3=\"\",\"\",IF(B3<>\"\",B3,NOW()))","v":""}]
[{"$f":"IF(NOT(ISBLANK(C4)),ROW(C4)-1,\"\")","v":""},""]
["",""]
["",""]
["",""]
["",""]
["",""]
["",""]
["",""]
["",""]
["",""]
["",""]
["",""]
["",""]
["",""]
["",""]
["",""]
["",""]
["",""]
["",""]
["",""]
["",""]
["",""]
["",""]
["",""]
["",""]
["",""]
["",""]
["",""]
["",""]
["",""]
["",""]
["",""]
["",""]
["",""]
["",""]
["",""]
["",""]
["",""]
["",""]
["",""]
["",""]
["",""]
["",""]
["",""]
["",""]
["",""]
["",""]
["",""]
["",""]
["",""]
["",""]
["",""]
["",""]
["",""]
["",""]
["",""]
["",""]
["",""]
["",""]
["",""]
["",""]
["",""]
["",""]
["",{"$f":"IF(C67=\"\",\"\",IF(B67<>\"\",B67,NOW()))","v":""}]
[{"$f":"IF(NOT(ISBLANK(C68)),ROW(C68)-1,\"\")","v":""},""]
["",""]
["",""]
["",""]
["",""]
["",""]
["",""]
["",""]
["",""]
["",""]
["",""]
["",""]
["",""]
["",""]
["",""]
["",""]
["",""]
["",""]
["",""]
["",""]
["",""]
["",""]
["",""]
["",""]
["",""]
["",""]
["",""]
["",""]
["",""]
["",""]
["",""]
["",""]
["",""]
["",""]
["",""]
["",""]
["",""]
["",""]
["",""]
["",""]
["",""]
["",""]
["",""]
["",""]
["",""]
["",""]
["",""]
["",""]
["",""]
["",""]
["",""]
["",""]
["",""]
{"$rows_left_out":3508}
{"sheet":"Avril","index":4,"n_rows":3627,"n_cols":7,"rows_kept":3627,"cut":false,"hidden":false,"merged":[]}
["Ordre","Date","Grade","Nom","Prénom","Statut","Motif de consultation"]
[{"$f":"IF(NOT(ISBLANK(C2)),VLOOKUP(9^9,Mars!A2:A3627,1)+1,\"\")","v":""},{"$f":"IF(C2=\"\",\"\",IF(B2<>\"\",B2,NOW()))","v":""}]
[{"$f":"IF(NOT(ISBLANK(C3)),ROW(C3)-1,\"\")","v":""},{"$f":"IF(C3=\"\",\"\",IF(B3<>\"\",B3,NOW()))","v":""}]
[{"$f":"IF(NOT(ISBLANK(C4)),ROW(C4)-1,\"\")","v":""},""]
["",""]
["",""]
["",""]
["",""]
["",""]
["",""]
["",""]
["",""]
["",""]
["",""]
["",""]
["",""]
["",""]
["",""]
["",""]
["",""]
["",""]
["",""]
["",""]
["",""]
["",""]
["",""]
["",""]
["",""]
["",""]
["",""]
["",""]
["",""]
["",""]
["",""]
["",""]
["",""]
["",""]
["",""]
["",""]
["",""]
["",""]
["",""]
["",""]
["",""]
["",""]
["",""]
["",""]
["",""]
["",""]
["",""]
["",""]
["",""]
["",""]
["",""]
["",""]
["",""]
["",""]
["",""]
["",""]
["",""]
["",""]
["",""]
["",""]
["",""]
["",""]
["",""]
["",{"$f":"IF(C67=\"\",\"\",IF(B67<>\"\",B67,NOW()))","v":""}]
[{"$f":"IF(NOT(ISBLANK(C68)),ROW(C68)-1,\"\")","v":""},""]
["",""]
["",""]
["",""]
["",""]
["",""]
["",""]
["",""]
["",""]
["",""]
["",""]
["",""]
["",""]
["",""]
["",""]
["",""]
["",""]
["",""]
["",""]
["",""]
["",""]
["",""]
["",""]
["",""]
["",""]
["",""]
["",""]
["",""]
["",""]
["",""]
["",""]
["",""]
["",""]
["",""]
["",""]
["",""]
["",""]
["",""]
["",""]
["",""]
["",""]
["",""]
["",""]
["",""]
["",""]
["",""]
["",""]
["",""]
["",""]
["",""]
["",""]
["",""]
["",""]
{"$rows_left_out":3508}
{"sheet":"Mai","index":5,"n_rows":3627,"n_cols":7,"rows_kept":3627,"cut":false,"hidden":false,"merged":[]}
["Ordre","Date","Grade","Nom","Prénom","Statut","Motif de consultation"]
[{"$f":"IF(NOT(ISBLANK(C2)),VLOOKUP(9^9,Avril!A2:A3627,1)+1,\"\")","v":""},{"$f":"IF(C2=\"\",\"\",IF(B2<>\"\",B2,NOW()))","v":""}]
[{"$f":"IF(NOT(ISBLANK(C3)),ROW(C3)-1,\"\")","v":""},{"$f":"IF(C3=\"\",\"\",IF(B3<>\"\",B3,NOW()))","v":""}]
[{"$f":"IF(NOT(ISBLANK(C4)),ROW(C4)-1,\"\")","v":""},""]
["",""]
["",""]
["",""]
["",""]
["",""]
["",""]
["",""]
["",""]
["",""]
["",""]
["",""]
["",""]
["",""]
["",""]
["",""]
["",""]
["",""]
["",""]
["",""]
["",""]
["",""]
["",""]
["",""]
["",""]
["",""]
["",""]
["",""]
["",""]
["",""]
["",""]
["",""]
["",""]
["",""]
["",""]
["",""]
["",""]
["",""]
["",""]
["",""]
["",""]
["",""]
["",""]
["",""]
["",""]
["",""]
["",""]
["",""]
["",""]
["",""]
["",""]
["",""]
["",""]
["",""]
["",""]
["",""]
["",""]
["",""]
["",""]
["",""]
["",""]
["",""]
["",""]
["",{"$f":"IF(C67=\"\",\"\",IF(B67<>\"\",B67,NOW()))","v":""}]
[{"$f":"IF(NOT(ISBLANK(C68)),ROW(C68)-1,\"\")","v":""},""]
["",""]
["",""]
["",""]
["",""]
["",""]
["",""]
["",""]
["",""]
["",""]
["",""]
["",""]
["",""]
["",""]
["",""]
["",""]
["",""]
["",""]
["",""]
["",""]
["",""]
["",""]
["",""]
["",""]
["",""]
["",""]
["",""]
["",""]
["",""]
["",""]
["",""]
["",""]
["",""]
["",""]
["",""]
["",""]
["",""]
["",""]
["",""]
["",""]
["",""]
["",""]
["",""]
["",""]
["",""]
["",""]
["",""]
["",""]
["",""]
["",""]
["",""]
["",""]
["",""]
{"$rows_left_out":3508}
{"sheet":"Juin","index":6,"n_rows":3627,"n_cols":7,"rows_kept":3627,"cut":false,"hidden":false,"merged":[]}
["Ordre","Date","Grade","Nom","Prénom","Statut","Motif de consultation"]
[{"$f":"IF(NOT(ISBLANK(C2)),VLOOKUP(9^9,Mai!A2:A3627,1)+1,\"\")","v":""},{"$f":"IF(C2=\"\",\"\",IF(B2<>\"\",B2,NOW()))","v":""}]
[{"$f":"IF(NOT(ISBLANK(C3)),ROW(C3)-1,\"\")","v":""},{"$f":"IF(C3=\"\",\"\",IF(B3<>\"\",B3,NOW()))","v":""}]
[{"$f":"IF(NOT(ISBLANK(C4)),ROW(C4)-1,\"\")","v":""},""]
["",""]
["",""]
["",""]
["",""]
["",""]
["",""]
["",""]
["",""]
["",""]
["",""]
["",""]
["",""]
["",""]
["",""]
["",""]
["",""]
["",""]
["",""]
["",""]
["",""]
["",""]
["",""]
["",""]
["",""]
["",""]
["",""]
["",""]
["",""]
["",""]
["",""]
["",""]
["",""]
["",""]
["",""]
["",""]
["",""]
["",""]
["",""]
["",""]
["",""]
["",""]
["",""]
["",""]
["",""]
["",""]
["",""]
["",""]
["",""]
["",""]
["",""]
["",""]
["",""]
["",""]
["",""]
["",""]
["",""]
["",""]
["",""]
["",""]
["",""]
["",""]
["",""]
["",{"$f":"IF(C67=\"\",\"\",IF(B67<>\"\",B67,NOW()))","v":""}]
[{"$f":"IF(NOT(ISBLANK(C68)),ROW(C68)-1,\"\")","v":""},""]
["",""]
["",""]
["",""]
["",""]
["",""]
["",""]
["",""]
["",""]
["",""]
["",""]
["",""]
["",""]
["",""]
["",""]
["",""]
["",""]
["",""]
["",""]
["",""]
["",""]
["",""]
["",""]
["",""]
["",""]
["",""]
["",""]
["",""]
["",""]
["",""]
["",""]
["",""]
["",""]
["",""]
["",""]
["",""]
["",""]
["",""]
["",""]
["",""]
["",""]
["",""]
["",""]
["",""]
["",""]
["",""]
["",""]
["",""]
["",""]
["",""]
["",""]
["",""]
["",""]
{"$rows_left_out":3508}
{"sheet":"Juillet","index":7,"n_rows":3627,"n_cols":7,"rows_kept":3627,"cut":false,"hidden":false,"merged":[]}
["Ordre","Date","Grade","Nom","Prénom","Statut","Motif de consultation"]
[{"$f":"IF(NOT(ISBLANK(C2)),VLOOKUP(9^9,Juin!A2:A3627,1)+1,\"\")","v":""},{"$f":"IF(C2=\"\",\"\",IF(B2<>\"\",B2,NOW()))","v":""}]
[{"$f":"IF(NOT(ISBLANK(C3)),ROW(C3)-1,\"\")","v":""},{"$f":"IF(C3=\"\",\"\",IF(B3<>\"\",B3,NOW()))","v":""}]
[{"$f":"IF(NOT(ISBLANK(C4)),ROW(C4)-1,\"\")","v":""},""]
["",""]
["",""]
["",""]
["",""]
["",""]
["",""]
["",""]
["",""]
["",""]
["",""]
["",""]
["",""]
["",""]
["",""]
["",""]
["",""]
["",""]
["",""]
["",""]
["",""]
["",""]
["",""]
["",""]
["",""]
["",""]
["",""]
["",""]
["",""]
["",""]
["",""]
["",""]
["",""]
["",""]
["",""]
["",""]
["",""]
["",""]
["",""]
["",""]
["",""]
["",""]
["",""]
["",""]
["",""]
["",""]
["",""]
["",""]
["",""]
["",""]
["",""]
["",""]
["",""]
["",""]
["",""]
["",""]
["",""]
["",""]
["",""]
["",""]
["",""]
["",""]
["",""]
["",{"$f":"IF(C67=\"\",\"\",IF(B67<>\"\",B67,NOW()))","v":""}]
[{"$f":"IF(NOT(ISBLANK(C68)),ROW(C68)-1,\"\")","v":""},""]
["",""]
["",""]
["",""]
["",""]
["",""]
["",""]
["",""]
["",""]
["",""]
["",""]
["",""]
["",""]
["",""]
["",""]
["",""]
["",""]
["",""]
["",""]
["",""]
["",""]
["",""]
["",""]
["",""]
["",""]
["",""]
["",""]
["",""]
["",""]
["",""]
["",""]
["",""]
["",""]
["",""]
["",""]
["",""]
["",""]
["",""]
["",""]
["",""]
["",""]
["",""]
["",""]
["",""]
["",""]
["",""]
["",""]
["",""]
["",""]
["",""]
["",""]
["",""]
["",""]
{"$rows_left_out":3508}
{"sheet":"Août","index":8,"n_rows":3627,"n_cols":7,"rows_kept":3627,"cut":false,"hidden":false,"merged":[]}
["Ordre","Date","Grade","Nom","Prénom","Statut","Motif de consultation"]
[{"$f":"IF(NOT(ISBLANK(C2)),VLOOKUP(9^9,Juillet!A2:A3627,1)+1,\"\")","v":""},{"$f":"IF(C2=\"\",\"\",IF(B2<>\"\",B2,NOW()))","v":""}]
[{"$f":"IF(NOT(ISBLANK(C3)),ROW(C3)-1,\"\")","v":""},{"$f":"IF(C3=\"\",\"\",IF(B3<>\"\",B3,NOW()))","v":""}]
[{"$f":"IF(NOT(ISBLANK(C4)),ROW(C4)-1,\"\")","v":""},""]
["",""]
["",""]
["",""]
["",""]
["",""]
["",""]
["",""]
["",""]
["",""]
["",""]
["",""]
["",""]
["",""]
["",""]
["",""]
["",""]
["",""]
["",""]
["",""]
["",""]
["",""]
["",""]
["",""]
["",""]
["",""]
["",""]
["",""]
["",""]
["",""]
["",""]
["",""]
["",""]
["",""]
["",""]
["",""]
["",""]
["",""]
["",""]
["",""]
["",""]
["",""]
["",""]
["",""]
["",""]
["",""]
["",""]
["",""]
["",""]
["",""]
["",""]
["",""]
["",""]
["",""]
["",""]
["",""]
["",""]
["",""]
["",""]
["",""]
["",""]
["",""]
["",""]
["",{"$f":"IF(C67=\"\",\"\",IF(B67<>\"\",B67,NOW()))","v":""}]
[{"$f":"IF(NOT(ISBLANK(C68)),ROW(C68)-1,\"\")","v":""},""]
["",""]
["",""]
["",""]
["",""]
["",""]
["",""]
["",""]
["",""]
["",""]
["",""]
["",""]
["",""]
["",""]
["",""]
["",""]
["",""]
["",""]
["",""]
["",""]
["",""]
["",""]
["",""]
["",""]
["",""]
["",""]
["",""]
["",""]
["",""]
["",""]
["",""]
["",""]
["",""]
["",""]
["",""]
["",""]
["",""]
["",""]
["",""]
["",""]
["",""]
["",""]
["",""]
["",""]
["",""]
["",""]
["",""]
["",""]
["",""]
["",""]
["",""]
["",""]
["",""]
{"$rows_left_out":3508}
{"sheet":"Septembre","index":9,"n_rows":3627,"n_cols":7,"rows_kept":3627,"cut":false,"hidden":false,"merged":[]}
["Ordre","Date","Grade","Nom","Prénom","Statut","Motif de consultation"]
[{"$f":"IF(NOT(ISBLANK(C2)),VLOOKUP(9^9,Août!A2:A3627,1)+1,\"\")","v":""},{"$f":"IF(C2=\"\",\"\",IF(B2<>\"\",B2,NOW()))","v":""}]
[{"$f":"IF(NOT(ISBLANK(C3)),ROW(C3)-1,\"\")","v":""},{"$f":"IF(C3=\"\",\"\",IF(B3<>\"\",B3,NOW()))","v":""}]
[{"$f":"IF(NOT(ISBLANK(C4)),ROW(C4)-1,\"\")","v":""},""]
["",""]
["",""]
["",""]
["",""]
["",""]
["",""]
["",""]
["",""]
["",""]
["",""]
["",""]
["",""]
["",""]
["",""]
["",""]
["",""]
["",""]
["",""]
["",""]
["",""]
["",""]
["",""]
["",""]
["",""]
["",""]
["",""]
["",""]
["",""]
["",""]
["",""]
["",""]
["",""]
["",""]
["",""]
["",""]
["",""]
["",""]
["",""]
["",""]
["",""]
["",""]
["",""]
["",""]
["",""]
["",""]
["",""]
["",""]
["",""]
["",""]
["",""]
["",""]
["",""]
["",""]
["",""]
["",""]
["",""]
["",""]
["",""]
["",""]
["",""]
["",""]
["",""]
["",{"$f":"IF(C67=\"\",\"\",IF(B67<>\"\",B67,NOW()))","v":""}]
[{"$f":"IF(NOT(ISBLANK(C68)),ROW(C68)-1,\"\")","v":""},""]
["",""]
["",""]
["",""]
["",""]
["",""]
["",""]
["",""]
["",""]
["",""]
["",""]
["",""]
["",""]
["",""]
["",""]
["",""]
["",""]
["",""]
["",""]
["",""]
["",""]
["",""]
["",""]
["",""]
["",""]
["",""]
["",""]
["",""]
["",""]
["",""]
["",""]
["",""]
["",""]
["",""]
["",""]
["",""]
["",""]
["",""]
["",""]
["",""]
["",""]
["",""]
["",""]
["",""]
["",""]
["",""]
["",""]
["",""]
["",""]
["",""]
["",""]
["",""]
["",""]
{"$rows_left_out":3508}
{"sheet":"Octobre","index":10,"n_rows":3627,"n_cols":7,"rows_kept":3627,"cut":false,"hidden":false,"merged":[]}
["Ordre","Date","Grade","Nom","Prénom","Statut","Motif de consultation"]
[{"$f":"IF(NOT(ISBLANK(C2)),VLOOKUP(9^9,Septembre!A2:A3627,1)+1,\"\")","v":""},{"$f":"IF(C2=\"\",\"\",IF(B2<>\"\",B2,NOW()))","v":""}]
[{"$f":"IF(NOT(ISBLANK(C3)),ROW(C3)-1,\"\")","v":""},{"$f":"IF(C3=\"\",\"\",IF(B3<>\"\",B3,NOW()))","v":""}]
[{"$f":"IF(NOT(ISBLANK(C4)),ROW(C4)-1,\"\")","v":""},""]
["",""]
["",""]
["",""]
["",""]
["",""]
["",""]
["",""]
["",""]
["",""]
["",""]
["",""]
["",""]
["",""]
["",""]
["",""]
["",""]
["",""]
["",""]
["",""]
["",""]
["",""]
["",""]
["",""]
["",""]
["",""]
["",""]
["",""]
["",""]
["",""]
["",""]
["",""]
["",""]
["",""]
["",""]
["",""]
["",""]
["",""]
["",""]
["",""]
["",""]
["",""]
["",""]
["",""]
["",""]
["",""]
["",""]
["",""]
["",""]
["",""]
["",""]
["",""]
["",""]
["",""]
["",""]
["",""]
["",""]
["",""]
["",""]
["",""]
["",""]
["",""]
["",""]
["",{"$f":"IF(C67=\"\",\"\",IF(B67<>\"\",B67,NOW()))","v":""}]
[{"$f":"IF(NOT(ISBLANK(C68)),ROW(C68)-1,\"\")","v":""},""]
["",""]
["",""]
["",""]
["",""]
["",""]
["",""]
["",""]
["",""]
["",""]
["",""]
["",""]
["",""]
["",""]
["",""]
["",""]
["",""]
["",""]
["",""]
["",""]
["",""]
["",""]
["",""]
["",""]
["",""]
["",""]
["",""]
["",""]
["",""]
["",""]
["",""]
["",""]
["",""]
["",""]
["",""]
["",""]
["",""]
["",""]
["",""]
["",""]
["",""]
["",""]
["",""]
["",""]
["",""]
["",""]
["",""]
["",""]
["",""]
["",""]
["",""]
["",""]
["",""]
{"$rows_left_out":3508}
{"sheet":"Novembre","index":11,"n_rows":3627,"n_cols":7,"rows_kept":3627,"cut":false,"hidden":false,"merged":[]}
["Ordre","Date","Grade","Nom","Prénom","Statut","Motif de consultation"]
[{"$f":"IF(NOT(ISBLANK(C2)),VLOOKUP(9^9,Octobre!A2:A3627,1)+1,\"\")","v":""},{"$f":"IF(C2=\"\",\"\",IF(B2<>\"\",B2,NOW()))","v":""}]
[{"$f":"IF(NOT(ISBLANK(C3)),ROW(C3)-1,\"\")","v":""},{"$f":"IF(C3=\"\",\"\",IF(B3<>\"\",B3,NOW()))","v":""}]
[{"$f":"IF(NOT(ISBLANK(C4)),ROW(C4)-1,\"\")","v":""},""]
["",""]
["",""]
["",""]
["",""]
["",""]
["",""]
["",""]
["",""]
["",""]
["",""]
["",""]
["",""]
["",""]
["",""]
["",""]
["",""]
["",""]
["",""]
["",""]
["",""]
["",""]
["",""]
["",""]
["",""]
["",""]
["",""]
["",""]
["",""]
["",""]
["",""]
["",""]
["",""]
["",""]
["",""]
["",""]
["",""]
["",""]
["",""]
["",""]
["",""]
["",""]
["",""]
["",""]
["",""]
["",""]
["",""]
["",""]
["",""]
["",""]
["",""]
["",""]
["",""]
["",""]
["",""]
["",""]
["",""]
["",""]
["",""]
["",""]
["",""]
["",""]
["",""]
["",{"$f":"IF(C67=\"\",\"\",IF(B67<>\"\",B67,NOW()))","v":""}]
[{"$f":"IF(NOT(ISBLANK(C68)),ROW(C68)-1,\"\")","v":""},""]
["",""]
["",""]
["",""]
["",""]
["",""]
["",""]
["",""]
["",""]
["",""]
["",""]
["",""]
["",""]
["",""]
["",""]
["",""]
["",""]
["",""]
["",""]
["",""]
["",""]
["",""]
["",""]
["",""]
["",""]
["",""]
["",""]
["",""]
["",""]
["",""]
["",""]
["",""]
["",""]
["",""]
["",""]
["",""]
["",""]
["",""]
["",""]
["",""]
["",""]
["",""]
["",""]
["",""]
["",""]
["",""]
["",""]
["",""]
["",""]
["",""]
["",""]
["",""]
["",""]
{"$rows_left_out":3508}
{"sheet":"Décembre","index":12,"n_rows":3627,"n_cols":7,"rows_kept":3627,"cut":false,"hidden":false,"merged":[]}
["Ordre","Date","Grade","Nom","Prénom","Statut","Motif de consultation"]
[{"$f":"IF(NOT(ISBLANK(C2)),VLOOKUP(9^9,Novembre!A2:A3627,1)+1,\"\")","v":""},{"$f":"IF(C2=\"\",\"\",IF(B2<>\"\",B2,NOW()))","v":""}]
[{"$f":"IF(NOT(ISBLANK(C3)),ROW(C3)-1,\"\")","v":""},{"$f":"IF(C3=\"\",\"\",IF(B3<>\"\",B3,NOW()))","v":""}]
[{"$f":"IF(NOT(ISBLANK(C4)),ROW(C4)-1,\"\")","v":""},""]
["",""]
["",""]
["",""]
["",""]
["",""]
["",""]
["",""]
["",""]
["",""]
["",""]
["",""]
["",""]
["",""]
["",""]
["",""]
["",""]
["",""]
["",""]
["",""]
["",""]
["",""]
["",""]
["",""]
["",""]
["",""]
["",""]
["",""]
["",""]
["",""]
["",""]
["",""]
["",""]
["",""]
["",""]
["",""]
["",""]
["",""]
["",""]
["",""]
["",""]
["",""]
["",""]
["",""]
["",""]
["",""]
["",""]
["",""]
["",""]
["",""]
["",""]
["",""]
["",""]
["",""]
["",""]
["",""]
["",""]
["",""]
["",""]
["",""]
["",""]
["",""]
["",""]
["",{"$f":"IF(C67=\"\",\"\",IF(B67<>\"\",B67,NOW()))","v":""}]
[{"$f":"IF(NOT(ISBLANK(C68)),ROW(C68)-1,\"\")","v":""},""]
["",""]
["",""]
["",""]
["",""]
["",""]
["",""]
["",""]
["",""]
["",""]
["",""]
["",""]
["",""]
["",""]
["",""]
["",""]
["",""]
["",""]
["",""]
["",""]
["",""]
["",""]
["",""]
["",""]
["",""]
["",""]
["",""]
["",""]
["",""]
["",""]
["",""]
["",""]
["",""]
["",""]
["",""]
["",""]
["",""]
["",""]
["",""]
["",""]
["",""]
["",""]
["",""]
["",""]
["",""]
["",""]
["",""]
["",""]
["",""]
["",""]
["",""]
["",""]
["",""]
{"$rows_left_out":3507}