{"text_format":"1","workbook":"xlsx","n_sheets":5,"sheets":["Liste Associés","Registre des mouvements","TCD","Feuil3","Listes"],"not_rendered":{"charts":0,"images":0,"macros":1,"external_links":0,"defined_names":2,"comments":0,"pivot_tables":1},"unopened":[],"bounds":{"document_bytes":16777216,"sheet_cells":100000,"rows_first":2000,"rows_last":500,"rows_between":2000,"halvings":0,"cell_chars":16384,"cell_head_chars":4096},"cells_cut":0,"cells_raw":0,"read":"whole","date_system":"1900"}

{"sheet":"Liste Associés","index":0,"n_rows":51,"n_cols":5,"rows_kept":51,"cut":false,"hidden":false,"merged":[]}
["NOM Prénom","Adresse","Commune","Code Postal","N° Associé"]
["JEAN Pierre","30 rue Pierre","Bonneval",28800,"A1"]
["JEAN Paul","25 rue exemple","Commune A",27177,"A2"]
["JEAN Jacques","26 rue exemple","Commune B",36000,"A3"]
["JEAN François","27 rue exemple","Commune C",28000,"A4"]
["JEAN Marie","28 rue exemple","Commune D",45000,"A5"]
["NOM Prénom 42424","29 rue exemple",null,null,"A6"]
["NOM Prénom 7","30 rue exemple",null,null,"A7"]
["NOM Prénom 8","31 rue exemple",null,null,"A8"]
["NOM Prénom 9","32 rue exemple",null,null,"A9"]
["NOM Prénom 10","33 rue exemple",null,null,"A10"]
["NOM Prénom 11","34 rue exemple",null,null,"A11"]
["NOM Prénom 12","35 rue exemple",null,null,"A12"]
["NOM Prénom 13","36 rue exemple",null,null,"A13"]
["NOM Prénom 14","37 rue exemple",null,null,"A14"]
["NOM Prénom 15","38 rue exemple",null,null,"A15"]
["NOM Prénom 16","39 rue exemple",null,null,"A16"]
["NOM Prénom 17","40 rue exemple",null,null,"A17"]
["NOM Prénom 18","41 rue exemple",null,null,"A18"]
["NOM Prénom 19","42 rue exemple",null,null,"A19"]
["NOM Prénom 20","43 rue exemple",null,null,"A20"]
["NOM Prénom 21","44 rue exemple",null,null,"A21"]
["NOM Prénom 22","45 rue exemple",null,null,"A22"]
["NOM Prénom 23","46 rue exemple",null,null,"A23"]
["NOM Prénom 24","47 rue exemple",null,null,"A24"]
["NOM Prénom 25","48 rue exemple",null,null,"A25"]
["NOM Prénom 26","49 rue exemple",null,null,"A26"]
["NOM Prénom 27","50 rue exemple",null,null,"A27"]
["NOM Prénom 28","51 rue exemple",null,null,"A28"]
["NOM Prénom 29","52 rue exemple",null,null,"A29"]
["NOM Prénom 30","53 rue exemple",null,null,"A30"]
["NOM Prénom 31","54 rue exemple",null,null,"A31"]
["NOM Prénom 32","55 rue exemple",null,null,"A32"]
["NOM Prénom 33","56 rue exemple",null,null,"A33"]
["NOM Prénom 34","57 rue exemple",null,null,"A34"]
["NOM Prénom 35","58 rue exemple",null,null,"A35"]
["NOM Prénom 36","59 rue exemple",null,null,"A36"]
["NOM Prénom 37","60 rue exemple",null,null,"A37"]
["NOM Prénom 38","61 rue exemple",null,null,"A38"]
["NOM Prénom 39","62 rue exemple",null,null,"A39"]
{"$rows_left_out":12}
{"sheet":"Registre des mouvements","index":1,"n_rows":359,"n_cols":14,"rows_kept":359,"cut":false,"hidden":false,"merged":[[2,13,5,22]]}
["Date de l'opération","NOM Prénom (Opérateur)","N° Identification","Adresse","Commune","Code Postal","Nature Opération","N° Part sociale","NOM Prénom (Bénéficiaire)","N° Identification (Bénéficiaire","Sens"]
[null,"JEAN Pierre",{"$f":"VLOOKUP(B2,'Liste Associés'!A:E,5,FALSE)","v":"A1"},{"$f":"VLOOKUP(B2,'Liste Associés'!A:E,2,FALSE)","v":"30 rue Pierre"},{"$f":"VLOOKUP(B2,'Liste Associés'!A:E,3,FALSE)","v":"Bonneval"},{"$f":"VLOOKUP(B2,'Liste Associés'!A:E,4,FALSE)","v":28800},"Apport",1,null,{"$f":"VLOOKUP(I2,'Liste Associés'!A:E,5,FALSE)","v":{"$error":"#N/A"}},{"$f":"IF(Tableau2[[#This Row],[Nature Opération]]=\"Apport\",1,-1)","v":1}]
[null,"JEAN Pierre",{"$f":"VLOOKUP(B3,'Liste Associés'!A:E,5,FALSE)","v":"A1"},{"$f":"VLOOKUP(B3,'Liste Associés'!A:E,2,FALSE)","v":"30 rue Pierre"},{"$f":"VLOOKUP(B3,'Liste Associés'!A:E,3,FALSE)","v":"Bonneval"},{"$f":"VLOOKUP(B3,'Liste Associés'!A:E,4,FALSE)","v":28800},"Apport",2,null,{"$f":"VLOOKUP(I3,'Liste Associés'!A:E,5,FALSE)","v":{"$error":"#N/A"}},{"$f":"IF(Tableau2[[#This Row],[Nature Opération]]=\"Apport\",1,-1)","v":1},null,"Colonne H ","je voudrais que le numéro d'identification des parts sociales se génèrent automatiquement lorsqu'il s'agit d'un apport. \nDans le cas d'une cession/donation je voudrais que cela génère une liste déroulante avec les parts sociales détenues par l'opérateur)"]
[null,"JEAN Paul",{"$f":"VLOOKUP(B4,'Liste Associés'!A:E,5,FALSE)","v":"A2"},{"$f":"VLOOKUP(B4,'Liste Associés'!A:E,2,FALSE)","v":"25 rue exemple"},{"$f":"VLOOKUP(B4,'Liste Associés'!A:E,3,FALSE)","v":"Commune A"},{"$f":"VLOOKUP(B4,'Liste Associés'!A:E,4,FALSE)","v":27177},"Apport",3,null,{"$f":"VLOOKUP(I4,'Liste Associés'!A:E,5,FALSE)","v":{"$error":"#N/A"}},{"$f":"IF(Tableau2[[#This Row],[Nature Opération]]=\"Apport\",1,-1)","v":1}]
[null,"JEAN Paul",{"$f":"VLOOKUP(B5,'Liste Associés'!A:E,5,FALSE)","v":"A2"},{"$f":"VLOOKUP(B5,'Liste Associés'!A:E,2,FALSE)","v":"25 rue exemple"},{"$f":"VLOOKUP(B5,'Liste Associés'!A:E,3,FALSE)","v":"Commune A"},{"$f":"VLOOKUP(B5,'Liste Associés'!A:E,4,FALSE)","v":27177},"Apport",4,null,{"$f":"VLOOKUP(I5,'Liste Associés'!A:E,5,FALSE)","v":{"$error":"#N/A"}},{"$f":"IF(Tableau2[[#This Row],[Nature Opération]]=\"Apport\",1,-1)","v":1}]
[null,"JEAN Jacques",{"$f":"VLOOKUP(B6,'Liste Associés'!A:E,5,FALSE)","v":"A3"},{"$f":"VLOOKUP(B6,'Liste Associés'!A:E,2,FALSE)","v":"26 rue exemple"},{"$f":"VLOOKUP(B6,'Liste Associés'!A:E,3,FALSE)","v":"Commune B"},{"$f":"VLOOKUP(B6,'Liste Associés'!A:E,4,FALSE)","v":36000},"Apport",5,null,{"$f":"VLOOKUP(I6,'Liste Associés'!A:E,5,FALSE)","v":{"$error":"#N/A"}},{"$f":"IF(Tableau2[[#This Row],[Nature Opération]]=\"Apport\",1,-1)","v":1}]
[null,"JEAN François",{"$f":"VLOOKUP(B7,'Liste Associés'!A:E,5,FALSE)","v":"A4"},{"$f":"VLOOKUP(B7,'Liste Associés'!A:E,2,FALSE)","v":"27 rue exemple"},{"$f":"VLOOKUP(B7,'Liste Associés'!A:E,3,FALSE)","v":"Commune C"},{"$f":"VLOOKUP(B7,'Liste Associés'!A:E,4,FALSE)","v":28000},"Apport",6,null,{"$f":"VLOOKUP(I7,'Liste Associés'!A:E,5,FALSE)","v":{"$error":"#N/A"}},{"$f":"IF(Tableau2[[#This Row],[Nature Opération]]=\"Apport\",1,-1)","v":1}]
[null,"JEAN François",{"$f":"VLOOKUP(B8,'Liste Associés'!A:E,5,FALSE)","v":"A4"},{"$f":"VLOOKUP(B8,'Liste Associés'!A:E,2,FALSE)","v":"27 rue exemple"},{"$f":"VLOOKUP(B8,'Liste Associés'!A:E,3,FALSE)","v":"Commune C"},{"$f":"VLOOKUP(B8,'Liste Associés'!A:E,4,FALSE)","v":28000},"Apport",7,null,{"$f":"VLOOKUP(I8,'Liste Associés'!A:E,5,FALSE)","v":{"$error":"#N/A"}},{"$f":"IF(Tableau2[[#This Row],[Nature Opération]]=\"Apport\",1,-1)","v":1}]
[null,"JEAN Marie",{"$f":"VLOOKUP(B9,'Liste Associés'!A:E,5,FALSE)","v":"A5"},{"$f":"VLOOKUP(B9,'Liste Associés'!A:E,2,FALSE)","v":"28 rue exemple"},{"$f":"VLOOKUP(B9,'Liste Associés'!A:E,3,FALSE)","v":"Commune D"},{"$f":"VLOOKUP(B9,'Liste Associés'!A:E,4,FALSE)","v":45000},"Apport",8,null,{"$f":"VLOOKUP(I9,'Liste Associés'!A:E,5,FALSE)","v":{"$error":"#N/A"}},{"$f":"IF(Tableau2[[#This Row],[Nature Opération]]=\"Apport\",1,-1)","v":1}]
[null,"JEAN Marie",{"$f":"VLOOKUP(B10,'Liste Associés'!A:E,5,FALSE)","v":"A5"},{"$f":"VLOOKUP(B10,'Liste Associés'!A:E,2,FALSE)","v":"28 rue exemple"},{"$f":"VLOOKUP(B10,'Liste Associés'!A:E,3,FALSE)","v":"Commune D"},{"$f":"VLOOKUP(B10,'Liste Associés'!A:E,4,FALSE)","v":45000},"Apport",9,null,{"$f":"VLOOKUP(I10,'Liste Associés'!A:E,5,FALSE)","v":{"$error":"#N/A"}},{"$f":"IF(Tableau2[[#This Row],[Nature Opération]]=\"Apport\",1,-1)","v":1}]
[null,"JEAN Paul",{"$f":"VLOOKUP(B11,'Liste Associés'!A:E,5,FALSE)","v":"A2"},{"$f":"VLOOKUP(B11,'Liste Associés'!A:E,2,FALSE)","v":"25 rue exemple"},{"$f":"VLOOKUP(B11,'Liste Associés'!A:E,3,FALSE)","v":"Commune A"},{"$f":"VLOOKUP(B11,'Liste Associés'!A:E,4,FALSE)","v":27177},"Cession",3,null,{"$f":"VLOOKUP(I11,'Liste Associés'!A:E,5,FALSE)","v":{"$error":"#N/A"}},{"$f":"IF(Tableau2[[#This Row],[Nature Opération]]=\"Apport\",1,-1)","v":-1}]
[null,"NOM Prénom 42424",{"$f":"VLOOKUP(B12,'Liste Associés'!A:E,5,FALSE)","v":"A6"},{"$f":"VLOOKUP(B12,'Liste Associés'!A:E,2,FALSE)","v":"29 rue exemple"},{"$f":"VLOOKUP(B12,'Liste Associés'!A:E,3,FALSE)","v":0},{"$f":"VLOOKUP(B12,'Liste Associés'!A:E,4,FALSE)","v":0},"Donation",28,null,{"$f":"VLOOKUP(I12,'Liste Associés'!A:E,5,FALSE)","v":{"$error":"#N/A"}},{"$f":"IF(Tableau2[[#This Row],[Nature Opération]]=\"Apport\",1,-1)","v":-1}]
[null,"NOM Prénom 42424",{"$f":"VLOOKUP(B13,'Liste Associés'!A:E,5,FALSE)","v":"A6"},{"$f":"VLOOKUP(B13,'Liste Associés'!A:E,2,FALSE)","v":"29 rue exemple"},{"$f":"VLOOKUP(B13,'Liste Associés'!A:E,3,FALSE)","v":0},{"$f":"VLOOKUP(B13,'Liste Associés'!A:E,4,FALSE)","v":0},"Apport",29,null,{"$f":"VLOOKUP(I13,'Liste Associés'!A:E,5,FALSE)","v":{"$error":"#N/A"}},{"$f":"IF(Tableau2[[#This Row],[Nature Opération]]=\"Apport\",1,-1)","v":1}]
[null,"NOM Prénom 42424",{"$f":"VLOOKUP(B14,'Liste Associés'!A:E,5,FALSE)","v":"A6"},{"$f":"VLOOKUP(B14,'Liste Associés'!A:E,2,FALSE)","v":"29 rue exemple"},{"$f":"VLOOKUP(B14,'Liste Associés'!A:E,3,FALSE)","v":0},{"$f":"VLOOKUP(B14,'Liste Associés'!A:E,4,FALSE)","v":0},"Apport",30,null,{"$f":"VLOOKUP(I14,'Liste Associés'!A:E,5,FALSE)","v":{"$error":"#N/A"}},{"$f":"IF(Tableau2[[#This Row],[Nature Opération]]=\"Apport\",1,-1)","v":1}]
[null,"NOM Prénom 42424",{"$f":"VLOOKUP(B15,'Liste Associés'!A:E,5,FALSE)","v":"A6"},{"$f":"VLOOKUP(B15,'Liste Associés'!A:E,2,FALSE)","v":"29 rue exemple"},{"$f":"VLOOKUP(B15,'Liste Associés'!A:E,3,FALSE)","v":0},{"$f":"VLOOKUP(B15,'Liste Associés'!A:E,4,FALSE)","v":0},"Donation",14,null,{"$f":"VLOOKUP(I15,'Liste Associés'!A:E,5,FALSE)","v":{"$error":"#N/A"}},{"$f":"IF(Tableau2[[#This Row],[Nature Opération]]=\"Apport\",1,-1)","v":-1}]
[null,null,{"$f":"VLOOKUP(B16,'Liste Associés'!A:E,5,FALSE)","v":{"$error":"#N/A"}},{"$f":"VLOOKUP(B16,'Liste Associés'!A:E,2,FALSE)","v":{"$error":"#N/A"}},{"$f":"VLOOKUP(B16,'Liste Associés'!A:E,3,FALSE)","v":{"$error":"#N/A"}},{"$f":"VLOOKUP(B16,'Liste Associés'!A:E,4,FALSE)","v":{"$error":"#N/A"}},null,15,null,{"$f":"VLOOKUP(I16,'Liste Associés'!A:E,5,FALSE)","v":{"$error":"#N/A"}},{"$f":"IF(Tableau2[[#This Row],[Nature Opération]]=\"Apport\",1,-1)","v":-1}]
[null,null,{"$f":"VLOOKUP(B17,'Liste Associés'!A:E,5,FALSE)","v":{"$error":"#N/A"}},{"$f":"VLOOKUP(B17,'Liste Associés'!A:E,2,FALSE)","v":{"$error":"#N/A"}},{"$f":"VLOOKUP(B17,'Liste Associés'!A:E,3,FALSE)","v":{"$error":"#N/A"}},{"$f":"VLOOKUP(B17,'Liste Associés'!A:E,4,FALSE)","v":{"$error":"#N/A"}},null,16,null,{"$f":"VLOOKUP(I17,'Liste Associés'!A:E,5,FALSE)","v":{"$error":"#N/A"}},{"$f":"IF(Tableau2[[#This Row],[Nature Opération]]=\"Apport\",1,-1)","v":-1}]
[null,null,{"$f":"VLOOKUP(B18,'Liste Associés'!A:E,5,FALSE)","v":{"$error":"#N/A"}},{"$f":"VLOOKUP(B18,'Liste Associés'!A:E,2,FALSE)","v":{"$error":"#N/A"}},{"$f":"VLOOKUP(B18,'Liste Associés'!A:E,3,FALSE)","v":{"$error":"#N/A"}},{"$f":"VLOOKUP(B18,'Liste Associés'!A:E,4,FALSE)","v":{"$error":"#N/A"}},null,17,null,{"$f":"VLOOKUP(I18,'Liste Associés'!A:E,5,FALSE)","v":{"$error":"#N/A"}},{"$f":"IF(Tableau2[[#This Row],[Nature Opération]]=\"Apport\",1,-1)","v":-1}]
[null,null,{"$f":"VLOOKUP(B19,'Liste Associés'!A:E,5,FALSE)","v":{"$error":"#N/A"}},{"$f":"VLOOKUP(B19,'Liste Associés'!A:E,2,FALSE)","v":{"$error":"#N/A"}},{"$f":"VLOOKUP(B19,'Liste Associés'!A:E,3,FALSE)","v":{"$error":"#N/A"}},{"$f":"VLOOKUP(B19,'Liste Associés'!A:E,4,FALSE)","v":{"$error":"#N/A"}},null,18,null,{"$f":"VLOOKUP(I19,'Liste Associés'!A:E,5,FALSE)","v":{"$error":"#N/A"}},{"$f":"IF(Tableau2[[#This Row],[Nature Opération]]=\"Apport\",1,-1)","v":-1}]
[null,null,{"$f":"VLOOKUP(B20,'Liste Associés'!A:E,5,FALSE)","v":{"$error":"#N/A"}},{"$f":"VLOOKUP(B20,'Liste Associés'!A:E,2,FALSE)","v":{"$error":"#N/A"}},{"$f":"VLOOKUP(B20,'Liste Associés'!A:E,3,FALSE)","v":{"$error":"#N/A"}},{"$f":"VLOOKUP(B20,'Liste Associés'!A:E,4,FALSE)","v":{"$error":"#N/A"}},null,19,null,{"$f":"VLOOKUP(I20,'Liste Associés'!A:E,5,FALSE)","v":{"$error":"#N/A"}},{"$f":"IF(Tableau2[[#This Row],[Nature Opération]]=\"Apport\",1,-1)","v":-1}]
[null,null,{"$f":"VLOOKUP(B21,'Liste Associés'!A:E,5,FALSE)","v":{"$error":"#N/A"}},{"$f":"VLOOKUP(B21,'Liste Associés'!A:E,2,FALSE)","v":{"$error":"#N/A"}},{"$f":"VLOOKUP(B21,'Liste Associés'!A:E,3,FALSE)","v":{"$error":"#N/A"}},{"$f":"VLOOKUP(B21,'Liste Associés'!A:E,4,FALSE)","v":{"$error":"#N/A"}},null,20,null,{"$f":"VLOOKUP(I21,'Liste Associés'!A:E,5,FALSE)","v":{"$error":"#N/A"}},{"$f":"IF(Tableau2[[#This Row],[Nature Opération]]=\"Apport\",1,-1)","v":-1}]
[null,null,{"$f":"VLOOKUP(B22,'Liste Associés'!A:E,5,FALSE)","v":{"$error":"#N/A"}},{"$f":"VLOOKUP(B22,'Liste Associés'!A:E,2,FALSE)","v":{"$error":"#N/A"}},{"$f":"VLOOKUP(B22,'Liste Associés'!A:E,3,FALSE)","v":{"$error":"#N/A"}},{"$f":"VLOOKUP(B22,'Liste Associés'!A:E,4,FALSE)","v":{"$error":"#N/A"}},null,21,null,{"$f":"VLOOKUP(I22,'Liste Associés'!A:E,5,FALSE)","v":{"$error":"#N/A"}},{"$f":"IF(Tableau2[[#This Row],[Nature Opération]]=\"Apport\",1,-1)","v":-1}]
[null,null,{"$f":"VLOOKUP(B23,'Liste Associés'!A:E,5,FALSE)","v":{"$error":"#N/A"}},{"$f":"VLOOKUP(B23,'Liste Associés'!A:E,2,FALSE)","v":{"$error":"#N/A"}},{"$f":"VLOOKUP(B23,'Liste Associés'!A:E,3,FALSE)","v":{"$error":"#N/A"}},{"$f":"VLOOKUP(B23,'Liste Associés'!A:E,4,FALSE)","v":{"$error":"#N/A"}},null,22,null,{"$f":"VLOOKUP(I23,'Liste Associés'!A:E,5,FALSE)","v":{"$error":"#N/A"}},{"$f":"IF(Tableau2[[#This Row],[Nature Opération]]=\"Apport\",1,-1)","v":-1}]
[null,null,{"$f":"VLOOKUP(B24,'Liste Associés'!A:E,5,FALSE)","v":{"$error":"#N/A"}},{"$f":"VLOOKUP(B24,'Liste Associés'!A:E,2,FALSE)","v":{"$error":"#N/A"}},{"$f":"VLOOKUP(B24,'Liste Associés'!A:E,3,FALSE)","v":{"$error":"#N/A"}},{"$f":"VLOOKUP(B24,'Liste Associés'!A:E,4,FALSE)","v":{"$error":"#N/A"}},null,23,null,{"$f":"VLOOKUP(I24,'Liste Associés'!A:E,5,FALSE)","v":{"$error":"#N/A"}},{"$f":"IF(Tableau2[[#This Row],[Nature Opération]]=\"Apport\",1,-1)","v":-1}]
[null,null,{"$f":"VLOOKUP(B25,'Liste Associés'!A:E,5,FALSE)","v":{"$error":"#N/A"}},{"$f":"VLOOKUP(B25,'Liste Associés'!A:E,2,FALSE)","v":{"$error":"#N/A"}},{"$f":"VLOOKUP(B25,'Liste Associés'!A:E,3,FALSE)","v":{"$error":"#N/A"}},{"$f":"VLOOKUP(B25,'Liste Associés'!A:E,4,FALSE)","v":{"$error":"#N/A"}},null,24,null,{"$f":"VLOOKUP(I25,'Liste Associés'!A:E,5,FALSE)","v":{"$error":"#N/A"}},{"$f":"IF(Tableau2[[#This Row],[Nature Opération]]=\"Apport\",1,-1)","v":-1}]
[null,null,{"$f":"VLOOKUP(B26,'Liste Associés'!A:E,5,FALSE)","v":{"$error":"#N/A"}},{"$f":"VLOOKUP(B26,'Liste Associés'!A:E,2,FALSE)","v":{"$error":"#N/A"}},{"$f":"VLOOKUP(B26,'Liste Associés'!A:E,3,FALSE)","v":{"$error":"#N/A"}},{"$f":"VLOOKUP(B26,'Liste Associés'!A:E,4,FALSE)","v":{"$error":"#N/A"}},null,25,null,{"$f":"VLOOKUP(I26,'Liste Associés'!A:E,5,FALSE)","v":{"$error":"#N/A"}},{"$f":"IF(Tableau2[[#This Row],[Nature Opération]]=\"Apport\",1,-1)","v":-1}]
[null,null,{"$f":"VLOOKUP(B27,'Liste Associés'!A:E,5,FALSE)","v":{"$error":"#N/A"}},{"$f":"VLOOKUP(B27,'Liste Associés'!A:E,2,FALSE)","v":{"$error":"#N/A"}},{"$f":"VLOOKUP(B27,'Liste Associés'!A:E,3,FALSE)","v":{"$error":"#N/A"}},{"$f":"VLOOKUP(B27,'Liste Associés'!A:E,4,FALSE)","v":{"$error":"#N/A"}},null,26,null,{"$f":"VLOOKUP(I27,'Liste Associés'!A:E,5,FALSE)","v":{"$error":"#N/A"}},{"$f":"IF(Tableau2[[#This Row],[Nature Opération]]=\"Apport\",1,-1)","v":-1}]
[null,null,{"$f":"VLOOKUP(B28,'Liste Associés'!A:E,5,FALSE)","v":{"$error":"#N/A"}},{"$f":"VLOOKUP(B28,'Liste Associés'!A:E,2,FALSE)","v":{"$error":"#N/A"}},{"$f":"VLOOKUP(B28,'Liste Associés'!A:E,3,FALSE)","v":{"$error":"#N/A"}},{"$f":"VLOOKUP(B28,'Liste Associés'!A:E,4,FALSE)","v":{"$error":"#N/A"}},null,27,null,{"$f":"VLOOKUP(I28,'Liste Associés'!A:E,5,FALSE)","v":{"$error":"#N/A"}},{"$f":"IF(Tableau2[[#This Row],[Nature Opération]]=\"Apport\",1,-1)","v":-1}]
[null,null,{"$f":"VLOOKUP(B29,'Liste Associés'!A:E,5,FALSE)","v":{"$error":"#N/A"}},{"$f":"VLOOKUP(B29,'Liste Associés'!A:E,2,FALSE)","v":{"$error":"#N/A"}},{"$f":"VLOOKUP(B29,'Liste Associés'!A:E,3,FALSE)","v":{"$error":"#N/A"}},{"$f":"VLOOKUP(B29,'Liste Associés'!A:E,4,FALSE)","v":{"$error":"#N/A"}},null,28,null,{"$f":"VLOOKUP(I29,'Liste Associés'!A:E,5,FALSE)","v":{"$error":"#N/A"}},{"$f":"IF(Tableau2[[#This Row],[Nature Opération]]=\"Apport\",1,-1)","v":-1}]
[null,null,{"$f":"VLOOKUP(B30,'Liste Associés'!A:E,5,FALSE)","v":{"$error":"#N/A"}},{"$f":"VLOOKUP(B30,'Liste Associés'!A:E,2,FALSE)","v":{"$error":"#N/A"}},{"$f":"VLOOKUP(B30,'Liste Associés'!A:E,3,FALSE)","v":{"$error":"#N/A"}},{"$f":"VLOOKUP(B30,'Liste Associés'!A:E,4,FALSE)","v":{"$error":"#N/A"}},null,null,null,{"$f":"VLOOKUP(I30,'Liste Associés'!A:E,5,FALSE)","v":{"$error":"#N/A"}},{"$f":"IF(Tableau2[[#This Row],[Nature Opération]]=\"Apport\",1,-1)","v":-1}]
[null,null,{"$f":"VLOOKUP(B31,'Liste Associés'!A:E,5,FALSE)","v":{"$error":"#N/A"}},{"$f":"VLOOKUP(B31,'Liste Associés'!A:E,2,FALSE)","v":{"$error":"#N/A"}},{"$f":"VLOOKUP(B31,'Liste Associés'!A:E,3,FALSE)","v":{"$error":"#N/A"}},{"$f":"VLOOKUP(B31,'Liste Associés'!A:E,4,FALSE)","v":{"$error":"#N/A"}},null,null,null,{"$f":"VLOOKUP(I31,'Liste Associés'!A:E,5,FALSE)","v":{"$error":"#N/A"}},{"$f":"IF(Tableau2[[#This Row],[Nature Opération]]=\"Apport\",1,-1)","v":-1}]
[null,null,{"$f":"VLOOKUP(B32,'Liste Associés'!A:E,5,FALSE)","v":{"$error":"#N/A"}},{"$f":"VLOOKUP(B32,'Liste Associés'!A:E,2,FALSE)","v":{"$error":"#N/A"}},{"$f":"VLOOKUP(B32,'Liste Associés'!A:E,3,FALSE)","v":{"$error":"#N/A"}},{"$f":"VLOOKUP(B32,'Liste Associés'!A:E,4,FALSE)","v":{"$error":"#N/A"}},null,null,null,{"$f":"VLOOKUP(I32,'Liste Associés'!A:E,5,FALSE)","v":{"$error":"#N/A"}},{"$f":"IF(Tableau2[[#This Row],[Nature Opération]]=\"Apport\",1,-1)","v":-1}]
[null,null,{"$f":"VLOOKUP(B33,'Liste Associés'!A:E,5,FALSE)","v":{"$error":"#N/A"}},{"$f":"VLOOKUP(B33,'Liste Associés'!A:E,2,FALSE)","v":{"$error":"#N/A"}},{"$f":"VLOOKUP(B33,'Liste Associés'!A:E,3,FALSE)","v":{"$error":"#N/A"}},{"$f":"VLOOKUP(B33,'Liste Associés'!A:E,4,FALSE)","v":{"$error":"#N/A"}},null,null,null,{"$f":"VLOOKUP(I33,'Liste Associés'!A:E,5,FALSE)","v":{"$error":"#N/A"}},{"$f":"IF(Tableau2[[#This Row],[Nature Opération]]=\"Apport\",1,-1)","v":-1}]
[null,null,{"$f":"VLOOKUP(B34,'Liste Associés'!A:E,5,FALSE)","v":{"$error":"#N/A"}},{"$f":"VLOOKUP(B34,'Liste Associés'!A:E,2,FALSE)","v":{"$error":"#N/A"}},{"$f":"VLOOKUP(B34,'Liste Associés'!A:E,3,FALSE)","v":{"$error":"#N/A"}},{"$f":"VLOOKUP(B34,'Liste Associés'!A:E,4,FALSE)","v":{"$error":"#N/A"}},null,null,null,{"$f":"VLOOKUP(I34,'Liste Associés'!A:E,5,FALSE)","v":{"$error":"#N/A"}},{"$f":"IF(Tableau2[[#This Row],[Nature Opération]]=\"Apport\",1,-1)","v":-1}]
[null,null,{"$f":"VLOOKUP(B35,'Liste Associés'!A:E,5,FALSE)","v":{"$error":"#N/A"}},{"$f":"VLOOKUP(B35,'Liste Associés'!A:E,2,FALSE)","v":{"$error":"#N/A"}},{"$f":"VLOOKUP(B35,'Liste Associés'!A:E,3,FALSE)","v":{"$error":"#N/A"}},{"$f":"VLOOKUP(B35,'Liste Associés'!A:E,4,FALSE)","v":{"$error":"#N/A"}},null,null,null,{"$f":"VLOOKUP(I35,'Liste Associés'!A:E,5,FALSE)","v":{"$error":"#N/A"}},{"$f":"IF(Tableau2[[#This Row],[Nature Opération]]=\"Apport\",1,-1)","v":-1}]
[null,null,{"$f":"VLOOKUP(B36,'Liste Associés'!A:E,5,FALSE)","v":{"$error":"#N/A"}},{"$f":"VLOOKUP(B36,'Liste Associés'!A:E,2,FALSE)","v":{"$error":"#N/A"}},{"$f":"VLOOKUP(B36,'Liste Associés'!A:E,3,FALSE)","v":{"$error":"#N/A"}},{"$f":"VLOOKUP(B36,'Liste Associés'!A:E,4,FALSE)","v":{"$error":"#N/A"}},null,null,null,{"$f":"VLOOKUP(I36,'Liste Associés'!A:E,5,FALSE)","v":{"$error":"#N/A"}},{"$f":"IF(Tableau2[[#This Row],[Nature Opération]]=\"Apport\",1,-1)","v":-1}]
[null,null,{"$f":"VLOOKUP(B37,'Liste Associés'!A:E,5,FALSE)","v":{"$error":"#N/A"}},{"$f":"VLOOKUP(B37,'Liste Associés'!A:E,2,FALSE)","v":{"$error":"#N/A"}},{"$f":"VLOOKUP(B37,'Liste Associés'!A:E,3,FALSE)","v":{"$error":"#N/A"}},{"$f":"VLOOKUP(B37,'Liste Associés'!A:E,4,FALSE)","v":{"$error":"#N/A"}},null,null,null,{"$f":"VLOOKUP(I37,'Liste Associés'!A:E,5,FALSE)","v":{"$error":"#N/A"}},{"$f":"IF(Tableau2[[#This Row],[Nature Opération]]=\"Apport\",1,-1)","v":-1}]
[null,null,{"$f":"VLOOKUP(B38,'Liste Associés'!A:E,5,FALSE)","v":{"$error":"#N/A"}},{"$f":"VLOOKUP(B38,'Liste Associés'!A:E,2,FALSE)","v":{"$error":"#N/A"}},{"$f":"VLOOKUP(B38,'Liste Associés'!A:E,3,FALSE)","v":{"$error":"#N/A"}},{"$f":"VLOOKUP(B38,'Liste Associés'!A:E,4,FALSE)","v":{"$error":"#N/A"}},null,null,null,{"$f":"VLOOKUP(I38,'Liste Associés'!A:E,5,FALSE)","v":{"$error":"#N/A"}},{"$f":"IF(Tableau2[[#This Row],[Nature Opération]]=\"Apport\",1,-1)","v":-1}]
[null,null,{"$f":"VLOOKUP(B39,'Liste Associés'!A:E,5,FALSE)","v":{"$error":"#N/A"}},{"$f":"VLOOKUP(B39,'Liste Associés'!A:E,2,FALSE)","v":{"$error":"#N/A"}},{"$f":"VLOOKUP(B39,'Liste Associés'!A:E,3,FALSE)","v":{"$error":"#N/A"}},{"$f":"VLOOKUP(B39,'Liste Associés'!A:E,4,FALSE)","v":{"$error":"#N/A"}},null,null,null,{"$f":"VLOOKUP(I39,'Liste Associés'!A:E,5,FALSE)","v":{"$error":"#N/A"}},{"$f":"IF(Tableau2[[#This Row],[Nature Opération]]=\"Apport\",1,-1)","v":-1}]
[null,null,{"$f":"VLOOKUP(B40,'Liste Associés'!A:E,5,FALSE)","v":{"$error":"#N/A"}},{"$f":"VLOOKUP(B40,'Liste Associés'!A:E,2,FALSE)","v":{"$error":"#N/A"}},{"$f":"VLOOKUP(B40,'Liste Associés'!A:E,3,FALSE)","v":{"$error":"#N/A"}},{"$f":"VLOOKUP(B40,'Liste Associés'!A:E,4,FALSE)","v":{"$error":"#N/A"}},null,null,null,{"$f":"VLOOKUP(I40,'Liste Associés'!A:E,5,FALSE)","v":{"$error":"#N/A"}},{"$f":"IF(Tableau2[[#This Row],[Nature Opération]]=\"Apport\",1,-1)","v":-1}]
{"$rows_left_out":320}
{"sheet":"TCD","index":2,"n_rows":9,"n_cols":4,"rows_kept":9,"cut":false,"hidden":false,"merged":[]}
[]
[]
["Étiquettes de lignes","Somme de Sens",null,"Je voudrais que le TCD calcul le nombre de parts par associés (en prenant en compte les cessation de parts)"]
["JEAN François",2]
["JEAN Jacques",1]
["JEAN Marie",2]
["JEAN Paul",1]
["JEAN Pierre",2]
["Total général",8]

{"sheet":"Feuil3","index":3,"n_rows":0,"n_cols":0,"rows_kept":0,"cut":false,"hidden":false,"merged":[]}

{"sheet":"Listes","index":4,"n_rows":5,"n_cols":1,"rows_kept":5,"cut":false,"hidden":false,"merged":[]}
["Nature Opération"]
["Cession"]
["Apport"]
["Donation"]
["Autres ?"]