{"text_format":"1","workbook":"xlsx","n_sheets":6,"sheets":["mémo pour remplir le tableau","Données","tmp","Bilans","listes","Regroupements"],"not_rendered":{"charts":6,"images":0,"macros":1,"external_links":1,"defined_names":45,"comments":1,"pivot_tables":0},"unopened":[],"bounds":{"document_bytes":16777216,"sheet_cells":100000,"rows_first":2000,"rows_last":500,"rows_between":2000,"halvings":0,"cell_chars":16384,"cell_head_chars":4096},"cells_cut":0,"cells_raw":0,"read":"whole","date_system":"1900"}

{"sheet":"mémo pour remplir le tableau","index":0,"n_rows":92,"n_cols":2,"rows_kept":92,"cut":false,"hidden":false,"merged":[[26,0,26,1],[28,0,28,1],[0,0,0,1],[2,0,2,1],[10,0,10,1],[15,0,15,1],[20,0,20,1]]}
["MEMO POUR REMPLIR LE TABLEAU"]
[]
["Ajouter un événement"]
["*","Se positionner à la fin du tableau sur une nouvelle ligne"]
["*","Remplir obligatoirement les colonnes A à J"]
["*","Colonne K \"Commentaires\" optionnelle"]
["*","Données des colonnes L,M, N, etc, calculées de manière automatique, servant aux tableaux bilans : Ne pas y toucher"]
["*","Remplir la colonne F \"Enseignant référent\" en inscrivant d'abord le nom de l'enseignant, puis son prénom. Veiller à l'orthographe.\nDans le cas d'un professeur se rendant à la médiathèque avec plusieurs classes (ex d'un prof documentaliste), préciser à la suite de son nom + prénom + la classe ou le groupe (ex : 6ème A, groupe 1)."]
["*","Cas des accueils organisés en binôme : Inscrire dans l'ordre que vous souhaitez les deux secteurs concernés. SAUF pour les accueils effectués par la médiathèque du Rize (RIZE MED) qui doivent toujours être inscrits en colonne B.\nEx : Accueil couplée médiathèque/médiation culturelle : En colonne B \"RIZE MED\", en colonne C \"RIZE VALO\""]
[]
["Je veux ajouter un nouvel accueil entre deux déjà existants, de manière chronologique"]
["*","Ne jamais insérer une nouvelle ligne, pour éviter des erreurs aux conséquences fatales (!)"]
["*","Se positionner à la fin du tableau, sur la première ligne non remplie et entrer les données"]
["*","Se positionner sur la cellule A1 \"Date venue\", cliquer sur la flèche en bas à droite de la cellule et sélectionner \"Trier du plus ancien au plus récent\" afin de positionner les accueils dans l'ordre chronologique"]
[]
["Mes événements ont disparu : vérifier qu'un filtre n'est pas actif"]
["*","Dans chaque cellule de la première ligne du tableau, si un filtre est actif, un petit entonnoir apparaît : "]
["*","Pour désactiver le filtre, cliquer sur cet entonnoir, puis à la fin du menu déroulant, activer la case \"sélectionner tout\", cliquez sur OK : tous les cellules réapparaissent"]
["*","Attention, plusieurs filtres peuvent être activés en même temps : il faut tous les désactiver en suivant la procédure ci-dessus"]
[]
{"$rows_left_out":73}
{"sheet":"Données","index":1,"n_rows":143,"n_cols":14,"rows_kept":143,"cut":false,"hidden":false,"merged":[]}
["Date venue","Secteur organisateur","Secteur organisateur binôme","Etablissement scolaire","Niveau de classe","Enseignant référent (Nom Prénom)","Nombre enfants","In situ / hors les murs","Type de visite","Appréciations","Commentaires","Groupe niveau","Quartier","Etablissement accueillant"]
["2018-10-12","MLIS J",null,"Albert Camus","autres (maternelle)","UN",25,"In situ","Album",null,null,{"$f":"IF(COUNTIF(Maternelle,E2)=1,listes!$T$1,IF(COUNTIF(Elémentaire,E2)=1,listes!$U$1,IF(COUNTIF(Collège,E2)=1,listes!$V$1,IF(COUNTIF(Lycée,E2)=1,listes!$W$1,\"\"))))","v":"Maternelle"},{"$f":"VLOOKUP(T_sept_dec[[#This Row],[Etablissement scolaire]],Regroupements!$T:$U,2,FALSE)","v":"Cyprian-les-Brosses"},{"$f":"IF(COUNTIF(FDL,B2)=1,\"FDL\",IF(COUNTIF(RIZE,B2)=1,\"RIZE\",IF(COUNTIF(MLIS,B2)=1,\"MLIS\",IF(COUNTIF(PACBUS,B2)=1,\"PAC-BUS\",IF(COUNTIF(Tonkin,B2)=1,\"TONKIN\",\"\")))))","v":"MLIS"}]
["2018-11-11","MTK",null,"Anatole France","autres (élémentaire)","DEUX",25,"In situ","Autour de la musique",null,null,{"$f":"IF(COUNTIF(Maternelle,E3)=1,listes!$T$1,IF(COUNTIF(Elémentaire,E3)=1,listes!$U$1,IF(COUNTIF(Collège,E3)=1,listes!$V$1,IF(COUNTIF(Lycée,E3)=1,listes!$W$1,\"\"))))","v":"Elémentaire"},{"$f":"VLOOKUP(T_sept_dec[[#This Row],[Etablissement scolaire]],Regroupements!$T:$U,2,FALSE)","v":"Gratte-ciel-Dedieu-Charmettes"},"TONKIN"]
["2018-09-13","MLIS J",null,"Antonin Perrin","ps","TROIS",20,"In situ","Atelier Youtuber",null,null,{"$f":"IF(COUNTIF(Maternelle,E4)=1,listes!$T$1,IF(COUNTIF(Elémentaire,E4)=1,listes!$U$1,IF(COUNTIF(Collège,E4)=1,listes!$V$1,IF(COUNTIF(Lycée,E4)=1,listes!$W$1,\"\"))))","v":"Maternelle"},{"$f":"VLOOKUP(T_sept_dec[[#This Row],[Etablissement scolaire]],Regroupements!$T:$U,2,FALSE)","v":"Ferrandière-Maisons Neuves"},"MLIS"]
[null,null,null,null,null,null,null,null,null,null,null,{"$f":"IF(COUNTIF(Maternelle,E5)=1,listes!$T$1,IF(COUNTIF(Elémentaire,E5)=1,listes!$U$1,IF(COUNTIF(Collège,E5)=1,listes!$V$1,IF(COUNTIF(Lycée,E5)=1,listes!$W$1,\"\"))))","v":""},{"$f":"VLOOKUP(T_sept_dec[[#This Row],[Etablissement scolaire]],Regroupements!$T:$U,2,FALSE)","v":{"$error":"#N/A"}},""]
[null,null,null,null,null,null,null,null,null,null,null,{"$f":"IF(COUNTIF(Maternelle,E6)=1,listes!$T$1,IF(COUNTIF(Elémentaire,E6)=1,listes!$U$1,IF(COUNTIF(Collège,E6)=1,listes!$V$1,IF(COUNTIF(Lycée,E6)=1,listes!$W$1,\"\"))))","v":""},{"$f":"VLOOKUP(T_sept_dec[[#This Row],[Etablissement scolaire]],Regroupements!$T:$U,2,FALSE)","v":{"$error":"#N/A"}},""]
[null,null,null,null,null,null,null,null,null,null,null,{"$f":"IF(COUNTIF(Maternelle,E7)=1,listes!$T$1,IF(COUNTIF(Elémentaire,E7)=1,listes!$U$1,IF(COUNTIF(Collège,E7)=1,listes!$V$1,IF(COUNTIF(Lycée,E7)=1,listes!$W$1,\"\"))))","v":""},{"$f":"VLOOKUP(T_sept_dec[[#This Row],[Etablissement scolaire]],Regroupements!$T:$U,2,FALSE)","v":{"$error":"#N/A"}},""]
[null,null,null,null,null,null,null,null,null,null,null,{"$f":"IF(COUNTIF(Maternelle,E8)=1,listes!$T$1,IF(COUNTIF(Elémentaire,E8)=1,listes!$U$1,IF(COUNTIF(Collège,E8)=1,listes!$V$1,IF(COUNTIF(Lycée,E8)=1,listes!$W$1,\"\"))))","v":""},{"$f":"VLOOKUP(T_sept_dec[[#This Row],[Etablissement scolaire]],Regroupements!$T:$U,2,FALSE)","v":{"$error":"#N/A"}},""]
[null,null,null,null,null,null,null,null,null,null,null,{"$f":"IF(COUNTIF(Maternelle,E9)=1,listes!$T$1,IF(COUNTIF(Elémentaire,E9)=1,listes!$U$1,IF(COUNTIF(Collège,E9)=1,listes!$V$1,IF(COUNTIF(Lycée,E9)=1,listes!$W$1,\"\"))))","v":""},{"$f":"VLOOKUP(T_sept_dec[[#This Row],[Etablissement scolaire]],Regroupements!$T:$U,2,FALSE)","v":{"$error":"#N/A"}},""]
[null,null,null,null,null,null,null,null,null,null,null,{"$f":"IF(COUNTIF(Maternelle,E10)=1,listes!$T$1,IF(COUNTIF(Elémentaire,E10)=1,listes!$U$1,IF(COUNTIF(Collège,E10)=1,listes!$V$1,IF(COUNTIF(Lycée,E10)=1,listes!$W$1,\"\"))))","v":""},{"$f":"VLOOKUP(T_sept_dec[[#This Row],[Etablissement scolaire]],Regroupements!$T:$U,2,FALSE)","v":{"$error":"#N/A"}},""]
[null,null,null,null,null,null,null,null,null,null,null,{"$f":"IF(COUNTIF(Maternelle,E11)=1,listes!$T$1,IF(COUNTIF(Elémentaire,E11)=1,listes!$U$1,IF(COUNTIF(Collège,E11)=1,listes!$V$1,IF(COUNTIF(Lycée,E11)=1,listes!$W$1,\"\"))))","v":""},{"$f":"VLOOKUP(T_sept_dec[[#This Row],[Etablissement scolaire]],Regroupements!$T:$U,2,FALSE)","v":{"$error":"#N/A"}},""]
[null,null,null,null,null,null,null,null,null,null,null,{"$f":"IF(COUNTIF(Maternelle,E12)=1,listes!$T$1,IF(COUNTIF(Elémentaire,E12)=1,listes!$U$1,IF(COUNTIF(Collège,E12)=1,listes!$V$1,IF(COUNTIF(Lycée,E12)=1,listes!$W$1,\"\"))))","v":""},{"$f":"VLOOKUP(T_sept_dec[[#This Row],[Etablissement scolaire]],Regroupements!$T:$U,2,FALSE)","v":{"$error":"#N/A"}},""]
[null,null,null,null,null,null,null,null,null,null,null,{"$f":"IF(COUNTIF(Maternelle,E13)=1,listes!$T$1,IF(COUNTIF(Elémentaire,E13)=1,listes!$U$1,IF(COUNTIF(Collège,E13)=1,listes!$V$1,IF(COUNTIF(Lycée,E13)=1,listes!$W$1,\"\"))))","v":""},{"$f":"VLOOKUP(T_sept_dec[[#This Row],[Etablissement scolaire]],Regroupements!$T:$U,2,FALSE)","v":{"$error":"#N/A"}},""]
[null,null,null,null,null,null,null,null,null,null,null,{"$f":"IF(COUNTIF(Maternelle,E14)=1,listes!$T$1,IF(COUNTIF(Elémentaire,E14)=1,listes!$U$1,IF(COUNTIF(Collège,E14)=1,listes!$V$1,IF(COUNTIF(Lycée,E14)=1,listes!$W$1,\"\"))))","v":""},{"$f":"VLOOKUP(T_sept_dec[[#This Row],[Etablissement scolaire]],Regroupements!$T:$U,2,FALSE)","v":{"$error":"#N/A"}},""]
[null,null,null,null,null,null,null,null,null,null,null,{"$f":"IF(COUNTIF(Maternelle,E15)=1,listes!$T$1,IF(COUNTIF(Elémentaire,E15)=1,listes!$U$1,IF(COUNTIF(Collège,E15)=1,listes!$V$1,IF(COUNTIF(Lycée,E15)=1,listes!$W$1,\"\"))))","v":""},{"$f":"VLOOKUP(T_sept_dec[[#This Row],[Etablissement scolaire]],Regroupements!$T:$U,2,FALSE)","v":{"$error":"#N/A"}},""]
[null,null,null,null,null,null,null,null,null,null,null,{"$f":"IF(COUNTIF(Maternelle,E16)=1,listes!$T$1,IF(COUNTIF(Elémentaire,E16)=1,listes!$U$1,IF(COUNTIF(Collège,E16)=1,listes!$V$1,IF(COUNTIF(Lycée,E16)=1,listes!$W$1,\"\"))))","v":""},{"$f":"VLOOKUP(T_sept_dec[[#This Row],[Etablissement scolaire]],Regroupements!$T:$U,2,FALSE)","v":{"$error":"#N/A"}},""]
[null,null,null,null,null,null,null,null,null,null,null,{"$f":"IF(COUNTIF(Maternelle,E17)=1,listes!$T$1,IF(COUNTIF(Elémentaire,E17)=1,listes!$U$1,IF(COUNTIF(Collège,E17)=1,listes!$V$1,IF(COUNTIF(Lycée,E17)=1,listes!$W$1,\"\"))))","v":""},{"$f":"VLOOKUP(T_sept_dec[[#This Row],[Etablissement scolaire]],Regroupements!$T:$U,2,FALSE)","v":{"$error":"#N/A"}},""]
[null,null,null,null,null,null,null,null,null,null,null,{"$f":"IF(COUNTIF(Maternelle,E18)=1,listes!$T$1,IF(COUNTIF(Elémentaire,E18)=1,listes!$U$1,IF(COUNTIF(Collège,E18)=1,listes!$V$1,IF(COUNTIF(Lycée,E18)=1,listes!$W$1,\"\"))))","v":""},{"$f":"VLOOKUP(T_sept_dec[[#This Row],[Etablissement scolaire]],Regroupements!$T:$U,2,FALSE)","v":{"$error":"#N/A"}},""]
[null,null,null,null,null,null,null,null,null,null,null,{"$f":"IF(COUNTIF(Maternelle,E19)=1,listes!$T$1,IF(COUNTIF(Elémentaire,E19)=1,listes!$U$1,IF(COUNTIF(Collège,E19)=1,listes!$V$1,IF(COUNTIF(Lycée,E19)=1,listes!$W$1,\"\"))))","v":""},{"$f":"VLOOKUP(T_sept_dec[[#This Row],[Etablissement scolaire]],Regroupements!$T:$U,2,FALSE)","v":{"$error":"#N/A"}},""]
[null,null,null,null,null,null,null,null,null,null,null,{"$f":"IF(COUNTIF(Maternelle,E20)=1,listes!$T$1,IF(COUNTIF(Elémentaire,E20)=1,listes!$U$1,IF(COUNTIF(Collège,E20)=1,listes!$V$1,IF(COUNTIF(Lycée,E20)=1,listes!$W$1,\"\"))))","v":""},{"$f":"VLOOKUP(T_sept_dec[[#This Row],[Etablissement scolaire]],Regroupements!$T:$U,2,FALSE)","v":{"$error":"#N/A"}},""]
{"$rows_left_out":124}
{"sheet":"tmp","index":2,"n_rows":2,"n_cols":11,"rows_kept":2,"cut":false,"hidden":true,"merged":[]}
["Date venue","Secteur organisateur","Secteur organisateur binôme","Etablissement scolaire","Niveau de classe","Enseignant référent (Nom Prénom)","Nombre enfants","In situ / hors les murs","Type de visite","Appréciations","Commentaires"]
["2018-11-11","MTK",null,"Anatole France","autres (élémentaire)","DEUX",25,"In situ","Autour de la musique"]

{"sheet":"Bilans","index":3,"n_rows":200,"n_cols":22,"rows_kept":200,"cut":false,"hidden":false,"merged":[[68,8,68,10],[51,3,51,4],[79,0,81,0],[97,0,99,0],[52,0,52,7],[51,1,51,2],[70,0,72,0],[73,0,75,0],[66,1,66,2],[66,3,66,4],[68,2,68,4],[68,5,68,7],[54,1,64,1],[67,0,67,21],[68,14,68,18],[68,11,68,13],[68,19,68,21],[91,0,93,0],[94,0,96,0],[82,0,84,0],[112,0,112,1],[103,0,103,1],[104,0,104,1],[105,0,105,1],[109,0,109,1],[110,0,110,1],[106,0,106,1],[111,0,111,1],[107,0,107,1],[108,0,108,1],[101,0,101,3],[117,19,117,21],[17,0,17,7],[33,0,33,7],[47,0,49,0],[19,0,21,0],[22,0,24,0],[25,0,27,0],[35,0,37,0],[38,0,40,0],[28,0,30,0],[41,0,43,0],[44,0,46,0],[113,0,113,1],[76,0,78,0],[85,0,87,0],[88,0,90,0],[117,2,117,4],[117,5,117,7],[117,8,117,10],[117,11,117,13],[117,14,117,18],[170,0,172,0],[173,0,175,0],[119,0,121,0],[122,0,124,0],[125,0,127,0],[128,0,130,0],[131,0,133,0],[155,0,157,0],[158,0,160,0],[161,0,163,0],[164,0,166,0],[167,0,169,0],[191,0,193,0],[194,0,196,0],[197,0,199,0],[116,0,116,19],[176,0,178,0],[179,0,181,0],[182,0,184,0],[185,0,187,0],[188,0,190,0],[134,0,136,0],[137,0,139,0],[140,0,142,0],[143,0,145,0],[146,0,148,0],[149,0,151,0],[152,0,154,0]]}
["Type tableau","pl. Données","pl. Résultats","pl. TitresLig","pl. titresCol","Champ\nLig","Champ\nCol","Champ\nNbEleve","champ \nEnseignant"]
[1,{"$f":"T_sept_dec[]","v":"MLIS J"},{"$f":"C20:G31","v":{"$error":"#VALUE!"}},{"$f":"A20:A31","v":{"$error":"#VALUE!"}},{"$f":"C19:G19","v":"Ecole (Mat+Element)"},"reg_Sect","reg_Niv","Nombre enfants","Enseignant référent (Nom Prénom)"]
[1,{"$f":"T_sept_dec[]","v":"MTK"},{"$f":"C36:G50","v":{"$error":"#VALUE!"}},{"$f":"A36:A50","v":{"$error":"#VALUE!"}},{"$f":"C35:G35","v":"Ecole (Mat+Element)"},"reg_Sect","reg_Niv","Nombre enfants","Enseignant référent (Nom Prénom)"]
[1,{"$f":"T_sept_dec[]","v":"MLIS J"},{"$f":"C71:N100","v":{"$error":"#VALUE!"}},{"$f":"$A$71:$A$100","v":{"$error":"#VALUE!"}},{"$f":"C69:N69","v":0},"reg_Quart","reg_Niv","Nombre enfants","Enseignant référent (Nom Prénom)",null,"!!! 2 tableaux juxtaposés pour Bilan par quartier. Attention pl. titresCol ne sont pas sur la même ligne"]
[1,{"$f":"T_sept_dec[]","v":0},{"$f":"O71:S100","v":{"$error":"#VALUE!"}},{"$f":"$A$71:$A$100","v":{"$error":"#VALUE!"}},{"$f":"O70:S70","v":{"$error":"#VALUE!"}},"reg_Quart","reg_Sect","Nombre enfants","Enseignant référent (Nom Prénom)",null,"!!! 2 tableaux juxtaposés pour Bilan par quartier. Attention pl. titresCol ne sont pas sur la même ligne"]
[1,{"$f":"T_sept_dec[]","v":0},{"$f":"C120:N200","v":{"$error":"#VALUE!"}},{"$f":"$A$120:$A$200","v":{"$error":"#VALUE!"}},{"$f":"C118:N118","v":0},"Etablissement scolaire","reg_Niv","Nombre enfants","Enseignant référent (Nom Prénom)"]
[1,{"$f":"T_sept_dec[]","v":0},{"$f":"O120:S200","v":{"$error":"#VALUE!"}},{"$f":"$A$120:$A$200","v":{"$error":"#VALUE!"}},{"$f":"O119:S119","v":{"$error":"#VALUE!"}},"Etablissement scolaire","reg_Sect","Nombre enfants","Enseignant référent (Nom Prénom)"]
[]
[]
[]
[]
[]
[]
[]
[]
[]
[]
["Bilan global sur l'année scolaire 2018/2019"]
[null,"Nb de","Maternelle","Elémentaire","Ecole (Mat+Element)","Collège","Lycée","Totaux"]
["Réseau des médiathèques","Classes accueillies",2,1,3,null,null,{"$f":"E20+F20+G20","v":3}]
{"$rows_left_out":181}
{"sheet":"listes","index":4,"n_rows":52,"n_cols":23,"rows_kept":52,"cut":false,"hidden":false,"merged":[]}
["Niveau classe","Secteur organisateur","Réseau","Rizehorsmed","Type de visite","Etablissement scolaire","In situ / hors les murs","Classe accueillie pour la…fois","Quartiers","Buers-Croix-Luizet","Charpennes-Tonkin","Cusset-Bonnevay","Cyprian-les-Brosses","Ferrandière-Maisons Neuves","Gratte-ciel-Dedieu-Charmettes","Perralière-Grandclément","Saint Jean","Hors Villeurbanne","Niveaux classe","Maternelle","Elémentaire","Collège","Lycée"]
["autres (maternelle)","FDL","ARTO","RIZE ARCHI","Album","Hors Villeurbanne","In situ",1,null,"Collège Jean Macé","Tonkin/Nigritelle","Ernest Renan A","Albert Camus","Antonin Perrin","Anatole France","Berthelot","Saint Exupéry","Hors Villeurbanne",null,"autres (maternelle)","autres (élémentaire)","autres (collège)","autres (lycée)"]
["autres (élémentaire)","ARTO","EMM","RIZE VALO","Atelier Youtuber","Albert Camus","Hors les murs",2,null,"Croix-Luizet","Descartes","Ernest Renan B","Jules Guesde","Jean Jaurès (primaire)","Edouard Herriot","Louis Pasteur","Collège Jean-Vilar",null,null,"tps","cp","6°","2°"]
["autres (collège)","EMM","MLIS A",null,"Autour de la musique","Anatole France",null,3,null,"Jean Moulin","François Truffaut","Jules Ferry","Simone Veil","Collège Jean Jaurès","Emile Zola","René Pellet (déficients visuels)","Collège Simone Lagrange",null,null,"ps","cp/ce1","5°","2° pro"]
["autres (lycée)","MLIS A","MLIS DV",null,"Autour du cinéma","Antonin Perrin",null,4,null,"Château-Gaillard","Lakanal","Lazare Goujon","Collège Lamartine","Collège Louis Jouvet","Jacques Prévert","La Nativité (privé)",null,null,null,"ps/ms","ce1","4°","1°"]
["tps","MLIS DV","MLIS J",null,"Arrêt Bibliobus","Berthelot",null,5,null,null,"Louis Armand","Lycée Frédéric Faÿs","Lycée Alfred de Musset",null,"Jean Zay","Immaculée conception (privé)",null,null,null,"ps/gs","ce1/ce2","3°","1° pro"]
["ps","MLIS J","MTK",null,"Ateliers","Beth Menahem (privé)",null,6,null,null,"Mère Teresa (privé)","Beth Menahem (privé)",null,null,"Léon Jouhaux","Lycée Marie Curie",null,null,null,"ms","ce2","ULIS (collège)","Tle"]
["ps/ms","MTK","PAC-BUS",null,"Autre","Château-Gaillard",null,7,null,null,"Ecole Horizons (privé)","Collège des Iris",null,null,"Rosa Parks",null,null,null,null,"ms/gs","ce2/cm1","UP2A (collège)","Tle pro"]
["ps/gs","PAC-BUS","RIZE MED",null,"Book Creator","Croix-Luizet",null,8,null,null,"Collège du Tonkin",null,null,null,"Ste Thérèse (privé)",null,null,null,null,"gs","cm1",null,"ULIS (lycée)"]
["ms","RIZE ARCHI",null,null,"Coder avec Scratch","Descartes",null,9,null,null,null,null,null,null,"Ecole juive de Lyon (privé)",null,null,null,null,null,"cm1/cm2"]
["ms/gs","RIZE MED",null,null,"Conte","Ecole Horizons (privé)",null,10,null,null,null,null,null,null,"Collège des Gratte-Ciel (Môrice Leroux)",null,null,null,null,null,"cm2"]
["gs","RIZE VALO",null,null,"De la littérature au cinéma","Ecole juive de Lyon (privé)",null,11,null,null,null,null,null,null,"Lycée Pierre Brossolette",null,null,null,null,null,"ULIS (école)"]
["cp",null,null,null,"Diptyque","Edouard Herriot",null,12,null,null,null,null,null,null,"Lycée Magenta",null,null,null,null,null,"UP2A (élémentaire)"]
["cp/ce1",null,null,null,"Double jeu","Emile Zola",null,13,null,null,null,null,null,null,"Montessori (privé)"]
["ce1",null,null,null,"Et si on parlait d'art ?","Ernest Renan A",null,14]
["ce1/ce2",null,null,null,"Exploration Gratte-Ciel","Ernest Renan B",null,15]
["ce2",null,null,null,"Exploration sensorielle","François Truffaut",null,16]
["ce2/cm1",null,null,null,"Exploration urbaine","Immaculée conception (privé)"]
["cm1",null,null,null,"Exposition","Jacques Prévert"]
["cm1/cm2",null,null,null,"Il était une fois l'art contemporain","Jean Jaurès (primaire)"]
{"$rows_left_out":33}
{"sheet":"Regroupements","index":5,"n_rows":54,"n_cols":21,"rows_kept":54,"cut":false,"hidden":false,"merged":[]}
["nom regroupement","reg_Sect",null,null,null,null,null,null,null,null,null,null,"reg_Niv",null,null,null,null,null,null,"reg_Quart"]
[]
[null,"Secteur organisateur","Réseau des médiathèques","Accueils menés seulement par le Rize (hors médiathèque)","FDL","MLIS","RIZE","TONKIN","PAC-BUS","FDL",null,null,"Niveau de classe","Maternelle","Elémentaire","Ecole (Mat+Element)","Collège","Lycée",null,"Etablissement scolaire","Quartier"]
[null,"FDL",null,null,"x",null,null,null,null,"x",null,null,"autres (maternelle)","x",null,"x",null,null,null,"Hors Villeurbanne","Hors Villeurbanne"]
[null,"ARTO","x",null,null,"x",null,null,null,null,null,null,"autres (élémentaire)",null,"x","x",null,null,null,"Albert Camus","Cyprian-les-Brosses"]
[null,"EMM","x",null,null,"x",null,null,null,null,null,null,"autres (collège)",null,null,null,"x",null,null,"Anatole France","Gratte-ciel-Dedieu-Charmettes"]
[null,"MLIS A","x",null,null,"x",null,null,null,null,null,null,"autres (lycée)",null,null,null,null,"x",null,"Antonin Perrin","Ferrandière-Maisons Neuves"]
[null,"MLIS DV","x",null,null,"x",null,null,null,null,null,null,"tps","x",null,"x",null,null,null,"Berthelot","Perralière-Grandclément"]
[null,"MLIS J","x",null,null,"x",null,null,null,null,null,null,"ps","x",null,"x",null,null,null,"Beth Menahem (privé)","Cusset-Bonnevay"]
[null,"MTK","x",null,null,null,null,"x",null,null,null,null,"ps/ms","x",null,"x",null,null,null,"Château-Gaillard","Buers-Croix-Luizet"]
[null,"PAC-BUS","x",null,null,null,null,null,"x",null,null,null,"ps/gs","x",null,"x",null,null,null,"Croix-Luizet","Buers-Croix-Luizet"]
[null,"RIZE ARCHI",null,"x",null,null,"x",null,null,null,null,null,"ms","x",null,"x",null,null,null,"Descartes","Charpennes-Tonkin"]
[null,"RIZE MED","x",null,null,null,"x",null,null,null,null,null,"ms/gs","x",null,"x",null,null,null,"Ecole Horizons (privé)","Charpennes-Tonkin"]
[null,"RIZE VALO",null,"x",null,null,"x",null,null,null,null,null,"gs","x",null,"x",null,null,null,"Ecole juive de Lyon (privé)","Gratte-ciel-Dedieu-Charmettes"]
[null,null,null,null,null,null,null,null,null,null,null,null,"cp",null,"x","x",null,null,null,"Edouard Herriot","Gratte-ciel-Dedieu-Charmettes"]
[null,null,null,null,null,null,null,null,null,null,null,null,"cp/ce1",null,"x","x",null,null,null,"Emile Zola","Gratte-ciel-Dedieu-Charmettes"]
[null,null,null,null,null,null,null,null,null,null,null,null,"ce1",null,"x","x",null,null,null,"Ernest Renan A","Cusset-Bonnevay"]
[null,null,null,null,null,null,null,null,null,null,null,null,"ce1/ce2",null,"x","x",null,null,null,"Ernest Renan B","Cusset-Bonnevay"]
[null,null,null,null,null,null,null,null,null,null,null,null,"ce2",null,"x","x",null,null,null,"François Truffaut","Charpennes-Tonkin"]
[null,null,null,null,null,null,null,null,null,null,null,null,"ce2/cm1",null,"x","x",null,null,null,"Immaculée conception (privé)","Perralière-Grandclément"]
{"$rows_left_out":34}