{"text_format":"1","workbook":"xlsx","n_sheets":7,"sheets":["Configuration","Modèle liste élèves","Configuration Liste élèves","Modèle","LISTES DES ELEVES ","Semainier","LISTE DES PROFS"],"not_rendered":{"charts":1,"images":0,"macros":1,"external_links":0,"defined_names":16,"comments":4,"pivot_tables":1},"unopened":[],"bounds":{"document_bytes":16777216,"sheet_cells":100000,"rows_first":2000,"rows_last":500,"rows_between":2000,"halvings":0,"cell_chars":16384,"cell_head_chars":4096},"cells_cut":0,"cells_raw":0,"read":"whole","date_system":"1900"}

{"sheet":"Configuration","index":0,"n_rows":37,"n_cols":13,"rows_kept":37,"cut":false,"hidden":false,"merged":[[13,3,14,3],[15,3,16,3],[17,3,18,3],[19,3,20,3],[3,0,5,3],[6,2,6,3],[7,3,8,5],[9,3,10,3],[11,3,12,3]]}
[]
[]
[]
["Cahier journal V3"]
[]
[]
[2018,"-",2019,null,null,null,null,null,null,null,null,1,"Janvier"]
[null,null,null,"Vacances scolaires",null,null,null,null,null,null,null,2,"février"]
[null,null,null,null,null,null,null,null,null,null,null,3,"mars"]
["Année scolaire :",201862019,null,"Vacances d’été (année précédente)","début","2016-07-05",{"$f":"F10+1","v":"2016-07-06"},null,null,null,null,4,"avril"]
{"$rows_left_out":28}
{"sheet":"Modèle liste élèves","index":1,"n_rows":7,"n_cols":18,"rows_kept":7,"cut":false,"hidden":true,"merged":[[0,1,0,13]]}
[null,"Liste élèves"]
["École:",null,{"$f":"Configuration!B12","v":"CFA"}]
["Enseignant:",null,{"$f":"Configuration!B14","v":"Mr DUPONT"}]
["Année scolaire:",null,{"$f":"Configuration!B10","v":201862019}]
["Classe de:",null,{"$f":"Configuration!B13","v":"niveau"}]
[null,null,null," "," "," "," "," "," "," ",null," "," "," "," "," "," "," "]
["N°","Nom","Prénom","Niv"]

{"sheet":"Configuration Liste élèves","index":2,"n_rows":223,"n_cols":17,"rows_kept":223,"cut":false,"hidden":false,"merged":[[6,14,6,15],[1,14,1,15],[2,14,2,15],[3,14,3,15],[4,14,4,15],[5,14,5,15]]}
[]
[null,"Liste élèves",null,null,null,null,null,null,null,null,null,null,null,null,"absence matin",null,"―"]
[null,null,null,null,null,null,null,null,null,null,null,null,null,null,"Absence après-midi",null,"│"]
["Année scolaire",null,"2018-2019",null,null,null,null,null,null,null,null,null,null,null,"Absenc toute la journée",null,"+"]
[null,null,null,null,null,null,null,null,null,null,null,null,null,null,"retard",null,"● r"]
["Classe",null,"ccv 1",null,null,null,null,null,null,null,null,null,null,null,"présent",null,"●"]
[null,null,null,null,null,null,null,null,null,null,null,null,null,null,"Absences justifiées",null,"― j"]
["Rentrez ci-dessous votre liste d'élève (dans l'ordre alphabétique ou non )",null,null,null,null,null,null,null,null,null,null,null,null,null,null,null,"│ j"]
[null,null,null,null,null,null,null,null,null,null,null,null,null,null,null,null,"+ j"]
["Num","PRENOM","NOM","Niveau","Dates de naissance","Sexe",null,"année naissance"]
{"$rows_left_out":214}
{"sheet":"Modèle","index":3,"n_rows":226,"n_cols":7,"rows_kept":226,"cut":false,"hidden":true,"merged":[[0,1,0,2],[129,2,129,5],[130,2,130,5],[132,2,132,5],[133,2,133,5],[134,2,134,5],[135,2,135,5]]}
[null,"Liste d'appel",null,null,{"$f":"'Configuration Liste élèves'!C6","v":"ccv 1"}]
["le",{"$f":"TODAY()","v":"2018-09-11"},"Présences matin",null,{"$f":"IF(INDIRECT(\"G6\")=TODAY(),INDIRECT(\"G130\"),\"\")","v":""}]
[null,null,"Présences après-midi",null,{"$f":"IF(INDIRECT(\"G6\")=TODAY(),INDIRECT(\"G131\"),\"\")","v":""}]
[null,null,"Absences",null,{"$f":"IF(INDIRECT(\"G6\")=TODAY(),INDIRECT(\"G136\"),\"\")","v":""}]
[]
["Num","Noms","Prénoms","Dates en cours","Ret","Abs"]
[null,{"$f":"IF(A7=\"\",\"\",'Configuration Liste élèves'!B51)","v":""},{"$f":"IF(B7=\"\",\"\",'Configuration Liste élèves'!C51)","v":""},null,{"$f":"IF(B7=\"\",\"\",COUNTIF(INDIRECT(\"G\"&ROW()):INDIRECT(\"WH\"&ROW()),'Configuration Liste élèves'!$Q$5))","v":""},{"$f":"IF(B7=\"\",\"\",COUNTIF(INDIRECT(\"G\"&ROW()):INDIRECT(\"WH\"&ROW()),'Configuration Liste élèves'!$Q$2)+COUNTIF(INDIRECT(\"G\"&ROW()):INDIRECT(\"WH\"&ROW()),'Configuration Liste élèves'!$Q$3)+2*(COUNTIF(INDIRECT(\"G\"&ROW()):INDIRECT(\"WH\"&ROW()),'Configuration Liste élèves'!$Q$4+COUNTIF(INDIRECT(\"G\"&ROW()):INDIRECT(\"WH\"&ROW()),'Configuration Liste élèves'!$Q$7)+COUNTIF(INDIRECT(\"G\"&ROW()):INDIRECT(\"WH\"&ROW()),'Configuration Liste élèves'!$Q$8)+2*(COUNTIF(INDIRECT(\"G\"&ROW()):INDIRECT(\"WH\"&ROW()),'Configuration Liste élèves'!$Q$9)))))","v":""}]
[null,{"$f":"IF(A8=\"\",\"\",'Configuration Liste élèves'!B52)","v":""},{"$f":"IF(B8=\"\",\"\",'Configuration Liste élèves'!C52)","v":""},null,{"$f":"IF(B8=\"\",\"\",COUNTIF(INDIRECT(\"G\"&ROW()):INDIRECT(\"WH\"&ROW()),'Configuration Liste élèves'!$Q$5))","v":""},{"$f":"IF(B8=\"\",\"\",COUNTIF(INDIRECT(\"G\"&ROW()):INDIRECT(\"WH\"&ROW()),'Configuration Liste élèves'!$Q$2)+COUNTIF(INDIRECT(\"G\"&ROW()):INDIRECT(\"WH\"&ROW()),'Configuration Liste élèves'!$Q$3)+2*(COUNTIF(INDIRECT(\"G\"&ROW()):INDIRECT(\"WH\"&ROW()),'Configuration Liste élèves'!$Q$4+COUNTIF(INDIRECT(\"G\"&ROW()):INDIRECT(\"WH\"&ROW()),'Configuration Liste élèves'!$Q$7)+COUNTIF(INDIRECT(\"G\"&ROW()):INDIRECT(\"WH\"&ROW()),'Configuration Liste élèves'!$Q$8)+2*(COUNTIF(INDIRECT(\"G\"&ROW()):INDIRECT(\"WH\"&ROW()),'Configuration Liste élèves'!$Q$9)))))","v":""}]
[null,{"$f":"IF(A9=\"\",\"\",'Configuration Liste élèves'!B53)","v":""},{"$f":"IF(B9=\"\",\"\",'Configuration Liste élèves'!C53)","v":""},null,{"$f":"IF(B9=\"\",\"\",COUNTIF(INDIRECT(\"G\"&ROW()):INDIRECT(\"WH\"&ROW()),'Configuration Liste élèves'!$Q$5))","v":""},{"$f":"IF(B9=\"\",\"\",COUNTIF(INDIRECT(\"G\"&ROW()):INDIRECT(\"WH\"&ROW()),'Configuration Liste élèves'!$Q$2)+COUNTIF(INDIRECT(\"G\"&ROW()):INDIRECT(\"WH\"&ROW()),'Configuration Liste élèves'!$Q$3)+2*(COUNTIF(INDIRECT(\"G\"&ROW()):INDIRECT(\"WH\"&ROW()),'Configuration Liste élèves'!$Q$4+COUNTIF(INDIRECT(\"G\"&ROW()):INDIRECT(\"WH\"&ROW()),'Configuration Liste élèves'!$Q$7)+COUNTIF(INDIRECT(\"G\"&ROW()):INDIRECT(\"WH\"&ROW()),'Configuration Liste élèves'!$Q$8)+2*(COUNTIF(INDIRECT(\"G\"&ROW()):INDIRECT(\"WH\"&ROW()),'Configuration Liste élèves'!$Q$9)))))","v":""}]
[null,{"$f":"IF(A10=\"\",\"\",'Configuration Liste élèves'!B54)","v":""},{"$f":"IF(B10=\"\",\"\",'Configuration Liste élèves'!C54)","v":""},null,{"$f":"IF(B10=\"\",\"\",COUNTIF(INDIRECT(\"G\"&ROW()):INDIRECT(\"WH\"&ROW()),'Configuration Liste élèves'!$Q$5))","v":""},{"$f":"IF(B10=\"\",\"\",COUNTIF(INDIRECT(\"G\"&ROW()):INDIRECT(\"WH\"&ROW()),'Configuration Liste élèves'!$Q$2)+COUNTIF(INDIRECT(\"G\"&ROW()):INDIRECT(\"WH\"&ROW()),'Configuration Liste élèves'!$Q$3)+2*(COUNTIF(INDIRECT(\"G\"&ROW()):INDIRECT(\"WH\"&ROW()),'Configuration Liste élèves'!$Q$4+COUNTIF(INDIRECT(\"G\"&ROW()):INDIRECT(\"WH\"&ROW()),'Configuration Liste élèves'!$Q$7)+COUNTIF(INDIRECT(\"G\"&ROW()):INDIRECT(\"WH\"&ROW()),'Configuration Liste élèves'!$Q$8)+2*(COUNTIF(INDIRECT(\"G\"&ROW()):INDIRECT(\"WH\"&ROW()),'Configuration Liste élèves'!$Q$9)))))","v":""}]
{"$rows_left_out":217}
{"sheet":"LISTES DES ELEVES ","index":4,"n_rows":47,"n_cols":4,"rows_kept":47,"cut":false,"hidden":false,"merged":[[0,1,0,13],[6,4,6,8]]}
[null,"Liste élèves"]
["École:",null,{"$f":"Configuration!B12","v":"CFA"}]
["Enseignant:",null,"MAR PAUL"]
["Année scolaire:",null,{"$f":"'Configuration Liste élèves'!C4","v":"2018-2019"}]
["jours",null,"lundi"]
["Classe de:",null,"ccv1"]
[]
["N°","Nom","Prénom","Niv"]
[{"$f":"IF(B9=\"\",\"\",#REF!+1)","v":{"$error":"#REF!"}},"Yohan ","SPIRAL ","AUDIO"]
[{"$f":"IF(B10=\"\",\"\",A9+1)","v":{"$error":"#REF!"}},"Mathias","LEITE","CCV2"]
{"$rows_left_out":38}
{"sheet":"Semainier","index":5,"n_rows":274,"n_cols":5,"rows_kept":274,"cut":false,"hidden":true,"merged":[[0,0,0,4]]}
["Semainier "]
[]
[{"$f":"#REF!","v":{"$error":"#REF!"}},{"$f":"#REF!+1","v":{"$error":"#REF!"}},{"$f":"#REF!+2","v":{"$error":"#REF!"}},{"$f":"#REF!+3","v":{"$error":"#REF!"}},{"$f":"#REF!+4","v":{"$error":"#REF!"}}]
["LUNDI","MARDI","MERCREDI","JEUDI","VENDREDI"]
[{"$f":"IF(AND(#REF!=\"\",#REF!=\"\"),\"\",IF(#REF!=\"Récréation\",CONCATENATE(#REF!&\" / \"&#REF!)&CHAR(10)&\"RECREATION\",CONCATENATE(#REF!&\" / \"&#REF!)&CHAR(10)&\"Matière : \"&#REF!&CHAR(10)&\"Compétences : \"&#REF!))","v":{"$error":"#REF!"}},{"$f":"IF(AND(#REF!=\"\",#REF!=\"\"),\"\",IF(#REF!=\"Récréation\",CONCATENATE(#REF!&\" / \"&#REF!)&CHAR(10)&\"RECREATION\",CONCATENATE(#REF!&\" / \"&#REF!)&CHAR(10)&\"Matière : \"&#REF!&CHAR(10)&\"Compétences : \"&#REF!))","v":{"$error":"#REF!"}},{"$f":"IF(AND(#REF!=\"\",#REF!=\"\"),\"\",IF(#REF!=\"Récréation\",CONCATENATE(#REF!&\" / \"&#REF!)&CHAR(10)&\"RECREATION\",CONCATENATE(#REF!&\" / \"&#REF!)&CHAR(10)&\"Matière : \"&#REF!&CHAR(10)&\"Compétences : \"&#REF!))","v":{"$error":"#REF!"}},{"$f":"IF(AND(#REF!=\"\",#REF!=\"\"),\"\",IF(#REF!=\"Récréation\",CONCATENATE(#REF!&\" / \"&#REF!)&CHAR(10)&\"RECREATION\",CONCATENATE(#REF!&\" / \"&#REF!)&CHAR(10)&\"Matière : \"&#REF!&CHAR(10)&\"Compétences : \"&#REF!))","v":{"$error":"#REF!"}},{"$f":"IF(AND(#REF!=\"\",#REF!=\"\"),\"\",IF(#REF!=\"Récréation\",CONCATENATE(#REF!&\" / \"&#REF!)&CHAR(10)&\"RECREATION\",CONCATENATE(#REF!&\" / \"&#REF!)&CHAR(10)&\"Matière : \"&#REF!&CHAR(10)&\"Compétences : \"&#REF!))","v":{"$error":"#REF!"}}]
[{"$f":"IF(AND(#REF!=\"\",#REF!=\"\"),\"\",IF(#REF!=\"Récréation\",CONCATENATE(#REF!&\" / \"&#REF!)&CHAR(10)&\"RECREATION\",CONCATENATE(#REF!&\" / \"&#REF!)&CHAR(10)&\"Matière : \"&#REF!&CHAR(10)&\"Compétences : \"&#REF!))","v":{"$error":"#REF!"}},{"$f":"IF(AND(#REF!=\"\",#REF!=\"\"),\"\",IF(#REF!=\"Récréation\",CONCATENATE(#REF!&\" / \"&#REF!)&CHAR(10)&\"RECREATION\",CONCATENATE(#REF!&\" / \"&#REF!)&CHAR(10)&\"Matière : \"&#REF!&CHAR(10)&\"Compétences : \"&#REF!))","v":{"$error":"#REF!"}},{"$f":"IF(AND(#REF!=\"\",#REF!=\"\"),\"\",IF(#REF!=\"Récréation\",CONCATENATE(#REF!&\" / \"&#REF!)&CHAR(10)&\"RECREATION\",CONCATENATE(#REF!&\" / \"&#REF!)&CHAR(10)&\"Matière : \"&#REF!&CHAR(10)&\"Compétences : \"&#REF!))","v":{"$error":"#REF!"}},{"$f":"IF(AND(#REF!=\"\",#REF!=\"\"),\"\",IF(#REF!=\"Récréation\",CONCATENATE(#REF!&\" / \"&#REF!)&CHAR(10)&\"RECREATION\",CONCATENATE(#REF!&\" / \"&#REF!)&CHAR(10)&\"Matière : \"&#REF!&CHAR(10)&\"Compétences : \"&#REF!))","v":{"$error":"#REF!"}},{"$f":"IF(AND(#REF!=\"\",#REF!=\"\"),\"\",IF(#REF!=\"Récréation\",CONCATENATE(#REF!&\" / \"&#REF!)&CHAR(10)&\"RECREATION\",CONCATENATE(#REF!&\" / \"&#REF!)&CHAR(10)&\"Matière : \"&#REF!&CHAR(10)&\"Compétences : \"&#REF!))","v":{"$error":"#REF!"}}]
[{"$f":"IF(AND(#REF!=\"\",#REF!=\"\"),\"\",IF(#REF!=\"Récréation\",CONCATENATE(#REF!&\" / \"&#REF!)&CHAR(10)&\"RECREATION\",CONCATENATE(#REF!&\" / \"&#REF!)&CHAR(10)&\"Matière : \"&#REF!&CHAR(10)&\"Compétences : \"&#REF!))","v":{"$error":"#REF!"}},{"$f":"IF(AND(#REF!=\"\",#REF!=\"\"),\"\",IF(#REF!=\"Récréation\",CONCATENATE(#REF!&\" / \"&#REF!)&CHAR(10)&\"RECREATION\",CONCATENATE(#REF!&\" / \"&#REF!)&CHAR(10)&\"Matière : \"&#REF!&CHAR(10)&\"Compétences : \"&#REF!))","v":{"$error":"#REF!"}},{"$f":"IF(AND(#REF!=\"\",#REF!=\"\"),\"\",IF(#REF!=\"Récréation\",CONCATENATE(#REF!&\" / \"&#REF!)&CHAR(10)&\"RECREATION\",CONCATENATE(#REF!&\" / \"&#REF!)&CHAR(10)&\"Matière : \"&#REF!&CHAR(10)&\"Compétences : \"&#REF!))","v":{"$error":"#REF!"}},{"$f":"IF(AND(#REF!=\"\",#REF!=\"\"),\"\",IF(#REF!=\"Récréation\",CONCATENATE(#REF!&\" / \"&#REF!)&CHAR(10)&\"RECREATION\",CONCATENATE(#REF!&\" / \"&#REF!)&CHAR(10)&\"Matière : \"&#REF!&CHAR(10)&\"Compétences : \"&#REF!))","v":{"$error":"#REF!"}},{"$f":"IF(AND(#REF!=\"\",#REF!=\"\"),\"\",IF(#REF!=\"Récréation\",CONCATENATE(#REF!&\" / \"&#REF!)&CHAR(10)&\"RECREATION\",CONCATENATE(#REF!&\" / \"&#REF!)&CHAR(10)&\"Matière : \"&#REF!&CHAR(10)&\"Compétences : \"&#REF!))","v":{"$error":"#REF!"}}]
[{"$f":"IF(AND(#REF!=\"\",#REF!=\"\"),\"\",IF(#REF!=\"Récréation\",CONCATENATE(#REF!&\" / \"&#REF!)&CHAR(10)&\"RECREATION\",CONCATENATE(#REF!&\" / \"&#REF!)&CHAR(10)&\"Matière : \"&#REF!&CHAR(10)&\"Compétences : \"&#REF!))","v":{"$error":"#REF!"}},{"$f":"IF(AND(#REF!=\"\",#REF!=\"\"),\"\",IF(#REF!=\"Récréation\",CONCATENATE(#REF!&\" / \"&#REF!)&CHAR(10)&\"RECREATION\",CONCATENATE(#REF!&\" / \"&#REF!)&CHAR(10)&\"Matière : \"&#REF!&CHAR(10)&\"Compétences : \"&#REF!))","v":{"$error":"#REF!"}},{"$f":"IF(AND(#REF!=\"\",#REF!=\"\"),\"\",IF(#REF!=\"Récréation\",CONCATENATE(#REF!&\" / \"&#REF!)&CHAR(10)&\"RECREATION\",CONCATENATE(#REF!&\" / \"&#REF!)&CHAR(10)&\"Matière : \"&#REF!&CHAR(10)&\"Compétences : \"&#REF!))","v":{"$error":"#REF!"}},{"$f":"IF(AND(#REF!=\"\",#REF!=\"\"),\"\",IF(#REF!=\"Récréation\",CONCATENATE(#REF!&\" / \"&#REF!)&CHAR(10)&\"RECREATION\",CONCATENATE(#REF!&\" / \"&#REF!)&CHAR(10)&\"Matière : \"&#REF!&CHAR(10)&\"Compétences : \"&#REF!))","v":{"$error":"#REF!"}},{"$f":"IF(AND(#REF!=\"\",#REF!=\"\"),\"\",IF(#REF!=\"Récréation\",CONCATENATE(#REF!&\" / \"&#REF!)&CHAR(10)&\"RECREATION\",CONCATENATE(#REF!&\" / \"&#REF!)&CHAR(10)&\"Matière : \"&#REF!&CHAR(10)&\"Compétences : \"&#REF!))","v":{"$error":"#REF!"}}]
[{"$f":"IF(AND(#REF!=\"\",#REF!=\"\"),\"\",IF(#REF!=\"Récréation\",CONCATENATE(#REF!&\" / \"&#REF!)&CHAR(10)&\"RECREATION\",CONCATENATE(#REF!&\" / \"&#REF!)&CHAR(10)&\"Matière : \"&#REF!&CHAR(10)&\"Compétences : \"&#REF!))","v":{"$error":"#REF!"}},{"$f":"IF(AND(#REF!=\"\",#REF!=\"\"),\"\",IF(#REF!=\"Récréation\",CONCATENATE(#REF!&\" / \"&#REF!)&CHAR(10)&\"RECREATION\",CONCATENATE(#REF!&\" / \"&#REF!)&CHAR(10)&\"Matière : \"&#REF!&CHAR(10)&\"Compétences : \"&#REF!))","v":{"$error":"#REF!"}},{"$f":"IF(AND(#REF!=\"\",#REF!=\"\"),\"\",IF(#REF!=\"Récréation\",CONCATENATE(#REF!&\" / \"&#REF!)&CHAR(10)&\"RECREATION\",CONCATENATE(#REF!&\" / \"&#REF!)&CHAR(10)&\"Matière : \"&#REF!&CHAR(10)&\"Compétences : \"&#REF!))","v":{"$error":"#REF!"}},{"$f":"IF(AND(#REF!=\"\",#REF!=\"\"),\"\",IF(#REF!=\"Récréation\",CONCATENATE(#REF!&\" / \"&#REF!)&CHAR(10)&\"RECREATION\",CONCATENATE(#REF!&\" / \"&#REF!)&CHAR(10)&\"Matière : \"&#REF!&CHAR(10)&\"Compétences : \"&#REF!))","v":{"$error":"#REF!"}},{"$f":"IF(AND(#REF!=\"\",#REF!=\"\"),\"\",IF(#REF!=\"Récréation\",CONCATENATE(#REF!&\" / \"&#REF!)&CHAR(10)&\"RECREATION\",CONCATENATE(#REF!&\" / \"&#REF!)&CHAR(10)&\"Matière : \"&#REF!&CHAR(10)&\"Compétences : \"&#REF!))","v":{"$error":"#REF!"}}]
[{"$f":"IF(AND(#REF!=\"\",#REF!=\"\"),\"\",IF(#REF!=\"Récréation\",CONCATENATE(#REF!&\" / \"&#REF!)&CHAR(10)&\"RECREATION\",CONCATENATE(#REF!&\" / \"&#REF!)&CHAR(10)&\"Matière : \"&#REF!&CHAR(10)&\"Compétences : \"&#REF!))","v":{"$error":"#REF!"}},{"$f":"IF(AND(#REF!=\"\",#REF!=\"\"),\"\",IF(#REF!=\"Récréation\",CONCATENATE(#REF!&\" / \"&#REF!)&CHAR(10)&\"RECREATION\",CONCATENATE(#REF!&\" / \"&#REF!)&CHAR(10)&\"Matière : \"&#REF!&CHAR(10)&\"Compétences : \"&#REF!))","v":{"$error":"#REF!"}},{"$f":"IF(AND(#REF!=\"\",#REF!=\"\"),\"\",IF(#REF!=\"Récréation\",CONCATENATE(#REF!&\" / \"&#REF!)&CHAR(10)&\"RECREATION\",CONCATENATE(#REF!&\" / \"&#REF!)&CHAR(10)&\"Matière : \"&#REF!&CHAR(10)&\"Compétences : \"&#REF!))","v":{"$error":"#REF!"}},{"$f":"IF(AND(#REF!=\"\",#REF!=\"\"),\"\",IF(#REF!=\"Récréation\",CONCATENATE(#REF!&\" / \"&#REF!)&CHAR(10)&\"RECREATION\",CONCATENATE(#REF!&\" / \"&#REF!)&CHAR(10)&\"Matière : \"&#REF!&CHAR(10)&\"Compétences : \"&#REF!))","v":{"$error":"#REF!"}},{"$f":"IF(AND(#REF!=\"\",#REF!=\"\"),\"\",IF(#REF!=\"Récréation\",CONCATENATE(#REF!&\" / \"&#REF!)&CHAR(10)&\"RECREATION\",CONCATENATE(#REF!&\" / \"&#REF!)&CHAR(10)&\"Matière : \"&#REF!&CHAR(10)&\"Compétences : \"&#REF!))","v":{"$error":"#REF!"}}]
{"$rows_left_out":265}
{"sheet":"LISTE DES PROFS","index":6,"n_rows":39,"n_cols":12,"rows_kept":39,"cut":false,"hidden":false,"merged":[]}
["MAR PAUL","ccv",null,null,"patrick clayes","anim",null,"Yohan ","SPIRAL ","AUDIO",null,"lundi"]
["RICHTER AURELIEN","ccv",null,null," Christophe Palma","anim",null,"Mathias","LEITE","CCV2"]
["FITER MATTHIAS","ccv",null,null,"daniele scali","anim",null,"Cyrianne","ALLIEN","CCV3"]
["VERJUX FRANCK","ccv",null,null,null,null,null,"Charlotte ","PICOUILLA","CCV2"]
[" RAPEZYNSKI  JONATHAN","ccv",null,null,null,null,null,"Marie-Charlotte","PEPIN","CCV3"]
["BOURDIER LAURENT","ccv",null,null,null,null,null,"Ophélie ","DURA","CCV2"]
["PHILIPPON SYLVAIN","ccv",null,null,null,null,null,"Matthieu ","DE VALENCE","CCV3"]
["COGNON PIERRE","ccv",null,null,null,null,null,"MARINE","REMI","CCV3"]
["CAUSSIDERY ROLLAND","ccv",null,null,null,null,null,"LEA","FERNANDES","CCV3"]
["LOUART SAMUEL","ccv",null,null,null,null,null,"CYRIENNE","MESTRES","CCV3"]
{"$rows_left_out":29}