{"text_format":"1","workbook":"xlsx","n_sheets":6,"sheets":["mémo pour remplir le tableau","Données","tmp","Bilans","listes","Regroupements"],"not_rendered":{"charts":6,"images":0,"macros":1,"external_links":3,"defined_names":45,"comments":3,"pivot_tables":0},"unopened":[],"bounds":{"document_bytes":16777216,"sheet_cells":100000,"rows_first":2000,"rows_last":500,"rows_between":2000,"halvings":0,"cell_chars":16384,"cell_head_chars":4096},"cells_cut":0,"cells_raw":0,"read":"whole","date_system":"1900"}

{"sheet":"mémo pour remplir le tableau","index":0,"n_rows":24,"n_cols":2,"rows_kept":24,"cut":false,"hidden":false,"merged":[[0,0,0,1],[2,0,2,1],[10,0,10,1],[15,0,15,1],[20,0,20,1]]}
["MEMO POUR REMPLIR LE TABLEAU"]
[]
["Ajouter un événement"]
["*","Se positionner à la fin du tableau sur une nouvelle ligne"]
["*","Remplir obligatoirement les colonnes A à J"]
["*","Colonne K \"Commentaires\" optionnelle"]
["*","Données des colonnes L,M, N calculées de manière automatique, servant aux tableaux bilans : Ne pas y toucher"]
["*","Remplir la colonne F \"Enseignant référent\" en inscrivant d'abord le nom de l'enseignant, puis son prénom"]
{"$rows_left_out":17}
{"sheet":"Données","index":1,"n_rows":151,"n_cols":22,"rows_kept":151,"cut":false,"hidden":false,"merged":[]}
["Date venue","Secteur organisateur","Secteur organisateur binôme","Etablissement scolaire","Niveau de classe","Enseignant référent (Nom Prénom)","Nombre enfants","In situ / hors les murs","Type de visite","Commentaires","Appréciation","Groupe niveau","Quartier","Etablissement accueillant","CléEtablissement","cptEtablissement","CléRéseau-Rize horsmed","cptréseau-rizehormed","CléRize","cptrize","cléTotal","cptTotal"]
["2017-10-18","RIZE MED",null,"Jean Jaurès (primaire)","gs","CENT",23,"In situ","Visite découverte",null,null,{"$f":"IF(COUNTIF(Maternelle,E2)=1,listes!$T$1,IF(COUNTIF(Elémentaire,E2)=1,listes!$U$1,IF(COUNTIF(Collège,E2)=1,listes!$V$1,IF(COUNTIF(Lycée,E2)=1,listes!$W$1,\"\"))))","v":"Maternelle"},{"$f":"VLOOKUP(T_sept_dec[[#This Row],[Etablissement scolaire]],Regroupements!$T:$U,2,FALSE)","v":"Ferrandière-Maisons Neuves"},{"$f":"IF(COUNTIF(FDL,B2)=1,\"FDL\",IF(COUNTIF(RIZE,B2)=1,\"RIZE\",IF(COUNTIF(MLIS,B2)=1,\"MLIS\",IF(COUNTIF(PACBUS,B2)=1,\"PAC-BUS\",IF(COUNTIF(Tonkin,B2)=1,\"TONKIN\",\"\")))))","v":"RIZE"},{"$f":"T_sept_dec[[#This Row],[Etablissement accueillant]]&\"-\"&T_sept_dec[[#This Row],[Enseignant référent (Nom Prénom)]]","v":"RIZE-CENT"},{"$f":"1/COUNTIF(T_sept_dec[CléEtablissement],T_sept_dec[[#This Row],[CléEtablissement]])","v":1},{"$f":"IF(COUNTIF(Réseau,T_sept_dec[[#This Row],[Secteur organisateur]]),\"Réseau_\"&T_sept_dec[[#This Row],[Enseignant référent (Nom Prénom)]], IF(COUNTIF(Rizehorsmed,T_sept_dec[[#This Row],[Secteur organisateur]]),\"Rizehorsmed_\"&T_sept_dec[[#This Row],[Enseignant référent (Nom Prénom)]], T_sept_dec[[#This Row],[Secteur organisateur]]&\"_\"&T_sept_dec[[#This Row],[Enseignant référent (Nom Prénom)]]))","v":"Réseau_CENT"},{"$f":"1/COUNTIF(T_sept_dec[CléRéseau-Rize horsmed],T_sept_dec[[#This Row],[CléRéseau-Rize horsmed]])","v":1},{"$f":"IF(COUNTIF(RIZE,T_sept_dec[[#This Row],[Secteur organisateur]]),\"Rize_\"&T_sept_dec[[#This Row],[Enseignant référent (Nom Prénom)]],\"\")","v":"Rize_CENT"},{"$f":"1/COUNTIF(T_sept_dec[CléRize],T_sept_dec[[#This Row],[CléRize]])","v":1},{"$f":"IF(COUNTIF(Total,T_sept_dec[[#This Row],[Secteur organisateur]]),\"Total_\"&T_sept_dec[[#This Row],[Enseignant référent (Nom Prénom)]],\"\")","v":"Total_CENT"},{"$f":"1/COUNTIF(T_sept_dec[cléTotal],T_sept_dec[[#This Row],[cléTotal]])","v":1}]
["2017-11-14","RIZE VALO",null,"Collège Jean Jaurès","6°","CENTDEUX",28,"Hors les murs","Exploration urbaine",null,null,{"$f":"IF(COUNTIF(Maternelle,E3)=1,listes!$T$1,IF(COUNTIF(Elémentaire,E3)=1,listes!$U$1,IF(COUNTIF(Collège,E3)=1,listes!$V$1,IF(COUNTIF(Lycée,E3)=1,listes!$W$1,\"\"))))","v":"Collège"},{"$f":"VLOOKUP(T_sept_dec[[#This Row],[Etablissement scolaire]],Regroupements!$T:$U,2,FALSE)","v":"Ferrandière-Maisons Neuves"},"RIZE",{"$f":"T_sept_dec[[#This Row],[Etablissement accueillant]]&\"-\"&T_sept_dec[[#This Row],[Enseignant référent (Nom Prénom)]]","v":"RIZE-CENTDEUX"},{"$f":"1/COUNTIF(T_sept_dec[CléEtablissement],T_sept_dec[[#This Row],[CléEtablissement]])","v":1},{"$f":"IF(COUNTIF(Réseau,T_sept_dec[[#This Row],[Secteur organisateur]]),\"Réseau_\"&T_sept_dec[[#This Row],[Enseignant référent (Nom Prénom)]], IF(COUNTIF(Rizehorsmed,T_sept_dec[[#This Row],[Secteur organisateur]]),\"Rizehorsmed_\"&T_sept_dec[[#This Row],[Enseignant référent (Nom Prénom)]], T_sept_dec[[#This Row],[Secteur organisateur]]&\"_\"&T_sept_dec[[#This Row],[Enseignant référent (Nom Prénom)]]))","v":"Rizehorsmed_CENTDEUX"},{"$f":"1/COUNTIF(T_sept_dec[CléRéseau-Rize horsmed],T_sept_dec[[#This Row],[CléRéseau-Rize horsmed]])","v":1},{"$f":"IF(COUNTIF(RIZE,T_sept_dec[[#This Row],[Secteur organisateur]]),\"Rize_\"&T_sept_dec[[#This Row],[Enseignant référent (Nom Prénom)]],\"\")","v":"Rize_CENTDEUX"},{"$f":"1/COUNTIF(T_sept_dec[CléRize],T_sept_dec[[#This Row],[CléRize]])","v":1},{"$f":"IF(COUNTIF(Total,T_sept_dec[[#This Row],[Secteur organisateur]]),\"Total_\"&T_sept_dec[[#This Row],[Enseignant référent (Nom Prénom)]],\"\")","v":"Total_CENTDEUX"},{"$f":"1/COUNTIF(T_sept_dec[cléTotal],T_sept_dec[[#This Row],[cléTotal]])","v":1}]
["2017-11-22","EMM",null,"Jean Zay","cm2","CENTUN",25,"In situ","Coder avec Scratch",null,null,{"$f":"IF(COUNTIF(Maternelle,E4)=1,listes!$T$1,IF(COUNTIF(Elémentaire,E4)=1,listes!$U$1,IF(COUNTIF(Collège,E4)=1,listes!$V$1,IF(COUNTIF(Lycée,E4)=1,listes!$W$1,\"\"))))","v":"Elémentaire"},{"$f":"VLOOKUP(T_sept_dec[[#This Row],[Etablissement scolaire]],Regroupements!$T:$U,2,FALSE)","v":"Gratte-ciel-Dedieu-Charmettes"},"MLIS",{"$f":"T_sept_dec[[#This Row],[Etablissement accueillant]]&\"-\"&T_sept_dec[[#This Row],[Enseignant référent (Nom Prénom)]]","v":"MLIS-CENTUN"},{"$f":"1/COUNTIF(T_sept_dec[CléEtablissement],T_sept_dec[[#This Row],[CléEtablissement]])","v":1},{"$f":"IF(COUNTIF(Réseau,T_sept_dec[[#This Row],[Secteur organisateur]]),\"Réseau_\"&T_sept_dec[[#This Row],[Enseignant référent (Nom Prénom)]], IF(COUNTIF(Rizehorsmed,T_sept_dec[[#This Row],[Secteur organisateur]]),\"Rizehorsmed_\"&T_sept_dec[[#This Row],[Enseignant référent (Nom Prénom)]], T_sept_dec[[#This Row],[Secteur organisateur]]&\"_\"&T_sept_dec[[#This Row],[Enseignant référent (Nom Prénom)]]))","v":"Réseau_CENTUN"},{"$f":"1/COUNTIF(T_sept_dec[CléRéseau-Rize horsmed],T_sept_dec[[#This Row],[CléRéseau-Rize horsmed]])","v":1},{"$f":"IF(COUNTIF(RIZE,T_sept_dec[[#This Row],[Secteur organisateur]]),\"Rize_\"&T_sept_dec[[#This Row],[Enseignant référent (Nom Prénom)]],\"\")","v":""},{"$f":"1/COUNTIF(T_sept_dec[CléRize],T_sept_dec[[#This Row],[CléRize]])","v":9.8039215686274508E-3},{"$f":"IF(COUNTIF(Total,T_sept_dec[[#This Row],[Secteur organisateur]]),\"Total_\"&T_sept_dec[[#This Row],[Enseignant référent (Nom Prénom)]],\"\")","v":"Total_CENTUN"},{"$f":"1/COUNTIF(T_sept_dec[cléTotal],T_sept_dec[[#This Row],[cléTotal]])","v":1}]
["2017-12-06","RIZE MED",null,"Louis Pasteur","cp","CINQ",23,"In situ","Visite découverte",null,null,{"$f":"IF(COUNTIF(Maternelle,E5)=1,listes!$T$1,IF(COUNTIF(Elémentaire,E5)=1,listes!$U$1,IF(COUNTIF(Collège,E5)=1,listes!$V$1,IF(COUNTIF(Lycée,E5)=1,listes!$W$1,\"\"))))","v":"Elémentaire"},{"$f":"VLOOKUP(T_sept_dec[[#This Row],[Etablissement scolaire]],Regroupements!$T:$U,2,FALSE)","v":"Perralière-Grandclément"},"RIZE",{"$f":"T_sept_dec[[#This Row],[Etablissement accueillant]]&\"-\"&T_sept_dec[[#This Row],[Enseignant référent (Nom Prénom)]]","v":"RIZE-CINQ"},{"$f":"1/COUNTIF(T_sept_dec[CléEtablissement],T_sept_dec[[#This Row],[CléEtablissement]])","v":1},{"$f":"IF(COUNTIF(Réseau,T_sept_dec[[#This Row],[Secteur organisateur]]),\"Réseau_\"&T_sept_dec[[#This Row],[Enseignant référent (Nom Prénom)]], IF(COUNTIF(Rizehorsmed,T_sept_dec[[#This Row],[Secteur organisateur]]),\"Rizehorsmed_\"&T_sept_dec[[#This Row],[Enseignant référent (Nom Prénom)]], T_sept_dec[[#This Row],[Secteur organisateur]]&\"_\"&T_sept_dec[[#This Row],[Enseignant référent (Nom Prénom)]]))","v":"Réseau_CINQ"},{"$f":"1/COUNTIF(T_sept_dec[CléRéseau-Rize horsmed],T_sept_dec[[#This Row],[CléRéseau-Rize horsmed]])","v":1},{"$f":"IF(COUNTIF(RIZE,T_sept_dec[[#This Row],[Secteur organisateur]]),\"Rize_\"&T_sept_dec[[#This Row],[Enseignant référent (Nom Prénom)]],\"\")","v":"Rize_CINQ"},{"$f":"1/COUNTIF(T_sept_dec[CléRize],T_sept_dec[[#This Row],[CléRize]])","v":1},{"$f":"IF(COUNTIF(Total,T_sept_dec[[#This Row],[Secteur organisateur]]),\"Total_\"&T_sept_dec[[#This Row],[Enseignant référent (Nom Prénom)]],\"\")","v":"Total_CINQ"},{"$f":"1/COUNTIF(T_sept_dec[cléTotal],T_sept_dec[[#This Row],[cléTotal]])","v":1}]
["2017-11-17","RIZE VALO",null,"Edouard Herriot","cm1","CINQUANTE",22,"Hors les murs","Exploration Gratte-Ciel",null,null,{"$f":"IF(COUNTIF(Maternelle,E6)=1,listes!$T$1,IF(COUNTIF(Elémentaire,E6)=1,listes!$U$1,IF(COUNTIF(Collège,E6)=1,listes!$V$1,IF(COUNTIF(Lycée,E6)=1,listes!$W$1,\"\"))))","v":"Elémentaire"},{"$f":"VLOOKUP(T_sept_dec[[#This Row],[Etablissement scolaire]],Regroupements!$T:$U,2,FALSE)","v":"Gratte-ciel-Dedieu-Charmettes"},"RIZE",{"$f":"T_sept_dec[[#This Row],[Etablissement accueillant]]&\"-\"&T_sept_dec[[#This Row],[Enseignant référent (Nom Prénom)]]","v":"RIZE-CINQUANTE"},{"$f":"1/COUNTIF(T_sept_dec[CléEtablissement],T_sept_dec[[#This Row],[CléEtablissement]])","v":1},{"$f":"IF(COUNTIF(Réseau,T_sept_dec[[#This Row],[Secteur organisateur]]),\"Réseau_\"&T_sept_dec[[#This Row],[Enseignant référent (Nom Prénom)]], IF(COUNTIF(Rizehorsmed,T_sept_dec[[#This Row],[Secteur organisateur]]),\"Rizehorsmed_\"&T_sept_dec[[#This Row],[Enseignant référent (Nom Prénom)]], T_sept_dec[[#This Row],[Secteur organisateur]]&\"_\"&T_sept_dec[[#This Row],[Enseignant référent (Nom Prénom)]]))","v":"Rizehorsmed_CINQUANTE"},{"$f":"1/COUNTIF(T_sept_dec[CléRéseau-Rize horsmed],T_sept_dec[[#This Row],[CléRéseau-Rize horsmed]])","v":1},{"$f":"IF(COUNTIF(RIZE,T_sept_dec[[#This Row],[Secteur organisateur]]),\"Rize_\"&T_sept_dec[[#This Row],[Enseignant référent (Nom Prénom)]],\"\")","v":"Rize_CINQUANTE"},{"$f":"1/COUNTIF(T_sept_dec[CléRize],T_sept_dec[[#This Row],[CléRize]])","v":1},{"$f":"IF(COUNTIF(Total,T_sept_dec[[#This Row],[Secteur organisateur]]),\"Total_\"&T_sept_dec[[#This Row],[Enseignant référent (Nom Prénom)]],\"\")","v":"Total_CINQUANTE"},{"$f":"1/COUNTIF(T_sept_dec[cléTotal],T_sept_dec[[#This Row],[cléTotal]])","v":1}]
["2017-11-28","PAC-BUS",null,"Saint Exupéry","cp","CINQUANTECINQ",26,"Hors les murs","Visite découverte",null,null,{"$f":"IF(COUNTIF(Maternelle,E7)=1,listes!$T$1,IF(COUNTIF(Elémentaire,E7)=1,listes!$U$1,IF(COUNTIF(Collège,E7)=1,listes!$V$1,IF(COUNTIF(Lycée,E7)=1,listes!$W$1,\"\"))))","v":"Elémentaire"},{"$f":"VLOOKUP(T_sept_dec[[#This Row],[Etablissement scolaire]],Regroupements!$T:$U,2,FALSE)","v":"Saint Jean"},"PAC-BUS",{"$f":"T_sept_dec[[#This Row],[Etablissement accueillant]]&\"-\"&T_sept_dec[[#This Row],[Enseignant référent (Nom Prénom)]]","v":"PAC-BUS-CINQUANTECINQ"},{"$f":"1/COUNTIF(T_sept_dec[CléEtablissement],T_sept_dec[[#This Row],[CléEtablissement]])","v":1},{"$f":"IF(COUNTIF(Réseau,T_sept_dec[[#This Row],[Secteur organisateur]]),\"Réseau_\"&T_sept_dec[[#This Row],[Enseignant référent (Nom Prénom)]], IF(COUNTIF(Rizehorsmed,T_sept_dec[[#This Row],[Secteur organisateur]]),\"Rizehorsmed_\"&T_sept_dec[[#This Row],[Enseignant référent (Nom Prénom)]], T_sept_dec[[#This Row],[Secteur organisateur]]&\"_\"&T_sept_dec[[#This Row],[Enseignant référent (Nom Prénom)]]))","v":"Réseau_CINQUANTECINQ"},{"$f":"1/COUNTIF(T_sept_dec[CléRéseau-Rize horsmed],T_sept_dec[[#This Row],[CléRéseau-Rize horsmed]])","v":1},{"$f":"IF(COUNTIF(RIZE,T_sept_dec[[#This Row],[Secteur organisateur]]),\"Rize_\"&T_sept_dec[[#This Row],[Enseignant référent (Nom Prénom)]],\"\")","v":""},{"$f":"1/COUNTIF(T_sept_dec[CléRize],T_sept_dec[[#This Row],[CléRize]])","v":9.8039215686274508E-3},{"$f":"IF(COUNTIF(Total,T_sept_dec[[#This Row],[Secteur organisateur]]),\"Total_\"&T_sept_dec[[#This Row],[Enseignant référent (Nom Prénom)]],\"\")","v":"Total_CINQUANTECINQ"},{"$f":"1/COUNTIF(T_sept_dec[cléTotal],T_sept_dec[[#This Row],[cléTotal]])","v":1}]
["2017-10-20","EMM",null,"Jules Ferry","cm2","CINQUANTEDEUX",24,"In situ","Coder avec Scratch",null,null,{"$f":"IF(COUNTIF(Maternelle,E8)=1,listes!$T$1,IF(COUNTIF(Elémentaire,E8)=1,listes!$U$1,IF(COUNTIF(Collège,E8)=1,listes!$V$1,IF(COUNTIF(Lycée,E8)=1,listes!$W$1,\"\"))))","v":"Elémentaire"},{"$f":"VLOOKUP(T_sept_dec[[#This Row],[Etablissement scolaire]],Regroupements!$T:$U,2,FALSE)","v":"Cusset-Bonnevay"},"MLIS",{"$f":"T_sept_dec[[#This Row],[Etablissement accueillant]]&\"-\"&T_sept_dec[[#This Row],[Enseignant référent (Nom Prénom)]]","v":"MLIS-CINQUANTEDEUX"},{"$f":"1/COUNTIF(T_sept_dec[CléEtablissement],T_sept_dec[[#This Row],[CléEtablissement]])","v":1},{"$f":"IF(COUNTIF(Réseau,T_sept_dec[[#This Row],[Secteur organisateur]]),\"Réseau_\"&T_sept_dec[[#This Row],[Enseignant référent (Nom Prénom)]], IF(COUNTIF(Rizehorsmed,T_sept_dec[[#This Row],[Secteur organisateur]]),\"Rizehorsmed_\"&T_sept_dec[[#This Row],[Enseignant référent (Nom Prénom)]], T_sept_dec[[#This Row],[Secteur organisateur]]&\"_\"&T_sept_dec[[#This Row],[Enseignant référent (Nom Prénom)]]))","v":"Réseau_CINQUANTEDEUX"},{"$f":"1/COUNTIF(T_sept_dec[CléRéseau-Rize horsmed],T_sept_dec[[#This Row],[CléRéseau-Rize horsmed]])","v":1},{"$f":"IF(COUNTIF(RIZE,T_sept_dec[[#This Row],[Secteur organisateur]]),\"Rize_\"&T_sept_dec[[#This Row],[Enseignant référent (Nom Prénom)]],\"\")","v":""},{"$f":"1/COUNTIF(T_sept_dec[CléRize],T_sept_dec[[#This Row],[CléRize]])","v":9.8039215686274508E-3},{"$f":"IF(COUNTIF(Total,T_sept_dec[[#This Row],[Secteur organisateur]]),\"Total_\"&T_sept_dec[[#This Row],[Enseignant référent (Nom Prénom)]],\"\")","v":"Total_CINQUANTEDEUX"},{"$f":"1/COUNTIF(T_sept_dec[cléTotal],T_sept_dec[[#This Row],[cléTotal]])","v":1}]
{"$rows_left_out":144}
{"sheet":"tmp","index":2,"n_rows":16,"n_cols":22,"rows_kept":16,"cut":false,"hidden":false,"merged":[]}
["Date venue","Secteur organisateur","Secteur organisateur binôme","Etablissement scolaire","Niveau de classe","Enseignant référent (Nom Prénom)","Nombre enfants","In situ / hors les murs","Type de visite","Commentaires","Appréciation","Groupe niveau","Quartier","Etablissement accueillant","CléEtablissement","cptEtablissement","CléRéseau-Rize horsmed","cptréseau-rizehormed","CléRize","cptrize","cléTotal","cptTotal"]
["2017-12-05","MTK",null,"Lakanal","cp","DIXNEUF",26,"In situ","Visite découverte",null,null,"Elémentaire","Charpennes-Tonkin","TONKIN","TONKIN-DIXNEUF",1,"Réseau_DIXNEUF",1,"",9.8039215686274508E-3,"Total_DIXNEUF",1]
["2017-11-28","MTK",null,"Tonkin/Nigritelle","cp","DIXSEPT",26,"In situ","Première lecture",null,null,"Elémentaire","Charpennes-Tonkin","TONKIN","TONKIN-DIXSEPT",1,"Réseau_DIXSEPT",1,"",9.8039215686274508E-3,"Total_DIXSEPT",1]
["2017-11-09","MTK",null,"Louis Armand","cm1","ONZE",30,"In situ","De la littérature au cinéma",null,null,"Elémentaire","Charpennes-Tonkin","TONKIN","TONKIN-ONZE",1,"Réseau_ONZE",1,"",9.8039215686274508E-3,"Total_ONZE",1]
["2017-11-16","MTK",null,"Saint Exupéry","cm1/cm2","QUARENTEHUIT",23,"In situ","De la littérature au cinéma",null,null,"Elémentaire","Saint Jean","TONKIN","TONKIN-QUARENTEHUIT",1,"Réseau_QUARENTEHUIT",0.5,"",9.8039215686274508E-3,"Total_QUARENTEHUIT",0.5]
["2017-12-05","MTK",null,"Lakanal","cp","QUATREVINGTDIX",24,"In situ","Visite découverte",null,null,"Elémentaire","Charpennes-Tonkin","TONKIN","TONKIN-QUATREVINGTDIX",1,"Réseau_QUATREVINGTDIX",1,"",9.8039215686274508E-3,"Total_QUATREVINGTDIX",1]
["2017-12-21","MTK",null,"Ecole juive de Lyon (privé)","ce1","QUATREVINGTNEUF",29,"In situ","Visite thématique",null,null,"Elémentaire","Gratte-ciel-Dedieu-Charmettes","TONKIN","TONKIN-QUATREVINGTNEUF",1,"Réseau_QUATREVINGTNEUF",1,"",9.8039215686274508E-3,"Total_QUATREVINGTNEUF",1]
["2017-11-24","MTK",null,"Lakanal","cp/ce1","QUATREVINGTSEPT",24,"In situ","Visite à la carte",null,null,"Elémentaire","Charpennes-Tonkin","TONKIN","TONKIN-QUATREVINGTSEPT",1,"Réseau_QUATREVINGTSEPT",1,"",9.8039215686274508E-3,"Total_QUATREVINGTSEPT",1]
{"$rows_left_out":9}
{"sheet":"Bilans","index":3,"n_rows":106,"n_cols":28,"rows_kept":106,"cut":false,"hidden":false,"merged":[[27,11,29,11],[30,11,32,11],[33,11,35,11],[36,11,38,11],[39,11,41,11],[100,0,100,1],[43,3,43,4],[71,0,73,0],[89,0,91,0],[44,0,44,7],[43,1,43,2],[62,0,64,0],[65,0,67,0],[58,1,58,2],[58,3,58,4],[60,2,60,4],[60,5,60,7],[93,0,93,3],[46,1,56,1],[59,0,59,21],[60,14,60,18],[105,0,105,1],[68,0,70,0],[77,0,79,0],[80,0,82,0],[83,0,85,0],[86,0,88,0],[74,0,76,0],[104,0,104,1],[95,0,95,1],[96,0,96,1],[97,0,97,1],[101,0,101,1],[102,0,102,1],[98,0,98,1],[103,0,103,1],[99,0,99,1],[11,0,13,0],[14,0,16,0],[17,0,19,0],[27,0,29,0],[30,0,32,0],[20,0,22,0],[39,0,41,0],[60,11,60,13],[60,19,60,21],[60,8,60,10],[33,0,35,0],[36,0,38,0],[46,12,56,12]]}
["Type tableau","pl. Données","pl. Résultats","pl. TitresLig","pl. titresCol","Champ\nLig","Champ\nCol","Champ\nNbEleve","champ \nEnseignant",null,null,"https://www.commentcamarche.net/forum/affich-35499266-calculer-l-occurrence-de-deux-donnees-pas-somme#p35504763"]
[1,{"$f":"T_sept_dec[]","v":"RIZE MED"},{"$f":"C12:G23","v":{"$error":"#VALUE!"}},{"$f":"A12:A23","v":{"$error":"#VALUE!"}},{"$f":"C11:G11","v":"Ecole (Mat+Element)"},"reg_Sect","reg_Niv","Nombre enfants","Enseignant référent (Nom Prénom)"]
[1,{"$f":"T_sept_dec[]","v":"RIZE VALO"},{"$f":"C28:G42","v":{"$error":"#VALUE!"}},{"$f":"A28:A42","v":{"$error":"#VALUE!"}},{"$f":"C27:G27","v":"Ecole (Mat+Element)"},"reg_Sect","reg_Niv","Nombre enfants","Enseignant référent (Nom Prénom)"]
[1,{"$f":"T_sept_dec[]","v":"EMM"},{"$f":"C63:N92","v":{"$error":"#VALUE!"}},{"$f":"$A$63:$A$92","v":{"$error":"#VALUE!"}},{"$f":"C61:N61","v":0},"reg_Quart","reg_Niv","Nombre enfants","Enseignant référent (Nom Prénom)",null,"!!! 2 tableaux juxtaposés pour Bilan par quartier. Attention pl. titresCol ne sont pas sur la même ligne"]
[1,{"$f":"T_sept_dec[]","v":"RIZE MED"},{"$f":"O63:S92","v":{"$error":"#VALUE!"}},{"$f":"$A$63:$A$92","v":{"$error":"#VALUE!"}},{"$f":"O62:S62","v":{"$error":"#VALUE!"}},"reg_Quart","reg_Sect","Nombre enfants","Enseignant référent (Nom Prénom)",null,"!!! 2 tableaux juxtaposés pour Bilan par quartier. Attention pl. titresCol ne sont pas sur la même ligne"]
[]
[]
[]
{"$rows_left_out":99}
{"sheet":"listes","index":4,"n_rows":52,"n_cols":23,"rows_kept":52,"cut":false,"hidden":false,"merged":[]}
["Niveau classe","Secteur organisateur","Réseau","Rizehorsmed","Type de visite","Etablissement scolaire","In situ / hors les murs","Classe accueillie pour la…fois","Quartiers","Buers-Croix-Luizet","Charpennes-Tonkin","Cusset-Bonnevay","Cyprian-les-Brosses","Ferrandière-Maisons Neuves","Gratte-ciel-Dedieu-Charmettes","Perralière-Grandclément","Saint Jean","Hors Villeurbanne","Niveaux classe","Maternelle","Elémentaire","Collège","Lycée"]
["autres (maternelle)","FDL","ARTO","RIZE ARCHI","Album","Hors Villeurbanne","In situ",1,null,"Collège Jean Macé","Tonkin/Nigritelle","Ernest Renan A","Albert Camus","Antonin Perrin","Anatole France","Berthelot","Saint Exupéry","Hors Villeurbanne",null,"autres (maternelle)","autres (élémentaire)","autres (collège)","autres (lycée)"]
["autres (élémentaire)","ARTO","EMM","RIZE VALO","Autour de la musique","Albert Camus","Hors les murs",2,null,"Croix-Luizet","Descartes","Ernest Renan B","Jules Guesde","Jean Jaurès (primaire)","Edouard Herriot","Louis Pasteur","Collège Jean-Vilar",null,null,"tps","cp","6°","2°"]
["autres (collège)","EMM","MLIS A",null,"Autour du cinéma","Anatole France",null,3,null,"Jean Moulin","François Truffaut","Jules Ferry","Simone Veil","Collège Jean Jaurès","Emile Zola","René Pellet (déficients visuels)","Collège Simone Lagrange",null,null,"ps","cp/ce1","5°","2° pro"]
["autres (lycée)","MLIS A","MLIS DV",null,"Arrêt Bibliobus","Antonin Perrin",null,4,null,"Château-Gaillard","Lakanal","Lazare Goujon","Collège Lamartine","Collège Louis Jouvet","Jacques Prévert","La Nativité (privé)",null,null,null,"ps/ms","ce1","4°","1°"]
["tps","MLIS DV","MLIS J",null,"Ateliers","Berthelot",null,5,null,null,"Louis Armand","Lycée Frédéric Faÿs","Lycée Alfred de Musset",null,"Jean Zay","Immaculée conception (privé)",null,null,null,"ps/gs","ce1/ce2","3°","1° pro"]
["ps","MLIS J","MTK",null,"Autre","Beth Menahem (privé)",null,6,null,null,"Mère Teresa (privé)","Beth Menahem (privé)",null,null,"Léon Jouhaux","Lycée Marie Curie",null,null,null,"ms","ce2","ULIS (collège)","Tle"]
["ps/ms","MTK","PAC-BUS",null,"Coder avec Scratch","Château-Gaillard",null,7,null,null,"Ecole Horizons (privé)","Collège des Iris",null,null,"Rosa Parks",null,null,null,null,"ms/gs","ce2/cm1",null,"Tle pro"]
{"$rows_left_out":45}
{"sheet":"Regroupements","index":5,"n_rows":54,"n_cols":21,"rows_kept":54,"cut":false,"hidden":false,"merged":[]}
["nom regroupement","reg_Sect",null,null,null,null,null,null,null,null,null,null,"reg_Niv",null,null,null,null,null,null,"reg_Quart"]
[]
[null,"Secteur organisateur","Réseau des médiathèques","Accueils menés seulement par le Rize (hors médiathèque)","FDL","MLIS","RIZE","TONKIN","PAC-BUS","FDL",null,null,"Niveau de classe","Maternelle","Elémentaire","Ecole (Mat+Element)","Collège","Lycée",null,"Etablissement scolaire","Quartier"]
[null,"FDL",null,null,"x",null,null,null,null,"x",null,null,"autres (maternelle)","x",null,"x",null,null,null,"Hors Villeurbanne","Hors Villeurbanne"]
[null,"ARTO","x",null,null,"x",null,null,null,null,null,null,"autres (élémentaire)",null,"x","x",null,null,null,"Albert Camus","Cyprian-les-Brosses"]
[null,"EMM","x",null,null,"x",null,null,null,null,null,null,"autres (collège)",null,null,null,"x",null,null,"Anatole France","Gratte-ciel-Dedieu-Charmettes"]
[null,"MLIS A","x",null,null,"x",null,null,null,null,null,null,"autres (lycée)",null,null,null,null,"x",null,"Antonin Perrin","Ferrandière-Maisons Neuves"]
[null,"MLIS DV","x",null,null,"x",null,null,null,null,null,null,"tps","x",null,"x",null,null,null,"Berthelot","Perralière-Grandclément"]
{"$rows_left_out":46}