{"text_format":"1","workbook":"xlsx","n_sheets":14,"sheets":["Accueil","Cours","Calendrier","Biochimie","Biologie Moléculaire","Chimie Organique","Chimie Générale","Embriologie","Biologie de la reproduction","Histologie","Biologie cellulaire","Physique","Biophysique","Biostatistiques"],"not_rendered":{"charts":0,"images":7,"macros":1,"external_links":0,"defined_names":4,"comments":2,"pivot_tables":0},"unopened":[],"bounds":{"document_bytes":16777216,"sheet_cells":100000,"rows_first":2000,"rows_last":500,"rows_between":2000,"halvings":0,"cell_chars":16384,"cell_head_chars":4096},"cells_cut":0,"cells_raw":0,"read":"whole","date_system":"1900"}

{"sheet":"Accueil","index":0,"n_rows":20,"n_cols":11,"rows_kept":20,"cut":false,"hidden":false,"merged":[[6,10,6,12],[10,10,10,12],[15,10,15,12],[0,4,2,12],[6,1,6,2],[17,1,17,2],[6,4,6,6],[10,4,10,6],[11,4,11,6],[15,4,15,6],[19,4,19,6],[6,7,6,9],[10,7,10,9],[11,7,11,9],[15,7,15,9],[19,7,19,9]]}
[null,null,null,null,"Catalogue des cours PACES"]
[]
[]
[]
[]
[]
[null,"Gestion des cours",null,null,"Biochimie",null,null,"Embriologie",null,null,"Physique"]
[]
[]
[]
[null,null,null,null,"Biologie",null,null,"Biologie de ",null,null,"Biophysique"]
[null,null,null,null," Moléculaire",null,null,"la reproduction"]
[]
[]
[]
[null,null,null,null,"Chimie Organique",null,null,"Histologie",null,null,"Biostatistiques"]
[]
[null,"Calendrier"]
[null,"de suivi des cours"]
[null,null,null,null,"Chimie Générale",null,null,"Biologie cellulaire"]
{"$rows_left_out":1}
{"sheet":"Cours","index":1,"n_rows":178,"n_cols":14,"rows_kept":178,"cut":false,"hidden":false,"merged":[]}
["Matières","Ronéos","Matières","J0","J+2","J+4","J+7","J+15","J+21","NB Cours",null,null,null,"Marquage"]
["BioChi     Structure protéines","R1","Biochimie","2018-08-03","2018-08-05","2018-08-07","2018-08-10","2018-08-18","2018-08-24",{"$f":"COUNTIF(D2:I2,\"<\"&TODAY())","v":2},null,"Retour Acceuil",null,"aucun"]
["BioChi     Structure glucides","R2","Biochimie",null,null,null,null,null,null,0,null,null,null,"Démarré"]
["BioChi     Lipides","R3","Biochimie",null,null,null,null,null,null,0,null,null,null,"Approfondir"]
["BioChi     BioNRJ","R4","Biochimie",null,null,null,null,null,null,0,null,null,null,"OK"]
["BioChi     Enzymo 1","R5","Biochimie",null,null,null,null,null,null,0]
["BioChi     Enzymo 2","R6","Biochimie",null,null,null,null,null,null,0]
["BioChi     Enzymo 3","R7","Biochimie",null,null,null,null,null,null,0]
["BioChi     Métabolisme glucidique","R8","Biochimie",null,null,null,null,null,null,0]
["BioChi     GGL","R8","Biochimie",null,null,null,null,null,null,0,"Marquage",null,{"$f":"TODAY()","v":"2018-08-06"}]
["BioChi     Glycolyse","R9","Biochimie",null,null,null,null,null,null,0,"aucun"]
["BioChi     Pentose Phosphate","R10","Biochimie",null,null,null,null,null,null,0,"Démarré"]
["BioChi     Glycogénogénèse","R11","Biochimie",null,null,null,null,null,null,0,"Approfondir"]
["BioChi     NGG","R11","Biochimie",null,null,null,null,null,null,0,"OK"]
["BioChi     Homéostatie glucidique","R11","Biochimie",null,null,null,null,null,null,0]
["BioChi     Métabolisme lipidique","R12","Biochimie",null,null,null,null,null,null,0]
["BioChi     Catabolisme AG et CC","R13","Biochimie",null,null,null,null,null,null,0]
["BioChi     Biosynthèse AG et TG","R14","Biochimie",null,null,null,null,null,null,0]
["BioChi     Métabolisme AA","R15","Biochimie",null,null,null,null,null,null,0]
["BioChi     PDH","R16","Biochimie",null,null,null,null,null,null,0]
{"$rows_left_out":159}
{"sheet":"Calendrier","index":2,"n_rows":41,"n_cols":3,"rows_kept":41,"cut":false,"hidden":false,"merged":[]}
[null,"2018-08-01"]
[{"$f":"B1","v":"2018-08-01"},null,1]
[{"$f":"A2+1","v":"2018-08-02"}]
[{"$f":"A3+1","v":"2018-08-03"}]
["2018-08-04"]
["2018-08-05"]
["2018-08-06"]
["2018-08-07"]
["2018-08-08"]
["2018-08-09"]
["2018-08-10"]
["2018-08-11"]
["2018-08-12"]
["2018-08-13"]
["2018-08-14"]
["2018-08-15"]
["2018-08-16"]
["2018-08-17"]
["2018-08-18"]
["2018-08-19"]
{"$rows_left_out":22}
{"sheet":"Biochimie","index":3,"n_rows":31,"n_cols":13,"rows_kept":31,"cut":false,"hidden":false,"merged":[[30,0,31,1],[0,4,0,10],[9,0,10,0],[13,0,15,0],[20,0,21,0]]}
[null,"Biochimie",null,null,"Annatut'"]
["Ronéos","Cours","Nbre de vues \ntotale","Dernière vue","2012-2013","2013-2014","2014-2015","2015-2016","2016-2017","2017-2018","2018 -2019","Annales"]
["R1","BioChi     Structure protéines",{"$f":"Cours!J2","v":2},{"$f":"MAX(INDEX((Cours!D2:I2<TODAY())*Cours!D2:I2,0))","v":"2018-08-05"},null,null,null,null,null,null,null,null,{"$f":"IF((TODAY()-D3)>7,1,0)","v":0}]
["R2","BioChi     Structure glucides",{"$f":"Cours!J3","v":0},{"$f":"MAX(INDEX((Cours!D3:I3<TODAY())*Cours!D3:I3,0))","v":"00:00:00"},null,null,null,null,null,null,null,null,{"$f":"IF((TODAY()-D4)>7,1,0)","v":1}]
["R3","BioChi     Lipides",{"$f":"Cours!J4","v":0},{"$f":"MAX(INDEX((Cours!D4:I4<TODAY())*Cours!D4:I4,0))","v":"00:00:00"}]
["R4","BioChi     BioNRJ",{"$f":"Cours!J5","v":0},{"$f":"MAX(INDEX((Cours!D5:I5<TODAY())*Cours!D5:I5,0))","v":"00:00:00"}]
["R5","BioChi     Enzymo 1",{"$f":"Cours!J6","v":0},{"$f":"MAX(INDEX((Cours!D6:I6<TODAY())*Cours!D6:I6,0))","v":"00:00:00"}]
["R6","BioChi     Enzymo 2",{"$f":"Cours!J7","v":0},{"$f":"MAX(INDEX((Cours!D7:I7<TODAY())*Cours!D7:I7,0))","v":"00:00:00"}]
["R7","BioChi     Enzymo 3",{"$f":"Cours!J8","v":0},{"$f":"MAX(INDEX((Cours!D8:I8<TODAY())*Cours!D8:I8,0))","v":"00:00:00"}]
["R8","BioChi     Métabolisme glucidique",{"$f":"Cours!J9","v":0},{"$f":"MAX(INDEX((Cours!D9:I9<TODAY())*Cours!D9:I9,0))","v":"00:00:00"}]
[null,"BioChi     GGL",{"$f":"Cours!J10","v":0},{"$f":"MAX(INDEX((Cours!D10:I10<TODAY())*Cours!D10:I10,0))","v":"00:00:00"}]
["R9","BioChi     Glycolyse",{"$f":"Cours!J11","v":0},{"$f":"MAX(INDEX((Cours!D11:I11<TODAY())*Cours!D11:I11,0))","v":"00:00:00"}]
["R10","BioChi     Pentose Phosphate",{"$f":"Cours!J12","v":0},{"$f":"MAX(INDEX((Cours!D12:I12<TODAY())*Cours!D12:I12,0))","v":"00:00:00"}]
["R11","BioChi     Glycogénogénèse",{"$f":"Cours!J13","v":0},{"$f":"MAX(INDEX((Cours!D13:I13<TODAY())*Cours!D13:I13,0))","v":"00:00:00"}]
[null,"BioChi     NGG",{"$f":"Cours!J14","v":0},{"$f":"MAX(INDEX((Cours!D14:I14<TODAY())*Cours!D14:I14,0))","v":"00:00:00"}]
[null,"BioChi     Homéostatie glucidique",{"$f":"Cours!J15","v":0},{"$f":"MAX(INDEX((Cours!D15:I15<TODAY())*Cours!D15:I15,0))","v":"00:00:00"}]
["R12","BioChi     Métabolisme lipidique",{"$f":"Cours!J16","v":0},{"$f":"MAX(INDEX((Cours!D16:I16<TODAY())*Cours!D16:I16,0))","v":"00:00:00"}]
["R13","BioChi     Catabolisme AG et CC",{"$f":"Cours!J17","v":0},{"$f":"MAX(INDEX((Cours!D17:I17<TODAY())*Cours!D17:I17,0))","v":"00:00:00"}]
["R14","BioChi     Biosynthèse AG et TG",{"$f":"Cours!J18","v":0},{"$f":"MAX(INDEX((Cours!D18:I18<TODAY())*Cours!D18:I18,0))","v":"00:00:00"}]
["R15","BioChi     Métabolisme AA",{"$f":"Cours!J19","v":0},{"$f":"MAX(INDEX((Cours!D19:I19<TODAY())*Cours!D19:I19,0))","v":"00:00:00"}]
{"$rows_left_out":12}
{"sheet":"Biologie Moléculaire","index":4,"n_rows":14,"n_cols":11,"rows_kept":14,"cut":false,"hidden":false,"merged":[[0,4,0,10],[2,0,5,0],[6,0,8,0],[9,0,11,0],[13,0,14,1]]}
[null,"Biologie Moléculaire",null,null,"Annatut'"]
["Fiches","Cours","Nbre de vues","Dernière vue","2012-2013","2013-2014","2014-2015","2015-2016","2016-2017","2017-2018","2018 -2019"]
["F1","BioMol     Introduction",{"$f":"Cours!J28","v":0},{"$f":"MAX(IF(Cours!D28:I28<TODAY(),Cours!D28:I28))","v":"00:00:00"}]
[null,"BioMol     Acides nucléiques",{"$f":"Cours!J29","v":0},{"$f":"MAX(IF(Cours!D29:I29<TODAY(),Cours!D29:I29))","v":"00:00:00"}]
[null,"BioMol     Réplication",{"$f":"Cours!J30","v":0},{"$f":"MAX(IF(Cours!D30:I30<TODAY(),Cours!D30:I30))","v":"00:00:00"}]
[null,"BioMol     Transcription",{"$f":"Cours!J31","v":0},{"$f":"MAX(IF(Cours!D31:I31<TODAY(),Cours!D31:I31))","v":"00:00:00"}]
["F2","BioMol     Traduction",{"$f":"Cours!J32","v":0},{"$f":"MAX(IF(Cours!D32:I32<TODAY(),Cours!D32:I32))","v":"00:00:00"}]
[null,"BioMol     Régulation de l'expression des gènes",{"$f":"Cours!J33","v":0},{"$f":"MAX(IF(Cours!D33:I33<TODAY(),Cours!D33:I33))","v":"00:00:00"}]
[null,"BioMol     Méiose",{"$f":"Cours!J34","v":0},{"$f":"MAX(IF(Cours!D34:I34<TODAY(),Cours!D34:I34))","v":"00:00:00"}]
["F3","BioMol     Hérédité mendélienne et ses exceptions",{"$f":"Cours!J35","v":0},{"$f":"MAX(IF(Cours!D35:I35<TODAY(),Cours!D35:I35))","v":"00:00:00"}]
[null,"BioMol     Mécanisme d'apparition des mutations",{"$f":"Cours!J36","v":0},{"$f":"MAX(IF(Cours!D36:I36<TODAY(),Cours!D36:I36))","v":"00:00:00"}]
[null,"BioMol     Biologie moléculaire et génomique comparative",{"$f":"Cours!J37","v":0},{"$f":"MAX(IF(Cours!D37:I37<TODAY(),Cours!D37:I37))","v":"00:00:00"}]
[]
["Annales",null,"2010 - 2011","2011 - 2012","2012-2013","2013-2014","2014-2015","2015-2016","2016-2017","2017-2018"]

{"sheet":"Chimie Organique","index":5,"n_rows":15,"n_cols":11,"rows_kept":15,"cut":false,"hidden":false,"merged":[[0,4,0,10],[14,0,15,1]]}
[null,"Chimie Orga",null,null,"Annatut'"]
["Ronéos","Cours","Nbre de vues","Dernière vue","2012-2013","2013-2014","2014-2015","2015-2016","2016-2017","2017-2018","2018 -2019"]
["F1","ChiOrg     Liaison chimique",{"$f":"Cours!J38","v":0},{"$f":"MAX(IF(Cours!D38:I38<TODAY(),Cours!D38:I38))","v":"00:00:00"}]
["F2","ChiOrg    Géométrie des molécules",{"$f":"Cours!J39","v":0},{"$f":"MAX(IF(Cours!D39:I39<TODAY(),Cours!D39:I39))","v":"00:00:00"}]
["F3","ChiOrg    Nomenclature",{"$f":"Cours!J40","v":0},{"$f":"MAX(IF(Cours!D40:I40<TODAY(),Cours!D40:I40))","v":"00:00:00"}]
["F4","Interactions électriques et effets des solvants",{"$f":"Cours!J41","v":0},{"$f":"MAX(IF(Cours!D41:I41<TODAY(),Cours!D41:I41))","v":"00:00:00"}]
["F5","ChiOrg    Isomérie",{"$f":"Cours!J42","v":0},{"$f":"MAX(IF(Cours!D42:I42<TODAY(),Cours!D42:I42))","v":"00:00:00"}]
["F6","ChiOrg    Réaction chimique",{"$f":"Cours!J43","v":0},{"$f":"MAX(IF(Cours!D43:I43<TODAY(),Cours!D43:I43))","v":"00:00:00"}]
["F7","ChiOrg    Réaction sur les carbones saturés",{"$f":"Cours!J44","v":0},{"$f":"MAX(IF(Cours!D44:I44<TODAY(),Cours!D44:I44))","v":"00:00:00"}]
["F8","Réaction sur alcènes et alcynes",{"$f":"Cours!J45","v":0},{"$f":"MAX(IF(Cours!D45:I45<TODAY(),Cours!D45:I45))","v":"00:00:00"}]
["F9","ChiOrg    Réaction sur aromatiques",{"$f":"Cours!J46","v":0},{"$f":"MAX(IF(Cours!D46:I46<TODAY(),Cours!D46:I46))","v":"00:00:00"}]
["F10","ChiOrg    C=O",{"$f":"Cours!J47","v":0},{"$f":"MAX(IF(Cours!D47:I47<TODAY(),Cours!D47:I47))","v":"00:00:00"}]
[]
[]
["Annales",null,"2010 - 2011","2011 - 2012","2012-2013","2013-2014","2014-2015","2015-2016","2016-2017","2017-2018"]

{"sheet":"Chimie Générale","index":6,"n_rows":9,"n_cols":12,"rows_kept":9,"cut":false,"hidden":false,"merged":[[0,4,0,10],[8,0,9,1]]}
[null,"Chimie Générale",null,null,"Annatut'"]
["Chapitres","Cours","Nbre de vues","Dernière vue","2012-2013","2013-2014","2014-2015","2015-2016","2016-2017","2017-2018","2018 -2019","QCM livre"]
["C1","ChiGén   Atomistique",{"$f":"Cours!J48","v":0},{"$f":"MAX(IF(Cours!D48:I48<TODAY(),Cours!D8:I48))","v":"00:00:00"}]
["C2","ChiGén   Liaisons Chimiques",{"$f":"Cours!J49","v":0},{"$f":"MAX(IF(Cours!D49:I49<TODAY(),Cours!D9:I49))","v":"00:00:00"}]
["C3","ChiGén   Thermodynamique",{"$f":"Cours!J50","v":0},{"$f":"MAX(IF(Cours!D50:I50<TODAY(),Cours!D10:I50))","v":"00:00:00"}]
["C4","ChiGén   Equilibre chimique",{"$f":"Cours!J51","v":0},{"$f":"MAX(IF(Cours!D51:I51<TODAY(),Cours!D11:I51))","v":"00:00:00"}]
[]
[]
["Annales",null,"2010 - 2011","2011 - 2012","2012-2013","2013-2014","2014-2015","2015-2016"]

{"sheet":"Embriologie","index":7,"n_rows":12,"n_cols":11,"rows_kept":12,"cut":false,"hidden":false,"merged":[[0,4,0,10],[11,0,12,1]]}
[null,"Embryologie",null,null,"Annatut'"]
["Ronéos","Cours","Nbre de vues","Dernière vue","2012-2013","2013-2014","2014-2015","2015-2016","2016-2017","2017-2018","2018 -2019"]
["R1","Embrio   Intro",{"$f":"Cours!J52","v":0},{"$f":"MAX(IF(Cours!D52:I52<TODAY(),Cours!D52:I52))","v":"00:00:00"}]
["R1","Embrio   Semaine 1",{"$f":"Cours!J53","v":0},{"$f":"MAX(IF(Cours!D53:I53<TODAY(),Cours!D53:I53))","v":"00:00:00"}]
["R2","Embrio   Semaine 2",{"$f":"Cours!J54","v":0},{"$f":"MAX(IF(Cours!D54:I54<TODAY(),Cours!D54:I54))","v":"00:00:00"}]
["R3","Embrio   Semaine 3",{"$f":"Cours!J55","v":0},{"$f":"MAX(IF(Cours!D55:I55<TODAY(),Cours!D55:I55))","v":"00:00:00"}]
["R4","Embrio   Semaine 3",{"$f":"Cours!J56","v":0},{"$f":"MAX(IF(Cours!D56:I56<TODAY(),Cours!D56:I56))","v":"00:00:00"}]
["R5","Embrio   Semaine 4",{"$f":"Cours!J57","v":0},{"$f":"MAX(IF(Cours!D57:I57<TODAY(),Cours!D57:I57))","v":"00:00:00"}]
["R6","Embrio   Semaine 4",{"$f":"Cours!J58","v":0},{"$f":"MAX(IF(Cours!D58:I58<TODAY(),Cours!D58:I58))","v":"00:00:00"}]
[]
[]
["Annales",null,"2010 - 2011","2011 - 2012","2012-2013","2013-2014","2014-2015","2015-2016"]

{"sheet":"Biologie de la reproduction","index":8,"n_rows":12,"n_cols":12,"rows_kept":12,"cut":false,"hidden":false,"merged":[[0,4,0,10],[2,11,8,11],[11,0,12,1]]}
[null,"Biologie de la reproduction",null,null,"Annatut'"]
["Ronéos","Cours","Nbre de vues","Dernière vue","2012-2013","2013-2014","2014-2015","2015-2016","2016-2017","2017-2018","2018 -2019","QCM fin de cours"]
["F1","BioRepro   Cellules - Ks - Gènes",{"$f":"Cours!J59","v":0},{"$f":"MAX(IF(Cours!D59:I59<TODAY(),Cours!D59:I59))","v":"00:00:00"}]
["F2","BioRepro   Cycle cellulaire et Mitose",{"$f":"Cours!J60","v":0},{"$f":"MAX(IF(Cours!D60:I60<TODAY(),Cours!D60:I60))","v":"00:00:00"}]
["F3","BioRepro   Reproduction",{"$f":"Cours!J61","v":0},{"$f":"MAX(IF(Cours!D61:I61<TODAY(),Cours!D61:I61))","v":"00:00:00"}]
["F4","BioRepro   Méiose (introduction)",{"$f":"Cours!J62","v":0},{"$f":"MAX(IF(Cours!D62:I62<TODAY(),Cours!D62:I62))","v":"00:00:00"}]
["F5","BioRepro   2 divisions méiotiques",{"$f":"Cours!J63","v":0},{"$f":"MAX(IF(Cours!D63:I63<TODAY(),Cours!D63:I63))","v":"00:00:00"}]
["F6","BioRepro   Gamétogénèse",{"$f":"Cours!J64","v":0},{"$f":"MAX(IF(Cours!D64:I64<TODAY(),Cours!D64:I64))","v":"00:00:00"}]
["F7","BioRepro   Appareil génital",{"$f":"Cours!J65","v":0},{"$f":"MAX(IF(Cours!D65:I65<TODAY(),Cours!D65:I65))","v":"00:00:00"}]
[]
[]
["Annales",null,"2010 - 2011","2011 - 2012","2012-2013","2013-2014","2014-2015","2015-2016","2016-2017","2017-2018"]

{"sheet":"Histologie","index":9,"n_rows":21,"n_cols":11,"rows_kept":21,"cut":false,"hidden":false,"merged":[[0,4,0,10],[20,0,21,1]]}
[null,"Histologie",null,null,"Annatut'"]
["Ronéos","Cours","Nbre de vues","Dernière vue","2012-2013","2013-2014","2014-2015","2015-2016","2016-2017","2017-2018","2018 -2019"]
["R1","Histo          Tissu conjonctif",{"$f":"Cours!J66","v":0},{"$f":"MAX(IF(Cours!D66:I66<TODAY(),Cours!D66:I66))","v":"00:00:00"}]
["R2","Histo          Tissu adipeux",{"$f":"Cours!J67","v":0},{"$f":"MAX(IF(Cours!D67:I67<TODAY(),Cours!D67:I67))","v":"00:00:00"}]
["R2","Histo          Tissu cartilagineux",{"$f":"Cours!J68","v":0},{"$f":"MAX(IF(Cours!D68:I68<TODAY(),Cours!D68:I68))","v":"00:00:00"}]
["R2","Histo          Tissu osseux",{"$f":"Cours!J69","v":0},{"$f":"MAX(IF(Cours!D69:I69<TODAY(),Cours!D69:I69))","v":"00:00:00"}]
["R3","Histo          Tissu osseux",{"$f":"Cours!J70","v":0},{"$f":"MAX(IF(Cours!D70:I70<TODAY(),Cours!D70:I70))","v":"00:00:00"}]
["R3","Histo          Tissu musculaire SS",{"$f":"Cours!J71","v":0},{"$f":"MAX(IF(Cours!D71:I71<TODAY(),Cours!D71:I71))","v":"00:00:00"}]
["R7","Histo          Tissu musculaire cardiaque",{"$f":"Cours!J72","v":0},{"$f":"MAX(IF(Cours!D72:I72<TODAY(),Cours!D72:I72))","v":"00:00:00"}]
["R7","Histo          Tissu musculaire lisse",{"$f":"Cours!J73","v":0},{"$f":"MAX(IF(Cours!D73:I73<TODAY(),Cours!D73:I73))","v":"00:00:00"}]
["R7","Histo          Contraction musculaire",{"$f":"Cours!J74","v":0},{"$f":"MAX(IF(Cours!D74:I74<TODAY(),Cours!D74:I74))","v":"00:00:00"}]
["R8","Histo          Tissu nerveux",{"$f":"Cours!J75","v":0},{"$f":"MAX(IF(Cours!D75:I75<TODAY(),Cours!D75:I75))","v":"00:00:00"}]
["R11","Histo          Tissu nerveux",{"$f":"Cours!J76","v":0},{"$f":"MAX(IF(Cours!D76:I76<TODAY(),Cours!D76:I76))","v":"00:00:00"}]
["R4","Histo          Microscopie",{"$f":"Cours!J77","v":0},{"$f":"MAX(IF(Cours!D77:I77<TODAY(),Cours!D77:I77))","v":"00:00:00"}]
["R9","Histo          Tissu sanguin",{"$f":"Cours!J78","v":0},{"$f":"MAX(IF(Cours!D78:I78<TODAY(),Cours!D78:I78))","v":"00:00:00"}]
["R10","Histo          Réaction inflammatoire",{"$f":"Cours!J79","v":0},{"$f":"MAX(IF(Cours!D79:I79<TODAY(),Cours!D79:I79))","v":"00:00:00"}]
["R5","Histo          Epithélium",{"$f":"Cours!J80","v":0},{"$f":"MAX(IF(Cours!D80:I80<TODAY(),Cours!D80:I80))","v":"00:00:00"}]
["R6","Histo          Epithélium",{"$f":"Cours!J81","v":0},{"$f":"MAX(IF(Cours!D81:I81<TODAY(),Cours!D81:I81))","v":"00:00:00"}]
[]
[]
{"$rows_left_out":2}
{"sheet":"Biologie cellulaire","index":10,"n_rows":41,"n_cols":11,"rows_kept":41,"cut":false,"hidden":false,"merged":[[0,4,0,10],[18,0,19,1]]}
[null,"Biologie cellulaire",null,null,"Annatut'"]
["Ronéos","Cours","Nbre de vues","Dernière vue","2012-2013","2013-2014","2014-2015","2015-2016","2016-2017","2017-2018","2018 -2019"]
["R1","BioCell      Introduction",{"$f":"Cours!J82","v":0},{"$f":"MAX(IF(Cours!D82:I82<TODAY(),Cours!D82:I82))","v":"00:00:00"}]
["R2","BioCell     Microscopie",{"$f":"Cours!J83","v":0},{"$f":"MAX(IF(Cours!D83:I83<TODAY(),Cours!D83:I83))","v":"00:00:00"}]
["R3","BioCell     Voie NER",{"$f":"Cours!J84","v":0},{"$f":"MAX(IF(Cours!D84:I84<TODAY(),Cours!D84:I84))","v":"00:00:00"}]
["R3","BioCell     Manipulation c",{"$f":"Cours!J85","v":0},{"$f":"MAX(IF(Cours!D85:I85<TODAY(),Cours!D85:I85))","v":"00:00:00"}]
["R4","BioCell     Analyse du contenu c + Analyse génétique",{"$f":"Cours!J86","v":0},{"$f":"MAX(IF(Cours!D86:I86<TODAY(),Cours!D86:I86))","v":"00:00:00"}]
["R5","BioCell     Compartimentation mb",{"$f":"Cours!J87","v":0},{"$f":"MAX(IF(Cours!D87:I87<TODAY(),Cours!D87:I87))","v":"00:00:00"}]
["R6","BioCell     Sécrétion + Exocytose + Endocytose",{"$f":"Cours!J88","v":0},{"$f":"MAX(IF(Cours!D88:I88<TODAY(),Cours!D88:I88))","v":"00:00:00"}]
["R7","BioCell     Cytosquelette",{"$f":"Cours!J89","v":0},{"$f":"MAX(IF(Cours!D89:I89<TODAY(),Cours!D89:I89))","v":"00:00:00"}]
["R8","BioCell     Mitose",{"$f":"Cours!J90","v":0},{"$f":"MAX(IF(Cours!D90:I90<TODAY(),Cours!D90:I90))","v":"00:00:00"}]
["R9","BioCell     Noyau",{"$f":"Cours!J91","v":0},{"$f":"MAX(IF(Cours!D91:I91<TODAY(),Cours!D91:I91))","v":"00:00:00"}]
["R10","BioCell     Noyau",{"$f":"Cours!J92","v":0},{"$f":"MAX(IF(Cours!D92:I92<TODAY(),Cours!D92:I92))","v":"00:00:00"}]
["R11","BioCell     Epigénétique et signalisation cellulaire",{"$f":"Cours!J93","v":0},{"$f":"MAX(IF(Cours!D93:I93<TODAY(),Cours!D93:I93))","v":"00:00:00"}]
["R12","BioCell     Signalisation cellulaire",{"$f":"Cours!J94","v":0},{"$f":"MAX(IF(Cours!D94:I94<TODAY(),Cours!D94:I94))","v":"00:00:00"}]
["R13","BioCell     Cycle c",{"$f":"Cours!J95","v":0},{"$f":"MAX(IF(Cours!D95:I95<TODAY(),Cours!D95:I95))","v":"00:00:00"}]
["R14","BioCell     Sénecence mort c Cancer",{"$f":"Cours!J96","v":0},{"$f":"MAX(IF(Cours!D96:I96<TODAY(),Cours!D96:I96))","v":"00:00:00"}]
[]
["Annales",null,"2010 - 2011","2011 - 2012","2012-2013","2013-2014","2014-2015","2015-2016"]
[]
{"$rows_left_out":22}
{"sheet":"Physique","index":11,"n_rows":15,"n_cols":13,"rows_kept":15,"cut":false,"hidden":false,"merged":[[0,4,0,10],[14,0,15,1]]}
[null,"Physique",null,null,"Annatut'"]
["Ronéos","Cours","Nbre de vues","Dernière vue","2012-2013","2013-2014","2014-2015","2015-2016","2016-2017","2017-2018","2018 -2019","QCM prépa","QCM ronéo"]
["R1","Phys         Mécanique 1",{"$f":"Cours!J97","v":0},{"$f":"MAX(IF(Cours!D97:I97<TODAY(),Cours!D97:I97))","v":"00:00:00"}]
["R2","Phys        Mécanique 2",{"$f":"Cours!J98","v":0},{"$f":"MAX(IF(Cours!D98:I98<TODAY(),Cours!D98:I98))","v":"00:00:00"}]
["R3","Phys        Ondes et RMN",{"$f":"Cours!J99","v":0},{"$f":"MAX(IF(Cours!D99:I99<TODAY(),Cours!D99:I99))","v":"00:00:00"}]
["R4","Phys        Optique géométrique et ondulatoire 1",{"$f":"Cours!J100","v":0},{"$f":"MAX(IF(Cours!D100:I100<TODAY(),Cours!D100:I100))","v":"00:00:00"}]
["R5","Phys        Optique géométrique et ondulatoire 2",{"$f":"Cours!J101","v":0},{"$f":"MAX(IF(Cours!D101:I101<TODAY(),Cours!D101:I101))","v":"00:00:00"}]
["R6","Phys        Physique quantique",{"$f":"Cours!J102","v":0},{"$f":"MAX(IF(Cours!D102:I102<TODAY(),Cours!D102:I102))","v":"00:00:00"}]
["R7","Phys        Optique et Source de lumière",{"$f":"Cours!J103","v":0},{"$f":"MAX(IF(Cours!D103:I103<TODAY(),Cours!D103:I103))","v":"00:00:00"}]
["R8","Phys        Optique et Source de lumière",{"$f":"Cours!J104","v":0},{"$f":"MAX(IF(Cours!D104:I104<TODAY(),Cours!D104:I104))","v":"00:00:00"}]
["R9","Phys        Optique médical 1",{"$f":"Cours!J105","v":0},{"$f":"MAX(IF(Cours!D105:I105<TODAY(),Cours!D105:I105))","v":"00:00:00"}]
["R10","Phys        Optique médical 2",{"$f":"Cours!J106","v":0},{"$f":"MAX(IF(Cours!D106:I106<TODAY(),Cours!D106:I106))","v":"00:00:00"}]
[]
[]
["Annales",null,"2010 - 2011","2011 - 2012","2012-2013","2013-2014","2014-2015","2015-2016","2016-2017","2017-2018","SDR 2014","SDR 2015"]

{"sheet":"Biophysique","index":12,"n_rows":17,"n_cols":11,"rows_kept":17,"cut":false,"hidden":false,"merged":[[0,4,0,10],[16,0,17,1]]}
[null,"Biophysique",null,null,"Annatut'"]
["Ronéos","Cours","Nbre de vues","Dernière vue","2012-2013","2013-2014","2014-2015","2015-2016","2016-2017","2017-2018","2018 -2019"]
["R1","BioPhys   Particules, ondes et atomes",{"$f":"Cours!J107","v":0},{"$f":"MAX(IF(Cours!D107:I107<TODAY(),Cours!D107:I107))","v":"00:00:00"}]
["R2","BioPhys   Interraction des RI avec la matières",{"$f":"Cours!J108","v":0},{"$f":"MAX(IF(Cours!D108:I108<TODAY(),Cours!D108:I108))","v":"00:00:00"}]
["R3","BioPhys   Rayons X",{"$f":"Cours!J109","v":0},{"$f":"MAX(IF(Cours!D109:I109<TODAY(),Cours!D109:I109))","v":"00:00:00"}]
["R4","BioPhys   Rayons X",{"$f":"Cours!J110","v":0},{"$f":"MAX(IF(Cours!D110:I110<TODAY(),Cours!D110:I110))","v":"00:00:00"}]
["R5","BioPhys   Le noyau",{"$f":"Cours!J111","v":0},{"$f":"MAX(IF(Cours!D111:I111<TODAY(),Cours!D111:I111))","v":"00:00:00"}]
["R6","BioPhys   Transformations radioactives",{"$f":"Cours!J112","v":0},{"$f":"MAX(IF(Cours!D112:I112<TODAY(),Cours!D112:I112))","v":"00:00:00"}]
["R7","BioPhys   Transformation isobariques",{"$f":"Cours!J113","v":0},{"$f":"MAX(IF(Cours!D113:I113<TODAY(),Cours!D113:I113))","v":"00:00:00"}]
["R8","BioPhys   Transformations isomériques",{"$f":"Cours!J114","v":0},{"$f":"MAX(IF(Cours!D114:I114<TODAY(),Cours!D114:I114))","v":"00:00:00"}]
["R9","BioPhys   Lois cinétiques",{"$f":"Cours!J115","v":0},{"$f":"MAX(IF(Cours!D115:I115<TODAY(),Cours!D115:I115))","v":"00:00:00"}]
["R10","BioPhys   Eléments de radiobiologie et de radioprotection",{"$f":"Cours!J116","v":0},{"$f":"MAX(IF(Cours!D116:I116<TODAY(),Cours!D116:I116))","v":"00:00:00"}]
["R11","BioPhys   RMN",{"$f":"Cours!J117","v":0},{"$f":"MAX(IF(Cours!D117:I117<TODAY(),Cours!D117:I117))","v":"00:00:00"}]
["R12","BioPhys   IRM",{"$f":"Cours!J118","v":0},{"$f":"MAX(IF(Cours!D118:I118<TODAY(),Cours!D118:I118))","v":"00:00:00"}]
[]
[]
["Annales",null,"2010 - 2011","2011 - 2012","2012-2013","2013-2014","2014-2015","2015-2016","2016-2017","2017-2018"]

{"sheet":"Biostatistiques","index":13,"n_rows":18,"n_cols":12,"rows_kept":18,"cut":false,"hidden":false,"merged":[[0,4,0,10],[17,0,18,1]]}
[null,"Biostatistiques",null,null,"Annatut'"]
["Fiches","Cours","Nbre de vues","Dernière vue","2012-2013","2013-2014","2014-2015","2015-2016","2016-2017","2017-2018","2018 -2019","Total UE4"]
["F1","Introduction à la métrologie et biométrie",{"$f":"Cours!J119","v":0},{"$f":"MAX(IF(Cours!D119:I119<TODAY(),Cours!D119:I119))","v":"00:00:00"}]
[null,"Evenements et probabilités élémentaires",{"$f":"Cours!J120","v":0},{"$f":"MAX(IF(Cours!D120:I120<TODAY(),Cours!D120:I120))","v":"00:00:00"}]
[null,"Probabilités conditionnelles, Théorèmes",{"$f":"Cours!J121","v":0},{"$f":"MAX(IF(Cours!D121:I121<TODAY(),Cours!D121:I121))","v":"00:00:00"}]
[null,"Les lois de probabilités",{"$f":"Cours!J122","v":0},{"$f":"MAX(IF(Cours!D122:I122<TODAY(),Cours!D122:I122))","v":"00:00:00"}]
[null,"Analyse de la survie",{"$f":"Cours!J123","v":0},{"$f":"MAX(IF(Cours!D123:I123<TODAY(),Cours!D123:I123))","v":"00:00:00"}]
[null,"Raisonnement médical, Arbre de décision",{"$f":"Cours!J124","v":0},{"$f":"MAX(IF(Cours!D124:I124<TODAY(),Cours!D124:I124))","v":"00:00:00"}]
[null,"Application de l'informatique à décision médicale",{"$f":"Cours!J125","v":0},{"$f":"MAX(IF(Cours!D125:I125<TODAY(),Cours!D125:I125))","v":"00:00:00"}]
[null,"Statistiques interférentielles et épidémiologie",{"$f":"Cours!J126","v":0},{"$f":"MAX(IF(Cours!D126:I126<TODAY(),Cours!D126:I126))","v":"00:00:00"}]
[null,"Test de statistique descriptive",{"$f":"Cours!J127","v":0},{"$f":"MAX(IF(Cours!D127:I127<TODAY(),Cours!D127:I127))","v":"00:00:00"}]
[null,"Test de statistiques déductives",{"$f":"Cours!J128","v":0},{"$f":"MAX(IF(Cours!D128:I128<TODAY(),Cours!D128:I128))","v":"00:00:00"}]
[null,"Indicateurs en épidémiologie",{"$f":"Cours!J129","v":0},{"$f":"MAX(IF(Cours!D129:I129<TODAY(),Cours!D129:I129))","v":"00:00:00"}]
[null,"Valeur informationnelle d'un signe",{"$f":"Cours!J130","v":0},{"$f":"MAX(IF(Cours!D130:I130<TODAY(),Cours!D130:I130))","v":"00:00:00"}]
[null,"Les essais cliniques",{"$f":"Cours!J131","v":0},{"$f":"MAX(IF(Cours!D131:I131<TODAY(),Cours!D131:I131))","v":"00:00:00"}]
[]
[]
["Annales",null,"2010 - 2011","2011 - 2012","2012-2013","2013-2014","2014-2015","2015-2016","2016-2017","2017-2018"]