{"text_format":"1","workbook":"xlsx","n_sheets":8,"sheets":["Calendrier","Sources","JUIN","S23à26","NOVEMBRE","S45àS48","DECEMBRE","S49àS53"],"not_rendered":{"charts":0,"images":0,"macros":1,"external_links":0,"defined_names":8,"comments":0,"pivot_tables":0},"unopened":[],"bounds":{"document_bytes":16777216,"sheet_cells":100000,"rows_first":2000,"rows_last":500,"rows_between":2000,"halvings":0,"cell_chars":16384,"cell_head_chars":4096},"cells_cut":0,"cells_raw":0,"read":"whole","date_system":"1900"}

{"sheet":"Calendrier","index":0,"n_rows":34,"n_cols":69,"rows_kept":34,"cut":false,"hidden":false,"merged":[[30,1,30,4],[30,6,30,7],[31,1,31,4],[31,6,31,7],[32,1,32,4],[32,6,32,7],[33,1,33,4],[33,6,33,7],[9,62,9,63],[9,34,9,35],[9,36,9,37],[9,38,9,39],[9,40,9,41],[9,44,9,45],[9,46,9,47],[9,48,9,49],[9,50,9,51],[9,52,9,53],[9,54,9,55],[9,56,9,57],[9,58,9,59],[9,60,9,61],[9,42,9,43],[9,14,9,15],[9,16,9,17],[9,18,9,19],[9,20,9,21],[9,22,9,23],[9,24,9,25],[9,26,9,27],[9,28,9,29],[9,30,9,31],[6,62,6,63],[6,52,6,53],[6,54,6,55],[6,56,6,57],[6,58,6,59],[6,60,6,61],[6,42,6,43],[6,44,6,45],[6,46,6,47],[6,48,6,49],[6,50,6,51],[6,36,6,37],[6,38,6,39],[6,40,6,41],[6,22,6,23],[6,24,6,25],[6,4,6,5],[6,6,6,7],[6,8,6,9],[6,10,6,11],[6,12,6,13],[6,14,6,15],[6,16,6,17],[6,18,6,19],[6,20,6,21],[6,26,6,27],[6,28,6,29],[6,30,6,31],[8,42,8,43],[8,40,8,41],[7,50,7,51],[7,52,7,53],[7,62,7,63],[7,54,7,55],[7,56,7,57],[7,58,7,59],[7,60,7,61],[7,46,7,47],[7,48,7,49],[8,48,8,49],[8,46,8,47],[8,44,8,45],[8,62,8,63],[8,60,8,61],[8,58,8,59],[8,56,8,57],[8,54,8,55],[8,52,8,53],[8,50,8,51],[7,36,7,37],[7,38,7,39],[7,40,7,41],[7,42,7,43],[7,44,7,45],[7,4,7,5],[7,6,7,7],[7,8,7,9],[7,10,7,11],[7,12,7,13],[7,14,7,15],[7,16,7,17],[7,22,7,23],[7,24,7,25],[7,26,7,27],[7,28,7,29],[7,30,7,31],[7,32,7,33],[7,34,7,35],[7,20,7,21],[7,18,7,19],[8,38,8,39],[8,36,8,37],[8,34,8,35],[8,32,8,33],[8,30,8,31],[8,28,8,29],[8,26,8,27],[8,8,8,9],[8,6,8,7],[1,32,1,35],[2,32,2,35],[1,6,2,22],[9,2,9,3],[8,2,8,3],[7,2,7,3],[6,2,6,3],[8,4,8,5],[8,24,8,25],[8,22,8,23],[8,14,8,15],[8,12,8,13],[8,10,8,11],[8,16,8,17],[8,18,8,19],[8,20,8,21],[6,32,6,33],[6,34,6,35],[9,32,9,33],[9,4,9,5],[9,6,9,7],[9,8,9,9],[9,10,9,11],[9,12,9,13]]}
[]
[null,2019,null,null,null,null,{"$f":"IF(AND(B2<>\"\",B3<>\"\"),\"Planning \"&B3&\" de l'année \"&B2,\"\")","v":"Planning Janvier de l'année 2019"},null,null,null,null,null,null,null,null,null,null,null,null,null,null,null,null,null,null,null,null,null,null,null,null,null,"JOURS FERIES"]
[null,"Janvier",null,null,null,null,null,null,null,null,null,null,null,null,null,null,null,null,null,null,null,null,null,null,null,null,null,null,null,null,null,null,"VACANCES SCO"]
[]
[null,"Matin"]
[]
[null,null,{"$f":"IF(C8=\"lundi \",\"S \"&WEEKNUM(C8,2),\"\")","v":""},null,{"$f":"IF(E9=\"lundi \",\"S \"&WEEKNUM(E8,2),\"\")","v":""},null,{"$f":"IF(G9=\"lundi \",\"S \"&WEEKNUM(G8,2),\"\")","v":""},null,{"$f":"IF(I9=\"lundi \",\"S \"&WEEKNUM(I8,2),\"\")","v":""},null,{"$f":"IF(K9=\"lundi \",\"S \"&WEEKNUM(K8,2),\"\")","v":""},null,{"$f":"IF(M9=\"lundi \",\"S \"&WEEKNUM(M8,2),\"\")","v":""},null,{"$f":"IF(O9=\"lundi \",\"S \"&WEEKNUM(O8,2),\"\")","v":"S 2"},null,{"$f":"IF(Q9=\"lundi \",\"S \"&WEEKNUM(Q8,2),\"\")","v":""},null,{"$f":"IF(S9=\"lundi \",\"S \"&WEEKNUM(S8,2),\"\")","v":""},null,{"$f":"IF(U9=\"lundi \",\"S \"&WEEKNUM(U8,2),\"\")","v":""},null,{"$f":"IF(W9=\"lundi \",\"S \"&WEEKNUM(W8,2),\"\")","v":""},null,{"$f":"IF(Y9=\"lundi \",\"S \"&WEEKNUM(Y8,2),\"\")","v":""},null,{"$f":"IF(AA9=\"lundi \",\"S \"&WEEKNUM(AA8,2),\"\")","v":""},null,{"$f":"IF(AC9=\"lundi \",\"S \"&WEEKNUM(AC8,2),\"\")","v":"S 3"},null,{"$f":"IF(AE9=\"lundi \",\"S \"&WEEKNUM(AE8,2),\"\")","v":""},null,{"$f":"IF(AG9=\"lundi \",\"S \"&WEEKNUM(AG8,2),\"\")","v":""},null,{"$f":"IF(AI9=\"lundi \",\"S \"&WEEKNUM(AI8,2),\"\")","v":""},null,{"$f":"IF(AK9=\"lundi \",\"S \"&WEEKNUM(AK8,2),\"\")","v":""},null,{"$f":"IF(AM9=\"lundi \",\"S \"&WEEKNUM(AM8,2),\"\")","v":""},null,{"$f":"IF(AO9=\"lundi \",\"S \"&WEEKNUM(AO8,2),\"\")","v":""},null,{"$f":"IF(AQ9=\"lundi \",\"S \"&WEEKNUM(AQ8,2),\"\")","v":"S 4"},null,{"$f":"IF(AS9=\"lundi \",\"S \"&WEEKNUM(AS8,2),\"\")","v":""},null,{"$f":"IF(AU9=\"lundi \",\"S \"&WEEKNUM(AU8,2),\"\")","v":""},null,{"$f":"IF(AW9=\"lundi \",\"S \"&WEEKNUM(AW8,2),\"\")","v":""},null,{"$f":"IF(AY9=\"lundi \",\"S \"&WEEKNUM(AY8,2),\"\")","v":""},null,{"$f":"IF(BA9=\"lundi \",\"S \"&WEEKNUM(BA8,2),\"\")","v":""},null,{"$f":"IF(BC9=\"lundi \",\"S \"&WEEKNUM(BC8,2),\"\")","v":""},null,{"$f":"IF(BE9=\"lundi \",\"S \"&WEEKNUM(BE8,2),\"\")","v":"S 5"},null,{"$f":"IF(BG9=\"lundi \",\"S \"&WEEKNUM(BG8,2),\"\")","v":""},null,{"$f":"IF(BI9=\"lundi \",\"S \"&WEEKNUM(BI8,2),\"\")","v":""},null,{"$f":"IF(BK9=\"lundi \",\"S \"&WEEKNUM(BK8,2),\"\")","v":""}]
[null,null,{"$f":"DATE($B$2,VLOOKUP($B$3,Sources!$C$2:$D$14,2,FALSE),Calendrier!C10)","v":"2019-01-01"},null,{"$f":"DATE($B$2,VLOOKUP($B$3,Sources!$C$2:$D$14,2,FALSE),Calendrier!E10)","v":"2019-01-02"},null,{"$f":"DATE($B$2,VLOOKUP($B$3,Sources!$C$2:$D$14,2,FALSE),Calendrier!G10)","v":"2019-01-03"},null,{"$f":"DATE($B$2,VLOOKUP($B$3,Sources!$C$2:$D$14,2,FALSE),Calendrier!I10)","v":"2019-01-04"},null,{"$f":"DATE($B$2,VLOOKUP($B$3,Sources!$C$2:$D$14,2,FALSE),Calendrier!K10)","v":"2019-01-05"},null,{"$f":"DATE($B$2,VLOOKUP($B$3,Sources!$C$2:$D$14,2,FALSE),Calendrier!M10)","v":"2019-01-06"},null,{"$f":"DATE($B$2,VLOOKUP($B$3,Sources!$C$2:$D$14,2,FALSE),Calendrier!O10)","v":"2019-01-07"},null,{"$f":"DATE($B$2,VLOOKUP($B$3,Sources!$C$2:$D$14,2,FALSE),Calendrier!Q10)","v":"2019-01-08"},null,{"$f":"DATE($B$2,VLOOKUP($B$3,Sources!$C$2:$D$14,2,FALSE),Calendrier!S10)","v":"2019-01-09"},null,{"$f":"DATE($B$2,VLOOKUP($B$3,Sources!$C$2:$D$14,2,FALSE),Calendrier!U10)","v":"2019-01-10"},null,{"$f":"DATE($B$2,VLOOKUP($B$3,Sources!$C$2:$D$14,2,FALSE),Calendrier!W10)","v":"2019-01-11"},null,{"$f":"DATE($B$2,VLOOKUP($B$3,Sources!$C$2:$D$14,2,FALSE),Calendrier!Y10)","v":"2019-01-12"},null,{"$f":"DATE($B$2,VLOOKUP($B$3,Sources!$C$2:$D$14,2,FALSE),Calendrier!AA10)","v":"2019-01-13"},null,{"$f":"DATE($B$2,VLOOKUP($B$3,Sources!$C$2:$D$14,2,FALSE),Calendrier!AC10)","v":"2019-01-14"},null,{"$f":"DATE($B$2,VLOOKUP($B$3,Sources!$C$2:$D$14,2,FALSE),Calendrier!AE10)","v":"2019-01-15"},null,{"$f":"DATE($B$2,VLOOKUP($B$3,Sources!$C$2:$D$14,2,FALSE),Calendrier!AG10)","v":"2019-01-16"},null,{"$f":"DATE($B$2,VLOOKUP($B$3,Sources!$C$2:$D$14,2,FALSE),Calendrier!AI10)","v":"2019-01-17"},null,{"$f":"DATE($B$2,VLOOKUP($B$3,Sources!$C$2:$D$14,2,FALSE),Calendrier!AK10)","v":"2019-01-18"},null,{"$f":"DATE($B$2,VLOOKUP($B$3,Sources!$C$2:$D$14,2,FALSE),Calendrier!AM10)","v":"2019-01-19"},null,{"$f":"DATE($B$2,VLOOKUP($B$3,Sources!$C$2:$D$14,2,FALSE),Calendrier!AO10)","v":"2019-01-20"},null,{"$f":"DATE($B$2,VLOOKUP($B$3,Sources!$C$2:$D$14,2,FALSE),Calendrier!AQ10)","v":"2019-01-21"},null,{"$f":"DATE($B$2,VLOOKUP($B$3,Sources!$C$2:$D$14,2,FALSE),Calendrier!AS10)","v":"2019-01-22"},null,{"$f":"DATE($B$2,VLOOKUP($B$3,Sources!$C$2:$D$14,2,FALSE),Calendrier!AU10)","v":"2019-01-23"},null,{"$f":"DATE($B$2,VLOOKUP($B$3,Sources!$C$2:$D$14,2,FALSE),Calendrier!AW10)","v":"2019-01-24"},null,{"$f":"DATE($B$2,VLOOKUP($B$3,Sources!$C$2:$D$14,2,FALSE),Calendrier!AY10)","v":"2019-01-25"},null,{"$f":"DATE($B$2,VLOOKUP($B$3,Sources!$C$2:$D$14,2,FALSE),Calendrier!BA10)","v":"2019-01-26"},null,{"$f":"DATE($B$2,VLOOKUP($B$3,Sources!$C$2:$D$14,2,FALSE),Calendrier!BC10)","v":"2019-01-27"},null,{"$f":"DATE($B$2,VLOOKUP($B$3,Sources!$C$2:$D$14,2,FALSE),Calendrier!BE10)","v":"2019-01-28"},null,{"$f":"DATE($B$2,VLOOKUP($B$3,Sources!$C$2:$D$14,2,FALSE),Calendrier!BG10)","v":"2019-01-29"},null,{"$f":"DATE($B$2,VLOOKUP($B$3,Sources!$C$2:$D$14,2,FALSE),Calendrier!BI10)","v":"2019-01-30"},null,{"$f":"DATE($B$2,VLOOKUP($B$3,Sources!$C$2:$D$14,2,FALSE),Calendrier!BK10)","v":"2019-01-31"}]
[null,null,{"$f":"IF(AND($B$2<>\"\",$B$3<>\"\"),TEXT(C8,\"jjjj\")&\" \",\"\")","v":"mardi "},null,{"$f":"IF(AND($B$2<>\"\",$B$3<>\"\"),IF(MONTH(E8)=MONTH($C$8),TEXT(E8,\"jjjj\")&\" \",\"\"),\"\")","v":"mercredi "},null,{"$f":"IF(AND($B$2<>\"\",$B$3<>\"\"),IF(MONTH(G8)=MONTH($C$8),TEXT(G8,\"jjjj\")&\" \",\"\"),\"\")","v":"jeudi "},null,{"$f":"IF(AND($B$2<>\"\",$B$3<>\"\"),IF(MONTH(I8)=MONTH($C$8),TEXT(I8,\"jjjj\")&\" \",\"\"),\"\")","v":"vendredi "},null,{"$f":"IF(AND($B$2<>\"\",$B$3<>\"\"),IF(MONTH(K8)=MONTH($C$8),TEXT(K8,\"jjjj\")&\" \",\"\"),\"\")","v":"samedi "},null,{"$f":"IF(AND($B$2<>\"\",$B$3<>\"\"),IF(MONTH(M8)=MONTH($C$8),TEXT(M8,\"jjjj\")&\" \",\"\"),\"\")","v":"dimanche "},null,{"$f":"IF(AND($B$2<>\"\",$B$3<>\"\"),IF(MONTH(O8)=MONTH($C$8),TEXT(O8,\"jjjj\")&\" \",\"\"),\"\")","v":"lundi "},null,{"$f":"IF(AND($B$2<>\"\",$B$3<>\"\"),IF(MONTH(Q8)=MONTH($C$8),TEXT(Q8,\"jjjj\")&\" \",\"\"),\"\")","v":"mardi "},null,{"$f":"IF(AND($B$2<>\"\",$B$3<>\"\"),IF(MONTH(S8)=MONTH($C$8),TEXT(S8,\"jjjj\")&\" \",\"\"),\"\")","v":"mercredi "},null,{"$f":"IF(AND($B$2<>\"\",$B$3<>\"\"),IF(MONTH(U8)=MONTH($C$8),TEXT(U8,\"jjjj\")&\" \",\"\"),\"\")","v":"jeudi "},null,{"$f":"IF(AND($B$2<>\"\",$B$3<>\"\"),IF(MONTH(W8)=MONTH($C$8),TEXT(W8,\"jjjj\")&\" \",\"\"),\"\")","v":"vendredi "},null,{"$f":"IF(AND($B$2<>\"\",$B$3<>\"\"),IF(MONTH(Y8)=MONTH($C$8),TEXT(Y8,\"jjjj\")&\" \",\"\"),\"\")","v":"samedi "},null,{"$f":"IF(AND($B$2<>\"\",$B$3<>\"\"),IF(MONTH(AA8)=MONTH($C$8),TEXT(AA8,\"jjjj\")&\" \",\"\"),\"\")","v":"dimanche "},null,{"$f":"IF(AND($B$2<>\"\",$B$3<>\"\"),IF(MONTH(AC8)=MONTH($C$8),TEXT(AC8,\"jjjj\")&\" \",\"\"),\"\")","v":"lundi "},null,{"$f":"IF(AND($B$2<>\"\",$B$3<>\"\"),IF(MONTH(AE8)=MONTH($C$8),TEXT(AE8,\"jjjj\")&\" \",\"\"),\"\")","v":"mardi "},null,{"$f":"IF(AND($B$2<>\"\",$B$3<>\"\"),IF(MONTH(AG8)=MONTH($C$8),TEXT(AG8,\"jjjj\")&\" \",\"\"),\"\")","v":"mercredi "},null,{"$f":"IF(AND($B$2<>\"\",$B$3<>\"\"),IF(MONTH(AI8)=MONTH($C$8),TEXT(AI8,\"jjjj\")&\" \",\"\"),\"\")","v":"jeudi "},null,{"$f":"IF(AND($B$2<>\"\",$B$3<>\"\"),IF(MONTH(AK8)=MONTH($C$8),TEXT(AK8,\"jjjj\")&\" \",\"\"),\"\")","v":"vendredi "},null,{"$f":"IF(AND($B$2<>\"\",$B$3<>\"\"),IF(MONTH(AM8)=MONTH($C$8),TEXT(AM8,\"jjjj\")&\" \",\"\"),\"\")","v":"samedi "},null,{"$f":"IF(AND($B$2<>\"\",$B$3<>\"\"),IF(MONTH(AO8)=MONTH($C$8),TEXT(AO8,\"jjjj\")&\" \",\"\"),\"\")","v":"dimanche "},null,{"$f":"IF(AND($B$2<>\"\",$B$3<>\"\"),IF(MONTH(AQ8)=MONTH($C$8),TEXT(AQ8,\"jjjj\")&\" \",\"\"),\"\")","v":"lundi "},null,{"$f":"IF(AND($B$2<>\"\",$B$3<>\"\"),IF(MONTH(AS8)=MONTH($C$8),TEXT(AS8,\"jjjj\")&\" \",\"\"),\"\")","v":"mardi "},null,{"$f":"IF(AND($B$2<>\"\",$B$3<>\"\"),IF(MONTH(AU8)=MONTH($C$8),TEXT(AU8,\"jjjj\")&\" \",\"\"),\"\")","v":"mercredi "},null,{"$f":"IF(AND($B$2<>\"\",$B$3<>\"\"),IF(MONTH(AW8)=MONTH($C$8),TEXT(AW8,\"jjjj\")&\" \",\"\"),\"\")","v":"jeudi "},null,{"$f":"IF(AND($B$2<>\"\",$B$3<>\"\"),IF(MONTH(AY8)=MONTH($C$8),TEXT(AY8,\"jjjj\")&\" \",\"\"),\"\")","v":"vendredi "},null,{"$f":"IF(AND($B$2<>\"\",$B$3<>\"\"),IF(MONTH(BA8)=MONTH($C$8),TEXT(BA8,\"jjjj\")&\" \",\"\"),\"\")","v":"samedi "},null,{"$f":"IF(AND($B$2<>\"\",$B$3<>\"\"),IF(MONTH(BC8)=MONTH($C$8),TEXT(BC8,\"jjjj\")&\" \",\"\"),\"\")","v":"dimanche "},null,{"$f":"IF(AND($B$2<>\"\",$B$3<>\"\"),IF(MONTH(BE8)=MONTH($C$8),TEXT(BE8,\"jjjj\")&\" \",\"\"),\"\")","v":"lundi "},null,{"$f":"IF(AND($B$2<>\"\",$B$3<>\"\"),IF(MONTH(BG8)=MONTH($C$8),TEXT(BG8,\"jjjj\")&\" \",\"\"),\"\")","v":"mardi "},null,{"$f":"IF(AND($B$2<>\"\",$B$3<>\"\"),IF(MONTH(BI8)=MONTH($C$8),TEXT(BI8,\"jjjj\")&\" \",\"\"),\"\")","v":"mercredi "},null,{"$f":"IF(AND($B$2<>\"\",$B$3<>\"\"),IF(MONTH(BK8)=MONTH($C$8),TEXT(BK8,\"jjjj\")&\" \",\"\"),\"\")","v":"jeudi "}]
[null,null,1,null,2,null,3,null,4,null,5,null,6,null,7,null,8,null,9,null,10,null,11,null,12,null,13,null,14,null,15,null,16,null,17,null,18,null,19,null,20,null,21,null,22,null,23,null,24,null,25,null,26,null,27,null,28,null,29,null,30,null,31,null,null,"total heures","Total congés"]
[null,{"$f":"IF($C$9<>\"\",Sources!H3,\"\")","v":"Jo"},null,null,null,null,null,null,null,null,null,null,null,null,null,null,null,null,null,null,null,null,null,null,null,null,null,null,null,null,null,null,null,null,null,null,null,null,null,null,null,null,null,null,null,null,null,null,null,null,null,null,null,null,null,null,null,null,null,null,null,null,null,null,null,{"$f":"SUMPRODUCT((COUNTIF(C11:BL11,typ))*(temps))","v":0},{"$f":"SUMPRODUCT((COUNTIF(C11:BL11,Sources!$B$35))*(Sources!$D$35))","v":0},null,"="]
[null,{"$f":"IF($C$9<>\"\",Sources!H4,\"\")","v":"Cha"},null,null,null,null,null,null,null,null,null,null,null,null,null,null,null,null,null,null,null,null,null,null,null,null,null,null,null,null,null,null,null,null,null,null,null,null,null,null,null,null,null,null,null,null,null,null,null,null,null,null,null,null,null,null,null,null,null,null,null,null,null,null,null,{"$f":"SUMPRODUCT((COUNTIF(C12:BL12,typ))*(temps))","v":0},{"$f":"SUMPRODUCT((COUNTIF(C12:BL12,Sources!$B$35))*(Sources!$D$35))","v":0}]
[null,{"$f":"IF($C$9<>\"\",Sources!H5,\"\")","v":"Jess"},null,null,null,null,null,null,null,null,null,null,null,null,null,null,null,null,null,null,null,null,null,null,null,null,null,null,null,null,null,null,null,null,null,null,null,null,null,null,null,null,null,null,null,null,null,null,null,null,null,null,null,null,null,null,null,null,null,null,null,null,null,null,null,0,{"$f":"SUMPRODUCT((COUNTIF(C13:BL13,Sources!$B$35))*(Sources!$D$35))","v":0}]
[null,{"$f":"IF($C$9<>\"\",Sources!H6,\" \")","v":"Alex"},null,null,null,null,null,null,null,null,null,null,null,null,null,null,null,null,null,null,null,null,null,null,null,null,null,null,null,null,null,null,null,null,null,null,null,null,null,null,null,null,null,null,null,null,null,null,null,null,null,null,null,null,null,null,null,null,null,null,null,null,null,null,null,0,{"$f":"SUMPRODUCT((COUNTIF(C14:BL14,Sources!$B$35))*(Sources!$D$35))","v":0}]
[null,{"$f":"IF($C$9<>\"\",Sources!H7,\"\")","v":"Op"},null,null,null,null,null,null,null,null,null,null,null,null,null,null,null,null,null,null,null,null,null,null,null,null,null,null,null,null,null,null,null,null,null,null,null,null,null,null,null,null,null,null,null,null,null,null,null,null,null,null,null,null,null,null,null,null,null,null,null,null,null,null,null,0,{"$f":"SUMPRODUCT((COUNTIF(C15:BL15,Sources!$B$35))*(Sources!$D$35))","v":0}]
[null,{"$f":"IF($C$9<>\"\",Sources!H8,\"\")","v":"De"},null,null,null,null,null,null,null,null,null,null,null,null,null,null,null,null,null,null,null,null,null,null,null,null,null,null,null,null,null,null,null,null,null,null,null,null,null,null,null,null,null,null,null,null,null,null,null,null,null,null,null,null,null,null,null,null,null,null,null,null,null,null,null,0,{"$f":"SUMPRODUCT((COUNTIF(C16:BL16,Sources!$B$35))*(Sources!$D$35))","v":0}]
[null,{"$f":"IF($C$9<>\"\",Sources!H9,\"\")","v":" "},null,null,null,null,null,null,null,null,null,null,null,null,null,null,null,null,null,null,null,null,null,null,null,null,null,null,null,null,null,null,null,null,null,null,null,null,null,null,null,null,null,null,null,null,null,null,null,null,null,null,null,null,null,null,null,null,null,null,null,null,null,null,null,0,{"$f":"SUMPRODUCT((COUNTIF(C17:BL17,Sources!$B$35))*(Sources!$D$35))","v":0}]
[null,{"$f":"IF($C$9<>\"\",Sources!H10,\"\")","v":"Sy"},null,null,null,null,null,null,null,null,null,null,null,null,null,null,null,null,null,null,null,null,null,null,null,null,null,null,null,null,null,null,null,null,null,null,null,null,null,null,null,null,null,null,null,null,null,null,null,null,null,null,null,null,null,null,null,null,null,null,null,null,null,null,null,0,{"$f":"SUMPRODUCT((COUNTIF(C18:BL18,Sources!$B$35))*(Sources!$D$35))","v":0}]
[null,{"$f":"IF($C$9<>\"\",Sources!H11,\"\")","v":" "},null,null,null,null,null,null,null,null,null,null,null,null,null,null,null,null,null,null,null,null,null,null,null,null,null,null,null,null,null,null,null,null,null,null,null,null,null,null,null,null,null,null,null,null,null,null,null,null,null,null,null,null,null,null,null,null,null,null,null,null,null,null,null,0,{"$f":"SUMPRODUCT((COUNTIF(C19:BL19,Sources!$B$35))*(Sources!$D$35))","v":0}]
[null,{"$f":"IF($C$9<>\"\",Sources!H12,\"\")","v":"H"},null,null,null,null,null,null,null,null,null,null,null,null,null,null,null,null,null,null,null,null,null,null,null,null,null,null,null,null,null,null,null,null,null,null,null,null,null,null,null,null,null,null,null,null,null,null,null,null,null,null,null,null,null,null,null,null,null,null,null,null,null,null,null,0,{"$f":"SUMPRODUCT((COUNTIF(C20:BL20,Sources!$B$35))*(Sources!$D$35))","v":0}]
[null,{"$f":"IF($C$9<>\"\",Sources!H13,\"\")","v":"T"},null,null,null,null,null,null,null,null,null,null,null,null,null,null,null,null,null,null,null,null,null,null,null,null,null,null,null,null,null,null,null,null,null,null,null,null,null,null,null,null,null,null,null,null,null,null,null,null,null,null,null,null,null,null,null,null,null,null,null,null,null,null,null,0,{"$f":"SUMPRODUCT((COUNTIF(C21:BL21,Sources!$B$35))*(Sources!$D$35))","v":0}]
[null,{"$f":"IF($C$9<>\"\",Sources!H14,\"\")","v":"S"},null,null,null,null,null,null,null,null,null,null,null,null,null,null,null,null,null,null,null,null,null,null,null,null,null,null,null,null,null,null,null,null,null,null,null,null,null,null,null,null,null,null,null,null,null,null,null,null,null,null,null,null,null,null,null,null,null,null,null,null,null,null,null,0,{"$f":"SUMPRODUCT((COUNTIF(C22:BL22,Sources!$B$35))*(Sources!$D$35))","v":0}]
[]
[]
[]
[]
[]
[]
[]
[]
[null,"SAINT MARS DU DESERT",null,null,null,null,"M = 10h-13h30"]
[null,"VARADES",null,null,null,null,"S = 18h-21h30"]
[null,"SAINT ETIENNE DE MTLUC",null,null,null,null,"SWE = 18h-22h"]
[null,"CONGES",null,null,null,null,"SD = 17h30- 22h"]

{"sheet":"Sources","index":1,"n_rows":49,"n_cols":14,"rows_kept":49,"cut":false,"hidden":false,"merged":[[55,19,55,20],[56,7,56,8],[56,9,56,10],[56,11,56,12],[56,13,56,14],[56,15,56,16],[56,17,56,18],[56,19,56,20],[55,7,55,8],[55,9,55,10],[55,11,55,12],[55,13,55,14],[55,15,55,16],[55,17,55,18]]}
[]
[null,null,"Mois","Num",null,"Années",null,"Salariés",null,"Horaires",null,"Tranches"]
[null,null,"Janvier",1,null,2018,null,"Jo",null,"06:30:00",null,"Matin"]
[null,null,"Février",2,null,2019,null,"Cha",null,"07:30:00",null,"Journée"]
[null,null,"Mars",3,null,2020,null,"Jess",null,"08:30:00",null,"Soir"]
[null,null,"Avril",4,null,2021,null,"Alex",null,"09:30:00"]
[null,null,"Mai",5,null,2022,null,"Op",null,"10:30:00"]
[null,null,"Juin",6,null,2023,null,"De",null,"11:30:00"]
[null,null,"Juillet",7,null,2024,null," ",null,"12:30:00"]
[null,null,"Août",8,null,2025,null,"Sy",null,"13:30:00"]
[null,null,"Septembre",9,null,2026,null," ",null,"14:30:00"]
[null,null,"Octobre",10,null,2027,null,"H",null,"15:30:00",null,null,"Jours fériés 2019 (jf)"]
[null,null,"Novembre",11,null,2028,null,"T",null,"16:30:00",null,null,"2019-01-01"]
[null,null,"Décembre",12,null,2029,null,"S",null,"17:30:00",null,null,"2019-04-22"]
[null,null,null,null,null,null,null,null,null,"18:30:00",null,null,"2019-05-01"]
[null,null,null,null,null,null,null,null,null,"19:30:00",null,null,"2019-05-08"]
[null,null,null,null,null,null,null,null,null,"20:30:00",null,null,"2019-05-30"]
[null,"typ","temps",null,null,null,null,null,null,"21:30:00",null,null,"2019-06-10"]
[null,"M SMDD",3.5,null,null,null,null,null,null,"22:30:00",null,null,"2019-07-14"]
[null,"S SMDD",3.5,null,null,null,null,null,null,null,null,null,"2019-08-15"]
[null,"SD SMDD",4.5,null,null,null,null,null,null,null,null,null,"2019-11-11"]
[null,"SWE SMDD",4,null,null,null,null,null,null,null,null,null,"2019-11-01"]
[]
[null,"M       SEM",3.5,null,null,null,null,null,null,null,null,null,"2019-12-25"]
[null,"S        SEM",3.5,null,null,null,null,null,null,null,null,null,"Vacances sco zone B"]
[null,"SD          SEM",4.5,null,null,null,null,null,null,null,null,null,"debut","fin"]
[null,"SWE          SEM",4,null,null,null,null,null,null,null,null,null,"2018-10-20","2018-11-04"]
[]
[null,"M        VAR",3.5,null,null,null,null,null,null,null,null,null,"2018-12-22","2019-01-07"]
[null,"S        VAR",3.5,null,null,null,null,null,null,null,null,null,"2019-02-09","2019-02-25"]
[null,"SD       VAR",4.5,null,null,null,null,null,null,null,null,null,"2019-04-06","2019-04-23"]
[null,"SWE         VAR",4,null,null,null,null,null,null,null,null,null,"2019-05-29","2019-06-03"]
[]
[null,"GEST"]
[null,"CP",0,0.5]
[]
[null,"M          SMLJ",3.5]
[null,"SWE SMLJ",4]
[null,"SD SMLJ",4.5]
[null,"S         SMLJ",3.5]
[null,null,0]
[null,"GEST"]
[null,"M",0]
[null,"S",0]
[null,"SWE",0]
[null,"M",0]
[null,"S",0]
[null,"SWE",0]
[null,"M",0]

{"sheet":"JUIN","index":2,"n_rows":32,"n_cols":69,"rows_kept":32,"cut":false,"hidden":false,"merged":[[28,1,28,4],[28,6,28,7],[29,1,29,4],[29,6,29,7],[30,1,30,4],[30,6,30,7],[31,1,31,4],[31,6,31,7],[1,6,2,22],[7,2,7,3],[7,4,7,5],[7,6,7,7],[7,8,7,9],[7,10,7,11],[7,12,7,13],[1,32,1,35],[2,32,2,35],[6,2,6,3],[6,4,6,5],[6,6,6,7],[6,8,6,9],[6,10,6,11],[6,12,6,13],[6,14,6,15],[6,28,6,29],[6,30,6,31],[6,32,6,33],[6,34,6,35],[6,58,6,59],[6,60,6,61],[6,62,6,63],[6,40,6,41],[6,42,6,43],[6,44,6,45],[6,46,6,47],[6,48,6,49],[6,50,6,51],[6,52,6,53],[6,54,6,55],[6,56,6,57],[6,36,6,37],[6,38,6,39],[6,16,6,17],[6,18,6,19],[6,20,6,21],[6,22,6,23],[6,24,6,25],[6,26,6,27],[7,46,7,47],[7,48,7,49],[7,26,7,27],[7,28,7,29],[7,30,7,31],[7,32,7,33],[7,34,7,35],[7,36,7,37],[7,14,7,15],[7,16,7,17],[7,18,7,19],[7,20,7,21],[7,22,7,23],[7,24,7,25],[8,24,8,25],[8,26,8,27],[8,28,8,29],[8,30,8,31],[7,62,7,63],[8,2,8,3],[8,4,8,5],[8,6,8,7],[8,8,8,9],[8,10,8,11],[8,12,8,13],[8,14,8,15],[8,16,8,17],[8,18,8,19],[7,50,7,51],[7,52,7,53],[7,54,7,55],[7,56,7,57],[7,58,7,59],[7,60,7,61],[7,38,7,39],[7,40,7,41],[7,42,7,43],[7,44,7,45],[8,56,8,57],[8,58,8,59],[8,60,8,61],[8,62,8,63],[9,2,9,3],[9,4,9,5],[9,6,9,7],[9,8,9,9],[9,10,9,11],[9,12,9,13],[8,44,8,45],[8,46,8,47],[8,48,8,49],[8,50,8,51],[8,52,8,53],[8,54,8,55],[8,32,8,33],[8,34,8,35],[8,36,8,37],[8,38,8,39],[8,40,8,41],[8,42,8,43],[8,20,8,21],[8,22,8,23],[9,26,9,27],[9,28,9,29],[9,30,9,31],[9,32,9,33],[9,34,9,35],[9,36,9,37],[9,14,9,15],[9,16,9,17],[9,18,9,19],[9,20,9,21],[9,22,9,23],[9,24,9,25],[9,62,9,63],[9,50,9,51],[9,52,9,53],[9,54,9,55],[9,56,9,57],[9,58,9,59],[9,60,9,61],[9,38,9,39],[9,40,9,41],[9,42,9,43],[9,44,9,45],[9,46,9,47],[9,48,9,49]]}
[]
[null,2018,null,null,null,null,{"$f":"IF(AND(B2<>\"\",B3<>\"\"),\"Planning Kap \"&B3&\" de l'année \"&B2,\"\")","v":"Planning Kap Juin de l'année 2018"},null,null,null,null,null,null,null,null,null,null,null,null,null,null,null,null,null,null,null,null,null,null,null,null,null,"JOURS FERIES"]
[null,"Juin",null,null,null,null,null,null,null,null,null,null,null,null,null,null,null,null,null,null,null,null,null,null,null,null,null,null,null,null,null,null,"VACANCES SCO"]
[]
[null,"Matin"]
[]
[null,null,{"$f":"IF(C8=\"lundi \",\"S \"&WEEKNUM(C8,2),\"\")","v":""},null,{"$f":"IF(E9=\"lundi \",\"S \"&WEEKNUM(E8,2),\"\")","v":""},null,{"$f":"IF(G9=\"lundi \",\"S \"&WEEKNUM(G8,2),\"\")","v":""},null,{"$f":"IF(I9=\"lundi \",\"S \"&WEEKNUM(I8,2),\"\")","v":"S 23"},null,{"$f":"IF(K9=\"lundi \",\"S \"&WEEKNUM(K8,2),\"\")","v":""},null,{"$f":"IF(M9=\"lundi \",\"S \"&WEEKNUM(M8,2),\"\")","v":""},null,{"$f":"IF(O9=\"lundi \",\"S \"&WEEKNUM(O8,2),\"\")","v":""},null,{"$f":"IF(Q9=\"lundi \",\"S \"&WEEKNUM(Q8,2),\"\")","v":""},null,{"$f":"IF(S9=\"lundi \",\"S \"&WEEKNUM(S8,2),\"\")","v":""},null,{"$f":"IF(U9=\"lundi \",\"S \"&WEEKNUM(U8,2),\"\")","v":""},null,{"$f":"IF(W9=\"lundi \",\"S \"&WEEKNUM(W8,2),\"\")","v":"S 24"},null,{"$f":"IF(Y9=\"lundi \",\"S \"&WEEKNUM(Y8,2),\"\")","v":""},null,{"$f":"IF(AA9=\"lundi \",\"S \"&WEEKNUM(AA8,2),\"\")","v":""},null,{"$f":"IF(AC9=\"lundi \",\"S \"&WEEKNUM(AC8,2),\"\")","v":""},null,{"$f":"IF(AE9=\"lundi \",\"S \"&WEEKNUM(AE8,2),\"\")","v":""},null,{"$f":"IF(AG9=\"lundi \",\"S \"&WEEKNUM(AG8,2),\"\")","v":""},null,{"$f":"IF(AI9=\"lundi \",\"S \"&WEEKNUM(AI8,2),\"\")","v":""},null,{"$f":"IF(AK9=\"lundi \",\"S \"&WEEKNUM(AK8,2),\"\")","v":"S 25"},null,{"$f":"IF(AM9=\"lundi \",\"S \"&WEEKNUM(AM8,2),\"\")","v":""},null,{"$f":"IF(AO9=\"lundi \",\"S \"&WEEKNUM(AO8,2),\"\")","v":""},null,{"$f":"IF(AQ9=\"lundi \",\"S \"&WEEKNUM(AQ8,2),\"\")","v":""},null,{"$f":"IF(AS9=\"lundi \",\"S \"&WEEKNUM(AS8,2),\"\")","v":""},null,{"$f":"IF(AU9=\"lundi \",\"S \"&WEEKNUM(AU8,2),\"\")","v":""},null,{"$f":"IF(AW9=\"lundi \",\"S \"&WEEKNUM(AW8,2),\"\")","v":""},null,{"$f":"IF(AY9=\"lundi \",\"S \"&WEEKNUM(AY8,2),\"\")","v":"S 26"},null,{"$f":"IF(BA9=\"lundi \",\"S \"&WEEKNUM(BA8,2),\"\")","v":""},null,{"$f":"IF(BC9=\"lundi \",\"S \"&WEEKNUM(BC8,2),\"\")","v":""},null,{"$f":"IF(BE9=\"lundi \",\"S \"&WEEKNUM(BE8,2),\"\")","v":""},null,{"$f":"IF(BG9=\"lundi \",\"S \"&WEEKNUM(BG8,2),\"\")","v":""},null,{"$f":"IF(BI9=\"lundi \",\"S \"&WEEKNUM(BI8,2),\"\")","v":""},null,{"$f":"IF(BK9=\"lundi \",\"S \"&WEEKNUM(BK8,2),\"\")","v":""}]
[null,null,{"$f":"DATE($B$2,VLOOKUP($B$3,Sources!$C$2:$D$14,2,FALSE),Calendrier!C10)","v":"2018-06-01"},null,{"$f":"DATE($B$2,VLOOKUP($B$3,Sources!$C$2:$D$14,2,FALSE),Calendrier!E10)","v":"2018-06-02"},null,{"$f":"DATE($B$2,VLOOKUP($B$3,Sources!$C$2:$D$14,2,FALSE),Calendrier!G10)","v":"2018-06-03"},null,{"$f":"DATE($B$2,VLOOKUP($B$3,Sources!$C$2:$D$14,2,FALSE),Calendrier!I10)","v":"2018-06-04"},null,{"$f":"DATE($B$2,VLOOKUP($B$3,Sources!$C$2:$D$14,2,FALSE),Calendrier!K10)","v":"2018-06-05"},null,{"$f":"DATE($B$2,VLOOKUP($B$3,Sources!$C$2:$D$14,2,FALSE),Calendrier!M10)","v":"2018-06-06"},null,{"$f":"DATE($B$2,VLOOKUP($B$3,Sources!$C$2:$D$14,2,FALSE),Calendrier!O10)","v":"2018-06-07"},null,{"$f":"DATE($B$2,VLOOKUP($B$3,Sources!$C$2:$D$14,2,FALSE),Calendrier!Q10)","v":"2018-06-08"},null,{"$f":"DATE($B$2,VLOOKUP($B$3,Sources!$C$2:$D$14,2,FALSE),Calendrier!S10)","v":"2018-06-09"},null,{"$f":"DATE($B$2,VLOOKUP($B$3,Sources!$C$2:$D$14,2,FALSE),Calendrier!U10)","v":"2018-06-10"},null,{"$f":"DATE($B$2,VLOOKUP($B$3,Sources!$C$2:$D$14,2,FALSE),Calendrier!W10)","v":"2018-06-11"},null,{"$f":"DATE($B$2,VLOOKUP($B$3,Sources!$C$2:$D$14,2,FALSE),Calendrier!Y10)","v":"2018-06-12"},null,{"$f":"DATE($B$2,VLOOKUP($B$3,Sources!$C$2:$D$14,2,FALSE),Calendrier!AA10)","v":"2018-06-13"},null,{"$f":"DATE($B$2,VLOOKUP($B$3,Sources!$C$2:$D$14,2,FALSE),Calendrier!AC10)","v":"2018-06-14"},null,{"$f":"DATE($B$2,VLOOKUP($B$3,Sources!$C$2:$D$14,2,FALSE),Calendrier!AE10)","v":"2018-06-15"},null,{"$f":"DATE($B$2,VLOOKUP($B$3,Sources!$C$2:$D$14,2,FALSE),Calendrier!AG10)","v":"2018-06-16"},null,{"$f":"DATE($B$2,VLOOKUP($B$3,Sources!$C$2:$D$14,2,FALSE),Calendrier!AI10)","v":"2018-06-17"},null,{"$f":"DATE($B$2,VLOOKUP($B$3,Sources!$C$2:$D$14,2,FALSE),Calendrier!AK10)","v":"2018-06-18"},null,{"$f":"DATE($B$2,VLOOKUP($B$3,Sources!$C$2:$D$14,2,FALSE),Calendrier!AM10)","v":"2018-06-19"},null,{"$f":"DATE($B$2,VLOOKUP($B$3,Sources!$C$2:$D$14,2,FALSE),Calendrier!AO10)","v":"2018-06-20"},null,{"$f":"DATE($B$2,VLOOKUP($B$3,Sources!$C$2:$D$14,2,FALSE),Calendrier!AQ10)","v":"2018-06-21"},null,{"$f":"DATE($B$2,VLOOKUP($B$3,Sources!$C$2:$D$14,2,FALSE),Calendrier!AS10)","v":"2018-06-22"},null,{"$f":"DATE($B$2,VLOOKUP($B$3,Sources!$C$2:$D$14,2,FALSE),Calendrier!AU10)","v":"2018-06-23"},null,{"$f":"DATE($B$2,VLOOKUP($B$3,Sources!$C$2:$D$14,2,FALSE),Calendrier!AW10)","v":"2018-06-24"},null,{"$f":"DATE($B$2,VLOOKUP($B$3,Sources!$C$2:$D$14,2,FALSE),Calendrier!AY10)","v":"2018-06-25"},null,{"$f":"DATE($B$2,VLOOKUP($B$3,Sources!$C$2:$D$14,2,FALSE),Calendrier!BA10)","v":"2018-06-26"},null,{"$f":"DATE($B$2,VLOOKUP($B$3,Sources!$C$2:$D$14,2,FALSE),Calendrier!BC10)","v":"2018-06-27"},null,{"$f":"DATE($B$2,VLOOKUP($B$3,Sources!$C$2:$D$14,2,FALSE),Calendrier!BE10)","v":"2018-06-28"},null,{"$f":"DATE($B$2,VLOOKUP($B$3,Sources!$C$2:$D$14,2,FALSE),Calendrier!BG10)","v":"2018-06-29"},null,{"$f":"DATE($B$2,VLOOKUP($B$3,Sources!$C$2:$D$14,2,FALSE),Calendrier!BI10)","v":"2018-06-30"},null,{"$f":"DATE($B$2,VLOOKUP($B$3,Sources!$C$2:$D$14,2,FALSE),Calendrier!BK10)","v":"2018-07-01"}]
[null,null,{"$f":"IF(AND($B$2<>\"\",$B$3<>\"\"),TEXT(C8,\"jjjj\")&\" \",\"\")","v":"vendredi "},null,{"$f":"IF(AND($B$2<>\"\",$B$3<>\"\"),IF(MONTH(E8)=MONTH($C$8),TEXT(E8,\"jjjj\")&\" \",\"\"),\"\")","v":"samedi "},null,{"$f":"IF(AND($B$2<>\"\",$B$3<>\"\"),IF(MONTH(G8)=MONTH($C$8),TEXT(G8,\"jjjj\")&\" \",\"\"),\"\")","v":"dimanche "},null,{"$f":"IF(AND($B$2<>\"\",$B$3<>\"\"),IF(MONTH(I8)=MONTH($C$8),TEXT(I8,\"jjjj\")&\" \",\"\"),\"\")","v":"lundi "},null,{"$f":"IF(AND($B$2<>\"\",$B$3<>\"\"),IF(MONTH(K8)=MONTH($C$8),TEXT(K8,\"jjjj\")&\" \",\"\"),\"\")","v":"mardi "},null,{"$f":"IF(AND($B$2<>\"\",$B$3<>\"\"),IF(MONTH(M8)=MONTH($C$8),TEXT(M8,\"jjjj\")&\" \",\"\"),\"\")","v":"mercredi "},null,{"$f":"IF(AND($B$2<>\"\",$B$3<>\"\"),IF(MONTH(O8)=MONTH($C$8),TEXT(O8,\"jjjj\")&\" \",\"\"),\"\")","v":"jeudi "},null,{"$f":"IF(AND($B$2<>\"\",$B$3<>\"\"),IF(MONTH(Q8)=MONTH($C$8),TEXT(Q8,\"jjjj\")&\" \",\"\"),\"\")","v":"vendredi "},null,{"$f":"IF(AND($B$2<>\"\",$B$3<>\"\"),IF(MONTH(S8)=MONTH($C$8),TEXT(S8,\"jjjj\")&\" \",\"\"),\"\")","v":"samedi "},null,{"$f":"IF(AND($B$2<>\"\",$B$3<>\"\"),IF(MONTH(U8)=MONTH($C$8),TEXT(U8,\"jjjj\")&\" \",\"\"),\"\")","v":"dimanche "},null,{"$f":"IF(AND($B$2<>\"\",$B$3<>\"\"),IF(MONTH(W8)=MONTH($C$8),TEXT(W8,\"jjjj\")&\" \",\"\"),\"\")","v":"lundi "},null,{"$f":"IF(AND($B$2<>\"\",$B$3<>\"\"),IF(MONTH(Y8)=MONTH($C$8),TEXT(Y8,\"jjjj\")&\" \",\"\"),\"\")","v":"mardi "},null,{"$f":"IF(AND($B$2<>\"\",$B$3<>\"\"),IF(MONTH(AA8)=MONTH($C$8),TEXT(AA8,\"jjjj\")&\" \",\"\"),\"\")","v":"mercredi "},null,{"$f":"IF(AND($B$2<>\"\",$B$3<>\"\"),IF(MONTH(AC8)=MONTH($C$8),TEXT(AC8,\"jjjj\")&\" \",\"\"),\"\")","v":"jeudi "},null,{"$f":"IF(AND($B$2<>\"\",$B$3<>\"\"),IF(MONTH(AE8)=MONTH($C$8),TEXT(AE8,\"jjjj\")&\" \",\"\"),\"\")","v":"vendredi "},null,{"$f":"IF(AND($B$2<>\"\",$B$3<>\"\"),IF(MONTH(AG8)=MONTH($C$8),TEXT(AG8,\"jjjj\")&\" \",\"\"),\"\")","v":"samedi "},null,{"$f":"IF(AND($B$2<>\"\",$B$3<>\"\"),IF(MONTH(AI8)=MONTH($C$8),TEXT(AI8,\"jjjj\")&\" \",\"\"),\"\")","v":"dimanche "},null,{"$f":"IF(AND($B$2<>\"\",$B$3<>\"\"),IF(MONTH(AK8)=MONTH($C$8),TEXT(AK8,\"jjjj\")&\" \",\"\"),\"\")","v":"lundi "},null,{"$f":"IF(AND($B$2<>\"\",$B$3<>\"\"),IF(MONTH(AM8)=MONTH($C$8),TEXT(AM8,\"jjjj\")&\" \",\"\"),\"\")","v":"mardi "},null,{"$f":"IF(AND($B$2<>\"\",$B$3<>\"\"),IF(MONTH(AO8)=MONTH($C$8),TEXT(AO8,\"jjjj\")&\" \",\"\"),\"\")","v":"mercredi "},null,{"$f":"IF(AND($B$2<>\"\",$B$3<>\"\"),IF(MONTH(AQ8)=MONTH($C$8),TEXT(AQ8,\"jjjj\")&\" \",\"\"),\"\")","v":"jeudi "},null,{"$f":"IF(AND($B$2<>\"\",$B$3<>\"\"),IF(MONTH(AS8)=MONTH($C$8),TEXT(AS8,\"jjjj\")&\" \",\"\"),\"\")","v":"vendredi "},null,{"$f":"IF(AND($B$2<>\"\",$B$3<>\"\"),IF(MONTH(AU8)=MONTH($C$8),TEXT(AU8,\"jjjj\")&\" \",\"\"),\"\")","v":"samedi "},null,{"$f":"IF(AND($B$2<>\"\",$B$3<>\"\"),IF(MONTH(AW8)=MONTH($C$8),TEXT(AW8,\"jjjj\")&\" \",\"\"),\"\")","v":"dimanche "},null,{"$f":"IF(AND($B$2<>\"\",$B$3<>\"\"),IF(MONTH(AY8)=MONTH($C$8),TEXT(AY8,\"jjjj\")&\" \",\"\"),\"\")","v":"lundi "},null,{"$f":"IF(AND($B$2<>\"\",$B$3<>\"\"),IF(MONTH(BA8)=MONTH($C$8),TEXT(BA8,\"jjjj\")&\" \",\"\"),\"\")","v":"mardi "},null,{"$f":"IF(AND($B$2<>\"\",$B$3<>\"\"),IF(MONTH(BC8)=MONTH($C$8),TEXT(BC8,\"jjjj\")&\" \",\"\"),\"\")","v":"mercredi "},null,{"$f":"IF(AND($B$2<>\"\",$B$3<>\"\"),IF(MONTH(BE8)=MONTH($C$8),TEXT(BE8,\"jjjj\")&\" \",\"\"),\"\")","v":"jeudi "},null,{"$f":"IF(AND($B$2<>\"\",$B$3<>\"\"),IF(MONTH(BG8)=MONTH($C$8),TEXT(BG8,\"jjjj\")&\" \",\"\"),\"\")","v":"vendredi "},null,{"$f":"IF(AND($B$2<>\"\",$B$3<>\"\"),IF(MONTH(BI8)=MONTH($C$8),TEXT(BI8,\"jjjj\")&\" \",\"\"),\"\")","v":"samedi "},null,{"$f":"IF(AND($B$2<>\"\",$B$3<>\"\"),IF(MONTH(BK8)=MONTH($C$8),TEXT(BK8,\"jjjj\")&\" \",\"\"),\"\")","v":""}]
[null,null,1,null,2,null,3,null,4,null,5,null,6,null,7,null,8,null,9,null,10,null,11,null,12,null,13,null,14,null,15,null,16,null,17,null,18,null,19,null,20,null,21,null,22,null,23,null,24,null,25,null,26,null,27,null,28,null,29,null,30,null,31,null,null,"total heures","Total congés"]
[null,{"$f":"IF($C$9<>\"\",Sources!H3,\"\")","v":"Jo"},null,"SWE SMDD",null,"SWE SMDD",null,"SD SMDD",null,null,null,null,null,null,null,null,null,"SWE SMDD",null,"SWE SMDD",null,"SD SMDD",null,null,null,null,null,null,null,null,null,"SWE SMDD",null,"SWE SMDD",null,"SD SMDD",null,null,null,null,null,null,null,null,null,"SWE SMDD",null,"SWE SMDD",null,"SD SMDD",null,null,null,null,null,null,null,null,null,"SWE SMDD",null,"SWE SMDD",null,null,null,{"$f":"SUMPRODUCT((COUNTIF(C11:BL11,typ))*(temps))","v":58},{"$f":"SUMPRODUCT((COUNTIF(C11:BL11,Sources!$B$35))*(Sources!$D$35))","v":0},null,"="]
[null,{"$f":"IF($C$9<>\"\",Sources!H4,\"\")","v":"Cha"},"M SMDD","SWE SMDD","M SMDD","SWE SMDD",null,null,"M SMDD","S SMDD",null,null,null,null,"M SMDD","S SMDD","M SMDD","SWE SMDD","M SMDD","SWE SMDD",null,"SD SMDD","M SMDD","S SMDD",null,null,null,null,"M SMDD","S SMDD","M SMDD","SWE SMDD","M SMDD","SWE SMDD",null,"SD SMDD","M SMDD","S SMDD","M SMDD","S SMDD",null,"S SMDD","M SMDD","S SMDD","M SMDD","SWE SMDD",null,null,null,null,"M SMDD","S SMDD","M SMDD","S SMDD",null,null,null,null,"M SMDD","SWE SMDD","M SMDD","SWE SMDD",null,null,null,{"$f":"SUMPRODUCT((COUNTIF(C12:BL12,typ))*(temps))","v":143},{"$f":"SUMPRODUCT((COUNTIF(C12:BL12,Sources!$B$35))*(Sources!$D$35))","v":0}]
[null,{"$f":"IF($C$9<>\"\",Sources!H5,\"\")","v":"Jess"},"CP","CP","CP","CP","CP","CP",null,null,"M SMDD","S SMDD",null,null,null,null,null,null,null,"SWE SMDD",null,"SD SMDD",null,null,null,null,null,"S SMDD",null,"S SMDD",null,null,null,null,null,"SD SMDD",null,null,null,null,null,null,null,"S SMDD",null,null,null,"SWE SMDD",null,null,null,null,null,null,null,null,null,"S SMDD",null,"SWE SMDD",null,"SWE         VAR",null,null,null,46,{"$f":"SUMPRODUCT((COUNTIF(C13:BL13,Sources!$B$35))*(Sources!$D$35))","v":3}]
[null,{"$f":"IF($C$9<>\"\",Sources!H6,\"\")","v":"Alex"},null,"SWE         VAR","M        VAR","SWE SMDD",null,"SD SMDD",null,null,null,"S        VAR","M SMDD","S        VAR","M        VAR","S        VAR",null,"SWE SMDD","M        VAR","S         SMLJ",null,"S         SMLJ",null,null,"M SMDD","S SMDD","M SMDD","S SMDD","M        VAR","S        VAR","M        VAR","SWE          SEM",null,"SWE SMDD",null,null,null,null,"M        VAR","S        VAR","M SMDD","S SMDD","M        VAR",null,null,"SWE          SEM","M SMDD","SWE SMDD",null,"SD SMDD",null,null,"M        VAR","S SMDD","M SMDD","S SMDD","M        VAR","S        VAR",null,"SWE         VAR",null,"SWE          SEM",null,null,null,143,{"$f":"SUMPRODUCT((COUNTIF(C14:BL14,Sources!$B$35))*(Sources!$D$35))","v":0}]
[null,{"$f":"IF($C$9<>\"\",Sources!H7,\"\")","v":"Op"},null,"SWE         VAR",null,"SWE         VAR",null,"SWE         VAR","M        VAR","S        VAR","M        VAR",null,null,null,"M        VAR","S        VAR",null,"SWE         VAR",null,"SWE         VAR",null,"SWE         VAR",null,null,null,null,"M        VAR","S        VAR",null,"S        VAR",null,"SWE         VAR","M        VAR","SWE         VAR",null,"SD       VAR",null,null,null,null,"M        VAR","S        VAR",null,"S        VAR",null,"SWE         VAR","M        VAR","SWE         VAR",null,"SD       VAR",null,null,null,"S        VAR","M        VAR","S        VAR",null,null,null,"SWE         VAR","M        VAR","SWE         VAR",null,null,null,116.5,{"$f":"SUMPRODUCT((COUNTIF(C15:BL15,Sources!$B$35))*(Sources!$D$35))","v":0}]
[null,{"$f":"IF($C$9<>\"\",Sources!H8,\"\")","v":"De"},"M        VAR","SWE         VAR",null,"SWE         VAR",null,"SWE         VAR",null,"S        VAR",null,null,null,"S SMDD",null,null,"M        VAR","SWE         VAR",null,"SWE         VAR",null,"CP","M        VAR","S        VAR","M        VAR","S        VAR",null,null,null,null,null,"SWE         VAR",null,"SWE         VAR",null,"SD       VAR","M        VAR","S        VAR",null,null,null,null,null,"S        VAR","M        VAR","SWE         VAR",null,"SWE         VAR",null,"SD       VAR","M        VAR","S        VAR",null,"S        VAR",null,null,null,null,"M        VAR","SWE         VAR",null,"SWE         VAR",null,null,null,109,{"$f":"SUMPRODUCT((COUNTIF(C16:BL16,Sources!$B$35))*(Sources!$D$35))","v":0.5}]
[null,{"$f":"IF($C$9<>\"\",Sources!H9,\"\")","v":" "},null,null,null,null,null,null,null,null,null,null,null,null,null,null,null,null,null,null,null,null,null,null,null,null,null,null,null,null,null,null,null,null,null,null,null,null,null,null,null,null,null,null,null,null,null,null,null,null,null,null,null,null,null,null,null,null,null,null,null,null,null,null,null,0,{"$f":"SUMPRODUCT((COUNTIF(C17:BL17,Sources!$B$35))*(Sources!$D$35))","v":0}]
[null,{"$f":"IF($C$9<>\"\",Sources!H10,\"\")","v":"Sy"},"CP","CP","CP","CP","CP","CP",null,null,null,null,"M        VAR","S SMDD",null,null,"M        VAR","SWE         VAR",null,"SWE         VAR",null,"SD       VAR",null,null,null,"S SMDD",null,null,"M SMDD","SWE SMDD",null,"SWE SMDD",null,null,null,null,null,null,null,"S SMDD",null,null,null,null,null,"SWE SMDD",null,null,null,null,null,null,null,null,null,"S SMDD","M SMDD","S SMDD",null,"SWE          SEM",null,"SWE SMDD",null,null,null,64,{"$f":"SUMPRODUCT((COUNTIF(C18:BL18,Sources!$B$35))*(Sources!$D$35))","v":3}]
[null,{"$f":"IF($C$9<>\"\",Sources!H11,\"\")","v":" "},null,null,null,null,null,null,null,null,null,null,null,null,null,null,null,null,null,null,null,null,null,null,null,null,null,null,null,null,null,null,null,null,null,null,null,null,null,null,null,null,null,null,null,null,null,null,null,null,null,null,null,null,null,null,null,null,null,null,null,null,null,null,null,0,{"$f":"SUMPRODUCT((COUNTIF(C19:BL19,Sources!$B$35))*(Sources!$D$35))","v":0}]
[null,{"$f":"IF($C$9<>\"\",Sources!H12,\"\")","v":"H"},"M       SEM","SWE          SEM",null,"SWE          SEM",null,"SD          SEM","M       SEM","S        SEM","M       SEM","S        SEM",null,null,null,"S        SEM","M       SEM","SWE          SEM",null,"SWE          SEM",null,"SD          SEM","M       SEM","S        SEM","M       SEM","S        SEM",null,null,null,"S        SEM","M       SEM","SWE          SEM",null,"SWE          SEM",null,"SD          SEM","M       SEM","S        SEM","M       SEM","S        SEM",null,null,null,"S        SEM","M       SEM","SWE          SEM",null,"SWE          SEM",null,"SD          SEM","M       SEM","S        SEM","M       SEM","S        SEM",null,null,null,"S        SEM","M       SEM","SWE          SEM",null,"SWE          SEM",null,null,null,145.5,{"$f":"SUMPRODUCT((COUNTIF(C20:BL20,Sources!$B$35))*(Sources!$D$35))","v":0}]
[null,{"$f":"IF($C$9<>\"\",Sources!H13,\"\")","v":"T"},null,"SWE          SEM","M       SEM","SWE          SEM",null,"SD          SEM",null,null,null,"S        SEM","M       SEM","S        SEM","M       SEM","S        SEM",null,"SWE          SEM","M       SEM","SWE          SEM",null,"SD          SEM",null,null,null,"S        SEM","M       SEM","S        SEM","M       SEM","S        SEM",null,"SWE          SEM","M       SEM","SWE          SEM",null,"SD          SEM",null,null,null,"S        SEM","M       SEM","S        SEM","M       SEM","S        SEM",null,"SWE          SEM","M       SEM","SWE          SEM",null,"SD          SEM",null,null,null,"S        SEM","M       SEM","S        SEM","M       SEM","S        SEM",null,"SWE          SEM","M       SEM","SWE          SEM",null,null,null,145.5,{"$f":"SUMPRODUCT((COUNTIF(C21:BL21,Sources!$B$35))*(Sources!$D$35))","v":0}]
[null,{"$f":"IF($C$9<>\"\",Sources!H14,\"\")","v":"S"},"M        VAR","SWE SMDD",null,"S        VAR",null,"S        VAR",null,null,"M SMDD","S SMDD",null,null,null,null,null,null,null,null,null,null,null,null,null,null,null,null,null,null,null,null,null,null,null,null,null,null,null,null,null,null,null,null,null,null,null,null,null,null,null,null,null,null,null,null,null,null,null,null,null,null,null,null,null,21.5,{"$f":"SUMPRODUCT((COUNTIF(C22:BL22,Sources!$B$35))*(Sources!$D$35))","v":0}]
[]
[]
[]
[]
[]
[]
[null,"SAINT MARS DU DESERT",null,null,null,null,"M = 10h-13h30"]
[null,"VARADES",null,null,null,null,"S = 18h-21h30"]
[null,"SAINT ETIENNE DE MTLUC",null,null,null,null,"SWE = 18h-22h"]
[null,"CONGES",null,null,null,null,"SD = 17h30- 22h"]

{"sheet":"S23à26","index":3,"n_rows":16,"n_cols":67,"rows_kept":16,"cut":false,"hidden":false,"merged":[[3,47,3,48],[3,22,3,23],[3,24,3,25],[3,26,3,27],[3,28,3,29],[3,30,3,31],[3,35,3,36],[0,64,0,65],[1,64,1,65],[2,64,2,65],[3,64,3,65],[3,52,3,53],[3,54,3,55],[3,56,3,57],[3,58,3,59],[3,60,3,61],[3,62,3,63],[2,62,2,63],[0,58,0,59],[0,60,0,61],[0,62,0,63],[2,45,2,46],[3,37,3,38],[3,39,3,40],[3,1,3,2],[3,3,3,4],[3,5,3,6],[3,7,3,8],[3,9,3,10],[3,11,3,12],[3,13,3,14],[3,18,3,19],[3,20,3,21],[3,41,3,42],[3,43,3,44],[3,45,3,46],[1,60,1,61],[1,62,1,63],[2,1,2,2],[2,3,2,4],[2,5,2,6],[2,7,2,8],[2,9,2,10],[2,11,2,12],[2,13,2,14],[2,18,2,19],[1,45,1,46],[1,47,1,48],[1,52,1,53],[1,54,1,55],[1,56,1,57],[1,58,1,59],[1,30,1,31],[1,35,1,36],[2,47,2,48],[2,52,2,53],[2,54,2,55],[2,56,2,57],[2,58,2,59],[2,60,2,61],[1,43,1,44],[1,18,1,19],[1,20,1,21],[1,22,1,23],[1,24,1,25],[1,26,1,27],[1,28,1,29],[2,20,2,21],[2,22,2,23],[2,24,2,25],[2,26,2,27],[2,28,2,29],[2,30,2,31],[2,35,2,36],[2,37,2,38],[2,39,2,40],[2,41,2,42],[2,43,2,44],[1,1,1,2],[1,3,1,4],[1,5,1,6],[1,7,1,8],[1,9,1,10],[1,11,1,12],[1,13,1,14],[0,43,0,44],[0,45,0,46],[0,13,0,14],[0,18,0,19],[0,20,0,21],[0,22,0,23],[0,24,0,25],[0,26,0,27],[0,1,0,2],[0,3,0,4],[0,5,0,6],[0,7,0,8],[0,9,0,10],[0,11,0,12],[1,37,1,38],[1,39,1,40],[1,41,1,42],[0,47,0,48],[0,52,0,53],[0,54,0,55],[0,56,0,57],[0,28,0,29],[0,30,0,31],[0,35,0,36],[0,37,0,38],[0,39,0,40],[0,41,0,42]]}
[null,{"$f":"JUIN!I7","v":"S 23"},null,{"$f":"JUIN!K7","v":""},null,{"$f":"JUIN!M7","v":""},null,{"$f":"JUIN!O7","v":""},null,{"$f":"JUIN!Q7","v":""},null,{"$f":"JUIN!S7","v":""},null,{"$f":"JUIN!U7","v":""},null,null,null,null,{"$f":"JUIN!W7","v":"S 24"},null,{"$f":"JUIN!Y7","v":""},null,{"$f":"JUIN!AA7","v":""},null,{"$f":"JUIN!AC7","v":""},null,{"$f":"JUIN!AE7","v":""},null,{"$f":"JUIN!AG7","v":""},null,{"$f":"JUIN!AI7","v":""},null,null,null,null,{"$f":"JUIN!AK7","v":"S 25"},null,{"$f":"JUIN!AM7","v":""},null,{"$f":"JUIN!AO7","v":""},null,{"$f":"JUIN!AQ7","v":""},null,{"$f":"JUIN!AS7","v":""},null,{"$f":"JUIN!AU7","v":""},null,{"$f":"JUIN!AW7","v":""},null,null,null,null,{"$f":"JUIN!AY7","v":"S 26"},null,{"$f":"JUIN!BA7","v":""},null,{"$f":"JUIN!BC7","v":""},null,{"$f":"JUIN!BE7","v":""},null,{"$f":"JUIN!BG7","v":""},null,{"$f":"JUIN!BI7","v":""},null,{"$f":"#REF!","v":{"$error":"#REF!"}}]
[null,{"$f":"JUIN!I8","v":"2018-06-04"},null,{"$f":"JUIN!K8","v":"2018-06-05"},null,{"$f":"JUIN!M8","v":"2018-06-06"},null,{"$f":"JUIN!O8","v":"2018-06-07"},null,{"$f":"JUIN!Q8","v":"2018-06-08"},null,{"$f":"JUIN!S8","v":"2018-06-09"},null,{"$f":"JUIN!U8","v":"2018-06-10"},null,null,null,null,{"$f":"JUIN!W8","v":"2018-06-11"},null,{"$f":"JUIN!Y8","v":"2018-06-12"},null,{"$f":"JUIN!AA8","v":"2018-06-13"},null,{"$f":"JUIN!AC8","v":"2018-06-14"},null,{"$f":"JUIN!AE8","v":"2018-06-15"},null,{"$f":"JUIN!AG8","v":"2018-06-16"},null,{"$f":"JUIN!AI8","v":"2018-06-17"},null,null,null,null,{"$f":"JUIN!AK8","v":"2018-06-18"},null,{"$f":"JUIN!AM8","v":"2018-06-19"},null,{"$f":"JUIN!AO8","v":"2018-06-20"},null,{"$f":"JUIN!AQ8","v":"2018-06-21"},null,{"$f":"JUIN!AS8","v":"2018-06-22"},null,{"$f":"JUIN!AU8","v":"2018-06-23"},null,{"$f":"JUIN!AW8","v":"2018-06-24"},null,null,null,null,{"$f":"JUIN!AY8","v":"2018-06-25"},null,{"$f":"JUIN!BA8","v":"2018-06-26"},null,{"$f":"JUIN!BC8","v":"2018-06-27"},null,{"$f":"JUIN!BE8","v":"2018-06-28"},null,{"$f":"JUIN!BG8","v":"2018-06-29"},null,{"$f":"JUIN!BI8","v":"2018-06-30"},null,{"$f":"#REF!","v":{"$error":"#REF!"}}]
[null,{"$f":"JUIN!I9","v":"lundi "},null,{"$f":"JUIN!K9","v":"mardi "},null,{"$f":"JUIN!M9","v":"mercredi "},null,{"$f":"JUIN!O9","v":"jeudi "},null,{"$f":"JUIN!Q9","v":"vendredi "},null,{"$f":"JUIN!S9","v":"samedi "},null,{"$f":"JUIN!U9","v":"dimanche "},null,null,null,null,{"$f":"JUIN!W9","v":"lundi "},null,{"$f":"JUIN!Y9","v":"mardi "},null,{"$f":"JUIN!AA9","v":"mercredi "},null,{"$f":"JUIN!AC9","v":"jeudi "},null,{"$f":"JUIN!AE9","v":"vendredi "},null,{"$f":"JUIN!AG9","v":"samedi "},null,{"$f":"JUIN!AI9","v":"dimanche "},null,null,null,null,{"$f":"JUIN!AK9","v":"lundi "},null,{"$f":"JUIN!AM9","v":"mardi "},null,{"$f":"JUIN!AO9","v":"mercredi "},null,{"$f":"JUIN!AQ9","v":"jeudi "},null,{"$f":"JUIN!AS9","v":"vendredi "},null,{"$f":"JUIN!AU9","v":"samedi "},null,{"$f":"JUIN!AW9","v":"dimanche "},null,null,null,null,{"$f":"JUIN!AY9","v":"lundi "},null,{"$f":"JUIN!BA9","v":"mardi "},null,{"$f":"JUIN!BC9","v":"mercredi "},null,{"$f":"JUIN!BE9","v":"jeudi "},null,{"$f":"JUIN!BG9","v":"vendredi "},null,{"$f":"JUIN!BI9","v":"samedi "},null,{"$f":"#REF!","v":{"$error":"#REF!"}}]
[null,{"$f":"JUIN!I10","v":4},null,{"$f":"JUIN!K10","v":5},null,{"$f":"JUIN!M10","v":6},null,{"$f":"JUIN!O10","v":7},null,{"$f":"JUIN!Q10","v":8},null,{"$f":"JUIN!S10","v":9},null,{"$f":"JUIN!U10","v":10},null,null,null,null,{"$f":"JUIN!W10","v":11},null,{"$f":"JUIN!Y10","v":12},null,{"$f":"JUIN!AA10","v":13},null,{"$f":"JUIN!AC10","v":14},null,{"$f":"JUIN!AE10","v":15},null,{"$f":"JUIN!AG10","v":16},null,{"$f":"JUIN!AI10","v":17},null,null,null,null,{"$f":"JUIN!AK10","v":18},null,{"$f":"JUIN!AM10","v":19},null,{"$f":"JUIN!AO10","v":20},null,{"$f":"JUIN!AQ10","v":21},null,{"$f":"JUIN!AS10","v":22},null,{"$f":"JUIN!AU10","v":23},null,{"$f":"JUIN!AW10","v":24},null,null,null,null,{"$f":"JUIN!AY10","v":25},null,{"$f":"JUIN!BA10","v":26},null,{"$f":"JUIN!BC10","v":27},null,{"$f":"JUIN!BE10","v":28},null,{"$f":"JUIN!BG10","v":29},null,{"$f":"JUIN!BI10","v":30},null,{"$f":"#REF!","v":{"$error":"#REF!"}}]
[{"$f":"JUIN!B11","v":"Jo"},{"$f":"JUIN!I11","v":0},{"$f":"JUIN!J11","v":0},{"$f":"JUIN!K11","v":0},{"$f":"JUIN!L11","v":0},{"$f":"JUIN!M11","v":0},{"$f":"JUIN!N11","v":0},{"$f":"JUIN!O11","v":0},{"$f":"JUIN!P11","v":0},{"$f":"JUIN!Q11","v":0},{"$f":"JUIN!R11","v":"SWE SMDD"},{"$f":"JUIN!S11","v":0},{"$f":"JUIN!T11","v":"SWE SMDD"},{"$f":"JUIN!U11","v":0},{"$f":"JUIN!V11","v":"SD SMDD"},{"$f":"SUMPRODUCT(COUNTIF(B5:O5,typ)*(temps))","v":12.5},null,{"$f":"JUIN!B11","v":"Jo"},{"$f":"JUIN!W11","v":0},{"$f":"JUIN!X11","v":0},{"$f":"JUIN!Y11","v":0},{"$f":"JUIN!Z11","v":0},{"$f":"JUIN!AA11","v":0},{"$f":"JUIN!AB11","v":0},{"$f":"JUIN!AC11","v":0},{"$f":"JUIN!AD11","v":0},{"$f":"JUIN!AE11","v":0},{"$f":"JUIN!AF11","v":"SWE SMDD"},{"$f":"JUIN!AG11","v":0},{"$f":"JUIN!AH11","v":"SWE SMDD"},{"$f":"JUIN!AI11","v":0},{"$f":"JUIN!AJ11","v":"SD SMDD"},{"$f":"SUMPRODUCT(COUNTIF(S5:AF5,typ)*(temps))","v":12.5},null,{"$f":"JUIN!B11","v":"Jo"},{"$f":"JUIN!AK11","v":0},{"$f":"JUIN!AL11","v":0},{"$f":"JUIN!AM11","v":0},{"$f":"JUIN!AN11","v":0},{"$f":"JUIN!AO11","v":0},{"$f":"JUIN!AP11","v":0},{"$f":"JUIN!AQ11","v":0},{"$f":"JUIN!AR11","v":0},{"$f":"JUIN!AS11","v":0},{"$f":"JUIN!AT11","v":"SWE SMDD"},{"$f":"JUIN!AU11","v":0},{"$f":"JUIN!AV11","v":"SWE SMDD"},{"$f":"JUIN!AW11","v":0},{"$f":"JUIN!AX11","v":"SD SMDD"},{"$f":"SUMPRODUCT(COUNTIF(AJ5:AW5,typ)*(temps))","v":12.5},null,{"$f":"JUIN!B11","v":"Jo"},{"$f":"JUIN!AY11","v":0},{"$f":"JUIN!AZ11","v":0},{"$f":"JUIN!BA11","v":0},{"$f":"JUIN!BB11","v":0},{"$f":"JUIN!BC11","v":0},{"$f":"JUIN!BD11","v":0},{"$f":"JUIN!BE11","v":0},{"$f":"JUIN!BF11","v":0},{"$f":"JUIN!BG11","v":0},{"$f":"JUIN!BH11","v":"SWE SMDD"},{"$f":"JUIN!BI11","v":0},{"$f":"JUIN!BJ11","v":"SWE SMDD"},{"$f":"#REF!","v":{"$error":"#REF!"}},{"$f":"#REF!","v":{"$error":"#REF!"}},{"$f":"SUMPRODUCT(COUNTIF(BA5:BN5,typ)*(temps))","v":8}]
[{"$f":"JUIN!B12","v":"Cha"},{"$f":"JUIN!I12","v":"M SMDD"},{"$f":"JUIN!J12","v":"S SMDD"},{"$f":"JUIN!K12","v":0},{"$f":"JUIN!L12","v":0},{"$f":"JUIN!M12","v":0},{"$f":"JUIN!N12","v":0},{"$f":"JUIN!O12","v":"M SMDD"},{"$f":"JUIN!P12","v":"S SMDD"},{"$f":"JUIN!Q12","v":"M SMDD"},{"$f":"JUIN!R12","v":"SWE SMDD"},{"$f":"JUIN!S12","v":"M SMDD"},{"$f":"JUIN!T12","v":"SWE SMDD"},{"$f":"JUIN!U12","v":0},{"$f":"JUIN!V12","v":"SD SMDD"},33.5,null,{"$f":"JUIN!B12","v":"Cha"},{"$f":"JUIN!W12","v":"M SMDD"},{"$f":"JUIN!X12","v":"S SMDD"},{"$f":"JUIN!Y12","v":0},{"$f":"JUIN!Z12","v":0},{"$f":"JUIN!AA12","v":0},{"$f":"JUIN!AB12","v":0},{"$f":"JUIN!AC12","v":"M SMDD"},{"$f":"JUIN!AD12","v":"S SMDD"},{"$f":"JUIN!AE12","v":"M SMDD"},{"$f":"JUIN!AF12","v":"SWE SMDD"},{"$f":"JUIN!AG12","v":"M SMDD"},{"$f":"JUIN!AH12","v":"SWE SMDD"},{"$f":"JUIN!AI12","v":0},{"$f":"JUIN!AJ12","v":"SD SMDD"},33.5,null,{"$f":"JUIN!B12","v":"Cha"},{"$f":"JUIN!AK12","v":"M SMDD"},{"$f":"JUIN!AL12","v":"S SMDD"},{"$f":"JUIN!AM12","v":"M SMDD"},{"$f":"JUIN!AN12","v":"S SMDD"},{"$f":"JUIN!AO12","v":0},{"$f":"JUIN!AP12","v":"S SMDD"},{"$f":"JUIN!AQ12","v":"M SMDD"},{"$f":"JUIN!AR12","v":"S SMDD"},{"$f":"JUIN!AS12","v":"M SMDD"},{"$f":"JUIN!AT12","v":"SWE SMDD"},{"$f":"JUIN!AU12","v":0},{"$f":"JUIN!AV12","v":0},{"$f":"JUIN!AW12","v":0},{"$f":"JUIN!AX12","v":0},32,null,{"$f":"JUIN!B12","v":"Cha"},{"$f":"JUIN!AY12","v":"M SMDD"},{"$f":"JUIN!AZ12","v":"S SMDD"},{"$f":"JUIN!BA12","v":"M SMDD"},{"$f":"JUIN!BB12","v":"S SMDD"},{"$f":"JUIN!BC12","v":0},{"$f":"JUIN!BD12","v":0},{"$f":"JUIN!BE12","v":0},{"$f":"JUIN!BF12","v":0},{"$f":"JUIN!BG12","v":"M SMDD"},{"$f":"JUIN!BH12","v":"SWE SMDD"},{"$f":"JUIN!BI12","v":"M SMDD"},{"$f":"JUIN!BJ12","v":"SWE SMDD"},{"$f":"#REF!","v":{"$error":"#REF!"}},{"$f":"#REF!","v":{"$error":"#REF!"}},29]
[{"$f":"JUIN!B13","v":"Jess"},{"$f":"JUIN!I13","v":0},{"$f":"JUIN!J13","v":0},{"$f":"JUIN!K13","v":"M SMDD"},{"$f":"JUIN!L13","v":"S SMDD"},{"$f":"JUIN!M13","v":0},{"$f":"JUIN!N13","v":0},{"$f":"JUIN!O13","v":0},{"$f":"JUIN!P13","v":0},{"$f":"JUIN!Q13","v":0},{"$f":"JUIN!R13","v":0},{"$f":"JUIN!S13","v":0},{"$f":"JUIN!T13","v":"SWE SMDD"},{"$f":"JUIN!U13","v":0},{"$f":"JUIN!V13","v":"SD SMDD"},15.5,null,{"$f":"JUIN!B13","v":"Jess"},{"$f":"JUIN!W13","v":0},{"$f":"JUIN!X13","v":0},{"$f":"JUIN!Y13","v":0},{"$f":"JUIN!Z13","v":0},{"$f":"JUIN!AA13","v":0},{"$f":"JUIN!AB13","v":"S SMDD"},{"$f":"JUIN!AC13","v":0},{"$f":"JUIN!AD13","v":"S SMDD"},{"$f":"JUIN!AE13","v":0},{"$f":"JUIN!AF13","v":0},{"$f":"JUIN!AG13","v":0},{"$f":"JUIN!AH13","v":0},{"$f":"JUIN!AI13","v":0},{"$f":"JUIN!AJ13","v":"SD SMDD"},11.5,null,{"$f":"JUIN!B13","v":"Jess"},{"$f":"JUIN!AK13","v":0},{"$f":"JUIN!AL13","v":0},{"$f":"JUIN!AM13","v":0},{"$f":"JUIN!AN13","v":0},{"$f":"JUIN!AO13","v":0},{"$f":"JUIN!AP13","v":0},{"$f":"JUIN!AQ13","v":0},{"$f":"JUIN!AR13","v":"S SMDD"},{"$f":"JUIN!AS13","v":0},{"$f":"JUIN!AT13","v":0},{"$f":"JUIN!AU13","v":0},{"$f":"JUIN!AV13","v":"SWE SMDD"},{"$f":"JUIN!AW13","v":0},{"$f":"JUIN!AX13","v":0},7.5,null,{"$f":"JUIN!B13","v":"Jess"},{"$f":"JUIN!AY13","v":0},{"$f":"JUIN!AZ13","v":0},{"$f":"JUIN!BA13","v":0},{"$f":"JUIN!BB13","v":0},{"$f":"JUIN!BC13","v":0},{"$f":"JUIN!BD13","v":0},{"$f":"JUIN!BE13","v":0},{"$f":"JUIN!BF13","v":"S SMDD"},{"$f":"JUIN!BG13","v":0},{"$f":"JUIN!BH13","v":"SWE SMDD"},{"$f":"JUIN!BI13","v":0},{"$f":"JUIN!BJ13","v":"SWE         VAR"},{"$f":"#REF!","v":{"$error":"#REF!"}},{"$f":"#REF!","v":{"$error":"#REF!"}},11.5]
[{"$f":"JUIN!B14","v":"Alex"},{"$f":"JUIN!I14","v":0},{"$f":"JUIN!J14","v":0},{"$f":"JUIN!K14","v":0},{"$f":"JUIN!L14","v":"S        VAR"},{"$f":"JUIN!M14","v":"M SMDD"},{"$f":"JUIN!N14","v":"S        VAR"},{"$f":"JUIN!O14","v":"M        VAR"},{"$f":"JUIN!P14","v":"S        VAR"},{"$f":"JUIN!Q14","v":0},{"$f":"JUIN!R14","v":"SWE SMDD"},{"$f":"JUIN!S14","v":"M        VAR"},{"$f":"JUIN!T14","v":"S         SMLJ"},{"$f":"JUIN!U14","v":0},{"$f":"JUIN!V14","v":"S         SMLJ"},32,null,{"$f":"JUIN!B14","v":"Alex"},{"$f":"JUIN!W14","v":0},{"$f":"JUIN!X14","v":0},{"$f":"JUIN!Y14","v":"M SMDD"},{"$f":"JUIN!Z14","v":"S SMDD"},{"$f":"JUIN!AA14","v":"M SMDD"},{"$f":"JUIN!AB14","v":"S SMDD"},{"$f":"JUIN!AC14","v":"M        VAR"},{"$f":"JUIN!AD14","v":"S        VAR"},{"$f":"JUIN!AE14","v":"M        VAR"},{"$f":"JUIN!AF14","v":"SWE          SEM"},{"$f":"JUIN!AG14","v":0},{"$f":"JUIN!AH14","v":"SWE SMDD"},{"$f":"JUIN!AI14","v":0},{"$f":"JUIN!AJ14","v":0},32.5,null,{"$f":"JUIN!B14","v":"Alex"},{"$f":"JUIN!AK14","v":0},{"$f":"JUIN!AL14","v":0},{"$f":"JUIN!AM14","v":"M        VAR"},{"$f":"JUIN!AN14","v":"S        VAR"},{"$f":"JUIN!AO14","v":"M SMDD"},{"$f":"JUIN!AP14","v":"S SMDD"},{"$f":"JUIN!AQ14","v":"M        VAR"},{"$f":"JUIN!AR14","v":0},{"$f":"JUIN!AS14","v":0},{"$f":"JUIN!AT14","v":"SWE          SEM"},{"$f":"JUIN!AU14","v":"M SMDD"},{"$f":"JUIN!AV14","v":"SWE SMDD"},{"$f":"JUIN!AW14","v":0},{"$f":"JUIN!AX14","v":"SD SMDD"},33.5,null,{"$f":"JUIN!B14","v":"Alex"},{"$f":"JUIN!AY14","v":0},{"$f":"JUIN!AZ14","v":0},{"$f":"JUIN!BA14","v":"M        VAR"},{"$f":"JUIN!BB14","v":"S SMDD"},{"$f":"JUIN!BC14","v":"M SMDD"},{"$f":"JUIN!BD14","v":"S SMDD"},{"$f":"JUIN!BE14","v":"M        VAR"},{"$f":"JUIN!BF14","v":"S        VAR"},{"$f":"JUIN!BG14","v":0},{"$f":"JUIN!BH14","v":"SWE         VAR"},{"$f":"JUIN!BI14","v":0},{"$f":"JUIN!BJ14","v":"SWE          SEM"},{"$f":"#REF!","v":{"$error":"#REF!"}},{"$f":"#REF!","v":{"$error":"#REF!"}},29]
[{"$f":"JUIN!B15","v":"Op"},{"$f":"JUIN!I15","v":"M        VAR"},{"$f":"JUIN!J15","v":"S        VAR"},{"$f":"JUIN!K15","v":"M        VAR"},{"$f":"JUIN!L15","v":0},{"$f":"JUIN!M15","v":0},{"$f":"JUIN!N15","v":0},null,{"$f":"JUIN!P15","v":"S        VAR"},{"$f":"JUIN!Q15","v":0},{"$f":"JUIN!R15","v":"SWE         VAR"},{"$f":"JUIN!S15","v":0},{"$f":"JUIN!T15","v":"SWE         VAR"},{"$f":"JUIN!U15","v":0},{"$f":"JUIN!V15","v":"SWE         VAR"},26,null,{"$f":"JUIN!B15","v":"Op"},{"$f":"JUIN!W15","v":0},{"$f":"JUIN!X15","v":0},{"$f":"JUIN!Y15","v":0},{"$f":"JUIN!Z15","v":0},{"$f":"JUIN!AA15","v":"M        VAR"},{"$f":"JUIN!AB15","v":"S        VAR"},{"$f":"JUIN!AC15","v":0},{"$f":"JUIN!AD15","v":"S        VAR"},{"$f":"JUIN!AE15","v":0},{"$f":"JUIN!AF15","v":"SWE         VAR"},{"$f":"JUIN!AG15","v":"M        VAR"},{"$f":"JUIN!AH15","v":"SWE         VAR"},{"$f":"JUIN!AI15","v":0},{"$f":"JUIN!AJ15","v":"SD       VAR"},26.5,null,{"$f":"JUIN!B15","v":"Op"},{"$f":"JUIN!AK15","v":0},{"$f":"JUIN!AL15","v":0},{"$f":"JUIN!AM15","v":0},{"$f":"JUIN!AN15","v":0},{"$f":"JUIN!AO15","v":"M        VAR"},{"$f":"JUIN!AP15","v":"S        VAR"},{"$f":"JUIN!AQ15","v":0},{"$f":"JUIN!AR15","v":"S        VAR"},{"$f":"JUIN!AS15","v":0},{"$f":"JUIN!AT15","v":"SWE         VAR"},{"$f":"JUIN!AU15","v":"M        VAR"},{"$f":"JUIN!AV15","v":"SWE         VAR"},{"$f":"JUIN!AW15","v":0},{"$f":"JUIN!AX15","v":"SD       VAR"},26.5,null,{"$f":"JUIN!B15","v":"Op"},{"$f":"JUIN!AY15","v":0},{"$f":"JUIN!AZ15","v":0},{"$f":"JUIN!BA15","v":0},{"$f":"JUIN!BB15","v":"S        VAR"},{"$f":"JUIN!BC15","v":"M        VAR"},{"$f":"JUIN!BD15","v":"S        VAR"},{"$f":"JUIN!BE15","v":0},{"$f":"JUIN!BF15","v":0},{"$f":"JUIN!BG15","v":0},{"$f":"JUIN!BH15","v":"SWE         VAR"},{"$f":"JUIN!BI15","v":"M        VAR"},{"$f":"JUIN!BJ15","v":"SWE         VAR"},{"$f":"#REF!","v":{"$error":"#REF!"}},{"$f":"#REF!","v":{"$error":"#REF!"}},22]
[{"$f":"JUIN!B16","v":"De"},{"$f":"JUIN!I16","v":0},{"$f":"JUIN!J16","v":"S        VAR"},{"$f":"JUIN!K16","v":0},{"$f":"JUIN!L16","v":0},"M        VAR",{"$f":"JUIN!N16","v":"S SMDD"},{"$f":"JUIN!O16","v":0},{"$f":"JUIN!P16","v":0},{"$f":"JUIN!Q16","v":"M        VAR"},{"$f":"JUIN!R16","v":"SWE         VAR"},{"$f":"JUIN!S16","v":0},{"$f":"JUIN!T16","v":"SWE         VAR"},{"$f":"JUIN!U16","v":0},{"$f":"JUIN!V16","v":"CP"},22,null,{"$f":"JUIN!B16","v":"De"},{"$f":"JUIN!W16","v":"M        VAR"},{"$f":"JUIN!X16","v":"S        VAR"},{"$f":"JUIN!Y16","v":"M        VAR"},{"$f":"JUIN!Z16","v":"S        VAR"},{"$f":"JUIN!AA16","v":0},{"$f":"JUIN!AB16","v":0},{"$f":"JUIN!AC16","v":0},{"$f":"JUIN!AD16","v":0},{"$f":"JUIN!AE16","v":0},{"$f":"JUIN!AF16","v":"SWE         VAR"},{"$f":"JUIN!AG16","v":0},{"$f":"JUIN!AH16","v":"SWE         VAR"},{"$f":"JUIN!AI16","v":0},{"$f":"JUIN!AJ16","v":"SD       VAR"},26.5,null,{"$f":"JUIN!B16","v":"De"},{"$f":"JUIN!AK16","v":"M        VAR"},{"$f":"JUIN!AL16","v":"S        VAR"},{"$f":"JUIN!AM16","v":0},{"$f":"JUIN!AN16","v":0},{"$f":"JUIN!AO16","v":0},{"$f":"JUIN!AP16","v":0},{"$f":"JUIN!AQ16","v":0},{"$f":"JUIN!AR16","v":"S        VAR"},{"$f":"JUIN!AS16","v":"M        VAR"},{"$f":"JUIN!AT16","v":"SWE         VAR"},{"$f":"JUIN!AU16","v":0},{"$f":"JUIN!AV16","v":"SWE         VAR"},{"$f":"JUIN!AW16","v":0},{"$f":"JUIN!AX16","v":"SD       VAR"},26.5,null,{"$f":"JUIN!B16","v":"De"},{"$f":"JUIN!AY16","v":"M        VAR"},{"$f":"JUIN!AZ16","v":"S        VAR"},{"$f":"JUIN!BA16","v":0},{"$f":"JUIN!BB16","v":"S        VAR"},{"$f":"JUIN!BC16","v":0},{"$f":"JUIN!BD16","v":0},{"$f":"JUIN!BE16","v":0},{"$f":"JUIN!BF16","v":0},{"$f":"JUIN!BG16","v":"M        VAR"},{"$f":"JUIN!BH16","v":"SWE         VAR"},{"$f":"JUIN!BI16","v":0},{"$f":"JUIN!BJ16","v":"SWE         VAR"},{"$f":"#REF!","v":{"$error":"#REF!"}},{"$f":"#REF!","v":{"$error":"#REF!"}},22]
[{"$f":"JUIN!B17","v":" "},{"$f":"JUIN!I17","v":0},{"$f":"JUIN!J17","v":0},{"$f":"JUIN!K17","v":0},{"$f":"JUIN!L17","v":0},{"$f":"JUIN!M17","v":0},{"$f":"JUIN!N17","v":0},{"$f":"JUIN!O17","v":0},{"$f":"JUIN!P17","v":0},{"$f":"JUIN!Q17","v":0},{"$f":"JUIN!R17","v":0},{"$f":"JUIN!S17","v":0},{"$f":"JUIN!T17","v":0},{"$f":"JUIN!U17","v":0},{"$f":"JUIN!V17","v":0},0,null,{"$f":"JUIN!B17","v":" "},{"$f":"JUIN!W17","v":0},{"$f":"JUIN!X17","v":0},{"$f":"JUIN!Y17","v":0},{"$f":"JUIN!Z17","v":0},{"$f":"JUIN!AA17","v":0},{"$f":"JUIN!AB17","v":0},{"$f":"JUIN!AC17","v":0},{"$f":"JUIN!AD17","v":0},{"$f":"JUIN!AE17","v":0},{"$f":"JUIN!AF17","v":0},{"$f":"JUIN!AG17","v":0},{"$f":"JUIN!AH17","v":0},{"$f":"JUIN!AI17","v":0},{"$f":"JUIN!AJ17","v":0},0,null,{"$f":"JUIN!B17","v":" "},{"$f":"JUIN!AK17","v":0},{"$f":"JUIN!AL17","v":0},{"$f":"JUIN!AM17","v":0},{"$f":"JUIN!AN17","v":0},{"$f":"JUIN!AO17","v":0},{"$f":"JUIN!AP17","v":0},{"$f":"JUIN!AQ17","v":0},{"$f":"JUIN!AR17","v":0},{"$f":"JUIN!AS17","v":0},{"$f":"JUIN!AT17","v":0},{"$f":"JUIN!AU17","v":0},{"$f":"JUIN!AV17","v":0},{"$f":"JUIN!AW17","v":0},{"$f":"JUIN!AX17","v":0},0,null,{"$f":"JUIN!B17","v":" "},{"$f":"JUIN!AY17","v":0},{"$f":"JUIN!AZ17","v":0},{"$f":"JUIN!BA17","v":0},{"$f":"JUIN!BB17","v":0},{"$f":"JUIN!BC17","v":0},{"$f":"JUIN!BD17","v":0},{"$f":"JUIN!BE17","v":0},{"$f":"JUIN!BF17","v":0},{"$f":"JUIN!BG17","v":0},{"$f":"JUIN!BH17","v":0},{"$f":"JUIN!BI17","v":0},{"$f":"JUIN!BJ17","v":0},{"$f":"#REF!","v":{"$error":"#REF!"}},{"$f":"#REF!","v":{"$error":"#REF!"}},0]
[{"$f":"JUIN!B18","v":"Sy"},{"$f":"JUIN!I18","v":0},{"$f":"JUIN!J18","v":0},{"$f":"JUIN!K18","v":0},{"$f":"JUIN!L18","v":0},{"$f":"JUIN!M18","v":"M        VAR"},{"$f":"JUIN!N18","v":"S SMDD"},{"$f":"JUIN!O18","v":0},{"$f":"JUIN!P18","v":0},{"$f":"JUIN!Q18","v":"M        VAR"},{"$f":"JUIN!R18","v":"SWE         VAR"},{"$f":"JUIN!S18","v":0},{"$f":"JUIN!T18","v":"SWE         VAR"},{"$f":"JUIN!U18","v":0},{"$f":"JUIN!V18","v":"SD       VAR"},23,null,{"$f":"JUIN!B18","v":"Sy"},{"$f":"JUIN!W18","v":0},{"$f":"JUIN!X18","v":0},{"$f":"JUIN!Y18","v":0},{"$f":"JUIN!Z18","v":"S SMDD"},{"$f":"JUIN!AA18","v":0},{"$f":"JUIN!AB18","v":0},{"$f":"JUIN!AC18","v":"M SMDD"},{"$f":"JUIN!AD18","v":"SWE SMDD"},{"$f":"JUIN!AE18","v":0},{"$f":"JUIN!AF18","v":"SWE SMDD"},{"$f":"JUIN!AG18","v":0},{"$f":"JUIN!AH18","v":0},{"$f":"JUIN!AI18","v":0},{"$f":"JUIN!AJ18","v":0},15,null,{"$f":"JUIN!B18","v":"Sy"},{"$f":"JUIN!AK18","v":0},{"$f":"JUIN!AL18","v":0},{"$f":"JUIN!AM18","v":0},{"$f":"JUIN!AN18","v":"S SMDD"},{"$f":"JUIN!AO18","v":0},{"$f":"JUIN!AP18","v":0},{"$f":"JUIN!AQ18","v":0},{"$f":"JUIN!AR18","v":0},{"$f":"JUIN!AS18","v":0},{"$f":"JUIN!AT18","v":"SWE SMDD"},{"$f":"JUIN!AU18","v":0},{"$f":"JUIN!AV18","v":0},{"$f":"JUIN!AW18","v":0},{"$f":"JUIN!AX18","v":0},7.5,null,{"$f":"JUIN!B18","v":"Sy"},{"$f":"JUIN!AY18","v":0},{"$f":"JUIN!AZ18","v":0},{"$f":"JUIN!BA18","v":0},{"$f":"JUIN!BB18","v":0},{"$f":"JUIN!BC18","v":0},{"$f":"JUIN!BD18","v":"S SMDD"},{"$f":"JUIN!BE18","v":"M SMDD"},{"$f":"JUIN!BF18","v":"S SMDD"},{"$f":"JUIN!BG18","v":0},{"$f":"JUIN!BH18","v":"SWE          SEM"},{"$f":"JUIN!BI18","v":0},{"$f":"JUIN!BJ18","v":"SWE SMDD"},{"$f":"#REF!","v":{"$error":"#REF!"}},{"$f":"#REF!","v":{"$error":"#REF!"}},18.5]
[{"$f":"JUIN!B19","v":" "},{"$f":"JUIN!I19","v":0},{"$f":"JUIN!J19","v":0},{"$f":"JUIN!K19","v":0},{"$f":"JUIN!L19","v":0},{"$f":"JUIN!M19","v":0},{"$f":"JUIN!N19","v":0},{"$f":"JUIN!O19","v":0},{"$f":"JUIN!P19","v":0},{"$f":"JUIN!Q19","v":0},{"$f":"JUIN!R19","v":0},{"$f":"JUIN!S19","v":0},{"$f":"JUIN!T19","v":0},{"$f":"JUIN!U19","v":0},{"$f":"JUIN!V19","v":0},0,null,{"$f":"JUIN!B19","v":" "},{"$f":"JUIN!W19","v":0},{"$f":"JUIN!X19","v":0},{"$f":"JUIN!Y19","v":0},{"$f":"JUIN!Z19","v":0},{"$f":"JUIN!AA19","v":0},{"$f":"JUIN!AB19","v":0},{"$f":"JUIN!AC19","v":0},{"$f":"JUIN!AD19","v":0},{"$f":"JUIN!AE19","v":0},{"$f":"JUIN!AF19","v":0},{"$f":"JUIN!AG19","v":0},{"$f":"JUIN!AH19","v":0},{"$f":"JUIN!AI19","v":0},{"$f":"JUIN!AJ19","v":0},0,null,{"$f":"JUIN!B19","v":" "},{"$f":"JUIN!AK19","v":0},{"$f":"JUIN!AL19","v":0},{"$f":"JUIN!AM19","v":0},{"$f":"JUIN!AN19","v":0},{"$f":"JUIN!AO19","v":0},{"$f":"JUIN!AP19","v":0},{"$f":"JUIN!AQ19","v":0},{"$f":"JUIN!AR19","v":0},{"$f":"JUIN!AS19","v":0},{"$f":"JUIN!AT19","v":0},{"$f":"JUIN!AU19","v":0},{"$f":"JUIN!AV19","v":0},{"$f":"JUIN!AW19","v":0},{"$f":"JUIN!AX19","v":0},0,null,{"$f":"JUIN!B19","v":" "},{"$f":"JUIN!AY19","v":0},{"$f":"JUIN!AZ19","v":0},{"$f":"JUIN!BA19","v":0},{"$f":"JUIN!BB19","v":0},{"$f":"JUIN!BC19","v":0},{"$f":"JUIN!BD19","v":0},{"$f":"JUIN!BE19","v":0},{"$f":"JUIN!BF19","v":0},{"$f":"JUIN!BG19","v":0},{"$f":"JUIN!BH19","v":0},{"$f":"JUIN!BI19","v":0},{"$f":"JUIN!BJ19","v":0},{"$f":"#REF!","v":{"$error":"#REF!"}},{"$f":"#REF!","v":{"$error":"#REF!"}},0]
[{"$f":"JUIN!B20","v":"H"},{"$f":"JUIN!I20","v":"M       SEM"},{"$f":"JUIN!J20","v":"S        SEM"},{"$f":"JUIN!K20","v":"M       SEM"},{"$f":"JUIN!L20","v":"S        SEM"},{"$f":"JUIN!M20","v":0},{"$f":"JUIN!N20","v":0},{"$f":"JUIN!O20","v":0},{"$f":"JUIN!P20","v":"S        SEM"},{"$f":"JUIN!Q20","v":"M       SEM"},{"$f":"JUIN!R20","v":"SWE          SEM"},{"$f":"JUIN!S20","v":0},{"$f":"JUIN!T20","v":"SWE          SEM"},{"$f":"JUIN!U20","v":0},{"$f":"JUIN!V20","v":"SD          SEM"},33.5,null,{"$f":"JUIN!B20","v":"H"},{"$f":"JUIN!W20","v":"M       SEM"},{"$f":"JUIN!X20","v":"S        SEM"},{"$f":"JUIN!Y20","v":"M       SEM"},{"$f":"JUIN!Z20","v":"S        SEM"},{"$f":"JUIN!AA20","v":0},{"$f":"JUIN!AB20","v":0},{"$f":"JUIN!AC20","v":0},{"$f":"JUIN!AD20","v":"S        SEM"},{"$f":"JUIN!AE20","v":"M       SEM"},{"$f":"JUIN!AF20","v":"SWE          SEM"},{"$f":"JUIN!AG20","v":0},{"$f":"JUIN!AH20","v":"SWE          SEM"},{"$f":"JUIN!AI20","v":0},{"$f":"JUIN!AJ20","v":"SD          SEM"},33.5,null,{"$f":"JUIN!B20","v":"H"},{"$f":"JUIN!AK20","v":"M       SEM"},{"$f":"JUIN!AL20","v":"S        SEM"},{"$f":"JUIN!AM20","v":"M       SEM"},{"$f":"JUIN!AN20","v":"S        SEM"},{"$f":"JUIN!AO20","v":0},{"$f":"JUIN!AP20","v":0},{"$f":"JUIN!AQ20","v":0},{"$f":"JUIN!AR20","v":"S        SEM"},{"$f":"JUIN!AS20","v":"M       SEM"},{"$f":"JUIN!AT20","v":"SWE          SEM"},{"$f":"JUIN!AU20","v":0},{"$f":"JUIN!AV20","v":"SWE          SEM"},{"$f":"JUIN!AW20","v":0},{"$f":"JUIN!AX20","v":"SD          SEM"},33.5,null,{"$f":"JUIN!B20","v":"H"},{"$f":"JUIN!AY20","v":"M       SEM"},{"$f":"JUIN!AZ20","v":"S        SEM"},{"$f":"JUIN!BA20","v":"M       SEM"},{"$f":"JUIN!BB20","v":"S        SEM"},{"$f":"JUIN!BC20","v":0},{"$f":"JUIN!BD20","v":0},{"$f":"JUIN!BE20","v":0},{"$f":"JUIN!BF20","v":"S        SEM"},{"$f":"JUIN!BG20","v":"M       SEM"},{"$f":"JUIN!BH20","v":"SWE          SEM"},{"$f":"JUIN!BI20","v":0},{"$f":"JUIN!BJ20","v":"SWE          SEM"},{"$f":"#REF!","v":{"$error":"#REF!"}},{"$f":"#REF!","v":{"$error":"#REF!"}},29]
[{"$f":"JUIN!B21","v":"T"},{"$f":"JUIN!I21","v":0},{"$f":"JUIN!J21","v":0},{"$f":"JUIN!K21","v":0},{"$f":"JUIN!L21","v":"S        SEM"},{"$f":"JUIN!M21","v":"M       SEM"},{"$f":"JUIN!N21","v":"S        SEM"},{"$f":"JUIN!O21","v":"M       SEM"},{"$f":"JUIN!P21","v":"S        SEM"},{"$f":"JUIN!Q21","v":0},{"$f":"JUIN!R21","v":"SWE          SEM"},{"$f":"JUIN!S21","v":"M       SEM"},{"$f":"JUIN!T21","v":"SWE          SEM"},{"$f":"JUIN!U21","v":0},{"$f":"JUIN!V21","v":"SD          SEM"},33.5,null,{"$f":"JUIN!B21","v":"T"},{"$f":"JUIN!W21","v":0},{"$f":"JUIN!X21","v":0},{"$f":"JUIN!Y21","v":0},{"$f":"JUIN!Z21","v":"S        SEM"},{"$f":"JUIN!AA21","v":"M       SEM"},{"$f":"JUIN!AB21","v":"S        SEM"},{"$f":"JUIN!AC21","v":"M       SEM"},{"$f":"JUIN!AD21","v":"S        SEM"},{"$f":"JUIN!AE21","v":0},{"$f":"JUIN!AF21","v":"SWE          SEM"},{"$f":"JUIN!AG21","v":"M       SEM"},{"$f":"JUIN!AH21","v":"SWE          SEM"},{"$f":"JUIN!AI21","v":0},{"$f":"JUIN!AJ21","v":"SD          SEM"},33.5,null,{"$f":"JUIN!B21","v":"T"},{"$f":"JUIN!AK21","v":0},{"$f":"JUIN!AL21","v":0},{"$f":"JUIN!AM21","v":0},{"$f":"JUIN!AN21","v":"S        SEM"},{"$f":"JUIN!AO21","v":"M       SEM"},{"$f":"JUIN!AP21","v":"S        SEM"},{"$f":"JUIN!AQ21","v":"M       SEM"},{"$f":"JUIN!AR21","v":"S        SEM"},{"$f":"JUIN!AS21","v":0},{"$f":"JUIN!AT21","v":"SWE          SEM"},{"$f":"JUIN!AU21","v":"M       SEM"},{"$f":"JUIN!AV21","v":"SWE          SEM"},{"$f":"JUIN!AW21","v":0},{"$f":"JUIN!AX21","v":"SD          SEM"},33.5,null,{"$f":"JUIN!B21","v":"T"},{"$f":"JUIN!AY21","v":0},{"$f":"JUIN!AZ21","v":0},{"$f":"JUIN!BA21","v":0},{"$f":"JUIN!BB21","v":"S        SEM"},{"$f":"JUIN!BC21","v":"M       SEM"},{"$f":"JUIN!BD21","v":"S        SEM"},{"$f":"JUIN!BE21","v":"M       SEM"},{"$f":"JUIN!BF21","v":"S        SEM"},{"$f":"JUIN!BG21","v":0},{"$f":"JUIN!BH21","v":"SWE          SEM"},{"$f":"JUIN!BI21","v":"M       SEM"},{"$f":"JUIN!BJ21","v":"SWE          SEM"},{"$f":"#REF!","v":{"$error":"#REF!"}},{"$f":"#REF!","v":{"$error":"#REF!"}},29]
[{"$f":"JUIN!B22","v":"S"},{"$f":"JUIN!I22","v":0},{"$f":"JUIN!J22","v":0},{"$f":"JUIN!K22","v":"M SMDD"},{"$f":"JUIN!L22","v":"S SMDD"},{"$f":"JUIN!M22","v":0},{"$f":"JUIN!N22","v":0},{"$f":"JUIN!O22","v":0},{"$f":"JUIN!P22","v":0},{"$f":"JUIN!Q22","v":0},{"$f":"JUIN!R22","v":0},{"$f":"JUIN!S22","v":0},{"$f":"JUIN!T22","v":0},{"$f":"JUIN!U22","v":0},{"$f":"JUIN!V22","v":0},7,null,{"$f":"JUIN!B22","v":"S"},{"$f":"JUIN!W22","v":0},{"$f":"JUIN!X22","v":0},{"$f":"JUIN!Y22","v":0},{"$f":"JUIN!Z22","v":0},{"$f":"JUIN!AA22","v":0},{"$f":"JUIN!AB22","v":0},{"$f":"JUIN!AC22","v":0},{"$f":"JUIN!AD22","v":0},{"$f":"JUIN!AE22","v":0},{"$f":"JUIN!AF22","v":0},{"$f":"JUIN!AG22","v":0},{"$f":"JUIN!AH22","v":0},{"$f":"JUIN!AI22","v":0},{"$f":"JUIN!AJ22","v":0},0,null,{"$f":"JUIN!B22","v":"S"},{"$f":"JUIN!AK22","v":0},{"$f":"JUIN!AL22","v":0},{"$f":"JUIN!AM22","v":0},{"$f":"JUIN!AN22","v":0},{"$f":"JUIN!AO22","v":0},{"$f":"JUIN!AP22","v":0},{"$f":"JUIN!AQ22","v":0},{"$f":"JUIN!AR22","v":0},{"$f":"JUIN!AS22","v":0},{"$f":"JUIN!AT22","v":0},{"$f":"JUIN!AU22","v":0},{"$f":"JUIN!AV22","v":0},{"$f":"JUIN!AW22","v":0},{"$f":"JUIN!AX22","v":0},0,null,{"$f":"JUIN!B22","v":"S"},{"$f":"JUIN!AY22","v":0},{"$f":"JUIN!AZ22","v":0},{"$f":"JUIN!BA22","v":0},{"$f":"JUIN!BB22","v":0},{"$f":"JUIN!BC22","v":0},{"$f":"JUIN!BD22","v":0},{"$f":"JUIN!BE22","v":0},{"$f":"JUIN!BF22","v":0},{"$f":"JUIN!BG22","v":0},{"$f":"JUIN!BH22","v":0},{"$f":"JUIN!BI22","v":0},{"$f":"JUIN!BJ22","v":0},{"$f":"#REF!","v":{"$error":"#REF!"}},{"$f":"#REF!","v":{"$error":"#REF!"}},0]

{"sheet":"NOVEMBRE","index":4,"n_rows":35,"n_cols":69,"rows_kept":35,"cut":false,"hidden":false,"merged":[[31,1,31,4],[31,6,31,7],[32,1,32,4],[32,6,32,7],[33,1,33,4],[33,6,33,7],[34,1,34,4],[34,6,34,7],[1,6,2,22],[7,2,7,3],[7,4,7,5],[7,6,7,7],[7,8,7,9],[7,10,7,11],[7,12,7,13],[1,32,1,35],[2,32,2,35],[6,2,6,3],[6,4,6,5],[6,6,6,7],[6,8,6,9],[6,10,6,11],[6,12,6,13],[6,14,6,15],[6,28,6,29],[6,30,6,31],[6,32,6,33],[6,34,6,35],[6,58,6,59],[6,60,6,61],[6,62,6,63],[6,40,6,41],[6,42,6,43],[6,44,6,45],[6,46,6,47],[6,48,6,49],[6,50,6,51],[6,52,6,53],[6,54,6,55],[6,56,6,57],[6,36,6,37],[6,38,6,39],[6,16,6,17],[6,18,6,19],[6,20,6,21],[6,22,6,23],[6,24,6,25],[6,26,6,27],[7,46,7,47],[7,48,7,49],[7,26,7,27],[7,28,7,29],[7,30,7,31],[7,32,7,33],[7,34,7,35],[7,36,7,37],[7,14,7,15],[7,16,7,17],[7,18,7,19],[7,20,7,21],[7,22,7,23],[7,24,7,25],[8,24,8,25],[8,26,8,27],[8,28,8,29],[8,30,8,31],[7,62,7,63],[8,2,8,3],[8,4,8,5],[8,6,8,7],[8,8,8,9],[8,10,8,11],[8,12,8,13],[8,14,8,15],[8,16,8,17],[8,18,8,19],[7,50,7,51],[7,52,7,53],[7,54,7,55],[7,56,7,57],[7,58,7,59],[7,60,7,61],[7,38,7,39],[7,40,7,41],[7,42,7,43],[7,44,7,45],[8,56,8,57],[8,58,8,59],[8,60,8,61],[8,62,8,63],[9,2,9,3],[9,4,9,5],[9,6,9,7],[9,8,9,9],[9,10,9,11],[9,12,9,13],[8,44,8,45],[8,46,8,47],[8,48,8,49],[8,50,8,51],[8,52,8,53],[8,54,8,55],[8,32,8,33],[8,34,8,35],[8,36,8,37],[8,38,8,39],[8,40,8,41],[8,42,8,43],[8,20,8,21],[8,22,8,23],[9,26,9,27],[9,28,9,29],[9,30,9,31],[9,32,9,33],[9,34,9,35],[9,36,9,37],[9,14,9,15],[9,16,9,17],[9,18,9,19],[9,20,9,21],[9,22,9,23],[9,24,9,25],[9,62,9,63],[9,50,9,51],[9,52,9,53],[9,54,9,55],[9,56,9,57],[9,58,9,59],[9,60,9,61],[9,38,9,39],[9,40,9,41],[9,42,9,43],[9,44,9,45],[9,46,9,47],[9,48,9,49]]}
[]
[null,2018,null,null,null,null,{"$f":"IF(AND(B2<>\"\",B3<>\"\"),\"Planning Kap \"&B3&\" de l'année \"&B2,\"\")","v":"Planning Kap Novembre de l'année 2018"},null,null,null,null,null,null,null,null,null,null,null,null,null,null,null,null,null,null,null,null,null,null,null,null,null,"JOURS FERIES"]
[null,"Novembre",null,null,null,null,null,null,null,null,null,null,null,null,null,null,null,null,null,null,null,null,null,null,null,null,null,null,null,null,null,null,"VACANCES SCO"]
[]
[null,"Matin"]
[]
[null,null,{"$f":"IF(C8=\"lundi \",\"S \"&WEEKNUM(C8,2),\"\")","v":""},null,{"$f":"IF(E9=\"lundi \",\"S \"&WEEKNUM(E8,2),\"\")","v":""},null,{"$f":"IF(G9=\"lundi \",\"S \"&WEEKNUM(G8,2),\"\")","v":""},null,{"$f":"IF(I9=\"lundi \",\"S \"&WEEKNUM(I8,2),\"\")","v":""},null,{"$f":"IF(K9=\"lundi \",\"S \"&WEEKNUM(K8,2),\"\")","v":"S 45"},null,{"$f":"IF(M9=\"lundi \",\"S \"&WEEKNUM(M8,2),\"\")","v":""},null,{"$f":"IF(O9=\"lundi \",\"S \"&WEEKNUM(O8,2),\"\")","v":""},null,{"$f":"IF(Q9=\"lundi \",\"S \"&WEEKNUM(Q8,2),\"\")","v":""},null,{"$f":"IF(S9=\"lundi \",\"S \"&WEEKNUM(S8,2),\"\")","v":""},null,{"$f":"IF(U9=\"lundi \",\"S \"&WEEKNUM(U8,2),\"\")","v":""},null,{"$f":"IF(W9=\"lundi \",\"S \"&WEEKNUM(W8,2),\"\")","v":""},null,{"$f":"IF(Y9=\"lundi \",\"S \"&WEEKNUM(Y8,2),\"\")","v":"S 46"},null,{"$f":"IF(AA9=\"lundi \",\"S \"&WEEKNUM(AA8,2),\"\")","v":""},null,{"$f":"IF(AC9=\"lundi \",\"S \"&WEEKNUM(AC8,2),\"\")","v":""},null,{"$f":"IF(AE9=\"lundi \",\"S \"&WEEKNUM(AE8,2),\"\")","v":""},null,{"$f":"IF(AG9=\"lundi \",\"S \"&WEEKNUM(AG8,2),\"\")","v":""},null,{"$f":"IF(AI9=\"lundi \",\"S \"&WEEKNUM(AI8,2),\"\")","v":""},null,{"$f":"IF(AK9=\"lundi \",\"S \"&WEEKNUM(AK8,2),\"\")","v":""},null,{"$f":"IF(AM9=\"lundi \",\"S \"&WEEKNUM(AM8,2),\"\")","v":"S 47"},null,{"$f":"IF(AO9=\"lundi \",\"S \"&WEEKNUM(AO8,2),\"\")","v":""},null,{"$f":"IF(AQ9=\"lundi \",\"S \"&WEEKNUM(AQ8,2),\"\")","v":""},null,{"$f":"IF(AS9=\"lundi \",\"S \"&WEEKNUM(AS8,2),\"\")","v":""},null,{"$f":"IF(AU9=\"lundi \",\"S \"&WEEKNUM(AU8,2),\"\")","v":""},null,{"$f":"IF(AW9=\"lundi \",\"S \"&WEEKNUM(AW8,2),\"\")","v":""},null,{"$f":"IF(AY9=\"lundi \",\"S \"&WEEKNUM(AY8,2),\"\")","v":""},null,{"$f":"IF(BA9=\"lundi \",\"S \"&WEEKNUM(BA8,2),\"\")","v":"S 48"},null,{"$f":"IF(BC9=\"lundi \",\"S \"&WEEKNUM(BC8,2),\"\")","v":""},null,{"$f":"IF(BE9=\"lundi \",\"S \"&WEEKNUM(BE8,2),\"\")","v":""},null,{"$f":"IF(BG9=\"lundi \",\"S \"&WEEKNUM(BG8,2),\"\")","v":""},null,{"$f":"IF(BI9=\"lundi \",\"S \"&WEEKNUM(BI8,2),\"\")","v":""},null,{"$f":"IF(BK9=\"lundi \",\"S \"&WEEKNUM(BK8,2),\"\")","v":""}]
[null,null,{"$f":"DATE($B$2,VLOOKUP($B$3,Sources!$C$2:$D$14,2,FALSE),Calendrier!C10)","v":"2018-11-01"},null,{"$f":"DATE($B$2,VLOOKUP($B$3,Sources!$C$2:$D$14,2,FALSE),Calendrier!E10)","v":"2018-11-02"},null,{"$f":"DATE($B$2,VLOOKUP($B$3,Sources!$C$2:$D$14,2,FALSE),Calendrier!G10)","v":"2018-11-03"},null,{"$f":"DATE($B$2,VLOOKUP($B$3,Sources!$C$2:$D$14,2,FALSE),Calendrier!I10)","v":"2018-11-04"},null,{"$f":"DATE($B$2,VLOOKUP($B$3,Sources!$C$2:$D$14,2,FALSE),Calendrier!K10)","v":"2018-11-05"},null,{"$f":"DATE($B$2,VLOOKUP($B$3,Sources!$C$2:$D$14,2,FALSE),Calendrier!M10)","v":"2018-11-06"},null,{"$f":"DATE($B$2,VLOOKUP($B$3,Sources!$C$2:$D$14,2,FALSE),Calendrier!O10)","v":"2018-11-07"},null,{"$f":"DATE($B$2,VLOOKUP($B$3,Sources!$C$2:$D$14,2,FALSE),Calendrier!Q10)","v":"2018-11-08"},null,{"$f":"DATE($B$2,VLOOKUP($B$3,Sources!$C$2:$D$14,2,FALSE),Calendrier!S10)","v":"2018-11-09"},null,{"$f":"DATE($B$2,VLOOKUP($B$3,Sources!$C$2:$D$14,2,FALSE),Calendrier!U10)","v":"2018-11-10"},null,{"$f":"DATE($B$2,VLOOKUP($B$3,Sources!$C$2:$D$14,2,FALSE),Calendrier!W10)","v":"2018-11-11"},null,{"$f":"DATE($B$2,VLOOKUP($B$3,Sources!$C$2:$D$14,2,FALSE),Calendrier!Y10)","v":"2018-11-12"},null,{"$f":"DATE($B$2,VLOOKUP($B$3,Sources!$C$2:$D$14,2,FALSE),Calendrier!AA10)","v":"2018-11-13"},null,{"$f":"DATE($B$2,VLOOKUP($B$3,Sources!$C$2:$D$14,2,FALSE),Calendrier!AC10)","v":"2018-11-14"},null,{"$f":"DATE($B$2,VLOOKUP($B$3,Sources!$C$2:$D$14,2,FALSE),Calendrier!AE10)","v":"2018-11-15"},null,{"$f":"DATE($B$2,VLOOKUP($B$3,Sources!$C$2:$D$14,2,FALSE),Calendrier!AG10)","v":"2018-11-16"},null,{"$f":"DATE($B$2,VLOOKUP($B$3,Sources!$C$2:$D$14,2,FALSE),Calendrier!AI10)","v":"2018-11-17"},null,{"$f":"DATE($B$2,VLOOKUP($B$3,Sources!$C$2:$D$14,2,FALSE),Calendrier!AK10)","v":"2018-11-18"},null,{"$f":"DATE($B$2,VLOOKUP($B$3,Sources!$C$2:$D$14,2,FALSE),Calendrier!AM10)","v":"2018-11-19"},null,{"$f":"DATE($B$2,VLOOKUP($B$3,Sources!$C$2:$D$14,2,FALSE),Calendrier!AO10)","v":"2018-11-20"},null,{"$f":"DATE($B$2,VLOOKUP($B$3,Sources!$C$2:$D$14,2,FALSE),Calendrier!AQ10)","v":"2018-11-21"},null,{"$f":"DATE($B$2,VLOOKUP($B$3,Sources!$C$2:$D$14,2,FALSE),Calendrier!AS10)","v":"2018-11-22"},null,{"$f":"DATE($B$2,VLOOKUP($B$3,Sources!$C$2:$D$14,2,FALSE),Calendrier!AU10)","v":"2018-11-23"},null,{"$f":"DATE($B$2,VLOOKUP($B$3,Sources!$C$2:$D$14,2,FALSE),Calendrier!AW10)","v":"2018-11-24"},null,{"$f":"DATE($B$2,VLOOKUP($B$3,Sources!$C$2:$D$14,2,FALSE),Calendrier!AY10)","v":"2018-11-25"},null,{"$f":"DATE($B$2,VLOOKUP($B$3,Sources!$C$2:$D$14,2,FALSE),Calendrier!BA10)","v":"2018-11-26"},null,{"$f":"DATE($B$2,VLOOKUP($B$3,Sources!$C$2:$D$14,2,FALSE),Calendrier!BC10)","v":"2018-11-27"},null,{"$f":"DATE($B$2,VLOOKUP($B$3,Sources!$C$2:$D$14,2,FALSE),Calendrier!BE10)","v":"2018-11-28"},null,{"$f":"DATE($B$2,VLOOKUP($B$3,Sources!$C$2:$D$14,2,FALSE),Calendrier!BG10)","v":"2018-11-29"},null,{"$f":"DATE($B$2,VLOOKUP($B$3,Sources!$C$2:$D$14,2,FALSE),Calendrier!BI10)","v":"2018-11-30"},null,{"$f":"DATE($B$2,VLOOKUP($B$3,Sources!$C$2:$D$14,2,FALSE),Calendrier!BK10)","v":"2018-12-01"}]
[null,null,{"$f":"IF(AND($B$2<>\"\",$B$3<>\"\"),TEXT(C8,\"jjjj\")&\" \",\"\")","v":"jeudi "},null,{"$f":"IF(AND($B$2<>\"\",$B$3<>\"\"),IF(MONTH(E8)=MONTH($C$8),TEXT(E8,\"jjjj\")&\" \",\"\"),\"\")","v":"vendredi "},null,{"$f":"IF(AND($B$2<>\"\",$B$3<>\"\"),IF(MONTH(G8)=MONTH($C$8),TEXT(G8,\"jjjj\")&\" \",\"\"),\"\")","v":"samedi "},null,{"$f":"IF(AND($B$2<>\"\",$B$3<>\"\"),IF(MONTH(I8)=MONTH($C$8),TEXT(I8,\"jjjj\")&\" \",\"\"),\"\")","v":"dimanche "},null,{"$f":"IF(AND($B$2<>\"\",$B$3<>\"\"),IF(MONTH(K8)=MONTH($C$8),TEXT(K8,\"jjjj\")&\" \",\"\"),\"\")","v":"lundi "},null,{"$f":"IF(AND($B$2<>\"\",$B$3<>\"\"),IF(MONTH(M8)=MONTH($C$8),TEXT(M8,\"jjjj\")&\" \",\"\"),\"\")","v":"mardi "},null,{"$f":"IF(AND($B$2<>\"\",$B$3<>\"\"),IF(MONTH(O8)=MONTH($C$8),TEXT(O8,\"jjjj\")&\" \",\"\"),\"\")","v":"mercredi "},null,{"$f":"IF(AND($B$2<>\"\",$B$3<>\"\"),IF(MONTH(Q8)=MONTH($C$8),TEXT(Q8,\"jjjj\")&\" \",\"\"),\"\")","v":"jeudi "},null,{"$f":"IF(AND($B$2<>\"\",$B$3<>\"\"),IF(MONTH(S8)=MONTH($C$8),TEXT(S8,\"jjjj\")&\" \",\"\"),\"\")","v":"vendredi "},null,{"$f":"IF(AND($B$2<>\"\",$B$3<>\"\"),IF(MONTH(U8)=MONTH($C$8),TEXT(U8,\"jjjj\")&\" \",\"\"),\"\")","v":"samedi "},null,{"$f":"IF(AND($B$2<>\"\",$B$3<>\"\"),IF(MONTH(W8)=MONTH($C$8),TEXT(W8,\"jjjj\")&\" \",\"\"),\"\")","v":"dimanche "},null,{"$f":"IF(AND($B$2<>\"\",$B$3<>\"\"),IF(MONTH(Y8)=MONTH($C$8),TEXT(Y8,\"jjjj\")&\" \",\"\"),\"\")","v":"lundi "},null,{"$f":"IF(AND($B$2<>\"\",$B$3<>\"\"),IF(MONTH(AA8)=MONTH($C$8),TEXT(AA8,\"jjjj\")&\" \",\"\"),\"\")","v":"mardi "},null,{"$f":"IF(AND($B$2<>\"\",$B$3<>\"\"),IF(MONTH(AC8)=MONTH($C$8),TEXT(AC8,\"jjjj\")&\" \",\"\"),\"\")","v":"mercredi "},null,{"$f":"IF(AND($B$2<>\"\",$B$3<>\"\"),IF(MONTH(AE8)=MONTH($C$8),TEXT(AE8,\"jjjj\")&\" \",\"\"),\"\")","v":"jeudi "},null,{"$f":"IF(AND($B$2<>\"\",$B$3<>\"\"),IF(MONTH(AG8)=MONTH($C$8),TEXT(AG8,\"jjjj\")&\" \",\"\"),\"\")","v":"vendredi "},null,{"$f":"IF(AND($B$2<>\"\",$B$3<>\"\"),IF(MONTH(AI8)=MONTH($C$8),TEXT(AI8,\"jjjj\")&\" \",\"\"),\"\")","v":"samedi "},null,{"$f":"IF(AND($B$2<>\"\",$B$3<>\"\"),IF(MONTH(AK8)=MONTH($C$8),TEXT(AK8,\"jjjj\")&\" \",\"\"),\"\")","v":"dimanche "},null,{"$f":"IF(AND($B$2<>\"\",$B$3<>\"\"),IF(MONTH(AM8)=MONTH($C$8),TEXT(AM8,\"jjjj\")&\" \",\"\"),\"\")","v":"lundi "},null,{"$f":"IF(AND($B$2<>\"\",$B$3<>\"\"),IF(MONTH(AO8)=MONTH($C$8),TEXT(AO8,\"jjjj\")&\" \",\"\"),\"\")","v":"mardi "},null,{"$f":"IF(AND($B$2<>\"\",$B$3<>\"\"),IF(MONTH(AQ8)=MONTH($C$8),TEXT(AQ8,\"jjjj\")&\" \",\"\"),\"\")","v":"mercredi "},null,{"$f":"IF(AND($B$2<>\"\",$B$3<>\"\"),IF(MONTH(AS8)=MONTH($C$8),TEXT(AS8,\"jjjj\")&\" \",\"\"),\"\")","v":"jeudi "},null,{"$f":"IF(AND($B$2<>\"\",$B$3<>\"\"),IF(MONTH(AU8)=MONTH($C$8),TEXT(AU8,\"jjjj\")&\" \",\"\"),\"\")","v":"vendredi "},null,{"$f":"IF(AND($B$2<>\"\",$B$3<>\"\"),IF(MONTH(AW8)=MONTH($C$8),TEXT(AW8,\"jjjj\")&\" \",\"\"),\"\")","v":"samedi "},null,{"$f":"IF(AND($B$2<>\"\",$B$3<>\"\"),IF(MONTH(AY8)=MONTH($C$8),TEXT(AY8,\"jjjj\")&\" \",\"\"),\"\")","v":"dimanche "},null,{"$f":"IF(AND($B$2<>\"\",$B$3<>\"\"),IF(MONTH(BA8)=MONTH($C$8),TEXT(BA8,\"jjjj\")&\" \",\"\"),\"\")","v":"lundi "},null,{"$f":"IF(AND($B$2<>\"\",$B$3<>\"\"),IF(MONTH(BC8)=MONTH($C$8),TEXT(BC8,\"jjjj\")&\" \",\"\"),\"\")","v":"mardi "},null,{"$f":"IF(AND($B$2<>\"\",$B$3<>\"\"),IF(MONTH(BE8)=MONTH($C$8),TEXT(BE8,\"jjjj\")&\" \",\"\"),\"\")","v":"mercredi "},null,{"$f":"IF(AND($B$2<>\"\",$B$3<>\"\"),IF(MONTH(BG8)=MONTH($C$8),TEXT(BG8,\"jjjj\")&\" \",\"\"),\"\")","v":"jeudi "},null,{"$f":"IF(AND($B$2<>\"\",$B$3<>\"\"),IF(MONTH(BI8)=MONTH($C$8),TEXT(BI8,\"jjjj\")&\" \",\"\"),\"\")","v":"vendredi "},null,{"$f":"IF(AND($B$2<>\"\",$B$3<>\"\"),IF(MONTH(BK8)=MONTH($C$8),TEXT(BK8,\"jjjj\")&\" \",\"\"),\"\")","v":""}]
[null,null,1,null,2,null,3,null,4,null,5,null,6,null,7,null,8,null,9,null,10,null,11,null,12,null,13,null,14,null,15,null,16,null,17,null,18,null,19,null,20,null,21,null,22,null,23,null,24,null,25,null,26,null,27,null,28,null,29,null,30,null,31,null,null,"total heures","Total congés"]
[null,{"$f":"IF($C$9<>\"\",Sources!H3,\"\")","v":"Jo"},null,null,null,null,null,null,null,null,null,null,null,null,null,null,null,null,null,null,null,null,null,null,null,null,null,null,null,null,null,null,null,null,null,null,null,null,null,null,null,null,null,null,null,null,null,null,null,null,null,null,null,null,null,null,null,null,null,null,null,null,null,null,null,{"$f":"SUMPRODUCT((COUNTIF(C11:BL11,typ))*(temps))","v":0},{"$f":"SUMPRODUCT((COUNTIF(C11:BL11,Sources!$B$35))*(Sources!$D$35))","v":0},null,"="]
[null,{"$f":"IF($C$9<>\"\",Sources!H4,\"\")","v":"Cha"},null,null,null,null,null,null,null,null,null,null,null,null,null,null,null,null,null,null,null,null,null,null,null,null,null,null,null,null,null,null,null,null,null,null,null,null,null,null,null,null,null,null,null,null,null,null,null,null,null,null,null,null,null,null,null,null,null,null,null,null,null,null,null,{"$f":"SUMPRODUCT((COUNTIF(C12:BL12,typ))*(temps))","v":0},{"$f":"SUMPRODUCT((COUNTIF(C12:BL12,Sources!$B$35))*(Sources!$D$35))","v":0}]
[null,{"$f":"IF($C$9<>\"\",Sources!H5,\"\")","v":"Jess"},null,null,null,null,null,null,null,null,null,null,null,null,null,null,null,null,null,null,null,null,null,null,null,null,null,null,null,null,null,null,null,null,null,null,null,null,null,null,null,null,null,null,null,null,null,null,null,null,null,null,null,null,null,null,null,null,null,null,null,null,null,null,null,0,{"$f":"SUMPRODUCT((COUNTIF(C13:BL13,Sources!$B$35))*(Sources!$D$35))","v":0}]
[null,{"$f":"IF($C$9<>\"\",Sources!H6,\"\")","v":"Alex"},null,null,null,null,null,null,null,null,null,null,null,null,null,null,null,null,null,null,null,null,null,null,null,null,null,null,null,null,null,null,null,null,null,null,null,null,null,null,null,null,null,null,null,null,null,null,null,null,null,null,null,null,null,null,null,null,null,null,null,null,null,null,null,0,{"$f":"SUMPRODUCT((COUNTIF(C14:BL14,Sources!$B$35))*(Sources!$D$35))","v":0}]
[null,{"$f":"IF($C$9<>\"\",Sources!H7,\"\")","v":"Op"},null,null,null,null,null,null,null,null,null,null,null,null,null,null,null,null,null,null,null,null,null,null,null,null,null,null,null,null,null,null,null,null,null,null,null,null,null,null,null,null,null,null,null,null,null,null,null,null,null,null,null,null,null,null,null,null,null,null,null,null,null,null,null,0,{"$f":"SUMPRODUCT((COUNTIF(C15:BL15,Sources!$B$35))*(Sources!$D$35))","v":0}]
[null,{"$f":"IF($C$9<>\"\",Sources!H8,\"\")","v":"De"},null,null,null,null,null,null,null,null,null,null,null,null,null,null,null,null,null,null,null,null,null,null,null,null,null,null,null,null,null,null,null,null,null,null,null,null,null,null,null,null,null,null,null,null,null,null,null,null,null,null,null,null,null,null,null,null,null,null,null,null,null,null,null,0,{"$f":"SUMPRODUCT((COUNTIF(C16:BL16,Sources!$B$35))*(Sources!$D$35))","v":0}]
[null,{"$f":"IF($C$9<>\"\",Sources!H9,\"\")","v":" "},null,null,null,null,null,null,null,null,null,null,null,null,null,null,null,null,null,null,null,null,null,null,null,null,null,null,null,null,null,null,null,null,null,null,null,null,null,null,null,null,null,null,null,null,null,null,null,null,null,null,null,null,null,null,null,null,null,null,null,null,null,null,null,0,{"$f":"SUMPRODUCT((COUNTIF(C17:BL17,Sources!$B$35))*(Sources!$D$35))","v":0}]
[null,{"$f":"IF($C$9<>\"\",Sources!H10,\"\")","v":"Sy"},null,null,null,null,null,null,null,null,null,null,null,null,null,null,null,null,null,null,null,null,null,null,null,null,null,null,null,null,null,null,null,null,null,null,null,null,null,null,null,null,null,null,null,null,null,null,null,null,null,null,null,null,null,null,null,null,null,null,null,null,null,null,null,0,{"$f":"SUMPRODUCT((COUNTIF(C18:BL18,Sources!$B$35))*(Sources!$D$35))","v":0}]
[null,{"$f":"IF($C$9<>\"\",Sources!H11,\"\")","v":" "},null,null,null,null,null,null,null,null,null,null,null,null,null,null,null,null,null,null,null,null,null,null,null,null,null,null,null,null,null,null,null,null,null,null,null,null,null,null,null,null,null,null,null,null,null,null,null,null,null,null,null,null,null,null,null,null,null,null,null,null,null,null,null,0,{"$f":"SUMPRODUCT((COUNTIF(C19:BL19,Sources!$B$35))*(Sources!$D$35))","v":0}]
[null,{"$f":"IF($C$9<>\"\",Sources!H12,\"\")","v":"H"},null,null,null,null,null,null,null,null,null,null,null,null,null,null,null,null,null,null,null,null,null,null,null,null,null,null,null,null,null,null,null,null,null,null,null,null,null,null,null,null,null,null,null,null,null,null,null,null,null,null,null,null,null,null,null,null,null,null,null,null,null,null,null,0,{"$f":"SUMPRODUCT((COUNTIF(C20:BL20,Sources!$B$35))*(Sources!$D$35))","v":0}]
[null,{"$f":"IF($C$9<>\"\",Sources!H13,\"\")","v":"T"},null,null,null,null,null,null,null,null,null,null,null,null,null,null,null,null,null,null,null,null,null,null,null,null,null,null,null,null,null,null,null,null,null,null,null,null,null,null,null,null,null,null,null,null,null,null,null,null,null,null,null,null,null,null,null,null,null,null,null,null,null,null,null,0,{"$f":"SUMPRODUCT((COUNTIF(C21:BL21,Sources!$B$35))*(Sources!$D$35))","v":0}]
[null,{"$f":"IF($C$9<>\"\",Sources!H14,\"\")","v":"S"},null,null,null,null,null,null,null,null,null,null,null,null,null,null,null,null,null,null,null,null,null,null,null,null,null,null,null,null,null,null,null,null,null,null,null,null,null,null,null,null,null,null,null,null,null,null,null,null,null,null,null,null,null,null,null,null,null,null,null,null,null,null,null,0,{"$f":"SUMPRODUCT((COUNTIF(C22:BL22,Sources!$B$35))*(Sources!$D$35))","v":0}]
[]
[]
[]
[]
[]
[]
[]
[]
[]
[null,"SAINT MARS DU DESERT",null,null,null,null,"M = 10h-13h30"]
[null,"VARADES",null,null,null,null,"S = 18h-21h30"]
[null,"SAINT ETIENNE DE MTLUC",null,null,null,null,"SWE = 18h-22h"]
[null,"CONGES",null,null,null,null,"SD = 17h30- 22h"]

{"sheet":"S45àS48","index":5,"n_rows":16,"n_cols":68,"rows_kept":16,"cut":false,"hidden":false,"merged":[[0,46,0,47],[0,48,0,49],[0,53,0,54],[0,55,0,56],[0,57,0,58],[0,29,0,30],[0,31,0,32],[0,36,0,37],[0,38,0,39],[0,40,0,41],[0,42,0,43],[1,2,1,3],[1,4,1,5],[1,6,1,7],[1,8,1,9],[1,10,1,11],[1,12,1,13],[1,14,1,15],[1,19,1,20],[0,44,0,45],[0,14,0,15],[0,19,0,20],[0,21,0,22],[0,23,0,24],[0,25,0,26],[0,27,0,28],[0,2,0,3],[0,4,0,5],[0,6,0,7],[0,8,0,9],[0,10,0,11],[0,12,0,13],[1,36,1,37],[1,38,1,39],[1,40,1,41],[1,42,1,43],[1,44,1,45],[1,46,1,47],[1,21,1,22],[1,23,1,24],[1,25,1,26],[1,27,1,28],[1,29,1,30],[1,31,1,32],[2,46,2,47],[2,48,2,49],[2,53,2,54],[2,55,2,56],[2,57,2,58],[2,29,2,30],[2,31,2,32],[2,36,2,37],[2,38,2,39],[2,40,2,41],[2,42,2,43],[3,2,3,3],[3,4,3,5],[3,6,3,7],[3,8,3,9],[3,10,3,11],[3,12,3,13],[3,14,3,15],[3,19,3,20],[2,44,2,45],[2,14,2,15],[2,19,2,20],[2,21,2,22],[2,23,2,24],[2,25,2,26],[2,27,2,28],[2,2,2,3],[2,4,2,5],[2,6,2,7],[2,8,2,9],[2,10,2,11],[2,12,2,13],[3,36,3,37],[3,38,3,39],[3,40,3,41],[3,42,3,43],[3,44,3,45],[3,46,3,47],[3,21,3,22],[3,23,3,24],[3,25,3,26],[3,27,3,28],[3,29,3,30],[3,31,3,32],[3,63,3,64],[3,65,3,66],[0,63,0,64],[0,65,0,66],[1,63,1,64],[1,65,1,66],[2,63,2,64],[2,65,2,66],[3,48,3,49],[3,53,3,54],[3,55,3,56],[3,57,3,58],[3,59,3,60],[3,61,3,62],[2,59,2,60],[2,61,2,62],[1,48,1,49],[1,53,1,54],[1,55,1,56],[1,57,1,58],[1,59,1,60],[1,61,1,62],[0,59,0,60],[0,61,0,62]]}
[null,null,{"$f":"NOVEMBRE!K7","v":"S 45"},null,{"$f":"NOVEMBRE!M7","v":""},null,{"$f":"NOVEMBRE!O7","v":""},null,{"$f":"NOVEMBRE!Q7","v":""},null,{"$f":"NOVEMBRE!S7","v":""},null,{"$f":"NOVEMBRE!U7","v":""},null,{"$f":"NOVEMBRE!W7","v":""},null,null,null,null,{"$f":"NOVEMBRE!Y7","v":"S 46"},null,{"$f":"NOVEMBRE!AA7","v":""},null,{"$f":"NOVEMBRE!AC7","v":""},null,{"$f":"NOVEMBRE!AE7","v":""},null,{"$f":"NOVEMBRE!AG7","v":""},null,{"$f":"NOVEMBRE!AI7","v":""},null,{"$f":"NOVEMBRE!AK7","v":""},null,null,null,null,{"$f":"NOVEMBRE!AM7","v":"S 47"},null,{"$f":"NOVEMBRE!AO7","v":""},null,{"$f":"NOVEMBRE!AQ7","v":""},null,{"$f":"NOVEMBRE!AS7","v":""},null,{"$f":"NOVEMBRE!AU7","v":""},null,{"$f":"NOVEMBRE!AW7","v":""},null,{"$f":"NOVEMBRE!AY7","v":""},null,null,null,null,{"$f":"NOVEMBRE!BA7","v":"S 48"},null,{"$f":"NOVEMBRE!BC7","v":""},null,{"$f":"NOVEMBRE!BE7","v":""},null,{"$f":"NOVEMBRE!BG7","v":""},null,{"$f":"NOVEMBRE!BI7","v":""},null,{"$f":"DECEMBRE!C7","v":""},null,{"$f":"DECEMBRE!E7","v":""}]
[null,null,{"$f":"NOVEMBRE!K8","v":"2018-11-05"},null,{"$f":"NOVEMBRE!M8","v":"2018-11-06"},null,{"$f":"NOVEMBRE!O8","v":"2018-11-07"},null,{"$f":"NOVEMBRE!Q8","v":"2018-11-08"},null,{"$f":"NOVEMBRE!S8","v":"2018-11-09"},null,{"$f":"NOVEMBRE!U8","v":"2018-11-10"},null,{"$f":"NOVEMBRE!W8","v":"2018-11-11"},null,null,null,null,{"$f":"NOVEMBRE!Y8","v":"2018-11-12"},null,{"$f":"NOVEMBRE!AA8","v":"2018-11-13"},null,{"$f":"NOVEMBRE!AC8","v":"2018-11-14"},null,{"$f":"NOVEMBRE!AE8","v":"2018-11-15"},null,{"$f":"NOVEMBRE!AG8","v":"2018-11-16"},null,{"$f":"NOVEMBRE!AI8","v":"2018-11-17"},null,{"$f":"NOVEMBRE!AK8","v":"2018-11-18"},null,null,null,null,{"$f":"NOVEMBRE!AM8","v":"2018-11-19"},null,{"$f":"NOVEMBRE!AO8","v":"2018-11-20"},null,{"$f":"NOVEMBRE!AQ8","v":"2018-11-21"},null,{"$f":"NOVEMBRE!AS8","v":"2018-11-22"},null,{"$f":"NOVEMBRE!AU8","v":"2018-11-23"},null,{"$f":"NOVEMBRE!AW8","v":"2018-11-24"},null,{"$f":"NOVEMBRE!AY8","v":"2018-11-25"},null,null,null,null,{"$f":"NOVEMBRE!BA8","v":"2018-11-26"},null,{"$f":"NOVEMBRE!BC8","v":"2018-11-27"},null,{"$f":"NOVEMBRE!BE8","v":"2018-11-28"},null,{"$f":"NOVEMBRE!BG8","v":"2018-11-29"},null,{"$f":"NOVEMBRE!BI8","v":"2018-11-30"},null,{"$f":"DECEMBRE!C8","v":"2018-12-01"},null,{"$f":"DECEMBRE!E8","v":"2018-12-02"}]
[null,null,{"$f":"NOVEMBRE!K9","v":"lundi "},null,{"$f":"NOVEMBRE!M9","v":"mardi "},null,{"$f":"NOVEMBRE!O9","v":"mercredi "},null,{"$f":"NOVEMBRE!Q9","v":"jeudi "},null,{"$f":"NOVEMBRE!S9","v":"vendredi "},null,{"$f":"NOVEMBRE!U9","v":"samedi "},null,{"$f":"NOVEMBRE!W9","v":"dimanche "},null,null,null,null,{"$f":"NOVEMBRE!Y9","v":"lundi "},null,{"$f":"NOVEMBRE!AA9","v":"mardi "},null,{"$f":"NOVEMBRE!AC9","v":"mercredi "},null,{"$f":"NOVEMBRE!AE9","v":"jeudi "},null,{"$f":"NOVEMBRE!AG9","v":"vendredi "},null,{"$f":"NOVEMBRE!AI9","v":"samedi "},null,{"$f":"NOVEMBRE!AK9","v":"dimanche "},null,null,null,null,{"$f":"NOVEMBRE!AM9","v":"lundi "},null,{"$f":"NOVEMBRE!AO9","v":"mardi "},null,{"$f":"NOVEMBRE!AQ9","v":"mercredi "},null,{"$f":"NOVEMBRE!AS9","v":"jeudi "},null,{"$f":"NOVEMBRE!AU9","v":"vendredi "},null,{"$f":"NOVEMBRE!AW9","v":"samedi "},null,{"$f":"NOVEMBRE!AY9","v":"dimanche "},null,null,null,null,{"$f":"NOVEMBRE!BA9","v":"lundi "},null,{"$f":"NOVEMBRE!BC9","v":"mardi "},null,{"$f":"NOVEMBRE!BE9","v":"mercredi "},null,{"$f":"NOVEMBRE!BG9","v":"jeudi "},null,{"$f":"NOVEMBRE!BI9","v":"vendredi "},null,{"$f":"DECEMBRE!C9","v":"samedi "},null,{"$f":"DECEMBRE!E9","v":"dimanche "}]
[null,null,{"$f":"NOVEMBRE!K10","v":5},null,{"$f":"NOVEMBRE!M10","v":6},null,{"$f":"NOVEMBRE!O10","v":7},null,{"$f":"NOVEMBRE!Q10","v":8},null,{"$f":"NOVEMBRE!S10","v":9},null,{"$f":"NOVEMBRE!U10","v":10},null,{"$f":"NOVEMBRE!W10","v":11},null,null,null,null,{"$f":"NOVEMBRE!Y10","v":12},null,{"$f":"NOVEMBRE!AA10","v":13},null,{"$f":"NOVEMBRE!AC10","v":14},null,{"$f":"NOVEMBRE!AE10","v":15},null,{"$f":"NOVEMBRE!AG10","v":16},null,{"$f":"NOVEMBRE!AI10","v":17},null,{"$f":"NOVEMBRE!AK10","v":18},null,null,null,null,{"$f":"NOVEMBRE!AM10","v":19},null,{"$f":"NOVEMBRE!AO10","v":20},null,{"$f":"NOVEMBRE!AQ10","v":21},null,{"$f":"NOVEMBRE!AS10","v":22},null,{"$f":"NOVEMBRE!AU10","v":23},null,{"$f":"NOVEMBRE!AW10","v":24},null,{"$f":"NOVEMBRE!AY10","v":25},null,null,null,null,{"$f":"NOVEMBRE!BA10","v":26},null,{"$f":"NOVEMBRE!BC10","v":27},null,{"$f":"NOVEMBRE!BE10","v":28},null,{"$f":"NOVEMBRE!BG10","v":29},null,{"$f":"NOVEMBRE!BI10","v":30},null,{"$f":"DECEMBRE!C10","v":1},null,{"$f":"DECEMBRE!E10","v":2}]
[null,{"$f":"NOVEMBRE!B11","v":"Jo"},{"$f":"NOVEMBRE!K11","v":0},{"$f":"NOVEMBRE!L11","v":0},{"$f":"NOVEMBRE!M11","v":0},{"$f":"NOVEMBRE!N11","v":0},{"$f":"NOVEMBRE!O11","v":0},{"$f":"NOVEMBRE!P11","v":0},{"$f":"NOVEMBRE!Q11","v":0},{"$f":"NOVEMBRE!R11","v":0},{"$f":"NOVEMBRE!S11","v":0},{"$f":"NOVEMBRE!T11","v":0},{"$f":"NOVEMBRE!U11","v":0},{"$f":"NOVEMBRE!V11","v":0},{"$f":"NOVEMBRE!W11","v":0},{"$f":"NOVEMBRE!X11","v":0},{"$f":"SUMPRODUCT(COUNTIF(C5:P5,typ)*(temps))","v":0},null,{"$f":"NOVEMBRE!B11","v":"Jo"},{"$f":"NOVEMBRE!Y11","v":0},{"$f":"NOVEMBRE!Z11","v":0},{"$f":"NOVEMBRE!AA11","v":0},{"$f":"NOVEMBRE!AB11","v":0},{"$f":"NOVEMBRE!AC11","v":0},{"$f":"NOVEMBRE!AD11","v":0},{"$f":"NOVEMBRE!AE11","v":0},{"$f":"NOVEMBRE!AF11","v":0},{"$f":"NOVEMBRE!AG11","v":0},{"$f":"NOVEMBRE!AH11","v":0},{"$f":"NOVEMBRE!AI11","v":0},{"$f":"NOVEMBRE!AJ11","v":0},{"$f":"NOVEMBRE!AK11","v":0},{"$f":"NOVEMBRE!AL11","v":0},{"$f":"SUMPRODUCT(COUNTIF(T5:AG5,typ)*(temps))","v":0},null,{"$f":"NOVEMBRE!B11","v":"Jo"},{"$f":"NOVEMBRE!AM11","v":0},{"$f":"NOVEMBRE!AN11","v":0},{"$f":"NOVEMBRE!AO11","v":0},{"$f":"NOVEMBRE!AP11","v":0},{"$f":"NOVEMBRE!AQ11","v":0},{"$f":"NOVEMBRE!AR11","v":0},{"$f":"NOVEMBRE!AS11","v":0},{"$f":"NOVEMBRE!AT11","v":0},{"$f":"NOVEMBRE!AU11","v":0},{"$f":"NOVEMBRE!AV11","v":0},{"$f":"NOVEMBRE!AW11","v":0},{"$f":"NOVEMBRE!AX11","v":0},{"$f":"NOVEMBRE!AY11","v":0},{"$f":"NOVEMBRE!AZ11","v":0},{"$f":"SUMPRODUCT(COUNTIF(AK5:AX5,typ)*(temps))","v":0},null,{"$f":"NOVEMBRE!B11","v":"Jo"},{"$f":"NOVEMBRE!BA11","v":0},{"$f":"NOVEMBRE!BB11","v":0},{"$f":"NOVEMBRE!BC11","v":0},{"$f":"NOVEMBRE!BD11","v":0},{"$f":"NOVEMBRE!BE11","v":0},{"$f":"NOVEMBRE!BF11","v":0},{"$f":"NOVEMBRE!BG11","v":0},{"$f":"NOVEMBRE!BH11","v":0},{"$f":"NOVEMBRE!BI11","v":0},{"$f":"NOVEMBRE!BJ11","v":0},{"$f":"DECEMBRE!C11","v":0},{"$f":"DECEMBRE!D11","v":0},{"$f":"DECEMBRE!E11","v":0},{"$f":"DECEMBRE!F11","v":0},{"$f":"SUMPRODUCT(COUNTIF(BB5:BO5,typ)*(temps))","v":0}]
[null,{"$f":"NOVEMBRE!B12","v":"Cha"},{"$f":"NOVEMBRE!K12","v":0},{"$f":"NOVEMBRE!L12","v":0},{"$f":"NOVEMBRE!M12","v":0},{"$f":"NOVEMBRE!N12","v":0},{"$f":"NOVEMBRE!O12","v":0},{"$f":"NOVEMBRE!P12","v":0},{"$f":"NOVEMBRE!Q12","v":0},{"$f":"NOVEMBRE!R12","v":0},{"$f":"NOVEMBRE!S12","v":0},{"$f":"NOVEMBRE!T12","v":0},{"$f":"NOVEMBRE!U12","v":0},{"$f":"NOVEMBRE!V12","v":0},{"$f":"NOVEMBRE!W12","v":0},{"$f":"NOVEMBRE!X12","v":0},0,null,{"$f":"NOVEMBRE!B12","v":"Cha"},{"$f":"NOVEMBRE!Y12","v":0},{"$f":"NOVEMBRE!Z12","v":0},{"$f":"NOVEMBRE!AA12","v":0},{"$f":"NOVEMBRE!AB12","v":0},{"$f":"NOVEMBRE!AC12","v":0},{"$f":"NOVEMBRE!AD12","v":0},{"$f":"NOVEMBRE!AE12","v":0},{"$f":"NOVEMBRE!AF12","v":0},{"$f":"NOVEMBRE!AG12","v":0},{"$f":"NOVEMBRE!AH12","v":0},{"$f":"NOVEMBRE!AI12","v":0},{"$f":"NOVEMBRE!AJ12","v":0},{"$f":"NOVEMBRE!AK12","v":0},{"$f":"NOVEMBRE!AL12","v":0},0,null,{"$f":"NOVEMBRE!B12","v":"Cha"},{"$f":"NOVEMBRE!AM12","v":0},{"$f":"NOVEMBRE!AN12","v":0},{"$f":"NOVEMBRE!AO12","v":0},{"$f":"NOVEMBRE!AP12","v":0},{"$f":"NOVEMBRE!AQ12","v":0},{"$f":"NOVEMBRE!AR12","v":0},{"$f":"NOVEMBRE!AS12","v":0},{"$f":"NOVEMBRE!AT12","v":0},{"$f":"NOVEMBRE!AU12","v":0},{"$f":"NOVEMBRE!AV12","v":0},{"$f":"NOVEMBRE!AW12","v":0},{"$f":"NOVEMBRE!AX12","v":0},{"$f":"NOVEMBRE!AY12","v":0},{"$f":"NOVEMBRE!AZ12","v":0},0,null,{"$f":"NOVEMBRE!B12","v":"Cha"},{"$f":"NOVEMBRE!BA12","v":0},{"$f":"NOVEMBRE!BB12","v":0},{"$f":"NOVEMBRE!BC12","v":0},{"$f":"NOVEMBRE!BD12","v":0},{"$f":"NOVEMBRE!BE12","v":0},{"$f":"NOVEMBRE!BF12","v":0},{"$f":"NOVEMBRE!BG12","v":0},{"$f":"NOVEMBRE!BH12","v":0},{"$f":"NOVEMBRE!BI12","v":0},{"$f":"NOVEMBRE!BJ12","v":0},{"$f":"DECEMBRE!C12","v":0},{"$f":"DECEMBRE!D12","v":0},{"$f":"DECEMBRE!E12","v":0},{"$f":"DECEMBRE!F12","v":0},0]
[null,{"$f":"NOVEMBRE!B13","v":"Jess"},{"$f":"NOVEMBRE!K13","v":0},{"$f":"NOVEMBRE!L13","v":0},{"$f":"NOVEMBRE!M13","v":0},{"$f":"NOVEMBRE!N13","v":0},{"$f":"NOVEMBRE!O13","v":0},{"$f":"NOVEMBRE!P13","v":0},{"$f":"NOVEMBRE!Q13","v":0},{"$f":"NOVEMBRE!R13","v":0},{"$f":"NOVEMBRE!S13","v":0},{"$f":"NOVEMBRE!T13","v":0},{"$f":"NOVEMBRE!U13","v":0},{"$f":"NOVEMBRE!V13","v":0},{"$f":"NOVEMBRE!W13","v":0},{"$f":"NOVEMBRE!X13","v":0},0,null,{"$f":"NOVEMBRE!B13","v":"Jess"},{"$f":"NOVEMBRE!Y13","v":0},{"$f":"NOVEMBRE!Z13","v":0},{"$f":"NOVEMBRE!AA13","v":0},{"$f":"NOVEMBRE!AB13","v":0},{"$f":"NOVEMBRE!AC13","v":0},{"$f":"NOVEMBRE!AD13","v":0},{"$f":"NOVEMBRE!AE13","v":0},{"$f":"NOVEMBRE!AF13","v":0},{"$f":"NOVEMBRE!AG13","v":0},{"$f":"NOVEMBRE!AH13","v":0},{"$f":"NOVEMBRE!AI13","v":0},{"$f":"NOVEMBRE!AJ13","v":0},{"$f":"NOVEMBRE!AK13","v":0},{"$f":"NOVEMBRE!AL13","v":0},0,null,{"$f":"NOVEMBRE!B13","v":"Jess"},{"$f":"NOVEMBRE!AM13","v":0},{"$f":"NOVEMBRE!AN13","v":0},{"$f":"NOVEMBRE!AO13","v":0},{"$f":"NOVEMBRE!AP13","v":0},{"$f":"NOVEMBRE!AQ13","v":0},{"$f":"NOVEMBRE!AR13","v":0},{"$f":"NOVEMBRE!AS13","v":0},{"$f":"NOVEMBRE!AT13","v":0},{"$f":"NOVEMBRE!AU13","v":0},{"$f":"NOVEMBRE!AV13","v":0},{"$f":"NOVEMBRE!AW13","v":0},{"$f":"NOVEMBRE!AX13","v":0},{"$f":"NOVEMBRE!AY13","v":0},{"$f":"NOVEMBRE!AZ13","v":0},0,null,{"$f":"NOVEMBRE!B13","v":"Jess"},{"$f":"NOVEMBRE!BA13","v":0},{"$f":"NOVEMBRE!BB13","v":0},{"$f":"NOVEMBRE!BC13","v":0},{"$f":"NOVEMBRE!BD13","v":0},{"$f":"NOVEMBRE!BE13","v":0},{"$f":"NOVEMBRE!BF13","v":0},{"$f":"NOVEMBRE!BG13","v":0},{"$f":"NOVEMBRE!BH13","v":0},{"$f":"NOVEMBRE!BI13","v":0},{"$f":"NOVEMBRE!BJ13","v":0},{"$f":"DECEMBRE!C13","v":0},{"$f":"DECEMBRE!D13","v":0},{"$f":"DECEMBRE!E13","v":0},{"$f":"DECEMBRE!F13","v":0},0]
[null,{"$f":"NOVEMBRE!B14","v":"Alex"},{"$f":"NOVEMBRE!K14","v":0},{"$f":"NOVEMBRE!L14","v":0},{"$f":"NOVEMBRE!M14","v":0},{"$f":"NOVEMBRE!N14","v":0},{"$f":"NOVEMBRE!O14","v":0},{"$f":"NOVEMBRE!P14","v":0},{"$f":"NOVEMBRE!Q14","v":0},{"$f":"NOVEMBRE!R14","v":0},{"$f":"NOVEMBRE!S14","v":0},{"$f":"NOVEMBRE!T14","v":0},{"$f":"NOVEMBRE!U14","v":0},{"$f":"NOVEMBRE!V14","v":0},{"$f":"NOVEMBRE!W14","v":0},{"$f":"NOVEMBRE!X14","v":0},0,null,{"$f":"NOVEMBRE!B14","v":"Alex"},{"$f":"NOVEMBRE!Y14","v":0},{"$f":"NOVEMBRE!Z14","v":0},{"$f":"NOVEMBRE!AA14","v":0},{"$f":"NOVEMBRE!AB14","v":0},{"$f":"NOVEMBRE!AC14","v":0},{"$f":"NOVEMBRE!AD14","v":0},{"$f":"NOVEMBRE!AE14","v":0},{"$f":"NOVEMBRE!AF14","v":0},{"$f":"NOVEMBRE!AG14","v":0},{"$f":"NOVEMBRE!AH14","v":0},{"$f":"NOVEMBRE!AI14","v":0},{"$f":"NOVEMBRE!AJ14","v":0},{"$f":"NOVEMBRE!AK14","v":0},{"$f":"NOVEMBRE!AL14","v":0},0,null,{"$f":"NOVEMBRE!B14","v":"Alex"},{"$f":"NOVEMBRE!AM14","v":0},{"$f":"NOVEMBRE!AN14","v":0},{"$f":"NOVEMBRE!AO14","v":0},{"$f":"NOVEMBRE!AP14","v":0},{"$f":"NOVEMBRE!AQ14","v":0},{"$f":"NOVEMBRE!AR14","v":0},{"$f":"NOVEMBRE!AS14","v":0},{"$f":"NOVEMBRE!AT14","v":0},{"$f":"NOVEMBRE!AU14","v":0},{"$f":"NOVEMBRE!AV14","v":0},{"$f":"NOVEMBRE!AW14","v":0},{"$f":"NOVEMBRE!AX14","v":0},{"$f":"NOVEMBRE!AY14","v":0},{"$f":"NOVEMBRE!AZ14","v":0},0,null,{"$f":"NOVEMBRE!B14","v":"Alex"},{"$f":"NOVEMBRE!BA14","v":0},{"$f":"NOVEMBRE!BB14","v":0},{"$f":"NOVEMBRE!BC14","v":0},{"$f":"NOVEMBRE!BD14","v":0},{"$f":"NOVEMBRE!BE14","v":0},{"$f":"NOVEMBRE!BF14","v":0},{"$f":"NOVEMBRE!BG14","v":0},{"$f":"NOVEMBRE!BH14","v":0},{"$f":"NOVEMBRE!BI14","v":0},{"$f":"NOVEMBRE!BJ14","v":0},{"$f":"DECEMBRE!C14","v":0},{"$f":"DECEMBRE!D14","v":0},{"$f":"DECEMBRE!E14","v":0},{"$f":"DECEMBRE!F14","v":0},0]
[null,{"$f":"NOVEMBRE!B15","v":"Op"},{"$f":"NOVEMBRE!K15","v":0},{"$f":"NOVEMBRE!L15","v":0},{"$f":"NOVEMBRE!M15","v":0},{"$f":"NOVEMBRE!N15","v":0},{"$f":"NOVEMBRE!O15","v":0},{"$f":"NOVEMBRE!P15","v":0},{"$f":"NOVEMBRE!Q15","v":0},{"$f":"NOVEMBRE!R15","v":0},{"$f":"NOVEMBRE!S15","v":0},{"$f":"NOVEMBRE!T15","v":0},{"$f":"NOVEMBRE!U15","v":0},{"$f":"NOVEMBRE!V15","v":0},{"$f":"NOVEMBRE!W15","v":0},{"$f":"NOVEMBRE!X15","v":0},0,null,{"$f":"NOVEMBRE!B15","v":"Op"},{"$f":"NOVEMBRE!Y15","v":0},{"$f":"NOVEMBRE!Z15","v":0},{"$f":"NOVEMBRE!AA15","v":0},{"$f":"NOVEMBRE!AB15","v":0},{"$f":"NOVEMBRE!AC15","v":0},{"$f":"NOVEMBRE!AD15","v":0},{"$f":"NOVEMBRE!AE15","v":0},{"$f":"NOVEMBRE!AF15","v":0},{"$f":"NOVEMBRE!AG15","v":0},{"$f":"NOVEMBRE!AH15","v":0},{"$f":"NOVEMBRE!AI15","v":0},{"$f":"NOVEMBRE!AJ15","v":0},{"$f":"NOVEMBRE!AK15","v":0},{"$f":"NOVEMBRE!AL15","v":0},0,null,{"$f":"NOVEMBRE!B15","v":"Op"},{"$f":"NOVEMBRE!AM15","v":0},{"$f":"NOVEMBRE!AN15","v":0},{"$f":"NOVEMBRE!AO15","v":0},{"$f":"NOVEMBRE!AP15","v":0},{"$f":"NOVEMBRE!AQ15","v":0},{"$f":"NOVEMBRE!AR15","v":0},{"$f":"NOVEMBRE!AS15","v":0},{"$f":"NOVEMBRE!AT15","v":0},{"$f":"NOVEMBRE!AU15","v":0},{"$f":"NOVEMBRE!AV15","v":0},{"$f":"NOVEMBRE!AW15","v":0},{"$f":"NOVEMBRE!AX15","v":0},{"$f":"NOVEMBRE!AY15","v":0},{"$f":"NOVEMBRE!AZ15","v":0},0,null,{"$f":"NOVEMBRE!B15","v":"Op"},{"$f":"NOVEMBRE!BA15","v":0},{"$f":"NOVEMBRE!BB15","v":0},{"$f":"NOVEMBRE!BC15","v":0},{"$f":"NOVEMBRE!BD15","v":0},{"$f":"NOVEMBRE!BE15","v":0},{"$f":"NOVEMBRE!BF15","v":0},{"$f":"NOVEMBRE!BG15","v":0},{"$f":"NOVEMBRE!BH15","v":0},{"$f":"NOVEMBRE!BI15","v":0},{"$f":"NOVEMBRE!BJ15","v":0},{"$f":"DECEMBRE!C15","v":0},{"$f":"DECEMBRE!D15","v":0},{"$f":"DECEMBRE!E15","v":0},{"$f":"DECEMBRE!F15","v":0},0]
[null,{"$f":"NOVEMBRE!B16","v":"De"},{"$f":"NOVEMBRE!K16","v":0},{"$f":"NOVEMBRE!L16","v":0},{"$f":"NOVEMBRE!M16","v":0},{"$f":"NOVEMBRE!N16","v":0},{"$f":"NOVEMBRE!O16","v":0},{"$f":"NOVEMBRE!P16","v":0},{"$f":"NOVEMBRE!Q16","v":0},{"$f":"NOVEMBRE!R16","v":0},{"$f":"NOVEMBRE!S16","v":0},{"$f":"NOVEMBRE!T16","v":0},{"$f":"NOVEMBRE!U16","v":0},{"$f":"NOVEMBRE!V16","v":0},{"$f":"NOVEMBRE!W16","v":0},{"$f":"NOVEMBRE!X16","v":0},0,null,{"$f":"NOVEMBRE!B16","v":"De"},{"$f":"NOVEMBRE!Y16","v":0},{"$f":"NOVEMBRE!Z16","v":0},{"$f":"NOVEMBRE!AA16","v":0},{"$f":"NOVEMBRE!AB16","v":0},{"$f":"NOVEMBRE!AC16","v":0},{"$f":"NOVEMBRE!AD16","v":0},{"$f":"NOVEMBRE!AE16","v":0},{"$f":"NOVEMBRE!AF16","v":0},{"$f":"NOVEMBRE!AG16","v":0},{"$f":"NOVEMBRE!AH16","v":0},{"$f":"NOVEMBRE!AI16","v":0},{"$f":"NOVEMBRE!AJ16","v":0},{"$f":"NOVEMBRE!AK16","v":0},{"$f":"NOVEMBRE!AL16","v":0},0,null,{"$f":"NOVEMBRE!B16","v":"De"},{"$f":"NOVEMBRE!AM16","v":0},{"$f":"NOVEMBRE!AN16","v":0},{"$f":"NOVEMBRE!AO16","v":0},{"$f":"NOVEMBRE!AP16","v":0},{"$f":"NOVEMBRE!AQ16","v":0},{"$f":"NOVEMBRE!AR16","v":0},{"$f":"NOVEMBRE!AS16","v":0},{"$f":"NOVEMBRE!AT16","v":0},{"$f":"NOVEMBRE!AU16","v":0},{"$f":"NOVEMBRE!AV16","v":0},{"$f":"NOVEMBRE!AW16","v":0},{"$f":"NOVEMBRE!AX16","v":0},{"$f":"NOVEMBRE!AY16","v":0},{"$f":"NOVEMBRE!AZ16","v":0},0,null,{"$f":"NOVEMBRE!B16","v":"De"},{"$f":"NOVEMBRE!BA16","v":0},{"$f":"NOVEMBRE!BB16","v":0},{"$f":"NOVEMBRE!BC16","v":0},{"$f":"NOVEMBRE!BD16","v":0},{"$f":"NOVEMBRE!BE16","v":0},{"$f":"NOVEMBRE!BF16","v":0},{"$f":"NOVEMBRE!BG16","v":0},{"$f":"NOVEMBRE!BH16","v":0},{"$f":"NOVEMBRE!BI16","v":0},{"$f":"NOVEMBRE!BJ16","v":0},{"$f":"DECEMBRE!C16","v":0},{"$f":"DECEMBRE!D16","v":0},{"$f":"DECEMBRE!E16","v":0},{"$f":"DECEMBRE!F16","v":0},0]
[null,{"$f":"NOVEMBRE!B17","v":" "},{"$f":"NOVEMBRE!K17","v":0},{"$f":"NOVEMBRE!L17","v":0},{"$f":"NOVEMBRE!M17","v":0},{"$f":"NOVEMBRE!N17","v":0},{"$f":"NOVEMBRE!O17","v":0},{"$f":"NOVEMBRE!P17","v":0},{"$f":"NOVEMBRE!Q17","v":0},{"$f":"NOVEMBRE!R17","v":0},{"$f":"NOVEMBRE!S17","v":0},{"$f":"NOVEMBRE!T17","v":0},{"$f":"NOVEMBRE!U17","v":0},{"$f":"NOVEMBRE!V17","v":0},{"$f":"NOVEMBRE!W17","v":0},{"$f":"NOVEMBRE!X17","v":0},0,null,{"$f":"NOVEMBRE!B17","v":" "},{"$f":"NOVEMBRE!Y17","v":0},{"$f":"NOVEMBRE!Z17","v":0},{"$f":"NOVEMBRE!AA17","v":0},{"$f":"NOVEMBRE!AB17","v":0},{"$f":"NOVEMBRE!AC17","v":0},{"$f":"NOVEMBRE!AD17","v":0},{"$f":"NOVEMBRE!AE17","v":0},{"$f":"NOVEMBRE!AF17","v":0},{"$f":"NOVEMBRE!AG17","v":0},{"$f":"NOVEMBRE!AH17","v":0},{"$f":"NOVEMBRE!AI17","v":0},{"$f":"NOVEMBRE!AJ17","v":0},{"$f":"NOVEMBRE!AK17","v":0},{"$f":"NOVEMBRE!AL17","v":0},0,null,{"$f":"NOVEMBRE!B17","v":" "},{"$f":"NOVEMBRE!AM17","v":0},{"$f":"NOVEMBRE!AN17","v":0},{"$f":"NOVEMBRE!AO17","v":0},{"$f":"NOVEMBRE!AP17","v":0},{"$f":"NOVEMBRE!AQ17","v":0},{"$f":"NOVEMBRE!AR17","v":0},{"$f":"NOVEMBRE!AS17","v":0},{"$f":"NOVEMBRE!AT17","v":0},{"$f":"NOVEMBRE!AU17","v":0},{"$f":"NOVEMBRE!AV17","v":0},{"$f":"NOVEMBRE!AW17","v":0},{"$f":"NOVEMBRE!AX17","v":0},{"$f":"NOVEMBRE!AY17","v":0},{"$f":"NOVEMBRE!AZ17","v":0},0,null,{"$f":"NOVEMBRE!B17","v":" "},{"$f":"NOVEMBRE!BA17","v":0},{"$f":"NOVEMBRE!BB17","v":0},{"$f":"NOVEMBRE!BC17","v":0},{"$f":"NOVEMBRE!BD17","v":0},{"$f":"NOVEMBRE!BE17","v":0},{"$f":"NOVEMBRE!BF17","v":0},{"$f":"NOVEMBRE!BG17","v":0},{"$f":"NOVEMBRE!BH17","v":0},{"$f":"NOVEMBRE!BI17","v":0},{"$f":"NOVEMBRE!BJ17","v":0},{"$f":"DECEMBRE!C17","v":0},{"$f":"DECEMBRE!D17","v":0},{"$f":"DECEMBRE!E17","v":0},{"$f":"DECEMBRE!F17","v":0},0]
[null,{"$f":"NOVEMBRE!B18","v":"Sy"},{"$f":"NOVEMBRE!K18","v":0},{"$f":"NOVEMBRE!L18","v":0},{"$f":"NOVEMBRE!M18","v":0},{"$f":"NOVEMBRE!N18","v":0},{"$f":"NOVEMBRE!O18","v":0},{"$f":"NOVEMBRE!P18","v":0},{"$f":"NOVEMBRE!Q18","v":0},{"$f":"NOVEMBRE!R18","v":0},{"$f":"NOVEMBRE!S18","v":0},{"$f":"NOVEMBRE!T18","v":0},{"$f":"NOVEMBRE!U18","v":0},{"$f":"NOVEMBRE!V18","v":0},{"$f":"NOVEMBRE!W18","v":0},{"$f":"NOVEMBRE!X18","v":0},0,null,{"$f":"NOVEMBRE!B18","v":"Sy"},{"$f":"NOVEMBRE!Y18","v":0},{"$f":"NOVEMBRE!Z18","v":0},{"$f":"NOVEMBRE!AA18","v":0},{"$f":"NOVEMBRE!AB18","v":0},{"$f":"NOVEMBRE!AC18","v":0},{"$f":"NOVEMBRE!AD18","v":0},{"$f":"NOVEMBRE!AE18","v":0},{"$f":"NOVEMBRE!AF18","v":0},{"$f":"NOVEMBRE!AG18","v":0},{"$f":"NOVEMBRE!AH18","v":0},{"$f":"NOVEMBRE!AI18","v":0},{"$f":"NOVEMBRE!AJ18","v":0},{"$f":"NOVEMBRE!AK18","v":0},{"$f":"NOVEMBRE!AL18","v":0},0,null,{"$f":"NOVEMBRE!B18","v":"Sy"},{"$f":"NOVEMBRE!AM18","v":0},{"$f":"NOVEMBRE!AN18","v":0},{"$f":"NOVEMBRE!AO18","v":0},{"$f":"NOVEMBRE!AP18","v":0},{"$f":"NOVEMBRE!AQ18","v":0},{"$f":"NOVEMBRE!AR18","v":0},{"$f":"NOVEMBRE!AS18","v":0},{"$f":"NOVEMBRE!AT18","v":0},{"$f":"NOVEMBRE!AU18","v":0},{"$f":"NOVEMBRE!AV18","v":0},{"$f":"NOVEMBRE!AW18","v":0},{"$f":"NOVEMBRE!AX18","v":0},{"$f":"NOVEMBRE!AY18","v":0},{"$f":"NOVEMBRE!AZ18","v":0},0,null,{"$f":"NOVEMBRE!B18","v":"Sy"},{"$f":"NOVEMBRE!BA18","v":0},{"$f":"NOVEMBRE!BB18","v":0},{"$f":"NOVEMBRE!BC18","v":0},{"$f":"NOVEMBRE!BD18","v":0},{"$f":"NOVEMBRE!BE18","v":0},{"$f":"NOVEMBRE!BF18","v":0},{"$f":"NOVEMBRE!BG18","v":0},{"$f":"NOVEMBRE!BH18","v":0},{"$f":"NOVEMBRE!BI18","v":0},{"$f":"NOVEMBRE!BJ18","v":0},{"$f":"DECEMBRE!C18","v":0},{"$f":"DECEMBRE!D18","v":0},{"$f":"DECEMBRE!E18","v":0},{"$f":"DECEMBRE!F18","v":0},0]
[null,{"$f":"NOVEMBRE!B19","v":" "},{"$f":"NOVEMBRE!K19","v":0},{"$f":"NOVEMBRE!L19","v":0},{"$f":"NOVEMBRE!M19","v":0},{"$f":"NOVEMBRE!N19","v":0},{"$f":"NOVEMBRE!O19","v":0},{"$f":"NOVEMBRE!P19","v":0},{"$f":"NOVEMBRE!Q19","v":0},{"$f":"NOVEMBRE!R19","v":0},{"$f":"NOVEMBRE!S19","v":0},{"$f":"NOVEMBRE!T19","v":0},{"$f":"NOVEMBRE!U19","v":0},{"$f":"NOVEMBRE!V19","v":0},{"$f":"NOVEMBRE!W19","v":0},{"$f":"NOVEMBRE!X19","v":0},0,null,{"$f":"NOVEMBRE!B19","v":" "},{"$f":"NOVEMBRE!Y19","v":0},{"$f":"NOVEMBRE!Z19","v":0},{"$f":"NOVEMBRE!AA19","v":0},{"$f":"NOVEMBRE!AB19","v":0},{"$f":"NOVEMBRE!AC19","v":0},{"$f":"NOVEMBRE!AD19","v":0},{"$f":"NOVEMBRE!AE19","v":0},{"$f":"NOVEMBRE!AF19","v":0},{"$f":"NOVEMBRE!AG19","v":0},{"$f":"NOVEMBRE!AH19","v":0},{"$f":"NOVEMBRE!AI19","v":0},{"$f":"NOVEMBRE!AJ19","v":0},{"$f":"NOVEMBRE!AK19","v":0},{"$f":"NOVEMBRE!AL19","v":0},0,null,{"$f":"NOVEMBRE!B19","v":" "},{"$f":"NOVEMBRE!AM19","v":0},{"$f":"NOVEMBRE!AN19","v":0},{"$f":"NOVEMBRE!AO19","v":0},{"$f":"NOVEMBRE!AP19","v":0},{"$f":"NOVEMBRE!AQ19","v":0},{"$f":"NOVEMBRE!AR19","v":0},{"$f":"NOVEMBRE!AS19","v":0},{"$f":"NOVEMBRE!AT19","v":0},{"$f":"NOVEMBRE!AU19","v":0},{"$f":"NOVEMBRE!AV19","v":0},{"$f":"NOVEMBRE!AW19","v":0},{"$f":"NOVEMBRE!AX19","v":0},{"$f":"NOVEMBRE!AY19","v":0},{"$f":"NOVEMBRE!AZ19","v":0},0,null,{"$f":"NOVEMBRE!B19","v":" "},{"$f":"NOVEMBRE!BA19","v":0},{"$f":"NOVEMBRE!BB19","v":0},{"$f":"NOVEMBRE!BC19","v":0},{"$f":"NOVEMBRE!BD19","v":0},{"$f":"NOVEMBRE!BE19","v":0},{"$f":"NOVEMBRE!BF19","v":0},{"$f":"NOVEMBRE!BG19","v":0},{"$f":"NOVEMBRE!BH19","v":0},{"$f":"NOVEMBRE!BI19","v":0},{"$f":"NOVEMBRE!BJ19","v":0},{"$f":"DECEMBRE!C19","v":0},{"$f":"DECEMBRE!D19","v":0},{"$f":"DECEMBRE!E19","v":0},{"$f":"DECEMBRE!F19","v":0},0]
[null,{"$f":"NOVEMBRE!B20","v":"H"},{"$f":"NOVEMBRE!K20","v":0},{"$f":"NOVEMBRE!L20","v":0},{"$f":"NOVEMBRE!M20","v":0},{"$f":"NOVEMBRE!N20","v":0},{"$f":"NOVEMBRE!O20","v":0},{"$f":"NOVEMBRE!P20","v":0},{"$f":"NOVEMBRE!Q20","v":0},{"$f":"NOVEMBRE!R20","v":0},{"$f":"NOVEMBRE!S20","v":0},{"$f":"NOVEMBRE!T20","v":0},{"$f":"NOVEMBRE!U20","v":0},{"$f":"NOVEMBRE!V20","v":0},{"$f":"NOVEMBRE!W20","v":0},{"$f":"NOVEMBRE!X20","v":0},0,null,{"$f":"NOVEMBRE!B20","v":"H"},{"$f":"NOVEMBRE!Y20","v":0},{"$f":"NOVEMBRE!Z20","v":0},{"$f":"NOVEMBRE!AA20","v":0},{"$f":"NOVEMBRE!AB20","v":0},{"$f":"NOVEMBRE!AC20","v":0},{"$f":"NOVEMBRE!AD20","v":0},{"$f":"NOVEMBRE!AE20","v":0},{"$f":"NOVEMBRE!AF20","v":0},{"$f":"NOVEMBRE!AG20","v":0},{"$f":"NOVEMBRE!AH20","v":0},{"$f":"NOVEMBRE!AI20","v":0},{"$f":"NOVEMBRE!AJ20","v":0},{"$f":"NOVEMBRE!AK20","v":0},{"$f":"NOVEMBRE!AL20","v":0},0,null,{"$f":"NOVEMBRE!B20","v":"H"},{"$f":"NOVEMBRE!AM20","v":0},{"$f":"NOVEMBRE!AN20","v":0},{"$f":"NOVEMBRE!AO20","v":0},{"$f":"NOVEMBRE!AP20","v":0},{"$f":"NOVEMBRE!AQ20","v":0},{"$f":"NOVEMBRE!AR20","v":0},{"$f":"NOVEMBRE!AS20","v":0},{"$f":"NOVEMBRE!AT20","v":0},{"$f":"NOVEMBRE!AU20","v":0},{"$f":"NOVEMBRE!AV20","v":0},{"$f":"NOVEMBRE!AW20","v":0},{"$f":"NOVEMBRE!AX20","v":0},{"$f":"NOVEMBRE!AY20","v":0},{"$f":"NOVEMBRE!AZ20","v":0},0,null,{"$f":"NOVEMBRE!B20","v":"H"},{"$f":"NOVEMBRE!BA20","v":0},{"$f":"NOVEMBRE!BB20","v":0},{"$f":"NOVEMBRE!BC20","v":0},{"$f":"NOVEMBRE!BD20","v":0},{"$f":"NOVEMBRE!BE20","v":0},{"$f":"NOVEMBRE!BF20","v":0},{"$f":"NOVEMBRE!BG20","v":0},{"$f":"NOVEMBRE!BH20","v":0},{"$f":"NOVEMBRE!BI20","v":0},{"$f":"NOVEMBRE!BJ20","v":0},{"$f":"DECEMBRE!C20","v":0},{"$f":"DECEMBRE!D20","v":0},{"$f":"DECEMBRE!E20","v":0},{"$f":"DECEMBRE!F20","v":0},0]
[null,{"$f":"NOVEMBRE!B21","v":"T"},{"$f":"NOVEMBRE!K21","v":0},{"$f":"NOVEMBRE!L21","v":0},{"$f":"NOVEMBRE!M21","v":0},{"$f":"NOVEMBRE!N21","v":0},{"$f":"NOVEMBRE!O21","v":0},{"$f":"NOVEMBRE!P21","v":0},{"$f":"NOVEMBRE!Q21","v":0},{"$f":"NOVEMBRE!R21","v":0},{"$f":"NOVEMBRE!S21","v":0},{"$f":"NOVEMBRE!T21","v":0},{"$f":"NOVEMBRE!U21","v":0},{"$f":"NOVEMBRE!V21","v":0},{"$f":"NOVEMBRE!W21","v":0},{"$f":"NOVEMBRE!X21","v":0},0,null,{"$f":"NOVEMBRE!B21","v":"T"},{"$f":"NOVEMBRE!Y21","v":0},{"$f":"NOVEMBRE!Z21","v":0},{"$f":"NOVEMBRE!AA21","v":0},{"$f":"NOVEMBRE!AB21","v":0},{"$f":"NOVEMBRE!AC21","v":0},{"$f":"NOVEMBRE!AD21","v":0},{"$f":"NOVEMBRE!AE21","v":0},{"$f":"NOVEMBRE!AF21","v":0},{"$f":"NOVEMBRE!AG21","v":0},{"$f":"NOVEMBRE!AH21","v":0},{"$f":"NOVEMBRE!AI21","v":0},{"$f":"NOVEMBRE!AJ21","v":0},{"$f":"NOVEMBRE!AK21","v":0},{"$f":"NOVEMBRE!AL21","v":0},0,null,{"$f":"NOVEMBRE!B21","v":"T"},{"$f":"NOVEMBRE!AM21","v":0},{"$f":"NOVEMBRE!AN21","v":0},{"$f":"NOVEMBRE!AO21","v":0},{"$f":"NOVEMBRE!AP21","v":0},{"$f":"NOVEMBRE!AQ21","v":0},{"$f":"NOVEMBRE!AR21","v":0},{"$f":"NOVEMBRE!AS21","v":0},{"$f":"NOVEMBRE!AT21","v":0},{"$f":"NOVEMBRE!AU21","v":0},{"$f":"NOVEMBRE!AV21","v":0},{"$f":"NOVEMBRE!AW21","v":0},{"$f":"NOVEMBRE!AX21","v":0},{"$f":"NOVEMBRE!AY21","v":0},{"$f":"NOVEMBRE!AZ21","v":0},0,null,{"$f":"NOVEMBRE!B21","v":"T"},{"$f":"NOVEMBRE!BA21","v":0},{"$f":"NOVEMBRE!BB21","v":0},{"$f":"NOVEMBRE!BC21","v":0},{"$f":"NOVEMBRE!BD21","v":0},{"$f":"NOVEMBRE!BE21","v":0},{"$f":"NOVEMBRE!BF21","v":0},{"$f":"NOVEMBRE!BG21","v":0},{"$f":"NOVEMBRE!BH21","v":0},{"$f":"NOVEMBRE!BI21","v":0},{"$f":"NOVEMBRE!BJ21","v":0},{"$f":"DECEMBRE!C21","v":0},{"$f":"DECEMBRE!D21","v":0},{"$f":"DECEMBRE!E21","v":0},{"$f":"DECEMBRE!F21","v":0},0]
[null,{"$f":"NOVEMBRE!B22","v":"S"},{"$f":"NOVEMBRE!K22","v":0},{"$f":"NOVEMBRE!L22","v":0},{"$f":"NOVEMBRE!M22","v":0},{"$f":"NOVEMBRE!N22","v":0},{"$f":"NOVEMBRE!O22","v":0},{"$f":"NOVEMBRE!P22","v":0},{"$f":"NOVEMBRE!Q22","v":0},{"$f":"NOVEMBRE!R22","v":0},{"$f":"NOVEMBRE!S22","v":0},{"$f":"NOVEMBRE!T22","v":0},{"$f":"NOVEMBRE!U22","v":0},{"$f":"NOVEMBRE!V22","v":0},{"$f":"NOVEMBRE!W22","v":0},{"$f":"NOVEMBRE!X22","v":0},0,null,{"$f":"NOVEMBRE!B22","v":"S"},{"$f":"NOVEMBRE!Y22","v":0},{"$f":"NOVEMBRE!Z22","v":0},{"$f":"NOVEMBRE!AA22","v":0},{"$f":"NOVEMBRE!AB22","v":0},{"$f":"NOVEMBRE!AC22","v":0},{"$f":"NOVEMBRE!AD22","v":0},{"$f":"NOVEMBRE!AE22","v":0},{"$f":"NOVEMBRE!AF22","v":0},{"$f":"NOVEMBRE!AG22","v":0},{"$f":"NOVEMBRE!AH22","v":0},{"$f":"NOVEMBRE!AI22","v":0},{"$f":"NOVEMBRE!AJ22","v":0},{"$f":"NOVEMBRE!AK22","v":0},{"$f":"NOVEMBRE!AL22","v":0},0,null,{"$f":"NOVEMBRE!B22","v":"S"},{"$f":"NOVEMBRE!AM22","v":0},{"$f":"NOVEMBRE!AN22","v":0},{"$f":"NOVEMBRE!AO22","v":0},{"$f":"NOVEMBRE!AP22","v":0},{"$f":"NOVEMBRE!AQ22","v":0},{"$f":"NOVEMBRE!AR22","v":0},{"$f":"NOVEMBRE!AS22","v":0},{"$f":"NOVEMBRE!AT22","v":0},{"$f":"NOVEMBRE!AU22","v":0},{"$f":"NOVEMBRE!AV22","v":0},{"$f":"NOVEMBRE!AW22","v":0},{"$f":"NOVEMBRE!AX22","v":0},{"$f":"NOVEMBRE!AY22","v":0},{"$f":"NOVEMBRE!AZ22","v":0},0,null,{"$f":"NOVEMBRE!B22","v":"S"},{"$f":"NOVEMBRE!BA22","v":0},{"$f":"NOVEMBRE!BB22","v":0},{"$f":"NOVEMBRE!BC22","v":0},{"$f":"NOVEMBRE!BD22","v":0},{"$f":"NOVEMBRE!BE22","v":0},{"$f":"NOVEMBRE!BF22","v":0},{"$f":"NOVEMBRE!BG22","v":0},{"$f":"NOVEMBRE!BH22","v":0},{"$f":"NOVEMBRE!BI22","v":0},{"$f":"NOVEMBRE!BJ22","v":0},{"$f":"DECEMBRE!C22","v":0},{"$f":"DECEMBRE!D22","v":0},{"$f":"DECEMBRE!E22","v":0},{"$f":"DECEMBRE!F22","v":0},0]

{"sheet":"DECEMBRE","index":6,"n_rows":37,"n_cols":69,"rows_kept":37,"cut":false,"hidden":false,"merged":[[33,1,33,4],[33,6,33,7],[34,1,34,4],[34,6,34,7],[35,1,35,4],[35,6,35,7],[36,1,36,4],[36,6,36,7],[1,6,2,22],[7,2,7,3],[7,4,7,5],[7,6,7,7],[7,8,7,9],[7,10,7,11],[7,12,7,13],[1,32,1,35],[2,32,2,35],[6,2,6,3],[6,4,6,5],[6,6,6,7],[6,8,6,9],[6,10,6,11],[6,12,6,13],[6,14,6,15],[6,28,6,29],[6,30,6,31],[6,32,6,33],[6,34,6,35],[6,58,6,59],[6,60,6,61],[6,62,6,63],[6,40,6,41],[6,42,6,43],[6,44,6,45],[6,46,6,47],[6,48,6,49],[6,50,6,51],[6,52,6,53],[6,54,6,55],[6,56,6,57],[6,36,6,37],[6,38,6,39],[6,16,6,17],[6,18,6,19],[6,20,6,21],[6,22,6,23],[6,24,6,25],[6,26,6,27],[7,46,7,47],[7,48,7,49],[7,26,7,27],[7,28,7,29],[7,30,7,31],[7,32,7,33],[7,34,7,35],[7,36,7,37],[7,14,7,15],[7,16,7,17],[7,18,7,19],[7,20,7,21],[7,22,7,23],[7,24,7,25],[8,24,8,25],[8,26,8,27],[8,28,8,29],[8,30,8,31],[7,62,7,63],[8,2,8,3],[8,4,8,5],[8,6,8,7],[8,8,8,9],[8,10,8,11],[8,12,8,13],[8,14,8,15],[8,16,8,17],[8,18,8,19],[7,50,7,51],[7,52,7,53],[7,54,7,55],[7,56,7,57],[7,58,7,59],[7,60,7,61],[7,38,7,39],[7,40,7,41],[7,42,7,43],[7,44,7,45],[8,56,8,57],[8,58,8,59],[8,60,8,61],[8,62,8,63],[9,2,9,3],[9,4,9,5],[9,6,9,7],[9,8,9,9],[9,10,9,11],[9,12,9,13],[8,44,8,45],[8,46,8,47],[8,48,8,49],[8,50,8,51],[8,52,8,53],[8,54,8,55],[8,32,8,33],[8,34,8,35],[8,36,8,37],[8,38,8,39],[8,40,8,41],[8,42,8,43],[8,20,8,21],[8,22,8,23],[9,26,9,27],[9,28,9,29],[9,30,9,31],[9,32,9,33],[9,34,9,35],[9,36,9,37],[9,14,9,15],[9,16,9,17],[9,18,9,19],[9,20,9,21],[9,22,9,23],[9,24,9,25],[9,62,9,63],[9,50,9,51],[9,52,9,53],[9,54,9,55],[9,56,9,57],[9,58,9,59],[9,60,9,61],[9,38,9,39],[9,40,9,41],[9,42,9,43],[9,44,9,45],[9,46,9,47],[9,48,9,49]]}
[]
[null,2018,null,null,null,null,{"$f":"IF(AND(B2<>\"\",B3<>\"\"),\"Planning Kap \"&B3&\" de l'année \"&B2,\"\")","v":"Planning Kap Décembre de l'année 2018"},null,null,null,null,null,null,null,null,null,null,null,null,null,null,null,null,null,null,null,null,null,null,null,null,null,"JOURS FERIES"]
[null,"Décembre",null,null,null,null,null,null,null,null,null,null,null,null,null,null,null,null,null,null,null,null,null,null,null,null,null,null,null,null,null,null,"VACANCES SCO"]
[]
[null,"Matin"]
[]
[null,null,{"$f":"IF(C8=\"lundi \",\"S \"&WEEKNUM(C8,2),\"\")","v":""},null,{"$f":"IF(E9=\"lundi \",\"S \"&WEEKNUM(E8,2),\"\")","v":""},null,{"$f":"IF(G9=\"lundi \",\"S \"&WEEKNUM(G8,2),\"\")","v":"S 49"},null,{"$f":"IF(I9=\"lundi \",\"S \"&WEEKNUM(I8,2),\"\")","v":""},null,{"$f":"IF(K9=\"lundi \",\"S \"&WEEKNUM(K8,2),\"\")","v":""},null,{"$f":"IF(M9=\"lundi \",\"S \"&WEEKNUM(M8,2),\"\")","v":""},null,{"$f":"IF(O9=\"lundi \",\"S \"&WEEKNUM(O8,2),\"\")","v":""},null,{"$f":"IF(Q9=\"lundi \",\"S \"&WEEKNUM(Q8,2),\"\")","v":""},null,{"$f":"IF(S9=\"lundi \",\"S \"&WEEKNUM(S8,2),\"\")","v":""},null,{"$f":"IF(U9=\"lundi \",\"S \"&WEEKNUM(U8,2),\"\")","v":"S 50"},null,{"$f":"IF(W9=\"lundi \",\"S \"&WEEKNUM(W8,2),\"\")","v":""},null,{"$f":"IF(Y9=\"lundi \",\"S \"&WEEKNUM(Y8,2),\"\")","v":""},null,{"$f":"IF(AA9=\"lundi \",\"S \"&WEEKNUM(AA8,2),\"\")","v":""},null,{"$f":"IF(AC9=\"lundi \",\"S \"&WEEKNUM(AC8,2),\"\")","v":""},null,{"$f":"IF(AE9=\"lundi \",\"S \"&WEEKNUM(AE8,2),\"\")","v":""},null,{"$f":"IF(AG9=\"lundi \",\"S \"&WEEKNUM(AG8,2),\"\")","v":""},null,{"$f":"IF(AI9=\"lundi \",\"S \"&WEEKNUM(AI8,2),\"\")","v":"S 51"},null,{"$f":"IF(AK9=\"lundi \",\"S \"&WEEKNUM(AK8,2),\"\")","v":""},null,{"$f":"IF(AM9=\"lundi \",\"S \"&WEEKNUM(AM8,2),\"\")","v":""},null,{"$f":"IF(AO9=\"lundi \",\"S \"&WEEKNUM(AO8,2),\"\")","v":""},null,{"$f":"IF(AQ9=\"lundi \",\"S \"&WEEKNUM(AQ8,2),\"\")","v":""},null,{"$f":"IF(AS9=\"lundi \",\"S \"&WEEKNUM(AS8,2),\"\")","v":""},null,{"$f":"IF(AU9=\"lundi \",\"S \"&WEEKNUM(AU8,2),\"\")","v":""},null,{"$f":"IF(AW9=\"lundi \",\"S \"&WEEKNUM(AW8,2),\"\")","v":"S 52"},null,{"$f":"IF(AY9=\"lundi \",\"S \"&WEEKNUM(AY8,2),\"\")","v":""},null,{"$f":"IF(BA9=\"lundi \",\"S \"&WEEKNUM(BA8,2),\"\")","v":""},null,{"$f":"IF(BC9=\"lundi \",\"S \"&WEEKNUM(BC8,2),\"\")","v":""},null,{"$f":"IF(BE9=\"lundi \",\"S \"&WEEKNUM(BE8,2),\"\")","v":""},null,{"$f":"IF(BG9=\"lundi \",\"S \"&WEEKNUM(BG8,2),\"\")","v":""},null,{"$f":"IF(BI9=\"lundi \",\"S \"&WEEKNUM(BI8,2),\"\")","v":""},null,{"$f":"IF(BK9=\"lundi \",\"S \"&WEEKNUM(BK8,2),\"\")","v":"S 53"}]
[null,null,{"$f":"DATE($B$2,VLOOKUP($B$3,Sources!$C$2:$D$14,2,FALSE),Calendrier!C10)","v":"2018-12-01"},null,{"$f":"DATE($B$2,VLOOKUP($B$3,Sources!$C$2:$D$14,2,FALSE),Calendrier!E10)","v":"2018-12-02"},null,{"$f":"DATE($B$2,VLOOKUP($B$3,Sources!$C$2:$D$14,2,FALSE),Calendrier!G10)","v":"2018-12-03"},null,{"$f":"DATE($B$2,VLOOKUP($B$3,Sources!$C$2:$D$14,2,FALSE),Calendrier!I10)","v":"2018-12-04"},null,{"$f":"DATE($B$2,VLOOKUP($B$3,Sources!$C$2:$D$14,2,FALSE),Calendrier!K10)","v":"2018-12-05"},null,{"$f":"DATE($B$2,VLOOKUP($B$3,Sources!$C$2:$D$14,2,FALSE),Calendrier!M10)","v":"2018-12-06"},null,{"$f":"DATE($B$2,VLOOKUP($B$3,Sources!$C$2:$D$14,2,FALSE),Calendrier!O10)","v":"2018-12-07"},null,{"$f":"DATE($B$2,VLOOKUP($B$3,Sources!$C$2:$D$14,2,FALSE),Calendrier!Q10)","v":"2018-12-08"},null,{"$f":"DATE($B$2,VLOOKUP($B$3,Sources!$C$2:$D$14,2,FALSE),Calendrier!S10)","v":"2018-12-09"},null,{"$f":"DATE($B$2,VLOOKUP($B$3,Sources!$C$2:$D$14,2,FALSE),Calendrier!U10)","v":"2018-12-10"},null,{"$f":"DATE($B$2,VLOOKUP($B$3,Sources!$C$2:$D$14,2,FALSE),Calendrier!W10)","v":"2018-12-11"},null,{"$f":"DATE($B$2,VLOOKUP($B$3,Sources!$C$2:$D$14,2,FALSE),Calendrier!Y10)","v":"2018-12-12"},null,{"$f":"DATE($B$2,VLOOKUP($B$3,Sources!$C$2:$D$14,2,FALSE),Calendrier!AA10)","v":"2018-12-13"},null,{"$f":"DATE($B$2,VLOOKUP($B$3,Sources!$C$2:$D$14,2,FALSE),Calendrier!AC10)","v":"2018-12-14"},null,{"$f":"DATE($B$2,VLOOKUP($B$3,Sources!$C$2:$D$14,2,FALSE),Calendrier!AE10)","v":"2018-12-15"},null,{"$f":"DATE($B$2,VLOOKUP($B$3,Sources!$C$2:$D$14,2,FALSE),Calendrier!AG10)","v":"2018-12-16"},null,{"$f":"DATE($B$2,VLOOKUP($B$3,Sources!$C$2:$D$14,2,FALSE),Calendrier!AI10)","v":"2018-12-17"},null,{"$f":"DATE($B$2,VLOOKUP($B$3,Sources!$C$2:$D$14,2,FALSE),Calendrier!AK10)","v":"2018-12-18"},null,{"$f":"DATE($B$2,VLOOKUP($B$3,Sources!$C$2:$D$14,2,FALSE),Calendrier!AM10)","v":"2018-12-19"},null,{"$f":"DATE($B$2,VLOOKUP($B$3,Sources!$C$2:$D$14,2,FALSE),Calendrier!AO10)","v":"2018-12-20"},null,{"$f":"DATE($B$2,VLOOKUP($B$3,Sources!$C$2:$D$14,2,FALSE),Calendrier!AQ10)","v":"2018-12-21"},null,{"$f":"DATE($B$2,VLOOKUP($B$3,Sources!$C$2:$D$14,2,FALSE),Calendrier!AS10)","v":"2018-12-22"},null,{"$f":"DATE($B$2,VLOOKUP($B$3,Sources!$C$2:$D$14,2,FALSE),Calendrier!AU10)","v":"2018-12-23"},null,{"$f":"DATE($B$2,VLOOKUP($B$3,Sources!$C$2:$D$14,2,FALSE),Calendrier!AW10)","v":"2018-12-24"},null,{"$f":"DATE($B$2,VLOOKUP($B$3,Sources!$C$2:$D$14,2,FALSE),Calendrier!AY10)","v":"2018-12-25"},null,{"$f":"DATE($B$2,VLOOKUP($B$3,Sources!$C$2:$D$14,2,FALSE),Calendrier!BA10)","v":"2018-12-26"},null,{"$f":"DATE($B$2,VLOOKUP($B$3,Sources!$C$2:$D$14,2,FALSE),Calendrier!BC10)","v":"2018-12-27"},null,{"$f":"DATE($B$2,VLOOKUP($B$3,Sources!$C$2:$D$14,2,FALSE),Calendrier!BE10)","v":"2018-12-28"},null,{"$f":"DATE($B$2,VLOOKUP($B$3,Sources!$C$2:$D$14,2,FALSE),Calendrier!BG10)","v":"2018-12-29"},null,{"$f":"DATE($B$2,VLOOKUP($B$3,Sources!$C$2:$D$14,2,FALSE),Calendrier!BI10)","v":"2018-12-30"},null,{"$f":"DATE($B$2,VLOOKUP($B$3,Sources!$C$2:$D$14,2,FALSE),Calendrier!BK10)","v":"2018-12-31"}]
[null,null,{"$f":"IF(AND($B$2<>\"\",$B$3<>\"\"),TEXT(C8,\"jjjj\")&\" \",\"\")","v":"samedi "},null,{"$f":"IF(AND($B$2<>\"\",$B$3<>\"\"),IF(MONTH(E8)=MONTH($C$8),TEXT(E8,\"jjjj\")&\" \",\"\"),\"\")","v":"dimanche "},null,{"$f":"IF(AND($B$2<>\"\",$B$3<>\"\"),IF(MONTH(G8)=MONTH($C$8),TEXT(G8,\"jjjj\")&\" \",\"\"),\"\")","v":"lundi "},null,{"$f":"IF(AND($B$2<>\"\",$B$3<>\"\"),IF(MONTH(I8)=MONTH($C$8),TEXT(I8,\"jjjj\")&\" \",\"\"),\"\")","v":"mardi "},null,{"$f":"IF(AND($B$2<>\"\",$B$3<>\"\"),IF(MONTH(K8)=MONTH($C$8),TEXT(K8,\"jjjj\")&\" \",\"\"),\"\")","v":"mercredi "},null,{"$f":"IF(AND($B$2<>\"\",$B$3<>\"\"),IF(MONTH(M8)=MONTH($C$8),TEXT(M8,\"jjjj\")&\" \",\"\"),\"\")","v":"jeudi "},null,{"$f":"IF(AND($B$2<>\"\",$B$3<>\"\"),IF(MONTH(O8)=MONTH($C$8),TEXT(O8,\"jjjj\")&\" \",\"\"),\"\")","v":"vendredi "},null,{"$f":"IF(AND($B$2<>\"\",$B$3<>\"\"),IF(MONTH(Q8)=MONTH($C$8),TEXT(Q8,\"jjjj\")&\" \",\"\"),\"\")","v":"samedi "},null,{"$f":"IF(AND($B$2<>\"\",$B$3<>\"\"),IF(MONTH(S8)=MONTH($C$8),TEXT(S8,\"jjjj\")&\" \",\"\"),\"\")","v":"dimanche "},null,{"$f":"IF(AND($B$2<>\"\",$B$3<>\"\"),IF(MONTH(U8)=MONTH($C$8),TEXT(U8,\"jjjj\")&\" \",\"\"),\"\")","v":"lundi "},null,{"$f":"IF(AND($B$2<>\"\",$B$3<>\"\"),IF(MONTH(W8)=MONTH($C$8),TEXT(W8,\"jjjj\")&\" \",\"\"),\"\")","v":"mardi "},null,{"$f":"IF(AND($B$2<>\"\",$B$3<>\"\"),IF(MONTH(Y8)=MONTH($C$8),TEXT(Y8,\"jjjj\")&\" \",\"\"),\"\")","v":"mercredi "},null,{"$f":"IF(AND($B$2<>\"\",$B$3<>\"\"),IF(MONTH(AA8)=MONTH($C$8),TEXT(AA8,\"jjjj\")&\" \",\"\"),\"\")","v":"jeudi "},null,{"$f":"IF(AND($B$2<>\"\",$B$3<>\"\"),IF(MONTH(AC8)=MONTH($C$8),TEXT(AC8,\"jjjj\")&\" \",\"\"),\"\")","v":"vendredi "},null,{"$f":"IF(AND($B$2<>\"\",$B$3<>\"\"),IF(MONTH(AE8)=MONTH($C$8),TEXT(AE8,\"jjjj\")&\" \",\"\"),\"\")","v":"samedi "},null,{"$f":"IF(AND($B$2<>\"\",$B$3<>\"\"),IF(MONTH(AG8)=MONTH($C$8),TEXT(AG8,\"jjjj\")&\" \",\"\"),\"\")","v":"dimanche "},null,{"$f":"IF(AND($B$2<>\"\",$B$3<>\"\"),IF(MONTH(AI8)=MONTH($C$8),TEXT(AI8,\"jjjj\")&\" \",\"\"),\"\")","v":"lundi "},null,{"$f":"IF(AND($B$2<>\"\",$B$3<>\"\"),IF(MONTH(AK8)=MONTH($C$8),TEXT(AK8,\"jjjj\")&\" \",\"\"),\"\")","v":"mardi "},null,{"$f":"IF(AND($B$2<>\"\",$B$3<>\"\"),IF(MONTH(AM8)=MONTH($C$8),TEXT(AM8,\"jjjj\")&\" \",\"\"),\"\")","v":"mercredi "},null,{"$f":"IF(AND($B$2<>\"\",$B$3<>\"\"),IF(MONTH(AO8)=MONTH($C$8),TEXT(AO8,\"jjjj\")&\" \",\"\"),\"\")","v":"jeudi "},null,{"$f":"IF(AND($B$2<>\"\",$B$3<>\"\"),IF(MONTH(AQ8)=MONTH($C$8),TEXT(AQ8,\"jjjj\")&\" \",\"\"),\"\")","v":"vendredi "},null,{"$f":"IF(AND($B$2<>\"\",$B$3<>\"\"),IF(MONTH(AS8)=MONTH($C$8),TEXT(AS8,\"jjjj\")&\" \",\"\"),\"\")","v":"samedi "},null,{"$f":"IF(AND($B$2<>\"\",$B$3<>\"\"),IF(MONTH(AU8)=MONTH($C$8),TEXT(AU8,\"jjjj\")&\" \",\"\"),\"\")","v":"dimanche "},null,{"$f":"IF(AND($B$2<>\"\",$B$3<>\"\"),IF(MONTH(AW8)=MONTH($C$8),TEXT(AW8,\"jjjj\")&\" \",\"\"),\"\")","v":"lundi "},null,{"$f":"IF(AND($B$2<>\"\",$B$3<>\"\"),IF(MONTH(AY8)=MONTH($C$8),TEXT(AY8,\"jjjj\")&\" \",\"\"),\"\")","v":"mardi "},null,{"$f":"IF(AND($B$2<>\"\",$B$3<>\"\"),IF(MONTH(BA8)=MONTH($C$8),TEXT(BA8,\"jjjj\")&\" \",\"\"),\"\")","v":"mercredi "},null,{"$f":"IF(AND($B$2<>\"\",$B$3<>\"\"),IF(MONTH(BC8)=MONTH($C$8),TEXT(BC8,\"jjjj\")&\" \",\"\"),\"\")","v":"jeudi "},null,{"$f":"IF(AND($B$2<>\"\",$B$3<>\"\"),IF(MONTH(BE8)=MONTH($C$8),TEXT(BE8,\"jjjj\")&\" \",\"\"),\"\")","v":"vendredi "},null,{"$f":"IF(AND($B$2<>\"\",$B$3<>\"\"),IF(MONTH(BG8)=MONTH($C$8),TEXT(BG8,\"jjjj\")&\" \",\"\"),\"\")","v":"samedi "},null,{"$f":"IF(AND($B$2<>\"\",$B$3<>\"\"),IF(MONTH(BI8)=MONTH($C$8),TEXT(BI8,\"jjjj\")&\" \",\"\"),\"\")","v":"dimanche "},null,{"$f":"IF(AND($B$2<>\"\",$B$3<>\"\"),IF(MONTH(BK8)=MONTH($C$8),TEXT(BK8,\"jjjj\")&\" \",\"\"),\"\")","v":"lundi "}]
[null,null,1,null,2,null,3,null,4,null,5,null,6,null,7,null,8,null,9,null,10,null,11,null,12,null,13,null,14,null,15,null,16,null,17,null,18,null,19,null,20,null,21,null,22,null,23,null,24,null,25,null,26,null,27,null,28,null,29,null,30,null,31,null,null,"total heures","Total congés"]
[null,{"$f":"IF($C$9<>\"\",Sources!H3,\"\")","v":"Jo"},null,null,null,null,null,null,null,null,null,null,null,null,null,null,null,null,null,null,null,null,null,null,null,null,null,null,null,null,null,null,null,null,null,null,null,null,null,null,null,null,null,null,null,null,null,null,null,null,null,null,null,null,null,null,null,null,null,null,null,null,null,null,null,{"$f":"SUMPRODUCT((COUNTIF(C11:BL11,typ))*(temps))","v":0},{"$f":"SUMPRODUCT((COUNTIF(C11:BL11,Sources!$B$35))*(Sources!$D$35))","v":0},null,"="]
[null,{"$f":"IF($C$9<>\"\",Sources!H4,\"\")","v":"Cha"},null,null,null,null,null,null,null,null,null,null,null,null,null,null,null,null,null,null,null,null,null,null,null,null,null,null,null,null,null,null,null,null,null,null,null,null,null,null,null,null,null,null,null,null,null,null,null,null,null,null,null,null,null,null,null,null,null,null,null,null,null,null,null,{"$f":"SUMPRODUCT((COUNTIF(C12:BL12,typ))*(temps))","v":0},{"$f":"SUMPRODUCT((COUNTIF(C12:BL12,Sources!$B$35))*(Sources!$D$35))","v":0}]
[null,{"$f":"IF($C$9<>\"\",Sources!H5,\"\")","v":"Jess"},null,null,null,null,null,null,null,null,null,null,null,null,null,null,null,null,null,null,null,null,null,null,null,null,null,null,null,null,null,null,null,null,null,null,null,null,null,null,null,null,null,null,null,null,null,null,null,null,null,null,null,null,null,null,null,null,null,null,null,null,null,null,null,0,{"$f":"SUMPRODUCT((COUNTIF(C13:BL13,Sources!$B$35))*(Sources!$D$35))","v":0}]
[null,{"$f":"IF($C$9<>\"\",Sources!H6,\"\")","v":"Alex"},null,null,null,null,null,null,null,null,null,null,null,null,null,null,null,null,null,null,null,null,null,null,null,null,null,null,null,null,null,null,null,null,null,null,null,null,null,null,null,null,null,null,null,null,null,null,null,null,null,null,null,null,null,null,null,null,null,null,null,null,null,null,null,0,{"$f":"SUMPRODUCT((COUNTIF(C14:BL14,Sources!$B$35))*(Sources!$D$35))","v":0}]
[null,{"$f":"IF($C$9<>\"\",Sources!H7,\"\")","v":"Op"},null,null,null,null,null,null,null,null,null,null,null,null,null,null,null,null,null,null,null,null,null,null,null,null,null,null,null,null,null,null,null,null,null,null,null,null,null,null,null,null,null,null,null,null,null,null,null,null,null,null,null,null,null,null,null,null,null,null,null,null,null,null,null,0,{"$f":"SUMPRODUCT((COUNTIF(C15:BL15,Sources!$B$35))*(Sources!$D$35))","v":0}]
[null,{"$f":"IF($C$9<>\"\",Sources!H8,\"\")","v":"De"},null,null,null,null,null,null,null,null,null,null,null,null,null,null,null,null,null,null,null,null,null,null,null,null,null,null,null,null,null,null,null,null,null,null,null,null,null,null,null,null,null,null,null,null,null,null,null,null,null,null,null,null,null,null,null,null,null,null,null,null,null,null,null,0,{"$f":"SUMPRODUCT((COUNTIF(C16:BL16,Sources!$B$35))*(Sources!$D$35))","v":0}]
[null,{"$f":"IF($C$9<>\"\",Sources!H9,\"\")","v":" "},null,null,null,null,null,null,null,null,null,null,null,null,null,null,null,null,null,null,null,null,null,null,null,null,null,null,null,null,null,null,null,null,null,null,null,null,null,null,null,null,null,null,null,null,null,null,null,null,null,null,null,null,null,null,null,null,null,null,null,null,null,null,null,0,{"$f":"SUMPRODUCT((COUNTIF(C17:BL17,Sources!$B$35))*(Sources!$D$35))","v":0}]
[null,{"$f":"IF($C$9<>\"\",Sources!H10,\"\")","v":"Sy"},null,null,null,null,null,null,null,null,null,null,null,null,null,null,null,null,null,null,null,null,null,null,null,null,null,null,null,null,null,null,null,null,null,null,null,null,null,null,null,null,null,null,null,null,null,null,null,null,null,null,null,null,null,null,null,null,null,null,null,null,null,null,null,0,{"$f":"SUMPRODUCT((COUNTIF(C18:BL18,Sources!$B$35))*(Sources!$D$35))","v":0}]
[null,{"$f":"IF($C$9<>\"\",Sources!H11,\"\")","v":" "},null,null,null,null,null,null,null,null,null,null,null,null,null,null,null,null,null,null,null,null,null,null,null,null,null,null,null,null,null,null,null,null,null,null,null,null,null,null,null,null,null,null,null,null,null,null,null,null,null,null,null,null,null,null,null,null,null,null,null,null,null,null,null,0,{"$f":"SUMPRODUCT((COUNTIF(C19:BL19,Sources!$B$35))*(Sources!$D$35))","v":0}]
[null,{"$f":"IF($C$9<>\"\",Sources!H12,\"\")","v":"H"},null,null,null,null,null,null,null,null,null,null,null,null,null,null,null,null,null,null,null,null,null,null,null,null,null,null,null,null,null,null,null,null,null,null,null,null,null,null,null,null,null,null,null,null,null,null,null,null,null,null,null,null,null,null,null,null,null,null,null,null,null,null,null,0,{"$f":"SUMPRODUCT((COUNTIF(C20:BL20,Sources!$B$35))*(Sources!$D$35))","v":0}]
[null,{"$f":"IF($C$9<>\"\",Sources!H13,\"\")","v":"T"},null,null,null,null,null,null,null,null,null,null,null,null,null,null,null,null,null,null,null,null,null,null,null,null,null,null,null,null,null,null,null,null,null,null,null,null,null,null,null,null,null,null,null,null,null,null,null,null,null,null,null,null,null,null,null,null,null,null,null,null,null,null,null,0,{"$f":"SUMPRODUCT((COUNTIF(C21:BL21,Sources!$B$35))*(Sources!$D$35))","v":0}]
[null,{"$f":"IF($C$9<>\"\",Sources!H14,\"\")","v":"S"},null,null,null,null,null,null,null,null,null,null,null,null,null,null,null,null,null,null,null,null,null,null,null,null,null,null,null,null,null,null,null,null,null,null,null,null,null,null,null,null,null,null,null,null,null,null,null,null,null,null,null,null,null,null,null,null,null,null,null,null,null,null,null,0,{"$f":"SUMPRODUCT((COUNTIF(C22:BL22,Sources!$B$35))*(Sources!$D$35))","v":0}]
[]
[]
[]
[]
[]
[]
[]
[]
[]
[]
[]
[null,"SAINT MARS DU DESERT",null,null,null,null,"M = 10h-13h30"]
[null,"VARADES",null,null,null,null,"S = 18h-21h30"]
[null,"SAINT ETIENNE DE MTLUC",null,null,null,null,"SWE = 18h-22h"]
[null,"CONGES",null,null,null,null,"SD = 17h30- 22h"]

{"sheet":"S49àS53","index":7,"n_rows":16,"n_cols":72,"rows_kept":16,"cut":false,"hidden":false,"merged":[[0,21,0,22],[0,23,0,24],[0,25,0,26],[0,27,0,28],[0,2,0,3],[0,4,0,5],[0,6,0,7],[0,8,0,9],[0,10,0,11],[0,12,0,13],[0,59,0,60],[0,61,0,62],[0,63,0,64],[0,65,0,66],[0,70,0,71],[1,2,1,3],[1,4,1,5],[1,6,1,7],[1,8,1,9],[1,10,1,11],[0,44,0,45],[0,46,0,47],[0,48,0,49],[0,53,0,54],[0,55,0,56],[0,57,0,58],[0,29,0,30],[0,31,0,32],[0,36,0,37],[0,38,0,39],[0,40,0,41],[0,42,0,43],[0,14,0,15],[0,19,0,20],[1,27,1,28],[1,29,1,30],[1,31,1,32],[1,36,1,37],[1,38,1,39],[1,40,1,41],[1,12,1,13],[1,14,1,15],[1,19,1,20],[1,21,1,22],[1,23,1,24],[1,25,1,26],[1,57,1,58],[1,59,1,60],[1,61,1,62],[1,63,1,64],[1,65,1,66],[1,70,1,71],[1,42,1,43],[1,44,1,45],[1,46,1,47],[1,48,1,49],[1,53,1,54],[1,55,1,56],[2,21,2,22],[2,23,2,24],[2,25,2,26],[2,27,2,28],[2,2,2,3],[2,4,2,5],[2,6,2,7],[2,8,2,9],[2,10,2,11],[2,12,2,13],[2,59,2,60],[2,61,2,62],[2,63,2,64],[2,65,2,66],[2,70,2,71],[3,2,3,3],[3,4,3,5],[3,6,3,7],[3,8,3,9],[3,10,3,11],[2,44,2,45],[2,46,2,47],[2,48,2,49],[2,53,2,54],[2,55,2,56],[2,57,2,58],[2,29,2,30],[2,31,2,32],[2,36,2,37],[2,38,2,39],[2,40,2,41],[2,42,2,43],[2,14,2,15],[2,19,2,20],[3,27,3,28],[3,29,3,30],[3,31,3,32],[3,36,3,37],[3,38,3,39],[3,40,3,41],[3,12,3,13],[3,14,3,15],[3,19,3,20],[3,21,3,22],[3,23,3,24],[3,25,3,26],[3,57,3,58],[3,59,3,60],[3,61,3,62],[3,63,3,64],[3,65,3,66],[3,70,3,71],[3,42,3,43],[3,44,3,45],[3,46,3,47],[3,48,3,49],[3,53,3,54],[3,55,3,56]]}
[null,null,{"$f":"DECEMBRE!G7","v":"S 49"},null,{"$f":"DECEMBRE!I7","v":""},null,{"$f":"DECEMBRE!K7","v":""},null,{"$f":"DECEMBRE!M7","v":""},null,{"$f":"DECEMBRE!O7","v":""},null,{"$f":"DECEMBRE!Q7","v":""},null,{"$f":"DECEMBRE!S7","v":""},null,null,null,null,{"$f":"DECEMBRE!U7","v":"S 50"},null,{"$f":"DECEMBRE!W7","v":""},null,{"$f":"DECEMBRE!Y7","v":""},null,{"$f":"DECEMBRE!AA7","v":""},null,{"$f":"DECEMBRE!AC7","v":""},null,{"$f":"DECEMBRE!AE7","v":""},null,{"$f":"DECEMBRE!AG7","v":""},null,null,null,null,{"$f":"DECEMBRE!AI7","v":"S 51"},null,{"$f":"DECEMBRE!AK7","v":""},null,{"$f":"DECEMBRE!AM7","v":""},null,{"$f":"DECEMBRE!AO7","v":""},null,{"$f":"DECEMBRE!AQ7","v":""},null,{"$f":"DECEMBRE!AS7","v":""},null,{"$f":"DECEMBRE!AU7","v":""},null,null,null,null,{"$f":"DECEMBRE!AW7","v":"S 52"},null,{"$f":"DECEMBRE!AY7","v":""},null,{"$f":"DECEMBRE!BA7","v":""},null,{"$f":"DECEMBRE!BC7","v":""},null,{"$f":"DECEMBRE!BE7","v":""},null,{"$f":"DECEMBRE!BG7","v":""},null,{"$f":"DECEMBRE!BI7","v":""},null,null,null,null,{"$f":"DECEMBRE!BK7","v":"S 53"}]
[null,null,{"$f":"DECEMBRE!G8","v":"2018-12-03"},null,{"$f":"DECEMBRE!I8","v":"2018-12-04"},null,{"$f":"DECEMBRE!K8","v":"2018-12-05"},null,{"$f":"DECEMBRE!M8","v":"2018-12-06"},null,{"$f":"DECEMBRE!O8","v":"2018-12-07"},null,{"$f":"DECEMBRE!Q8","v":"2018-12-08"},null,{"$f":"DECEMBRE!S8","v":"2018-12-09"},null,null,null,null,{"$f":"DECEMBRE!U8","v":"2018-12-10"},null,{"$f":"DECEMBRE!W8","v":"2018-12-11"},null,{"$f":"DECEMBRE!Y8","v":"2018-12-12"},null,{"$f":"DECEMBRE!AA8","v":"2018-12-13"},null,{"$f":"DECEMBRE!AC8","v":"2018-12-14"},null,{"$f":"DECEMBRE!AE8","v":"2018-12-15"},null,{"$f":"DECEMBRE!AG8","v":"2018-12-16"},null,null,null,null,{"$f":"DECEMBRE!AI8","v":"2018-12-17"},null,{"$f":"DECEMBRE!AK8","v":"2018-12-18"},null,{"$f":"DECEMBRE!AM8","v":"2018-12-19"},null,{"$f":"DECEMBRE!AO8","v":"2018-12-20"},null,{"$f":"DECEMBRE!AQ8","v":"2018-12-21"},null,{"$f":"DECEMBRE!AS8","v":"2018-12-22"},null,{"$f":"DECEMBRE!AU8","v":"2018-12-23"},null,null,null,null,{"$f":"DECEMBRE!AW8","v":"2018-12-24"},null,{"$f":"DECEMBRE!AY8","v":"2018-12-25"},null,{"$f":"DECEMBRE!BA8","v":"2018-12-26"},null,{"$f":"DECEMBRE!BC8","v":"2018-12-27"},null,{"$f":"DECEMBRE!BE8","v":"2018-12-28"},null,{"$f":"DECEMBRE!BG8","v":"2018-12-29"},null,{"$f":"DECEMBRE!BI8","v":"2018-12-30"},null,null,null,null,{"$f":"DECEMBRE!BK8","v":"2018-12-31"}]
[null,null,{"$f":"DECEMBRE!G9","v":"lundi "},null,{"$f":"DECEMBRE!I9","v":"mardi "},null,{"$f":"DECEMBRE!K9","v":"mercredi "},null,{"$f":"DECEMBRE!M9","v":"jeudi "},null,{"$f":"DECEMBRE!O9","v":"vendredi "},null,{"$f":"DECEMBRE!Q9","v":"samedi "},null,{"$f":"DECEMBRE!S9","v":"dimanche "},null,null,null,null,{"$f":"DECEMBRE!U9","v":"lundi "},null,{"$f":"DECEMBRE!W9","v":"mardi "},null,{"$f":"DECEMBRE!Y9","v":"mercredi "},null,{"$f":"DECEMBRE!AA9","v":"jeudi "},null,{"$f":"DECEMBRE!AC9","v":"vendredi "},null,{"$f":"DECEMBRE!AE9","v":"samedi "},null,{"$f":"DECEMBRE!AG9","v":"dimanche "},null,null,null,null,{"$f":"DECEMBRE!AI9","v":"lundi "},null,{"$f":"DECEMBRE!AK9","v":"mardi "},null,{"$f":"DECEMBRE!AM9","v":"mercredi "},null,{"$f":"DECEMBRE!AO9","v":"jeudi "},null,{"$f":"DECEMBRE!AQ9","v":"vendredi "},null,{"$f":"DECEMBRE!AS9","v":"samedi "},null,{"$f":"DECEMBRE!AU9","v":"dimanche "},null,null,null,null,{"$f":"DECEMBRE!AW9","v":"lundi "},null,{"$f":"DECEMBRE!AY9","v":"mardi "},null,{"$f":"DECEMBRE!BA9","v":"mercredi "},null,{"$f":"DECEMBRE!BC9","v":"jeudi "},null,{"$f":"DECEMBRE!BE9","v":"vendredi "},null,{"$f":"DECEMBRE!BG9","v":"samedi "},null,{"$f":"DECEMBRE!BI9","v":"dimanche "},null,null,null,null,{"$f":"DECEMBRE!BK9","v":"lundi "}]
[null,null,{"$f":"DECEMBRE!G10","v":3},null,{"$f":"DECEMBRE!I10","v":4},null,{"$f":"DECEMBRE!K10","v":5},null,{"$f":"DECEMBRE!M10","v":6},null,{"$f":"DECEMBRE!O10","v":7},null,{"$f":"DECEMBRE!Q10","v":8},null,{"$f":"DECEMBRE!S10","v":9},null,null,null,null,{"$f":"DECEMBRE!U10","v":10},null,{"$f":"DECEMBRE!W10","v":11},null,{"$f":"DECEMBRE!Y10","v":12},null,{"$f":"DECEMBRE!AA10","v":13},null,{"$f":"DECEMBRE!AC10","v":14},null,{"$f":"DECEMBRE!AE10","v":15},null,{"$f":"DECEMBRE!AG10","v":16},null,null,null,null,{"$f":"DECEMBRE!AI10","v":17},null,{"$f":"DECEMBRE!AK10","v":18},null,{"$f":"DECEMBRE!AM10","v":19},null,{"$f":"DECEMBRE!AO10","v":20},null,{"$f":"DECEMBRE!AQ10","v":21},null,{"$f":"DECEMBRE!AS10","v":22},null,{"$f":"DECEMBRE!AU10","v":23},null,null,null,null,{"$f":"DECEMBRE!AW10","v":24},null,{"$f":"DECEMBRE!AY10","v":25},null,{"$f":"DECEMBRE!BA10","v":26},null,{"$f":"DECEMBRE!BC10","v":27},null,{"$f":"DECEMBRE!BE10","v":28},null,{"$f":"DECEMBRE!BG10","v":29},null,{"$f":"DECEMBRE!BI10","v":30},null,null,null,null,{"$f":"DECEMBRE!BK10","v":31}]
[null,{"$f":"DECEMBRE!B11","v":"Jo"},{"$f":"DECEMBRE!G11","v":0},{"$f":"DECEMBRE!H11","v":0},{"$f":"DECEMBRE!I11","v":0},{"$f":"DECEMBRE!J11","v":0},{"$f":"DECEMBRE!K11","v":0},{"$f":"DECEMBRE!L11","v":0},{"$f":"DECEMBRE!M11","v":0},{"$f":"DECEMBRE!N11","v":0},{"$f":"DECEMBRE!O11","v":0},{"$f":"DECEMBRE!P11","v":0},{"$f":"DECEMBRE!Q11","v":0},{"$f":"DECEMBRE!R11","v":0},{"$f":"DECEMBRE!S11","v":0},{"$f":"DECEMBRE!T11","v":0},{"$f":"SUMPRODUCT(COUNTIF(C5:P5,typ)*(temps))","v":0},null,{"$f":"DECEMBRE!B11","v":"Jo"},{"$f":"DECEMBRE!U11","v":0},{"$f":"DECEMBRE!V11","v":0},{"$f":"DECEMBRE!W11","v":0},{"$f":"DECEMBRE!X11","v":0},{"$f":"DECEMBRE!Y11","v":0},{"$f":"DECEMBRE!Z11","v":0},{"$f":"DECEMBRE!AA11","v":0},{"$f":"DECEMBRE!AB11","v":0},{"$f":"DECEMBRE!AC11","v":0},{"$f":"DECEMBRE!AD11","v":0},{"$f":"DECEMBRE!AE11","v":0},{"$f":"DECEMBRE!AF11","v":0},{"$f":"DECEMBRE!AG11","v":0},{"$f":"DECEMBRE!AH11","v":0},{"$f":"SUMPRODUCT(COUNTIF(T5:AG5,typ)*(temps))","v":0},null,{"$f":"DECEMBRE!B11","v":"Jo"},{"$f":"DECEMBRE!AI11","v":0},{"$f":"DECEMBRE!AJ11","v":0},{"$f":"DECEMBRE!AK11","v":0},{"$f":"DECEMBRE!AL11","v":0},{"$f":"DECEMBRE!AM11","v":0},{"$f":"DECEMBRE!AN11","v":0},{"$f":"DECEMBRE!AO11","v":0},{"$f":"DECEMBRE!AP11","v":0},{"$f":"DECEMBRE!AQ11","v":0},{"$f":"DECEMBRE!AR11","v":0},{"$f":"DECEMBRE!AS11","v":0},{"$f":"DECEMBRE!AT11","v":0},{"$f":"DECEMBRE!AU11","v":0},{"$f":"DECEMBRE!AV11","v":0},{"$f":"SUMPRODUCT(COUNTIF(AK5:AX5,typ)*(temps))","v":0},null,{"$f":"DECEMBRE!B11","v":"Jo"},{"$f":"DECEMBRE!AW11","v":0},{"$f":"DECEMBRE!AX11","v":0},{"$f":"DECEMBRE!AY11","v":0},{"$f":"DECEMBRE!AZ11","v":0},{"$f":"DECEMBRE!BA11","v":0},{"$f":"DECEMBRE!BB11","v":0},{"$f":"DECEMBRE!BC11","v":0},{"$f":"DECEMBRE!BD11","v":0},{"$f":"DECEMBRE!BE11","v":0},{"$f":"DECEMBRE!BF11","v":0},{"$f":"DECEMBRE!BG11","v":0},{"$f":"DECEMBRE!BH11","v":0},{"$f":"DECEMBRE!BI11","v":0},{"$f":"DECEMBRE!BJ11","v":0},{"$f":"SUMPRODUCT(COUNTIF(BB5:BO5,typ)*(temps))","v":0},null,{"$f":"DECEMBRE!B11","v":"Jo"},{"$f":"DECEMBRE!BK11","v":0},{"$f":"DECEMBRE!BL11","v":0}]
[null,{"$f":"DECEMBRE!B12","v":"Cha"},{"$f":"DECEMBRE!G12","v":0},{"$f":"DECEMBRE!H12","v":0},{"$f":"DECEMBRE!I12","v":0},{"$f":"DECEMBRE!J12","v":0},{"$f":"DECEMBRE!K12","v":0},{"$f":"DECEMBRE!L12","v":0},{"$f":"DECEMBRE!M12","v":0},{"$f":"DECEMBRE!N12","v":0},{"$f":"DECEMBRE!O12","v":0},{"$f":"DECEMBRE!P12","v":0},{"$f":"DECEMBRE!Q12","v":0},{"$f":"DECEMBRE!R12","v":0},{"$f":"DECEMBRE!S12","v":0},{"$f":"DECEMBRE!T12","v":0},0,null,{"$f":"DECEMBRE!B12","v":"Cha"},{"$f":"DECEMBRE!U12","v":0},{"$f":"DECEMBRE!V12","v":0},{"$f":"DECEMBRE!W12","v":0},{"$f":"DECEMBRE!X12","v":0},{"$f":"DECEMBRE!Y12","v":0},{"$f":"DECEMBRE!Z12","v":0},{"$f":"DECEMBRE!AA12","v":0},{"$f":"DECEMBRE!AB12","v":0},{"$f":"DECEMBRE!AC12","v":0},{"$f":"DECEMBRE!AD12","v":0},{"$f":"DECEMBRE!AE12","v":0},{"$f":"DECEMBRE!AF12","v":0},{"$f":"DECEMBRE!AG12","v":0},{"$f":"DECEMBRE!AH12","v":0},0,null,{"$f":"DECEMBRE!B12","v":"Cha"},{"$f":"DECEMBRE!AI12","v":0},{"$f":"DECEMBRE!AJ12","v":0},{"$f":"DECEMBRE!AK12","v":0},{"$f":"DECEMBRE!AL12","v":0},{"$f":"DECEMBRE!AM12","v":0},{"$f":"DECEMBRE!AN12","v":0},{"$f":"DECEMBRE!AO12","v":0},{"$f":"DECEMBRE!AP12","v":0},{"$f":"DECEMBRE!AQ12","v":0},{"$f":"DECEMBRE!AR12","v":0},{"$f":"DECEMBRE!AS12","v":0},{"$f":"DECEMBRE!AT12","v":0},{"$f":"DECEMBRE!AU12","v":0},{"$f":"DECEMBRE!AV12","v":0},0,null,{"$f":"DECEMBRE!B12","v":"Cha"},{"$f":"DECEMBRE!AW12","v":0},{"$f":"DECEMBRE!AX12","v":0},{"$f":"DECEMBRE!AY12","v":0},{"$f":"DECEMBRE!AZ12","v":0},{"$f":"DECEMBRE!BA12","v":0},{"$f":"DECEMBRE!BB12","v":0},{"$f":"DECEMBRE!BC12","v":0},{"$f":"DECEMBRE!BD12","v":0},{"$f":"DECEMBRE!BE12","v":0},{"$f":"DECEMBRE!BF12","v":0},{"$f":"DECEMBRE!BG12","v":0},{"$f":"DECEMBRE!BH12","v":0},{"$f":"DECEMBRE!BI12","v":0},{"$f":"DECEMBRE!BJ12","v":0},0,null,{"$f":"DECEMBRE!B12","v":"Cha"},{"$f":"DECEMBRE!BK12","v":0},{"$f":"DECEMBRE!BL12","v":0}]
[null,{"$f":"DECEMBRE!B13","v":"Jess"},{"$f":"DECEMBRE!G13","v":0},{"$f":"DECEMBRE!H13","v":0},{"$f":"DECEMBRE!I13","v":0},{"$f":"DECEMBRE!J13","v":0},{"$f":"DECEMBRE!K13","v":0},{"$f":"DECEMBRE!L13","v":0},{"$f":"DECEMBRE!M13","v":0},{"$f":"DECEMBRE!N13","v":0},{"$f":"DECEMBRE!O13","v":0},{"$f":"DECEMBRE!P13","v":0},{"$f":"DECEMBRE!Q13","v":0},{"$f":"DECEMBRE!R13","v":0},{"$f":"DECEMBRE!S13","v":0},{"$f":"DECEMBRE!T13","v":0},0,null,{"$f":"DECEMBRE!B13","v":"Jess"},{"$f":"DECEMBRE!U13","v":0},{"$f":"DECEMBRE!V13","v":0},{"$f":"DECEMBRE!W13","v":0},{"$f":"DECEMBRE!X13","v":0},{"$f":"DECEMBRE!Y13","v":0},{"$f":"DECEMBRE!Z13","v":0},{"$f":"DECEMBRE!AA13","v":0},{"$f":"DECEMBRE!AB13","v":0},{"$f":"DECEMBRE!AC13","v":0},{"$f":"DECEMBRE!AD13","v":0},{"$f":"DECEMBRE!AE13","v":0},{"$f":"DECEMBRE!AF13","v":0},{"$f":"DECEMBRE!AG13","v":0},{"$f":"DECEMBRE!AH13","v":0},0,null,{"$f":"DECEMBRE!B13","v":"Jess"},{"$f":"DECEMBRE!AI13","v":0},{"$f":"DECEMBRE!AJ13","v":0},{"$f":"DECEMBRE!AK13","v":0},{"$f":"DECEMBRE!AL13","v":0},{"$f":"DECEMBRE!AM13","v":0},{"$f":"DECEMBRE!AN13","v":0},{"$f":"DECEMBRE!AO13","v":0},{"$f":"DECEMBRE!AP13","v":0},{"$f":"DECEMBRE!AQ13","v":0},{"$f":"DECEMBRE!AR13","v":0},{"$f":"DECEMBRE!AS13","v":0},{"$f":"DECEMBRE!AT13","v":0},{"$f":"DECEMBRE!AU13","v":0},{"$f":"DECEMBRE!AV13","v":0},0,null,{"$f":"DECEMBRE!B13","v":"Jess"},{"$f":"DECEMBRE!AW13","v":0},{"$f":"DECEMBRE!AX13","v":0},{"$f":"DECEMBRE!AY13","v":0},{"$f":"DECEMBRE!AZ13","v":0},{"$f":"DECEMBRE!BA13","v":0},{"$f":"DECEMBRE!BB13","v":0},{"$f":"DECEMBRE!BC13","v":0},{"$f":"DECEMBRE!BD13","v":0},{"$f":"DECEMBRE!BE13","v":0},{"$f":"DECEMBRE!BF13","v":0},{"$f":"DECEMBRE!BG13","v":0},{"$f":"DECEMBRE!BH13","v":0},{"$f":"DECEMBRE!BI13","v":0},{"$f":"DECEMBRE!BJ13","v":0},0,null,{"$f":"DECEMBRE!B13","v":"Jess"},{"$f":"DECEMBRE!BK13","v":0},{"$f":"DECEMBRE!BL13","v":0}]
[null,{"$f":"DECEMBRE!B14","v":"Alex"},{"$f":"DECEMBRE!G14","v":0},{"$f":"DECEMBRE!H14","v":0},{"$f":"DECEMBRE!I14","v":0},{"$f":"DECEMBRE!J14","v":0},{"$f":"DECEMBRE!K14","v":0},{"$f":"DECEMBRE!L14","v":0},{"$f":"DECEMBRE!M14","v":0},{"$f":"DECEMBRE!N14","v":0},{"$f":"DECEMBRE!O14","v":0},{"$f":"DECEMBRE!P14","v":0},{"$f":"DECEMBRE!Q14","v":0},{"$f":"DECEMBRE!R14","v":0},{"$f":"DECEMBRE!S14","v":0},{"$f":"DECEMBRE!T14","v":0},0,null,{"$f":"DECEMBRE!B14","v":"Alex"},{"$f":"DECEMBRE!U14","v":0},{"$f":"DECEMBRE!V14","v":0},{"$f":"DECEMBRE!W14","v":0},{"$f":"DECEMBRE!X14","v":0},{"$f":"DECEMBRE!Y14","v":0},{"$f":"DECEMBRE!Z14","v":0},{"$f":"DECEMBRE!AA14","v":0},{"$f":"DECEMBRE!AB14","v":0},{"$f":"DECEMBRE!AC14","v":0},{"$f":"DECEMBRE!AD14","v":0},{"$f":"DECEMBRE!AE14","v":0},{"$f":"DECEMBRE!AF14","v":0},{"$f":"DECEMBRE!AG14","v":0},{"$f":"DECEMBRE!AH14","v":0},0,null,{"$f":"DECEMBRE!B14","v":"Alex"},{"$f":"DECEMBRE!AI14","v":0},{"$f":"DECEMBRE!AJ14","v":0},{"$f":"DECEMBRE!AK14","v":0},{"$f":"DECEMBRE!AL14","v":0},{"$f":"DECEMBRE!AM14","v":0},{"$f":"DECEMBRE!AN14","v":0},{"$f":"DECEMBRE!AO14","v":0},{"$f":"DECEMBRE!AP14","v":0},{"$f":"DECEMBRE!AQ14","v":0},{"$f":"DECEMBRE!AR14","v":0},{"$f":"DECEMBRE!AS14","v":0},{"$f":"DECEMBRE!AT14","v":0},{"$f":"DECEMBRE!AU14","v":0},{"$f":"DECEMBRE!AV14","v":0},0,null,{"$f":"DECEMBRE!B14","v":"Alex"},{"$f":"DECEMBRE!AW14","v":0},{"$f":"DECEMBRE!AX14","v":0},{"$f":"DECEMBRE!AY14","v":0},{"$f":"DECEMBRE!AZ14","v":0},{"$f":"DECEMBRE!BA14","v":0},{"$f":"DECEMBRE!BB14","v":0},{"$f":"DECEMBRE!BC14","v":0},{"$f":"DECEMBRE!BD14","v":0},{"$f":"DECEMBRE!BE14","v":0},{"$f":"DECEMBRE!BF14","v":0},{"$f":"DECEMBRE!BG14","v":0},{"$f":"DECEMBRE!BH14","v":0},{"$f":"DECEMBRE!BI14","v":0},{"$f":"DECEMBRE!BJ14","v":0},0,null,{"$f":"DECEMBRE!B14","v":"Alex"},{"$f":"DECEMBRE!BK14","v":0},{"$f":"DECEMBRE!BL14","v":0}]
[null,{"$f":"DECEMBRE!B15","v":"Op"},{"$f":"DECEMBRE!G15","v":0},{"$f":"DECEMBRE!H15","v":0},{"$f":"DECEMBRE!I15","v":0},{"$f":"DECEMBRE!J15","v":0},{"$f":"DECEMBRE!K15","v":0},{"$f":"DECEMBRE!L15","v":0},{"$f":"DECEMBRE!M15","v":0},{"$f":"DECEMBRE!N15","v":0},{"$f":"DECEMBRE!O15","v":0},{"$f":"DECEMBRE!P15","v":0},{"$f":"DECEMBRE!Q15","v":0},{"$f":"DECEMBRE!R15","v":0},{"$f":"DECEMBRE!S15","v":0},{"$f":"DECEMBRE!T15","v":0},0,null,{"$f":"DECEMBRE!B15","v":"Op"},{"$f":"DECEMBRE!U15","v":0},{"$f":"DECEMBRE!V15","v":0},{"$f":"DECEMBRE!W15","v":0},{"$f":"DECEMBRE!X15","v":0},{"$f":"DECEMBRE!Y15","v":0},{"$f":"DECEMBRE!Z15","v":0},{"$f":"DECEMBRE!AA15","v":0},{"$f":"DECEMBRE!AB15","v":0},{"$f":"DECEMBRE!AC15","v":0},{"$f":"DECEMBRE!AD15","v":0},{"$f":"DECEMBRE!AE15","v":0},{"$f":"DECEMBRE!AF15","v":0},{"$f":"DECEMBRE!AG15","v":0},{"$f":"DECEMBRE!AH15","v":0},0,null,{"$f":"DECEMBRE!B15","v":"Op"},{"$f":"DECEMBRE!AI15","v":0},{"$f":"DECEMBRE!AJ15","v":0},{"$f":"DECEMBRE!AK15","v":0},{"$f":"DECEMBRE!AL15","v":0},{"$f":"DECEMBRE!AM15","v":0},{"$f":"DECEMBRE!AN15","v":0},{"$f":"DECEMBRE!AO15","v":0},{"$f":"DECEMBRE!AP15","v":0},{"$f":"DECEMBRE!AQ15","v":0},{"$f":"DECEMBRE!AR15","v":0},{"$f":"DECEMBRE!AS15","v":0},{"$f":"DECEMBRE!AT15","v":0},{"$f":"DECEMBRE!AU15","v":0},{"$f":"DECEMBRE!AV15","v":0},0,null,{"$f":"DECEMBRE!B15","v":"Op"},{"$f":"DECEMBRE!AW15","v":0},{"$f":"DECEMBRE!AX15","v":0},{"$f":"DECEMBRE!AY15","v":0},{"$f":"DECEMBRE!AZ15","v":0},{"$f":"DECEMBRE!BA15","v":0},{"$f":"DECEMBRE!BB15","v":0},{"$f":"DECEMBRE!BC15","v":0},{"$f":"DECEMBRE!BD15","v":0},{"$f":"DECEMBRE!BE15","v":0},{"$f":"DECEMBRE!BF15","v":0},{"$f":"DECEMBRE!BG15","v":0},{"$f":"DECEMBRE!BH15","v":0},{"$f":"DECEMBRE!BI15","v":0},{"$f":"DECEMBRE!BJ15","v":0},0,null,{"$f":"DECEMBRE!B15","v":"Op"},{"$f":"DECEMBRE!BK15","v":0},{"$f":"DECEMBRE!BL15","v":0}]
[null,{"$f":"DECEMBRE!B16","v":"De"},{"$f":"DECEMBRE!G16","v":0},{"$f":"DECEMBRE!H16","v":0},{"$f":"DECEMBRE!I16","v":0},{"$f":"DECEMBRE!J16","v":0},{"$f":"DECEMBRE!K16","v":0},{"$f":"DECEMBRE!L16","v":0},{"$f":"DECEMBRE!M16","v":0},{"$f":"DECEMBRE!N16","v":0},{"$f":"DECEMBRE!O16","v":0},{"$f":"DECEMBRE!P16","v":0},{"$f":"DECEMBRE!Q16","v":0},{"$f":"DECEMBRE!R16","v":0},{"$f":"DECEMBRE!S16","v":0},{"$f":"DECEMBRE!T16","v":0},0,null,{"$f":"DECEMBRE!B16","v":"De"},{"$f":"DECEMBRE!U16","v":0},{"$f":"DECEMBRE!V16","v":0},{"$f":"DECEMBRE!W16","v":0},{"$f":"DECEMBRE!X16","v":0},{"$f":"DECEMBRE!Y16","v":0},{"$f":"DECEMBRE!Z16","v":0},{"$f":"DECEMBRE!AA16","v":0},{"$f":"DECEMBRE!AB16","v":0},{"$f":"DECEMBRE!AC16","v":0},{"$f":"DECEMBRE!AD16","v":0},{"$f":"DECEMBRE!AE16","v":0},{"$f":"DECEMBRE!AF16","v":0},{"$f":"DECEMBRE!AG16","v":0},{"$f":"DECEMBRE!AH16","v":0},0,null,{"$f":"DECEMBRE!B16","v":"De"},{"$f":"DECEMBRE!AI16","v":0},{"$f":"DECEMBRE!AJ16","v":0},{"$f":"DECEMBRE!AK16","v":0},{"$f":"DECEMBRE!AL16","v":0},{"$f":"DECEMBRE!AM16","v":0},{"$f":"DECEMBRE!AN16","v":0},{"$f":"DECEMBRE!AO16","v":0},{"$f":"DECEMBRE!AP16","v":0},{"$f":"DECEMBRE!AQ16","v":0},{"$f":"DECEMBRE!AR16","v":0},{"$f":"DECEMBRE!AS16","v":0},{"$f":"DECEMBRE!AT16","v":0},{"$f":"DECEMBRE!AU16","v":0},{"$f":"DECEMBRE!AV16","v":0},0,null,{"$f":"DECEMBRE!B16","v":"De"},{"$f":"DECEMBRE!AW16","v":0},{"$f":"DECEMBRE!AX16","v":0},{"$f":"DECEMBRE!AY16","v":0},{"$f":"DECEMBRE!AZ16","v":0},{"$f":"DECEMBRE!BA16","v":0},{"$f":"DECEMBRE!BB16","v":0},{"$f":"DECEMBRE!BC16","v":0},{"$f":"DECEMBRE!BD16","v":0},{"$f":"DECEMBRE!BE16","v":0},{"$f":"DECEMBRE!BF16","v":0},{"$f":"DECEMBRE!BG16","v":0},{"$f":"DECEMBRE!BH16","v":0},{"$f":"DECEMBRE!BI16","v":0},{"$f":"DECEMBRE!BJ16","v":0},0,null,{"$f":"DECEMBRE!B16","v":"De"},{"$f":"DECEMBRE!BK16","v":0},{"$f":"DECEMBRE!BL16","v":0}]
[null,{"$f":"DECEMBRE!B17","v":" "},{"$f":"DECEMBRE!G17","v":0},{"$f":"DECEMBRE!H17","v":0},{"$f":"DECEMBRE!I17","v":0},{"$f":"DECEMBRE!J17","v":0},{"$f":"DECEMBRE!K17","v":0},{"$f":"DECEMBRE!L17","v":0},{"$f":"DECEMBRE!M17","v":0},{"$f":"DECEMBRE!N17","v":0},{"$f":"DECEMBRE!O17","v":0},{"$f":"DECEMBRE!P17","v":0},{"$f":"DECEMBRE!Q17","v":0},{"$f":"DECEMBRE!R17","v":0},{"$f":"DECEMBRE!S17","v":0},{"$f":"DECEMBRE!T17","v":0},0,null,{"$f":"DECEMBRE!B17","v":" "},{"$f":"DECEMBRE!U17","v":0},{"$f":"DECEMBRE!V17","v":0},{"$f":"DECEMBRE!W17","v":0},{"$f":"DECEMBRE!X17","v":0},{"$f":"DECEMBRE!Y17","v":0},{"$f":"DECEMBRE!Z17","v":0},{"$f":"DECEMBRE!AA17","v":0},{"$f":"DECEMBRE!AB17","v":0},{"$f":"DECEMBRE!AC17","v":0},{"$f":"DECEMBRE!AD17","v":0},{"$f":"DECEMBRE!AE17","v":0},{"$f":"DECEMBRE!AF17","v":0},{"$f":"DECEMBRE!AG17","v":0},{"$f":"DECEMBRE!AH17","v":0},0,null,{"$f":"DECEMBRE!B17","v":" "},{"$f":"DECEMBRE!AI17","v":0},{"$f":"DECEMBRE!AJ17","v":0},{"$f":"DECEMBRE!AK17","v":0},{"$f":"DECEMBRE!AL17","v":0},{"$f":"DECEMBRE!AM17","v":0},{"$f":"DECEMBRE!AN17","v":0},{"$f":"DECEMBRE!AO17","v":0},{"$f":"DECEMBRE!AP17","v":0},{"$f":"DECEMBRE!AQ17","v":0},{"$f":"DECEMBRE!AR17","v":0},{"$f":"DECEMBRE!AS17","v":0},{"$f":"DECEMBRE!AT17","v":0},{"$f":"DECEMBRE!AU17","v":0},{"$f":"DECEMBRE!AV17","v":0},0,null,{"$f":"DECEMBRE!B17","v":" "},{"$f":"DECEMBRE!AW17","v":0},{"$f":"DECEMBRE!AX17","v":0},{"$f":"DECEMBRE!AY17","v":0},{"$f":"DECEMBRE!AZ17","v":0},{"$f":"DECEMBRE!BA17","v":0},{"$f":"DECEMBRE!BB17","v":0},{"$f":"DECEMBRE!BC17","v":0},{"$f":"DECEMBRE!BD17","v":0},{"$f":"DECEMBRE!BE17","v":0},{"$f":"DECEMBRE!BF17","v":0},{"$f":"DECEMBRE!BG17","v":0},{"$f":"DECEMBRE!BH17","v":0},{"$f":"DECEMBRE!BI17","v":0},{"$f":"DECEMBRE!BJ17","v":0},0,null,{"$f":"DECEMBRE!B17","v":" "},{"$f":"DECEMBRE!BK17","v":0},{"$f":"DECEMBRE!BL17","v":0}]
[null,{"$f":"DECEMBRE!B18","v":"Sy"},{"$f":"DECEMBRE!G18","v":0},{"$f":"DECEMBRE!H18","v":0},{"$f":"DECEMBRE!I18","v":0},{"$f":"DECEMBRE!J18","v":0},{"$f":"DECEMBRE!K18","v":0},{"$f":"DECEMBRE!L18","v":0},{"$f":"DECEMBRE!M18","v":0},{"$f":"DECEMBRE!N18","v":0},{"$f":"DECEMBRE!O18","v":0},{"$f":"DECEMBRE!P18","v":0},{"$f":"DECEMBRE!Q18","v":0},{"$f":"DECEMBRE!R18","v":0},{"$f":"DECEMBRE!S18","v":0},{"$f":"DECEMBRE!T18","v":0},0,null,{"$f":"DECEMBRE!B18","v":"Sy"},{"$f":"DECEMBRE!U18","v":0},{"$f":"DECEMBRE!V18","v":0},{"$f":"DECEMBRE!W18","v":0},{"$f":"DECEMBRE!X18","v":0},{"$f":"DECEMBRE!Y18","v":0},{"$f":"DECEMBRE!Z18","v":0},{"$f":"DECEMBRE!AA18","v":0},{"$f":"DECEMBRE!AB18","v":0},{"$f":"DECEMBRE!AC18","v":0},{"$f":"DECEMBRE!AD18","v":0},{"$f":"DECEMBRE!AE18","v":0},{"$f":"DECEMBRE!AF18","v":0},{"$f":"DECEMBRE!AG18","v":0},{"$f":"DECEMBRE!AH18","v":0},0,null,{"$f":"DECEMBRE!B18","v":"Sy"},{"$f":"DECEMBRE!AI18","v":0},{"$f":"DECEMBRE!AJ18","v":0},{"$f":"DECEMBRE!AK18","v":0},{"$f":"DECEMBRE!AL18","v":0},{"$f":"DECEMBRE!AM18","v":0},{"$f":"DECEMBRE!AN18","v":0},{"$f":"DECEMBRE!AO18","v":0},{"$f":"DECEMBRE!AP18","v":0},{"$f":"DECEMBRE!AQ18","v":0},{"$f":"DECEMBRE!AR18","v":0},{"$f":"DECEMBRE!AS18","v":0},{"$f":"DECEMBRE!AT18","v":0},{"$f":"DECEMBRE!AU18","v":0},{"$f":"DECEMBRE!AV18","v":0},0,null,{"$f":"DECEMBRE!B18","v":"Sy"},{"$f":"DECEMBRE!AW18","v":0},{"$f":"DECEMBRE!AX18","v":0},{"$f":"DECEMBRE!AY18","v":0},{"$f":"DECEMBRE!AZ18","v":0},{"$f":"DECEMBRE!BA18","v":0},{"$f":"DECEMBRE!BB18","v":0},{"$f":"DECEMBRE!BC18","v":0},{"$f":"DECEMBRE!BD18","v":0},{"$f":"DECEMBRE!BE18","v":0},{"$f":"DECEMBRE!BF18","v":0},{"$f":"DECEMBRE!BG18","v":0},{"$f":"DECEMBRE!BH18","v":0},{"$f":"DECEMBRE!BI18","v":0},{"$f":"DECEMBRE!BJ18","v":0},0,null,{"$f":"DECEMBRE!B18","v":"Sy"},{"$f":"DECEMBRE!BK18","v":0},{"$f":"DECEMBRE!BL18","v":0}]
[null,{"$f":"DECEMBRE!B19","v":" "},{"$f":"DECEMBRE!G19","v":0},{"$f":"DECEMBRE!H19","v":0},{"$f":"DECEMBRE!I19","v":0},{"$f":"DECEMBRE!J19","v":0},{"$f":"DECEMBRE!K19","v":0},{"$f":"DECEMBRE!L19","v":0},{"$f":"DECEMBRE!M19","v":0},{"$f":"DECEMBRE!N19","v":0},{"$f":"DECEMBRE!O19","v":0},{"$f":"DECEMBRE!P19","v":0},{"$f":"DECEMBRE!Q19","v":0},{"$f":"DECEMBRE!R19","v":0},{"$f":"DECEMBRE!S19","v":0},{"$f":"DECEMBRE!T19","v":0},0,null,{"$f":"DECEMBRE!B19","v":" "},{"$f":"DECEMBRE!U19","v":0},{"$f":"DECEMBRE!V19","v":0},{"$f":"DECEMBRE!W19","v":0},{"$f":"DECEMBRE!X19","v":0},{"$f":"DECEMBRE!Y19","v":0},{"$f":"DECEMBRE!Z19","v":0},{"$f":"DECEMBRE!AA19","v":0},{"$f":"DECEMBRE!AB19","v":0},{"$f":"DECEMBRE!AC19","v":0},{"$f":"DECEMBRE!AD19","v":0},{"$f":"DECEMBRE!AE19","v":0},{"$f":"DECEMBRE!AF19","v":0},{"$f":"DECEMBRE!AG19","v":0},{"$f":"DECEMBRE!AH19","v":0},0,null,{"$f":"DECEMBRE!B19","v":" "},{"$f":"DECEMBRE!AI19","v":0},{"$f":"DECEMBRE!AJ19","v":0},{"$f":"DECEMBRE!AK19","v":0},{"$f":"DECEMBRE!AL19","v":0},{"$f":"DECEMBRE!AM19","v":0},{"$f":"DECEMBRE!AN19","v":0},{"$f":"DECEMBRE!AO19","v":0},{"$f":"DECEMBRE!AP19","v":0},{"$f":"DECEMBRE!AQ19","v":0},{"$f":"DECEMBRE!AR19","v":0},{"$f":"DECEMBRE!AS19","v":0},{"$f":"DECEMBRE!AT19","v":0},{"$f":"DECEMBRE!AU19","v":0},{"$f":"DECEMBRE!AV19","v":0},0,null,{"$f":"DECEMBRE!B19","v":" "},{"$f":"DECEMBRE!AW19","v":0},{"$f":"DECEMBRE!AX19","v":0},{"$f":"DECEMBRE!AY19","v":0},{"$f":"DECEMBRE!AZ19","v":0},{"$f":"DECEMBRE!BA19","v":0},{"$f":"DECEMBRE!BB19","v":0},{"$f":"DECEMBRE!BC19","v":0},{"$f":"DECEMBRE!BD19","v":0},{"$f":"DECEMBRE!BE19","v":0},{"$f":"DECEMBRE!BF19","v":0},{"$f":"DECEMBRE!BG19","v":0},{"$f":"DECEMBRE!BH19","v":0},{"$f":"DECEMBRE!BI19","v":0},{"$f":"DECEMBRE!BJ19","v":0},0,null,{"$f":"DECEMBRE!B19","v":" "},{"$f":"DECEMBRE!BK19","v":0},{"$f":"DECEMBRE!BL19","v":0}]
[null,{"$f":"DECEMBRE!B20","v":"H"},{"$f":"DECEMBRE!G20","v":0},{"$f":"DECEMBRE!H20","v":0},{"$f":"DECEMBRE!I20","v":0},{"$f":"DECEMBRE!J20","v":0},{"$f":"DECEMBRE!K20","v":0},{"$f":"DECEMBRE!L20","v":0},{"$f":"DECEMBRE!M20","v":0},{"$f":"DECEMBRE!N20","v":0},{"$f":"DECEMBRE!O20","v":0},{"$f":"DECEMBRE!P20","v":0},{"$f":"DECEMBRE!Q20","v":0},{"$f":"DECEMBRE!R20","v":0},{"$f":"DECEMBRE!S20","v":0},{"$f":"DECEMBRE!T20","v":0},0,null,{"$f":"DECEMBRE!B20","v":"H"},{"$f":"DECEMBRE!U20","v":0},{"$f":"DECEMBRE!V20","v":0},{"$f":"DECEMBRE!W20","v":0},{"$f":"DECEMBRE!X20","v":0},{"$f":"DECEMBRE!Y20","v":0},{"$f":"DECEMBRE!Z20","v":0},{"$f":"DECEMBRE!AA20","v":0},{"$f":"DECEMBRE!AB20","v":0},{"$f":"DECEMBRE!AC20","v":0},{"$f":"DECEMBRE!AD20","v":0},{"$f":"DECEMBRE!AE20","v":0},{"$f":"DECEMBRE!AF20","v":0},{"$f":"DECEMBRE!AG20","v":0},{"$f":"DECEMBRE!AH20","v":0},0,null,{"$f":"DECEMBRE!B20","v":"H"},{"$f":"DECEMBRE!AI20","v":0},{"$f":"DECEMBRE!AJ20","v":0},{"$f":"DECEMBRE!AK20","v":0},{"$f":"DECEMBRE!AL20","v":0},{"$f":"DECEMBRE!AM20","v":0},{"$f":"DECEMBRE!AN20","v":0},{"$f":"DECEMBRE!AO20","v":0},{"$f":"DECEMBRE!AP20","v":0},{"$f":"DECEMBRE!AQ20","v":0},{"$f":"DECEMBRE!AR20","v":0},{"$f":"DECEMBRE!AS20","v":0},{"$f":"DECEMBRE!AT20","v":0},{"$f":"DECEMBRE!AU20","v":0},{"$f":"DECEMBRE!AV20","v":0},0,null,{"$f":"DECEMBRE!B20","v":"H"},{"$f":"DECEMBRE!AW20","v":0},{"$f":"DECEMBRE!AX20","v":0},{"$f":"DECEMBRE!AY20","v":0},{"$f":"DECEMBRE!AZ20","v":0},{"$f":"DECEMBRE!BA20","v":0},{"$f":"DECEMBRE!BB20","v":0},{"$f":"DECEMBRE!BC20","v":0},{"$f":"DECEMBRE!BD20","v":0},{"$f":"DECEMBRE!BE20","v":0},{"$f":"DECEMBRE!BF20","v":0},{"$f":"DECEMBRE!BG20","v":0},{"$f":"DECEMBRE!BH20","v":0},{"$f":"DECEMBRE!BI20","v":0},{"$f":"DECEMBRE!BJ20","v":0},0,null,{"$f":"DECEMBRE!B20","v":"H"},{"$f":"DECEMBRE!BK20","v":0},{"$f":"DECEMBRE!BL20","v":0}]
[null,{"$f":"DECEMBRE!B21","v":"T"},{"$f":"DECEMBRE!G21","v":0},{"$f":"DECEMBRE!H21","v":0},{"$f":"DECEMBRE!I21","v":0},{"$f":"DECEMBRE!J21","v":0},{"$f":"DECEMBRE!K21","v":0},{"$f":"DECEMBRE!L21","v":0},{"$f":"DECEMBRE!M21","v":0},{"$f":"DECEMBRE!N21","v":0},{"$f":"DECEMBRE!O21","v":0},{"$f":"DECEMBRE!P21","v":0},{"$f":"DECEMBRE!Q21","v":0},{"$f":"DECEMBRE!R21","v":0},{"$f":"DECEMBRE!S21","v":0},{"$f":"DECEMBRE!T21","v":0},0,null,{"$f":"DECEMBRE!B21","v":"T"},{"$f":"DECEMBRE!U21","v":0},{"$f":"DECEMBRE!V21","v":0},{"$f":"DECEMBRE!W21","v":0},{"$f":"DECEMBRE!X21","v":0},{"$f":"DECEMBRE!Y21","v":0},{"$f":"DECEMBRE!Z21","v":0},{"$f":"DECEMBRE!AA21","v":0},{"$f":"DECEMBRE!AB21","v":0},{"$f":"DECEMBRE!AC21","v":0},{"$f":"DECEMBRE!AD21","v":0},{"$f":"DECEMBRE!AE21","v":0},{"$f":"DECEMBRE!AF21","v":0},{"$f":"DECEMBRE!AG21","v":0},{"$f":"DECEMBRE!AH21","v":0},0,null,{"$f":"DECEMBRE!B21","v":"T"},{"$f":"DECEMBRE!AI21","v":0},{"$f":"DECEMBRE!AJ21","v":0},{"$f":"DECEMBRE!AK21","v":0},{"$f":"DECEMBRE!AL21","v":0},{"$f":"DECEMBRE!AM21","v":0},{"$f":"DECEMBRE!AN21","v":0},{"$f":"DECEMBRE!AO21","v":0},{"$f":"DECEMBRE!AP21","v":0},{"$f":"DECEMBRE!AQ21","v":0},{"$f":"DECEMBRE!AR21","v":0},{"$f":"DECEMBRE!AS21","v":0},{"$f":"DECEMBRE!AT21","v":0},{"$f":"DECEMBRE!AU21","v":0},{"$f":"DECEMBRE!AV21","v":0},0,null,{"$f":"DECEMBRE!B21","v":"T"},{"$f":"DECEMBRE!AW21","v":0},{"$f":"DECEMBRE!AX21","v":0},{"$f":"DECEMBRE!AY21","v":0},{"$f":"DECEMBRE!AZ21","v":0},{"$f":"DECEMBRE!BA21","v":0},{"$f":"DECEMBRE!BB21","v":0},{"$f":"DECEMBRE!BC21","v":0},{"$f":"DECEMBRE!BD21","v":0},{"$f":"DECEMBRE!BE21","v":0},{"$f":"DECEMBRE!BF21","v":0},{"$f":"DECEMBRE!BG21","v":0},{"$f":"DECEMBRE!BH21","v":0},{"$f":"DECEMBRE!BI21","v":0},{"$f":"DECEMBRE!BJ21","v":0},0,null,{"$f":"DECEMBRE!B21","v":"T"},{"$f":"DECEMBRE!BK21","v":0},{"$f":"DECEMBRE!BL21","v":0}]
[null,{"$f":"DECEMBRE!B22","v":"S"},{"$f":"DECEMBRE!G22","v":0},{"$f":"DECEMBRE!H22","v":0},{"$f":"DECEMBRE!I22","v":0},{"$f":"DECEMBRE!J22","v":0},{"$f":"DECEMBRE!K22","v":0},{"$f":"DECEMBRE!L22","v":0},{"$f":"DECEMBRE!M22","v":0},{"$f":"DECEMBRE!N22","v":0},{"$f":"DECEMBRE!O22","v":0},{"$f":"DECEMBRE!P22","v":0},{"$f":"DECEMBRE!Q22","v":0},{"$f":"DECEMBRE!R22","v":0},{"$f":"DECEMBRE!S22","v":0},{"$f":"DECEMBRE!T22","v":0},0,null,{"$f":"DECEMBRE!B22","v":"S"},{"$f":"DECEMBRE!U22","v":0},{"$f":"DECEMBRE!V22","v":0},{"$f":"DECEMBRE!W22","v":0},{"$f":"DECEMBRE!X22","v":0},{"$f":"DECEMBRE!Y22","v":0},{"$f":"DECEMBRE!Z22","v":0},{"$f":"DECEMBRE!AA22","v":0},{"$f":"DECEMBRE!AB22","v":0},{"$f":"DECEMBRE!AC22","v":0},{"$f":"DECEMBRE!AD22","v":0},{"$f":"DECEMBRE!AE22","v":0},{"$f":"DECEMBRE!AF22","v":0},{"$f":"DECEMBRE!AG22","v":0},{"$f":"DECEMBRE!AH22","v":0},0,null,{"$f":"DECEMBRE!B22","v":"S"},{"$f":"DECEMBRE!AI22","v":0},{"$f":"DECEMBRE!AJ22","v":0},{"$f":"DECEMBRE!AK22","v":0},{"$f":"DECEMBRE!AL22","v":0},{"$f":"DECEMBRE!AM22","v":0},{"$f":"DECEMBRE!AN22","v":0},{"$f":"DECEMBRE!AO22","v":0},{"$f":"DECEMBRE!AP22","v":0},{"$f":"DECEMBRE!AQ22","v":0},{"$f":"DECEMBRE!AR22","v":0},{"$f":"DECEMBRE!AS22","v":0},{"$f":"DECEMBRE!AT22","v":0},{"$f":"DECEMBRE!AU22","v":0},{"$f":"DECEMBRE!AV22","v":0},0,null,{"$f":"DECEMBRE!B22","v":"S"},{"$f":"DECEMBRE!AW22","v":0},{"$f":"DECEMBRE!AX22","v":0},{"$f":"DECEMBRE!AY22","v":0},{"$f":"DECEMBRE!AZ22","v":0},{"$f":"DECEMBRE!BA22","v":0},{"$f":"DECEMBRE!BB22","v":0},{"$f":"DECEMBRE!BC22","v":0},{"$f":"DECEMBRE!BD22","v":0},{"$f":"DECEMBRE!BE22","v":0},{"$f":"DECEMBRE!BF22","v":0},{"$f":"DECEMBRE!BG22","v":0},{"$f":"DECEMBRE!BH22","v":0},{"$f":"DECEMBRE!BI22","v":0},{"$f":"DECEMBRE!BJ22","v":0},0,null,{"$f":"DECEMBRE!B22","v":"S"},{"$f":"DECEMBRE!BK22","v":0},{"$f":"DECEMBRE!BL22","v":0}]