{"text_format":"1","workbook":"xlsx","n_sheets":10,"sheets":["FICHA_SUPPLEMENTADO","Produccion","Ensacado","Silos","Nueva","NuevaEns","Nueva_Nec","Tb_mezcla","Tb_mezcla2","Datos"],"not_rendered":{"charts":0,"images":14,"macros":1,"external_links":0,"defined_names":24,"comments":0,"pivot_tables":0},"unopened":[],"bounds":{"document_bytes":16777216,"sheet_cells":100000,"rows_first":2000,"rows_last":500,"rows_between":2000,"halvings":0,"cell_chars":16384,"cell_head_chars":4096},"cells_cut":0,"cells_raw":0,"read":"whole","date_system":"1900"}

{"sheet":"FICHA_SUPPLEMENTADO","index":0,"n_rows":28,"n_cols":13,"rows_kept":28,"cut":false,"hidden":false,"merged":[[24,7,27,11],[12,11,12,12],[4,7,4,10],[2,7,2,10],[3,7,3,10],[22,7,22,11],[6,11,6,12],[7,11,7,12],[8,11,8,12],[9,11,9,12],[10,11,10,12],[11,11,11,12]]}
[]
[]
[null,null,null,null,null,null,null,"Automatico! No modificar!"]
[null,null,null,null,null,null,null,"DATOS DE FABRICACION",null,null,null,null,{"$f":"TODAY()","v":"2018-07-24"}]
[null,null,null,null,null,null,null,{"$f":"IF(B6<>\"\",B6,\"\")","v":""},null,null,null,null,{"$f":"NomUtilisateur()","v":"serine_a"}]
[]
[null,null,null,null,null,null,null,{"$f":"A7&\" :\"","v":" :"},{"$f":"IF(B8<>\"\",INDEX(Tb_mezcla2!A1:M1,MIN(IF(Tb_mezcla2!B3:M7=I13,COLUMN(Tb_mezcla2!B3:M7)))),\"\")","v":""},null,{"$f":"IF(A10<>\"\",A10&\" :\",\"\")","v":""},{"$f":"B10","v":0}]
[null,null,null,null,null,null,null,null,null,null,{"$f":"IF(A14<>\"\",A14&\" :\",\"\")","v":""},{"$f":"IF(B14<>\"\",B14,\"\")","v":""}]
[null,null,null,null,null,null,null,{"$f":"C7&\" :\"","v":" :"},{"$f":"IF(B8<>\"\",INDEX(Tb_mezcla2!A1:A7,MIN(IF(Tb_mezcla2!B3:M7=I13,ROW(Tb_mezcla2!B3:M7)))),\"\")","v":""},null,{"$f":"IF(A15<>\"\",A15&\" :\",\"\")","v":""},{"$f":"IF(A16<>\"\",A16,\"\")","v":""}]
[null,null,null,null,null,null,null,null,null,null,{"$f":"IF(A17<>\"\",A17&\" :\",\"\")","v":""},{"$f":"IF(B17<>\"\",B17,\"\")","v":""}]
[null,null,null,null,null,null,null,"Cantidad real :",{"$f":"IF(B8<>\"\",B8,\"\")","v":""},null,{"$f":"IF(A18<>\"\",A18&\" :\",\"\")","v":""},{"$f":"IF(B18<>\"\",B18,\"\")","v":""}]
[null,null,null,null,null,null,null,null,null,null,{"$f":"IF(A19<>\"\",A19&\" :\",\"\")","v":""},{"$f":"IF(B19<>\"\",B19,\"\")","v":""}]
[null,null,null,null,null,null,null,"Cantidad a fabricar :",{"$f":"MIN(IF(ABS(Tb_mezcla2!B3:M7-I11)=MIN(ABS(Tb_mezcla2!B3:M7-I11)),Tb_mezcla2!B3:M7))","v":{"$error":"#VALUE!"}},null,"N°Variante : ",{"$f":"IF(A3<>\"\",A3,\"\")","v":""}]
[]
[null,null,null,null,null,null,"PC",{"$f":"IF(A30<>\"\",A30,\"\")","v":""},"","","","Kg/Mezcla"]
{"$rows_left_out":14}
{"sheet":"Produccion","index":1,"n_rows":4,"n_cols":120,"rows_kept":4,"cut":false,"hidden":false,"merged":[[0,20,0,23],[1,14,1,15],[1,6,1,8],[1,0,1,3],[1,4,1,5],[1,10,1,11],[1,12,1,13],[0,13,0,15]]}
[null,null,null,null,null,null,null,null,null,null,null,null,null,{"$f":"NomUtilisateur()","v":"serine_a"},null,null,"Fecha Principio :","2018-07-23","Hora de Comienzo :","09:00:00","GANTT DE PRODUCCION"]
["|                                  CONTROL                                 |",null,null,null,"|     DESCRITPION PRODUCTO    |",null,"|             PRODUCCION            |",null,null,null,"|  Primero  |",null,"|    Segundo   |",null,"|   Tercero   |",null,"Fecha fin :",{"$f":"R1+1","v":"2018-07-24"},"Escala temporal :","00:15:00",null,null,null,null,{"$f":"IF($T$1+$R$1>=$R$2,\"\",$T$1+$R$1)","v":"2018-07-23T09:00:00"},{"$f":"IF(Y2<>\"\",IF(Y2+$T$2>=$R$2+$T$1,\"\",Y2+$T$2),\"\")","v":"2018-07-23T09:15:00"},"2018-07-23T09:30:00","2018-07-23T09:45:00","2018-07-23T10:00:00","2018-07-23T10:15:00","2018-07-23T10:30:00","2018-07-23T10:45:00","2018-07-23T11:00:00","2018-07-23T11:15:00","2018-07-23T11:30:00","2018-07-23T11:45:00","2018-07-23T12:00:00","2018-07-23T12:15:00","2018-07-23T12:30:00","2018-07-23T12:45:00","2018-07-23T13:00:00","2018-07-23T13:15:00","2018-07-23T13:30:00","2018-07-23T13:45:00","2018-07-23T14:00:00","2018-07-23T14:15:00","2018-07-23T14:30:00","2018-07-23T14:45:00","2018-07-23T15:00:00","2018-07-23T15:15:00","2018-07-23T15:30:00","2018-07-23T15:45:00","2018-07-23T16:00:00","2018-07-23T16:15:00","2018-07-23T16:30:00","2018-07-23T16:45:00","2018-07-23T17:00:00",{"$f":"IF(BE2<>\"\",IF(BE2+$T$2>=$R$2+$T$1,\"\",BE2+$T$2),\"\")","v":"2018-07-23T17:15:00"},"2018-07-23T17:30:00","2018-07-23T17:45:00","2018-07-23T18:00:00","2018-07-23T18:15:00","2018-07-23T18:30:00","2018-07-23T18:45:00","2018-07-23T19:00:00","2018-07-23T19:15:00","2018-07-23T19:30:00","2018-07-23T19:45:00","2018-07-23T20:00:00","2018-07-23T20:15:00","2018-07-23T20:30:00","2018-07-23T20:45:00","2018-07-23T21:00:00","2018-07-23T21:15:00","2018-07-23T21:30:00","2018-07-23T21:45:00","2018-07-23T22:00:00","2018-07-23T22:15:00","2018-07-23T22:30:00","2018-07-23T22:45:00","2018-07-23T23:00:00","2018-07-23T23:15:00","2018-07-23T23:30:00","2018-07-23T23:45:00","2018-07-24","2018-07-24T00:15:00","2018-07-24T00:30:00","2018-07-24T00:45:00","2018-07-24T01:00:00",{"$f":"IF(CK2<>\"\",IF(CK2+$T$2>=$R$2+$T$1,\"\",CK2+$T$2),\"\")","v":"2018-07-24T01:15:00"},"2018-07-24T01:30:00","2018-07-24T01:45:00","2018-07-24T02:00:00","2018-07-24T02:15:00","2018-07-24T02:30:00","2018-07-24T02:45:00","2018-07-24T03:00:00","2018-07-24T03:15:00","2018-07-24T03:30:00","2018-07-24T03:45:00","2018-07-24T04:00:00","2018-07-24T04:15:00","2018-07-24T04:30:00","2018-07-24T04:45:00","2018-07-24T05:00:00","2018-07-24T05:15:00","2018-07-24T05:30:00","2018-07-24T05:45:00","2018-07-24T06:00:00","2018-07-24T06:15:00","2018-07-24T06:30:00","2018-07-24T06:45:00","2018-07-24T07:00:00","2018-07-24T07:15:00","2018-07-24T07:30:00","2018-07-24T07:45:00","2018-07-24T08:00:00","2018-07-24T08:15:00","2018-07-24T08:30:00","2018-07-24T08:45:00"]
["ORDEN W2600","ORDEN ERP","HR","CODIGO","HARINA","GRANO","%","Mz","Tm","PR","S1","G1","S2","G2","S3","G3","RECYCLAGE","M/C o C/S","SUPPLEMENTADO","HORA COMIENZO","DURACION","RETRASO","HORA FIN PREVISTA","HORA DE FIN VERDADERA","1","2","3","4","5","6","7","8","9","10","11","12","13","14","15","16","17","18","19","20","21","22","23","24","25","26","27","28","29","30","31","32","33","34","35","36","37","38","39","40","41","42","43","44","45","46","47","48","49","50","51","52","53","54","55","56","57","58","59","60","61","62","63","64","65","66","67","68","69","70","71","72","73","74","75","76","77","78","79","80","81","82","83","84","85","86","87","88","89","90","91","92","93","94","95","96"]
[null,null,null,null,null,null,{"$f":"IF(I4<>\"\",INDEX(Tb_mezcla!$A$1:$A$8,MIN(IF(Tb_mezcla!$B$3:$M$8=I4,ROW(Tb_mezcla!$B$3:$M$8)))),\"\")","v":""},{"$f":"IF(I4<>\"\",INDEX(Tb_mezcla!$A$1:$M$1,MIN(IF(Tb_mezcla!$B$3:$M$8=I4,COLUMN(Tb_mezcla!$B$3:$M$8)))),\"\")","v":""},null,null,null,null,null,null,null,null,null,null,null,null,null,null,{"$f":"IF(T4<>\"\",T4+U4,\"\")","v":""},{"$f":"IF(T4<>\"\",T4+U4+V4,\"\")","v":""},{"$f":"IF($T4<>\"\",IF(AND(Y$2>=$T4,Y$2<$X4),IF(AND(Y$2>=$T4,Y$2<$W4),1,2),0),\"\")","v":""},"","","","","","","","","",{"$f":"IF($T4<>\"\",IF(AND(AI$2>=$T4,AI$2<$X4),IF(AND(AI$2>=$T4,AI$2<$W4),1,2),0),\"\")","v":""},"","","","","","","","","",{"$f":"IF($T4<>\"\",IF(AND(AS$2>=$T4,AS$2<$X4),IF(AND(AS$2>=$T4,AS$2<$W4),1,2),0),\"\")","v":""},"","","","","","","","","",{"$f":"IF($T4<>\"\",IF(AND(BC$2>=$T4,BC$2<$X4),IF(AND(BC$2>=$T4,BC$2<$W4),1,2),0),\"\")","v":""},"","","","","","","","","",{"$f":"IF($T4<>\"\",IF(AND(BM$2>=$T4,BM$2<$X4),IF(AND(BM$2>=$T4,BM$2<$W4),1,2),0),\"\")","v":""},"","","","","","","","","",{"$f":"IF($T4<>\"\",IF(AND(BW$2>=$T4,BW$2<$X4),IF(AND(BW$2>=$T4,BW$2<$W4),1,2),0),\"\")","v":""},"","","","","","","","","",{"$f":"IF($T4<>\"\",IF(AND(CG$2>=$T4,CG$2<$X4),IF(AND(CG$2>=$T4,CG$2<$W4),1,2),0),\"\")","v":""},"","","","","","","","","",{"$f":"IF($T4<>\"\",IF(AND(CQ$2>=$T4,CQ$2<$X4),IF(AND(CQ$2>=$T4,CQ$2<$W4),1,2),0),\"\")","v":""},"","","","","","","","","",{"$f":"IF($T4<>\"\",IF(AND(DA$2>=$T4,DA$2<$X4),IF(AND(DA$2>=$T4,DA$2<$W4),1,2),0),\"\")","v":""},"","","","","","","","","",{"$f":"IF($T4<>\"\",IF(AND(DK$2>=$T4,DK$2<$X4),IF(AND(DK$2>=$T4,DK$2<$W4),1,2),0),\"\")","v":""},"","","","",""]

{"sheet":"Ensacado","index":2,"n_rows":3,"n_cols":12,"rows_kept":3,"cut":false,"hidden":false,"merged":[[1,0,1,1],[1,2,1,3]]}
[]
[{"$f":"Produccion!R1","v":"2018-07-23"},null,{"$f":"NomUtilisateur()","v":"serine_a"}]
["TURNO","ORDEN","OP","PESO","PRODUCTO","TIPO","PALETS","SILO","SACOS ALMACEN","KG RECUPERAR","ENVASES ROTOS","Observaciones"]

{"sheet":"Silos","index":3,"n_rows":57,"n_cols":27,"rows_kept":57,"cut":false,"hidden":false,"merged":[[3,26,8,26],[11,4,13,6],[14,4,14,6],[11,7,13,9],[14,7,14,9],[11,10,13,12],[14,10,14,12],[14,13,14,15],[11,13,13,15],[14,25,14,27],[11,25,13,27],[14,22,14,24],[11,22,13,24],[14,19,14,21],[14,16,14,18],[11,19,13,21],[3,5,8,5],[3,8,8,8],[3,11,8,11],[3,14,8,14],[3,17,8,17],[3,20,8,20],[3,23,8,23],[30,13,30,15],[30,16,30,18],[11,1,13,3],[14,1,14,3],[19,2,24,2],[19,11,24,11],[19,8,24,8],[19,5,24,5],[30,1,30,3],[27,1,29,3],[30,19,30,21],[30,22,30,24],[11,16,13,18],[3,2,8,2],[19,26,24,26],[19,23,24,23],[19,20,24,20],[19,17,24,17],[19,14,24,14],[32,26,37,26],[32,23,37,23],[32,20,37,20],[32,17,37,17],[32,14,37,14],[32,8,37,8],[32,5,37,5],[32,2,37,2],[27,16,29,18],[27,13,29,15],[27,10,29,12],[27,7,29,9],[27,4,29,6],[32,11,37,11],[30,25,30,27],[27,25,29,27],[27,22,29,24],[27,19,29,21],[30,4,30,6],[30,7,30,9],[30,10,30,12],[43,1,43,3],[43,4,43,6],[43,7,43,9],[43,10,43,12],[40,10,42,12],[40,7,42,9],[40,4,42,6],[40,1,42,3],[40,25,42,27],[40,22,42,24],[40,19,42,21],[40,16,42,18],[40,13,42,15],[43,13,43,15],[43,16,43,18],[43,19,43,21],[43,22,43,24],[43,25,43,27],[56,13,56,15],[56,16,56,18],[53,16,55,18],[53,13,55,15],[53,10,55,12],[45,2,50,2],[56,1,56,3],[56,4,56,6],[56,7,56,9],[56,10,56,12],[53,7,55,9],[53,4,55,6],[53,1,55,3],[45,17,50,17],[45,14,50,14],[45,11,50,11],[45,8,50,8],[45,5,50,5]]}
[]
[]
[]
[null,null,"1S",null,null,"2S",null,null,"3S",null,null,"4S",null,null,"5S",null,null,"6S",null,null,"7S",null,null,"8S",null,null,"9S"]
[]
[]
[]
[]
[]
[]
[null,null,false,null,null,false,null,null,false,null,null,false,null,null,false,null,null,false,null,null,false,null,null,false,null,null,false]
[null,{"$f":"IFERROR(IF(INDEX(Produccion!E4:L4,MATCH(C4,Produccion!K4:K4,0),1)<>\"  \",INDEX(Produccion!E4:L4,MATCH(C4,Produccion!K4:K4,0),1),INDEX(Produccion!E4:L4,MATCH(C4,Produccion!K4:K4,0),2)),\"\")","v":""},null,null,{"$f":"IFERROR(IF(INDEX(Produccion!E4:L4,MATCH(F4,Produccion!K4:K4,0),1)<>\"  \",INDEX(Produccion!E4:L4,MATCH(F4,Produccion!K4:K4,0),1),INDEX(Produccion!E4:L4,MATCH(F4,Produccion!K4:K4,0),2)),\"\")","v":""},null,null,{"$f":"IFERROR(IF(INDEX(Produccion!E4:L4,MATCH(I4,Produccion!K4:K4,0),1)<>\"  \",INDEX(Produccion!E4:L4,MATCH(I4,Produccion!K4:K4,0),1),INDEX(Produccion!E4:L4,MATCH(I4,Produccion!K4:K4,0),2)),\"\")","v":""},null,null,{"$f":"IFERROR(IF(INDEX(Produccion!E4:L4,MATCH(L4,Produccion!K4:K4,0),1)<>\"  \",INDEX(Produccion!E4:L4,MATCH(L4,Produccion!K4:K4,0),1),INDEX(Produccion!E4:L4,MATCH(L4,Produccion!K4:K4,0),2)),\"\")","v":""},null,null,{"$f":"IFERROR(IF(INDEX(Produccion!E4:L4,MATCH(O4,Produccion!K4:K4,0),1)<>\"  \",INDEX(Produccion!E4:L4,MATCH(O4,Produccion!K4:K4,0),1),INDEX(Produccion!E4:L4,MATCH(O4,Produccion!K4:K4,0),2)),\"\")","v":""},null,null,{"$f":"IFERROR(IF(INDEX(Produccion!E4:L4,MATCH(R4,Produccion!K4:K4,0),1)<>\"  \",INDEX(Produccion!E4:L4,MATCH(R4,Produccion!K4:K4,0),1),INDEX(Produccion!E4:L4,MATCH(R4,Produccion!K4:K4,0),2)),\"\")","v":""},null,null,{"$f":"IFERROR(IF(INDEX(Produccion!E4:L4,MATCH(U4,Produccion!K4:K4,0),1)<>\"  \",INDEX(Produccion!E4:L4,MATCH(U4,Produccion!K4:K4,0),1),INDEX(Produccion!E4:L4,MATCH(U4,Produccion!K4:K4,0),2)),\"\")","v":""},null,null,{"$f":"IFERROR(IF(INDEX(Produccion!E4:L4,MATCH(X4,Produccion!K4:K4,0),1)<>\"  \",INDEX(Produccion!E4:L4,MATCH(X4,Produccion!K4:K4,0),1),INDEX(Produccion!E4:L4,MATCH(X4,Produccion!K4:K4,0),2)),\"\")","v":""},null,null,{"$f":"IFERROR(IF(INDEX(Produccion!E4:L4,MATCH(AA4,Produccion!K4:K4,0),1)<>\"  \",INDEX(Produccion!E4:L4,MATCH(AA4,Produccion!K4:K4,0),1),INDEX(Produccion!E4:L4,MATCH(AA4,Produccion!K4:K4,0),2)),\"\")","v":""}]
[]
[]
[null,{"$f":"IFERROR(INDEX(Produccion!E4:L4,MATCH(C4,Produccion!K4:K4,0),5)&\" Tm\",\"\")","v":""},null,null,{"$f":"IFERROR(INDEX(Produccion!E4:L4,MATCH(F4,Produccion!K4:K4,0),5)&\" Tm\",\"\")","v":""},null,null,{"$f":"IFERROR(INDEX(Produccion!E4:L4,MATCH(I4,Produccion!K4:K4,0),5)&\" Tm\",\"\")","v":""},null,null,{"$f":"IFERROR(INDEX(Produccion!E4:L4,MATCH(L4,Produccion!K4:K4,0),5)&\" Tm\",\"\")","v":""},null,null,{"$f":"IFERROR(INDEX(Produccion!E4:L4,MATCH(O4,Produccion!K4:K4,0),5)&\" Tm\",\"\")","v":""},null,null,{"$f":"IFERROR(INDEX(Produccion!E4:L4,MATCH(R4,Produccion!K4:K4,0),5)&\" Tm\",\"\")","v":""},null,null,{"$f":"IFERROR(INDEX(Produccion!E4:L4,MATCH(U4,Produccion!K4:K4,0),5)&\" Tm\",\"\")","v":""},null,null,{"$f":"IFERROR(INDEX(Produccion!E4:L4,MATCH(X4,Produccion!K4:K4,0),5)&\" Tm\",\"\")","v":""},null,null,{"$f":"IFERROR(INDEX(Produccion!E4:L4,MATCH(AA4,Produccion!K4:K4,0),5)&\" Tm\",\"\")","v":""}]
{"$rows_left_out":43}
{"sheet":"Nueva","index":4,"n_rows":0,"n_cols":0,"rows_kept":0,"cut":false,"hidden":false,"merged":[]}

{"sheet":"NuevaEns","index":5,"n_rows":0,"n_cols":0,"rows_kept":0,"cut":false,"hidden":false,"merged":[]}

{"sheet":"Nueva_Nec","index":6,"n_rows":0,"n_cols":0,"rows_kept":0,"cut":false,"hidden":false,"merged":[]}

{"sheet":"Tb_mezcla","index":7,"n_rows":8,"n_cols":13,"rows_kept":8,"cut":false,"hidden":false,"merged":[]}
[null,1,2,3,4,5,6,7,8,9,10,11,12]
["% de mezcla","Tm"]
[0.03,0.09]
[0.35,1.05]
[0.7,2.1,{"$f":"B5*$C$1","v":4.2},{"$f":"B5*$D$1","v":6.3000000000000007},{"$f":"B5*$E$1","v":8.4},{"$f":"B5*$F$1","v":10.5},{"$f":"B5*$G$1","v":12.600000000000001},{"$f":"B5*$H$1","v":14.700000000000001},null,null,null,{"$f":"B5*$L$1","v":23.1},{"$f":"B5*$M$1","v":25.200000000000003}]
[0.8,2.4,{"$f":"B6*$C$1","v":4.8},{"$f":"B6*$D$1","v":7.1999999999999993},{"$f":"B6*4","v":9.6},null,{"$f":"B6*$G$1","v":14.399999999999999},{"$f":"B6*$H$1","v":16.8},{"$f":"B6*$I$1","v":19.2},null,null,{"$f":"B6*$L$1","v":26.4},{"$f":"B6*$M$1","v":28.799999999999997}]
[0.9,2.7,{"$f":"B7*$C$1","v":5.4},{"$f":"B7*$D$1","v":8.1000000000000014},{"$f":"B7*4","v":10.8},{"$f":"B7*$F$1","v":13.5},{"$f":"B7*$G$1","v":16.200000000000003},{"$f":"B7*$H$1","v":18.900000000000002},{"$f":"B7*$I$1","v":21.6},{"$f":"B7*$J$1","v":24.3},null,{"$f":"B7*$L$1","v":29.700000000000003},{"$f":"B7*$M$1","v":32.400000000000006}]
[1,3,{"$f":"B8*$C$1","v":6},{"$f":"B8*$D$1","v":9},{"$f":"B8*4","v":12},{"$f":"B8*$F$1","v":15},{"$f":"B8*$G$1","v":18},{"$f":"B8*$H$1","v":21},{"$f":"B8*$I$1","v":24},{"$f":"B8*$J$1","v":27},{"$f":"B8*$K$1","v":30},{"$f":"B8*$L$1","v":33},{"$f":"B8*$M$1","v":36}]

{"sheet":"Tb_mezcla2","index":8,"n_rows":7,"n_cols":13,"rows_kept":7,"cut":false,"hidden":false,"merged":[]}
[null,1,2,3,4,5,6,7,8,9,10,11,12]
["% de mezcla","Tm"]
[0.35,1050]
[0.7,2100,{"$f":"B4*$C$1","v":4200},{"$f":"B4*$D$1","v":6300},{"$f":"B4*$E$1","v":8400},{"$f":"B4*$F$1","v":10500},{"$f":"B4*$G$1","v":12600},{"$f":"B4*$H$1","v":14700},null,null,null,{"$f":"B4*$L$1","v":23100},{"$f":"B4*$M$1","v":25200}]
[0.8,2400,{"$f":"B5*$C$1","v":4800},{"$f":"B5*$D$1","v":7200},{"$f":"B5*4","v":9600},null,{"$f":"B5*$G$1","v":14400},{"$f":"B5*$H$1","v":16800},{"$f":"B5*$I$1","v":19200},null,null,{"$f":"B5*$L$1","v":26400},{"$f":"B5*$M$1","v":28800}]
[0.9,2700,{"$f":"B6*$C$1","v":5400},{"$f":"B6*$D$1","v":8100},{"$f":"B6*4","v":10800},{"$f":"B6*$F$1","v":13500},{"$f":"B6*$G$1","v":16200},{"$f":"B6*$H$1","v":18900},{"$f":"B6*$I$1","v":21600},{"$f":"B6*$J$1","v":24300},null,{"$f":"B6*$L$1","v":29700},{"$f":"B6*$M$1","v":32400}]
[1,3000,{"$f":"B7*$C$1","v":6000},{"$f":"B7*$D$1","v":9000},{"$f":"B7*4","v":12000},{"$f":"B7*$F$1","v":15000},{"$f":"B7*$G$1","v":18000},{"$f":"B7*$H$1","v":21000},{"$f":"B7*$I$1","v":24000},{"$f":"B7*$J$1","v":27000},{"$f":"B7*$K$1","v":30000},{"$f":"B7*$L$1","v":33000},{"$f":"B7*$M$1","v":36000}]

{"sheet":"Datos","index":9,"n_rows":97,"n_cols":26,"rows_kept":97,"cut":false,"hidden":false,"merged":[]}
["PR",null,"Silos_Sacos",null,"Silos_Granel",null,"M/C o C/S",null,"Silos_2y3_Sacos","Silos_2y3_Granel",null,"Num_Orden","Lista evolutiva",null,"Horas",null,"Liste_Onglets",null,"Date","Horas_Gantt_1h","Horas_Gantt","Horas_Gantt_30","Escala_tempo",null,"Horas_Comienzo","Turno"]
[1,null,{"$f":"IF(Silos!C11=FALSE,\"1S\",\"\")","v":"1S"},null,{"$f":"IF(Silos!C$27=FALSE,\"1G\",\"\")","v":"1G"},null,"M/C",null,"1S","1G",null,1,{"$f":"IF(ROWS($1:1)<=COUNTA(Num_Orden)-COUNTA(Produccion!$A$4:$A$4),INDEX(Num_Orden,SMALL(IF((COUNTIF(Produccion!$A$4:$A$4,Num_Orden)=0),ROW(INDIRECT(\"1:\"&ROWS(Num_Orden)))),ROWS($1:1))),\"\")","v":1},null,"05:00:00",null,null,null,{"$f":"TODAY()-4","v":"2018-07-20"},"01:00:00","00:15:00","00:30:00","00:15:00",null,{"$f":"IF(Produccion!$T$1+Produccion!$R$1>=Produccion!$R$2,\"\",Produccion!$T$1+Produccion!$R$1)","v":"2018-07-23T09:00:00"},"A"]
[2,null,{"$f":"IF(Silos!F11=FALSE,\"2S\",\"\")","v":"2S"},null,{"$f":"IF(Silos!F$27=FALSE,\"2G\",\"\")","v":"2G"},null,"C/S",null,"2S","2G",null,2,{"$f":"IF(ROWS($1:2)<=COUNTA(Num_Orden)-COUNTA(Produccion!$A$4:$A$4),INDEX(Num_Orden,SMALL(IF((COUNTIF(Produccion!$A$4:$A$4,Num_Orden)=0),ROW(INDIRECT(\"1:\"&ROWS(Num_Orden)))),ROWS($1:2))),\"\")","v":2},null,"06:00:00",null,null,null,{"$f":"TODAY()-3","v":"2018-07-21"},"02:00:00","00:30:00","01:00:00","00:30:00",null,{"$f":"IF(Y2<>\"\",IF(Y2+Produccion!$T$2>=Produccion!$R$2+Produccion!$T$1,\"\",Y2+Produccion!$T$2),\"\")","v":"2018-07-23T09:15:00"},"B"]
[null,null,{"$f":"IF(Silos!I11=FALSE,\"3S\",\"\")","v":"3S"},null,{"$f":"IF(Silos!I$27=FALSE,\"3G\",\"\")","v":"3G"},null,null,null,"3S","3G",null,3,{"$f":"IF(ROWS($1:3)<=COUNTA(Num_Orden)-COUNTA(Produccion!$A$4:$A$4),INDEX(Num_Orden,SMALL(IF((COUNTIF(Produccion!$A$4:$A$4,Num_Orden)=0),ROW(INDIRECT(\"1:\"&ROWS(Num_Orden)))),ROWS($1:3))),\"\")","v":3},null,"07:00:00",null,null,null,{"$f":"TODAY()-2","v":"2018-07-22"},"03:00:00","00:45:00","01:30:00","01:00:00",null,{"$f":"IF(Y3<>\"\",IF(Y3+Produccion!$T$2>=Produccion!$R$2+Produccion!$T$1,\"\",Y3+Produccion!$T$2),\"\")","v":"2018-07-23T09:30:00"},"C"]
[null,null,{"$f":"IF(Silos!L11=FALSE,\"4S\",\"\")","v":"4S"},null,{"$f":"IF(Silos!L$27=FALSE,\"4G\",\"\")","v":"4G"},null,null,null,"4S","4G",null,4,{"$f":"IF(ROWS($1:4)<=COUNTA(Num_Orden)-COUNTA(Produccion!$A$4:$A$4),INDEX(Num_Orden,SMALL(IF((COUNTIF(Produccion!$A$4:$A$4,Num_Orden)=0),ROW(INDIRECT(\"1:\"&ROWS(Num_Orden)))),ROWS($1:4))),\"\")","v":4},null,"08:00:00",null,null,null,{"$f":"TODAY()-1","v":"2018-07-23"},"04:00:00","01:00:00","02:00:00",null,null,{"$f":"IF(Y4<>\"\",IF(Y4+Produccion!$T$2>=Produccion!$R$2+Produccion!$T$1,\"\",Y4+Produccion!$T$2),\"\")","v":"2018-07-23T09:45:00"}]
[null,null,{"$f":"IF(Silos!O11=FALSE,\"5S\",\"\")","v":"5S"},null,{"$f":"IF(Silos!O$27=FALSE,\"5G\",\"\")","v":"5G"},null,null,null,"5S","5G",null,5,{"$f":"IF(ROWS($1:5)<=COUNTA(Num_Orden)-COUNTA(Produccion!$A$4:$A$4),INDEX(Num_Orden,SMALL(IF((COUNTIF(Produccion!$A$4:$A$4,Num_Orden)=0),ROW(INDIRECT(\"1:\"&ROWS(Num_Orden)))),ROWS($1:5))),\"\")","v":5},null,"09:00:00",null,null,null,{"$f":"TODAY()","v":"2018-07-24"},"05:00:00","01:15:00","02:30:00",null,null,{"$f":"IF(Y5<>\"\",IF(Y5+Produccion!$T$2>=Produccion!$R$2+Produccion!$T$1,\"\",Y5+Produccion!$T$2),\"\")","v":"2018-07-23T10:00:00"}]
[null,null,{"$f":"IF(Silos!R11=FALSE,\"6S\",\"\")","v":"6S"},null,{"$f":"IF(Silos!R$27=FALSE,\"6G\",\"\")","v":"6G"},null,null,null,"6S","6G",null,6,{"$f":"IF(ROWS($1:6)<=COUNTA(Num_Orden)-COUNTA(Produccion!$A$4:$A$4),INDEX(Num_Orden,SMALL(IF((COUNTIF(Produccion!$A$4:$A$4,Num_Orden)=0),ROW(INDIRECT(\"1:\"&ROWS(Num_Orden)))),ROWS($1:6))),\"\")","v":6},null,"10:00:00",null,null,null,{"$f":"TODAY()+1","v":"2018-07-25"},"06:00:00","01:30:00","03:00:00",null,null,{"$f":"IF(Y6<>\"\",IF(Y6+Produccion!$T$2>=Produccion!$R$2+Produccion!$T$1,\"\",Y6+Produccion!$T$2),\"\")","v":"2018-07-23T10:15:00"}]
[null,null,{"$f":"IF(Silos!U11=FALSE,\"7S\",\"\")","v":"7S"},null,{"$f":"IF(Silos!U$27=FALSE,\"7G\",\"\")","v":"7G"},null,null,null,"7S","7G",null,7,{"$f":"IF(ROWS($1:7)<=COUNTA(Num_Orden)-COUNTA(Produccion!$A$4:$A$4),INDEX(Num_Orden,SMALL(IF((COUNTIF(Produccion!$A$4:$A$4,Num_Orden)=0),ROW(INDIRECT(\"1:\"&ROWS(Num_Orden)))),ROWS($1:7))),\"\")","v":7},null,"11:00:00",null,null,null,{"$f":"TODAY()+2","v":"2018-07-26"},"07:00:00","01:45:00","03:30:00",null,null,{"$f":"IF(Y7<>\"\",IF(Y7+Produccion!$T$2>=Produccion!$R$2+Produccion!$T$1,\"\",Y7+Produccion!$T$2),\"\")","v":"2018-07-23T10:30:00"}]
[null,null,{"$f":"IF(Silos!X11=FALSE,\"8S\",\"\")","v":"8S"},null,{"$f":"IF(Silos!X$27=FALSE,\"8G\",\"\")","v":"8G"},null,null,null,"8S","8G",null,8,{"$f":"IF(ROWS($1:8)<=COUNTA(Num_Orden)-COUNTA(Produccion!$A$4:$A$4),INDEX(Num_Orden,SMALL(IF((COUNTIF(Produccion!$A$4:$A$4,Num_Orden)=0),ROW(INDIRECT(\"1:\"&ROWS(Num_Orden)))),ROWS($1:8))),\"\")","v":8},null,"12:00:00",null,null,null,{"$f":"TODAY()+3","v":"2018-07-27"},"08:00:00","02:00:00","04:00:00",null,null,{"$f":"IF(Y8<>\"\",IF(Y8+Produccion!$T$2>=Produccion!$R$2+Produccion!$T$1,\"\",Y8+Produccion!$T$2),\"\")","v":"2018-07-23T10:45:00"}]
[null,null,{"$f":"IF(Silos!AA11=FALSE,\"9S\",\"\")","v":"9S"},null,{"$f":"IF(Silos!AA$27=FALSE,\"9G\",\"\")","v":"9G"},null,null,null,"9S","9G",null,9,{"$f":"IF(ROWS($1:9)<=COUNTA(Num_Orden)-COUNTA(Produccion!$A$4:$A$4),INDEX(Num_Orden,SMALL(IF((COUNTIF(Produccion!$A$4:$A$4,Num_Orden)=0),ROW(INDIRECT(\"1:\"&ROWS(Num_Orden)))),ROWS($1:9))),\"\")","v":9},null,"13:00:00",null,null,null,{"$f":"TODAY()+4","v":"2018-07-28"},"09:00:00","02:15:00","04:30:00",null,null,{"$f":"IF(Y9<>\"\",IF(Y9+Produccion!$T$2>=Produccion!$R$2+Produccion!$T$1,\"\",Y9+Produccion!$T$2),\"\")","v":"2018-07-23T11:00:00"}]
[null,null,null,null,{"$f":"IF(Silos!C$40=FALSE,\"10G\",\"\")","v":"10G"},null,null,null,null,"10G",null,10,{"$f":"IF(ROWS($1:10)<=COUNTA(Num_Orden)-COUNTA(Produccion!$A$4:$A$4),INDEX(Num_Orden,SMALL(IF((COUNTIF(Produccion!$A$4:$A$4,Num_Orden)=0),ROW(INDIRECT(\"1:\"&ROWS(Num_Orden)))),ROWS($1:10))),\"\")","v":10},null,"14:00:00",null,null,null,null,"10:00:00","02:30:00","05:00:00",null,null,{"$f":"IF(Y10<>\"\",IF(Y10+Produccion!$T$2>=Produccion!$R$2+Produccion!$T$1,\"\",Y10+Produccion!$T$2),\"\")","v":"2018-07-23T11:15:00"}]
[null,null,null,null,{"$f":"IF(Silos!F$40=FALSE,\"11G\",\"\")","v":"11G"},null,null,null,null,"11G",null,11,{"$f":"IF(ROWS($1:11)<=COUNTA(Num_Orden)-COUNTA(Produccion!$A$4:$A$4),INDEX(Num_Orden,SMALL(IF((COUNTIF(Produccion!$A$4:$A$4,Num_Orden)=0),ROW(INDIRECT(\"1:\"&ROWS(Num_Orden)))),ROWS($1:11))),\"\")","v":11},null,"15:00:00",null,null,null,null,"11:00:00","02:45:00","05:30:00",null,null,{"$f":"IF(Y11<>\"\",IF(Y11+Produccion!$T$2>=Produccion!$R$2+Produccion!$T$1,\"\",Y11+Produccion!$T$2),\"\")","v":"2018-07-23T11:30:00"}]
[null,null,null,null,{"$f":"IF(Silos!I$40=FALSE,\"12G\",\"\")","v":"12G"},null,null,null,null,"12G",null,12,{"$f":"IF(ROWS($1:12)<=COUNTA(Num_Orden)-COUNTA(Produccion!$A$4:$A$4),INDEX(Num_Orden,SMALL(IF((COUNTIF(Produccion!$A$4:$A$4,Num_Orden)=0),ROW(INDIRECT(\"1:\"&ROWS(Num_Orden)))),ROWS($1:12))),\"\")","v":12},null,"16:00:00",null,null,null,null,"12:00:00","03:00:00","06:00:00",null,null,{"$f":"IF(Y12<>\"\",IF(Y12+Produccion!$T$2>=Produccion!$R$2+Produccion!$T$1,\"\",Y12+Produccion!$T$2),\"\")","v":"2018-07-23T11:45:00"}]
[null,null,null,null,{"$f":"IF(Silos!L$40=FALSE,\"13G\",\"\")","v":"13G"},null,null,null,null,"13G",null,13,{"$f":"IF(ROWS($1:13)<=COUNTA(Num_Orden)-COUNTA(Produccion!$A$4:$A$4),INDEX(Num_Orden,SMALL(IF((COUNTIF(Produccion!$A$4:$A$4,Num_Orden)=0),ROW(INDIRECT(\"1:\"&ROWS(Num_Orden)))),ROWS($1:13))),\"\")","v":13},null,"17:00:00",null,null,null,null,"13:00:00","03:15:00","06:30:00",null,null,{"$f":"IF(Y13<>\"\",IF(Y13+Produccion!$T$2>=Produccion!$R$2+Produccion!$T$1,\"\",Y13+Produccion!$T$2),\"\")","v":"2018-07-23T12:00:00"}]
[null,null,null,null,{"$f":"IF(Silos!O$40=FALSE,\"14G\",\"\")","v":"14G"},null,null,null,null,"14G",null,14,{"$f":"IF(ROWS($1:14)<=COUNTA(Num_Orden)-COUNTA(Produccion!$A$4:$A$4),INDEX(Num_Orden,SMALL(IF((COUNTIF(Produccion!$A$4:$A$4,Num_Orden)=0),ROW(INDIRECT(\"1:\"&ROWS(Num_Orden)))),ROWS($1:14))),\"\")","v":14},null,"18:00:00",null,null,null,null,"14:00:00","03:30:00","07:00:00",null,null,{"$f":"IF(Y14<>\"\",IF(Y14+Produccion!$T$2>=Produccion!$R$2+Produccion!$T$1,\"\",Y14+Produccion!$T$2),\"\")","v":"2018-07-23T12:15:00"}]
{"$rows_left_out":82}