{"text_format":"1","workbook":"xlsx","n_sheets":7,"sheets":["Products","Iviltra","Iviltra MP","Orlen","Orlen MP","SER","SER MP"],"not_rendered":{"charts":0,"images":0,"macros":1,"external_links":0,"defined_names":7,"comments":7,"pivot_tables":0},"unopened":[],"bounds":{"document_bytes":16777216,"sheet_cells":100000,"rows_first":2000,"rows_last":500,"rows_between":2000,"halvings":0,"cell_chars":16384,"cell_head_chars":4096},"cells_cut":0,"cells_raw":0,"read":"whole","date_system":"1900"}

{"sheet":"Products","index":0,"n_rows":50,"n_cols":22,"rows_kept":50,"cut":false,"hidden":false,"merged":[[0,5,2,5],[0,10,1,11],[0,0,1,0],[0,1,1,1],[0,3,1,3],[0,4,1,4],[0,2,1,2],[0,20,1,21],[0,6,1,7],[0,8,1,9],[0,17,1,18],[0,12,1,13],[0,14,1,15]]}
["Toller","Iviltra","ORLEN","SER","Sogechem","Toller","Drop-Melt Point \nASTM-127-08 ",null,"Congealing Point\n ASTM-938-06  ",null,"Penetration ASTM-D937 \n(at XX°C w/cone)  ",null,"Viscosity ASTM-D445 (mPa.s at 85°C)",null,"Density ASTM-1298\n(Kg/M3 at 85°C)",null,"Appearence = yellow to light brown\n","Color ASTM-D1500   1,5 to 5,0",null,"Moisture ASTM-D95 (%)  <0,4\n","Active Matter %\n"]
[]
["Product","Product","ZL code","Toller Code","UV Tracer",null,"Min ","Max","Min ","Max","Min ","Max","Min ","Max","Min ","Max",null,"Min ","Max",null,"Min","Max"]
["Galoryl ATH 626M EU",{"$f":"SUBSTITUTE(A4,\"Galoryl\",\"\")","v":" ATH 626M EU"},"ZL62835","N/A","No","Iviltra",57,67,53,63,120,200,5,15,770,835,"yellow to light brown",1,5,0.04,12.3,15.3]
["Galoryl ATH 635",{"$f":"SUBSTITUTE(A5,\"Galoryl\",\"\")","v":" ATH 635"},"ZL62835","N/A","No","Iviltra",57,67,53,63,120,200,5,15,770,835,"yellow to light brown",1,5,0.04,12.3,15.3]
["Galoryl ATH 635 BG"," ATH 635 BG","ZL60224","N/A","No","Iviltra",57,67,50,60,70,150,5,15,805,835,"yellow to light brown",1,5,0.04,6.7,9.3000000000000007]
["Galoryl ATH 635 OCP"," ATH 635 OCP","ZL60367","N/A","No","Iviltra",55,65,57,67,60,120,5,15,780,845,"yellow to light brown",1,5,0.04,"N/A","N/A"]
["Galoryl ATH 709"," ATH 709","ZL62809","N/A","No","Iviltra",60,70,53,63,50,110,5,15,780,845,"yellow to light brown",1,5,0.04,"N/A","N/A"]
["Galoryl ATH 714"," ATH 714","ZL62840","N/A","No","Iviltra",60,70,57,67,30,60,10,20,780,845,"yellow to light brown",1,5,0.04,"N/A","N/A"]
["Galoryl ATH 741"," ATH 741","ZL62840","N/A","No","Iviltra",60,70,57,67,30,60,10,20,780,845,"yellow to light brown",1,5,0.04,"N/A","N/A"]
["Galoryl ATH 809"," ATH 809","ZL62809","N/A","No","Iviltra",60,70,53,63,50,110,5,15,780,845,"yellow to light brown",1,5,0.04,"N/A","N/A"]
["Galoryl ATH 809 V"," ATH 809 V","ZL62814","N/A","No","Iviltra",55,65,46,56,65,145,5,15,770,830,"yellow to light brown",1,5,0.04,"N/A","N/A"]
["Galoryl ATH 814"," ATH 814","ZL62840","N/A","No","Iviltra",60,70,57,67,30,60,10,20,780,845,"yellow to light brown",1,5,0.04,"N/A","N/A"]
["Galoryl ATH 814 V"," ATH 814 V"," ZL62839","N/A","No","Iviltra",55,65,50,55,110,210,5,15,770,830,"yellow to light brown",1,5,0.04,"N/A","N/A"]
["Galoryl ATH 835"," ATH 835","ZL62835","N/A","No","Iviltra",57,67,53,63,120,200,5,15,770,835,"yellow to light brown",1,5,0.04,12.3,15.3]
["Galoryl ATH 837"," ATH 837","ZL62837","N/A","No","Iviltra",60,65,50,60,70,130,5,15,770,830,"yellow to light brown",1,5,0.04,"N/A","N/A"]
["Galoryl ATH 837 BG"," ATH 837 BG"," ZL62839","N/A","No","Iviltra",55,65,50,55,110,210,5,15,770,830,"yellow to light brown",1,5,0.04,"N/A","N/A"]
["Galoryl ATH 674",{"$f":"SUBSTITUTE(A18,\"Galoryl\",\"\")","v":" ATH 674"},null,null,null,"Iviltra"]
["Absent",{"$f":"SUBSTITUTE(A19,\"Galoryl\",\"\")","v":"Absent"},"Absent","Absent","Absent","Iviltra","Absent","Absent","Absent","Absent","Absent","Absent","Absent","Absent","Absent",{"$f":"SUBSTITUTE(O19,\"Galoryl\",\"\")","v":"Absent"},"Absent","Absent","Absent","Absent","Absent","Absent"]
["Galoryl ATH 635"," ATH 635","ZL60430","N/A","No","ORLEN",55,65,56,66,120,200,5,15,770,835,"yellow to light brown",1,5,0.04,12.3,15.3]
["Galoryl ATH 636 BG"," ATH 636 BG","ZL60430","N/A","No","ORLEN",55,65,56,66,120,200,5,15,770,835,"yellow to light brown",1,5,0.04,12.3,15.3]
["Galoryl ATH 709"," ATH 709","ZL60400","N/A","No","ORLEN",53,63,53,63,50,110,5,15,780,845,"yellow to light brown",1,5,0.04,"N/A","N/A"]
["Galoryl ATH 714"," ATH 714","ZL60755","N/A","No","ORLEN",60,70,57,67,30,60,5,15,780,845,"yellow to light brown",1,5,0.04,"N/A","N/A"]
["Galoryl ATH 635 BG"," ATH 635 BG","ZL60222","N/A","No","ORLEN",50,60,57,67,70,150,5,15,805,835,"yellow to light brown",1,5,0.04,6.7,9.3000000000000007]
["Galoryl ATH 638 BG"," ATH 638 BG","ZL60380","N/A","No","ORLEN",55,65,56,66,160,240,5,15,780,845,"yellow to light brown",1,5,0.04,6.7,9.3000000000000007]
["Galoryl ATH F 100 EU"," ATH F 100 EU","ZL60250","N/A","No","ORLEN","N/A","N/A","N/A","N/A","N/A","N/A",150,350,865,895,"yellow to light brown",1,5,0.04,"N/A","N/A"]
["Galoryl ATH 626M EU"," ATH 626M EU","ZL60430","N/A","No","ORLEN",55,65,56,66,120,200,5,15,770,832,"yellow to light brown",1,5,0.04,12.3,15.3]
["Galoryl ATH 626M EU"," ATH 626M EU","ZL60431","N/A","Yes","ORLEN",55,65,56,66,120,200,5,15,770,832,"yellow to light brown",1,5,0.04,12.3,15.3]
["Galoryl ATH 635 ACHEMA",{"$f":"SUBSTITUTE(A29,\"Galoryl\",\"\")","v":" ATH 635 ACHEMA"},"ZL60246","N/A","No","ORLEN",57,67,58,68,160,240,5,15,805,835,"yellow to light brown",1,5,0.04,13.8,15.8]
["Absent",{"$f":"SUBSTITUTE(A30,\"Galoryl\",\"\")","v":"Absent"},"Absent","Absent","Absent","ORLEN","Absent","Absent","Absent","Absent","Absent","Absent","Absent","Absent","Absent","Absent","Absent","Absent","Absent","Absent","Absent","Absent"]
["Galoryl ATH 709",{"$f":"SUBSTITUTE(A31,\"Galoryl\",\"\")","v":" ATH 709"},"ZL60401","GAL008","Yes","SER",60,70,"N/A","N/A",60,120,5,15,780,845,"yellow to light brown",1,5,0.04,"N/A","N/A"]
["Galoryl ATH 709 V",{"$f":"SUBSTITUTE(A32,\"Galoryl\",\"\")","v":" ATH 709 V"},"ZL60479","GAL017","No","SER",51,61,50,60,190,210,22,26,780,845,"yellow to light brown",1,5,0.04,"N/A","N/A"]
["Galoryl ATH 714"," ATH 714","ZL60756","GAL006","Yes","SER",60,70,"N/A","N/A",30,60,5,15,780,845,"yellow to light brown",1,5,0.04,"N/A","N/A"]
["Galoryl ATH 741"," ATH 741","ZL60756","GAL024","Yes","SER",60,70,"N/A","N/A",30,60,5,15,780,845,"yellow to light brown",1,5,0.04,"N/A","N/A"]
["Galoryl ATH 714 V"," ATH 714 V","ZL60760","GAL018","No","SER",50,60,55,65,190,270,22,26,770,830,"yellow to light brown",1,5,0.04,"N/A","N/A"]
["Galoryl ATH 719 SP"," ATH 719 SP","ZL60800","GAL019","No","SER",60,70,57,67,60,120,5,15,780,845,"yellow to light brown",1,5,0.04,"N/A","N/A"]
["Galoryl ATH 635 OCP"," ATH 635 OCP","ZL60365","GAL635","No","SER",60,70,57,67,60,120,5,15,780,845,"yellow to light brown",1,5,0.04,"N/A","N/A"]
["Galoryl ATH 635 BG"," ATH 635 BG","ZL60223","GAL009","Yes","SER",50,60,"N/A","N/A",90,130,5,15,780,845,"yellow to light brown",1,5,0.04,"N/A","N/A"]
["Galogreen 315","Galogreen 315","ZL60315","GAL315","No","SER","N/A","N/A",47,62,25,50,0,25,850,880,"yellow to light brown",1,5,0.04,"N/A","N/A"]
["Galoryl ATH 635"," ATH 635","ZL60330","GAL002","No","SER",55,65,56,66,120,200,5,15,770,835,"yellow to light brown",1,5,0.04,"N/A","N/A"]
{"$rows_left_out":11}
{"sheet":"Iviltra","index":1,"n_rows":311,"n_cols":16,"rows_kept":311,"cut":false,"hidden":false,"merged":[]}
["Lot","Date","ZL code","Order Dirship","Customer","Product","Drop-Melt Point \nASTM-127-08   ","Congealing Point\n ASTM-938-06   ","Penetration ASTM-D937 \n(at 35°C w/cone)  ","Viscosity ASTM-D445 (mPa.s at 85°C) 5-15 ","Density ASTM-1298 \n(Kg/M3 at 85°C) 770-830\n","Appearence = yellow to light brown\n","Color ASTM-D1500   1,5 to 5,0\n","Moisture ASTM-D95 (%)  <0,4\n","Active Matter %\n","In Spec + Comments\n"]
[1,"???",{"$f":"INDEX(Products!$C$4:$C$19,MATCH(Iviltra!F2,Products!$B$4:$B$19,0))","v":"ZL62814"},null,null," ATH 809 V",null,"n/a",53,9.1310000000000002,805,"Light Brown",1.5,"N/A"]
[2,"???",{"$f":"INDEX(Products!$C$4:$C$19,MATCH(Iviltra!F3,Products!$B$4:$B$19,0))","v":"ZL62814"},null,null," ATH 809 V",55.2,53,60,8.4209999999999994,805,"Light Brown",null,0.01]
[3,"???",{"$f":"INDEX(Products!$C$4:$C$19,MATCH(Iviltra!F4,Products!$B$4:$B$19,0))","v":"ZL62814"},null,null," ATH 809 V",55.2,53,57,8.3870000000000005,805,"Light Brown",null,0.01]
[4,"???",{"$f":"INDEX(Products!$C$4:$C$19,MATCH(Iviltra!F5,Products!$B$4:$B$19,0))","v":"ZL62814"},null,null," ATH 809 V",55.8,53.8,56,8.5589999999999993,805,"Light Brown",null,0.01]
[5,"???",{"$f":"INDEX(Products!$C$4:$C$19,MATCH(Iviltra!F6,Products!$B$4:$B$19,0))","v":"ZL62814"},null,null," ATH 809 V",61.8,53.3,114,7.4710000000000001,795,"Light Brown",null,0.01]
[6,"???",{"$f":"INDEX(Products!$C$4:$C$19,MATCH(Iviltra!F7,Products!$B$4:$B$19,0))","v":"ZL62814"},null,null," ATH 809 V",61.5,49.3,104,7.694,796,"Light Brown",null,0.01]
[7,"???",{"$f":"INDEX(Products!$C$4:$C$19,MATCH(Iviltra!F8,Products!$B$4:$B$19,0))","v":"ZL62814"},null,null," ATH 809 V",61.5,49.6,93,7.64,801,"Light Brown",null,0.01]
[8,"???",{"$f":"INDEX(Products!$C$4:$C$19,MATCH(Iviltra!F9,Products!$B$4:$B$19,0))","v":"ZL62814"},null,null," ATH 809 V",64,52.8,63,8.173,799,"Light Brown",null,0.01]
[9,"???",{"$f":"INDEX(Products!$C$4:$C$19,MATCH(Iviltra!F10,Products!$B$4:$B$19,0))","v":"ZL62814"},null,null," ATH 809 V",62.9,50.8,127,8.3019999999999996,801,"Light Brown",null,0.01]
[10,"???",{"$f":"INDEX(Products!$C$4:$C$19,MATCH(Iviltra!F11,Products!$B$4:$B$19,0))","v":"ZL62814"},null,null," ATH 809 V",63,51.5,120,7.9279999999999999,800,"Light Brown",null,0.01]
[11,"???",{"$f":"INDEX(Products!$C$4:$C$19,MATCH(Iviltra!F12,Products!$B$4:$B$19,0))","v":"ZL62814"},null,null," ATH 809 V",59,52.8,64,7.9329999999999998,800,"Light Brown",null,0.01]
[12,"???",{"$f":"INDEX(Products!$C$4:$C$19,MATCH(Iviltra!F13,Products!$B$4:$B$19,0))","v":"ZL62814"},null,null," ATH 809 V",60.5,51.7,136,7.5960000000000001,802,"Light Brown",null,0.01]
[13,"???",{"$f":"INDEX(Products!$C$4:$C$19,MATCH(Iviltra!F14,Products!$B$4:$B$19,0))","v":"ZL62814"},null,null," ATH 809 V",58.8,55.9,156,7.4889999999999999,800,"Light Brown",null,0.01]
[14,"???",{"$f":"INDEX(Products!$C$4:$C$19,MATCH(Iviltra!F15,Products!$B$4:$B$19,0))","v":" ZL62839"},null,null," ATH 814 V",57.6,55,173,7.0789999999999997,797,"Light Brown",null,0.01]
[15,"???",{"$f":"INDEX(Products!$C$4:$C$19,MATCH(Iviltra!F16,Products!$B$4:$B$19,0))","v":" ZL62839"},null,null," ATH 814 V",60.1,55.8,171,6.9530000000000003,785,"Light Brown",null,0.01]
[16,"???",{"$f":"INDEX(Products!$C$4:$C$19,MATCH(Iviltra!F17,Products!$B$4:$B$19,0))","v":" ZL62839"},null,null," ATH 814 V",60.7,55.5,246,7.1520000000000001,787,"Light Brown",null,0.01]
[17,"???",{"$f":"INDEX(Products!$C$4:$C$19,MATCH(Iviltra!F18,Products!$B$4:$B$19,0))","v":"ZL62837"},null,null," ATH 837",56.1,43.5,143,8.1539999999999999,805,"Light Brown",null,0.01]
[18,"???",{"$f":"INDEX(Products!$C$4:$C$19,MATCH(Iviltra!F19,Products!$B$4:$B$19,0))","v":"ZL62814"},null,null," ATH 809 V",53.8,45.8,126,8.1530000000000005,803,"Light Brown",null,0.01]
[19,"???",{"$f":"INDEX(Products!$C$4:$C$19,MATCH(Iviltra!F20,Products!$B$4:$B$19,0))","v":"ZL62814"},null,null," ATH 809 V",62.6,51.6,80,8.3000000000000007,803,"Light Brown",null,0.01]
[20,"???",{"$f":"INDEX(Products!$C$4:$C$19,MATCH(Iviltra!F21,Products!$B$4:$B$19,0))","v":"ZL62837"},null,null," ATH 837",68.3,57,82,8.9619999999999997,798,"Light Brown",null,0.01]
[21,null,{"$f":"INDEX(Products!$C$4:$C$19,MATCH(Iviltra!F22,Products!$B$4:$B$19,0))","v":"Absent"},null,null,"Absent"]
[22,"???",{"$f":"INDEX(Products!$C$4:$C$19,MATCH(Iviltra!F23,Products!$B$4:$B$19,0))","v":"ZL62814"},null,null," ATH 809 V",59.5,50.1,117,8.1720000000000006,804,"Light Brown",null,0.01]
[23,"???",{"$f":"INDEX(Products!$C$4:$C$19,MATCH(Iviltra!F24,Products!$B$4:$B$19,0))","v":"ZL62837"},null,null," ATH 837",63.5,61.1,54,9.093,802,"Light Brown",null,0.01]
[24,"???",{"$f":"INDEX(Products!$C$4:$C$19,MATCH(Iviltra!F25,Products!$B$4:$B$19,0))","v":"ZL62814"},null,null," ATH 809 V",59,50.5,131,7.7,796,"Light Brown",null,0.01]
[25,"???",{"$f":"INDEX(Products!$C$4:$C$19,MATCH(Iviltra!F26,Products!$B$4:$B$19,0))","v":"ZL62814"},null,null," ATH 809 V",60.3,49.5,137,7.657,795,"Light Brown",null,0.01]
[26,"???",{"$f":"INDEX(Products!$C$4:$C$19,MATCH(Iviltra!F27,Products!$B$4:$B$19,0))","v":"ZL62814"},null,null," ATH 809 V",61,48.5,139,7.383,792,"Light Brown",null,0.01]
[27,"???",{"$f":"INDEX(Products!$C$4:$C$19,MATCH(Iviltra!F28,Products!$B$4:$B$19,0))","v":"ZL62814"},null,null," ATH 809 V",62,48.3,144,7.6130000000000004,796,"Light Brown",null,0.01]
[28,"???",{"$f":"INDEX(Products!$C$4:$C$19,MATCH(Iviltra!F29,Products!$B$4:$B$19,0))","v":"ZL62837"},null,null," ATH 837",62,50,104,7.9249999999999998,798,"Light Brown",null,0.01]
[29,"???",{"$f":"INDEX(Products!$C$4:$C$19,MATCH(Iviltra!F30,Products!$B$4:$B$19,0))","v":"ZL62837"},null,null," ATH 837",67.5,58,74,8.7810000000000006,803,"Light Brown",null,0.01]
[30,"???",{"$f":"INDEX(Products!$C$4:$C$19,MATCH(Iviltra!F31,Products!$B$4:$B$19,0))","v":"ZL62837"},null,null," ATH 837",68.900000000000006,57.1,103,8.9529999999999994,797,"Light Brown",null,0.01]
[31,"???",{"$f":"INDEX(Products!$C$4:$C$19,MATCH(Iviltra!F32,Products!$B$4:$B$19,0))","v":"ZL62814"},null,null," ATH 809 V",62.4,52.5,145,7.3810000000000002,794,"Light Brown",null,0.01]
[32,"???",{"$f":"INDEX(Products!$C$4:$C$19,MATCH(Iviltra!F33,Products!$B$4:$B$19,0))","v":"ZL62814"},null,null," ATH 809 V",63.2,53,147,7.9059999999999997,795,"Light Brown",null,0.01]
[33,"???",{"$f":"INDEX(Products!$C$4:$C$19,MATCH(Iviltra!F34,Products!$B$4:$B$19,0))","v":"ZL62814"},null,null," ATH 809 V",60.4,52.3,121,6.782,792,"Light Brown",null,0.01]
[34,"???",{"$f":"INDEX(Products!$C$4:$C$19,MATCH(Iviltra!F35,Products!$B$4:$B$19,0))","v":"ZL62837"},null,null," ATH 837",64.599999999999994,58.5,128,8.6349999999999998,798,"Light Brown",null,0.01]
[35,"???",{"$f":"INDEX(Products!$C$4:$C$19,MATCH(Iviltra!F36,Products!$B$4:$B$19,0))","v":"ZL62837"},null,null," ATH 837",67.5,57.5,138,8.109,797,"Light Brown",null,0.01]
[36,"???",{"$f":"INDEX(Products!$C$4:$C$19,MATCH(Iviltra!F37,Products!$B$4:$B$19,0))","v":"ZL62837"},null,null," ATH 837",67.5,58,93,8.9149999999999991,801,"Light Brown",null,0.01]
[37,"???",{"$f":"INDEX(Products!$C$4:$C$19,MATCH(Iviltra!F38,Products!$B$4:$B$19,0))","v":"ZL62837"},null,null," ATH 837",66.900000000000006,57,89,7.5350000000000001,795,"Light Brown",null,0.01,null,"Formulation here was 83% Foots Oil and 17% Concentrate"]
[38,"???",{"$f":"INDEX(Products!$C$4:$C$19,MATCH(Iviltra!F39,Products!$B$4:$B$19,0))","v":"ZL62814"},null,null," ATH 809 V",56.2,53,85,7.4690000000000003,791,"Light Brown",null,0.01]
[39,"???",{"$f":"INDEX(Products!$C$4:$C$19,MATCH(Iviltra!F40,Products!$B$4:$B$19,0))","v":0},null,null," ATH 674",63.8,57.1,131,9.1460000000000008,800,"Light Brown",null,0.01,null,"24.3% Pet 12, 58.5% SN 150, 17.2% 674"]
{"$rows_left_out":272}
{"sheet":"Iviltra MP","index":2,"n_rows":2,"n_cols":16,"rows_kept":2,"cut":false,"hidden":false,"merged":[]}
["Lot","Date","ZL code","Order Dirship","Customer","Product","Drop-Melt Point \nASTM-127-08   ","Congealing Point\n ASTM-938-06   ","Penetration ASTM-D937 \n(at 35°C w/cone)  ","Viscosity ASTM-D445 (mPa.s at 85°C) 5-15 ","Density ASTM-1298 \n(Kg/M3 at 85°C) 770-830\n","Appearence = yellow to light brown\n","Color ASTM-D1500   1,5 to 5,0\n","Moisture ASTM-D95 (%)  <0,4\n","Active Matter %\n","In Spec + Comments\n"]
["","","ZL62814","","","","65","","","","","","","","",""]

{"sheet":"Orlen","index":3,"n_rows":69,"n_cols":16,"rows_kept":69,"cut":false,"hidden":false,"merged":[]}
["Lot","Date","ZL code","Order Dirship","Customer","Product","Drop-Melt Point \nASTM-127-08   ","Congealing Point\n ASTM-938-06   ","Penetration ASTM-D937 \n(at 35°C w/cone)  ","Viscosity ASTM-D445 (mPa.s at 85°C) 5-15 ","Density ASTM-1298 \n(Kg/M3 at 85°C) 770-830\n","Appearence = yellow to light brown\n","Color ASTM-D1500   1,5 to 5,0\n","Moisture ASTM-D95 (%)  <0,4\n","Active Matter %\n","In Spec + Comments\n"]
[107,"2017-07-04","ZL60430","ZL60430",null,"ATH 635"]
[108,"??","ZL60430",null,null,"ATH 635"]
[109,"2017-08-11","ZL60755",null,null,"ATH 741"]
[110,"2017-07-15","ZL60430",null,null,"ATH 626 MEU"]
[111,"2017-07-16","ZL60250",null,null,"ATH F 100 EU"]
[112,"2017-07-17","ZL60430",null,null,"ATH 635"]
[113,"??","ZL60430",null,null,"ATH 635"]
[114,"2017-07-29","ZL60250",null,null,"ATH F 100 EU"]
[114,"??","ZL60250",null,null,"ATH F 100 EU"]
[115,"2017-08-07","ZL60430",null,null,"ATH 626 MEU"]
[116,"??","ZL60250",null,null,"ATH F 100 EU"]
[117,"2017-08-11","ZL60250",null,null,"ATH F 100 EU"]
[118,"2017-08-11","ZL60400",null,null,"ATH 709"]
[119]
[120,"2017-08-25","ZL60430",null,null,"ATH 635"]
[121,"2017-08-29","ZL60430",null,null,"ATH 626 MEU"]
[122]
[123,"??","ZL60250",null,null,"ATH F 100 EU"]
[124,"??","ZL60430",null,null,"ATH 635"]
[125]
[126,"2017-09-16","ZL60430",null,null,"ATH 635"]
[127]
[128,"2017-09-28","ZL60430",null,null,"ATH 635"]
[129,"2017-10-06","ZL60430",null,null,"ATH 626 MEU"]
[130]
[131,"??","ZL60250",null,null,"ATH F 100 EU"]
[132,"2017-10-18","ZL60250",null,null,"ATH F 100 EU"]
[133,"2017-10-23","ZL60250",null,null,"ATH F 100 EU"]
[134,"2017-11-04","ZL60430",null,null,"ATH 635"]
[135,"2017-11-03","ZL60222",null,null,"ATH 635 BG"]
[136,"??","ZL60250",null,null,"ATH F 100 EU"]
[137,"2017-11-09","ZL60430",null,null,"ATH 635"]
[138]
[139,"2017-11-17","ZL60250",null,null,"ATH F 100 EU"]
[140,"2017-11-17","ZL60430",null,null,"ATH 635"]
[141,"2017-11-30","ZL60250",null,null,"ATH F 100 EU"]
[142,"2017-12-03","ZL60430",null,null,"ATH 635"]
[143,"2017-12-08","ZL60250",null,null,"ATH F 100 EU"]
[144,"2017-12-08","ZL60430",null,null,"ATH 635"]
{"$rows_left_out":30}
{"sheet":"Orlen MP","index":4,"n_rows":2,"n_cols":16,"rows_kept":2,"cut":false,"hidden":false,"merged":[]}
["Lot","Date","ZL code","Order Dirship","Customer","Product","Drop-Melt Point \nASTM-127-08   ","Congealing Point\n ASTM-938-06   ","Penetration ASTM-D937 \n(at 35°C w/cone)  ","Viscosity ASTM-D445 (mPa.s at 85°C) 5-15 ","Density ASTM-1298 \n(Kg/M3 at 85°C) 770-830\n","Appearence = yellow to light brown\n","Color ASTM-D1500   1,5 to 5,0\n","Moisture ASTM-D95 (%)  <0,4\n","Active Matter %\n","In Spec + Comments\n"]
[null,null,"Zl62814",null,null,null,50]

{"sheet":"SER","index":5,"n_rows":33,"n_cols":17,"rows_kept":33,"cut":false,"hidden":false,"merged":[]}
["Lot","Date","ZL code","Order Dirship","Customer","Product","Drop-Melt Point \nASTM-127-08   ","Congealing Point\n ASTM-938-06   ","Penetration ASTM-D937 \n(at 35°C w/cone)  ","Viscosity ASTM-D445 (mPa.s at 85°C) 5-15 ","Density ASTM-1298 \n(Kg/M3 at 85°C) 770-830\n","Appearence = yellow to light brown\n","Color ASTM-D1500   1,5 to 5,0\n","Moisture ASTM-D95 (%)  <0,4\n","Active Matter %\n","In Spec + Comments\n","In Spec + Comments\n"]
[75619,"2017-08-29","ZL60330",null,null,null,"ATH 626"]
[75796,"2017-09-11","ZL60330",null,null,null,"ATH 626 MEU"]
[75907,"2017-09-15","ZL60225",null,null,null,"ATH 636 H"]
[76002,"2017-09-20","ZL60225",null,null,null,"ATH 636 H"]
[76774,"2017-11-13","ZL60225",null,null,null,"ATH 636 H"]
[77090,"2017-12-01","ZL60365",null,null,null,"ATH 635 OCP"]
[77150,"???","ZL60225",null,null,null,"ATH 636 H"]
[76895,"2017-12-07","ZL60365",null,null,null,"ATH 635 OCP"]
[76899,"2017-12-12","ZL60365",null,null,null,"ATH 635 OCP"]
[77233,"2017-12-12","ZL60330",null,null,null,"ATH 626 MEU"]
[77278,"2017-12-15","ZL60330",null,null,null,"ATH 626 MEU"]
[77358,"2017-12-22","ZL60225",null,null,null,"ATH 636 H"]
[77434,"2018-01-04","ZL60330",null,null,null,"ATH 626"]
[77714,"2018-01-23","ZL60225",null,null,null,"ATH 636 H"]
[78050,"2018-02-16","ZL60330",null,null,null,"ATH 626 MEU"]
[78197,"2018-02-23","ZL60330",null,null,null,"ATH 626 MEU"]
[78344,"2018-03-03","ZL60225",null,null,null,"ATH 636 H"]
[78573,"2018-03-27","ZL60365",null,null,null,"ATH 635 OCP"]
[78575,"2018-03-28","ZL60365",null,null,null,"ATH 635 OCP"]
[78577,"2018-03-29","ZL60365",null,null,null,"ATH 635 OCP"]
[78636,"2018-03-29","ZL60225",null,null,null,"ATH 636 H"]
[78579,"2018-03-31","ZL60365",null,null,null,"ATH 635 OCP"]
[78581,"2018-04-04","ZL60365",null,null,null,"ATH 635 OCP"]
[78950,"2018-05-04","ZL60330","GAL004","1386-0",null,"ATH 626M EU",null,null,null,15,null,"Yellow-Light brown"]
[78962,"2018-09-05","ZL60365",null,null,null,"ATH 635 OCP",null,null,60,7.8,0.81,"Light Brown"]
[78964,"2018-05-09","ZL60335",null,null,null,"ATH 635 OCP",null,null,67,8.3000000000000007,0.8,"Light Brown"]
[79122,"2018-05-10","ZL60365",null,null,null,"ATH 635 OCP",null,null,80,8.3000000000000007,0.8,"Yellow-Light brown"]
[79123,"2018-05-11",null,null,"ITST01-46-5",null,"ATH 635 OCP",64.2,59,65,8.6999999999999993,0.79,"Light Brown"]
[78968,"2018-05-14",null,null,null,null,"ATH 635 OCP",64.599999999999994,58,63,9,0.81,"Light Brown"]
[79125,"2018-05-14",null,null,"VE117806",null,"ATH 635 OCP",64.3,59,77,9.9,0.81,"Light Brown"]
[78970,"2018-05-15",null,null,"VE117522",null,"ATH 635 OCP",62.6,58,88,8.8000000000000007,0.8,"Light Brown"]
[79319,"2018-05-15","","GAL023","1401-0","","ATH 636 H",58.8,60,"","","","","","","",""]

{"sheet":"SER MP","index":6,"n_rows":2,"n_cols":17,"rows_kept":2,"cut":false,"hidden":false,"merged":[]}
["Lot","Date","ZL code","Order Dirship","Customer","Product","Drop-Melt Point \nASTM-127-08   ","Congealing Point\n ASTM-938-06   ","Penetration ASTM-D937 \n(at 35°C w/cone)  ","Viscosity ASTM-D445 (mPa.s at 85°C) 5-15 ","Density ASTM-1298 \n(Kg/M3 at 85°C) 770-830\n","Appearence = yellow to light brown\n","Color ASTM-D1500   1,5 to 5,0\n","Moisture ASTM-D95 (%)  <0,4\n","Active Matter %\n","In Spec + Comments\n","In Spec + Comments\n"]
[null,null,"ZL62814",null,null,null,50]