{"text_format":"1","workbook":"xlsx","n_sheets":7,"sheets":["Products","Iviltra","Iviltra MP","Orlen","Orlen MP","SER","SER MP"],"not_rendered":{"charts":0,"images":0,"macros":1,"external_links":0,"defined_names":7,"comments":7,"pivot_tables":0},"unopened":[],"bounds":{"document_bytes":16777216,"sheet_cells":100000,"rows_first":2000,"rows_last":500,"rows_between":2000,"halvings":0,"cell_chars":16384,"cell_head_chars":4096},"cells_cut":0,"cells_raw":0,"read":"whole","date_system":"1900"}

{"sheet":"Products","index":0,"n_rows":50,"n_cols":22,"rows_kept":50,"cut":false,"hidden":false,"merged":[[0,5,2,5],[0,10,1,11],[0,0,1,0],[0,1,1,1],[0,3,1,3],[0,4,1,4],[0,2,1,2],[0,20,1,21],[0,6,1,7],[0,8,1,9],[0,17,1,18],[0,12,1,13],[0,14,1,15]]}
["Toller","Iviltra","ORLEN","SER","Sogechem","Toller","Drop-Melt Point \nASTM-127-08 ",null,"Congealing Point\n ASTM-938-06  ",null,"Penetration ASTM-D937 \n(at XX°C w/cone)  ",null,"Viscosity ASTM-D445 (mPa.s at 85°C)",null,"Density ASTM-1298\n(Kg/M3 at 85°C)",null,"Appearence = yellow to light brown\n","Color ASTM-D1500   1,5 to 5,0",null,"Moisture ASTM-D95 (%)  <0,4\n","Active Matter %\n"]
[]
["Product","Product","ZL code","Toller Code","UV Tracer",null,"Min ","Max","Min ","Max","Min ","Max","Min ","Max","Min ","Max",null,"Min ","Max",null,"Min","Max"]
["Galoryl ATH 626M EU",{"$f":"SUBSTITUTE(A4,\"Galoryl\",\"\")","v":" ATH 626M EU"},"ZL62835","N/A","No","Iviltra",57,67,53,63,120,200,5,15,770,835,"yellow to light brown",1,5,0.04,12.3,15.3]
["Galoryl ATH 635",{"$f":"SUBSTITUTE(A5,\"Galoryl\",\"\")","v":" ATH 635"},"ZL62835","N/A","No","Iviltra",57,67,53,63,120,200,5,15,770,835,"yellow to light brown",1,5,0.04,12.3,15.3]
["Galoryl ATH 635 BG"," ATH 635 BG","ZL60224","N/A","No","Iviltra",57,67,50,60,70,150,5,15,805,835,"yellow to light brown",1,5,0.04,6.7,9.3000000000000007]
["Galoryl ATH 635 OCP"," ATH 635 OCP","ZL60367","N/A","No","Iviltra",55,65,57,67,60,120,5,15,780,845,"yellow to light brown",1,5,0.04,"N/A","N/A"]
["Galoryl ATH 709"," ATH 709","ZL62809","N/A","No","Iviltra",60,70,53,63,50,110,5,15,780,845,"yellow to light brown",1,5,0.04,"N/A","N/A"]
["Galoryl ATH 714"," ATH 714","ZL62840","N/A","No","Iviltra",60,70,57,67,30,60,10,20,780,845,"yellow to light brown",1,5,0.04,"N/A","N/A"]
["Galoryl ATH 741"," ATH 741","ZL62840","N/A","No","Iviltra",60,70,57,67,30,60,10,20,780,845,"yellow to light brown",1,5,0.04,"N/A","N/A"]
["Galoryl ATH 809"," ATH 809","ZL62809","N/A","No","Iviltra",60,70,53,63,50,110,5,15,780,845,"yellow to light brown",1,5,0.04,"N/A","N/A"]
["Galoryl ATH 809 V"," ATH 809 V","ZL62814","N/A","No","Iviltra",55,65,46,56,65,145,5,15,770,830,"yellow to light brown",1,5,0.04,"N/A","N/A"]
["Galoryl ATH 814"," ATH 814","ZL62840","N/A","No","Iviltra",60,70,57,67,30,60,10,20,780,845,"yellow to light brown",1,5,0.04,"N/A","N/A"]
["Galoryl ATH 814 V"," ATH 814 V"," ZL62839","N/A","No","Iviltra",55,65,50,55,110,210,5,15,770,830,"yellow to light brown",1,5,0.04,"N/A","N/A"]
["Galoryl ATH 835"," ATH 835","ZL62835","N/A","No","Iviltra",57,67,53,63,120,200,5,15,770,835,"yellow to light brown",1,5,0.04,12.3,15.3]
["Galoryl ATH 837"," ATH 837","ZL62837","N/A","No","Iviltra",60,65,50,60,70,130,5,15,770,830,"yellow to light brown",1,5,0.04,"N/A","N/A"]
["Galoryl ATH 837 BG"," ATH 837 BG"," ZL62839","N/A","No","Iviltra",55,65,50,55,110,210,5,15,770,830,"yellow to light brown",1,5,0.04,"N/A","N/A"]
["Galoryl ATH 674",{"$f":"SUBSTITUTE(A18,\"Galoryl\",\"\")","v":" ATH 674"},null,null,null,"Iviltra"]
["Absent",{"$f":"SUBSTITUTE(A19,\"Galoryl\",\"\")","v":"Absent"},"Absent","Absent","Absent","Iviltra","Absent","Absent","Absent","Absent","Absent","Absent","Absent","Absent","Absent",{"$f":"SUBSTITUTE(O19,\"Galoryl\",\"\")","v":"Absent"},"Absent","Absent","Absent","Absent","Absent","Absent"]
["Galoryl ATH 635"," ATH 635","ZL60430","N/A","No","ORLEN",55,65,56,66,120,200,5,15,770,835,"yellow to light brown",1,5,0.04,12.3,15.3]
["Galoryl ATH 636 BG"," ATH 636 BG","ZL60430","N/A","No","ORLEN",55,65,56,66,120,200,5,15,770,835,"yellow to light brown",1,5,0.04,12.3,15.3]
["Galoryl ATH 709"," ATH 709","ZL60400","N/A","No","ORLEN",53,63,53,63,50,110,5,15,780,845,"yellow to light brown",1,5,0.04,"N/A","N/A"]
["Galoryl ATH 714"," ATH 714","ZL60755","N/A","No","ORLEN",60,70,57,67,30,60,5,15,780,845,"yellow to light brown",1,5,0.04,"N/A","N/A"]
["Galoryl ATH 635 BG"," ATH 635 BG","ZL60222","N/A","No","ORLEN",50,60,57,67,70,150,5,15,805,835,"yellow to light brown",1,5,0.04,6.7,9.3000000000000007]
["Galoryl ATH 638 BG"," ATH 638 BG","ZL60380","N/A","No","ORLEN",55,65,56,66,160,240,5,15,780,845,"yellow to light brown",1,5,0.04,6.7,9.3000000000000007]
["Galoryl ATH F 100 EU"," ATH F 100 EU","ZL60250","N/A","No","ORLEN","N/A","N/A","N/A","N/A","N/A","N/A",150,350,865,895,"yellow to light brown",1,5,0.04,"N/A","N/A"]
["Galoryl ATH 626M EU"," ATH 626M EU","ZL60430","N/A","No","ORLEN",55,65,56,66,120,200,5,15,770,832,"yellow to light brown",1,5,0.04,12.3,15.3]
["Galoryl ATH 626M EU"," ATH 626M EU","ZL60431","N/A","Yes","ORLEN",55,65,56,66,120,200,5,15,770,832,"yellow to light brown",1,5,0.04,12.3,15.3]
["Galoryl ATH 635 ACHEMA",{"$f":"SUBSTITUTE(A29,\"Galoryl\",\"\")","v":" ATH 635 ACHEMA"},"ZL60246","N/A","No","ORLEN",57,67,58,68,160,240,5,15,805,835,"yellow to light brown",1,5,0.04,13.8,15.8]
["Absent",{"$f":"SUBSTITUTE(A30,\"Galoryl\",\"\")","v":"Absent"},"Absent","Absent","Absent","ORLEN","Absent","Absent","Absent","Absent","Absent","Absent","Absent","Absent","Absent","Absent","Absent","Absent","Absent","Absent","Absent","Absent"]
["Galoryl ATH 709",{"$f":"SUBSTITUTE(A31,\"Galoryl\",\"\")","v":" ATH 709"},"ZL60401","GAL008","Yes","SER",60,70,"N/A","N/A",60,120,5,15,780,845,"yellow to light brown",1,5,0.04,"N/A","N/A"]
["Galoryl ATH 709 V",{"$f":"SUBSTITUTE(A32,\"Galoryl\",\"\")","v":" ATH 709 V"},"ZL60479","GAL017","No","SER",51,61,50,60,190,210,22,26,780,845,"yellow to light brown",1,5,0.04,"N/A","N/A"]
["Galoryl ATH 714"," ATH 714","ZL60756","GAL006","Yes","SER",60,70,"N/A","N/A",30,60,5,15,780,845,"yellow to light brown",1,5,0.04,"N/A","N/A"]
["Galoryl ATH 741"," ATH 741","ZL60756","GAL024","Yes","SER",60,70,"N/A","N/A",30,60,5,15,780,845,"yellow to light brown",1,5,0.04,"N/A","N/A"]
["Galoryl ATH 714 V"," ATH 714 V","ZL60760","GAL018","No","SER",50,60,55,65,190,270,22,26,770,830,"yellow to light brown",1,5,0.04,"N/A","N/A"]
["Galoryl ATH 719 SP"," ATH 719 SP","ZL60800","GAL019","No","SER",60,70,57,67,60,120,5,15,780,845,"yellow to light brown",1,5,0.04,"N/A","N/A"]
["Galoryl ATH 635 OCP"," ATH 635 OCP","ZL60365","GAL635","No","SER",60,70,57,67,60,120,5,15,780,845,"yellow to light brown",1,5,0.04,"N/A","N/A"]
["Galoryl ATH 635 BG"," ATH 635 BG","ZL60223","GAL009","Yes","SER",50,60,"N/A","N/A",90,130,5,15,780,845,"yellow to light brown",1,5,0.04,"N/A","N/A"]
["Galogreen 315","Galogreen 315","ZL60315","GAL315","No","SER","N/A","N/A",47,62,25,50,0,25,850,880,"yellow to light brown",1,5,0.04,"N/A","N/A"]
["Galoryl ATH 635"," ATH 635","ZL60330","GAL002","No","SER",55,65,56,66,120,200,5,15,770,835,"yellow to light brown",1,5,0.04,"N/A","N/A"]
["Galoryl ATH 626"," ATH 626","ZL60330","GAL003","No","SER",55,65,56,66,120,200,5,15,770,835,"yellow to light brown",1,5,0.04,"N/A","N/A"]
["DEEP COAT","DEEP COAT","ZL60331","GAL011","Yes","SER",55,65,56,66,120,200,5,15,770,835,"yellow to light brown",1,5,0.04,"N/A","N/A"]
["Galoryl ATH 626M EU"," ATH 626M EU","ZL60331","GAL004","Yes","SER",55,65,56,66,120,200,5,15,770,835,"yellow to light brown",1,5,0.04,12.3,15.3]
["Galoryl ATH 972"," ATH 972","ZL60972","GAL022","Yes","SER",55,65,56,66,120,200,5,15,770,835,"yellow to light brown",1,5,0.04,"N/A","N/A"]
["Galoryl ATH 636 H"," ATH 636 H","ZL60225","GAL023","Yes","SER",54,64,55,65,120,160,5,15,760,820,"yellow to light brown",1,5,0.04,13.5,16.5]
["Galoryl ATH 626 M"," ATH 626 M","ZL60215","GAL005","No","SER",60,70,60,70,120,160,5,15,770,830,"yellow to light brown",1,5,0.04,25,30]
["Galoryl WR41"," WR41","ZL62250",null,"No","Sogechem"]
["Galoryl AT"," AT",null,null,null,"Innospec"]
["Galoryl GR 35"," GR 35",null,null,null,"Innospec"]
["Galoryl AT 725"," AT 725",null,null,null,"Innospec"]

{"sheet":"Iviltra","index":1,"n_rows":311,"n_cols":16,"rows_kept":311,"cut":false,"hidden":false,"merged":[]}
["Lot","Date","ZL code","Order Dirship","Customer","Product","Drop-Melt Point \nASTM-127-08   ","Congealing Point\n ASTM-938-06   ","Penetration ASTM-D937 \n(at 35°C w/cone)  ","Viscosity ASTM-D445 (mPa.s at 85°C) 5-15 ","Density ASTM-1298 \n(Kg/M3 at 85°C) 770-830\n","Appearence = yellow to light brown\n","Color ASTM-D1500   1,5 to 5,0\n","Moisture ASTM-D95 (%)  <0,4\n","Active Matter %\n","In Spec + Comments\n"]
[1,"???",{"$f":"INDEX(Products!$C$4:$C$19,MATCH(Iviltra!F2,Products!$B$4:$B$19,0))","v":"ZL62814"},null,null," ATH 809 V",null,"n/a",53,9.1310000000000002,805,"Light Brown",1.5,"N/A"]
[2,"???",{"$f":"INDEX(Products!$C$4:$C$19,MATCH(Iviltra!F3,Products!$B$4:$B$19,0))","v":"ZL62814"},null,null," ATH 809 V",55.2,53,60,8.4209999999999994,805,"Light Brown",null,0.01]
[3,"???",{"$f":"INDEX(Products!$C$4:$C$19,MATCH(Iviltra!F4,Products!$B$4:$B$19,0))","v":"ZL62814"},null,null," ATH 809 V",55.2,53,57,8.3870000000000005,805,"Light Brown",null,0.01]
[4,"???",{"$f":"INDEX(Products!$C$4:$C$19,MATCH(Iviltra!F5,Products!$B$4:$B$19,0))","v":"ZL62814"},null,null," ATH 809 V",55.8,53.8,56,8.5589999999999993,805,"Light Brown",null,0.01]
[5,"???",{"$f":"INDEX(Products!$C$4:$C$19,MATCH(Iviltra!F6,Products!$B$4:$B$19,0))","v":"ZL62814"},null,null," ATH 809 V",61.8,53.3,114,7.4710000000000001,795,"Light Brown",null,0.01]
[6,"???",{"$f":"INDEX(Products!$C$4:$C$19,MATCH(Iviltra!F7,Products!$B$4:$B$19,0))","v":"ZL62814"},null,null," ATH 809 V",61.5,49.3,104,7.694,796,"Light Brown",null,0.01]
[7,"???",{"$f":"INDEX(Products!$C$4:$C$19,MATCH(Iviltra!F8,Products!$B$4:$B$19,0))","v":"ZL62814"},null,null," ATH 809 V",61.5,49.6,93,7.64,801,"Light Brown",null,0.01]
[8,"???",{"$f":"INDEX(Products!$C$4:$C$19,MATCH(Iviltra!F9,Products!$B$4:$B$19,0))","v":"ZL62814"},null,null," ATH 809 V",64,52.8,63,8.173,799,"Light Brown",null,0.01]
[9,"???",{"$f":"INDEX(Products!$C$4:$C$19,MATCH(Iviltra!F10,Products!$B$4:$B$19,0))","v":"ZL62814"},null,null," ATH 809 V",62.9,50.8,127,8.3019999999999996,801,"Light Brown",null,0.01]
[10,"???",{"$f":"INDEX(Products!$C$4:$C$19,MATCH(Iviltra!F11,Products!$B$4:$B$19,0))","v":"ZL62814"},null,null," ATH 809 V",63,51.5,120,7.9279999999999999,800,"Light Brown",null,0.01]
[11,"???",{"$f":"INDEX(Products!$C$4:$C$19,MATCH(Iviltra!F12,Products!$B$4:$B$19,0))","v":"ZL62814"},null,null," ATH 809 V",59,52.8,64,7.9329999999999998,800,"Light Brown",null,0.01]
[12,"???",{"$f":"INDEX(Products!$C$4:$C$19,MATCH(Iviltra!F13,Products!$B$4:$B$19,0))","v":"ZL62814"},null,null," ATH 809 V",60.5,51.7,136,7.5960000000000001,802,"Light Brown",null,0.01]
[13,"???",{"$f":"INDEX(Products!$C$4:$C$19,MATCH(Iviltra!F14,Products!$B$4:$B$19,0))","v":"ZL62814"},null,null," ATH 809 V",58.8,55.9,156,7.4889999999999999,800,"Light Brown",null,0.01]
[14,"???",{"$f":"INDEX(Products!$C$4:$C$19,MATCH(Iviltra!F15,Products!$B$4:$B$19,0))","v":" ZL62839"},null,null," ATH 814 V",57.6,55,173,7.0789999999999997,797,"Light Brown",null,0.01]
[15,"???",{"$f":"INDEX(Products!$C$4:$C$19,MATCH(Iviltra!F16,Products!$B$4:$B$19,0))","v":" ZL62839"},null,null," ATH 814 V",60.1,55.8,171,6.9530000000000003,785,"Light Brown",null,0.01]
[16,"???",{"$f":"INDEX(Products!$C$4:$C$19,MATCH(Iviltra!F17,Products!$B$4:$B$19,0))","v":" ZL62839"},null,null," ATH 814 V",60.7,55.5,246,7.1520000000000001,787,"Light Brown",null,0.01]
[17,"???",{"$f":"INDEX(Products!$C$4:$C$19,MATCH(Iviltra!F18,Products!$B$4:$B$19,0))","v":"ZL62837"},null,null," ATH 837",56.1,43.5,143,8.1539999999999999,805,"Light Brown",null,0.01]
[18,"???",{"$f":"INDEX(Products!$C$4:$C$19,MATCH(Iviltra!F19,Products!$B$4:$B$19,0))","v":"ZL62814"},null,null," ATH 809 V",53.8,45.8,126,8.1530000000000005,803,"Light Brown",null,0.01]
[19,"???",{"$f":"INDEX(Products!$C$4:$C$19,MATCH(Iviltra!F20,Products!$B$4:$B$19,0))","v":"ZL62814"},null,null," ATH 809 V",62.6,51.6,80,8.3000000000000007,803,"Light Brown",null,0.01]
[20,"???",{"$f":"INDEX(Products!$C$4:$C$19,MATCH(Iviltra!F21,Products!$B$4:$B$19,0))","v":"ZL62837"},null,null," ATH 837",68.3,57,82,8.9619999999999997,798,"Light Brown",null,0.01]
[21,null,{"$f":"INDEX(Products!$C$4:$C$19,MATCH(Iviltra!F22,Products!$B$4:$B$19,0))","v":"Absent"},null,null,"Absent"]
[22,"???",{"$f":"INDEX(Products!$C$4:$C$19,MATCH(Iviltra!F23,Products!$B$4:$B$19,0))","v":"ZL62814"},null,null," ATH 809 V",59.5,50.1,117,8.1720000000000006,804,"Light Brown",null,0.01]
[23,"???",{"$f":"INDEX(Products!$C$4:$C$19,MATCH(Iviltra!F24,Products!$B$4:$B$19,0))","v":"ZL62837"},null,null," ATH 837",63.5,61.1,54,9.093,802,"Light Brown",null,0.01]
[24,"???",{"$f":"INDEX(Products!$C$4:$C$19,MATCH(Iviltra!F25,Products!$B$4:$B$19,0))","v":"ZL62814"},null,null," ATH 809 V",59,50.5,131,7.7,796,"Light Brown",null,0.01]
[25,"???",{"$f":"INDEX(Products!$C$4:$C$19,MATCH(Iviltra!F26,Products!$B$4:$B$19,0))","v":"ZL62814"},null,null," ATH 809 V",60.3,49.5,137,7.657,795,"Light Brown",null,0.01]
[26,"???",{"$f":"INDEX(Products!$C$4:$C$19,MATCH(Iviltra!F27,Products!$B$4:$B$19,0))","v":"ZL62814"},null,null," ATH 809 V",61,48.5,139,7.383,792,"Light Brown",null,0.01]
[27,"???",{"$f":"INDEX(Products!$C$4:$C$19,MATCH(Iviltra!F28,Products!$B$4:$B$19,0))","v":"ZL62814"},null,null," ATH 809 V",62,48.3,144,7.6130000000000004,796,"Light Brown",null,0.01]
[28,"???",{"$f":"INDEX(Products!$C$4:$C$19,MATCH(Iviltra!F29,Products!$B$4:$B$19,0))","v":"ZL62837"},null,null," ATH 837",62,50,104,7.9249999999999998,798,"Light Brown",null,0.01]
[29,"???",{"$f":"INDEX(Products!$C$4:$C$19,MATCH(Iviltra!F30,Products!$B$4:$B$19,0))","v":"ZL62837"},null,null," ATH 837",67.5,58,74,8.7810000000000006,803,"Light Brown",null,0.01]
[30,"???",{"$f":"INDEX(Products!$C$4:$C$19,MATCH(Iviltra!F31,Products!$B$4:$B$19,0))","v":"ZL62837"},null,null," ATH 837",68.900000000000006,57.1,103,8.9529999999999994,797,"Light Brown",null,0.01]
[31,"???",{"$f":"INDEX(Products!$C$4:$C$19,MATCH(Iviltra!F32,Products!$B$4:$B$19,0))","v":"ZL62814"},null,null," ATH 809 V",62.4,52.5,145,7.3810000000000002,794,"Light Brown",null,0.01]
[32,"???",{"$f":"INDEX(Products!$C$4:$C$19,MATCH(Iviltra!F33,Products!$B$4:$B$19,0))","v":"ZL62814"},null,null," ATH 809 V",63.2,53,147,7.9059999999999997,795,"Light Brown",null,0.01]
[33,"???",{"$f":"INDEX(Products!$C$4:$C$19,MATCH(Iviltra!F34,Products!$B$4:$B$19,0))","v":"ZL62814"},null,null," ATH 809 V",60.4,52.3,121,6.782,792,"Light Brown",null,0.01]
[34,"???",{"$f":"INDEX(Products!$C$4:$C$19,MATCH(Iviltra!F35,Products!$B$4:$B$19,0))","v":"ZL62837"},null,null," ATH 837",64.599999999999994,58.5,128,8.6349999999999998,798,"Light Brown",null,0.01]
[35,"???",{"$f":"INDEX(Products!$C$4:$C$19,MATCH(Iviltra!F36,Products!$B$4:$B$19,0))","v":"ZL62837"},null,null," ATH 837",67.5,57.5,138,8.109,797,"Light Brown",null,0.01]
[36,"???",{"$f":"INDEX(Products!$C$4:$C$19,MATCH(Iviltra!F37,Products!$B$4:$B$19,0))","v":"ZL62837"},null,null," ATH 837",67.5,58,93,8.9149999999999991,801,"Light Brown",null,0.01]
[37,"???",{"$f":"INDEX(Products!$C$4:$C$19,MATCH(Iviltra!F38,Products!$B$4:$B$19,0))","v":"ZL62837"},null,null," ATH 837",66.900000000000006,57,89,7.5350000000000001,795,"Light Brown",null,0.01,null,"Formulation here was 83% Foots Oil and 17% Concentrate"]
[38,"???",{"$f":"INDEX(Products!$C$4:$C$19,MATCH(Iviltra!F39,Products!$B$4:$B$19,0))","v":"ZL62814"},null,null," ATH 809 V",56.2,53,85,7.4690000000000003,791,"Light Brown",null,0.01]
[39,"???",{"$f":"INDEX(Products!$C$4:$C$19,MATCH(Iviltra!F40,Products!$B$4:$B$19,0))","v":0},null,null," ATH 674",63.8,57.1,131,9.1460000000000008,800,"Light Brown",null,0.01,null,"24.3% Pet 12, 58.5% SN 150, 17.2% 674"]
[40,"???",{"$f":"INDEX(Products!$C$4:$C$19,MATCH(Iviltra!F41,Products!$B$4:$B$19,0))","v":0},null,null," ATH 674",63.2,56.3,105,9.06,805,"Light Brown",null,0.01,null,"26.3% Pet 12, 55.3% SN 150, 18.4% 674 - out of oil so it was approved to ship as produced"]
[41,"???",{"$f":"INDEX(Products!$C$4:$C$19,MATCH(Iviltra!F42,Products!$B$4:$B$19,0))","v":"ZL62837"},null,null," ATH 837",58.8,57.5,114,7.4560000000000004,795,"Light Brown",null,0.01,null,"This batch was sent to Achema"]
[42,"???",{"$f":"INDEX(Products!$C$4:$C$19,MATCH(Iviltra!F43,Products!$B$4:$B$19,0))","v":"ZL62837"},null,null," ATH 837",65,58.2,125,6.6829999999999998,794,"Light Brown",null,0.01,null,"This batch was sent to Achema"]
[43,"???",{"$f":"INDEX(Products!$C$4:$C$19,MATCH(Iviltra!F44,Products!$B$4:$B$19,0))","v":"ZL62837"},null,null," ATH 837",63.9,59,75,8.3030000000000008,796,"Light Brown",null,0.01,null,"This batch was sent to Achema"]
[44,"???",{"$f":"INDEX(Products!$C$4:$C$19,MATCH(Iviltra!F45,Products!$B$4:$B$19,0))","v":"ZL62837"},null,null," ATH 837",69.7,59.5,81,8.1859999999999999,799,"Light Brown",null,0.01]
[45,"???",{"$f":"INDEX(Products!$C$4:$C$19,MATCH(Iviltra!F46,Products!$B$4:$B$19,0))","v":"ZL62837"},null,null," ATH 837",69.5,58,60,8.4429999999999996,795,"Light Brown",null,0.01]
[46,"???",{"$f":"INDEX(Products!$C$4:$C$19,MATCH(Iviltra!F47,Products!$B$4:$B$19,0))","v":"ZL62835"},null,null," ATH 635",58,54.6,135,10.699,825,"Light Brown",null,0.01]
[49,"2017-06-16",{"$f":"INDEX(Products!$C$4:$C$19,MATCH(Iviltra!F48,Products!$B$4:$B$19,0))","v":"ZL62809"},null,null," ATH 709",66.3,57.4,95,12.143000000000001,808,"Light Brown",null,0.01]
[50,"2017-06-19",{"$f":"INDEX(Products!$C$4:$C$19,MATCH(Iviltra!F49,Products!$B$4:$B$19,0))","v":"ZL62835"},null,null," ATH 635",67.5,57.2,140,10.214,810,"Light Brown",null,0.01]
[51,"2017-06-20",{"$f":"INDEX(Products!$C$4:$C$19,MATCH(Iviltra!F50,Products!$B$4:$B$19,0))","v":"ZL62809"},null,null," ATH 709",69.3,57.9,95,10.06,810,"Light Brown",null,0.01]
[52,"2017-06-23",{"$f":"INDEX(Products!$C$4:$C$19,MATCH(Iviltra!F51,Products!$B$4:$B$19,0))","v":"ZL62809"},null,null," ATH 709",66.7,57.2,75,10.919,809,"Light Brown",null,0.01]
[53,"2017-06-29",{"$f":"INDEX(Products!$C$4:$C$19,MATCH(Iviltra!F52,Products!$B$4:$B$19,0))","v":"ZL62835"},null,null," ATH 635",68.8,58,149,10.029999999999999,811,"Light Brown",null,0.01]
[54,"2017-07-03",{"$f":"INDEX(Products!$C$4:$C$19,MATCH(Iviltra!F53,Products!$B$4:$B$19,0))","v":"ZL62809"},null,null," ATH 709",69.2,56.2,87,12.441000000000001,809,"Light Brown",null,0.01]
[55,"2017-07-07",{"$f":"INDEX(Products!$C$4:$C$19,MATCH(Iviltra!F54,Products!$B$4:$B$19,0))","v":"ZL62835"},null,null," ATH 635",64.400000000000006,57.1,161,10.645,817,"Light Brown",null,0.01]
[56,"2017-07-10",{"$f":"INDEX(Products!$C$4:$C$19,MATCH(Iviltra!F55,Products!$B$4:$B$19,0))","v":"ZL62809"},null,null," ATH 709",61.9,56.2,89,11.53,804,"Light Brown",null,0.01]
[57,"2017-07-11",{"$f":"INDEX(Products!$C$4:$C$19,MATCH(Iviltra!F56,Products!$B$4:$B$19,0))","v":"ZL62835"},null,null," ATH 635",63.6,56.4,127,10.074,809,"Light Brown",null,0.01]
[58,"2017-07-12",{"$f":"INDEX(Products!$C$4:$C$19,MATCH(Iviltra!F57,Products!$B$4:$B$19,0))","v":"ZL62835"},null,null," ATH 635",61.1,56.5,107,10.208,805,"Light Brown",null,0.01]
[59,"???",{"$f":"INDEX(Products!$C$4:$C$19,MATCH(Iviltra!F58,Products!$B$4:$B$19,0))","v":"ZL60367"},null,null," ATH 635 OCP",65,58.8,78,12.45,806,"Light Brown",null,0.01]
[60,"2017-07-26",{"$f":"INDEX(Products!$C$4:$C$19,MATCH(Iviltra!F59,Products!$B$4:$B$19,0))","v":"ZL62809"},null,null," ATH 709",63.8,57.5,72,11.186,805,"Light Brown",null,0.01]
[61,"2017-07-28",{"$f":"INDEX(Products!$C$4:$C$19,MATCH(Iviltra!F60,Products!$B$4:$B$19,0))","v":"ZL60224"},null,null," ATH 635 BG",63.4,55.9,137,10.536,806,"Light Brown",null,0.01]
[62,"2017-07-28",{"$f":"INDEX(Products!$C$4:$C$19,MATCH(Iviltra!F61,Products!$B$4:$B$19,0))","v":"ZL60367"},null,null," ATH 635 OCP",64.900000000000006,56.4,85,11.896000000000001,799,"Light Brown",null,0.01]
[63,"2017-07-28",{"$f":"INDEX(Products!$C$4:$C$19,MATCH(Iviltra!F62,Products!$B$4:$B$19,0))","v":"ZL62835"},null,null," ATH 635",64.5,57,127,10.146000000000001,814,"Light Brown",null,0.01]
[64,"2017-07-31",{"$f":"INDEX(Products!$C$4:$C$19,MATCH(Iviltra!F63,Products!$B$4:$B$19,0))","v":"ZL60224"},null,null," ATH 635 BG",61.6,55,130,10.122999999999999,805,"Light Brown",null,0.01]
[65,"2017-07-31",{"$f":"INDEX(Products!$C$4:$C$19,MATCH(Iviltra!F64,Products!$B$4:$B$19,0))","v":"ZL62835"},null,null," ATH 635",65,57.6,173,10.94,803,"Light Brown",null,0.01]
[66,"???",{"$f":"INDEX(Products!$C$4:$C$19,MATCH(Iviltra!F65,Products!$B$4:$B$19,0))","v":"ZL60367"},null,null," ATH 635 OCP",63,56.9,84,13.055999999999999,802,"Light Brown",null,0.01]
[67,"2017-08-01",{"$f":"INDEX(Products!$C$4:$C$19,MATCH(Iviltra!F66,Products!$B$4:$B$19,0))","v":"ZL62840"},null,null," ATH 714",65.5,58.6,45,15.401999999999999,807,"Light Brown",null,0.01]
[68,"2017-08-04",{"$f":"INDEX(Products!$C$4:$C$19,MATCH(Iviltra!F67,Products!$B$4:$B$19,0))","v":"ZL60224"},null,null," ATH 635 BG",62,57,130,10.276999999999999,807,"Light Brown",null,0.01]
[69,"2017-08-04",{"$f":"INDEX(Products!$C$4:$C$19,MATCH(Iviltra!F68,Products!$B$4:$B$19,0))","v":"ZL62835"},null,null," ATH 635",66.8,57.7,141,9.7680000000000007,803,"Light Brown",null,0.01]
[70,"2017-08-04",{"$f":"INDEX(Products!$C$4:$C$19,MATCH(Iviltra!F69,Products!$B$4:$B$19,0))","v":"ZL62840"},null,null," ATH 814",68.7,62.5,49,16.521000000000001,812,"Light Brown",null,0.01]
[71,"2017-08-07",{"$f":"INDEX(Products!$C$4:$C$19,MATCH(Iviltra!F70,Products!$B$4:$B$19,0))","v":"ZL60224"},null,null," ATH 635 BG",61.5,54,147,11.566000000000001,823,"Light Brown",null,0.01]
[72,"2017-08-07",{"$f":"INDEX(Products!$C$4:$C$19,MATCH(Iviltra!F71,Products!$B$4:$B$19,0))","v":"ZL62814"},null,null," ATH 809 V",55.6,49.5,121,8.68,794,"Light Brown",null,0.01]
[73,"2017-08-08",{"$f":"INDEX(Products!$C$4:$C$19,MATCH(Iviltra!F72,Products!$B$4:$B$19,0))","v":"ZL62835"},null,null," ATH 635",67,58.7,169,10.398,811,"Light Brown",null,0.01]
[74,"2017-08-09",{"$f":"INDEX(Products!$C$4:$C$19,MATCH(Iviltra!F73,Products!$B$4:$B$19,0))","v":"ZL60367"},null,null," ATH 635 OCP",63.8,58,115,14.689,811,"Light Brown",null,0.01]
[75,"2017-08-10",{"$f":"INDEX(Products!$C$4:$C$19,MATCH(Iviltra!F74,Products!$B$4:$B$19,0))","v":"ZL60224"},null,null," ATH 635 BG",66.8,54.8,130,12.180999999999999,812,"Light Brown",null,0.01]
[76,"2017-08-11",{"$f":"INDEX(Products!$C$4:$C$19,MATCH(Iviltra!F75,Products!$B$4:$B$19,0))","v":"ZL60224"},null,null," ATH 635 BG",64.8,56.2,142,11.385999999999999,811,"Light Brown",null,0.01]
[77,"2017-08-14",{"$f":"INDEX(Products!$C$4:$C$19,MATCH(Iviltra!F76,Products!$B$4:$B$19,0))","v":"ZL62835"},null,null," ATH 635",65.5,57.3,177,10.836,811,"Light Brown",null,0.01]
[78,"2017-08-14",{"$f":"INDEX(Products!$C$4:$C$19,MATCH(Iviltra!F77,Products!$B$4:$B$19,0))","v":"ZL60367"},null,null," ATH 635 OCP",63,57,91,13.329000000000001,822,"Light Brown",null,0.01]
[79,"2017-08-16",{"$f":"INDEX(Products!$C$4:$C$19,MATCH(Iviltra!F78,Products!$B$4:$B$19,0))","v":"ZL62809"},null,null," ATH 709",64.099999999999994,55.2,95,13.337,825,"Light Brown",null,0.01]
[80,"2017-08-16",{"$f":"INDEX(Products!$C$4:$C$19,MATCH(Iviltra!F79,Products!$B$4:$B$19,0))","v":"ZL62835"},null,null," ATH 635",64.099999999999994,58.2,171,11.282999999999999,807,"Light Brown",null,0.01]
[81,"???",{"$f":"INDEX(Products!$C$4:$C$19,MATCH(Iviltra!F80,Products!$B$4:$B$19,0))","v":"ZL60367"},null,null," ATH 635 OCP",63.8,57.7,86,13.925000000000001,807,"Light Brown",null,0.01]
[82,"2017-08-17",{"$f":"INDEX(Products!$C$4:$C$19,MATCH(Iviltra!F81,Products!$B$4:$B$19,0))","v":"ZL62814"},null,null," ATH 809 V",60.2,49.2,125,8.2710000000000008,805,"Light Brown",null,0.01]
[83,"2017-08-17",{"$f":"INDEX(Products!$C$4:$C$19,MATCH(Iviltra!F82,Products!$B$4:$B$19,0))","v":"ZL60367"},null,null," ATH 635 OCP",64.900000000000006,57.3,89,12.981,824,"Light Brown",null,0.01]
[84,"2017-08-25",{"$f":"INDEX(Products!$C$4:$C$19,MATCH(Iviltra!F83,Products!$B$4:$B$19,0))","v":"ZL62835"},null,null," ATH 635"]
[84,"2017-08-18",{"$f":"INDEX(Products!$C$4:$C$19,MATCH(Iviltra!F84,Products!$B$4:$B$19,0))","v":"ZL60224"},null,null," ATH 635 BG",64.2,54.5,145,11.531000000000001,809,"Light Brown",null,0.01]
[85,"2017-08-21",{"$f":"INDEX(Products!$C$4:$C$19,MATCH(Iviltra!F85,Products!$B$4:$B$19,0))","v":"ZL60224"},null,null," ATH 635 BG",62.1,57.4,146,11.688000000000001,811,"Light Brown",null,0.01]
[86,"2017-08-24",{"$f":"INDEX(Products!$C$4:$C$19,MATCH(Iviltra!F86,Products!$B$4:$B$19,0))","v":"ZL62809"},null,null," ATH 709",67.8,58.5,82,14.143000000000001,823,"Light Brown",null,0.01]
[87,"???",{"$f":"INDEX(Products!$C$4:$C$19,MATCH(Iviltra!F87,Products!$B$4:$B$19,0))","v":"ZL62835"},null,null," ATH 635",63.4,57.9,136,10.851000000000001,811,"Light Brown",null,0.01]
[88,"???",{"$f":"INDEX(Products!$C$4:$C$19,MATCH(Iviltra!F88,Products!$B$4:$B$19,0))","v":"ZL62835"},null,null," ATH 635",63.4,56.3,165,10.962,814,"Light Brown",null,0.01]
[89,"2017-08-28",{"$f":"INDEX(Products!$C$4:$C$19,MATCH(Iviltra!F89,Products!$B$4:$B$19,0))","v":"ZL62835"},null,null," ATH 635",63.2,57.5,162,10.763,822,"Light Brown",null,0.01]
[90,"2017-08-28",{"$f":"INDEX(Products!$C$4:$C$19,MATCH(Iviltra!F90,Products!$B$4:$B$19,0))","v":"ZL62840"},null,null," ATH 741",67.5,57.8,54,16.565999999999999,825,"Light Brown",null,0.01]
[91,"2017-09-04",{"$f":"INDEX(Products!$C$4:$C$19,MATCH(Iviltra!F91,Products!$B$4:$B$19,0))","v":"ZL62835"},null,null," ATH 635",63.5,56.8,155,10.423999999999999,807,"Light Brown",null,0.01]
[92,"2017-09-05",{"$f":"INDEX(Products!$C$4:$C$19,MATCH(Iviltra!F92,Products!$B$4:$B$19,0))","v":"ZL60224"},null,null," ATH 635 BG",63.1,56.3,148,11.134,807,"Light Brown",null,0.01]
[93,"2017-09-05",{"$f":"INDEX(Products!$C$4:$C$19,MATCH(Iviltra!F93,Products!$B$4:$B$19,0))","v":"ZL62835"},null,null," ATH 635",67,57,183,10.67,807,"Light Brown",null,0.01]
[94,"2017-09-08",{"$f":"INDEX(Products!$C$4:$C$19,MATCH(Iviltra!F94,Products!$B$4:$B$19,0))","v":"ZL60224"},null,null," ATH 635 BG",61,56.3,134,11.872999999999999,811,"Light Brown",null,0.01]
[95,"2017-09-11",{"$f":"INDEX(Products!$C$4:$C$19,MATCH(Iviltra!F95,Products!$B$4:$B$19,0))","v":"ZL62840"},null,null," ATH 741",68.900000000000006,58,50,14.897,803,"Light Brown",null,0.01]
[96,"2017-09-14",{"$f":"INDEX(Products!$C$4:$C$19,MATCH(Iviltra!F96,Products!$B$4:$B$19,0))","v":"ZL60224"},null,null," ATH 635 BG",66.3,54.5,127,10.567,822,"Light Brown",null,0.01]
[97,"2017-09-14",{"$f":"INDEX(Products!$C$4:$C$19,MATCH(Iviltra!F97,Products!$B$4:$B$19,0))","v":"ZL62835"},null,null," ATH 635",66.8,57.1,163,10.519,823,"Light Brown",null,0.01]
[98,"???",{"$f":"INDEX(Products!$C$4:$C$19,MATCH(Iviltra!F98,Products!$B$4:$B$19,0))","v":"ZL60224"},null,null," ATH 635 BG",62.3,52.5,145,10.897,819,"Light Brown",null,0.01]
[99,"2017-09-19",{"$f":"INDEX(Products!$C$4:$C$19,MATCH(Iviltra!F99,Products!$B$4:$B$19,0))","v":"ZL62835"},null,null," ATH 635",64.5,54.5,186,10.76,823,"Light Brown",null,0.01]
[100,"2017-08-19",{"$f":"INDEX(Products!$C$4:$C$19,MATCH(Iviltra!F100,Products!$B$4:$B$19,0))","v":"ZL60224"},null,null," ATH 635 BG",62.5,52,170,11.079000000000001,812,"Light Brown",null,0.01]
[101,"2017-09-22",{"$f":"INDEX(Products!$C$4:$C$19,MATCH(Iviltra!F101,Products!$B$4:$B$19,0))","v":"ZL60224"},null,null," ATH 635 BG",62,52.5,147,11.834,827,"Light Brown",null,0.01]
[102,"2017-09-25",{"$f":"INDEX(Products!$C$4:$C$19,MATCH(Iviltra!F102,Products!$B$4:$B$19,0))","v":"ZL60224"},null,null," ATH 635 BG",62,53,146,11.534000000000001,820,"Light Brown",null,0.01]
[103,"2017-09-25",{"$f":"INDEX(Products!$C$4:$C$19,MATCH(Iviltra!F103,Products!$B$4:$B$19,0))","v":"ZL62809"},null,null," ATH 709",67.2,57.6,94,14.315,828,"Light Brown",null,0.01]
[104,"2017-09-26",{"$f":"INDEX(Products!$C$4:$C$19,MATCH(Iviltra!F104,Products!$B$4:$B$19,0))","v":"ZL60224"},null,null," ATH 635 BG",61.8,52.5,148,11.802,826,"Light Brown",null,0.01]
[105,"2017-09-29",{"$f":"INDEX(Products!$C$4:$C$19,MATCH(Iviltra!F105,Products!$B$4:$B$19,0))","v":"ZL62835"},null,null," ATH 635",63,56.4,186,10.605,811,"Light Brown",null,0.01]
[106,"2017-10-02",{"$f":"INDEX(Products!$C$4:$C$19,MATCH(Iviltra!F106,Products!$B$4:$B$19,0))","v":"ZL62840"},null,null," ATH 741",69.8,61.2,42,18.547999999999998,805,"Light Brown",null,0.01]
[107,"2017-10-09",{"$f":"INDEX(Products!$C$4:$C$19,MATCH(Iviltra!F107,Products!$B$4:$B$19,0))","v":"ZL62814"},null,null," ATH 809 V",61,50,95,8.07,793,"Light Brown",null,0.01]
[108,"2017-10-11",{"$f":"INDEX(Products!$C$4:$C$19,MATCH(Iviltra!F108,Products!$B$4:$B$19,0))","v":" ZL62839"},null,null," ATH 814 V",64.2,59,48,15.742000000000001,822,"Light Brown",null,0.01]
[109,"2017-10-13",{"$f":"INDEX(Products!$C$4:$C$19,MATCH(Iviltra!F109,Products!$B$4:$B$19,0))","v":"ZL62809"},null,null," ATH 709",66.8,54.8,105,14.894,822,"Light Brown",null,0.01]
[110,"2017-10-13",{"$f":"INDEX(Products!$C$4:$C$19,MATCH(Iviltra!F110,Products!$B$4:$B$19,0))","v":"ZL62840"},null,null," ATH 741",67,61,40,13.741,811,"Light Brown",null,0.01]
[111,"2017-10-16",{"$f":"INDEX(Products!$C$4:$C$19,MATCH(Iviltra!F111,Products!$B$4:$B$19,0))","v":"ZL60224"},null,null," ATH 635 BG",62.5,53.1,92,10.43,813,"Light Brown",null,0.01]
[112,"2017-10-17",{"$f":"INDEX(Products!$C$4:$C$19,MATCH(Iviltra!F112,Products!$B$4:$B$19,0))","v":"ZL60224"},null,null," ATH 635 BG",62.7,52.5,93,10.146000000000001,807,"Light Brown",null,0.01]
[113,"2017-01-20",{"$f":"INDEX(Products!$C$4:$C$19,MATCH(Iviltra!F113,Products!$B$4:$B$19,0))","v":"ZL60224"},null,null," ATH 635 BG",59.2,54,135,10.436999999999999,805,"Light Brown",null,0.01]
[114,"2017-10-23",{"$f":"INDEX(Products!$C$4:$C$19,MATCH(Iviltra!F114,Products!$B$4:$B$19,0))","v":"ZL60224"},null,null," ATH 635 BG",59.8,51.5,131,11.028,814,"Light Brown",null,0.01]
[115,"2017-10-24",{"$f":"INDEX(Products!$C$4:$C$19,MATCH(Iviltra!F115,Products!$B$4:$B$19,0))","v":"ZL62809"},null,null," ATH 709",60,56.5,55,11.879,805,"Light Brown",null,0.01]
[116,"2017-10-25",{"$f":"INDEX(Products!$C$4:$C$19,MATCH(Iviltra!F116,Products!$B$4:$B$19,0))","v":"ZL62809"},null,null," ATH 709",60.2,56.3,66,11.561,804,"Light Brown",null,0.01]
[117,"2017-11-03",{"$f":"INDEX(Products!$C$4:$C$19,MATCH(Iviltra!F117,Products!$B$4:$B$19,0))","v":"ZL60224"},null,null," ATH 635 BG",62.1,55.4,125,11.289,812,"Light Brown",null,0.01]
[118,"2017-11-06",{"$f":"INDEX(Products!$C$4:$C$19,MATCH(Iviltra!F118,Products!$B$4:$B$19,0))","v":"ZL60224"},null,null," ATH 635 BG",61.8,53.2,132,12.125999999999999,806,"Light Brown",null,0.01]
[119,"2017-11-07",{"$f":"INDEX(Products!$C$4:$C$19,MATCH(Iviltra!F119,Products!$B$4:$B$19,0))","v":"ZL60224"},null,null," ATH 635 BG",61.1,54,135,11.957000000000001,810,"Light Brown",null,0.01]
[120,"2017-11-09",{"$f":"INDEX(Products!$C$4:$C$19,MATCH(Iviltra!F120,Products!$B$4:$B$19,0))","v":"ZL62835"},null,null," ATH 626M EU",61.7,56.1,140,11.792,830,"Light Brown",null,0.01]
[121,"2017-11-13",{"$f":"INDEX(Products!$C$4:$C$19,MATCH(Iviltra!F121,Products!$B$4:$B$19,0))","v":"ZL60224"},null,null," ATH 635 BG",60.5,53.2,134,11.367000000000001,806,"Light Brown",null,0.01]
[122,"2017-11-14",{"$f":"INDEX(Products!$C$4:$C$19,MATCH(Iviltra!F122,Products!$B$4:$B$19,0))","v":"ZL60224"},null,null," ATH 635 BG",59.9,54.5,141,10.946999999999999,806,"Light Brown",null,0.01]
[123,"2017-11-20",{"$f":"INDEX(Products!$C$4:$C$19,MATCH(Iviltra!F123,Products!$B$4:$B$19,0))","v":"ZL62840"},null,null," ATH 814",66.2,60.3,52,17.593,810,"Light Brown",null,0.01]
[124,"2017-11-21",{"$f":"INDEX(Products!$C$4:$C$19,MATCH(Iviltra!F124,Products!$B$4:$B$19,0))","v":"ZL60224"},null,null," ATH 635 BG",59.7,55,130,10.962999999999999,817,"Light Brown",null,0.01]
[125,"2017-11-27",{"$f":"INDEX(Products!$C$4:$C$19,MATCH(Iviltra!F125,Products!$B$4:$B$19,0))","v":"ZL60224"},null,null," ATH 635 BG",66.400000000000006,55,112,11.436,811,"Light Brown",null,0.01]
[126,"2017-11-27",{"$f":"INDEX(Products!$C$4:$C$19,MATCH(Iviltra!F126,Products!$B$4:$B$19,0))","v":"ZL60224"},null,null," ATH 635 BG",66.400000000000006,55,112,11.436,811,"Light Brown",null,0.01]
[127,"2017-11-27",{"$f":"INDEX(Products!$C$4:$C$19,MATCH(Iviltra!F127,Products!$B$4:$B$19,0))","v":"ZL62840"},null,null," ATH 814",64.7,60,41,14.794,805,"Light Brown",null,0.01]
[128,"2017-11-28",{"$f":"INDEX(Products!$C$4:$C$19,MATCH(Iviltra!F128,Products!$B$4:$B$19,0))","v":"ZL62840"},null,null," ATH 741",64.7,59.2,42,15.254,811,"Light Brown",null,0.01]
[129,"2017-11-30",{"$f":"INDEX(Products!$C$4:$C$19,MATCH(Iviltra!F129,Products!$B$4:$B$19,0))","v":"ZL62809"},null,null," ATH 709",61.7,54.6,86,12.121,808,"Light Brown",null,0.01]
[130,"2017-12-01",{"$f":"INDEX(Products!$C$4:$C$19,MATCH(Iviltra!F130,Products!$B$4:$B$19,0))","v":"ZL62809"},null,null," ATH 709",62.3,55.2,83,13.144,822,"Light Brown",null,0.01]
[131,"2017-11-29",{"$f":"INDEX(Products!$C$4:$C$19,MATCH(Iviltra!F131,Products!$B$4:$B$19,0))","v":"ZL62835"},null,null," ATH 626M EU",63.6,55,136,9.1669999999999998,803,"Light Brown",null,0.01]
[132,"2017-12-07",{"$f":"INDEX(Products!$C$4:$C$19,MATCH(Iviltra!F132,Products!$B$4:$B$19,0))","v":"ZL62809"},null,null," ATH 709",62.8,57.6,84,13.618,809,"Light Brown",null,0.01]
[133,"2017-12-11",{"$f":"INDEX(Products!$C$4:$C$19,MATCH(Iviltra!F133,Products!$B$4:$B$19,0))","v":"ZL60224"},null,null," ATH 635 BG",59,54.8,132,11.314,817,"Light Brown",null,0.01]
[134,"2017-12-12",{"$f":"INDEX(Products!$C$4:$C$19,MATCH(Iviltra!F134,Products!$B$4:$B$19,0))","v":"ZL60224"},null,null," ATH 635 BG",60.7,55.2,134,11.868,816,"Light Brown",null,0.01]
[135,"2017-12-15",{"$f":"INDEX(Products!$C$4:$C$19,MATCH(Iviltra!F135,Products!$B$4:$B$19,0))","v":"ZL60224"},null,null," ATH 635 BG",58,52.8,147,10.728,824,"Light Brown",null,0.01]
[136,"2018-12-18",{"$f":"INDEX(Products!$C$4:$C$19,MATCH(Iviltra!F136,Products!$B$4:$B$19,0))","v":"ZL60224"},null,null," ATH 635 BG",57.7,51.6,142,11.105,827,"Light Brown",null,0.01]
[137,"2018-01-03",{"$f":"INDEX(Products!$C$4:$C$19,MATCH(Iviltra!F137,Products!$B$4:$B$19,0))","v":"ZL60224"},null,null," ATH 635 BG",58.4,54.8,111,11.207000000000001,825,"Light Brown",null,0.4]
[138,"2018-01-05",{"$f":"INDEX(Products!$C$4:$C$19,MATCH(Iviltra!F138,Products!$B$4:$B$19,0))","v":"ZL60224"},null,null," ATH 635 BG",57.1,54.2,131,11.169,834,"Light Brown",null,0.4]
[139,"2018-01-05",{"$f":"INDEX(Products!$C$4:$C$19,MATCH(Iviltra!F139,Products!$B$4:$B$19,0))","v":" ZL62839"},null,null," ATH 837 BG",55.2,50.5,110,8.08,795,"Light Brown",null,0.4]
[140,"2018-01-08",{"$f":"INDEX(Products!$C$4:$C$19,MATCH(Iviltra!F140,Products!$B$4:$B$19,0))","v":"ZL60224"},null,null," ATH 635 BG",59.4,52,140,11.574999999999999,830,"Light Brown",null,0.4]
[141,"2018-01-08",{"$f":"INDEX(Products!$C$4:$C$19,MATCH(Iviltra!F141,Products!$B$4:$B$19,0))","v":"ZL60224"},null,null," ATH 635 BG",58.8,54,145,11.297000000000001,834,"Light Brown",null,0.4]
[142,"2018-01-09",{"$f":"INDEX(Products!$C$4:$C$19,MATCH(Iviltra!F142,Products!$B$4:$B$19,0))","v":"ZL62840"},null,null," ATH 814",67.8,60.5,44,14.759,820,"Light Brown",null,0.01]
[143,"2018-01-17",{"$f":"INDEX(Products!$C$4:$C$19,MATCH(Iviltra!F143,Products!$B$4:$B$19,0))","v":"ZL62809"},null,null," ATH 709",63.4,58,90,14.081,826,"Light Brown",null,0.01]
[144,"2018-01-19",{"$f":"INDEX(Products!$C$4:$C$19,MATCH(Iviltra!F144,Products!$B$4:$B$19,0))","v":"ZL62814"},null,null," ATH 809 V",55.1,50.5,70,8.1069999999999993,790,"Light Brown",null,0.01]
[145,"2018-01-19",{"$f":"INDEX(Products!$C$4:$C$19,MATCH(Iviltra!F145,Products!$B$4:$B$19,0))","v":"ZL60224"},null,null," ATH 635 BG",66.8,54.9,148,12.029,815,"Light Brown",null,0.01]
[146,"2018-01-23",{"$f":"INDEX(Products!$C$4:$C$19,MATCH(Iviltra!F146,Products!$B$4:$B$19,0))","v":"ZL60224"},null,null," ATH 635 BG",57.2,52.2,134,11.94,813,"Light Brown",null,0.01]
[147,"???",{"$f":"INDEX(Products!$C$4:$C$19,MATCH(Iviltra!F147,Products!$B$4:$B$19,0))","v":"ZL62840"},null,null," ATH 741",69.8,62.2,40,17.699000000000002,809,"Light Brown",null,0.01]
[148,"2018-01-29",{"$f":"INDEX(Products!$C$4:$C$19,MATCH(Iviltra!F148,Products!$B$4:$B$19,0))","v":" ZL62839"},null,null," ATH 837 BG",55.2,50.1,113,7.7759999999999998,790,"Light Brown",null,0.01]
[149,"2018-02-02",{"$f":"INDEX(Products!$C$4:$C$19,MATCH(Iviltra!F149,Products!$B$4:$B$19,0))","v":"ZL62840"},null,null," ATH 741",68.599999999999994,61.4,50,18.321000000000002,818,"Light Brown",null,0.01]
[150,"2018-02-06",{"$f":"INDEX(Products!$C$4:$C$19,MATCH(Iviltra!F150,Products!$B$4:$B$19,0))","v":"ZL60224"},null,null," ATH 635 BG",58.7,53,142,10.887,819,"Light Brown",null,0.01]
[151,"2018-02-08",{"$f":"INDEX(Products!$C$4:$C$19,MATCH(Iviltra!F151,Products!$B$4:$B$19,0))","v":" ZL62839"},null,null," ATH 837 BG",55.4,50.2,117,7.423,794,"Light Brown",null,0.01]
[152,"2018-02-09",{"$f":"INDEX(Products!$C$4:$C$19,MATCH(Iviltra!F152,Products!$B$4:$B$19,0))","v":"ZL62814"},null,null," ATH 809 V",55.4,50.8,95,8.282,782,"Light Brown",null,0.01]
[153,"2018-02-09",{"$f":"INDEX(Products!$C$4:$C$19,MATCH(Iviltra!F153,Products!$B$4:$B$19,0))","v":"ZL60224"},null,null," ATH 635 BG",57.6,54.5,133,11.09,807,"Light Brown",null,0.01]
[154,"2018-02-12",{"$f":"INDEX(Products!$C$4:$C$19,MATCH(Iviltra!F154,Products!$B$4:$B$19,0))","v":"ZL60224"},null,null," ATH 635 BG",59.4,52.5,129,10.968999999999999,816,"Light Brown",null,0.01]
[155,"2018-02-15",{"$f":"INDEX(Products!$C$4:$C$19,MATCH(Iviltra!F155,Products!$B$4:$B$19,0))","v":"ZL62840"},null,null," ATH 814",68.900000000000006,63,46,17.085000000000001,807,"Light Brown",null,0.01]
[156,"2018-02-15",{"$f":"INDEX(Products!$C$4:$C$19,MATCH(Iviltra!F156,Products!$B$4:$B$19,0))","v":"ZL60224"},null,null," ATH 635 BG",57.9,55.3,132,11.449,816,"Light Brown",null,0.01]
[157,"2018-02-15",{"$f":"INDEX(Products!$C$4:$C$19,MATCH(Iviltra!F157,Products!$B$4:$B$19,0))","v":"ZL62809"},null,null," ATH 709",63.9,58.5,74,12.933,810,"Light Brown",null,0.01]
[158,"2018-02-19",{"$f":"INDEX(Products!$C$4:$C$19,MATCH(Iviltra!F158,Products!$B$4:$B$19,0))","v":"ZL60224"},null,null," ATH 635 BG",58.7,53.5,146,10.797000000000001,806,"Light Brown",null,0.01]
[159,"2018-02-23",{"$f":"INDEX(Products!$C$4:$C$19,MATCH(Iviltra!F159,Products!$B$4:$B$19,0))","v":"ZL60224"},null,null," ATH 635 BG",60.3,53.4,145,11.286,816,"Light Brown",null,0.01]
[160,"2018-02-26",{"$f":"INDEX(Products!$C$4:$C$19,MATCH(Iviltra!F160,Products!$B$4:$B$19,0))","v":" ZL62839"},null,null," ATH 837 BG",55.7,52.5,150,8.2319999999999993,796,"Light Brown",null,0.01]
[161,"2018-02-26",{"$f":"INDEX(Products!$C$4:$C$19,MATCH(Iviltra!F161,Products!$B$4:$B$19,0))","v":"ZL62809"},null,null," ATH 709",64.5,59.2,97,13.534000000000001,823,"Light Brown",null,0.01]
[162,"2018-02-27",{"$f":"INDEX(Products!$C$4:$C$19,MATCH(Iviltra!F162,Products!$B$4:$B$19,0))","v":"ZL60224"},null,null," ATH 635 BG",57.5,55,130,10.866,815,"Light Brown",null,0.01]
[163,"2018-03-02",{"$f":"INDEX(Products!$C$4:$C$19,MATCH(Iviltra!F163,Products!$B$4:$B$19,0))","v":"ZL60224"},null,null," ATH 635 BG",57.6,53,143,11.689,819,"Light Brown",null,0.01]
[164,"2018-03-06",{"$f":"INDEX(Products!$C$4:$C$19,MATCH(Iviltra!F164,Products!$B$4:$B$19,0))","v":"ZL60224"},null,null," ATH 635 BG",57.8,53.6,149,14.912000000000001,834,"Light Brown",null,0.01]
[165,"2018-03-05",{"$f":"INDEX(Products!$C$4:$C$19,MATCH(Iviltra!F165,Products!$B$4:$B$19,0))","v":"ZL62809"},null,null," ATH 709",64.5,58,84,13.967000000000001,822,"Light Brown",null,0.01]
[166,"2017-03-06",{"$f":"INDEX(Products!$C$4:$C$19,MATCH(Iviltra!F166,Products!$B$4:$B$19,0))","v":"ZL62840"},null,null," ATH 741",67.7,61.5,39,17.420000000000002,827,"Light Brown",null,0.01]
[167,"2018-01-23",{"$f":"INDEX(Products!$C$4:$C$19,MATCH(Iviltra!F167,Products!$B$4:$B$19,0))","v":"ZL62840"},null,null," ATH 741",69.8,63.5,44,16.864000000000001,836,"Light Brown",null,0.01]
[168,"2018-03-07",{"$f":"INDEX(Products!$C$4:$C$19,MATCH(Iviltra!F168,Products!$B$4:$B$19,0))","v":"ZL62814"},null,null," ATH 809 V",55.9,52,118,8.5939999999999994,807,"Light Brown",null,0.01]
[169,"2018-03-15",{"$f":"INDEX(Products!$C$4:$C$19,MATCH(Iviltra!F169,Products!$B$4:$B$19,0))","v":"ZL62837"},null,null," ATH 837",56.4,53.2,111,8.31,791,"Light Brown",null,0.01]
[170,"2018-03-22",{"$f":"INDEX(Products!$C$4:$C$19,MATCH(Iviltra!F170,Products!$B$4:$B$19,0))","v":"ZL62837"},null,null," ATH 837",60.2,56.2,118,8.65,796,"Light Brown",null,0.01]
[171,"2018-03-23",{"$f":"INDEX(Products!$C$4:$C$19,MATCH(Iviltra!F171,Products!$B$4:$B$19,0))","v":"ZL60224"},null,null," ATH 635 BG",57.2,54,125,11.324999999999999,821,"Light Brown",null,0.01]
[172,"2018-03-23",{"$f":"INDEX(Products!$C$4:$C$19,MATCH(Iviltra!F172,Products!$B$4:$B$19,0))","v":"ZL60224"},null,null," ATH 635 BG",59.2,53.1,123,11.493,826,"Light Brown",null,0.01]
[173,"2018-03-26",{"$f":"INDEX(Products!$C$4:$C$19,MATCH(Iviltra!F173,Products!$B$4:$B$19,0))","v":"ZL62840"},null,null," ATH 814",66.099999999999994,61.5,46,15.842000000000001,807,"Light Brown",null,0.01]
[174,"2018-03-27",{"$f":"INDEX(Products!$C$4:$C$19,MATCH(Iviltra!F174,Products!$B$4:$B$19,0))","v":"ZL60224"},null,null," ATH 635 BG",58.2,53.1,143,12.545999999999999,817,"Light Brown",null,0.01]
[175,"2018-04-03",{"$f":"INDEX(Products!$C$4:$C$19,MATCH(Iviltra!F175,Products!$B$4:$B$19,0))","v":"ZL60224"},null,null," ATH 635 BG",57.3,52.1,123,9.9510000000000005,812,"Light Brown",null,0.01]
[176,"???",{"$f":"INDEX(Products!$C$4:$C$19,MATCH(Iviltra!F176,Products!$B$4:$B$19,0))","v":"ZL60224"},null,null," ATH 635 BG",58.1,54.5,128,10.999000000000001,829,"Light Brown",null,0.01]
[177,"2018-04-05",{"$f":"INDEX(Products!$C$4:$C$19,MATCH(Iviltra!F177,Products!$B$4:$B$19,0))","v":"ZL62837"},null,null," ATH 837",63.3,59.4,77,8.4629999999999992,805,"Light Brown",null,0.01]
[178,"2018-04-06",{"$f":"INDEX(Products!$C$4:$C$19,MATCH(Iviltra!F178,Products!$B$4:$B$19,0))","v":"ZL62809"},null,null," ATH 709",60.9,56.2,59,11.167999999999999,839,"Light Brown",null,0.01]
[179,"2018-04-06",{"$f":"INDEX(Products!$C$4:$C$19,MATCH(Iviltra!F179,Products!$B$4:$B$19,0))","v":" ZL62839"},null,null," ATH 837 BG",55.9,57.5,120,7.9260000000000002,790,"Light Brown",null,0.01]
[180,"2018-04-10",{"$f":"INDEX(Products!$C$4:$C$19,MATCH(Iviltra!F180,Products!$B$4:$B$19,0))","v":"ZL62840"},null,null," ATH 741",64.900000000000006,58.9,36,12.782,802,"Light Brown",null,0.01]
[181,"???",{"$f":"INDEX(Products!$C$4:$C$19,MATCH(Iviltra!F181,Products!$B$4:$B$19,0))","v":"ZL60224"},null,null," ATH 635 BG",58.3,52.5,130,10.432,824,"Light Brown",null,0.01]
[182,null,{"$f":"INDEX(Products!$C$4:$C$19,MATCH(Iviltra!F182,Products!$B$4:$B$19,0))","v":"Absent"},null,null,"Absent"]
[183,null,{"$f":"INDEX(Products!$C$4:$C$19,MATCH(Iviltra!F183,Products!$B$4:$B$19,0))","v":"Absent"},null,null,"Absent"]
[184,"2018-04-25",{"$f":"INDEX(Products!$C$4:$C$19,MATCH(Iviltra!F184,Products!$B$4:$B$19,0))","v":"ZL60367"},"LTIV01-3-3","ArrMaz El Jadida"," ATH 635 OCP",61.4,56.6,67,12.239000000000001,827,"Brown",null,0.01]
[185,"2018-04-26",{"$f":"INDEX(Products!$C$4:$C$19,MATCH(Iviltra!F185,Products!$B$4:$B$19,0))","v":"ZL60367"},"LTIV01-3-4","ArrMaz El Jadida"," ATH 635 OCP",60.9,57.1,68,11.94,824,"Brown",null,0.01]
[186,"2018-04-27",{"$f":"INDEX(Products!$C$4:$C$19,MATCH(Iviltra!F186,Products!$B$4:$B$19,0))","v":"ZL60367"},"LTIV01-3-5","ArrMaz El Jadida"," ATH 635 OCP",60.9,55.8,71,12.404,810,"Brown",null,0.01]
[187,"2018-04-30",{"$f":"INDEX(Products!$C$4:$C$19,MATCH(Iviltra!F187,Products!$B$4:$B$19,0))","v":"ZL60224"},"1389-0","SCAZOMURES - SA"," ATH 635 BG",59.4,53.1,105,12.446,814,"Brown",null,0.01]
[188,"2018-04-30",{"$f":"INDEX(Products!$C$4:$C$19,MATCH(Iviltra!F188,Products!$B$4:$B$19,0))","v":"ZL60224"},"1390-0","SCAZOMURES - SA"," ATH 635 BG",59.4,54,106,12.377000000000001,820,"Brown",null,0.01]
[189,"2018-04-30",{"$f":"INDEX(Products!$C$4:$C$19,MATCH(Iviltra!F189,Products!$B$4:$B$19,0))","v":"ZL60367"},"LTIV01-4-1","ArrMaz El Jadida"," ATH 635 OCP",60.5,56,64,11.68,817,"Brown",null,0.01]
[190,"2018-05-02",{"$f":"INDEX(Products!$C$4:$C$19,MATCH(Iviltra!F190,Products!$B$4:$B$19,0))","v":"ZL60367"},"LTV01-4-2","ArrMaz El Jadida"," ATH 635 OCP",62,58,66,12.231999999999999,832,"Brown",null,0.01]
[191,"2018-05-02",{"$f":"INDEX(Products!$C$4:$C$19,MATCH(Iviltra!F191,Products!$B$4:$B$19,0))","v":"ZL62840"},1387,"LOVOCHEMIE"," ATH 741",65.5,63,45,14.298,814,"Brown",null,0.01]
[192,"2018-05-04",{"$f":"INDEX(Products!$C$4:$C$19,MATCH(Iviltra!F192,Products!$B$4:$B$19,0))","v":" ZL62839"},1388,"AGROPOLYCHIM"," ATH 837 BG",57.1,52.6,130,7.4279999999999999,804,"Brown",2.8,0.01]
[193,"2018-05-07",{"$f":"INDEX(Products!$C$4:$C$19,MATCH(Iviltra!F193,Products!$B$4:$B$19,0))","v":"ZL60224"},"1391-0","SCAZOMURES - SA"," ATH 635 BG",59.3,53,149,11.276,823,"Brown",3.1,0.01]
[194,"2018-05-07",{"$f":"INDEX(Products!$C$4:$C$19,MATCH(Iviltra!F194,Products!$B$4:$B$19,0))","v":"ZL60367"},"LTV01-4-5","ArrMaz El Jadida"," ATH 635 OCP",63.3,57.2,74,13.852,833,"Brown",3,0.01]
[195,"2018-05-08",{"$f":"INDEX(Products!$C$4:$C$19,MATCH(Iviltra!F195,Products!$B$4:$B$19,0))","v":"ZL60367"},"LTV01-4-6","ArrMaz El Jadida"," ATH 635 OCP",64.5,57,71,14.606999999999999,829,"Brown",3.5,0.01]
[196,"2018-05-09",{"$f":"INDEX(Products!$C$4:$C$19,MATCH(Iviltra!F196,Products!$B$4:$B$19,0))","v":"ZL60367"},"LTV01-4-7","ArrMaz El Jadida"," ATH 635 OCP",63.1,57.5,65,13.266999999999999,830,"Brown",3.6,0.01]
[197,"2018-05-10",{"$f":"INDEX(Products!$C$4:$C$19,MATCH(Iviltra!F197,Products!$B$4:$B$19,0))","v":"ZL60367"},"LTC01-4-3","ArrMaz El Jadida"," ATH 635 OCP",63,58.1,100,13.5,820,"Brown",3.1,0.01]
[198,"2018-05-10",{"$f":"INDEX(Products!$C$4:$C$19,MATCH(Iviltra!F198,Products!$B$4:$B$19,0))","v":"ZL62809"},1397,"SECO FERTILIZANTS"," ATH 709",62.8,56.5,90,13,833,"Brown",3.5,0.01]
[199,"2018-05-11",{"$f":"INDEX(Products!$C$4:$C$19,MATCH(Iviltra!F199,Products!$B$4:$B$19,0))","v":"ZL60224"},1392,"SC AZOMURES SA"," ATH 635 BG",59.6,54,149,10,831,"Brown",3.1,0.01]
["200","2018-05-11",{"$f":"INDEX(Products!$C$4:$C$19,MATCH(Iviltra!F200,Products!$B$4:$B$19,0))","v":"ZL60367"},"LTV01-4-4","ArrMaz El Jadida"," ATH 635 OCP","62,1","56,1","95","11,5","826","Brown","43193","2000-01-01","",""]
[201,"2018-05-14",{"$f":"INDEX(Products!$C$4:$C$19,MATCH(Iviltra!F201,Products!$B$4:$B$19,0))","v":"ZL60224"},1393,"SC AZOMURES SA"," ATH 635 BG",59.1,55,147,9,826,"Brown",4,0.01]
[202,"2018-05-18",{"$f":"INDEX(Products!$C$4:$C$19,MATCH(Iviltra!F202,Products!$B$4:$B$19,0))","v":"ZL60224"},1394,"SC AZOMURES SA"," ATH 635 BG",57.8,54,147,10,823,"Brown",3.9,0.01,null,"For this production batch we had to modify pertolatum/oil ratio just a bit to achieve the necessary level of penetration value."]
[203,"2018-05-21",{"$f":"INDEX(Products!$C$4:$C$19,MATCH(Iviltra!F203,Products!$B$4:$B$19,0))","v":"ZL62809"},1404,"BASF SE"," ATH 709",61.3,58.1,86,11,815,"Brown",4.5,0.01]
[204,"2018-05-24",{"$f":"INDEX(Products!$C$4:$C$19,MATCH(Iviltra!F204,Products!$B$4:$B$19,0))","v":" ZL62839"},1406,"AGROPOLYCHIM"," ATH 837 BG",57.8,54.3,115,7,796,"Brown",4,0.01]
[205,"2018-05-28",{"$f":"INDEX(Products!$C$4:$C$19,MATCH(Iviltra!F205,Products!$B$4:$B$19,0))","v":"ZL62809"},1408,"COMAO EXPERT GMBH HALLE 10"," ATH 709",62.1,59,84,10,816,"Brown",4.2,0.01]
["206","2018-05-31",{"$f":"INDEX(Products!$C$4:$C$19,MATCH(Iviltra!F206,Products!$B$4:$B$19,0))","v":"ZL60224"},"1395","SC AZOMURES SA"," ATH 635 BG","57,2","55,4","148","11","809","Brown","2,9","0,01","",""]
["207","2018-06-01",{"$f":"INDEX(Products!$C$4:$C$19,MATCH(Iviltra!F207,Products!$B$4:$B$19,0))","v":"ZL60224"},"1396","SC AZOMURES SA"," ATH 635 BG","57,2","54,5","146","10,06","820","Brown","0","6","",""]
[208,null,{"$f":"INDEX(Products!$C$4:$C$19,MATCH(Iviltra!F208,Products!$B$4:$B$19,0))","v":{"$error":"#N/A"}}]
["209","",{"$f":"INDEX(Products!$C$4:$C$19,MATCH(Iviltra!F209,Products!$B$4:$B$19,0))","v":{"$error":"#N/A"}},"","","","","","","","","","","","",""]
["210","",{"$f":"INDEX(Products!$C$4:$C$19,MATCH(Iviltra!F210,Products!$B$4:$B$19,0))","v":{"$error":"#N/A"}},"","","","","","","","","","","","",""]
["211","",{"$f":"INDEX(Products!$C$4:$C$19,MATCH(Iviltra!F211,Products!$B$4:$B$19,0))","v":{"$error":"#N/A"}},"","","","","","","","","","","","",""]
[212,null,{"$f":"INDEX(Products!$C$4:$C$19,MATCH(Iviltra!F212,Products!$B$4:$B$19,0))","v":{"$error":"#N/A"}}]
[213,null,{"$f":"INDEX(Products!$C$4:$C$19,MATCH(Iviltra!F213,Products!$B$4:$B$19,0))","v":{"$error":"#N/A"}}]
[214,null,{"$f":"INDEX(Products!$C$4:$C$19,MATCH(Iviltra!F214,Products!$B$4:$B$19,0))","v":{"$error":"#N/A"}}]
[215,null,{"$f":"INDEX(Products!$C$4:$C$19,MATCH(Iviltra!F215,Products!$B$4:$B$19,0))","v":{"$error":"#N/A"}}]
[216,null,{"$f":"INDEX(Products!$C$4:$C$19,MATCH(Iviltra!F216,Products!$B$4:$B$19,0))","v":{"$error":"#N/A"}}]
[217,null,{"$f":"INDEX(Products!$C$4:$C$19,MATCH(Iviltra!F217,Products!$B$4:$B$19,0))","v":{"$error":"#N/A"}}]
[218,null,{"$f":"INDEX(Products!$C$4:$C$19,MATCH(Iviltra!F218,Products!$B$4:$B$19,0))","v":{"$error":"#N/A"}}]
["219","",{"$f":"INDEX(Products!$C$4:$C$19,MATCH(Iviltra!F219,Products!$B$4:$B$19,0))","v":{"$error":"#N/A"}},"","","","","","","","","","","","",""]
[220,null,{"$f":"INDEX(Products!$C$4:$C$19,MATCH(Iviltra!F220,Products!$B$4:$B$19,0))","v":{"$error":"#N/A"}}]
[221,null,{"$f":"INDEX(Products!$C$4:$C$19,MATCH(Iviltra!F221,Products!$B$4:$B$19,0))","v":{"$error":"#N/A"}}]
[222,null,{"$f":"INDEX(Products!$C$4:$C$19,MATCH(Iviltra!F222,Products!$B$4:$B$19,0))","v":{"$error":"#N/A"}}]
[223,null,{"$f":"INDEX(Products!$C$4:$C$19,MATCH(Iviltra!F223,Products!$B$4:$B$19,0))","v":{"$error":"#N/A"}}]
[224,null,{"$f":"INDEX(Products!$C$4:$C$19,MATCH(Iviltra!F224,Products!$B$4:$B$19,0))","v":{"$error":"#N/A"}}]
[225,null,{"$f":"INDEX(Products!$C$4:$C$19,MATCH(Iviltra!F225,Products!$B$4:$B$19,0))","v":{"$error":"#N/A"}}]
[226,null,{"$f":"INDEX(Products!$C$4:$C$19,MATCH(Iviltra!F226,Products!$B$4:$B$19,0))","v":{"$error":"#N/A"}}]
[227,null,{"$f":"INDEX(Products!$C$4:$C$19,MATCH(Iviltra!F227,Products!$B$4:$B$19,0))","v":{"$error":"#N/A"}}]
[228,null,{"$f":"INDEX(Products!$C$4:$C$19,MATCH(Iviltra!F228,Products!$B$4:$B$19,0))","v":{"$error":"#N/A"}}]
[229,null,{"$f":"INDEX(Products!$C$4:$C$19,MATCH(Iviltra!F229,Products!$B$4:$B$19,0))","v":{"$error":"#N/A"}}]
[230,null,{"$f":"INDEX(Products!$C$4:$C$19,MATCH(Iviltra!F230,Products!$B$4:$B$19,0))","v":{"$error":"#N/A"}}]
[231,null,{"$f":"INDEX(Products!$C$4:$C$19,MATCH(Iviltra!F231,Products!$B$4:$B$19,0))","v":{"$error":"#N/A"}}]
[232,null,{"$f":"INDEX(Products!$C$4:$C$19,MATCH(Iviltra!F232,Products!$B$4:$B$19,0))","v":{"$error":"#N/A"}}]
[233,null,{"$f":"INDEX(Products!$C$4:$C$19,MATCH(Iviltra!F233,Products!$B$4:$B$19,0))","v":{"$error":"#N/A"}}]
[234,null,{"$f":"INDEX(Products!$C$4:$C$19,MATCH(Iviltra!F234,Products!$B$4:$B$19,0))","v":{"$error":"#N/A"}}]
[235,null,{"$f":"INDEX(Products!$C$4:$C$19,MATCH(Iviltra!F235,Products!$B$4:$B$19,0))","v":{"$error":"#N/A"}}]
[236,null,{"$f":"INDEX(Products!$C$4:$C$19,MATCH(Iviltra!F236,Products!$B$4:$B$19,0))","v":{"$error":"#N/A"}}]
[237,null,{"$f":"INDEX(Products!$C$4:$C$19,MATCH(Iviltra!F237,Products!$B$4:$B$19,0))","v":{"$error":"#N/A"}}]
[238,null,{"$f":"INDEX(Products!$C$4:$C$19,MATCH(Iviltra!F238,Products!$B$4:$B$19,0))","v":{"$error":"#N/A"}}]
[239,null,{"$f":"INDEX(Products!$C$4:$C$19,MATCH(Iviltra!F239,Products!$B$4:$B$19,0))","v":{"$error":"#N/A"}}]
[240,null,{"$f":"INDEX(Products!$C$4:$C$19,MATCH(Iviltra!F240,Products!$B$4:$B$19,0))","v":{"$error":"#N/A"}}]
[241,null,{"$f":"INDEX(Products!$C$4:$C$19,MATCH(Iviltra!F241,Products!$B$4:$B$19,0))","v":{"$error":"#N/A"}}]
[242,null,{"$f":"INDEX(Products!$C$4:$C$19,MATCH(Iviltra!F242,Products!$B$4:$B$19,0))","v":{"$error":"#N/A"}}]
[243,null,{"$f":"INDEX(Products!$C$4:$C$19,MATCH(Iviltra!F243,Products!$B$4:$B$19,0))","v":{"$error":"#N/A"}}]
[244,null,{"$f":"INDEX(Products!$C$4:$C$19,MATCH(Iviltra!F244,Products!$B$4:$B$19,0))","v":{"$error":"#N/A"}}]
[245,null,{"$f":"INDEX(Products!$C$4:$C$19,MATCH(Iviltra!F245,Products!$B$4:$B$19,0))","v":{"$error":"#N/A"}}]
[246,null,{"$f":"INDEX(Products!$C$4:$C$19,MATCH(Iviltra!F246,Products!$B$4:$B$19,0))","v":{"$error":"#N/A"}}]
[247,null,{"$f":"INDEX(Products!$C$4:$C$19,MATCH(Iviltra!F247,Products!$B$4:$B$19,0))","v":{"$error":"#N/A"}}]
[248,null,{"$f":"INDEX(Products!$C$4:$C$19,MATCH(Iviltra!F248,Products!$B$4:$B$19,0))","v":{"$error":"#N/A"}}]
[249,null,{"$f":"INDEX(Products!$C$4:$C$19,MATCH(Iviltra!F249,Products!$B$4:$B$19,0))","v":{"$error":"#N/A"}}]
[250,null,{"$f":"INDEX(Products!$C$4:$C$19,MATCH(Iviltra!F250,Products!$B$4:$B$19,0))","v":{"$error":"#N/A"}}]
[251,null,{"$f":"INDEX(Products!$C$4:$C$19,MATCH(Iviltra!F251,Products!$B$4:$B$19,0))","v":{"$error":"#N/A"}}]
[252,null,{"$f":"INDEX(Products!$C$4:$C$19,MATCH(Iviltra!F252,Products!$B$4:$B$19,0))","v":{"$error":"#N/A"}}]
[253,null,{"$f":"INDEX(Products!$C$4:$C$19,MATCH(Iviltra!F253,Products!$B$4:$B$19,0))","v":{"$error":"#N/A"}}]
[254,null,{"$f":"INDEX(Products!$C$4:$C$19,MATCH(Iviltra!F254,Products!$B$4:$B$19,0))","v":{"$error":"#N/A"}}]
[255,null,{"$f":"INDEX(Products!$C$4:$C$19,MATCH(Iviltra!F255,Products!$B$4:$B$19,0))","v":{"$error":"#N/A"}}]
[256,null,{"$f":"INDEX(Products!$C$4:$C$19,MATCH(Iviltra!F256,Products!$B$4:$B$19,0))","v":{"$error":"#N/A"}}]
[257,null,{"$f":"INDEX(Products!$C$4:$C$19,MATCH(Iviltra!F257,Products!$B$4:$B$19,0))","v":{"$error":"#N/A"}}]
[258,null,{"$f":"INDEX(Products!$C$4:$C$19,MATCH(Iviltra!F258,Products!$B$4:$B$19,0))","v":{"$error":"#N/A"}}]
[259,null,{"$f":"INDEX(Products!$C$4:$C$19,MATCH(Iviltra!F259,Products!$B$4:$B$19,0))","v":{"$error":"#N/A"}}]
[260,null,{"$f":"INDEX(Products!$C$4:$C$19,MATCH(Iviltra!F260,Products!$B$4:$B$19,0))","v":{"$error":"#N/A"}}]
[261,null,{"$f":"INDEX(Products!$C$4:$C$19,MATCH(Iviltra!F261,Products!$B$4:$B$19,0))","v":{"$error":"#N/A"}}]
[262,null,{"$f":"INDEX(Products!$C$4:$C$19,MATCH(Iviltra!F262,Products!$B$4:$B$19,0))","v":{"$error":"#N/A"}}]
[263,null,{"$f":"INDEX(Products!$C$4:$C$19,MATCH(Iviltra!F263,Products!$B$4:$B$19,0))","v":{"$error":"#N/A"}}]
[264,null,{"$f":"INDEX(Products!$C$4:$C$19,MATCH(Iviltra!F264,Products!$B$4:$B$19,0))","v":{"$error":"#N/A"}}]
[265,null,{"$f":"INDEX(Products!$C$4:$C$19,MATCH(Iviltra!F265,Products!$B$4:$B$19,0))","v":{"$error":"#N/A"}}]
[266,null,{"$f":"INDEX(Products!$C$4:$C$19,MATCH(Iviltra!F266,Products!$B$4:$B$19,0))","v":{"$error":"#N/A"}}]
[267,null,{"$f":"INDEX(Products!$C$4:$C$19,MATCH(Iviltra!F267,Products!$B$4:$B$19,0))","v":{"$error":"#N/A"}}]
[268,null,{"$f":"INDEX(Products!$C$4:$C$19,MATCH(Iviltra!F268,Products!$B$4:$B$19,0))","v":{"$error":"#N/A"}}]
[269,null,{"$f":"INDEX(Products!$C$4:$C$19,MATCH(Iviltra!F269,Products!$B$4:$B$19,0))","v":{"$error":"#N/A"}}]
[270,null,{"$f":"INDEX(Products!$C$4:$C$19,MATCH(Iviltra!F270,Products!$B$4:$B$19,0))","v":{"$error":"#N/A"}}]
[271,null,{"$f":"INDEX(Products!$C$4:$C$19,MATCH(Iviltra!F271,Products!$B$4:$B$19,0))","v":{"$error":"#N/A"}}]
[272,null,{"$f":"INDEX(Products!$C$4:$C$19,MATCH(Iviltra!F272,Products!$B$4:$B$19,0))","v":{"$error":"#N/A"}}]
[273,null,{"$f":"INDEX(Products!$C$4:$C$19,MATCH(Iviltra!F273,Products!$B$4:$B$19,0))","v":{"$error":"#N/A"}}]
[274,null,{"$f":"INDEX(Products!$C$4:$C$19,MATCH(Iviltra!F274,Products!$B$4:$B$19,0))","v":{"$error":"#N/A"}}]
[275,null,{"$f":"INDEX(Products!$C$4:$C$19,MATCH(Iviltra!F275,Products!$B$4:$B$19,0))","v":{"$error":"#N/A"}}]
[276,null,{"$f":"INDEX(Products!$C$4:$C$19,MATCH(Iviltra!F276,Products!$B$4:$B$19,0))","v":{"$error":"#N/A"}}]
[277,null,{"$f":"INDEX(Products!$C$4:$C$19,MATCH(Iviltra!F277,Products!$B$4:$B$19,0))","v":{"$error":"#N/A"}}]
[278,null,{"$f":"INDEX(Products!$C$4:$C$19,MATCH(Iviltra!F278,Products!$B$4:$B$19,0))","v":{"$error":"#N/A"}}]
[279,null,{"$f":"INDEX(Products!$C$4:$C$19,MATCH(Iviltra!F279,Products!$B$4:$B$19,0))","v":{"$error":"#N/A"}}]
[280,null,{"$f":"INDEX(Products!$C$4:$C$19,MATCH(Iviltra!F280,Products!$B$4:$B$19,0))","v":{"$error":"#N/A"}}]
[281,null,{"$f":"INDEX(Products!$C$4:$C$19,MATCH(Iviltra!F281,Products!$B$4:$B$19,0))","v":{"$error":"#N/A"}}]
[282,null,{"$f":"INDEX(Products!$C$4:$C$19,MATCH(Iviltra!F282,Products!$B$4:$B$19,0))","v":{"$error":"#N/A"}}]
[283,null,{"$f":"INDEX(Products!$C$4:$C$19,MATCH(Iviltra!F283,Products!$B$4:$B$19,0))","v":{"$error":"#N/A"}}]
[284,null,{"$f":"INDEX(Products!$C$4:$C$19,MATCH(Iviltra!F284,Products!$B$4:$B$19,0))","v":{"$error":"#N/A"}}]
[285,null,{"$f":"INDEX(Products!$C$4:$C$19,MATCH(Iviltra!F285,Products!$B$4:$B$19,0))","v":{"$error":"#N/A"}}]
[286,null,{"$f":"INDEX(Products!$C$4:$C$19,MATCH(Iviltra!F286,Products!$B$4:$B$19,0))","v":{"$error":"#N/A"}}]
[287,null,{"$f":"INDEX(Products!$C$4:$C$19,MATCH(Iviltra!F287,Products!$B$4:$B$19,0))","v":{"$error":"#N/A"}}]
[288,null,{"$f":"INDEX(Products!$C$4:$C$19,MATCH(Iviltra!F288,Products!$B$4:$B$19,0))","v":{"$error":"#N/A"}}]
[289,null,{"$f":"INDEX(Products!$C$4:$C$19,MATCH(Iviltra!F289,Products!$B$4:$B$19,0))","v":{"$error":"#N/A"}}]
[290,null,{"$f":"INDEX(Products!$C$4:$C$19,MATCH(Iviltra!F290,Products!$B$4:$B$19,0))","v":{"$error":"#N/A"}}]
[291,null,{"$f":"INDEX(Products!$C$4:$C$19,MATCH(Iviltra!F291,Products!$B$4:$B$19,0))","v":{"$error":"#N/A"}}]
[292,null,{"$f":"INDEX(Products!$C$4:$C$19,MATCH(Iviltra!F292,Products!$B$4:$B$19,0))","v":{"$error":"#N/A"}}]
[293,null,{"$f":"INDEX(Products!$C$4:$C$19,MATCH(Iviltra!F293,Products!$B$4:$B$19,0))","v":{"$error":"#N/A"}}]
[294,null,{"$f":"INDEX(Products!$C$4:$C$19,MATCH(Iviltra!F294,Products!$B$4:$B$19,0))","v":{"$error":"#N/A"}}]
[295,null,{"$f":"INDEX(Products!$C$4:$C$19,MATCH(Iviltra!F295,Products!$B$4:$B$19,0))","v":{"$error":"#N/A"}}]
[296,null,{"$f":"INDEX(Products!$C$4:$C$19,MATCH(Iviltra!F296,Products!$B$4:$B$19,0))","v":{"$error":"#N/A"}}]
[297,null,{"$f":"INDEX(Products!$C$4:$C$19,MATCH(Iviltra!F297,Products!$B$4:$B$19,0))","v":{"$error":"#N/A"}}]
[298,null,{"$f":"INDEX(Products!$C$4:$C$19,MATCH(Iviltra!F298,Products!$B$4:$B$19,0))","v":{"$error":"#N/A"}}]
[299,null,{"$f":"INDEX(Products!$C$4:$C$19,MATCH(Iviltra!F299,Products!$B$4:$B$19,0))","v":{"$error":"#N/A"}}]
[300,null,{"$f":"INDEX(Products!$C$4:$C$19,MATCH(Iviltra!F300,Products!$B$4:$B$19,0))","v":{"$error":"#N/A"}}]
[301,null,{"$f":"INDEX(Products!$C$4:$C$19,MATCH(Iviltra!F301,Products!$B$4:$B$19,0))","v":{"$error":"#N/A"}}]
[302,null,{"$f":"INDEX(Products!$C$4:$C$19,MATCH(Iviltra!F302,Products!$B$4:$B$19,0))","v":{"$error":"#N/A"}}]
[303,null,{"$f":"INDEX(Products!$C$4:$C$19,MATCH(Iviltra!F303,Products!$B$4:$B$19,0))","v":{"$error":"#N/A"}}]
[304,null,{"$f":"INDEX(Products!$C$4:$C$19,MATCH(Iviltra!F304,Products!$B$4:$B$19,0))","v":{"$error":"#N/A"}}]
[305,null,{"$f":"INDEX(Products!$C$4:$C$19,MATCH(Iviltra!F305,Products!$B$4:$B$19,0))","v":{"$error":"#N/A"}}]
[306,null,{"$f":"INDEX(Products!$C$4:$C$19,MATCH(Iviltra!F306,Products!$B$4:$B$19,0))","v":{"$error":"#N/A"}}]
[307,null,{"$f":"INDEX(Products!$C$4:$C$19,MATCH(Iviltra!F307,Products!$B$4:$B$19,0))","v":{"$error":"#N/A"}}]
[308,null,{"$f":"INDEX(Products!$C$4:$C$19,MATCH(Iviltra!F308,Products!$B$4:$B$19,0))","v":{"$error":"#N/A"}}]
[309,null,{"$f":"INDEX(Products!$C$4:$C$19,MATCH(Iviltra!F309,Products!$B$4:$B$19,0))","v":{"$error":"#N/A"}}]
[310,null,{"$f":"INDEX(Products!$C$4:$C$19,MATCH(Iviltra!F310,Products!$B$4:$B$19,0))","v":{"$error":"#N/A"}}]
[null,null,{"$f":"INDEX(Products!$C$4:$C$19,MATCH(Iviltra!F311,Products!$B$4:$B$19,0))","v":{"$error":"#N/A"}}]

{"sheet":"Iviltra MP","index":2,"n_rows":2,"n_cols":16,"rows_kept":2,"cut":false,"hidden":false,"merged":[]}
["Lot","Date","ZL code","Order Dirship","Customer","Product","Drop-Melt Point \nASTM-127-08   ","Congealing Point\n ASTM-938-06   ","Penetration ASTM-D937 \n(at 35°C w/cone)  ","Viscosity ASTM-D445 (mPa.s at 85°C) 5-15 ","Density ASTM-1298 \n(Kg/M3 at 85°C) 770-830\n","Appearence = yellow to light brown\n","Color ASTM-D1500   1,5 to 5,0\n","Moisture ASTM-D95 (%)  <0,4\n","Active Matter %\n","In Spec + Comments\n"]
["","","ZL62814","","","","65","","","","","","","","",""]

{"sheet":"Orlen","index":3,"n_rows":69,"n_cols":16,"rows_kept":69,"cut":false,"hidden":false,"merged":[]}
["Lot","Date","ZL code","Order Dirship","Customer","Product","Drop-Melt Point \nASTM-127-08   ","Congealing Point\n ASTM-938-06   ","Penetration ASTM-D937 \n(at 35°C w/cone)  ","Viscosity ASTM-D445 (mPa.s at 85°C) 5-15 ","Density ASTM-1298 \n(Kg/M3 at 85°C) 770-830\n","Appearence = yellow to light brown\n","Color ASTM-D1500   1,5 to 5,0\n","Moisture ASTM-D95 (%)  <0,4\n","Active Matter %\n","In Spec + Comments\n"]
[107,"2017-07-04","ZL60430","ZL60430",null,"ATH 635"]
[108,"??","ZL60430",null,null,"ATH 635"]
[109,"2017-08-11","ZL60755",null,null,"ATH 741"]
[110,"2017-07-15","ZL60430",null,null,"ATH 626 MEU"]
[111,"2017-07-16","ZL60250",null,null,"ATH F 100 EU"]
[112,"2017-07-17","ZL60430",null,null,"ATH 635"]
[113,"??","ZL60430",null,null,"ATH 635"]
[114,"2017-07-29","ZL60250",null,null,"ATH F 100 EU"]
[114,"??","ZL60250",null,null,"ATH F 100 EU"]
[115,"2017-08-07","ZL60430",null,null,"ATH 626 MEU"]
[116,"??","ZL60250",null,null,"ATH F 100 EU"]
[117,"2017-08-11","ZL60250",null,null,"ATH F 100 EU"]
[118,"2017-08-11","ZL60400",null,null,"ATH 709"]
[119]
[120,"2017-08-25","ZL60430",null,null,"ATH 635"]
[121,"2017-08-29","ZL60430",null,null,"ATH 626 MEU"]
[122]
[123,"??","ZL60250",null,null,"ATH F 100 EU"]
[124,"??","ZL60430",null,null,"ATH 635"]
[125]
[126,"2017-09-16","ZL60430",null,null,"ATH 635"]
[127]
[128,"2017-09-28","ZL60430",null,null,"ATH 635"]
[129,"2017-10-06","ZL60430",null,null,"ATH 626 MEU"]
[130]
[131,"??","ZL60250",null,null,"ATH F 100 EU"]
[132,"2017-10-18","ZL60250",null,null,"ATH F 100 EU"]
[133,"2017-10-23","ZL60250",null,null,"ATH F 100 EU"]
[134,"2017-11-04","ZL60430",null,null,"ATH 635"]
[135,"2017-11-03","ZL60222",null,null,"ATH 635 BG"]
[136,"??","ZL60250",null,null,"ATH F 100 EU"]
[137,"2017-11-09","ZL60430",null,null,"ATH 635"]
[138]
[139,"2017-11-17","ZL60250",null,null,"ATH F 100 EU"]
[140,"2017-11-17","ZL60430",null,null,"ATH 635"]
[141,"2017-11-30","ZL60250",null,null,"ATH F 100 EU"]
[142,"2017-12-03","ZL60430",null,null,"ATH 635"]
[143,"2017-12-08","ZL60250",null,null,"ATH F 100 EU"]
[144,"2017-12-08","ZL60430",null,null,"ATH 635"]
[145,"2017-12-16","ZL60430",null,null,"ATH 635"]
[146,"2017-12-16","ZL60430",null,null,"ATH 626 MEU"]
[147,"??","ZL60250",null,null,"ATH F 100 EU"]
[148,"??",null,null,null,"ATH F 100 EU"]
[1,"2018-01-05",null,null,null,"ATH F 100 EU"]
[2,"2018-01-06","ZL60430",null,null,"ATH 635"]
[3,"2018-01-13",null,null,null,"ATH 635"]
[4,"2018-01-27",null,null,null,"ATH 635"]
[5]
[6,"2018-02-03",null,null,null,"ATH F 100 EU"]
[7,"2018-02-03",null,null,null,"ATH 635 BG"]
[8,"2018-02-11",null,null,null,"ATH F 100 EU"]
[9,"2018-02-11",null,null,null,"ATH 635 BG"]
[10,"2018-02-15",null,null,null,"ATH F 100 EU"]
[11,"2018-02-18",null,null,null,"ATH 635"]
[12,"2018-02-24",null,null,null,"ATH F 100 EU"]
[13,"2018-02-27",null,null,null,"ATH 626 MEU"]
[14,"2018-02-28",null,null,null,"ATH 635 BG"]
[15,"2018-03-14",null,null,null,"ATH F 100 EU"]
[16,"2018-03-14",null,null,null,"ATH 635 BG"]
[17,"2018-03-17",null,null,null,"ATH F 100 EU"]
[18,"2018-03-19",null,null,null,"ATH 626 MEU"]
[19,"2018-03-24",null,null,null,"ATH 635 BG"]
[20,"2018-04-06",null,null,null,"ATH F 100 EU"]
[21]
[22,"2018-04-14",null,null,null,"ATH F 100 EU"]
[23,"2018-04-17",null,null,null,"ATH 626 MEU"]
[24,"2018-04-19",null,null,null,"ATH 635 BG"]
["","","","","","","","","","","","","","","",""]

{"sheet":"Orlen MP","index":4,"n_rows":2,"n_cols":16,"rows_kept":2,"cut":false,"hidden":false,"merged":[]}
["Lot","Date","ZL code","Order Dirship","Customer","Product","Drop-Melt Point \nASTM-127-08   ","Congealing Point\n ASTM-938-06   ","Penetration ASTM-D937 \n(at 35°C w/cone)  ","Viscosity ASTM-D445 (mPa.s at 85°C) 5-15 ","Density ASTM-1298 \n(Kg/M3 at 85°C) 770-830\n","Appearence = yellow to light brown\n","Color ASTM-D1500   1,5 to 5,0\n","Moisture ASTM-D95 (%)  <0,4\n","Active Matter %\n","In Spec + Comments\n"]
[null,null,"Zl62814",null,null,null,50]

{"sheet":"SER","index":5,"n_rows":33,"n_cols":17,"rows_kept":33,"cut":false,"hidden":false,"merged":[]}
["Lot","Date","ZL code","Order Dirship","Customer","Product","Drop-Melt Point \nASTM-127-08   ","Congealing Point\n ASTM-938-06   ","Penetration ASTM-D937 \n(at 35°C w/cone)  ","Viscosity ASTM-D445 (mPa.s at 85°C) 5-15 ","Density ASTM-1298 \n(Kg/M3 at 85°C) 770-830\n","Appearence = yellow to light brown\n","Color ASTM-D1500   1,5 to 5,0\n","Moisture ASTM-D95 (%)  <0,4\n","Active Matter %\n","In Spec + Comments\n","In Spec + Comments\n"]
[75619,"2017-08-29","ZL60330",null,null,null,"ATH 626"]
[75796,"2017-09-11","ZL60330",null,null,null,"ATH 626 MEU"]
[75907,"2017-09-15","ZL60225",null,null,null,"ATH 636 H"]
[76002,"2017-09-20","ZL60225",null,null,null,"ATH 636 H"]
[76774,"2017-11-13","ZL60225",null,null,null,"ATH 636 H"]
[77090,"2017-12-01","ZL60365",null,null,null,"ATH 635 OCP"]
[77150,"???","ZL60225",null,null,null,"ATH 636 H"]
[76895,"2017-12-07","ZL60365",null,null,null,"ATH 635 OCP"]
[76899,"2017-12-12","ZL60365",null,null,null,"ATH 635 OCP"]
[77233,"2017-12-12","ZL60330",null,null,null,"ATH 626 MEU"]
[77278,"2017-12-15","ZL60330",null,null,null,"ATH 626 MEU"]
[77358,"2017-12-22","ZL60225",null,null,null,"ATH 636 H"]
[77434,"2018-01-04","ZL60330",null,null,null,"ATH 626"]
[77714,"2018-01-23","ZL60225",null,null,null,"ATH 636 H"]
[78050,"2018-02-16","ZL60330",null,null,null,"ATH 626 MEU"]
[78197,"2018-02-23","ZL60330",null,null,null,"ATH 626 MEU"]
[78344,"2018-03-03","ZL60225",null,null,null,"ATH 636 H"]
[78573,"2018-03-27","ZL60365",null,null,null,"ATH 635 OCP"]
[78575,"2018-03-28","ZL60365",null,null,null,"ATH 635 OCP"]
[78577,"2018-03-29","ZL60365",null,null,null,"ATH 635 OCP"]
[78636,"2018-03-29","ZL60225",null,null,null,"ATH 636 H"]
[78579,"2018-03-31","ZL60365",null,null,null,"ATH 635 OCP"]
[78581,"2018-04-04","ZL60365",null,null,null,"ATH 635 OCP"]
[78950,"2018-05-04","ZL60330","GAL004","1386-0",null,"ATH 626M EU",null,null,null,15,null,"Yellow-Light brown"]
[78962,"2018-09-05","ZL60365",null,null,null,"ATH 635 OCP",null,null,60,7.8,0.81,"Light Brown"]
[78964,"2018-05-09","ZL60335",null,null,null,"ATH 635 OCP",null,null,67,8.3000000000000007,0.8,"Light Brown"]
[79122,"2018-05-10","ZL60365",null,null,null,"ATH 635 OCP",null,null,80,8.3000000000000007,0.8,"Yellow-Light brown"]
[79123,"2018-05-11",null,null,"ITST01-46-5",null,"ATH 635 OCP",64.2,59,65,8.6999999999999993,0.79,"Light Brown"]
[78968,"2018-05-14",null,null,null,null,"ATH 635 OCP",64.599999999999994,58,63,9,0.81,"Light Brown"]
[79125,"2018-05-14",null,null,"VE117806",null,"ATH 635 OCP",64.3,59,77,9.9,0.81,"Light Brown"]
[78970,"2018-05-15",null,null,"VE117522",null,"ATH 635 OCP",62.6,58,88,8.8000000000000007,0.8,"Light Brown"]
[79319,"2018-05-15","","GAL023","1401-0","","ATH 636 H",58.8,60,"","","","","","","",""]

{"sheet":"SER MP","index":6,"n_rows":2,"n_cols":17,"rows_kept":2,"cut":false,"hidden":false,"merged":[]}
["Lot","Date","ZL code","Order Dirship","Customer","Product","Drop-Melt Point \nASTM-127-08   ","Congealing Point\n ASTM-938-06   ","Penetration ASTM-D937 \n(at 35°C w/cone)  ","Viscosity ASTM-D445 (mPa.s at 85°C) 5-15 ","Density ASTM-1298 \n(Kg/M3 at 85°C) 770-830\n","Appearence = yellow to light brown\n","Color ASTM-D1500   1,5 to 5,0\n","Moisture ASTM-D95 (%)  <0,4\n","Active Matter %\n","In Spec + Comments\n","In Spec + Comments\n"]
[null,null,"ZL62814",null,null,null,50]