{"text_format":"1","workbook":"xlsx","n_sheets":11,"sheets":["SALARIE 1","SALARIE 2","SALARIE 3","SALARIE 4","SALARIE 5","SALARIE 6","SALARIE 7","SALARIE 8","SALARIE 9","SALARIE 10","SYNTHESE EQUIPE"],"not_rendered":{"charts":11,"images":10,"macros":1,"external_links":0,"defined_names":67,"comments":0,"pivot_tables":0},"unopened":[],"bounds":{"document_bytes":16777216,"sheet_cells":100000,"rows_first":2000,"rows_last":500,"rows_between":2000,"halvings":0,"cell_chars":16384,"cell_head_chars":4096},"cells_cut":0,"cells_raw":0,"read":"whole","date_system":"1900"}

{"sheet":"SALARIE 1","index":0,"n_rows":117,"n_cols":10,"rows_kept":117,"cut":false,"hidden":false,"merged":[[11,0,11,1],[11,2,11,3],[11,4,11,5],[11,6,11,7],[12,0,12,1],[12,2,12,3],[12,4,12,5],[12,6,12,7],[4,2,4,7],[10,0,10,1],[10,2,10,3],[10,4,10,5],[9,6,9,7],[15,0,15,1],[15,2,15,3],[15,4,15,5],[15,6,15,7],[16,0,16,1],[16,2,16,3],[16,4,16,5],[16,6,16,7],[13,0,13,1],[13,2,13,3],[13,4,13,5],[13,6,13,7],[14,0,14,1],[14,2,14,3],[14,4,14,5],[14,6,14,7],[19,0,19,1],[19,2,19,3],[19,4,19,5],[19,6,19,7],[20,0,20,1],[20,2,20,3],[20,4,20,5],[20,6,20,7],[17,0,17,1],[17,2,17,3],[17,4,17,5],[17,6,17,7],[18,0,18,1],[18,2,18,3],[18,4,18,5],[18,6,18,7],[23,0,23,1],[23,2,23,3],[23,4,23,5],[23,6,23,7],[24,0,24,7],[21,0,21,1],[21,2,21,3],[21,4,21,5],[21,6,21,7],[22,0,22,1],[22,2,22,3],[22,4,22,5],[22,6,22,7],[26,0,26,1],[26,6,26,7],[27,0,27,1],[28,0,28,1],[29,0,29,1],[30,0,30,1],[27,6,27,7],[28,6,28,7],[29,6,29,7],[30,6,30,7],[31,0,31,1],[33,0,33,1],[34,0,34,1],[34,6,34,7],[35,0,35,1],[36,0,36,1],[31,6,31,7],[32,6,32,7],[33,6,33,7],[35,6,35,7],[36,6,36,7],[37,0,37,1],[39,0,39,1],[40,0,40,1],[40,6,40,7],[41,0,41,1],[50,0,50,1],[38,0,38,1],[43,0,43,1],[44,0,44,1],[43,6,43,7],[44,6,44,7],[45,6,45,7],[46,6,46,7],[47,6,47,7],[48,6,48,7],[37,6,37,7],[38,6,38,7],[39,6,39,7],[41,6,41,7],[42,6,42,7],[47,0,47,1],[48,0,48,1],[51,0,51,1],[51,6,51,7],[52,0,52,1],[53,0,53,1],[54,0,54,1],[55,0,55,1],[53,6,53,7],[54,6,54,7],[55,6,55,7],[52,6,52,7],[63,0,63,1],[65,0,65,1],[66,0,66,1],[66,6,66,7],[67,0,67,1],[68,0,68,1],[68,6,68,7],[56,0,56,1],[59,0,59,1],[59,6,59,7],[60,0,60,1],[61,0,61,1],[62,0,62,1],[56,6,56,7],[57,6,57,7],[58,6,58,7],[60,6,60,7],[57,0,57,1],[58,0,58,1],[64,0,64,1],[61,6,61,7],[62,6,62,7],[63,6,63,7],[64,6,64,7],[87,6,87,7],[69,0,69,1],[72,0,72,7],[74,0,74,1],[74,6,74,7],[75,0,75,1],[76,0,76,1],[69,6,69,7],[70,6,70,7],[71,6,71,7],[75,6,75,7],[70,0,70,1],[111,0,111,5],[110,0,110,9],[111,8,111,9],[0,0,0,9],[2,5,2,9],[3,2,3,4],[3,5,3,9],[7,0,7,9],[32,0,32,1],[102,0,102,1],[103,0,103,1],[104,0,104,1],[106,0,106,1],[107,0,107,1],[107,6,107,7],[105,0,105,1],[96,0,96,1],[97,0,97,1],[98,0,98,1],[99,0,99,1],[100,0,100,1],[101,0,101,1],[89,0,89,1],[90,0,90,1],[89,6,89,7],[90,6,90,7],[79,0,79,1],[86,0,86,1],[76,6,76,7],[77,6,77,7],[78,6,78,7],[79,6,79,7],[80,6,80,7],[82,6,82,7],[85,0,85,1],[87,0,87,1],[88,0,88,1],[88,6,88,7],[83,6,83,7],[84,6,84,7],[85,6,85,7],[86,6,86,7],[77,0,77,1],[78,0,78,1],[80,0,80,1],[81,0,81,1],[81,6,81,7],[82,0,82,1],[65,6,65,7],[67,6,67,7],[83,0,83,1],[100,6,100,7],[101,6,101,7],[102,6,102,7],[103,6,103,7],[104,6,104,7],[106,6,106,7],[105,6,105,7],[71,0,71,1],[95,6,95,7],[96,6,96,7],[97,6,97,7],[98,6,98,7],[99,6,99,7],[91,6,91,7],[92,6,92,7],[91,0,91,1],[92,0,92,1],[93,0,93,7],[94,0,94,1],[95,0,95,1],[84,0,84,1]]}
["OUVRIER ENTRETIEN MECANIQUE"]
[]
["Nom :","SALARIE 1","Dâte d'entrée :"]
["Prénom :",null,"Service :"]
["Poste occupé :"]
[]
[]
["NA = non acquis        ECA = en cours d'acquisition          A = acquis          M = maîtrisé"]
[]
[null,null,"NA","ECA","A","M","Commentaires"]
["FORMATION",null,{"$f":"COUNTIF(C12:D24,\"=X\")*0","v":0},null,{"$f":"COUNTIF(E12:F24,\"=X\")*1","v":9},null,{"$f":"COUNTA(A12:B24)*1","v":9},{"$f":"SUM(C11:F11)/G11*20","v":20}]
["Habilitation électrique",null,null,null,"X",null,null,null,{"$f":"IF(AND(C12=\"\",E12=\"\"),\"Saisir une valeur !\",\"\")","v":""},{"$f":"IF(COUNTA(C12:F12)>1,\"Une seule réponse SVP !\",\"\")","v":""}]
["Formation SST",null,null,null,"X",null,null,null,{"$f":"IF(AND(C13=\"\",E13=\"\"),\"Saisir une valeur !\",\"\")","v":""},{"$f":"IF(COUNTA(C13:F13)>1,\"Une seule réponse SVP !\",\"\")","v":""}]
["Habilitation pinces LPA",null,null,null,"X",null,null,null,"",{"$f":"IF(COUNTA(C14:F14)>1,\"Une seule réponse SVP !\",\"\")","v":""}]
["Habilitation pinces LA672",null,null,null,"X",null,null,null,"",{"$f":"IF(COUNTA(C15:F15)>1,\"Une seule réponse SVP !\",\"\")","v":""}]
["Habilitation pinces D-OMEGA T",null,null,null,"X",null,null,null,"",{"$f":"IF(COUNTA(C16:F16)>1,\"Une seule réponse SVP !\",\"\")","v":""}]
["Formation réglage gares",null,null,null,"X",null,null,null,"",{"$f":"IF(COUNTA(C17:F17)>1,\"Une seule réponse SVP !\",\"\")","v":""}]
["Formation réglage freins",null,null,null,"X",null,null,null,"",""]
["Epissures",null,null,null,"X",null,null,null,"",""]
["Habilitation travail en hauteur",null,null,null,"X",null,null,null,"",""]
[null,null,null,null,null,null,null,null,"Saisir une valeur !",""]
[null,null,null,null,null,null,null,null,"Saisir une valeur !",""]
[null,null,null,null,null,null,null,null,"Saisir une valeur !",""]
[null,null,null,null,null,null,null,null,"Saisir une valeur !",""]
[null,null,null,null,null,null,null,null,null,{"$f":"IF(AND(C25<>\"\",E25<>\"\"),\"Une seule réponse SVP !\",\"\")","v":""}]
["SAVOIR-FAIRE - TELESKI",null,null,null,null,null,{"$f":"COUNTA(A28:B34,A36:B40,A42:B49)*4","v":56},{"$f":"(SUM(C27:F27)+SUM(C35:F35)+SUM(C41:F41))/G26*20","v":17.142857142857142},null,""]
["Téleski - gare motrice",null,{"$f":"COUNTIF(C28:C34,\"=X\")*1","v":0},{"$f":"COUNTIF(D28:D34,\"=X\")*2","v":0},{"$f":"COUNTIF(E28:E34,\"=X\")*3","v":0},{"$f":"COUNTIF(F28:F34,\"=X\")*4","v":20}]
["Décablage - reprise de tension",null,null,null,null,"X",null,null,{"$f":"IF(AND(C28=\"\",D28=\"\",E28=\"\",F28=\"\"),\"Saisir une valeur !\",\"\")","v":""},{"$f":"IF(COUNTA(C28:F28)>1,\"Une seule réponse SVP !\",\"\")","v":""}]
["Changement bandage, roulement",null,null,null,null,"X",null,null,{"$f":"IF(AND(C29=\"\",D29=\"\",E29=\"\",F29=\"\"),\"Saisir une valeur !\",\"\")","v":""},{"$f":"IF(COUNTA(C29:F29)>1,\"Une seule réponse SVP !\",\"\")","v":""}]
["Réglage gare",null,null,null,null,"X",null,null,"",""]
["Changement protection gare",null,null,null,null,"X",null,null,"",""]
["Contrôle visuel du câble et épissure",null,null,null,null,"X",null,null,"",""]
[null,null,null,null,null,null,null,null,{"$f":"IF(AND(C33=\"\",D33=\"\",E33=\"\",F33=\"\"),\"Saisir une valeur !\",\"\")","v":"Saisir une valeur !"},""]
[null,null,null,null,null,null,null,null,{"$f":"IF(AND(C34=\"\",D34=\"\",E34=\"\",F34=\"\"),\"Saisir une valeur !\",\"\")","v":"Saisir une valeur !"},""]
["Téleski - ligne",null,{"$f":"COUNTIF(C36:C40,\"=X\")*1","v":0},{"$f":"COUNTIF(D36:D40,\"=X\")*2","v":0},{"$f":"COUNTIF(E36:E40,\"=X\")*3","v":0},{"$f":"COUNTIF(F36:F40,\"=X\")*4","v":12}]
["Pylônes - contrôle général",null,null,null,null,"X",null,null,{"$f":"IF(AND(C36=\"\",D36=\"\",E36=\"\",F36=\"\"),\"Saisir une valeur !\",\"\")","v":""},{"$f":"IF(COUNTA(C36:F36)>1,\"Une seule réponse SVP !\",\"\")","v":""}]
["Décâblage",null,null,null,null,"X",null,null,"",""]
["Contrôle et changement bandage, roulements",null,null,null,null,"X",null,null,"",""]
[null,null,null,null,null,null,null,null,"Saisir une valeur !",""]
[null,null,null,null,null,null,null,null,"Saisir une valeur !",""]
["Téleski - poulie retour",null,{"$f":"COUNTIF(C42:C49,\"=X\")*1","v":0},{"$f":"COUNTIF(D42:D49,\"=X\")*2","v":4},{"$f":"COUNTIF(E42:E49,\"=X\")*3","v":12},{"$f":"COUNTIF(F42:F49,\"=X\")*4","v":0}]
["Pose de la poulie avec reprise de la tension",null,null,"X",null,null,null,null,{"$f":"IF(AND(C42=\"\",D42=\"\",E42=\"\",F42=\"\"),\"Saisir une valeur !\",\"\")","v":""},{"$f":"IF(COUNTA(C42:F42)>1,\"Une seule réponse SVP !\",\"\")","v":""}]
["Contrôle et changement bandage, roulements",null,null,"X",null,null,null,null,"",""]
["Graissage",null,null,null,"X",null,null,null,"",""]
["Contrôle général",null,null,null,"X",null,null,null,"",""]
["Contrôle fonctionnement tir-fort",null,null,null,"X",null,null,null,"",""]
["Réparation perches et enrouleurs",null,null,null,"X",null,null,null,"",""]
[null,null,null,null,null,null,null,null,"Saisir une valeur !",""]
[null,null,null,null,null,null,null,null,"Saisir une valeur !",""]
[null,null,null,null,null,null,null,null,null,""]
["SAVOIR-FAIRE - TELESIEGES PINCES FIXES (TSF)",null,null,null,null,null,{"$f":"COUNTA(A53:B59,A61:B66,A68:B72)*4","v":48},{"$f":"(SUM(C52:F52)+SUM(C60:F60)+SUM(C67:F67))/G51*20","v":11.25},null,""]
["Télésiège - gare motrice",null,{"$f":"COUNTIF(C53:C59,\"=X\")*1","v":0},{"$f":"COUNTIF(D53:D59,\"=X\")*2","v":4},{"$f":"COUNTIF(E53:E59,\"=X\")*3","v":9},{"$f":"COUNTIF(F53:F59,\"=X\")*4","v":0}]
["Contrôle et réglage frein (changement plaquettes et rondelles belleville)",null,null,null,"X",null,null,null,{"$f":"IF(AND(C53=\"\",D53=\"\",E53=\"\",F53=\"\"),\"Saisir une valeur !\",\"\")","v":""},{"$f":"IF(COUNTA(C53:F53)>1,\"Une seule réponse SVP !\",\"\")","v":""}]
["Points d graissage",null,null,"X",null,null,null,null,"",""]
["Contrôle courroie",null,null,null,"X",null,null,null,"",""]
["Réducteur (contrôle sonore, niveau huile, vidange)",null,null,"X",null,null,null,null,"",""]
["Contrôle moteur thermique",null,null,null,"X",null,null,null,"",""]
[null,null,null,null,null,null,null,null,"Saisir une valeur !",""]
[null,null,null,null,null,null,null,null,"Saisir une valeur !",""]
["Télésiège - ligne",null,{"$f":"COUNTIF(C61:C66,\"=X\")*1","v":1},{"$f":"COUNTIF(D61:D66,\"=X\")*2","v":4},{"$f":"COUNTIF(E61:E66,\"=X\")*3","v":3},{"$f":"COUNTIF(F61:F66,\"=X\")*4","v":0}]
["Pylônes - contrôle général",null,"X",null,null,null,null,null,{"$f":"IF(AND(C61=\"\",D61=\"\",E61=\"\",F61=\"\"),\"Saisir une valeur !\",\"\")","v":""},{"$f":"IF(COUNTA(C61:F61)>1,\"Une seule réponse SVP !\",\"\")","v":""}]
["Décâblage et graissage hors charge",null,null,"X",null,null,null,null,"",""]
["Contrôle et changement bandage, roulements",null,null,"X",null,null,null,null,"",""]
["Changement de galet ",null,null,null,"X",null,null,null,"",""]
[null,null,null,null,null,null,null,null,"Saisir une valeur !",""]
[null,null,null,null,null,null,null,null,"Saisir une valeur !",""]
["Télésiège - poulie retour",null,{"$f":"COUNTIF(C68:C72,\"=X\")*1","v":1},{"$f":"COUNTIF(D68:D72,\"=X\")*2","v":2},{"$f":"COUNTIF(E68:E72,\"=X\")*3","v":3},{"$f":"COUNTIF(F68:F72,\"=X\")*4","v":0}]
["Graissage",null,null,"X",null,null,null,null,{"$f":"IF(AND(C68=\"\",D68=\"\",E68=\"\",F68=\"\"),\"Saisir une valeur !\",\"\")","v":""},{"$f":"IF(COUNTA(C68:F68)>1,\"Une seule réponse SVP !\",\"\")","v":""}]
["Contrôle état général (fisure serrage boulonnerie contrôle massif + serrage des ancrages)",null,"X",null,null,null,null,null,"",""]
["Contrôle bandage",null,null,null,"X",null,null,null,"",""]
[null,null,null,null,null,null,null,null,"Saisir une valeur !",""]
[null,null,null,null,null,null,null,null,"Saisir une valeur !",""]
[null,null,null,null,null,null,null,null,null,""]
["SAVOIR-FAIRE - TELESIEGES DEBRAYABLES (TSD)",null,null,null,null,null,{"$f":"COUNTA(A76:B81,A83:B88,A90:B93)*4","v":40},{"$f":"(SUM(C75:F75)+SUM(C82:F82)+SUM(C89:F89))/G74*20","v":14.5},null,""]
["Télésiège - gare motrice",null,{"$f":"COUNTIF(C76:C81,\"=X\")*1","v":1},{"$f":"COUNTIF(D76:D81,\"=X\")*2","v":0},{"$f":"COUNTIF(E76:E81,\"=X\")*3","v":9},{"$f":"COUNTIF(F76:F81,\"=X\")*4","v":0}]
["Contrôle et réglage frein (changement plaquettes et rondelles belleville)",null,"X",null,null,null,null,null,{"$f":"IF(AND(C76=\"\",D76=\"\",E76=\"\",F76=\"\"),\"Saisir une valeur !\",\"\")","v":""},{"$f":"IF(COUNTA(C76:F76)>1,\"Une seule réponse SVP !\",\"\")","v":""}]
["Contrôle et réglage gabarit de gare",null,null,null,"X",null,null,null,"",""]
["Contrôle état général (pneus, courroies, badage)",null,null,null,"X",null,null,null,"",""]
["Réducteur (contrôle sonore, niveau huile, vidange)",null,null,null,"X",null,null,null,"",""]
[null,null,null,null,null,null,null,null,"Saisir une valeur !",""]
[null,null,null,null,null,null,null,null,"Saisir une valeur !",""]
["Télésiège - ligne",null,{"$f":"COUNTIF(C83:C88,\"=X\")*1","v":0},{"$f":"COUNTIF(D83:D88,\"=X\")*2","v":2},{"$f":"COUNTIF(E83:E88,\"=X\")*3","v":9},{"$f":"COUNTIF(F83:F88,\"=X\")*4","v":0}]
["Pylônes - contrôle général",null,null,"X",null,null,null,null,{"$f":"IF(AND(C83=\"\",D83=\"\",E83=\"\",F83=\"\"),\"Saisir une valeur !\",\"\")","v":""},{"$f":"IF(COUNTA(C83:F83)>1,\"Une seule réponse SVP !\",\"\")","v":""}]
["Décâblage et graissage hors charge",null,null,null,"X",null,null,null,"",""]
["Contrôle et changement bandage, roulements",null,null,null,"X",null,null,null,"",""]
["Changement de galets",null,null,null,"X",null,null,null,"",""]
[null,null,null,null,null,null,null,null,"Saisir une valeur !",""]
[null,null,null,null,null,null,null,null,"Saisir une valeur !",""]
["Télésiège - poulie retour",null,{"$f":"COUNTIF(C90:C93,\"=X\")*1","v":0},{"$f":"COUNTIF(D90:D93,\"=X\")*2","v":0},{"$f":"COUNTIF(E90:E93,\"=X\")*3","v":0},{"$f":"COUNTIF(F90:F93,\"=X\")*4","v":8}]
["Contrôle et réglage gabarit de gare",null,null,null,null,"X",null,null,{"$f":"IF(AND(C90=\"\",D90=\"\",E90=\"\",F90=\"\"),\"Saisir une valeur !\",\"\")","v":""},{"$f":"IF(COUNTA(C90:F90)>1,\"Une seule réponse SVP !\",\"\")","v":""}]
["Contrôle état général (pneus, courroies, bandages)",null,null,null,null,"X",null,null,"",""]
[null,null,null,null,null,null,null,null,"Saisir une valeur !",""]
[null,null,null,null,null,null,null,null,"Saisir une valeur !",""]
[]
["SAVOIR-ETRE",null,{"$f":"COUNTIF(C96:C108,\"=X\")*1","v":0},{"$f":"COUNTIF(D96:D108,\"=X\")*2","v":16},{"$f":"COUNTIF(E96:E108,\"=X\")*3","v":6},{"$f":"COUNTIF(F96:F108,\"=X\")*4","v":4},{"$f":"COUNTA(A96:B108)*4","v":44},{"$f":"SUM(C95:F95)/G95*20","v":11.818181818181818}]
["Rigueur dans les contôles",null,null,"X",null,null,null,null,{"$f":"IF(AND(C96=\"\",D96=\"\",E96=\"\",F96=\"\"),\"Saisir une valeur !\",\"\")","v":""},{"$f":"IF(COUNTA(C96:F96)>1,\"Une seule réponse SVP !\",\"\")","v":""}]
["Respect et propreté du matériel et des batiments ",null,null,"X",null,null,null,null,"",""]
["Prise d'initiative",null,null,"X",null,null,null,null,"",""]
["Ponctualité",null,null,"X",null,null,null,null,"",""]
["Respect de la sécurité (EPI, collègues de travail)",null,null,null,"X",null,null,null,"",""]
["Maîtrise de soi",null,null,"X",null,null,null,null,"",""]
["Discrétion professionnelle",null,null,null,"X",null,null,null,"",{"$f":"IF(COUNTA(C102:F102)>1,\"Une seule réponse SVP !\",\"\")","v":""}]
["Respect de la hiérarchie",null,null,"X",null,null,null,null,"",""]
["Adaptabilité",null,null,"X",null,null,null,null,"",""]
["Motivation",null,null,"X",null,null,null,null,"",""]
["TREGHD",null,null,null,null,"X",null,null,"",""]
[null,null,null,null,null,null,null,null,"Saisir une valeur !",""]
[null,null,null,null,null,null,null,null,"Saisir une valeur !",""]
[]
[]
["SYNTESE"]
[null,null,null,null,null,null,{"$f":"B3","v":"SALARIE 1"},{"$f":"'SYNTHESE EQUIPE'!L3","v":"Σ EQUIPE"},"OBJECTIF SALARIE FIXE"]
[{"$f":"A11","v":"FORMATION"},null,null,null,null,null,{"$f":"H11","v":20},{"$f":"'SYNTHESE EQUIPE'!L4","v":20},10]
[{"$f":"A26","v":"SAVOIR-FAIRE - TELESKI"},null,null,null,null,null,{"$f":"H26","v":17.142857142857142},{"$f":"'SYNTHESE EQUIPE'!L5","v":17.142857142857142},8]
[{"$f":"A51","v":"SAVOIR-FAIRE - TELESIEGES PINCES FIXES (TSF)"},null,null,null,null,null,{"$f":"H51","v":11.25},{"$f":"'SYNTHESE EQUIPE'!L6","v":11.25},13]
[{"$f":"A74","v":"SAVOIR-FAIRE - TELESIEGES DEBRAYABLES (TSD)"},null,null,null,null,null,{"$f":"H74","v":14.5},{"$f":"'SYNTHESE EQUIPE'!L7","v":14.5},13]
[{"$f":"A95","v":"SAVOIR-ETRE"},null,null,null,null,null,{"$f":"H95","v":11.818181818181818},{"$f":"'SYNTHESE EQUIPE'!L8","v":11.818181818181818},13]

{"sheet":"SALARIE 2","index":1,"n_rows":116,"n_cols":10,"rows_kept":116,"cut":false,"hidden":false,"merged":[[0,0,0,9],[11,0,11,1],[11,2,11,3],[11,4,11,5],[11,6,11,7],[12,0,12,1],[12,2,12,3],[12,4,12,5],[12,6,12,7],[4,2,4,7],[10,0,10,1],[10,2,10,3],[10,4,10,5],[2,5,2,9],[3,2,3,4],[3,5,3,9],[7,0,7,9],[9,6,9,7],[15,0,15,1],[15,2,15,3],[15,4,15,5],[15,6,15,7],[16,0,16,1],[16,2,16,3],[16,4,16,5],[16,6,16,7],[13,0,13,1],[13,2,13,3],[13,4,13,5],[13,6,13,7],[14,0,14,1],[14,2,14,3],[14,4,14,5],[14,6,14,7],[19,0,19,1],[19,2,19,3],[19,4,19,5],[19,6,19,7],[20,0,20,1],[20,2,20,3],[20,4,20,5],[20,6,20,7],[17,0,17,1],[17,2,17,3],[17,4,17,5],[17,6,17,7],[18,0,18,1],[18,2,18,3],[18,4,18,5],[18,6,18,7],[23,0,23,1],[23,2,23,3],[23,4,23,5],[23,6,23,7],[24,0,24,7],[21,0,21,1],[21,2,21,3],[21,4,21,5],[21,6,21,7],[22,0,22,1],[22,2,22,3],[22,4,22,5],[22,6,22,7],[31,0,31,1],[33,0,33,1],[34,0,34,1],[34,6,34,7],[35,0,35,1],[36,0,36,1],[32,0,32,1],[26,0,26,1],[26,6,26,7],[27,0,27,1],[28,0,28,1],[29,0,29,1],[30,0,30,1],[37,0,37,1],[39,0,39,1],[40,0,40,1],[40,6,40,7],[41,0,41,1],[50,0,50,1],[37,6,37,7],[38,0,38,1],[38,6,38,7],[39,6,39,7],[41,6,41,7],[42,6,42,7],[43,0,43,1],[43,6,43,7],[44,0,44,1],[44,6,44,7],[47,0,47,1],[48,0,48,1],[65,0,65,1],[66,0,66,1],[66,6,66,7],[67,0,67,1],[68,0,68,1],[65,6,65,7],[67,6,67,7],[68,6,68,7],[56,0,56,1],[59,0,59,1],[59,6,59,7],[60,0,60,1],[61,0,61,1],[62,0,62,1],[56,6,56,7],[57,0,57,1],[57,6,57,7],[58,0,58,1],[77,0,77,1],[78,0,78,1],[80,0,80,1],[81,0,81,1],[81,6,81,7],[82,0,82,1],[80,6,80,7],[82,6,82,7],[69,0,69,1],[72,0,72,7],[74,0,74,1],[74,6,74,7],[75,0,75,1],[76,0,76,1],[69,6,69,7],[70,0,70,1],[70,6,70,7],[71,0,71,1],[79,0,79,1],[83,0,83,1],[84,0,84,1],[85,0,85,1],[87,0,87,1],[88,0,88,1],[88,6,88,7],[83,6,83,7],[84,6,84,7],[85,6,85,7],[86,0,86,1],[102,6,102,7],[103,6,103,7],[102,0,102,1],[103,0,103,1],[104,0,104,1],[105,0,105,1],[106,0,106,1],[104,6,104,7],[105,6,105,7],[106,6,106,7],[99,0,99,1],[100,0,100,1],[101,0,101,1],[89,0,89,1],[90,0,90,1],[92,0,92,1],[93,0,93,7],[94,0,94,1],[95,0,95,1],[92,6,92,7],[110,8,110,9],[27,6,27,7],[28,6,28,7],[29,6,29,7],[30,6,30,7],[31,6,31,7],[32,6,32,7],[33,6,33,7],[35,6,35,7],[36,6,36,7],[45,6,45,7],[46,6,46,7],[47,6,47,7],[48,6,48,7],[78,6,78,7],[79,6,79,7],[58,6,58,7],[60,6,60,7],[61,6,61,7],[62,6,62,7],[109,0,109,9],[96,0,96,1],[97,0,97,1],[98,0,98,1],[110,0,110,5],[95,6,95,7],[96,6,96,7],[97,6,97,7],[98,6,98,7],[99,6,99,7],[100,6,100,7],[101,6,101,7],[63,6,63,7],[64,0,64,1],[64,6,64,7],[63,0,63,1],[107,0,107,1],[107,6,107,7],[86,6,86,7],[87,6,87,7],[89,6,89,7],[90,6,90,7],[91,0,91,1],[91,6,91,7],[71,6,71,7],[75,6,75,7],[76,6,76,7],[77,6,77,7],[51,0,51,1],[51,6,51,7],[52,0,52,1],[53,0,53,1],[54,0,54,1],[55,0,55,1],[52,6,52,7],[53,6,53,7],[54,6,54,7],[55,6,55,7]]}
["OUVRIER ENTRETIEN MECANIQUE"]
[]
["Nom :","SALARIE 2","Dâte d'entrée :"]
["Prénom :",null,"Service :"]
["Poste occupé :"]
[]
[]
["NA = non acquis        ECA = en cours d'acquisition          A = acquis          M = maîtrisé"]
[]
[null,null,"NA","ECA","A","M","Commentaires"]
["Savasem1",null,{"$f":"COUNTIF(C12:D24,\"=X\")*0","v":0},null,{"$f":"COUNTIF(E12:F24,\"=X\")*1","v":0},null,{"$f":"COUNTA(A12:B24)*1","v":9},{"$f":"SUM(C11:F11)/G11*20","v":0}]
["Habilitation électrique",null,null,null,null,null,null,null,{"$f":"IF(AND(C12=\"\",E12=\"\"),\"Saisir une valeur !\",\"\")","v":"Saisir une valeur !"},{"$f":"IF(COUNTA(C12:F12)>1,\"Une seule réponse SVP !\",\"\")","v":""}]
["Formation SST",null,null,null,null,null,null,null,{"$f":"IF(AND(C13=\"\",E13=\"\"),\"Saisir une valeur !\",\"\")","v":"Saisir une valeur !"},{"$f":"IF(COUNTA(C13:F13)>1,\"Une seule réponse SVP !\",\"\")","v":""}]
["Habilitation pinces LPA",null,null,null,null,null,null,null,"Saisir une valeur !",{"$f":"IF(COUNTA(C14:F14)>1,\"Une seule réponse SVP !\",\"\")","v":""}]
["Habilitation pinces LA672",null,null,null,null,null,null,null,"Saisir une valeur !",{"$f":"IF(COUNTA(C15:F15)>1,\"Une seule réponse SVP !\",\"\")","v":""}]
["Habilitation pinces D-OMEGA T",null,null,null,null,null,null,null,"Saisir une valeur !",{"$f":"IF(COUNTA(C16:F16)>1,\"Une seule réponse SVP !\",\"\")","v":""}]
["Formation réglage gares",null,null,null,null,null,null,null,"Saisir une valeur !",{"$f":"IF(COUNTA(C17:F17)>1,\"Une seule réponse SVP !\",\"\")","v":""}]
["Formation réglage freins",null,null,null,null,null,null,null,"Saisir une valeur !",""]
["Epissures",null,null,null,null,null,null,null,"Saisir une valeur !",""]
["Habilitation travail en hauteur",null,null,null,null,null,null,null,"Saisir une valeur !",""]
[null,null,null,null,null,null,null,null,"Saisir une valeur !",""]
[null,null,null,null,null,null,null,null,"Saisir une valeur !",""]
[null,null,null,null,null,null,null,null,"Saisir une valeur !",""]
[null,null,null,null,null,null,null,null,"Saisir une valeur !",""]
[null,null,null,null,null,null,null,null,null,{"$f":"IF(AND(C25<>\"\",E25<>\"\"),\"Une seule réponse SVP !\",\"\")","v":""}]
["SAVOIR-FAIRE - TELESKI",null,null,null,null,null,{"$f":"COUNTA(A28:B34,A36:B40,A42:B49)*4","v":56},{"$f":"(SUM(C27:F27)+SUM(C35:F35)+SUM(C41:F41))/G26*20","v":0},null,""]
["Téleski - gare motrice",null,{"$f":"COUNTIF(C28:C34,\"=X\")*1","v":0},{"$f":"COUNTIF(D28:D34,\"=X\")*2","v":0},{"$f":"COUNTIF(E28:E34,\"=X\")*3","v":0},{"$f":"COUNTIF(F28:F34,\"=X\")*4","v":0}]
["Décablage - reprise de tension",null,null,null,null,null,null,null,{"$f":"IF(AND(C28=\"\",D28=\"\",E28=\"\",F28=\"\"),\"Saisir une valeur !\",\"\")","v":"Saisir une valeur !"},{"$f":"IF(COUNTA(C28:F28)>1,\"Une seule réponse SVP !\",\"\")","v":""}]
["Changement bandage, roulement",null,null,null,null,null,null,null,{"$f":"IF(AND(C29=\"\",D29=\"\",E29=\"\",F29=\"\"),\"Saisir une valeur !\",\"\")","v":"Saisir une valeur !"},{"$f":"IF(COUNTA(C29:F29)>1,\"Une seule réponse SVP !\",\"\")","v":""}]
["Réglage gare",null,null,null,null,null,null,null,"Saisir une valeur !",""]
["Changement protection gare",null,null,null,null,null,null,null,"Saisir une valeur !",""]
["Contrôle visuel du câble et épissure",null,null,null,null,null,null,null,"Saisir une valeur !",""]
[null,null,null,null,null,null,null,null,{"$f":"IF(AND(C33=\"\",D33=\"\",E33=\"\",F33=\"\"),\"Saisir une valeur !\",\"\")","v":"Saisir une valeur !"},""]
[null,null,null,null,null,null,null,null,{"$f":"IF(AND(C34=\"\",D34=\"\",E34=\"\",F34=\"\"),\"Saisir une valeur !\",\"\")","v":"Saisir une valeur !"},""]
["Téleski - ligne",null,{"$f":"COUNTIF(C36:C40,\"=X\")*1","v":0},{"$f":"COUNTIF(D36:D40,\"=X\")*2","v":0},{"$f":"COUNTIF(E36:E40,\"=X\")*3","v":0},{"$f":"COUNTIF(F36:F40,\"=X\")*4","v":0}]
["Pylônes - contrôle général",null,null,null,null,null,null,null,{"$f":"IF(AND(C36=\"\",D36=\"\",E36=\"\",F36=\"\"),\"Saisir une valeur !\",\"\")","v":"Saisir une valeur !"},{"$f":"IF(COUNTA(C36:F36)>1,\"Une seule réponse SVP !\",\"\")","v":""}]
["Décâblage",null,null,null,null,null,null,null,"Saisir une valeur !",""]
["Contrôle et changement bandage, roulements",null,null,null,null,null,null,null,"Saisir une valeur !",""]
[null,null,null,null,null,null,null,null,"Saisir une valeur !",""]
[null,null,null,null,null,null,null,null,"Saisir une valeur !",""]
["Téleski - poulie retour",null,{"$f":"COUNTIF(C42:C49,\"=X\")*1","v":0},{"$f":"COUNTIF(D42:D49,\"=X\")*2","v":0},{"$f":"COUNTIF(E42:E49,\"=X\")*3","v":0},{"$f":"COUNTIF(F42:F49,\"=X\")*4","v":0}]
["Pose de la poulie avec reprise de la tension",null,null,null,null,null,null,null,{"$f":"IF(AND(C42=\"\",D42=\"\",E42=\"\",F42=\"\"),\"Saisir une valeur !\",\"\")","v":"Saisir une valeur !"},{"$f":"IF(COUNTA(C42:F42)>1,\"Une seule réponse SVP !\",\"\")","v":""}]
["Contrôle et changement bandage, roulements",null,null,null,null,null,null,null,"Saisir une valeur !",""]
["Graissage",null,null,null,null,null,null,null,"Saisir une valeur !",""]
["Contrôle général",null,null,null,null,null,null,null,"Saisir une valeur !",""]
["Contrôle fonctionnement tir-fort",null,null,null,null,null,null,null,"Saisir une valeur !",""]
["Réparation perches et enrouleurs",null,null,null,null,null,null,null,"Saisir une valeur !",""]
[null,null,null,null,null,null,null,null,"Saisir une valeur !",""]
[null,null,null,null,null,null,null,null,"Saisir une valeur !",""]
[null,null,null,null,null,null,null,null,null,""]
["SAVOIR-FAIRE - TELESIEGES PINCES FIXES (TSF)",null,null,null,null,null,{"$f":"COUNTA(A53:B59,A61:B66,A68:B72)*4","v":48},{"$f":"(SUM(C52:F52)+SUM(C60:F60)+SUM(C67:F67))/G51*20","v":0},null,""]
["Télésiège - gare motrice",null,{"$f":"COUNTIF(C53:C59,\"=X\")*1","v":0},{"$f":"COUNTIF(D53:D59,\"=X\")*2","v":0},{"$f":"COUNTIF(E53:E59,\"=X\")*3","v":0},{"$f":"COUNTIF(F53:F59,\"=X\")*4","v":0}]
["Contrôle et réglage frein (changement plaquettes et rondelles belleville)",null,null,null,null,null,null,null,{"$f":"IF(AND(C53=\"\",D53=\"\",E53=\"\",F53=\"\"),\"Saisir une valeur !\",\"\")","v":"Saisir une valeur !"},{"$f":"IF(COUNTA(C53:F53)>1,\"Une seule réponse SVP !\",\"\")","v":""}]
["Points d graissage",null,null,null,null,null,null,null,"Saisir une valeur !",""]
["Contrôle courroie",null,null,null,null,null,null,null,"Saisir une valeur !",""]
["Réducteur (contrôle sonore, niveau huile, vidange)",null,null,null,null,null,null,null,"Saisir une valeur !",""]
["Contrôle moteur thermique",null,null,null,null,null,null,null,"Saisir une valeur !",""]
[null,null,null,null,null,null,null,null,"Saisir une valeur !",""]
[null,null,null,null,null,null,null,null,"Saisir une valeur !",""]
["Télésiège - ligne",null,{"$f":"COUNTIF(C61:C66,\"=X\")*1","v":0},{"$f":"COUNTIF(D61:D66,\"=X\")*2","v":0},{"$f":"COUNTIF(E61:E66,\"=X\")*3","v":0},{"$f":"COUNTIF(F61:F66,\"=X\")*4","v":0}]
["Pylônes - contrôle général",null,null,null,null,null,null,null,{"$f":"IF(AND(C61=\"\",D61=\"\",E61=\"\",F61=\"\"),\"Saisir une valeur !\",\"\")","v":"Saisir une valeur !"},{"$f":"IF(COUNTA(C61:F61)>1,\"Une seule réponse SVP !\",\"\")","v":""}]
["Décâblage et graissage hors charge",null,null,null,null,null,null,null,"Saisir une valeur !",""]
["Contrôle et changement bandage, roulements",null,null,null,null,null,null,null,"Saisir une valeur !",""]
["Changement de galet ",null,null,null,null,null,null,null,"Saisir une valeur !",""]
[null,null,null,null,null,null,null,null,"Saisir une valeur !",""]
[null,null,null,null,null,null,null,null,"Saisir une valeur !",""]
["Télésiège - poulie retour",null,{"$f":"COUNTIF(C68:C72,\"=X\")*1","v":0},{"$f":"COUNTIF(D68:D72,\"=X\")*2","v":0},{"$f":"COUNTIF(E68:E72,\"=X\")*3","v":0},{"$f":"COUNTIF(F68:F72,\"=X\")*4","v":0}]
["Graissage",null,null,null,null,null,null,null,{"$f":"IF(AND(C68=\"\",D68=\"\",E68=\"\",F68=\"\"),\"Saisir une valeur !\",\"\")","v":"Saisir une valeur !"},{"$f":"IF(COUNTA(C68:F68)>1,\"Une seule réponse SVP !\",\"\")","v":""}]
["Contrôle état général (fisure serrage boulonnerie contrôle massif + serrage des ancrages)",null,null,null,null,null,null,null,"Saisir une valeur !",""]
["Contrôle bandage",null,null,null,null,null,null,null,"Saisir une valeur !",""]
[null,null,null,null,null,null,null,null,"Saisir une valeur !",""]
[null,null,null,null,null,null,null,null,"Saisir une valeur !",""]
[null,null,null,null,null,null,null,null,null,""]
["SAVOIR-FAIRE - TELESIEGES DEBRAYABLES (TSD)",null,null,null,null,null,{"$f":"COUNTA(A76:B81,A83:B88,A90:B93)*4","v":40},{"$f":"(SUM(C75:F75)+SUM(C82:F82)+SUM(C89:F89))/G74*20","v":0},null,""]
["Télésiège - gare motrice",null,{"$f":"COUNTIF(C76:C81,\"=X\")*1","v":0},{"$f":"COUNTIF(D76:D81,\"=X\")*2","v":0},{"$f":"COUNTIF(E76:E81,\"=X\")*3","v":0},{"$f":"COUNTIF(F76:F81,\"=X\")*4","v":0}]
["Contrôle et réglage frein (changement plaquettes et rondelles belleville)",null,null,null,null,null,null,null,{"$f":"IF(AND(C76=\"\",D76=\"\",E76=\"\",F76=\"\"),\"Saisir une valeur !\",\"\")","v":"Saisir une valeur !"},{"$f":"IF(COUNTA(C76:F76)>1,\"Une seule réponse SVP !\",\"\")","v":""}]
["Contrôle et réglage gabarit de gare",null,null,null,null,null,null,null,"Saisir une valeur !",""]
["Contrôle état général (pneus, courroies, badage)",null,null,null,null,null,null,null,"Saisir une valeur !",""]
["Réducteur (contrôle sonore, niveau huile, vidange)",null,null,null,null,null,null,null,"Saisir une valeur !",""]
[null,null,null,null,null,null,null,null,"Saisir une valeur !",""]
[null,null,null,null,null,null,null,null,"Saisir une valeur !",""]
["Télésiège - ligne",null,{"$f":"COUNTIF(C83:C88,\"=X\")*1","v":0},{"$f":"COUNTIF(D83:D88,\"=X\")*2","v":0},{"$f":"COUNTIF(E83:E88,\"=X\")*3","v":0},{"$f":"COUNTIF(F83:F88,\"=X\")*4","v":0}]
["Pylônes - contrôle général",null,null,null,null,null,null,null,{"$f":"IF(AND(C83=\"\",D83=\"\",E83=\"\",F83=\"\"),\"Saisir une valeur !\",\"\")","v":"Saisir une valeur !"},{"$f":"IF(COUNTA(C83:F83)>1,\"Une seule réponse SVP !\",\"\")","v":""}]
["Décâblage et graissage hors charge",null,null,null,null,null,null,null,"Saisir une valeur !",""]
["Contrôle et changement bandage, roulements",null,null,null,null,null,null,null,"Saisir une valeur !",""]
["Changement de galets",null,null,null,null,null,null,null,"Saisir une valeur !",""]
[null,null,null,null,null,null,null,null,"Saisir une valeur !",""]
[null,null,null,null,null,null,null,null,"Saisir une valeur !",""]
["Télésiège - poulie retour",null,{"$f":"COUNTIF(C90:C93,\"=X\")*1","v":0},{"$f":"COUNTIF(D90:D93,\"=X\")*2","v":0},{"$f":"COUNTIF(E90:E93,\"=X\")*3","v":0},{"$f":"COUNTIF(F90:F93,\"=X\")*4","v":0}]
["Contrôle et réglage gabarit de gare",null,null,null,null,null,null,null,{"$f":"IF(AND(C90=\"\",D90=\"\",E90=\"\",F90=\"\"),\"Saisir une valeur !\",\"\")","v":"Saisir une valeur !"},{"$f":"IF(COUNTA(C90:F90)>1,\"Une seule réponse SVP !\",\"\")","v":""}]
["Contrôle état général (pneus, courroies, bandages)",null,null,null,null,null,null,null,"Saisir une valeur !",""]
[null,null,null,null,null,null,null,null,"Saisir une valeur !",""]
[null,null,null,null,null,null,null,null,"Saisir une valeur !",""]
[]
["SAVOIR-ETRE",null,{"$f":"COUNTIF(C96:C108,\"=X\")*1","v":0},{"$f":"COUNTIF(D96:D108,\"=X\")*2","v":0},{"$f":"COUNTIF(E96:E108,\"=X\")*3","v":0},{"$f":"COUNTIF(F96:F108,\"=X\")*4","v":0},{"$f":"COUNTA(A96:B108)*4","v":40},{"$f":"SUM(C95:F95)/G95*20","v":0}]
["Rigueur dans les contôles",null,null,null,null,null,null,null,{"$f":"IF(AND(C96=\"\",D96=\"\",E96=\"\",F96=\"\"),\"Saisir une valeur !\",\"\")","v":"Saisir une valeur !"},{"$f":"IF(COUNTA(C96:F96)>1,\"Une seule réponse SVP !\",\"\")","v":""}]
["Respect et propreté du matériel et des batiments ",null,null,null,null,null,null,null,"Saisir une valeur !",""]
["Prise d'initiative",null,null,null,null,null,null,null,"Saisir une valeur !",""]
["Ponctualité",null,null,null,null,null,null,null,"Saisir une valeur !",""]
["Respect de la sécurité (EPI, collègues de travail)",null,null,null,null,null,null,null,"Saisir une valeur !",""]
["Maîtrise de soi",null,null,null,null,null,null,null,"Saisir une valeur !",""]
["Discrétion professionnelle",null,null,null,null,null,null,null,"Saisir une valeur !",""]
["Respect de la hiérarchie",null,null,null,null,null,null,null,"Saisir une valeur !",""]
["Adaptabilité",null,null,null,null,null,null,null,"Saisir une valeur !",""]
["Motivation",null,null,null,null,null,null,null,"Saisir une valeur !",""]
[null,null,null,null,null,null,null,null,"Saisir une valeur !",""]
[null,null,null,null,null,null,null,null,"Saisir une valeur !",""]
[null,null,null,null,null,null,null,null,"Saisir une valeur !",""]
[]
["SYNTESE"]
[null,null,null,null,null,null,{"$f":"B3","v":"SALARIE 2"},{"$f":"'SYNTHESE EQUIPE'!L3","v":"Σ EQUIPE"},"OBJECTIF SALARIE FIXE"]
[{"$f":"A11","v":"Savasem1"},null,null,null,null,null,{"$f":"H11","v":0},{"$f":"'SYNTHESE EQUIPE'!L4","v":20},6]
[{"$f":"A26","v":"SAVOIR-FAIRE - TELESKI"},null,null,null,null,null,{"$f":"H26","v":0},{"$f":"'SYNTHESE EQUIPE'!L5","v":17.142857142857142},14]
[{"$f":"A51","v":"SAVOIR-FAIRE - TELESIEGES PINCES FIXES (TSF)"},null,null,null,null,null,{"$f":"H51","v":0},{"$f":"'SYNTHESE EQUIPE'!L6","v":11.25},10]
[{"$f":"A74","v":"SAVOIR-FAIRE - TELESIEGES DEBRAYABLES (TSD)"},null,null,null,null,null,{"$f":"H74","v":0},{"$f":"'SYNTHESE EQUIPE'!L7","v":14.5},10]
[{"$f":"A95","v":"SAVOIR-ETRE"},null,null,null,null,null,{"$f":"H95","v":0},{"$f":"'SYNTHESE EQUIPE'!L8","v":11.818181818181818},10]

{"sheet":"SALARIE 3","index":2,"n_rows":116,"n_cols":10,"rows_kept":116,"cut":false,"hidden":false,"merged":[[4,2,4,7],[10,0,10,1],[10,2,10,3],[10,4,10,5],[13,0,13,1],[13,2,13,3],[13,4,13,5],[13,6,13,7],[14,0,14,1],[14,2,14,3],[14,4,14,5],[14,6,14,7],[11,0,11,1],[11,2,11,3],[11,4,11,5],[11,6,11,7],[12,0,12,1],[12,2,12,3],[12,4,12,5],[12,6,12,7],[17,0,17,1],[17,2,17,3],[17,4,17,5],[17,6,17,7],[18,0,18,1],[18,2,18,3],[18,4,18,5],[18,6,18,7],[15,0,15,1],[15,2,15,3],[15,4,15,5],[15,6,15,7],[16,0,16,1],[16,2,16,3],[16,4,16,5],[16,6,16,7],[21,0,21,1],[21,2,21,3],[21,4,21,5],[21,6,21,7],[22,0,22,1],[22,2,22,3],[22,4,22,5],[22,6,22,7],[19,0,19,1],[19,2,19,3],[19,4,19,5],[19,6,19,7],[20,0,20,1],[20,2,20,3],[20,4,20,5],[20,6,20,7],[26,0,26,1],[26,6,26,7],[27,0,27,1],[28,0,28,1],[29,0,29,1],[30,0,30,1],[29,6,29,7],[30,6,30,7],[23,0,23,1],[23,2,23,3],[23,4,23,5],[23,6,23,7],[24,0,24,7],[31,0,31,1],[33,0,33,1],[34,0,34,1],[34,6,34,7],[35,0,35,1],[36,0,36,1],[31,6,31,7],[32,0,32,1],[32,6,32,7],[33,6,33,7],[65,0,65,1],[66,0,66,1],[66,6,66,7],[67,0,67,1],[68,0,68,1],[65,6,65,7],[67,6,67,7],[68,6,68,7],[56,0,56,1],[59,0,59,1],[59,6,59,7],[60,0,60,1],[61,0,61,1],[62,0,62,1],[56,6,56,7],[57,0,57,1],[57,6,57,7],[58,0,58,1],[60,6,60,7],[61,6,61,7],[62,6,62,7],[63,6,63,7],[64,0,64,1],[64,6,64,7],[77,0,77,1],[78,0,78,1],[80,0,80,1],[81,0,81,1],[81,6,81,7],[82,0,82,1],[80,6,80,7],[82,6,82,7],[69,0,69,1],[72,0,72,7],[74,0,74,1],[74,6,74,7],[75,0,75,1],[76,0,76,1],[69,6,69,7],[70,0,70,1],[70,6,70,7],[71,0,71,1],[83,0,83,1],[84,0,84,1],[85,0,85,1],[87,0,87,1],[88,0,88,1],[88,6,88,7],[83,6,83,7],[84,6,84,7],[85,6,85,7],[86,0,86,1],[101,0,101,1],[89,0,89,1],[90,0,90,1],[92,0,92,1],[93,0,93,7],[94,0,94,1],[95,0,95,1],[92,6,92,7],[95,6,95,7],[110,0,110,5],[110,8,110,9],[109,0,109,9],[7,0,7,9],[0,0,0,9],[2,5,2,9],[3,2,3,4],[3,5,3,9],[27,6,27,7],[28,6,28,7],[102,0,102,1],[103,0,103,1],[104,0,104,1],[105,0,105,1],[106,0,106,1],[102,6,102,7],[103,6,103,7],[104,6,104,7],[105,6,105,7],[96,0,96,1],[97,0,97,1],[98,0,98,1],[99,0,99,1],[100,0,100,1],[44,0,44,1],[44,6,44,7],[45,6,45,7],[46,6,46,7],[47,0,47,1],[47,6,47,7],[35,6,35,7],[36,6,36,7],[37,6,37,7],[38,0,38,1],[38,6,38,7],[39,6,39,7],[37,0,37,1],[39,0,39,1],[40,0,40,1],[40,6,40,7],[41,0,41,1],[41,6,41,7],[42,6,42,7],[43,0,43,1],[43,6,43,7],[48,0,48,1],[48,6,48,7],[52,6,52,7],[53,6,53,7],[54,6,54,7],[55,6,55,7],[63,0,63,1],[51,0,51,1],[51,6,51,7],[52,0,52,1],[53,0,53,1],[54,0,54,1],[55,0,55,1],[50,0,50,1],[106,6,106,7],[107,0,107,1],[107,6,107,7],[9,6,9,7],[96,6,96,7],[97,6,97,7],[98,6,98,7],[99,6,99,7],[100,6,100,7],[101,6,101,7],[86,6,86,7],[87,6,87,7],[89,6,89,7],[90,6,90,7],[91,0,91,1],[91,6,91,7],[71,6,71,7],[75,6,75,7],[76,6,76,7],[77,6,77,7],[78,6,78,7],[79,0,79,1],[79,6,79,7],[58,6,58,7]]}
["OUVRIER ENTRETIEN MECANIQUE"]
[]
["Nom :","SALARIE 3","Dâte d'entrée :"]
["Prénom :",null,"Service :"]
["Poste occupé :"]
[]
[]
["NA = non acquis        ECA = en cours d'acquisition          A = acquis          M = maîtrisé"]
[]
[null,null,"NA","ECA","A","M","Commentaires"]
["FORMATION",null,{"$f":"COUNTIF(C12:D24,\"=X\")*0","v":0},null,{"$f":"COUNTIF(E12:F24,\"=X\")*1","v":0},null,{"$f":"COUNTA(A12:B24)*1","v":9},{"$f":"SUM(C11:F11)/G11*20","v":0}]
["Habilitation électrique",null,null,null,null,null,null,null,{"$f":"IF(AND(C12=\"\",E12=\"\"),\"Saisir une valeur !\",\"\")","v":"Saisir une valeur !"},{"$f":"IF(COUNTA(C12:F12)>1,\"Une seule réponse SVP !\",\"\")","v":""}]
["Formation SST",null,null,null,null,null,null,null,{"$f":"IF(AND(C13=\"\",E13=\"\"),\"Saisir une valeur !\",\"\")","v":"Saisir une valeur !"},{"$f":"IF(COUNTA(C13:F13)>1,\"Une seule réponse SVP !\",\"\")","v":""}]
["Habilitation pinces LPA",null,null,null,null,null,null,null,"Saisir une valeur !",{"$f":"IF(COUNTA(C14:F14)>1,\"Une seule réponse SVP !\",\"\")","v":""}]
["Habilitation pinces LA672",null,null,null,null,null,null,null,"Saisir une valeur !",{"$f":"IF(COUNTA(C15:F15)>1,\"Une seule réponse SVP !\",\"\")","v":""}]
["Habilitation pinces D-OMEGA T",null,null,null,null,null,null,null,"Saisir une valeur !",{"$f":"IF(COUNTA(C16:F16)>1,\"Une seule réponse SVP !\",\"\")","v":""}]
["Formation réglage gares",null,null,null,null,null,null,null,"Saisir une valeur !",{"$f":"IF(COUNTA(C17:F17)>1,\"Une seule réponse SVP !\",\"\")","v":""}]
["Formation réglage freins",null,null,null,null,null,null,null,"Saisir une valeur !",""]
["Epissures",null,null,null,null,null,null,null,"Saisir une valeur !",""]
["Habilitation travail en hauteur",null,null,null,null,null,null,null,"Saisir une valeur !",""]
[null,null,null,null,null,null,null,null,"Saisir une valeur !",""]
[null,null,null,null,null,null,null,null,"Saisir une valeur !",""]
[null,null,null,null,null,null,null,null,"Saisir une valeur !",""]
[null,null,null,null,null,null,null,null,"Saisir une valeur !",""]
[null,null,null,null,null,null,null,null,null,{"$f":"IF(AND(C25<>\"\",E25<>\"\"),\"Une seule réponse SVP !\",\"\")","v":""}]
["SAVOIR-FAIRE - TELESKI",null,null,null,null,null,{"$f":"COUNTA(A28:B34,A36:B40,A42:B49)*4","v":56},{"$f":"(SUM(C27:F27)+SUM(C35:F35)+SUM(C41:F41))/G26*20","v":0},null,""]
["Téleski - gare motrice",null,{"$f":"COUNTIF(C28:C34,\"=X\")*1","v":0},{"$f":"COUNTIF(D28:D34,\"=X\")*2","v":0},{"$f":"COUNTIF(E28:E34,\"=X\")*3","v":0},{"$f":"COUNTIF(F28:F34,\"=X\")*4","v":0}]
["Décablage - reprise de tension",null,null,null,null,null,null,null,{"$f":"IF(AND(C28=\"\",D28=\"\",E28=\"\",F28=\"\"),\"Saisir une valeur !\",\"\")","v":"Saisir une valeur !"},{"$f":"IF(COUNTA(C28:F28)>1,\"Une seule réponse SVP !\",\"\")","v":""}]
["Changement bandage, roulement",null,null,null,null,null,null,null,{"$f":"IF(AND(C29=\"\",D29=\"\",E29=\"\",F29=\"\"),\"Saisir une valeur !\",\"\")","v":"Saisir une valeur !"},{"$f":"IF(COUNTA(C29:F29)>1,\"Une seule réponse SVP !\",\"\")","v":""}]
["Réglage gare",null,null,null,null,null,null,null,"Saisir une valeur !",""]
["Changement protection gare",null,null,null,null,null,null,null,"Saisir une valeur !",""]
["Contrôle visuel du câble et épissure",null,null,null,null,null,null,null,"Saisir une valeur !",""]
[null,null,null,null,null,null,null,null,{"$f":"IF(AND(C33=\"\",D33=\"\",E33=\"\",F33=\"\"),\"Saisir une valeur !\",\"\")","v":"Saisir une valeur !"},""]
[null,null,null,null,null,null,null,null,{"$f":"IF(AND(C34=\"\",D34=\"\",E34=\"\",F34=\"\"),\"Saisir une valeur !\",\"\")","v":"Saisir une valeur !"},""]
["Téleski - ligne",null,{"$f":"COUNTIF(C36:C40,\"=X\")*1","v":0},{"$f":"COUNTIF(D36:D40,\"=X\")*2","v":0},{"$f":"COUNTIF(E36:E40,\"=X\")*3","v":0},{"$f":"COUNTIF(F36:F40,\"=X\")*4","v":0}]
["Pylônes - contrôle général",null,null,null,null,null,null,null,{"$f":"IF(AND(C36=\"\",D36=\"\",E36=\"\",F36=\"\"),\"Saisir une valeur !\",\"\")","v":"Saisir une valeur !"},{"$f":"IF(COUNTA(C36:F36)>1,\"Une seule réponse SVP !\",\"\")","v":""}]
["Décâblage",null,null,null,null,null,null,null,"Saisir une valeur !",""]
["Contrôle et changement bandage, roulements",null,null,null,null,null,null,null,"Saisir une valeur !",""]
[null,null,null,null,null,null,null,null,"Saisir une valeur !",""]
[null,null,null,null,null,null,null,null,"Saisir une valeur !",""]
["Téleski - poulie retour",null,{"$f":"COUNTIF(C42:C49,\"=X\")*1","v":0},{"$f":"COUNTIF(D42:D49,\"=X\")*2","v":0},{"$f":"COUNTIF(E42:E49,\"=X\")*3","v":0},{"$f":"COUNTIF(F42:F49,\"=X\")*4","v":0}]
["Pose de la poulie avec reprise de la tension",null,null,null,null,null,null,null,{"$f":"IF(AND(C42=\"\",D42=\"\",E42=\"\",F42=\"\"),\"Saisir une valeur !\",\"\")","v":"Saisir une valeur !"},{"$f":"IF(COUNTA(C42:F42)>1,\"Une seule réponse SVP !\",\"\")","v":""}]
["Contrôle et changement bandage, roulements",null,null,null,null,null,null,null,"Saisir une valeur !",""]
["Graissage",null,null,null,null,null,null,null,"Saisir une valeur !",""]
["Contrôle général",null,null,null,null,null,null,null,"Saisir une valeur !",""]
["Contrôle fonctionnement tir-fort",null,null,null,null,null,null,null,"Saisir une valeur !",""]
["Réparation perches et enrouleurs",null,null,null,null,null,null,null,"Saisir une valeur !",""]
[null,null,null,null,null,null,null,null,"Saisir une valeur !",""]
[null,null,null,null,null,null,null,null,"Saisir une valeur !",""]
[null,null,null,null,null,null,null,null,null,""]
["SAVOIR-FAIRE - TELESIEGES PINCES FIXES (TSF)",null,null,null,null,null,{"$f":"COUNTA(A53:B59,A61:B66,A68:B72)*4","v":48},{"$f":"(SUM(C52:F52)+SUM(C60:F60)+SUM(C67:F67))/G51*20","v":0},null,""]
["Télésiège - gare motrice",null,{"$f":"COUNTIF(C53:C59,\"=X\")*1","v":0},{"$f":"COUNTIF(D53:D59,\"=X\")*2","v":0},{"$f":"COUNTIF(E53:E59,\"=X\")*3","v":0},{"$f":"COUNTIF(F53:F59,\"=X\")*4","v":0}]
["Contrôle et réglage frein (changement plaquettes et rondelles belleville)",null,null,null,null,null,null,null,{"$f":"IF(AND(C53=\"\",D53=\"\",E53=\"\",F53=\"\"),\"Saisir une valeur !\",\"\")","v":"Saisir une valeur !"},{"$f":"IF(COUNTA(C53:F53)>1,\"Une seule réponse SVP !\",\"\")","v":""}]
["Points d graissage",null,null,null,null,null,null,null,"Saisir une valeur !",""]
["Contrôle courroie",null,null,null,null,null,null,null,"Saisir une valeur !",""]
["Réducteur (contrôle sonore, niveau huile, vidange)",null,null,null,null,null,null,null,"Saisir une valeur !",""]
["Contrôle moteur thermique",null,null,null,null,null,null,null,"Saisir une valeur !",""]
[null,null,null,null,null,null,null,null,"Saisir une valeur !",""]
[null,null,null,null,null,null,null,null,"Saisir une valeur !",""]
["Télésiège - ligne",null,{"$f":"COUNTIF(C61:C66,\"=X\")*1","v":0},{"$f":"COUNTIF(D61:D66,\"=X\")*2","v":0},{"$f":"COUNTIF(E61:E66,\"=X\")*3","v":0},{"$f":"COUNTIF(F61:F66,\"=X\")*4","v":0}]
["Pylônes - contrôle général",null,null,null,null,null,null,null,{"$f":"IF(AND(C61=\"\",D61=\"\",E61=\"\",F61=\"\"),\"Saisir une valeur !\",\"\")","v":"Saisir une valeur !"},{"$f":"IF(COUNTA(C61:F61)>1,\"Une seule réponse SVP !\",\"\")","v":""}]
["Décâblage et graissage hors charge",null,null,null,null,null,null,null,"Saisir une valeur !",""]
["Contrôle et changement bandage, roulements",null,null,null,null,null,null,null,"Saisir une valeur !",""]
["Changement de galet ",null,null,null,null,null,null,null,"Saisir une valeur !",""]
[null,null,null,null,null,null,null,null,"Saisir une valeur !",""]
[null,null,null,null,null,null,null,null,"Saisir une valeur !",""]
["Télésiège - poulie retour",null,{"$f":"COUNTIF(C68:C72,\"=X\")*1","v":0},{"$f":"COUNTIF(D68:D72,\"=X\")*2","v":0},{"$f":"COUNTIF(E68:E72,\"=X\")*3","v":0},{"$f":"COUNTIF(F68:F72,\"=X\")*4","v":0}]
["Graissage",null,null,null,null,null,null,null,{"$f":"IF(AND(C68=\"\",D68=\"\",E68=\"\",F68=\"\"),\"Saisir une valeur !\",\"\")","v":"Saisir une valeur !"},{"$f":"IF(COUNTA(C68:F68)>1,\"Une seule réponse SVP !\",\"\")","v":""}]
["Contrôle état général (fisure serrage boulonnerie contrôle massif + serrage des ancrages)",null,null,null,null,null,null,null,"Saisir une valeur !",""]
["Contrôle bandage",null,null,null,null,null,null,null,"Saisir une valeur !",""]
[null,null,null,null,null,null,null,null,"Saisir une valeur !",""]
[null,null,null,null,null,null,null,null,"Saisir une valeur !",""]
[null,null,null,null,null,null,null,null,null,""]
["SAVOIR-FAIRE - TELESIEGES DEBRAYABLES (TSD)",null,null,null,null,null,{"$f":"COUNTA(A76:B81,A83:B88,A90:B93)*4","v":40},{"$f":"(SUM(C75:F75)+SUM(C82:F82)+SUM(C89:F89))/G74*20","v":0},null,""]
["Télésiège - gare motrice",null,{"$f":"COUNTIF(C76:C81,\"=X\")*1","v":0},{"$f":"COUNTIF(D76:D81,\"=X\")*2","v":0},{"$f":"COUNTIF(E76:E81,\"=X\")*3","v":0},{"$f":"COUNTIF(F76:F81,\"=X\")*4","v":0}]
["Contrôle et réglage frein (changement plaquettes et rondelles belleville)",null,null,null,null,null,null,null,{"$f":"IF(AND(C76=\"\",D76=\"\",E76=\"\",F76=\"\"),\"Saisir une valeur !\",\"\")","v":"Saisir une valeur !"},{"$f":"IF(COUNTA(C76:F76)>1,\"Une seule réponse SVP !\",\"\")","v":""}]
["Contrôle et réglage gabarit de gare",null,null,null,null,null,null,null,"Saisir une valeur !",""]
["Contrôle état général (pneus, courroies, badage)",null,null,null,null,null,null,null,"Saisir une valeur !",""]
["Réducteur (contrôle sonore, niveau huile, vidange)",null,null,null,null,null,null,null,"Saisir une valeur !",""]
[null,null,null,null,null,null,null,null,"Saisir une valeur !",""]
[null,null,null,null,null,null,null,null,"Saisir une valeur !",""]
["Télésiège - ligne",null,{"$f":"COUNTIF(C83:C88,\"=X\")*1","v":0},{"$f":"COUNTIF(D83:D88,\"=X\")*2","v":0},{"$f":"COUNTIF(E83:E88,\"=X\")*3","v":0},{"$f":"COUNTIF(F83:F88,\"=X\")*4","v":0}]
["Pylônes - contrôle général",null,null,null,null,null,null,null,{"$f":"IF(AND(C83=\"\",D83=\"\",E83=\"\",F83=\"\"),\"Saisir une valeur !\",\"\")","v":"Saisir une valeur !"},{"$f":"IF(COUNTA(C83:F83)>1,\"Une seule réponse SVP !\",\"\")","v":""}]
["Décâblage et graissage hors charge",null,null,null,null,null,null,null,"Saisir une valeur !",""]
["Contrôle et changement bandage, roulements",null,null,null,null,null,null,null,"Saisir une valeur !",""]
["Changement de galets",null,null,null,null,null,null,null,"Saisir une valeur !",""]
[null,null,null,null,null,null,null,null,"Saisir une valeur !",""]
[null,null,null,null,null,null,null,null,"Saisir une valeur !",""]
["Télésiège - poulie retour",null,{"$f":"COUNTIF(C90:C93,\"=X\")*1","v":0},{"$f":"COUNTIF(D90:D93,\"=X\")*2","v":0},{"$f":"COUNTIF(E90:E93,\"=X\")*3","v":0},{"$f":"COUNTIF(F90:F93,\"=X\")*4","v":0}]
["Contrôle et réglage gabarit de gare",null,null,null,null,null,null,null,{"$f":"IF(AND(C90=\"\",D90=\"\",E90=\"\",F90=\"\"),\"Saisir une valeur !\",\"\")","v":"Saisir une valeur !"},{"$f":"IF(COUNTA(C90:F90)>1,\"Une seule réponse SVP !\",\"\")","v":""}]
["Contrôle état général (pneus, courroies, bandages)",null,null,null,null,null,null,null,"Saisir une valeur !",""]
[null,null,null,null,null,null,null,null,"Saisir une valeur !",""]
[null,null,null,null,null,null,null,null,"Saisir une valeur !",""]
[]
["SAVOIR-ETRE",null,{"$f":"COUNTIF(C96:C108,\"=X\")*1","v":0},{"$f":"COUNTIF(D96:D108,\"=X\")*2","v":0},{"$f":"COUNTIF(E96:E108,\"=X\")*3","v":0},{"$f":"COUNTIF(F96:F108,\"=X\")*4","v":0},{"$f":"COUNTA(A96:B108)*4","v":40},{"$f":"SUM(C95:F95)/G95*20","v":0}]
["Rigueur dans les contôles",null,null,null,null,null,null,null,{"$f":"IF(AND(C96=\"\",D96=\"\",E96=\"\",F96=\"\"),\"Saisir une valeur !\",\"\")","v":"Saisir une valeur !"},{"$f":"IF(COUNTA(C96:F96)>1,\"Une seule réponse SVP !\",\"\")","v":""}]
["Respect et propreté du matériel et des batiments ",null,null,null,null,null,null,null,"Saisir une valeur !",""]
["Prise d'initiative",null,null,null,null,null,null,null,"Saisir une valeur !",""]
["Ponctualité",null,null,null,null,null,null,null,"Saisir une valeur !",""]
["Respect de la sécurité (EPI, collègues de travail)",null,null,null,null,null,null,null,"Saisir une valeur !",""]
["Maîtrise de soi",null,null,null,null,null,null,null,"Saisir une valeur !",""]
["Discrétion professionnelle",null,null,null,null,null,null,null,"Saisir une valeur !",""]
["Respect de la hiérarchie",null,null,null,null,null,null,null,"Saisir une valeur !",""]
["Adaptabilité",null,null,null,null,null,null,null,"Saisir une valeur !",""]
["Motivation",null,null,null,null,null,null,null,"Saisir une valeur !",""]
[null,null,null,null,null,null,null,null,"Saisir une valeur !",""]
[null,null,null,null,null,null,null,null,"Saisir une valeur !",""]
[null,null,null,null,null,null,null,null,"Saisir une valeur !",""]
[]
["SYNTESE"]
[null,null,null,null,null,null,{"$f":"B3","v":"SALARIE 3"},{"$f":"'SYNTHESE EQUIPE'!L3","v":"Σ EQUIPE"},"OBJECTIF SALARIE FIXE"]
[{"$f":"A11","v":"FORMATION"},null,null,null,null,null,{"$f":"H11","v":0},{"$f":"'SYNTHESE EQUIPE'!L4","v":20},10]
[{"$f":"A26","v":"SAVOIR-FAIRE - TELESKI"},null,null,null,null,null,{"$f":"H26","v":0},{"$f":"'SYNTHESE EQUIPE'!L5","v":17.142857142857142},10]
[{"$f":"A51","v":"SAVOIR-FAIRE - TELESIEGES PINCES FIXES (TSF)"},null,null,null,null,null,{"$f":"H51","v":0},{"$f":"'SYNTHESE EQUIPE'!L6","v":11.25},10]
[{"$f":"A74","v":"SAVOIR-FAIRE - TELESIEGES DEBRAYABLES (TSD)"},null,null,null,null,null,{"$f":"H74","v":0},{"$f":"'SYNTHESE EQUIPE'!L7","v":14.5},10]
[{"$f":"A95","v":"SAVOIR-ETRE"},null,null,null,null,null,{"$f":"H95","v":0},{"$f":"'SYNTHESE EQUIPE'!L8","v":11.818181818181818},10]

{"sheet":"SALARIE 4","index":3,"n_rows":116,"n_cols":10,"rows_kept":116,"cut":false,"hidden":false,"merged":[[4,2,4,7],[10,0,10,1],[10,2,10,3],[10,4,10,5],[0,0,0,9],[13,0,13,1],[13,2,13,3],[13,4,13,5],[13,6,13,7],[14,0,14,1],[14,2,14,3],[14,4,14,5],[14,6,14,7],[11,0,11,1],[11,2,11,3],[11,4,11,5],[11,6,11,7],[12,0,12,1],[12,2,12,3],[12,4,12,5],[12,6,12,7],[17,0,17,1],[17,2,17,3],[17,4,17,5],[17,6,17,7],[18,0,18,1],[18,2,18,3],[18,4,18,5],[18,6,18,7],[15,0,15,1],[15,2,15,3],[15,4,15,5],[15,6,15,7],[16,0,16,1],[16,2,16,3],[16,4,16,5],[16,6,16,7],[21,0,21,1],[21,2,21,3],[21,4,21,5],[21,6,21,7],[22,0,22,1],[22,2,22,3],[22,4,22,5],[22,6,22,7],[19,0,19,1],[19,2,19,3],[19,4,19,5],[19,6,19,7],[20,0,20,1],[20,2,20,3],[20,4,20,5],[20,6,20,7],[26,0,26,1],[26,6,26,7],[27,0,27,1],[28,0,28,1],[29,0,29,1],[30,0,30,1],[23,0,23,1],[23,2,23,3],[23,4,23,5],[23,6,23,7],[24,0,24,7],[31,0,31,1],[33,0,33,1],[34,0,34,1],[34,6,34,7],[35,0,35,1],[36,0,36,1],[32,6,32,7],[33,6,33,7],[35,6,35,7],[36,6,36,7],[37,0,37,1],[39,0,39,1],[40,0,40,1],[40,6,40,7],[41,0,41,1],[50,0,50,1],[37,6,37,7],[38,0,38,1],[38,6,38,7],[39,6,39,7],[45,6,45,7],[46,6,46,7],[47,0,47,1],[47,6,47,7],[48,0,48,1],[48,6,48,7],[41,6,41,7],[42,6,42,7],[43,0,43,1],[43,6,43,7],[44,0,44,1],[44,6,44,7],[51,0,51,1],[51,6,51,7],[52,0,52,1],[53,0,53,1],[54,0,54,1],[55,0,55,1],[52,6,52,7],[53,6,53,7],[54,6,54,7],[55,6,55,7],[56,0,56,1],[59,0,59,1],[59,6,59,7],[60,0,60,1],[61,0,61,1],[62,0,62,1],[56,6,56,7],[57,0,57,1],[57,6,57,7],[58,0,58,1],[58,6,58,7],[60,6,60,7],[61,6,61,7],[62,6,62,7],[80,0,80,1],[81,0,81,1],[81,6,81,7],[82,0,82,1],[80,6,80,7],[82,6,82,7],[69,0,69,1],[72,0,72,7],[74,0,74,1],[74,6,74,7],[75,0,75,1],[76,0,76,1],[69,6,69,7],[70,0,70,1],[70,6,70,7],[71,0,71,1],[79,0,79,1],[79,6,79,7],[83,0,83,1],[84,0,84,1],[85,0,85,1],[87,0,87,1],[88,0,88,1],[88,6,88,7],[83,6,83,7],[84,6,84,7],[85,6,85,7],[86,0,86,1],[101,0,101,1],[89,0,89,1],[90,0,90,1],[92,0,92,1],[93,0,93,7],[94,0,94,1],[95,0,95,1],[92,6,92,7],[95,6,95,7],[110,0,110,5],[110,8,110,9],[109,0,109,9],[7,0,7,9],[27,6,27,7],[28,6,28,7],[29,6,29,7],[30,6,30,7],[31,6,31,7],[32,0,32,1],[102,0,102,1],[103,0,103,1],[104,0,104,1],[105,0,105,1],[106,0,106,1],[102,6,102,7],[103,6,103,7],[104,6,104,7],[105,6,105,7],[96,0,96,1],[97,0,97,1],[98,0,98,1],[99,0,99,1],[100,0,100,1],[63,6,63,7],[64,0,64,1],[64,6,64,7],[77,0,77,1],[78,0,78,1],[63,0,63,1],[65,0,65,1],[66,0,66,1],[66,6,66,7],[67,0,67,1],[68,0,68,1],[65,6,65,7],[67,6,67,7],[68,6,68,7],[106,6,106,7],[107,0,107,1],[107,6,107,7],[2,5,2,9],[3,2,3,4],[3,5,3,9],[9,6,9,7],[96,6,96,7],[97,6,97,7],[98,6,98,7],[99,6,99,7],[100,6,100,7],[101,6,101,7],[86,6,86,7],[87,6,87,7],[89,6,89,7],[90,6,90,7],[91,0,91,1],[91,6,91,7],[71,6,71,7],[75,6,75,7],[76,6,76,7],[77,6,77,7],[78,6,78,7]]}
["OUVRIER ENTRETIEN MECANIQUE"]
[]
["Nom :","SALARIE 4","Dâte d'entrée :"]
["Prénom :",null,"Service :"]
["Poste occupé :"]
[]
[]
["NA = non acquis        ECA = en cours d'acquisition          A = acquis          M = maîtrisé"]
[]
[null,null,"NA","ECA","A","M","Commentaires"]
["FORMATION",null,{"$f":"COUNTIF(C12:D24,\"=X\")*0","v":0},null,{"$f":"COUNTIF(E12:F24,\"=X\")*1","v":0},null,{"$f":"COUNTA(A12:B24)*1","v":9},{"$f":"SUM(C11:F11)/G11*20","v":0}]
["Habilitation électrique",null,null,null,null,null,null,null,{"$f":"IF(AND(C12=\"\",E12=\"\"),\"Saisir une valeur !\",\"\")","v":"Saisir une valeur !"},{"$f":"IF(COUNTA(C12:F12)>1,\"Une seule réponse SVP !\",\"\")","v":""}]
["Formation SST",null,null,null,null,null,null,null,{"$f":"IF(AND(C13=\"\",E13=\"\"),\"Saisir une valeur !\",\"\")","v":"Saisir une valeur !"},{"$f":"IF(COUNTA(C13:F13)>1,\"Une seule réponse SVP !\",\"\")","v":""}]
["Habilitation pinces LPA",null,null,null,null,null,null,null,"Saisir une valeur !",{"$f":"IF(COUNTA(C14:F14)>1,\"Une seule réponse SVP !\",\"\")","v":""}]
["Habilitation pinces LA672",null,null,null,null,null,null,null,"Saisir une valeur !",{"$f":"IF(COUNTA(C15:F15)>1,\"Une seule réponse SVP !\",\"\")","v":""}]
["Habilitation pinces D-OMEGA T",null,null,null,null,null,null,null,"Saisir une valeur !",{"$f":"IF(COUNTA(C16:F16)>1,\"Une seule réponse SVP !\",\"\")","v":""}]
["Formation réglage gares",null,null,null,null,null,null,null,"Saisir une valeur !",{"$f":"IF(COUNTA(C17:F17)>1,\"Une seule réponse SVP !\",\"\")","v":""}]
["Formation réglage freins",null,null,null,null,null,null,null,"Saisir une valeur !",""]
["Epissures",null,null,null,null,null,null,null,"Saisir une valeur !",""]
["Habilitation travail en hauteur",null,null,null,null,null,null,null,"Saisir une valeur !",""]
[null,null,null,null,null,null,null,null,"Saisir une valeur !",""]
[null,null,null,null,null,null,null,null,"Saisir une valeur !",""]
[null,null,null,null,null,null,null,null,"Saisir une valeur !",""]
[null,null,null,null,null,null,null,null,"Saisir une valeur !",""]
[null,null,null,null,null,null,null,null,null,{"$f":"IF(AND(C25<>\"\",E25<>\"\"),\"Une seule réponse SVP !\",\"\")","v":""}]
["SAVOIR-FAIRE - TELESKI",null,null,null,null,null,{"$f":"COUNTA(A28:B34,A36:B40,A42:B49)*4","v":56},{"$f":"(SUM(C27:F27)+SUM(C35:F35)+SUM(C41:F41))/G26*20","v":0},null,""]
["Téleski - gare motrice",null,{"$f":"COUNTIF(C28:C34,\"=X\")*1","v":0},{"$f":"COUNTIF(D28:D34,\"=X\")*2","v":0},{"$f":"COUNTIF(E28:E34,\"=X\")*3","v":0},{"$f":"COUNTIF(F28:F34,\"=X\")*4","v":0}]
["Décablage - reprise de tension",null,null,null,null,null,null,null,{"$f":"IF(AND(C28=\"\",D28=\"\",E28=\"\",F28=\"\"),\"Saisir une valeur !\",\"\")","v":"Saisir une valeur !"},{"$f":"IF(COUNTA(C28:F28)>1,\"Une seule réponse SVP !\",\"\")","v":""}]
["Changement bandage, roulement",null,null,null,null,null,null,null,{"$f":"IF(AND(C29=\"\",D29=\"\",E29=\"\",F29=\"\"),\"Saisir une valeur !\",\"\")","v":"Saisir une valeur !"},{"$f":"IF(COUNTA(C29:F29)>1,\"Une seule réponse SVP !\",\"\")","v":""}]
["Réglage gare",null,null,null,null,null,null,null,"Saisir une valeur !",""]
["Changement protection gare",null,null,null,null,null,null,null,"Saisir une valeur !",""]
["Contrôle visuel du câble et épissure",null,null,null,null,null,null,null,"Saisir une valeur !",""]
[null,null,null,null,null,null,null,null,{"$f":"IF(AND(C33=\"\",D33=\"\",E33=\"\",F33=\"\"),\"Saisir une valeur !\",\"\")","v":"Saisir une valeur !"},""]
[null,null,null,null,null,null,null,null,{"$f":"IF(AND(C34=\"\",D34=\"\",E34=\"\",F34=\"\"),\"Saisir une valeur !\",\"\")","v":"Saisir une valeur !"},""]
["Téleski - ligne",null,{"$f":"COUNTIF(C36:C40,\"=X\")*1","v":0},{"$f":"COUNTIF(D36:D40,\"=X\")*2","v":0},{"$f":"COUNTIF(E36:E40,\"=X\")*3","v":0},{"$f":"COUNTIF(F36:F40,\"=X\")*4","v":0}]
["Pylônes - contrôle général",null,null,null,null,null,null,null,{"$f":"IF(AND(C36=\"\",D36=\"\",E36=\"\",F36=\"\"),\"Saisir une valeur !\",\"\")","v":"Saisir une valeur !"},{"$f":"IF(COUNTA(C36:F36)>1,\"Une seule réponse SVP !\",\"\")","v":""}]
["Décâblage",null,null,null,null,null,null,null,"Saisir une valeur !",""]
["Contrôle et changement bandage, roulements",null,null,null,null,null,null,null,"Saisir une valeur !",""]
[null,null,null,null,null,null,null,null,"Saisir une valeur !",""]
[null,null,null,null,null,null,null,null,"Saisir une valeur !",""]
["Téleski - poulie retour",null,{"$f":"COUNTIF(C42:C49,\"=X\")*1","v":0},{"$f":"COUNTIF(D42:D49,\"=X\")*2","v":0},{"$f":"COUNTIF(E42:E49,\"=X\")*3","v":0},{"$f":"COUNTIF(F42:F49,\"=X\")*4","v":0}]
["Pose de la poulie avec reprise de la tension",null,null,null,null,null,null,null,{"$f":"IF(AND(C42=\"\",D42=\"\",E42=\"\",F42=\"\"),\"Saisir une valeur !\",\"\")","v":"Saisir une valeur !"},{"$f":"IF(COUNTA(C42:F42)>1,\"Une seule réponse SVP !\",\"\")","v":""}]
["Contrôle et changement bandage, roulements",null,null,null,null,null,null,null,"Saisir une valeur !",""]
["Graissage",null,null,null,null,null,null,null,"Saisir une valeur !",""]
["Contrôle général",null,null,null,null,null,null,null,"Saisir une valeur !",""]
["Contrôle fonctionnement tir-fort",null,null,null,null,null,null,null,"Saisir une valeur !",""]
["Réparation perches et enrouleurs",null,null,null,null,null,null,null,"Saisir une valeur !",""]
[null,null,null,null,null,null,null,null,"Saisir une valeur !",""]
[null,null,null,null,null,null,null,null,"Saisir une valeur !",""]
[null,null,null,null,null,null,null,null,null,""]
["SAVOIR-FAIRE - TELESIEGES PINCES FIXES (TSF)",null,null,null,null,null,{"$f":"COUNTA(A53:B59,A61:B66,A68:B72)*4","v":48},{"$f":"(SUM(C52:F52)+SUM(C60:F60)+SUM(C67:F67))/G51*20","v":0},null,""]
["Télésiège - gare motrice",null,{"$f":"COUNTIF(C53:C59,\"=X\")*1","v":0},{"$f":"COUNTIF(D53:D59,\"=X\")*2","v":0},{"$f":"COUNTIF(E53:E59,\"=X\")*3","v":0},{"$f":"COUNTIF(F53:F59,\"=X\")*4","v":0}]
["Contrôle et réglage frein (changement plaquettes et rondelles belleville)",null,null,null,null,null,null,null,{"$f":"IF(AND(C53=\"\",D53=\"\",E53=\"\",F53=\"\"),\"Saisir une valeur !\",\"\")","v":"Saisir une valeur !"},{"$f":"IF(COUNTA(C53:F53)>1,\"Une seule réponse SVP !\",\"\")","v":""}]
["Points d graissage",null,null,null,null,null,null,null,"Saisir une valeur !",""]
["Contrôle courroie",null,null,null,null,null,null,null,"Saisir une valeur !",""]
["Réducteur (contrôle sonore, niveau huile, vidange)",null,null,null,null,null,null,null,"Saisir une valeur !",""]
["Contrôle moteur thermique",null,null,null,null,null,null,null,"Saisir une valeur !",""]
[null,null,null,null,null,null,null,null,"Saisir une valeur !",""]
[null,null,null,null,null,null,null,null,"Saisir une valeur !",""]
["Télésiège - ligne",null,{"$f":"COUNTIF(C61:C66,\"=X\")*1","v":0},{"$f":"COUNTIF(D61:D66,\"=X\")*2","v":0},{"$f":"COUNTIF(E61:E66,\"=X\")*3","v":0},{"$f":"COUNTIF(F61:F66,\"=X\")*4","v":0}]
["Pylônes - contrôle général",null,null,null,null,null,null,null,{"$f":"IF(AND(C61=\"\",D61=\"\",E61=\"\",F61=\"\"),\"Saisir une valeur !\",\"\")","v":"Saisir une valeur !"},{"$f":"IF(COUNTA(C61:F61)>1,\"Une seule réponse SVP !\",\"\")","v":""}]
["Décâblage et graissage hors charge",null,null,null,null,null,null,null,"Saisir une valeur !",""]
["Contrôle et changement bandage, roulements",null,null,null,null,null,null,null,"Saisir une valeur !",""]
["Changement de galet ",null,null,null,null,null,null,null,"Saisir une valeur !",""]
[null,null,null,null,null,null,null,null,"Saisir une valeur !",""]
[null,null,null,null,null,null,null,null,"Saisir une valeur !",""]
["Télésiège - poulie retour",null,{"$f":"COUNTIF(C68:C72,\"=X\")*1","v":0},{"$f":"COUNTIF(D68:D72,\"=X\")*2","v":0},{"$f":"COUNTIF(E68:E72,\"=X\")*3","v":0},{"$f":"COUNTIF(F68:F72,\"=X\")*4","v":0}]
["Graissage",null,null,null,null,null,null,null,{"$f":"IF(AND(C68=\"\",D68=\"\",E68=\"\",F68=\"\"),\"Saisir une valeur !\",\"\")","v":"Saisir une valeur !"},{"$f":"IF(COUNTA(C68:F68)>1,\"Une seule réponse SVP !\",\"\")","v":""}]
["Contrôle état général (fisure serrage boulonnerie contrôle massif + serrage des ancrages)",null,null,null,null,null,null,null,"Saisir une valeur !",""]
["Contrôle bandage",null,null,null,null,null,null,null,"Saisir une valeur !",""]
[null,null,null,null,null,null,null,null,"Saisir une valeur !",""]
[null,null,null,null,null,null,null,null,"Saisir une valeur !",""]
[null,null,null,null,null,null,null,null,null,""]
["SAVOIR-FAIRE - TELESIEGES DEBRAYABLES (TSD)",null,null,null,null,null,{"$f":"COUNTA(A76:B81,A83:B88,A90:B93)*4","v":40},{"$f":"(SUM(C75:F75)+SUM(C82:F82)+SUM(C89:F89))/G74*20","v":0},null,""]
["Télésiège - gare motrice",null,{"$f":"COUNTIF(C76:C81,\"=X\")*1","v":0},{"$f":"COUNTIF(D76:D81,\"=X\")*2","v":0},{"$f":"COUNTIF(E76:E81,\"=X\")*3","v":0},{"$f":"COUNTIF(F76:F81,\"=X\")*4","v":0}]
["Contrôle et réglage frein (changement plaquettes et rondelles belleville)",null,null,null,null,null,null,null,{"$f":"IF(AND(C76=\"\",D76=\"\",E76=\"\",F76=\"\"),\"Saisir une valeur !\",\"\")","v":"Saisir une valeur !"},{"$f":"IF(COUNTA(C76:F76)>1,\"Une seule réponse SVP !\",\"\")","v":""}]
["Contrôle et réglage gabarit de gare",null,null,null,null,null,null,null,"Saisir une valeur !",""]
["Contrôle état général (pneus, courroies, badage)",null,null,null,null,null,null,null,"Saisir une valeur !",""]
["Réducteur (contrôle sonore, niveau huile, vidange)",null,null,null,null,null,null,null,"Saisir une valeur !",""]
[null,null,null,null,null,null,null,null,"Saisir une valeur !",""]
[null,null,null,null,null,null,null,null,"Saisir une valeur !",""]
["Télésiège - ligne",null,{"$f":"COUNTIF(C83:C88,\"=X\")*1","v":0},{"$f":"COUNTIF(D83:D88,\"=X\")*2","v":0},{"$f":"COUNTIF(E83:E88,\"=X\")*3","v":0},{"$f":"COUNTIF(F83:F88,\"=X\")*4","v":0}]
["Pylônes - contrôle général",null,null,null,null,null,null,null,{"$f":"IF(AND(C83=\"\",D83=\"\",E83=\"\",F83=\"\"),\"Saisir une valeur !\",\"\")","v":"Saisir une valeur !"},{"$f":"IF(COUNTA(C83:F83)>1,\"Une seule réponse SVP !\",\"\")","v":""}]
["Décâblage et graissage hors charge",null,null,null,null,null,null,null,"Saisir une valeur !",""]
["Contrôle et changement bandage, roulements",null,null,null,null,null,null,null,"Saisir une valeur !",""]
["Changement de galets",null,null,null,null,null,null,null,"Saisir une valeur !",""]
[null,null,null,null,null,null,null,null,"Saisir une valeur !",""]
[null,null,null,null,null,null,null,null,"Saisir une valeur !",""]
["Télésiège - poulie retour",null,{"$f":"COUNTIF(C90:C93,\"=X\")*1","v":0},{"$f":"COUNTIF(D90:D93,\"=X\")*2","v":0},{"$f":"COUNTIF(E90:E93,\"=X\")*3","v":0},{"$f":"COUNTIF(F90:F93,\"=X\")*4","v":0}]
["Contrôle et réglage gabarit de gare",null,null,null,null,null,null,null,{"$f":"IF(AND(C90=\"\",D90=\"\",E90=\"\",F90=\"\"),\"Saisir une valeur !\",\"\")","v":"Saisir une valeur !"},{"$f":"IF(COUNTA(C90:F90)>1,\"Une seule réponse SVP !\",\"\")","v":""}]
["Contrôle état général (pneus, courroies, bandages)",null,null,null,null,null,null,null,"Saisir une valeur !",""]
[null,null,null,null,null,null,null,null,"Saisir une valeur !",""]
[null,null,null,null,null,null,null,null,"Saisir une valeur !",""]
[]
["SAVOIR-ETRE",null,{"$f":"COUNTIF(C96:C108,\"=X\")*1","v":0},{"$f":"COUNTIF(D96:D108,\"=X\")*2","v":0},{"$f":"COUNTIF(E96:E108,\"=X\")*3","v":0},{"$f":"COUNTIF(F96:F108,\"=X\")*4","v":0},{"$f":"COUNTA(A96:B108)*4","v":40},{"$f":"SUM(C95:F95)/G95*20","v":0}]
["Rigueur dans les contôles",null,null,null,null,null,null,null,{"$f":"IF(AND(C96=\"\",D96=\"\",E96=\"\",F96=\"\"),\"Saisir une valeur !\",\"\")","v":"Saisir une valeur !"},{"$f":"IF(COUNTA(C96:F96)>1,\"Une seule réponse SVP !\",\"\")","v":""}]
["Respect et propreté du matériel et des batiments ",null,null,null,null,null,null,null,"Saisir une valeur !",""]
["Prise d'initiative",null,null,null,null,null,null,null,"Saisir une valeur !",""]
["Ponctualité",null,null,null,null,null,null,null,"Saisir une valeur !",""]
["Respect de la sécurité (EPI, collègues de travail)",null,null,null,null,null,null,null,"Saisir une valeur !",""]
["Maîtrise de soi",null,null,null,null,null,null,null,"Saisir une valeur !",""]
["Discrétion professionnelle",null,null,null,null,null,null,null,"Saisir une valeur !",""]
["Respect de la hiérarchie",null,null,null,null,null,null,null,"Saisir une valeur !",""]
["Adaptabilité",null,null,null,null,null,null,null,"Saisir une valeur !",""]
["Motivation",null,null,null,null,null,null,null,"Saisir une valeur !",""]
[null,null,null,null,null,null,null,null,"Saisir une valeur !",""]
[null,null,null,null,null,null,null,null,"Saisir une valeur !",""]
[null,null,null,null,null,null,null,null,"Saisir une valeur !",""]
[]
["SYNTESE"]
[null,null,null,null,null,null,{"$f":"B3","v":"SALARIE 4"},{"$f":"'SYNTHESE EQUIPE'!L3","v":"Σ EQUIPE"},"OBJECTIF SALARIE FIXE"]
[{"$f":"A11","v":"FORMATION"},null,null,null,null,null,{"$f":"H11","v":0},{"$f":"'SYNTHESE EQUIPE'!L4","v":20},10]
[{"$f":"A26","v":"SAVOIR-FAIRE - TELESKI"},null,null,null,null,null,{"$f":"H26","v":0},{"$f":"'SYNTHESE EQUIPE'!L5","v":17.142857142857142},10]
[{"$f":"A51","v":"SAVOIR-FAIRE - TELESIEGES PINCES FIXES (TSF)"},null,null,null,null,null,{"$f":"H51","v":0},{"$f":"'SYNTHESE EQUIPE'!L6","v":11.25},10]
[{"$f":"A74","v":"SAVOIR-FAIRE - TELESIEGES DEBRAYABLES (TSD)"},null,null,null,null,null,{"$f":"H74","v":0},{"$f":"'SYNTHESE EQUIPE'!L7","v":14.5},10]
[{"$f":"A95","v":"SAVOIR-ETRE"},null,null,null,null,null,{"$f":"H95","v":0},{"$f":"'SYNTHESE EQUIPE'!L8","v":11.818181818181818},10]

{"sheet":"SALARIE 5","index":4,"n_rows":116,"n_cols":11,"rows_kept":116,"cut":false,"hidden":false,"merged":[[11,0,11,1],[11,2,11,3],[11,4,11,5],[11,6,11,7],[12,0,12,1],[12,2,12,3],[12,4,12,5],[12,6,12,7],[4,2,4,7],[10,0,10,1],[10,2,10,3],[10,4,10,5],[15,0,15,1],[15,2,15,3],[15,4,15,5],[15,6,15,7],[16,0,16,1],[16,2,16,3],[16,4,16,5],[16,6,16,7],[13,0,13,1],[13,2,13,3],[13,4,13,5],[13,6,13,7],[14,0,14,1],[14,2,14,3],[14,4,14,5],[14,6,14,7],[19,0,19,1],[19,2,19,3],[19,4,19,5],[19,6,19,7],[20,0,20,1],[20,2,20,3],[20,4,20,5],[20,6,20,7],[17,0,17,1],[17,2,17,3],[17,4,17,5],[17,6,17,7],[18,0,18,1],[18,2,18,3],[18,4,18,5],[18,6,18,7],[23,0,23,1],[23,2,23,3],[23,4,23,5],[23,6,23,7],[24,0,24,7],[21,0,21,1],[21,2,21,3],[21,4,21,5],[21,6,21,7],[22,0,22,1],[22,2,22,3],[22,4,22,5],[22,6,22,7],[31,0,31,1],[33,0,33,1],[34,0,34,1],[34,6,34,7],[35,0,35,1],[36,0,36,1],[35,6,35,7],[36,6,36,7],[26,0,26,1],[26,6,26,7],[27,0,27,1],[28,0,28,1],[29,0,29,1],[30,0,30,1],[37,0,37,1],[39,0,39,1],[40,0,40,1],[40,6,40,7],[41,0,41,1],[50,0,50,1],[37,6,37,7],[38,0,38,1],[38,6,38,7],[39,6,39,7],[42,6,42,7],[43,0,43,1],[43,6,43,7],[44,0,44,1],[44,6,44,7],[51,0,51,1],[51,6,51,7],[52,0,52,1],[53,0,53,1],[54,0,54,1],[55,0,55,1],[52,6,52,7],[53,6,53,7],[54,6,54,7],[55,6,55,7],[56,0,56,1],[59,0,59,1],[59,6,59,7],[60,0,60,1],[61,0,61,1],[62,0,62,1],[56,6,56,7],[57,0,57,1],[57,6,57,7],[58,0,58,1],[63,0,63,1],[65,0,65,1],[66,0,66,1],[66,6,66,7],[67,0,67,1],[68,0,68,1],[65,6,65,7],[67,6,67,7],[68,6,68,7],[77,0,77,1],[78,0,78,1],[80,0,80,1],[81,0,81,1],[81,6,81,7],[82,0,82,1],[80,6,80,7],[82,6,82,7],[69,0,69,1],[72,0,72,7],[74,0,74,1],[74,6,74,7],[75,0,75,1],[76,0,76,1],[69,6,69,7],[70,0,70,1],[70,6,70,7],[71,0,71,1],[83,0,83,1],[84,0,84,1],[85,0,85,1],[87,0,87,1],[88,0,88,1],[88,6,88,7],[83,6,83,7],[84,6,84,7],[85,6,85,7],[86,0,86,1],[101,0,101,1],[89,0,89,1],[90,0,90,1],[92,0,92,1],[93,0,93,7],[94,0,94,1],[95,0,95,1],[92,6,92,7],[95,6,95,7],[110,0,110,5],[7,0,7,9],[27,6,27,7],[28,6,28,7],[29,6,29,7],[30,6,30,7],[31,6,31,7],[32,0,32,1],[32,6,32,7],[33,6,33,7],[102,0,102,1],[103,0,103,1],[104,0,104,1],[105,0,105,1],[106,0,106,1],[102,6,102,7],[103,6,103,7],[104,6,104,7],[105,6,105,7],[96,0,96,1],[97,0,97,1],[98,0,98,1],[99,0,99,1],[100,0,100,1],[0,0,0,9],[2,5,2,9],[3,2,3,4],[3,5,3,9],[96,6,96,7],[97,6,97,7],[98,6,98,7],[99,6,99,7],[100,6,100,7],[86,6,86,7],[87,6,87,7],[89,6,89,7],[90,6,90,7],[91,0,91,1],[91,6,91,7],[71,6,71,7],[75,6,75,7],[76,6,76,7],[77,6,77,7],[78,6,78,7],[79,0,79,1],[79,6,79,7],[58,6,58,7],[60,6,60,7],[115,0,115,5],[9,6,9,7],[110,8,110,9],[109,0,109,9],[111,0,111,5],[112,0,112,5],[113,0,113,5],[114,0,114,5],[106,6,106,7],[107,0,107,1],[107,6,107,7],[101,6,101,7],[61,6,61,7],[62,6,62,7],[63,6,63,7],[64,0,64,1],[64,6,64,7],[45,6,45,7],[46,6,46,7],[47,0,47,1],[47,6,47,7],[48,0,48,1],[48,6,48,7],[41,6,41,7]]}
["OUVRIER ENTRETIEN MECANIQUE",null,null,null,null,null,null,null,null,null,"X"]
[]
["Nom :","SALARIE 5","Dâte d'entrée :"]
["Prénom :",null,"Service :"]
["Poste occupé :"]
[]
[]
["NA = non acquis        ECA = en cours d'acquisition          A = acquis          M = maîtrisé"]
[]
[null,null,"NA","ECA","A","M","Commentaires"]
["FORMATION",null,{"$f":"COUNTIF(C12:D24,\"=X\")*0","v":0},null,{"$f":"COUNTIF(E12:F24,\"=X\")*1","v":0},null,{"$f":"COUNTA(A12:B24)*1","v":9},{"$f":"SUM(C11:F11)/G11*20","v":0}]
["Habilitation électrique",null,null,null,null,null,null,null,{"$f":"IF(AND(C12=\"\",E12=\"\"),\"Saisir une valeur !\",\"\")","v":"Saisir une valeur !"},{"$f":"IF(COUNTA(C12:F12)>1,\"Une seule réponse SVP !\",\"\")","v":""}]
["Formation SST",null,null,null,null,null,null,null,{"$f":"IF(AND(C13=\"\",E13=\"\"),\"Saisir une valeur !\",\"\")","v":"Saisir une valeur !"},{"$f":"IF(COUNTA(C13:F13)>1,\"Une seule réponse SVP !\",\"\")","v":""}]
["Habilitation pinces LPA",null,null,null,null,null,null,null,"Saisir une valeur !",{"$f":"IF(COUNTA(C14:F14)>1,\"Une seule réponse SVP !\",\"\")","v":""}]
["Habilitation pinces LA672",null,null,null,null,null,null,null,"Saisir une valeur !",{"$f":"IF(COUNTA(C15:F15)>1,\"Une seule réponse SVP !\",\"\")","v":""}]
["Habilitation pinces D-OMEGA T",null,null,null,null,null,null,null,"Saisir une valeur !",{"$f":"IF(COUNTA(C16:F16)>1,\"Une seule réponse SVP !\",\"\")","v":""}]
["Formation réglage gares",null,null,null,null,null,null,null,"Saisir une valeur !",{"$f":"IF(COUNTA(C17:F17)>1,\"Une seule réponse SVP !\",\"\")","v":""}]
["Formation réglage freins",null,null,null,null,null,null,null,"Saisir une valeur !",""]
["Epissures",null,null,null,null,null,null,null,"Saisir une valeur !",""]
["Habilitation travail en hauteur",null,null,null,null,null,null,null,"Saisir une valeur !",""]
[null,null,null,null,null,null,null,null,"Saisir une valeur !",""]
[null,null,null,null,null,null,null,null,"Saisir une valeur !",""]
[null,null,null,null,null,null,null,null,"Saisir une valeur !",""]
[null,null,null,null,null,null,null,null,"Saisir une valeur !",""]
[null,null,null,null,null,null,null,null,null,{"$f":"IF(AND(C25<>\"\",E25<>\"\"),\"Une seule réponse SVP !\",\"\")","v":""}]
["SAVOIR-FAIRE - TELESKI",null,null,null,null,null,{"$f":"COUNTA(A28:B34,A36:B40,A42:B49)*4","v":56},{"$f":"(SUM(C27:F27)+SUM(C35:F35)+SUM(C41:F41))/G26*20","v":0},null,""]
["Téleski - gare motrice",null,{"$f":"COUNTIF(C28:C34,\"=X\")*1","v":0},{"$f":"COUNTIF(D28:D34,\"=X\")*2","v":0},{"$f":"COUNTIF(E28:E34,\"=X\")*3","v":0},{"$f":"COUNTIF(F28:F34,\"=X\")*4","v":0}]
["Décablage - reprise de tension",null,null,null,null,null,null,null,{"$f":"IF(AND(C28=\"\",D28=\"\",E28=\"\",F28=\"\"),\"Saisir une valeur !\",\"\")","v":"Saisir une valeur !"},{"$f":"IF(COUNTA(C28:F28)>1,\"Une seule réponse SVP !\",\"\")","v":""}]
["Changement bandage, roulement",null,null,null,null,null,null,null,{"$f":"IF(AND(C29=\"\",D29=\"\",E29=\"\",F29=\"\"),\"Saisir une valeur !\",\"\")","v":"Saisir une valeur !"},{"$f":"IF(COUNTA(C29:F29)>1,\"Une seule réponse SVP !\",\"\")","v":""}]
["Réglage gare",null,null,null,null,null,null,null,"Saisir une valeur !",""]
["Changement protection gare",null,null,null,null,null,null,null,"Saisir une valeur !",""]
["Contrôle visuel du câble et épissure",null,null,null,null,null,null,null,"Saisir une valeur !",""]
[null,null,null,null,null,null,null,null,{"$f":"IF(AND(C33=\"\",D33=\"\",E33=\"\",F33=\"\"),\"Saisir une valeur !\",\"\")","v":"Saisir une valeur !"},""]
[null,null,null,null,null,null,null,null,{"$f":"IF(AND(C34=\"\",D34=\"\",E34=\"\",F34=\"\"),\"Saisir une valeur !\",\"\")","v":"Saisir une valeur !"},""]
["Téleski - ligne",null,{"$f":"COUNTIF(C36:C40,\"=X\")*1","v":0},{"$f":"COUNTIF(D36:D40,\"=X\")*2","v":0},{"$f":"COUNTIF(E36:E40,\"=X\")*3","v":0},{"$f":"COUNTIF(F36:F40,\"=X\")*4","v":0}]
["Pylônes - contrôle général",null,null,null,null,null,null,null,{"$f":"IF(AND(C36=\"\",D36=\"\",E36=\"\",F36=\"\"),\"Saisir une valeur !\",\"\")","v":"Saisir une valeur !"},{"$f":"IF(COUNTA(C36:F36)>1,\"Une seule réponse SVP !\",\"\")","v":""}]
["Décâblage",null,null,null,null,null,null,null,"Saisir une valeur !",""]
["Contrôle et changement bandage, roulements",null,null,null,null,null,null,null,"Saisir une valeur !",""]
[null,null,null,null,null,null,null,null,"Saisir une valeur !",""]
[null,null,null,null,null,null,null,null,"Saisir une valeur !",""]
["Téleski - poulie retour",null,{"$f":"COUNTIF(C42:C49,\"=X\")*1","v":0},{"$f":"COUNTIF(D42:D49,\"=X\")*2","v":0},{"$f":"COUNTIF(E42:E49,\"=X\")*3","v":0},{"$f":"COUNTIF(F42:F49,\"=X\")*4","v":0}]
["Pose de la poulie avec reprise de la tension",null,null,null,null,null,null,null,{"$f":"IF(AND(C42=\"\",D42=\"\",E42=\"\",F42=\"\"),\"Saisir une valeur !\",\"\")","v":"Saisir une valeur !"},{"$f":"IF(COUNTA(C42:F42)>1,\"Une seule réponse SVP !\",\"\")","v":""}]
["Contrôle et changement bandage, roulements",null,null,null,null,null,null,null,"Saisir une valeur !",""]
["Graissage",null,null,null,null,null,null,null,"Saisir une valeur !",""]
["Contrôle général",null,null,null,null,null,null,null,"Saisir une valeur !",""]
["Contrôle fonctionnement tir-fort",null,null,null,null,null,null,null,"Saisir une valeur !",""]
["Réparation perches et enrouleurs",null,null,null,null,null,null,null,"Saisir une valeur !",""]
[null,null,null,null,null,null,null,null,"Saisir une valeur !",""]
[null,null,null,null,null,null,null,null,"Saisir une valeur !",""]
[null,null,null,null,null,null,null,null,null,""]
["SAVOIR-FAIRE - TELESIEGES PINCES FIXES (TSF)",null,null,null,null,null,{"$f":"COUNTA(A53:B59,A61:B66,A68:B72)*4","v":48},{"$f":"(SUM(C52:F52)+SUM(C60:F60)+SUM(C67:F67))/G51*20","v":0},null,""]
["Télésiège - gare motrice",null,{"$f":"COUNTIF(C53:C59,\"=X\")*1","v":0},{"$f":"COUNTIF(D53:D59,\"=X\")*2","v":0},{"$f":"COUNTIF(E53:E59,\"=X\")*3","v":0},{"$f":"COUNTIF(F53:F59,\"=X\")*4","v":0}]
["Contrôle et réglage frein (changement plaquettes et rondelles belleville)",null,null,null,null,null,null,null,{"$f":"IF(AND(C53=\"\",D53=\"\",E53=\"\",F53=\"\"),\"Saisir une valeur !\",\"\")","v":"Saisir une valeur !"},{"$f":"IF(COUNTA(C53:F53)>1,\"Une seule réponse SVP !\",\"\")","v":""}]
["Points d graissage",null,null,null,null,null,null,null,"Saisir une valeur !",""]
["Contrôle courroie",null,null,null,null,null,null,null,"Saisir une valeur !",""]
["Réducteur (contrôle sonore, niveau huile, vidange)",null,null,null,null,null,null,null,"Saisir une valeur !",""]
["Contrôle moteur thermique",null,null,null,null,null,null,null,"Saisir une valeur !",""]
[null,null,null,null,null,null,null,null,"Saisir une valeur !",""]
[null,null,null,null,null,null,null,null,"Saisir une valeur !",""]
["Télésiège - ligne",null,{"$f":"COUNTIF(C61:C66,\"=X\")*1","v":0},{"$f":"COUNTIF(D61:D66,\"=X\")*2","v":0},{"$f":"COUNTIF(E61:E66,\"=X\")*3","v":0},{"$f":"COUNTIF(F61:F66,\"=X\")*4","v":0}]
["Pylônes - contrôle général",null,null,null,null,null,null,null,{"$f":"IF(AND(C61=\"\",D61=\"\",E61=\"\",F61=\"\"),\"Saisir une valeur !\",\"\")","v":"Saisir une valeur !"},{"$f":"IF(COUNTA(C61:F61)>1,\"Une seule réponse SVP !\",\"\")","v":""}]
["Décâblage et graissage hors charge",null,null,null,null,null,null,null,"Saisir une valeur !",""]
["Contrôle et changement bandage, roulements",null,null,null,null,null,null,null,"Saisir une valeur !",""]
["Changement de galet ",null,null,null,null,null,null,null,"Saisir une valeur !",""]
[null,null,null,null,null,null,null,null,"Saisir une valeur !",""]
[null,null,null,null,null,null,null,null,"Saisir une valeur !",""]
["Télésiège - poulie retour",null,{"$f":"COUNTIF(C68:C72,\"=X\")*1","v":0},{"$f":"COUNTIF(D68:D72,\"=X\")*2","v":0},{"$f":"COUNTIF(E68:E72,\"=X\")*3","v":0},{"$f":"COUNTIF(F68:F72,\"=X\")*4","v":0}]
["Graissage",null,null,null,null,null,null,null,{"$f":"IF(AND(C68=\"\",D68=\"\",E68=\"\",F68=\"\"),\"Saisir une valeur !\",\"\")","v":"Saisir une valeur !"},{"$f":"IF(COUNTA(C68:F68)>1,\"Une seule réponse SVP !\",\"\")","v":""}]
["Contrôle état général (fisure serrage boulonnerie contrôle massif + serrage des ancrages)",null,null,null,null,null,null,null,"Saisir une valeur !",""]
["Contrôle bandage",null,null,null,null,null,null,null,"Saisir une valeur !",""]
[null,null,null,null,null,null,null,null,"Saisir une valeur !",""]
[null,null,null,null,null,null,null,null,"Saisir une valeur !",""]
[null,null,null,null,null,null,null,null,null,""]
["SAVOIR-FAIRE - TELESIEGES DEBRAYABLES (TSD)",null,null,null,null,null,{"$f":"COUNTA(A76:B81,A83:B88,A90:B93)*4","v":40},{"$f":"(SUM(C75:F75)+SUM(C82:F82)+SUM(C89:F89))/G74*20","v":0},null,""]
["Télésiège - gare motrice",null,{"$f":"COUNTIF(C76:C81,\"=X\")*1","v":0},{"$f":"COUNTIF(D76:D81,\"=X\")*2","v":0},{"$f":"COUNTIF(E76:E81,\"=X\")*3","v":0},{"$f":"COUNTIF(F76:F81,\"=X\")*4","v":0}]
["Contrôle et réglage frein (changement plaquettes et rondelles belleville)",null,null,null,null,null,null,null,{"$f":"IF(AND(C76=\"\",D76=\"\",E76=\"\",F76=\"\"),\"Saisir une valeur !\",\"\")","v":"Saisir une valeur !"},{"$f":"IF(COUNTA(C76:F76)>1,\"Une seule réponse SVP !\",\"\")","v":""}]
["Contrôle et réglage gabarit de gare",null,null,null,null,null,null,null,"Saisir une valeur !",""]
["Contrôle état général (pneus, courroies, badage)",null,null,null,null,null,null,null,"Saisir une valeur !",""]
["Réducteur (contrôle sonore, niveau huile, vidange)",null,null,null,null,null,null,null,"Saisir une valeur !",""]
[null,null,null,null,null,null,null,null,"Saisir une valeur !",""]
[null,null,null,null,null,null,null,null,"Saisir une valeur !",""]
["Télésiège - ligne",null,{"$f":"COUNTIF(C83:C88,\"=X\")*1","v":0},{"$f":"COUNTIF(D83:D88,\"=X\")*2","v":0},{"$f":"COUNTIF(E83:E88,\"=X\")*3","v":0},{"$f":"COUNTIF(F83:F88,\"=X\")*4","v":0}]
["Pylônes - contrôle général",null,null,null,null,null,null,null,{"$f":"IF(AND(C83=\"\",D83=\"\",E83=\"\",F83=\"\"),\"Saisir une valeur !\",\"\")","v":"Saisir une valeur !"},{"$f":"IF(COUNTA(C83:F83)>1,\"Une seule réponse SVP !\",\"\")","v":""}]
["Décâblage et graissage hors charge",null,null,null,null,null,null,null,"Saisir une valeur !",""]
["Contrôle et changement bandage, roulements",null,null,null,null,null,null,null,"Saisir une valeur !",""]
["Changement de galets",null,null,null,null,null,null,null,"Saisir une valeur !",""]
[null,null,null,null,null,null,null,null,"Saisir une valeur !",""]
[null,null,null,null,null,null,null,null,"Saisir une valeur !",""]
["Télésiège - poulie retour",null,{"$f":"COUNTIF(C90:C93,\"=X\")*1","v":0},{"$f":"COUNTIF(D90:D93,\"=X\")*2","v":0},{"$f":"COUNTIF(E90:E93,\"=X\")*3","v":0},{"$f":"COUNTIF(F90:F93,\"=X\")*4","v":0}]
["Contrôle et réglage gabarit de gare",null,null,null,null,null,null,null,{"$f":"IF(AND(C90=\"\",D90=\"\",E90=\"\",F90=\"\"),\"Saisir une valeur !\",\"\")","v":"Saisir une valeur !"},{"$f":"IF(COUNTA(C90:F90)>1,\"Une seule réponse SVP !\",\"\")","v":""}]
["Contrôle état général (pneus, courroies, bandages)",null,null,null,null,null,null,null,"Saisir une valeur !",""]
[null,null,null,null,null,null,null,null,"Saisir une valeur !",""]
[null,null,null,null,null,null,null,null,"Saisir une valeur !",""]
[]
["SAVOIR-ETRE",null,{"$f":"COUNTIF(C96:C108,\"=X\")*1","v":0},{"$f":"COUNTIF(D96:D108,\"=X\")*2","v":0},{"$f":"COUNTIF(E96:E108,\"=X\")*3","v":0},{"$f":"COUNTIF(F96:F108,\"=X\")*4","v":0},{"$f":"COUNTA(A96:B108)*4","v":40},{"$f":"SUM(C95:F95)/G95*20","v":0}]
["Rigueur dans les contôles",null,null,null,null,null,null,null,{"$f":"IF(AND(C96=\"\",D96=\"\",E96=\"\",F96=\"\"),\"Saisir une valeur !\",\"\")","v":"Saisir une valeur !"},{"$f":"IF(COUNTA(C96:F96)>1,\"Une seule réponse SVP !\",\"\")","v":""}]
["Respect et propreté du matériel et des batiments ",null,null,null,null,null,null,null,"Saisir une valeur !",""]
["Prise d'initiative",null,null,null,null,null,null,null,"Saisir une valeur !",""]
["Ponctualité",null,null,null,null,null,null,null,"Saisir une valeur !",""]
["Respect de la sécurité (EPI, collègues de travail)",null,null,null,null,null,null,null,"Saisir une valeur !",""]
["Maîtrise de soi",null,null,null,null,null,null,null,"Saisir une valeur !",""]
["Discrétion professionnelle",null,null,null,null,null,null,null,"Saisir une valeur !",""]
["Respect de la hiérarchie",null,null,null,null,null,null,null,"Saisir une valeur !",""]
["Adaptabilité",null,null,null,null,null,null,null,"Saisir une valeur !",""]
["Motivation",null,null,null,null,null,null,null,"Saisir une valeur !",""]
[null,null,null,null,null,null,null,null,"Saisir une valeur !",""]
[null,null,null,null,null,null,null,null,"Saisir une valeur !",""]
[null,null,null,null,null,null,null,null,"Saisir une valeur !",""]
[]
["SYNTESE"]
[null,null,null,null,null,null,{"$f":"B3","v":"SALARIE 5"},{"$f":"'SYNTHESE EQUIPE'!L3","v":"Σ EQUIPE"},"OBJECTIF SALARIE FIXE"]
[{"$f":"A11","v":"FORMATION"},null,null,null,null,null,{"$f":"H11","v":0},{"$f":"'SYNTHESE EQUIPE'!L4","v":20},10]
[{"$f":"A26","v":"SAVOIR-FAIRE - TELESKI"},null,null,null,null,null,{"$f":"H26","v":0},{"$f":"'SYNTHESE EQUIPE'!L5","v":17.142857142857142},10]
[{"$f":"A51","v":"SAVOIR-FAIRE - TELESIEGES PINCES FIXES (TSF)"},null,null,null,null,null,{"$f":"H51","v":0},{"$f":"'SYNTHESE EQUIPE'!L6","v":11.25},10]
[{"$f":"A74","v":"SAVOIR-FAIRE - TELESIEGES DEBRAYABLES (TSD)"},null,null,null,null,null,{"$f":"H74","v":0},{"$f":"'SYNTHESE EQUIPE'!L7","v":14.5},10]
[{"$f":"A95","v":"SAVOIR-ETRE"},null,null,null,null,null,{"$f":"H95","v":0},{"$f":"'SYNTHESE EQUIPE'!L8","v":11.818181818181818},10]

{"sheet":"SALARIE 6","index":5,"n_rows":116,"n_cols":10,"rows_kept":116,"cut":false,"hidden":false,"merged":[[4,2,4,7],[10,0,10,1],[10,2,10,3],[10,4,10,5],[13,0,13,1],[13,2,13,3],[13,4,13,5],[13,6,13,7],[14,0,14,1],[14,2,14,3],[14,4,14,5],[14,6,14,7],[11,0,11,1],[11,2,11,3],[11,4,11,5],[11,6,11,7],[12,0,12,1],[12,2,12,3],[12,4,12,5],[12,6,12,7],[17,0,17,1],[17,2,17,3],[17,4,17,5],[17,6,17,7],[18,0,18,1],[18,2,18,3],[18,4,18,5],[18,6,18,7],[15,0,15,1],[15,2,15,3],[15,4,15,5],[15,6,15,7],[16,0,16,1],[16,2,16,3],[16,4,16,5],[16,6,16,7],[21,0,21,1],[21,2,21,3],[21,4,21,5],[21,6,21,7],[22,0,22,1],[22,2,22,3],[22,4,22,5],[22,6,22,7],[19,0,19,1],[19,2,19,3],[19,4,19,5],[19,6,19,7],[20,0,20,1],[20,2,20,3],[20,4,20,5],[20,6,20,7],[26,0,26,1],[26,6,26,7],[27,0,27,1],[28,0,28,1],[29,0,29,1],[30,0,30,1],[23,0,23,1],[23,2,23,3],[23,4,23,5],[23,6,23,7],[24,0,24,7],[31,0,31,1],[33,0,33,1],[34,0,34,1],[34,6,34,7],[35,0,35,1],[36,0,36,1],[32,6,32,7],[33,6,33,7],[35,6,35,7],[36,6,36,7],[37,0,37,1],[39,0,39,1],[40,0,40,1],[40,6,40,7],[41,0,41,1],[50,0,50,1],[37,6,37,7],[38,0,38,1],[38,6,38,7],[39,6,39,7],[45,6,45,7],[46,6,46,7],[47,0,47,1],[47,6,47,7],[48,0,48,1],[48,6,48,7],[41,6,41,7],[42,6,42,7],[43,0,43,1],[43,6,43,7],[44,0,44,1],[44,6,44,7],[51,0,51,1],[51,6,51,7],[52,0,52,1],[53,0,53,1],[54,0,54,1],[55,0,55,1],[52,6,52,7],[53,6,53,7],[54,6,54,7],[55,6,55,7],[56,0,56,1],[59,0,59,1],[59,6,59,7],[60,0,60,1],[61,0,61,1],[62,0,62,1],[56,6,56,7],[57,0,57,1],[57,6,57,7],[58,0,58,1],[58,6,58,7],[60,6,60,7],[61,6,61,7],[62,6,62,7],[80,0,80,1],[81,0,81,1],[81,6,81,7],[82,0,82,1],[80,6,80,7],[82,6,82,7],[69,0,69,1],[72,0,72,7],[74,0,74,1],[74,6,74,7],[75,0,75,1],[76,0,76,1],[69,6,69,7],[70,0,70,1],[70,6,70,7],[71,0,71,1],[78,6,78,7],[79,0,79,1],[79,6,79,7],[83,0,83,1],[84,0,84,1],[85,0,85,1],[87,0,87,1],[88,0,88,1],[88,6,88,7],[83,6,83,7],[84,6,84,7],[85,6,85,7],[86,0,86,1],[101,0,101,1],[89,0,89,1],[90,0,90,1],[92,0,92,1],[93,0,93,7],[94,0,94,1],[95,0,95,1],[92,6,92,7],[95,6,95,7],[110,0,110,5],[110,8,110,9],[109,0,109,9],[7,0,7,9],[27,6,27,7],[28,6,28,7],[29,6,29,7],[30,6,30,7],[31,6,31,7],[32,0,32,1],[102,0,102,1],[103,0,103,1],[104,0,104,1],[105,0,105,1],[106,0,106,1],[102,6,102,7],[103,6,103,7],[104,6,104,7],[105,6,105,7],[96,0,96,1],[97,0,97,1],[98,0,98,1],[99,0,99,1],[100,0,100,1],[63,6,63,7],[64,0,64,1],[64,6,64,7],[77,0,77,1],[78,0,78,1],[63,0,63,1],[65,0,65,1],[66,0,66,1],[66,6,66,7],[67,0,67,1],[68,0,68,1],[65,6,65,7],[67,6,67,7],[68,6,68,7],[106,6,106,7],[107,0,107,1],[107,6,107,7],[0,0,0,9],[2,5,2,9],[3,2,3,4],[3,5,3,9],[9,6,9,7],[96,6,96,7],[97,6,97,7],[98,6,98,7],[99,6,99,7],[100,6,100,7],[101,6,101,7],[86,6,86,7],[87,6,87,7],[89,6,89,7],[90,6,90,7],[91,0,91,1],[91,6,91,7],[71,6,71,7],[75,6,75,7],[76,6,76,7],[77,6,77,7]]}
["OUVRIER ENTRETIEN MECANIQUE"]
[]
["Nom :","rrrrr","Dâte d'entrée :"]
["Prénom :",null,"Service :"]
["Poste occupé :"]
[]
[]
["NA = non acquis        ECA = en cours d'acquisition          A = acquis          M = maîtrisé"]
[]
[null,null,"NA","ECA","A","M","Commentaires"]
["FORMATION",null,{"$f":"COUNTIF(C12:D24,\"=X\")*0","v":0},null,{"$f":"COUNTIF(E12:F24,\"=X\")*1","v":0},null,{"$f":"COUNTA(A12:B24)*1","v":9},{"$f":"SUM(C11:F11)/G11*20","v":0}]
["Habilitation électrique",null,null,null,null,null,null,null,{"$f":"IF(AND(C12=\"\",E12=\"\"),\"Saisir une valeur !\",\"\")","v":"Saisir une valeur !"},{"$f":"IF(COUNTA(C12:F12)>1,\"Une seule réponse SVP !\",\"\")","v":""}]
["Formation SST",null,null,null,null,null,null,null,{"$f":"IF(AND(C13=\"\",E13=\"\"),\"Saisir une valeur !\",\"\")","v":"Saisir une valeur !"},{"$f":"IF(COUNTA(C13:F13)>1,\"Une seule réponse SVP !\",\"\")","v":""}]
["Habilitation pinces LPA",null,null,null,null,null,null,null,"Saisir une valeur !",{"$f":"IF(COUNTA(C14:F14)>1,\"Une seule réponse SVP !\",\"\")","v":""}]
["Habilitation pinces LA672",null,null,null,null,null,null,null,"Saisir une valeur !",{"$f":"IF(COUNTA(C15:F15)>1,\"Une seule réponse SVP !\",\"\")","v":""}]
["Habilitation pinces D-OMEGA T",null,null,null,null,null,null,null,"Saisir une valeur !",{"$f":"IF(COUNTA(C16:F16)>1,\"Une seule réponse SVP !\",\"\")","v":""}]
["Formation réglage gares",null,null,null,null,null,null,null,"Saisir une valeur !",{"$f":"IF(COUNTA(C17:F17)>1,\"Une seule réponse SVP !\",\"\")","v":""}]
["Formation réglage freins",null,null,null,null,null,null,null,"Saisir une valeur !",""]
["Epissures",null,null,null,null,null,null,null,"Saisir une valeur !",""]
["Habilitation travail en hauteur",null,null,null,null,null,null,null,"Saisir une valeur !",""]
[null,null,null,null,null,null,null,null,"Saisir une valeur !",""]
[null,null,null,null,null,null,null,null,"Saisir une valeur !",""]
[null,null,null,null,null,null,null,null,"Saisir une valeur !",""]
[null,null,null,null,null,null,null,null,"Saisir une valeur !",""]
[null,null,null,null,null,null,null,null,null,{"$f":"IF(AND(C25<>\"\",E25<>\"\"),\"Une seule réponse SVP !\",\"\")","v":""}]
["SAVOIR-FAIRE - TELESKI",null,null,null,null,null,{"$f":"COUNTA(A28:B34,A36:B40,A42:B49)*4","v":56},{"$f":"(SUM(C27:F27)+SUM(C35:F35)+SUM(C41:F41))/G26*20","v":0},null,""]
["Téleski - gare motrice",null,{"$f":"COUNTIF(C28:C34,\"=X\")*1","v":0},{"$f":"COUNTIF(D28:D34,\"=X\")*2","v":0},{"$f":"COUNTIF(E28:E34,\"=X\")*3","v":0},{"$f":"COUNTIF(F28:F34,\"=X\")*4","v":0}]
["Décablage - reprise de tension",null,null,null,null,null,null,null,{"$f":"IF(AND(C28=\"\",D28=\"\",E28=\"\",F28=\"\"),\"Saisir une valeur !\",\"\")","v":"Saisir une valeur !"},{"$f":"IF(COUNTA(C28:F28)>1,\"Une seule réponse SVP !\",\"\")","v":""}]
["Changement bandage, roulement",null,null,null,null,null,null,null,{"$f":"IF(AND(C29=\"\",D29=\"\",E29=\"\",F29=\"\"),\"Saisir une valeur !\",\"\")","v":"Saisir une valeur !"},{"$f":"IF(COUNTA(C29:F29)>1,\"Une seule réponse SVP !\",\"\")","v":""}]
["Réglage gare",null,null,null,null,null,null,null,"Saisir une valeur !",""]
["Changement protection gare",null,null,null,null,null,null,null,"Saisir une valeur !",""]
["Contrôle visuel du câble et épissure",null,null,null,null,null,null,null,"Saisir une valeur !",""]
[null,null,null,null,null,null,null,null,{"$f":"IF(AND(C33=\"\",D33=\"\",E33=\"\",F33=\"\"),\"Saisir une valeur !\",\"\")","v":"Saisir une valeur !"},""]
[null,null,null,null,null,null,null,null,{"$f":"IF(AND(C34=\"\",D34=\"\",E34=\"\",F34=\"\"),\"Saisir une valeur !\",\"\")","v":"Saisir une valeur !"},""]
["Téleski - ligne",null,{"$f":"COUNTIF(C36:C40,\"=X\")*1","v":0},{"$f":"COUNTIF(D36:D40,\"=X\")*2","v":0},{"$f":"COUNTIF(E36:E40,\"=X\")*3","v":0},{"$f":"COUNTIF(F36:F40,\"=X\")*4","v":0}]
["Pylônes - contrôle général",null,null,null,null,null,null,null,{"$f":"IF(AND(C36=\"\",D36=\"\",E36=\"\",F36=\"\"),\"Saisir une valeur !\",\"\")","v":"Saisir une valeur !"},{"$f":"IF(COUNTA(C36:F36)>1,\"Une seule réponse SVP !\",\"\")","v":""}]
["Décâblage",null,null,null,null,null,null,null,"Saisir une valeur !",""]
["Contrôle et changement bandage, roulements",null,null,null,null,null,null,null,"Saisir une valeur !",""]
[null,null,null,null,null,null,null,null,"Saisir une valeur !",""]
[null,null,null,null,null,null,null,null,"Saisir une valeur !",""]
["Téleski - poulie retour",null,{"$f":"COUNTIF(C42:C49,\"=X\")*1","v":0},{"$f":"COUNTIF(D42:D49,\"=X\")*2","v":0},{"$f":"COUNTIF(E42:E49,\"=X\")*3","v":0},{"$f":"COUNTIF(F42:F49,\"=X\")*4","v":0}]
["Pose de la poulie avec reprise de la tension",null,null,null,null,null,null,null,{"$f":"IF(AND(C42=\"\",D42=\"\",E42=\"\",F42=\"\"),\"Saisir une valeur !\",\"\")","v":"Saisir une valeur !"},{"$f":"IF(COUNTA(C42:F42)>1,\"Une seule réponse SVP !\",\"\")","v":""}]
["Contrôle et changement bandage, roulements",null,null,null,null,null,null,null,"Saisir une valeur !",""]
["Graissage",null,null,null,null,null,null,null,"Saisir une valeur !",""]
["Contrôle général",null,null,null,null,null,null,null,"Saisir une valeur !",""]
["Contrôle fonctionnement tir-fort",null,null,null,null,null,null,null,"Saisir une valeur !",""]
["Réparation perches et enrouleurs",null,null,null,null,null,null,null,"Saisir une valeur !",""]
[null,null,null,null,null,null,null,null,"Saisir une valeur !",""]
[null,null,null,null,null,null,null,null,"Saisir une valeur !",""]
[null,null,null,null,null,null,null,null,null,""]
["SAVOIR-FAIRE - TELESIEGES PINCES FIXES (TSF)",null,null,null,null,null,{"$f":"COUNTA(A53:B59,A61:B66,A68:B72)*4","v":48},{"$f":"(SUM(C52:F52)+SUM(C60:F60)+SUM(C67:F67))/G51*20","v":0},null,""]
["Télésiège - gare motrice",null,{"$f":"COUNTIF(C53:C59,\"=X\")*1","v":0},{"$f":"COUNTIF(D53:D59,\"=X\")*2","v":0},{"$f":"COUNTIF(E53:E59,\"=X\")*3","v":0},{"$f":"COUNTIF(F53:F59,\"=X\")*4","v":0}]
["Contrôle et réglage frein (changement plaquettes et rondelles belleville)",null,null,null,null,null,null,null,{"$f":"IF(AND(C53=\"\",D53=\"\",E53=\"\",F53=\"\"),\"Saisir une valeur !\",\"\")","v":"Saisir une valeur !"},{"$f":"IF(COUNTA(C53:F53)>1,\"Une seule réponse SVP !\",\"\")","v":""}]
["Points d graissage",null,null,null,null,null,null,null,"Saisir une valeur !",""]
["Contrôle courroie",null,null,null,null,null,null,null,"Saisir une valeur !",""]
["Réducteur (contrôle sonore, niveau huile, vidange)",null,null,null,null,null,null,null,"Saisir une valeur !",""]
["Contrôle moteur thermique",null,null,null,null,null,null,null,"Saisir une valeur !",""]
[null,null,null,null,null,null,null,null,"Saisir une valeur !",""]
[null,null,null,null,null,null,null,null,"Saisir une valeur !",""]
["Télésiège - ligne",null,{"$f":"COUNTIF(C61:C66,\"=X\")*1","v":0},{"$f":"COUNTIF(D61:D66,\"=X\")*2","v":0},{"$f":"COUNTIF(E61:E66,\"=X\")*3","v":0},{"$f":"COUNTIF(F61:F66,\"=X\")*4","v":0}]
["Pylônes - contrôle général",null,null,null,null,null,null,null,{"$f":"IF(AND(C61=\"\",D61=\"\",E61=\"\",F61=\"\"),\"Saisir une valeur !\",\"\")","v":"Saisir une valeur !"},{"$f":"IF(COUNTA(C61:F61)>1,\"Une seule réponse SVP !\",\"\")","v":""}]
["Décâblage et graissage hors charge",null,null,null,null,null,null,null,"Saisir une valeur !",""]
["Contrôle et changement bandage, roulements",null,null,null,null,null,null,null,"Saisir une valeur !",""]
["Changement de galet ",null,null,null,null,null,null,null,"Saisir une valeur !",""]
[null,null,null,null,null,null,null,null,"Saisir une valeur !",""]
[null,null,null,null,null,null,null,null,"Saisir une valeur !",""]
["Télésiège - poulie retour",null,{"$f":"COUNTIF(C68:C72,\"=X\")*1","v":0},{"$f":"COUNTIF(D68:D72,\"=X\")*2","v":0},{"$f":"COUNTIF(E68:E72,\"=X\")*3","v":0},{"$f":"COUNTIF(F68:F72,\"=X\")*4","v":0}]
["Graissage",null,null,null,null,null,null,null,{"$f":"IF(AND(C68=\"\",D68=\"\",E68=\"\",F68=\"\"),\"Saisir une valeur !\",\"\")","v":"Saisir une valeur !"},{"$f":"IF(COUNTA(C68:F68)>1,\"Une seule réponse SVP !\",\"\")","v":""}]
["Contrôle état général (fisure serrage boulonnerie contrôle massif + serrage des ancrages)",null,null,null,null,null,null,null,"Saisir une valeur !",""]
["Contrôle bandage",null,null,null,null,null,null,null,"Saisir une valeur !",""]
[null,null,null,null,null,null,null,null,"Saisir une valeur !",""]
[null,null,null,null,null,null,null,null,"Saisir une valeur !",""]
[null,null,null,null,null,null,null,null,null,""]
["SAVOIR-FAIRE - TELESIEGES DEBRAYABLES (TSD)",null,null,null,null,null,{"$f":"COUNTA(A76:B81,A83:B88,A90:B93)*4","v":40},{"$f":"(SUM(C75:F75)+SUM(C82:F82)+SUM(C89:F89))/G74*20","v":0},null,""]
["Télésiège - gare motrice",null,{"$f":"COUNTIF(C76:C81,\"=X\")*1","v":0},{"$f":"COUNTIF(D76:D81,\"=X\")*2","v":0},{"$f":"COUNTIF(E76:E81,\"=X\")*3","v":0},{"$f":"COUNTIF(F76:F81,\"=X\")*4","v":0}]
["Contrôle et réglage frein (changement plaquettes et rondelles belleville)",null,null,null,null,null,null,null,{"$f":"IF(AND(C76=\"\",D76=\"\",E76=\"\",F76=\"\"),\"Saisir une valeur !\",\"\")","v":"Saisir une valeur !"},{"$f":"IF(COUNTA(C76:F76)>1,\"Une seule réponse SVP !\",\"\")","v":""}]
["Contrôle et réglage gabarit de gare",null,null,null,null,null,null,null,"Saisir une valeur !",""]
["Contrôle état général (pneus, courroies, badage)",null,null,null,null,null,null,null,"Saisir une valeur !",""]
["Réducteur (contrôle sonore, niveau huile, vidange)",null,null,null,null,null,null,null,"Saisir une valeur !",""]
[null,null,null,null,null,null,null,null,"Saisir une valeur !",""]
[null,null,null,null,null,null,null,null,"Saisir une valeur !",""]
["Télésiège - ligne",null,{"$f":"COUNTIF(C83:C88,\"=X\")*1","v":0},{"$f":"COUNTIF(D83:D88,\"=X\")*2","v":0},{"$f":"COUNTIF(E83:E88,\"=X\")*3","v":0},{"$f":"COUNTIF(F83:F88,\"=X\")*4","v":0}]
["Pylônes - contrôle général",null,null,null,null,null,null,null,{"$f":"IF(AND(C83=\"\",D83=\"\",E83=\"\",F83=\"\"),\"Saisir une valeur !\",\"\")","v":"Saisir une valeur !"},{"$f":"IF(COUNTA(C83:F83)>1,\"Une seule réponse SVP !\",\"\")","v":""}]
["Décâblage et graissage hors charge",null,null,null,null,null,null,null,"Saisir une valeur !",""]
["Contrôle et changement bandage, roulements",null,null,null,null,null,null,null,"Saisir une valeur !",""]
["Changement de galets",null,null,null,null,null,null,null,"Saisir une valeur !",""]
[null,null,null,null,null,null,null,null,"Saisir une valeur !",""]
[null,null,null,null,null,null,null,null,"Saisir une valeur !",""]
["Télésiège - poulie retour",null,{"$f":"COUNTIF(C90:C93,\"=X\")*1","v":0},{"$f":"COUNTIF(D90:D93,\"=X\")*2","v":0},{"$f":"COUNTIF(E90:E93,\"=X\")*3","v":0},{"$f":"COUNTIF(F90:F93,\"=X\")*4","v":0}]
["Contrôle et réglage gabarit de gare",null,null,null,null,null,null,null,{"$f":"IF(AND(C90=\"\",D90=\"\",E90=\"\",F90=\"\"),\"Saisir une valeur !\",\"\")","v":"Saisir une valeur !"},{"$f":"IF(COUNTA(C90:F90)>1,\"Une seule réponse SVP !\",\"\")","v":""}]
["Contrôle état général (pneus, courroies, bandages)",null,null,null,null,null,null,null,"Saisir une valeur !",""]
[null,null,null,null,null,null,null,null,"Saisir une valeur !",""]
[null,null,null,null,null,null,null,null,"Saisir une valeur !",""]
[]
["SAVOIR-ETRE",null,{"$f":"COUNTIF(C96:C108,\"=X\")*1","v":0},{"$f":"COUNTIF(D96:D108,\"=X\")*2","v":0},{"$f":"COUNTIF(E96:E108,\"=X\")*3","v":0},{"$f":"COUNTIF(F96:F108,\"=X\")*4","v":0},{"$f":"COUNTA(A96:B108)*4","v":40},{"$f":"SUM(C95:F95)/G95*20","v":0}]
["Rigueur dans les contôles",null,null,null,null,null,null,null,{"$f":"IF(AND(C96=\"\",D96=\"\",E96=\"\",F96=\"\"),\"Saisir une valeur !\",\"\")","v":"Saisir une valeur !"},{"$f":"IF(COUNTA(C96:F96)>1,\"Une seule réponse SVP !\",\"\")","v":""}]
["Respect et propreté du matériel et des batiments ",null,null,null,null,null,null,null,"Saisir une valeur !",""]
["Prise d'initiative",null,null,null,null,null,null,null,"Saisir une valeur !",""]
["Ponctualité",null,null,null,null,null,null,null,"Saisir une valeur !",""]
["Respect de la sécurité (EPI, collègues de travail)",null,null,null,null,null,null,null,"Saisir une valeur !",""]
["Maîtrise de soi",null,null,null,null,null,null,null,"Saisir une valeur !",""]
["Discrétion professionnelle",null,null,null,null,null,null,null,"Saisir une valeur !",""]
["Respect de la hiérarchie",null,null,null,null,null,null,null,"Saisir une valeur !",""]
["Adaptabilité",null,null,null,null,null,null,null,"Saisir une valeur !",""]
["Motivation",null,null,null,null,null,null,null,"Saisir une valeur !",""]
[null,null,null,null,null,null,null,null,"Saisir une valeur !",""]
[null,null,null,null,null,null,null,null,"Saisir une valeur !",""]
[null,null,null,null,null,null,null,null,"Saisir une valeur !",""]
[]
["SYNTESE"]
[null,null,null,null,null,null,{"$f":"B3","v":"rrrrr"},{"$f":"'SYNTHESE EQUIPE'!L3","v":"Σ EQUIPE"},"OBJECTIF SALARIE FIXE"]
[{"$f":"A11","v":"FORMATION"},null,null,null,null,null,{"$f":"H11","v":0},{"$f":"'SYNTHESE EQUIPE'!L4","v":20},10]
[{"$f":"A26","v":"SAVOIR-FAIRE - TELESKI"},null,null,null,null,null,{"$f":"H26","v":0},{"$f":"'SYNTHESE EQUIPE'!L5","v":17.142857142857142},10]
[{"$f":"A51","v":"SAVOIR-FAIRE - TELESIEGES PINCES FIXES (TSF)"},null,null,null,null,null,{"$f":"H51","v":0},{"$f":"'SYNTHESE EQUIPE'!L6","v":11.25},10]
[{"$f":"A74","v":"SAVOIR-FAIRE - TELESIEGES DEBRAYABLES (TSD)"},null,null,null,null,null,{"$f":"H74","v":0},{"$f":"'SYNTHESE EQUIPE'!L7","v":14.5},10]
[{"$f":"A95","v":"SAVOIR-ETRE"},null,null,null,null,null,{"$f":"H95","v":0},{"$f":"'SYNTHESE EQUIPE'!L8","v":11.818181818181818},10]

{"sheet":"SALARIE 7","index":6,"n_rows":116,"n_cols":10,"rows_kept":116,"cut":false,"hidden":false,"merged":[[4,2,4,7],[10,0,10,1],[10,2,10,3],[10,4,10,5],[13,0,13,1],[13,2,13,3],[13,4,13,5],[13,6,13,7],[14,0,14,1],[14,2,14,3],[14,4,14,5],[14,6,14,7],[11,0,11,1],[11,2,11,3],[11,4,11,5],[11,6,11,7],[12,0,12,1],[12,2,12,3],[12,4,12,5],[12,6,12,7],[17,0,17,1],[17,2,17,3],[17,4,17,5],[17,6,17,7],[18,0,18,1],[18,2,18,3],[18,4,18,5],[18,6,18,7],[15,0,15,1],[15,2,15,3],[15,4,15,5],[15,6,15,7],[16,0,16,1],[16,2,16,3],[16,4,16,5],[16,6,16,7],[21,0,21,1],[21,2,21,3],[21,4,21,5],[21,6,21,7],[22,0,22,1],[22,2,22,3],[22,4,22,5],[22,6,22,7],[19,0,19,1],[19,2,19,3],[19,4,19,5],[19,6,19,7],[20,0,20,1],[20,2,20,3],[20,4,20,5],[20,6,20,7],[26,0,26,1],[26,6,26,7],[27,0,27,1],[28,0,28,1],[29,0,29,1],[30,0,30,1],[23,0,23,1],[23,2,23,3],[23,4,23,5],[23,6,23,7],[24,0,24,7],[31,0,31,1],[33,0,33,1],[34,0,34,1],[34,6,34,7],[35,0,35,1],[36,0,36,1],[33,6,33,7],[35,6,35,7],[36,6,36,7],[37,0,37,1],[39,0,39,1],[40,0,40,1],[40,6,40,7],[41,0,41,1],[50,0,50,1],[37,6,37,7],[38,0,38,1],[38,6,38,7],[39,6,39,7],[45,6,45,7],[46,6,46,7],[47,0,47,1],[47,6,47,7],[48,0,48,1],[48,6,48,7],[41,6,41,7],[42,6,42,7],[43,0,43,1],[43,6,43,7],[44,0,44,1],[44,6,44,7],[51,0,51,1],[51,6,51,7],[52,0,52,1],[53,0,53,1],[54,0,54,1],[55,0,55,1],[52,6,52,7],[53,6,53,7],[54,6,54,7],[55,6,55,7],[56,0,56,1],[59,0,59,1],[59,6,59,7],[60,0,60,1],[61,0,61,1],[62,0,62,1],[56,6,56,7],[57,0,57,1],[57,6,57,7],[58,0,58,1],[58,6,58,7],[60,6,60,7],[61,6,61,7],[62,6,62,7],[80,0,80,1],[81,0,81,1],[81,6,81,7],[82,0,82,1],[80,6,80,7],[82,6,82,7],[69,0,69,1],[72,0,72,7],[74,0,74,1],[74,6,74,7],[75,0,75,1],[76,0,76,1],[69,6,69,7],[70,0,70,1],[70,6,70,7],[71,0,71,1],[78,6,78,7],[79,0,79,1],[79,6,79,7],[83,0,83,1],[84,0,84,1],[85,0,85,1],[87,0,87,1],[88,0,88,1],[88,6,88,7],[83,6,83,7],[84,6,84,7],[85,6,85,7],[86,0,86,1],[96,0,96,1],[97,0,97,1],[98,0,98,1],[99,0,99,1],[100,0,100,1],[101,0,101,1],[89,0,89,1],[90,0,90,1],[92,0,92,1],[93,0,93,7],[94,0,94,1],[95,0,95,1],[92,6,92,7],[95,6,95,7],[114,0,114,5],[115,0,115,5],[7,0,7,9],[27,6,27,7],[28,6,28,7],[29,6,29,7],[30,6,30,7],[31,6,31,7],[32,0,32,1],[32,6,32,7],[110,0,110,5],[110,8,110,9],[109,0,109,9],[111,0,111,5],[113,0,113,5],[102,0,102,1],[103,0,103,1],[104,0,104,1],[105,0,105,1],[106,0,106,1],[102,6,102,7],[103,6,103,7],[104,6,104,7],[105,6,105,7],[63,6,63,7],[64,0,64,1],[64,6,64,7],[77,0,77,1],[78,0,78,1],[63,0,63,1],[65,0,65,1],[66,0,66,1],[66,6,66,7],[67,0,67,1],[68,0,68,1],[65,6,65,7],[67,6,67,7],[68,6,68,7],[106,6,106,7],[107,0,107,1],[107,6,107,7],[0,0,0,9],[2,5,2,9],[3,2,3,4],[3,5,3,9],[9,6,9,7],[96,6,96,7],[97,6,97,7],[98,6,98,7],[99,6,99,7],[100,6,100,7],[101,6,101,7],[86,6,86,7],[87,6,87,7],[89,6,89,7],[90,6,90,7],[91,0,91,1],[91,6,91,7],[71,6,71,7],[75,6,75,7],[76,6,76,7],[77,6,77,7]]}
["OUVRIER ENTRETIEN MECANIQUE"]
[]
["Nom :","SALARIE 7","Dâte d'entrée :"]
["Prénom :",null,"Service :"]
["Poste occupé :"]
[]
[]
["NA = non acquis        ECA = en cours d'acquisition          A = acquis          M = maîtrisé"]
[]
[null,null,"NA","ECA","A","M","Commentaires"]
["FORMATION",null,{"$f":"COUNTIF(C12:D24,\"=X\")*0","v":0},null,{"$f":"COUNTIF(E12:F24,\"=X\")*1","v":0},null,{"$f":"COUNTA(A12:B24)*1","v":9},{"$f":"SUM(C11:F11)/G11*20","v":0}]
["Habilitation électrique",null,null,null,null,null,null,null,{"$f":"IF(AND(C12=\"\",E12=\"\"),\"Saisir une valeur !\",\"\")","v":"Saisir une valeur !"},{"$f":"IF(COUNTA(C12:F12)>1,\"Une seule réponse SVP !\",\"\")","v":""}]
["Formation SST",null,null,null,null,null,null,null,{"$f":"IF(AND(C13=\"\",E13=\"\"),\"Saisir une valeur !\",\"\")","v":"Saisir une valeur !"},{"$f":"IF(COUNTA(C13:F13)>1,\"Une seule réponse SVP !\",\"\")","v":""}]
["Habilitation pinces LPA",null,null,null,null,null,null,null,"Saisir une valeur !",{"$f":"IF(COUNTA(C14:F14)>1,\"Une seule réponse SVP !\",\"\")","v":""}]
["Habilitation pinces LA672",null,null,null,null,null,null,null,"Saisir une valeur !",{"$f":"IF(COUNTA(C15:F15)>1,\"Une seule réponse SVP !\",\"\")","v":""}]
["Habilitation pinces D-OMEGA T",null,null,null,null,null,null,null,"Saisir une valeur !",{"$f":"IF(COUNTA(C16:F16)>1,\"Une seule réponse SVP !\",\"\")","v":""}]
["Formation réglage gares",null,null,null,null,null,null,null,"Saisir une valeur !",{"$f":"IF(COUNTA(C17:F17)>1,\"Une seule réponse SVP !\",\"\")","v":""}]
["Formation réglage freins",null,null,null,null,null,null,null,"Saisir une valeur !",""]
["Epissures",null,null,null,null,null,null,null,"Saisir une valeur !",""]
["Habilitation travail en hauteur",null,null,null,null,null,null,null,"Saisir une valeur !",""]
[null,null,null,null,null,null,null,null,"Saisir une valeur !",""]
[null,null,null,null,null,null,null,null,"Saisir une valeur !",""]
[null,null,null,null,null,null,null,null,"Saisir une valeur !",""]
[null,null,null,null,null,null,null,null,"Saisir une valeur !",""]
[null,null,null,null,null,null,null,null,null,{"$f":"IF(AND(C25<>\"\",E25<>\"\"),\"Une seule réponse SVP !\",\"\")","v":""}]
["SAVOIR-FAIRE - TELESKI",null,null,null,null,null,{"$f":"COUNTA(A28:B34,A36:B40,A42:B49)*4","v":56},{"$f":"(SUM(C27:F27)+SUM(C35:F35)+SUM(C41:F41))/G26*20","v":0},null,""]
["Téleski - gare motrice",null,{"$f":"COUNTIF(C28:C34,\"=X\")*1","v":0},{"$f":"COUNTIF(D28:D34,\"=X\")*2","v":0},{"$f":"COUNTIF(E28:E34,\"=X\")*3","v":0},{"$f":"COUNTIF(F28:F34,\"=X\")*4","v":0}]
["Décablage - reprise de tension",null,null,null,null,null,null,null,{"$f":"IF(AND(C28=\"\",D28=\"\",E28=\"\",F28=\"\"),\"Saisir une valeur !\",\"\")","v":"Saisir une valeur !"},{"$f":"IF(COUNTA(C28:F28)>1,\"Une seule réponse SVP !\",\"\")","v":""}]
["Changement bandage, roulement",null,null,null,null,null,null,null,{"$f":"IF(AND(C29=\"\",D29=\"\",E29=\"\",F29=\"\"),\"Saisir une valeur !\",\"\")","v":"Saisir une valeur !"},{"$f":"IF(COUNTA(C29:F29)>1,\"Une seule réponse SVP !\",\"\")","v":""}]
["Réglage gare",null,null,null,null,null,null,null,"Saisir une valeur !",""]
["Changement protection gare",null,null,null,null,null,null,null,"Saisir une valeur !",""]
["Contrôle visuel du câble et épissure",null,null,null,null,null,null,null,"Saisir une valeur !",""]
[null,null,null,null,null,null,null,null,{"$f":"IF(AND(C33=\"\",D33=\"\",E33=\"\",F33=\"\"),\"Saisir une valeur !\",\"\")","v":"Saisir une valeur !"},""]
[null,null,null,null,null,null,null,null,{"$f":"IF(AND(C34=\"\",D34=\"\",E34=\"\",F34=\"\"),\"Saisir une valeur !\",\"\")","v":"Saisir une valeur !"},""]
["Téleski - ligne",null,{"$f":"COUNTIF(C36:C40,\"=X\")*1","v":0},{"$f":"COUNTIF(D36:D40,\"=X\")*2","v":0},{"$f":"COUNTIF(E36:E40,\"=X\")*3","v":0},{"$f":"COUNTIF(F36:F40,\"=X\")*4","v":0}]
["Pylônes - contrôle général",null,null,null,null,null,null,null,{"$f":"IF(AND(C36=\"\",D36=\"\",E36=\"\",F36=\"\"),\"Saisir une valeur !\",\"\")","v":"Saisir une valeur !"},{"$f":"IF(COUNTA(C36:F36)>1,\"Une seule réponse SVP !\",\"\")","v":""}]
["Décâblage",null,null,null,null,null,null,null,"Saisir une valeur !",""]
["Contrôle et changement bandage, roulements",null,null,null,null,null,null,null,"Saisir une valeur !",""]
[null,null,null,null,null,null,null,null,"Saisir une valeur !",""]
[null,null,null,null,null,null,null,null,"Saisir une valeur !",""]
["Téleski - poulie retour",null,{"$f":"COUNTIF(C42:C49,\"=X\")*1","v":0},{"$f":"COUNTIF(D42:D49,\"=X\")*2","v":0},{"$f":"COUNTIF(E42:E49,\"=X\")*3","v":0},{"$f":"COUNTIF(F42:F49,\"=X\")*4","v":0}]
["Pose de la poulie avec reprise de la tension",null,null,null,null,null,null,null,{"$f":"IF(AND(C42=\"\",D42=\"\",E42=\"\",F42=\"\"),\"Saisir une valeur !\",\"\")","v":"Saisir une valeur !"},{"$f":"IF(COUNTA(C42:F42)>1,\"Une seule réponse SVP !\",\"\")","v":""}]
["Contrôle et changement bandage, roulements",null,null,null,null,null,null,null,"Saisir une valeur !",""]
["Graissage",null,null,null,null,null,null,null,"Saisir une valeur !",""]
["Contrôle général",null,null,null,null,null,null,null,"Saisir une valeur !",""]
["Contrôle fonctionnement tir-fort",null,null,null,null,null,null,null,"Saisir une valeur !",""]
["Réparation perches et enrouleurs",null,null,null,null,null,null,null,"Saisir une valeur !",""]
[null,null,null,null,null,null,null,null,"Saisir une valeur !",""]
[null,null,null,null,null,null,null,null,"Saisir une valeur !",""]
[null,null,null,null,null,null,null,null,null,""]
["SAVOIR-FAIRE - TELESIEGES PINCES FIXES (TSF)",null,null,null,null,null,{"$f":"COUNTA(A53:B59,A61:B66,A68:B72)*4","v":48},{"$f":"(SUM(C52:F52)+SUM(C60:F60)+SUM(C67:F67))/G51*20","v":0},null,""]
["Télésiège - gare motrice",null,{"$f":"COUNTIF(C53:C59,\"=X\")*1","v":0},{"$f":"COUNTIF(D53:D59,\"=X\")*2","v":0},{"$f":"COUNTIF(E53:E59,\"=X\")*3","v":0},{"$f":"COUNTIF(F53:F59,\"=X\")*4","v":0}]
["Contrôle et réglage frein (changement plaquettes et rondelles belleville)",null,null,null,null,null,null,null,{"$f":"IF(AND(C53=\"\",D53=\"\",E53=\"\",F53=\"\"),\"Saisir une valeur !\",\"\")","v":"Saisir une valeur !"},{"$f":"IF(COUNTA(C53:F53)>1,\"Une seule réponse SVP !\",\"\")","v":""}]
["Points d graissage",null,null,null,null,null,null,null,"Saisir une valeur !",""]
["Contrôle courroie",null,null,null,null,null,null,null,"Saisir une valeur !",""]
["Réducteur (contrôle sonore, niveau huile, vidange)",null,null,null,null,null,null,null,"Saisir une valeur !",""]
["Contrôle moteur thermique",null,null,null,null,null,null,null,"Saisir une valeur !",""]
[null,null,null,null,null,null,null,null,"Saisir une valeur !",""]
[null,null,null,null,null,null,null,null,"Saisir une valeur !",""]
["Télésiège - ligne",null,{"$f":"COUNTIF(C61:C66,\"=X\")*1","v":0},{"$f":"COUNTIF(D61:D66,\"=X\")*2","v":0},{"$f":"COUNTIF(E61:E66,\"=X\")*3","v":0},{"$f":"COUNTIF(F61:F66,\"=X\")*4","v":0}]
["Pylônes - contrôle général",null,null,null,null,null,null,null,{"$f":"IF(AND(C61=\"\",D61=\"\",E61=\"\",F61=\"\"),\"Saisir une valeur !\",\"\")","v":"Saisir une valeur !"},{"$f":"IF(COUNTA(C61:F61)>1,\"Une seule réponse SVP !\",\"\")","v":""}]
["Décâblage et graissage hors charge",null,null,null,null,null,null,null,"Saisir une valeur !",""]
["Contrôle et changement bandage, roulements",null,null,null,null,null,null,null,"Saisir une valeur !",""]
["Changement de galet ",null,null,null,null,null,null,null,"Saisir une valeur !",""]
[null,null,null,null,null,null,null,null,"Saisir une valeur !",""]
[null,null,null,null,null,null,null,null,"Saisir une valeur !",""]
["Télésiège - poulie retour",null,{"$f":"COUNTIF(C68:C72,\"=X\")*1","v":0},{"$f":"COUNTIF(D68:D72,\"=X\")*2","v":0},{"$f":"COUNTIF(E68:E72,\"=X\")*3","v":0},{"$f":"COUNTIF(F68:F72,\"=X\")*4","v":0}]
["Graissage",null,null,null,null,null,null,null,{"$f":"IF(AND(C68=\"\",D68=\"\",E68=\"\",F68=\"\"),\"Saisir une valeur !\",\"\")","v":"Saisir une valeur !"},{"$f":"IF(COUNTA(C68:F68)>1,\"Une seule réponse SVP !\",\"\")","v":""}]
["Contrôle état général (fisure serrage boulonnerie contrôle massif + serrage des ancrages)",null,null,null,null,null,null,null,"Saisir une valeur !",""]
["Contrôle bandage",null,null,null,null,null,null,null,"Saisir une valeur !",""]
[null,null,null,null,null,null,null,null,"Saisir une valeur !",""]
[null,null,null,null,null,null,null,null,"Saisir une valeur !",""]
[null,null,null,null,null,null,null,null,null,""]
["SAVOIR-FAIRE - TELESIEGES DEBRAYABLES (TSD)",null,null,null,null,null,{"$f":"COUNTA(A76:B81,A83:B88,A90:B93)*4","v":40},{"$f":"(SUM(C75:F75)+SUM(C82:F82)+SUM(C89:F89))/G74*20","v":0},null,""]
["Télésiège - gare motrice",null,{"$f":"COUNTIF(C76:C81,\"=X\")*1","v":0},{"$f":"COUNTIF(D76:D81,\"=X\")*2","v":0},{"$f":"COUNTIF(E76:E81,\"=X\")*3","v":0},{"$f":"COUNTIF(F76:F81,\"=X\")*4","v":0}]
["Contrôle et réglage frein (changement plaquettes et rondelles belleville)",null,null,null,null,null,null,null,{"$f":"IF(AND(C76=\"\",D76=\"\",E76=\"\",F76=\"\"),\"Saisir une valeur !\",\"\")","v":"Saisir une valeur !"},{"$f":"IF(COUNTA(C76:F76)>1,\"Une seule réponse SVP !\",\"\")","v":""}]
["Contrôle et réglage gabarit de gare",null,null,null,null,null,null,null,"Saisir une valeur !",""]
["Contrôle état général (pneus, courroies, badage)",null,null,null,null,null,null,null,"Saisir une valeur !",""]
["Réducteur (contrôle sonore, niveau huile, vidange)",null,null,null,null,null,null,null,"Saisir une valeur !",""]
[null,null,null,null,null,null,null,null,"Saisir une valeur !",""]
[null,null,null,null,null,null,null,null,"Saisir une valeur !",""]
["Télésiège - ligne",null,{"$f":"COUNTIF(C83:C88,\"=X\")*1","v":0},{"$f":"COUNTIF(D83:D88,\"=X\")*2","v":0},{"$f":"COUNTIF(E83:E88,\"=X\")*3","v":0},{"$f":"COUNTIF(F83:F88,\"=X\")*4","v":0}]
["Pylônes - contrôle général",null,null,null,null,null,null,null,{"$f":"IF(AND(C83=\"\",D83=\"\",E83=\"\",F83=\"\"),\"Saisir une valeur !\",\"\")","v":"Saisir une valeur !"},{"$f":"IF(COUNTA(C83:F83)>1,\"Une seule réponse SVP !\",\"\")","v":""}]
["Décâblage et graissage hors charge",null,null,null,null,null,null,null,"Saisir une valeur !",""]
["Contrôle et changement bandage, roulements",null,null,null,null,null,null,null,"Saisir une valeur !",""]
["Changement de galets",null,null,null,null,null,null,null,"Saisir une valeur !",""]
[null,null,null,null,null,null,null,null,"Saisir une valeur !",""]
[null,null,null,null,null,null,null,null,"Saisir une valeur !",""]
["Télésiège - poulie retour",null,{"$f":"COUNTIF(C90:C93,\"=X\")*1","v":0},{"$f":"COUNTIF(D90:D93,\"=X\")*2","v":0},{"$f":"COUNTIF(E90:E93,\"=X\")*3","v":0},{"$f":"COUNTIF(F90:F93,\"=X\")*4","v":0}]
["Contrôle et réglage gabarit de gare",null,null,null,null,null,null,null,{"$f":"IF(AND(C90=\"\",D90=\"\",E90=\"\",F90=\"\"),\"Saisir une valeur !\",\"\")","v":"Saisir une valeur !"},{"$f":"IF(COUNTA(C90:F90)>1,\"Une seule réponse SVP !\",\"\")","v":""}]
["Contrôle état général (pneus, courroies, bandages)",null,null,null,null,null,null,null,"Saisir une valeur !",""]
[null,null,null,null,null,null,null,null,"Saisir une valeur !",""]
[null,null,null,null,null,null,null,null,"Saisir une valeur !",""]
[]
["SAVOIR-ETRE",null,{"$f":"COUNTIF(C96:C108,\"=X\")*1","v":0},{"$f":"COUNTIF(D96:D108,\"=X\")*2","v":0},{"$f":"COUNTIF(E96:E108,\"=X\")*3","v":0},{"$f":"COUNTIF(F96:F108,\"=X\")*4","v":0},{"$f":"COUNTA(A96:B108)*4","v":40},{"$f":"SUM(C95:F95)/G95*20","v":0}]
["Rigueur dans les contôles",null,null,null,null,null,null,null,{"$f":"IF(AND(C96=\"\",D96=\"\",E96=\"\",F96=\"\"),\"Saisir une valeur !\",\"\")","v":"Saisir une valeur !"},{"$f":"IF(COUNTA(C96:F96)>1,\"Une seule réponse SVP !\",\"\")","v":""}]
["Respect et propreté du matériel et des batiments ",null,null,null,null,null,null,null,"Saisir une valeur !",""]
["Prise d'initiative",null,null,null,null,null,null,null,"Saisir une valeur !",""]
["Ponctualité",null,null,null,null,null,null,null,"Saisir une valeur !",""]
["Respect de la sécurité (EPI, collègues de travail)",null,null,null,null,null,null,null,"Saisir une valeur !",""]
["Maîtrise de soi",null,null,null,null,null,null,null,"Saisir une valeur !",""]
["Discrétion professionnelle",null,null,null,null,null,null,null,"Saisir une valeur !",""]
["Respect de la hiérarchie",null,null,null,null,null,null,null,"Saisir une valeur !",""]
["Adaptabilité",null,null,null,null,null,null,null,"Saisir une valeur !",""]
["Motivation",null,null,null,null,null,null,null,"Saisir une valeur !",""]
[null,null,null,null,null,null,null,null,"Saisir une valeur !",""]
[null,null,null,null,null,null,null,null,"Saisir une valeur !",""]
[null,null,null,null,null,null,null,null,"Saisir une valeur !",""]
[]
["SYNTESE"]
[null,null,null,null,null,null,{"$f":"B3","v":"SALARIE 7"},{"$f":"'SYNTHESE EQUIPE'!L3","v":"Σ EQUIPE"},"OBJECTIF SALARIE FIXE"]
[{"$f":"A11","v":"FORMATION"},null,null,null,null,null,{"$f":"H11","v":0},{"$f":"'SYNTHESE EQUIPE'!L4","v":20},10]
[{"$f":"A26","v":"SAVOIR-FAIRE - TELESKI"},null,null,null,null,null,{"$f":"H26","v":0},{"$f":"'SYNTHESE EQUIPE'!L5","v":17.142857142857142},10]
[{"$f":"A51","v":"SAVOIR-FAIRE - TELESIEGES PINCES FIXES (TSF)"},null,null,null,null,null,{"$f":"H51","v":0},{"$f":"'SYNTHESE EQUIPE'!L6","v":11.25},10]
[{"$f":"A74","v":"SAVOIR-FAIRE - TELESIEGES DEBRAYABLES (TSD)"},null,null,null,null,null,{"$f":"H74","v":0},{"$f":"'SYNTHESE EQUIPE'!L7","v":14.5},10]
[{"$f":"A95","v":"SAVOIR-ETRE"},null,null,null,null,null,{"$f":"H95","v":0},{"$f":"'SYNTHESE EQUIPE'!L8","v":11.818181818181818},10]

{"sheet":"SALARIE 8","index":7,"n_rows":116,"n_cols":10,"rows_kept":116,"cut":false,"hidden":false,"merged":[[4,2,4,7],[10,0,10,1],[10,2,10,3],[10,4,10,5],[0,0,0,9],[13,0,13,1],[13,2,13,3],[13,4,13,5],[13,6,13,7],[7,0,7,9],[2,5,2,9],[3,2,3,4],[3,5,3,9],[9,6,9,7],[14,0,14,1],[14,2,14,3],[14,4,14,5],[14,6,14,7],[11,0,11,1],[11,2,11,3],[11,4,11,5],[11,6,11,7],[12,0,12,1],[12,2,12,3],[12,4,12,5],[12,6,12,7],[17,0,17,1],[17,2,17,3],[17,4,17,5],[17,6,17,7],[18,0,18,1],[18,2,18,3],[18,4,18,5],[18,6,18,7],[15,0,15,1],[15,2,15,3],[15,4,15,5],[15,6,15,7],[16,0,16,1],[16,2,16,3],[16,4,16,5],[16,6,16,7],[21,0,21,1],[21,2,21,3],[21,4,21,5],[21,6,21,7],[22,0,22,1],[22,2,22,3],[22,4,22,5],[22,6,22,7],[19,0,19,1],[19,2,19,3],[19,4,19,5],[19,6,19,7],[20,0,20,1],[20,2,20,3],[20,4,20,5],[20,6,20,7],[26,0,26,1],[26,6,26,7],[27,0,27,1],[28,0,28,1],[29,0,29,1],[30,0,30,1],[23,0,23,1],[23,2,23,3],[23,4,23,5],[23,6,23,7],[24,0,24,7],[27,6,27,7],[28,6,28,7],[29,6,29,7],[30,6,30,7],[31,0,31,1],[33,0,33,1],[34,0,34,1],[34,6,34,7],[35,0,35,1],[36,0,36,1],[33,6,33,7],[35,6,35,7],[36,6,36,7],[31,6,31,7],[32,0,32,1],[32,6,32,7],[37,0,37,1],[39,0,39,1],[40,0,40,1],[40,6,40,7],[41,0,41,1],[50,0,50,1],[37,6,37,7],[38,0,38,1],[38,6,38,7],[39,6,39,7],[45,6,45,7],[46,6,46,7],[47,0,47,1],[47,6,47,7],[48,0,48,1],[48,6,48,7],[41,6,41,7],[42,6,42,7],[43,0,43,1],[43,6,43,7],[44,0,44,1],[44,6,44,7],[51,0,51,1],[51,6,51,7],[52,0,52,1],[53,0,53,1],[54,0,54,1],[55,0,55,1],[52,6,52,7],[53,6,53,7],[54,6,54,7],[55,6,55,7],[56,0,56,1],[59,0,59,1],[59,6,59,7],[60,0,60,1],[61,0,61,1],[62,0,62,1],[56,6,56,7],[57,0,57,1],[57,6,57,7],[58,0,58,1],[58,6,58,7],[60,6,60,7],[61,6,61,7],[62,6,62,7],[80,0,80,1],[81,0,81,1],[81,6,81,7],[82,0,82,1],[80,6,80,7],[82,6,82,7],[69,0,69,1],[72,0,72,7],[74,0,74,1],[74,6,74,7],[75,0,75,1],[76,0,76,1],[69,6,69,7],[70,0,70,1],[70,6,70,7],[71,0,71,1],[79,0,79,1],[79,6,79,7],[84,0,84,1],[85,0,85,1],[87,0,87,1],[88,0,88,1],[88,6,88,7],[83,6,83,7],[84,6,84,7],[85,6,85,7],[86,0,86,1],[83,0,83,1],[86,6,86,7],[87,6,87,7],[110,0,110,5],[110,8,110,9],[102,0,102,1],[103,0,103,1],[104,0,104,1],[105,0,105,1],[106,0,106,1],[102,6,102,7],[103,6,103,7],[104,6,104,7],[105,6,105,7],[109,0,109,9],[106,6,106,7],[107,0,107,1],[107,6,107,7],[96,0,96,1],[97,0,97,1],[98,0,98,1],[99,0,99,1],[100,0,100,1],[101,0,101,1],[89,0,89,1],[90,0,90,1],[92,0,92,1],[93,0,93,7],[94,0,94,1],[95,0,95,1],[92,6,92,7],[95,6,95,7],[96,6,96,7],[97,6,97,7],[98,6,98,7],[99,6,99,7],[100,6,100,7],[101,6,101,7],[89,6,89,7],[90,6,90,7],[91,0,91,1],[91,6,91,7],[63,6,63,7],[64,0,64,1],[64,6,64,7],[77,0,77,1],[78,0,78,1],[63,0,63,1],[65,0,65,1],[66,0,66,1],[66,6,66,7],[67,0,67,1],[68,0,68,1],[65,6,65,7],[67,6,67,7],[68,6,68,7],[71,6,71,7],[75,6,75,7],[76,6,76,7],[77,6,77,7],[78,6,78,7]]}
["OUVRIER ENTRETIEN MECANIQUE"]
[]
["Nom :","SALARIE 8","Dâte d'entrée :"]
["Prénom :",null,"Service :"]
["Poste occupé :"]
[]
[]
["NA = non acquis        ECA = en cours d'acquisition          A = acquis          M = maîtrisé"]
[]
[null,null,"NA","ECA","A","M","Commentaires"]
["FORMATION",null,{"$f":"COUNTIF(C12:D24,\"=X\")*0","v":0},null,{"$f":"COUNTIF(E12:F24,\"=X\")*1","v":0},null,{"$f":"COUNTA(A12:B24)*1","v":9},{"$f":"SUM(C11:F11)/G11*20","v":0}]
["Habilitation électrique",null,null,null,null,null,null,null,{"$f":"IF(AND(C12=\"\",E12=\"\"),\"Saisir une valeur !\",\"\")","v":"Saisir une valeur !"},{"$f":"IF(COUNTA(C12:F12)>1,\"Une seule réponse SVP !\",\"\")","v":""}]
["Formation SST",null,null,null,null,null,null,null,{"$f":"IF(AND(C13=\"\",E13=\"\"),\"Saisir une valeur !\",\"\")","v":"Saisir une valeur !"},{"$f":"IF(COUNTA(C13:F13)>1,\"Une seule réponse SVP !\",\"\")","v":""}]
["Habilitation pinces LPA",null,null,null,null,null,null,null,"Saisir une valeur !",{"$f":"IF(COUNTA(C14:F14)>1,\"Une seule réponse SVP !\",\"\")","v":""}]
["Habilitation pinces LA672",null,null,null,null,null,null,null,"Saisir une valeur !",{"$f":"IF(COUNTA(C15:F15)>1,\"Une seule réponse SVP !\",\"\")","v":""}]
["Habilitation pinces D-OMEGA T",null,null,null,null,null,null,null,"Saisir une valeur !",{"$f":"IF(COUNTA(C16:F16)>1,\"Une seule réponse SVP !\",\"\")","v":""}]
["Formation réglage gares",null,null,null,null,null,null,null,"Saisir une valeur !",{"$f":"IF(COUNTA(C17:F17)>1,\"Une seule réponse SVP !\",\"\")","v":""}]
["Formation réglage freins",null,null,null,null,null,null,null,"Saisir une valeur !",""]
["Epissures",null,null,null,null,null,null,null,"Saisir une valeur !",""]
["Habilitation travail en hauteur",null,null,null,null,null,null,null,"Saisir une valeur !",""]
[null,null,null,null,null,null,null,null,"Saisir une valeur !",""]
[null,null,null,null,null,null,null,null,"Saisir une valeur !",""]
[null,null,null,null,null,null,null,null,"Saisir une valeur !",""]
[null,null,null,null,null,null,null,null,"Saisir une valeur !",""]
[null,null,null,null,null,null,null,null,null,{"$f":"IF(AND(C25<>\"\",E25<>\"\"),\"Une seule réponse SVP !\",\"\")","v":""}]
["SAVOIR-FAIRE - TELESKI",null,null,null,null,null,{"$f":"COUNTA(A28:B34,A36:B40,A42:B49)*4","v":56},{"$f":"(SUM(C27:F27)+SUM(C35:F35)+SUM(C41:F41))/G26*20","v":0},null,""]
["Téleski - gare motrice",null,{"$f":"COUNTIF(C28:C34,\"=X\")*1","v":0},{"$f":"COUNTIF(D28:D34,\"=X\")*2","v":0},{"$f":"COUNTIF(E28:E34,\"=X\")*3","v":0},{"$f":"COUNTIF(F28:F34,\"=X\")*4","v":0}]
["Décablage - reprise de tension",null,null,null,null,null,null,null,{"$f":"IF(AND(C28=\"\",D28=\"\",E28=\"\",F28=\"\"),\"Saisir une valeur !\",\"\")","v":"Saisir une valeur !"},{"$f":"IF(COUNTA(C28:F28)>1,\"Une seule réponse SVP !\",\"\")","v":""}]
["Changement bandage, roulement",null,null,null,null,null,null,null,{"$f":"IF(AND(C29=\"\",D29=\"\",E29=\"\",F29=\"\"),\"Saisir une valeur !\",\"\")","v":"Saisir une valeur !"},{"$f":"IF(COUNTA(C29:F29)>1,\"Une seule réponse SVP !\",\"\")","v":""}]
["Réglage gare",null,null,null,null,null,null,null,"Saisir une valeur !",""]
["Changement protection gare",null,null,null,null,null,null,null,"Saisir une valeur !",""]
["Contrôle visuel du câble et épissure",null,null,null,null,null,null,null,"Saisir une valeur !",""]
[null,null,null,null,null,null,null,null,{"$f":"IF(AND(C33=\"\",D33=\"\",E33=\"\",F33=\"\"),\"Saisir une valeur !\",\"\")","v":"Saisir une valeur !"},""]
[null,null,null,null,null,null,null,null,{"$f":"IF(AND(C34=\"\",D34=\"\",E34=\"\",F34=\"\"),\"Saisir une valeur !\",\"\")","v":"Saisir une valeur !"},""]
["Téleski - ligne",null,{"$f":"COUNTIF(C36:C40,\"=X\")*1","v":0},{"$f":"COUNTIF(D36:D40,\"=X\")*2","v":0},{"$f":"COUNTIF(E36:E40,\"=X\")*3","v":0},{"$f":"COUNTIF(F36:F40,\"=X\")*4","v":0}]
["Pylônes - contrôle général",null,null,null,null,null,null,null,{"$f":"IF(AND(C36=\"\",D36=\"\",E36=\"\",F36=\"\"),\"Saisir une valeur !\",\"\")","v":"Saisir une valeur !"},{"$f":"IF(COUNTA(C36:F36)>1,\"Une seule réponse SVP !\",\"\")","v":""}]
["Décâblage",null,null,null,null,null,null,null,"Saisir une valeur !",""]
["Contrôle et changement bandage, roulements",null,null,null,null,null,null,null,"Saisir une valeur !",""]
[null,null,null,null,null,null,null,null,"Saisir une valeur !",""]
[null,null,null,null,null,null,null,null,"Saisir une valeur !",""]
["Téleski - poulie retour",null,{"$f":"COUNTIF(C42:C49,\"=X\")*1","v":0},{"$f":"COUNTIF(D42:D49,\"=X\")*2","v":0},{"$f":"COUNTIF(E42:E49,\"=X\")*3","v":0},{"$f":"COUNTIF(F42:F49,\"=X\")*4","v":0}]
["Pose de la poulie avec reprise de la tension",null,null,null,null,null,null,null,{"$f":"IF(AND(C42=\"\",D42=\"\",E42=\"\",F42=\"\"),\"Saisir une valeur !\",\"\")","v":"Saisir une valeur !"},{"$f":"IF(COUNTA(C42:F42)>1,\"Une seule réponse SVP !\",\"\")","v":""}]
["Contrôle et changement bandage, roulements",null,null,null,null,null,null,null,"Saisir une valeur !",""]
["Graissage",null,null,null,null,null,null,null,"Saisir une valeur !",""]
["Contrôle général",null,null,null,null,null,null,null,"Saisir une valeur !",""]
["Contrôle fonctionnement tir-fort",null,null,null,null,null,null,null,"Saisir une valeur !",""]
["Réparation perches et enrouleurs",null,null,null,null,null,null,null,"Saisir une valeur !",""]
[null,null,null,null,null,null,null,null,"Saisir une valeur !",""]
[null,null,null,null,null,null,null,null,"Saisir une valeur !",""]
[null,null,null,null,null,null,null,null,null,""]
["SAVOIR-FAIRE - TELESIEGES PINCES FIXES (TSF)",null,null,null,null,null,{"$f":"COUNTA(A53:B59,A61:B66,A68:B72)*4","v":48},{"$f":"(SUM(C52:F52)+SUM(C60:F60)+SUM(C67:F67))/G51*20","v":0},null,""]
["Télésiège - gare motrice",null,{"$f":"COUNTIF(C53:C59,\"=X\")*1","v":0},{"$f":"COUNTIF(D53:D59,\"=X\")*2","v":0},{"$f":"COUNTIF(E53:E59,\"=X\")*3","v":0},{"$f":"COUNTIF(F53:F59,\"=X\")*4","v":0}]
["Contrôle et réglage frein (changement plaquettes et rondelles belleville)",null,null,null,null,null,null,null,{"$f":"IF(AND(C53=\"\",D53=\"\",E53=\"\",F53=\"\"),\"Saisir une valeur !\",\"\")","v":"Saisir une valeur !"},{"$f":"IF(COUNTA(C53:F53)>1,\"Une seule réponse SVP !\",\"\")","v":""}]
["Points d graissage",null,null,null,null,null,null,null,"Saisir une valeur !",""]
["Contrôle courroie",null,null,null,null,null,null,null,"Saisir une valeur !",""]
["Réducteur (contrôle sonore, niveau huile, vidange)",null,null,null,null,null,null,null,"Saisir une valeur !",""]
["Contrôle moteur thermique",null,null,null,null,null,null,null,"Saisir une valeur !",""]
[null,null,null,null,null,null,null,null,"Saisir une valeur !",""]
[null,null,null,null,null,null,null,null,"Saisir une valeur !",""]
["Télésiège - ligne",null,{"$f":"COUNTIF(C61:C66,\"=X\")*1","v":0},{"$f":"COUNTIF(D61:D66,\"=X\")*2","v":0},{"$f":"COUNTIF(E61:E66,\"=X\")*3","v":0},{"$f":"COUNTIF(F61:F66,\"=X\")*4","v":0}]
["Pylônes - contrôle général",null,null,null,null,null,null,null,{"$f":"IF(AND(C61=\"\",D61=\"\",E61=\"\",F61=\"\"),\"Saisir une valeur !\",\"\")","v":"Saisir une valeur !"},{"$f":"IF(COUNTA(C61:F61)>1,\"Une seule réponse SVP !\",\"\")","v":""}]
["Décâblage et graissage hors charge",null,null,null,null,null,null,null,"Saisir une valeur !",""]
["Contrôle et changement bandage, roulements",null,null,null,null,null,null,null,"Saisir une valeur !",""]
["Changement de galet ",null,null,null,null,null,null,null,"Saisir une valeur !",""]
[null,null,null,null,null,null,null,null,"Saisir une valeur !",""]
[null,null,null,null,null,null,null,null,"Saisir une valeur !",""]
["Télésiège - poulie retour",null,{"$f":"COUNTIF(C68:C72,\"=X\")*1","v":0},{"$f":"COUNTIF(D68:D72,\"=X\")*2","v":0},{"$f":"COUNTIF(E68:E72,\"=X\")*3","v":0},{"$f":"COUNTIF(F68:F72,\"=X\")*4","v":0}]
["Graissage",null,null,null,null,null,null,null,{"$f":"IF(AND(C68=\"\",D68=\"\",E68=\"\",F68=\"\"),\"Saisir une valeur !\",\"\")","v":"Saisir une valeur !"},{"$f":"IF(COUNTA(C68:F68)>1,\"Une seule réponse SVP !\",\"\")","v":""}]
["Contrôle état général (fisure serrage boulonnerie contrôle massif + serrage des ancrages)",null,null,null,null,null,null,null,"Saisir une valeur !",""]
["Contrôle bandage",null,null,null,null,null,null,null,"Saisir une valeur !",""]
[null,null,null,null,null,null,null,null,"Saisir une valeur !",""]
[null,null,null,null,null,null,null,null,"Saisir une valeur !",""]
[null,null,null,null,null,null,null,null,null,""]
["SAVOIR-FAIRE - TELESIEGES DEBRAYABLES (TSD)",null,null,null,null,null,{"$f":"COUNTA(A76:B81,A83:B88,A90:B93)*4","v":40},{"$f":"(SUM(C75:F75)+SUM(C82:F82)+SUM(C89:F89))/G74*20","v":0},null,""]
["Télésiège - gare motrice",null,{"$f":"COUNTIF(C76:C81,\"=X\")*1","v":0},{"$f":"COUNTIF(D76:D81,\"=X\")*2","v":0},{"$f":"COUNTIF(E76:E81,\"=X\")*3","v":0},{"$f":"COUNTIF(F76:F81,\"=X\")*4","v":0}]
["Contrôle et réglage frein (changement plaquettes et rondelles belleville)",null,null,null,null,null,null,null,{"$f":"IF(AND(C76=\"\",D76=\"\",E76=\"\",F76=\"\"),\"Saisir une valeur !\",\"\")","v":"Saisir une valeur !"},{"$f":"IF(COUNTA(C76:F76)>1,\"Une seule réponse SVP !\",\"\")","v":""}]
["Contrôle et réglage gabarit de gare",null,null,null,null,null,null,null,"Saisir une valeur !",""]
["Contrôle état général (pneus, courroies, badage)",null,null,null,null,null,null,null,"Saisir une valeur !",""]
["Réducteur (contrôle sonore, niveau huile, vidange)",null,null,null,null,null,null,null,"Saisir une valeur !",""]
[null,null,null,null,null,null,null,null,"Saisir une valeur !",""]
[null,null,null,null,null,null,null,null,"Saisir une valeur !",""]
["Télésiège - ligne",null,{"$f":"COUNTIF(C83:C88,\"=X\")*1","v":0},{"$f":"COUNTIF(D83:D88,\"=X\")*2","v":0},{"$f":"COUNTIF(E83:E88,\"=X\")*3","v":0},{"$f":"COUNTIF(F83:F88,\"=X\")*4","v":0}]
["Pylônes - contrôle général",null,null,null,null,null,null,null,{"$f":"IF(AND(C83=\"\",D83=\"\",E83=\"\",F83=\"\"),\"Saisir une valeur !\",\"\")","v":"Saisir une valeur !"},{"$f":"IF(COUNTA(C83:F83)>1,\"Une seule réponse SVP !\",\"\")","v":""}]
["Décâblage et graissage hors charge",null,null,null,null,null,null,null,"Saisir une valeur !",""]
["Contrôle et changement bandage, roulements",null,null,null,null,null,null,null,"Saisir une valeur !",""]
["Changement de galets",null,null,null,null,null,null,null,"Saisir une valeur !",""]
[null,null,null,null,null,null,null,null,"Saisir une valeur !",""]
[null,null,null,null,null,null,null,null,"Saisir une valeur !",""]
["Télésiège - poulie retour",null,{"$f":"COUNTIF(C90:C93,\"=X\")*1","v":0},{"$f":"COUNTIF(D90:D93,\"=X\")*2","v":0},{"$f":"COUNTIF(E90:E93,\"=X\")*3","v":0},{"$f":"COUNTIF(F90:F93,\"=X\")*4","v":0}]
["Contrôle et réglage gabarit de gare",null,null,null,null,null,null,null,{"$f":"IF(AND(C90=\"\",D90=\"\",E90=\"\",F90=\"\"),\"Saisir une valeur !\",\"\")","v":"Saisir une valeur !"},{"$f":"IF(COUNTA(C90:F90)>1,\"Une seule réponse SVP !\",\"\")","v":""}]
["Contrôle état général (pneus, courroies, bandages)",null,null,null,null,null,null,null,"Saisir une valeur !",""]
[null,null,null,null,null,null,null,null,"Saisir une valeur !",""]
[null,null,null,null,null,null,null,null,"Saisir une valeur !",""]
[]
["SAVOIR-ETRE",null,{"$f":"COUNTIF(C96:C108,\"=X\")*1","v":0},{"$f":"COUNTIF(D96:D108,\"=X\")*2","v":0},{"$f":"COUNTIF(E96:E108,\"=X\")*3","v":0},{"$f":"COUNTIF(F96:F108,\"=X\")*4","v":0},{"$f":"COUNTA(A96:B108)*4","v":40},{"$f":"SUM(C95:F95)/G95*20","v":0}]
["Rigueur dans les contôles",null,null,null,null,null,null,null,{"$f":"IF(AND(C96=\"\",D96=\"\",E96=\"\",F96=\"\"),\"Saisir une valeur !\",\"\")","v":"Saisir une valeur !"},{"$f":"IF(COUNTA(C96:F96)>1,\"Une seule réponse SVP !\",\"\")","v":""}]
["Respect et propreté du matériel et des batiments ",null,null,null,null,null,null,null,"Saisir une valeur !",""]
["Prise d'initiative",null,null,null,null,null,null,null,"Saisir une valeur !",""]
["Ponctualité",null,null,null,null,null,null,null,"Saisir une valeur !",""]
["Respect de la sécurité (EPI, collègues de travail)",null,null,null,null,null,null,null,"Saisir une valeur !",""]
["Maîtrise de soi",null,null,null,null,null,null,null,"Saisir une valeur !",""]
["Discrétion professionnelle",null,null,null,null,null,null,null,"Saisir une valeur !",""]
["Respect de la hiérarchie",null,null,null,null,null,null,null,"Saisir une valeur !",""]
["Adaptabilité",null,null,null,null,null,null,null,"Saisir une valeur !",""]
["Motivation",null,null,null,null,null,null,null,"Saisir une valeur !",""]
[null,null,null,null,null,null,null,null,"Saisir une valeur !",""]
[null,null,null,null,null,null,null,null,"Saisir une valeur !",""]
[null,null,null,null,null,null,null,null,"Saisir une valeur !",""]
[]
["SYNTESE"]
[null,null,null,null,null,null,{"$f":"B3","v":"SALARIE 8"},{"$f":"'SYNTHESE EQUIPE'!L3","v":"Σ EQUIPE"},"OBJECTIF SALARIE FIXE"]
[{"$f":"A11","v":"FORMATION"},null,null,null,null,null,{"$f":"H11","v":0},{"$f":"'SYNTHESE EQUIPE'!L4","v":20},10]
[{"$f":"A26","v":"SAVOIR-FAIRE - TELESKI"},null,null,null,null,null,{"$f":"H26","v":0},{"$f":"'SYNTHESE EQUIPE'!L5","v":17.142857142857142},10]
[{"$f":"A51","v":"SAVOIR-FAIRE - TELESIEGES PINCES FIXES (TSF)"},null,null,null,null,null,{"$f":"H51","v":0},{"$f":"'SYNTHESE EQUIPE'!L6","v":11.25},10]
[{"$f":"A74","v":"SAVOIR-FAIRE - TELESIEGES DEBRAYABLES (TSD)"},null,null,null,null,null,{"$f":"H74","v":0},{"$f":"'SYNTHESE EQUIPE'!L7","v":14.5},10]
[{"$f":"A95","v":"SAVOIR-ETRE"},null,null,null,null,null,{"$f":"H95","v":0},{"$f":"'SYNTHESE EQUIPE'!L8","v":11.818181818181818},10]

{"sheet":"SALARIE 9","index":8,"n_rows":116,"n_cols":10,"rows_kept":116,"cut":false,"hidden":false,"merged":[[4,2,4,7],[10,0,10,1],[10,2,10,3],[10,4,10,5],[13,0,13,1],[13,2,13,3],[13,4,13,5],[13,6,13,7],[14,0,14,1],[14,2,14,3],[14,4,14,5],[14,6,14,7],[11,0,11,1],[11,2,11,3],[11,4,11,5],[11,6,11,7],[12,0,12,1],[12,2,12,3],[12,4,12,5],[12,6,12,7],[17,0,17,1],[17,2,17,3],[17,4,17,5],[17,6,17,7],[18,0,18,1],[18,2,18,3],[18,4,18,5],[18,6,18,7],[15,0,15,1],[15,2,15,3],[15,4,15,5],[15,6,15,7],[16,0,16,1],[16,2,16,3],[16,4,16,5],[16,6,16,7],[21,0,21,1],[21,2,21,3],[21,4,21,5],[21,6,21,7],[22,0,22,1],[22,2,22,3],[22,4,22,5],[22,6,22,7],[19,0,19,1],[19,2,19,3],[19,4,19,5],[19,6,19,7],[20,0,20,1],[20,2,20,3],[20,4,20,5],[20,6,20,7],[26,0,26,1],[26,6,26,7],[27,0,27,1],[28,0,28,1],[29,0,29,1],[30,0,30,1],[23,0,23,1],[23,2,23,3],[23,4,23,5],[23,6,23,7],[24,0,24,7],[31,0,31,1],[33,0,33,1],[34,0,34,1],[34,6,34,7],[35,0,35,1],[36,0,36,1],[31,6,31,7],[32,0,32,1],[32,6,32,7],[33,6,33,7],[65,0,65,1],[66,0,66,1],[66,6,66,7],[67,0,67,1],[68,0,68,1],[65,6,65,7],[67,6,67,7],[68,6,68,7],[56,0,56,1],[59,0,59,1],[59,6,59,7],[60,0,60,1],[61,0,61,1],[62,0,62,1],[56,6,56,7],[57,0,57,1],[57,6,57,7],[58,0,58,1],[58,6,58,7],[60,6,60,7],[61,6,61,7],[62,6,62,7],[63,6,63,7],[64,0,64,1],[77,0,77,1],[78,0,78,1],[80,0,80,1],[81,0,81,1],[81,6,81,7],[82,0,82,1],[80,6,80,7],[82,6,82,7],[69,0,69,1],[72,0,72,7],[74,0,74,1],[74,6,74,7],[75,0,75,1],[76,0,76,1],[69,6,69,7],[70,0,70,1],[70,6,70,7],[71,0,71,1],[83,0,83,1],[84,0,84,1],[85,0,85,1],[87,0,87,1],[88,0,88,1],[88,6,88,7],[83,6,83,7],[84,6,84,7],[85,6,85,7],[86,0,86,1],[105,6,105,7],[96,0,96,1],[97,0,97,1],[98,0,98,1],[99,0,99,1],[100,0,100,1],[101,0,101,1],[89,0,89,1],[90,0,90,1],[92,0,92,1],[93,0,93,7],[94,0,94,1],[95,0,95,1],[92,6,92,7],[95,6,95,7],[114,0,114,5],[115,0,115,5],[2,5,2,9],[3,2,3,4],[3,5,3,9],[7,0,7,9],[27,6,27,7],[28,6,28,7],[29,6,29,7],[30,6,30,7],[110,0,110,5],[110,8,110,9],[109,0,109,9],[111,0,111,5],[112,0,112,5],[113,0,113,5],[102,0,102,1],[103,0,103,1],[104,0,104,1],[105,0,105,1],[106,0,106,1],[102,6,102,7],[103,6,103,7],[104,6,104,7],[44,0,44,1],[44,6,44,7],[45,6,45,7],[46,6,46,7],[47,0,47,1],[47,6,47,7],[35,6,35,7],[36,6,36,7],[37,6,37,7],[38,0,38,1],[38,6,38,7],[39,6,39,7],[37,0,37,1],[39,0,39,1],[40,0,40,1],[40,6,40,7],[41,0,41,1],[41,6,41,7],[42,6,42,7],[43,0,43,1],[43,6,43,7],[64,6,64,7],[48,0,48,1],[48,6,48,7],[52,6,52,7],[53,6,53,7],[54,6,54,7],[55,6,55,7],[63,0,63,1],[51,0,51,1],[51,6,51,7],[52,0,52,1],[53,0,53,1],[54,0,54,1],[55,0,55,1],[50,0,50,1],[106,6,106,7],[107,0,107,1],[107,6,107,7],[0,0,0,9],[9,6,9,7],[96,6,96,7],[97,6,97,7],[98,6,98,7],[99,6,99,7],[100,6,100,7],[101,6,101,7],[86,6,86,7],[87,6,87,7],[89,6,89,7],[90,6,90,7],[91,0,91,1],[91,6,91,7],[71,6,71,7],[75,6,75,7],[76,6,76,7],[77,6,77,7],[78,6,78,7],[79,0,79,1],[79,6,79,7]]}
["OUVRIER ENTRETIEN MECANIQUE"]
[]
["Nom :","SALARIE 9","Dâte d'entrée :"]
["Prénom :",null,"Service :"]
["Poste occupé :"]
[]
[]
["NA = non acquis        ECA = en cours d'acquisition          A = acquis          M = maîtrisé"]
[]
[null,null,"NA","ECA","A","M","Commentaires"]
["FORMATION",null,{"$f":"COUNTIF(C12:D24,\"=X\")*0","v":0},null,{"$f":"COUNTIF(E12:F24,\"=X\")*1","v":0},null,{"$f":"COUNTA(A12:B24)*1","v":9},{"$f":"SUM(C11:F11)/G11*20","v":0}]
["Habilitation électrique",null,null,null,null,null,null,null,{"$f":"IF(AND(C12=\"\",E12=\"\"),\"Saisir une valeur !\",\"\")","v":"Saisir une valeur !"},{"$f":"IF(COUNTA(C12:F12)>1,\"Une seule réponse SVP !\",\"\")","v":""}]
["Formation SST",null,null,null,null,null,null,null,{"$f":"IF(AND(C13=\"\",E13=\"\"),\"Saisir une valeur !\",\"\")","v":"Saisir une valeur !"},{"$f":"IF(COUNTA(C13:F13)>1,\"Une seule réponse SVP !\",\"\")","v":""}]
["Habilitation pinces LPA",null,null,null,null,null,null,null,"Saisir une valeur !",{"$f":"IF(COUNTA(C14:F14)>1,\"Une seule réponse SVP !\",\"\")","v":""}]
["Habilitation pinces LA672",null,null,null,null,null,null,null,"Saisir une valeur !",{"$f":"IF(COUNTA(C15:F15)>1,\"Une seule réponse SVP !\",\"\")","v":""}]
["Habilitation pinces D-OMEGA T",null,null,null,null,null,null,null,"Saisir une valeur !",{"$f":"IF(COUNTA(C16:F16)>1,\"Une seule réponse SVP !\",\"\")","v":""}]
["Formation réglage gares",null,null,null,null,null,null,null,"Saisir une valeur !",{"$f":"IF(COUNTA(C17:F17)>1,\"Une seule réponse SVP !\",\"\")","v":""}]
["Formation réglage freins",null,null,null,null,null,null,null,"Saisir une valeur !",""]
["Epissures",null,null,null,null,null,null,null,"Saisir une valeur !",""]
["Habilitation travail en hauteur",null,null,null,null,null,null,null,"Saisir une valeur !",""]
[null,null,null,null,null,null,null,null,"Saisir une valeur !",""]
[null,null,null,null,null,null,null,null,"Saisir une valeur !",""]
[null,null,null,null,null,null,null,null,"Saisir une valeur !",""]
[null,null,null,null,null,null,null,null,"Saisir une valeur !",""]
[null,null,null,null,null,null,null,null,null,{"$f":"IF(AND(C25<>\"\",E25<>\"\"),\"Une seule réponse SVP !\",\"\")","v":""}]
["SAVOIR-FAIRE - TELESKI",null,null,null,null,null,{"$f":"COUNTA(A28:B34,A36:B40,A42:B49)*4","v":56},{"$f":"(SUM(C27:F27)+SUM(C35:F35)+SUM(C41:F41))/G26*20","v":0},null,""]
["Téleski - gare motrice",null,{"$f":"COUNTIF(C28:C34,\"=X\")*1","v":0},{"$f":"COUNTIF(D28:D34,\"=X\")*2","v":0},{"$f":"COUNTIF(E28:E34,\"=X\")*3","v":0},{"$f":"COUNTIF(F28:F34,\"=X\")*4","v":0}]
["Décablage - reprise de tension",null,null,null,null,null,null,null,{"$f":"IF(AND(C28=\"\",D28=\"\",E28=\"\",F28=\"\"),\"Saisir une valeur !\",\"\")","v":"Saisir une valeur !"},{"$f":"IF(COUNTA(C28:F28)>1,\"Une seule réponse SVP !\",\"\")","v":""}]
["Changement bandage, roulement",null,null,null,null,null,null,null,{"$f":"IF(AND(C29=\"\",D29=\"\",E29=\"\",F29=\"\"),\"Saisir une valeur !\",\"\")","v":"Saisir une valeur !"},{"$f":"IF(COUNTA(C29:F29)>1,\"Une seule réponse SVP !\",\"\")","v":""}]
["Réglage gare",null,null,null,null,null,null,null,"Saisir une valeur !",""]
["Changement protection gare",null,null,null,null,null,null,null,"Saisir une valeur !",""]
["Contrôle visuel du câble et épissure",null,null,null,null,null,null,null,"Saisir une valeur !",""]
[null,null,null,null,null,null,null,null,{"$f":"IF(AND(C33=\"\",D33=\"\",E33=\"\",F33=\"\"),\"Saisir une valeur !\",\"\")","v":"Saisir une valeur !"},""]
[null,null,null,null,null,null,null,null,{"$f":"IF(AND(C34=\"\",D34=\"\",E34=\"\",F34=\"\"),\"Saisir une valeur !\",\"\")","v":"Saisir une valeur !"},""]
["Téleski - ligne",null,{"$f":"COUNTIF(C36:C40,\"=X\")*1","v":0},{"$f":"COUNTIF(D36:D40,\"=X\")*2","v":0},{"$f":"COUNTIF(E36:E40,\"=X\")*3","v":0},{"$f":"COUNTIF(F36:F40,\"=X\")*4","v":0}]
["Pylônes - contrôle général",null,null,null,null,null,null,null,{"$f":"IF(AND(C36=\"\",D36=\"\",E36=\"\",F36=\"\"),\"Saisir une valeur !\",\"\")","v":"Saisir une valeur !"},{"$f":"IF(COUNTA(C36:F36)>1,\"Une seule réponse SVP !\",\"\")","v":""}]
["Décâblage",null,null,null,null,null,null,null,"Saisir une valeur !",""]
["Contrôle et changement bandage, roulements",null,null,null,null,null,null,null,"Saisir une valeur !",""]
[null,null,null,null,null,null,null,null,"Saisir une valeur !",""]
[null,null,null,null,null,null,null,null,"Saisir une valeur !",""]
["Téleski - poulie retour",null,{"$f":"COUNTIF(C42:C49,\"=X\")*1","v":0},{"$f":"COUNTIF(D42:D49,\"=X\")*2","v":0},{"$f":"COUNTIF(E42:E49,\"=X\")*3","v":0},{"$f":"COUNTIF(F42:F49,\"=X\")*4","v":0}]
["Pose de la poulie avec reprise de la tension",null,null,null,null,null,null,null,{"$f":"IF(AND(C42=\"\",D42=\"\",E42=\"\",F42=\"\"),\"Saisir une valeur !\",\"\")","v":"Saisir une valeur !"},{"$f":"IF(COUNTA(C42:F42)>1,\"Une seule réponse SVP !\",\"\")","v":""}]
["Contrôle et changement bandage, roulements",null,null,null,null,null,null,null,"Saisir une valeur !",""]
["Graissage",null,null,null,null,null,null,null,"Saisir une valeur !",""]
["Contrôle général",null,null,null,null,null,null,null,"Saisir une valeur !",""]
["Contrôle fonctionnement tir-fort",null,null,null,null,null,null,null,"Saisir une valeur !",""]
["Réparation perches et enrouleurs",null,null,null,null,null,null,null,"Saisir une valeur !",""]
[null,null,null,null,null,null,null,null,"Saisir une valeur !",""]
[null,null,null,null,null,null,null,null,"Saisir une valeur !",""]
[null,null,null,null,null,null,null,null,null,""]
["SAVOIR-FAIRE - TELESIEGES PINCES FIXES (TSF)",null,null,null,null,null,{"$f":"COUNTA(A53:B59,A61:B66,A68:B72)*4","v":48},{"$f":"(SUM(C52:F52)+SUM(C60:F60)+SUM(C67:F67))/G51*20","v":0},null,""]
["Télésiège - gare motrice",null,{"$f":"COUNTIF(C53:C59,\"=X\")*1","v":0},{"$f":"COUNTIF(D53:D59,\"=X\")*2","v":0},{"$f":"COUNTIF(E53:E59,\"=X\")*3","v":0},{"$f":"COUNTIF(F53:F59,\"=X\")*4","v":0}]
["Contrôle et réglage frein (changement plaquettes et rondelles belleville)",null,null,null,null,null,null,null,{"$f":"IF(AND(C53=\"\",D53=\"\",E53=\"\",F53=\"\"),\"Saisir une valeur !\",\"\")","v":"Saisir une valeur !"},{"$f":"IF(COUNTA(C53:F53)>1,\"Une seule réponse SVP !\",\"\")","v":""}]
["Points d graissage",null,null,null,null,null,null,null,"Saisir une valeur !",""]
["Contrôle courroie",null,null,null,null,null,null,null,"Saisir une valeur !",""]
["Réducteur (contrôle sonore, niveau huile, vidange)",null,null,null,null,null,null,null,"Saisir une valeur !",""]
["Contrôle moteur thermique",null,null,null,null,null,null,null,"Saisir une valeur !",""]
[null,null,null,null,null,null,null,null,"Saisir une valeur !",""]
[null,null,null,null,null,null,null,null,"Saisir une valeur !",""]
["Télésiège - ligne",null,{"$f":"COUNTIF(C61:C66,\"=X\")*1","v":0},{"$f":"COUNTIF(D61:D66,\"=X\")*2","v":0},{"$f":"COUNTIF(E61:E66,\"=X\")*3","v":0},{"$f":"COUNTIF(F61:F66,\"=X\")*4","v":0}]
["Pylônes - contrôle général",null,null,null,null,null,null,null,{"$f":"IF(AND(C61=\"\",D61=\"\",E61=\"\",F61=\"\"),\"Saisir une valeur !\",\"\")","v":"Saisir une valeur !"},{"$f":"IF(COUNTA(C61:F61)>1,\"Une seule réponse SVP !\",\"\")","v":""}]
["Décâblage et graissage hors charge",null,null,null,null,null,null,null,"Saisir une valeur !",""]
["Contrôle et changement bandage, roulements",null,null,null,null,null,null,null,"Saisir une valeur !",""]
["Changement de galet ",null,null,null,null,null,null,null,"Saisir une valeur !",""]
[null,null,null,null,null,null,null,null,"Saisir une valeur !",""]
[null,null,null,null,null,null,null,null,"Saisir une valeur !",""]
["Télésiège - poulie retour",null,{"$f":"COUNTIF(C68:C72,\"=X\")*1","v":0},{"$f":"COUNTIF(D68:D72,\"=X\")*2","v":0},{"$f":"COUNTIF(E68:E72,\"=X\")*3","v":0},{"$f":"COUNTIF(F68:F72,\"=X\")*4","v":0}]
["Graissage",null,null,null,null,null,null,null,{"$f":"IF(AND(C68=\"\",D68=\"\",E68=\"\",F68=\"\"),\"Saisir une valeur !\",\"\")","v":"Saisir une valeur !"},{"$f":"IF(COUNTA(C68:F68)>1,\"Une seule réponse SVP !\",\"\")","v":""}]
["Contrôle état général (fisure serrage boulonnerie contrôle massif + serrage des ancrages)",null,null,null,null,null,null,null,"Saisir une valeur !",""]
["Contrôle bandage",null,null,null,null,null,null,null,"Saisir une valeur !",""]
[null,null,null,null,null,null,null,null,"Saisir une valeur !",""]
[null,null,null,null,null,null,null,null,"Saisir une valeur !",""]
[null,null,null,null,null,null,null,null,null,""]
["SAVOIR-FAIRE - TELESIEGES DEBRAYABLES (TSD)",null,null,null,null,null,{"$f":"COUNTA(A76:B81,A83:B88,A90:B93)*4","v":40},{"$f":"(SUM(C75:F75)+SUM(C82:F82)+SUM(C89:F89))/G74*20","v":0},null,""]
["Télésiège - gare motrice",null,{"$f":"COUNTIF(C76:C81,\"=X\")*1","v":0},{"$f":"COUNTIF(D76:D81,\"=X\")*2","v":0},{"$f":"COUNTIF(E76:E81,\"=X\")*3","v":0},{"$f":"COUNTIF(F76:F81,\"=X\")*4","v":0}]
["Contrôle et réglage frein (changement plaquettes et rondelles belleville)",null,null,null,null,null,null,null,{"$f":"IF(AND(C76=\"\",D76=\"\",E76=\"\",F76=\"\"),\"Saisir une valeur !\",\"\")","v":"Saisir une valeur !"},{"$f":"IF(COUNTA(C76:F76)>1,\"Une seule réponse SVP !\",\"\")","v":""}]
["Contrôle et réglage gabarit de gare",null,null,null,null,null,null,null,"Saisir une valeur !",""]
["Contrôle état général (pneus, courroies, badage)",null,null,null,null,null,null,null,"Saisir une valeur !",""]
["Réducteur (contrôle sonore, niveau huile, vidange)",null,null,null,null,null,null,null,"Saisir une valeur !",""]
[null,null,null,null,null,null,null,null,"Saisir une valeur !",""]
[null,null,null,null,null,null,null,null,"Saisir une valeur !",""]
["Télésiège - ligne",null,{"$f":"COUNTIF(C83:C88,\"=X\")*1","v":0},{"$f":"COUNTIF(D83:D88,\"=X\")*2","v":0},{"$f":"COUNTIF(E83:E88,\"=X\")*3","v":0},{"$f":"COUNTIF(F83:F88,\"=X\")*4","v":0}]
["Pylônes - contrôle général",null,null,null,null,null,null,null,{"$f":"IF(AND(C83=\"\",D83=\"\",E83=\"\",F83=\"\"),\"Saisir une valeur !\",\"\")","v":"Saisir une valeur !"},{"$f":"IF(COUNTA(C83:F83)>1,\"Une seule réponse SVP !\",\"\")","v":""}]
["Décâblage et graissage hors charge",null,null,null,null,null,null,null,"Saisir une valeur !",""]
["Contrôle et changement bandage, roulements",null,null,null,null,null,null,null,"Saisir une valeur !",""]
["Changement de galets",null,null,null,null,null,null,null,"Saisir une valeur !",""]
[null,null,null,null,null,null,null,null,"Saisir une valeur !",""]
[null,null,null,null,null,null,null,null,"Saisir une valeur !",""]
["Télésiège - poulie retour",null,{"$f":"COUNTIF(C90:C93,\"=X\")*1","v":0},{"$f":"COUNTIF(D90:D93,\"=X\")*2","v":0},{"$f":"COUNTIF(E90:E93,\"=X\")*3","v":0},{"$f":"COUNTIF(F90:F93,\"=X\")*4","v":0}]
["Contrôle et réglage gabarit de gare",null,null,null,null,null,null,null,{"$f":"IF(AND(C90=\"\",D90=\"\",E90=\"\",F90=\"\"),\"Saisir une valeur !\",\"\")","v":"Saisir une valeur !"},{"$f":"IF(COUNTA(C90:F90)>1,\"Une seule réponse SVP !\",\"\")","v":""}]
["Contrôle état général (pneus, courroies, bandages)",null,null,null,null,null,null,null,"Saisir une valeur !",""]
[null,null,null,null,null,null,null,null,"Saisir une valeur !",""]
[null,null,null,null,null,null,null,null,"Saisir une valeur !",""]
[]
["SAVOIR-ETRE",null,{"$f":"COUNTIF(C96:C108,\"=X\")*1","v":0},{"$f":"COUNTIF(D96:D108,\"=X\")*2","v":0},{"$f":"COUNTIF(E96:E108,\"=X\")*3","v":0},{"$f":"COUNTIF(F96:F108,\"=X\")*4","v":0},{"$f":"COUNTA(A96:B108)*4","v":40},{"$f":"SUM(C95:F95)/G95*20","v":0}]
["Rigueur dans les contôles",null,null,null,null,null,null,null,{"$f":"IF(AND(C96=\"\",D96=\"\",E96=\"\",F96=\"\"),\"Saisir une valeur !\",\"\")","v":"Saisir une valeur !"},{"$f":"IF(COUNTA(C96:F96)>1,\"Une seule réponse SVP !\",\"\")","v":""}]
["Respect et propreté du matériel et des batiments ",null,null,null,null,null,null,null,"Saisir une valeur !",""]
["Prise d'initiative",null,null,null,null,null,null,null,"Saisir une valeur !",""]
["Ponctualité",null,null,null,null,null,null,null,"Saisir une valeur !",""]
["Respect de la sécurité (EPI, collègues de travail)",null,null,null,null,null,null,null,"Saisir une valeur !",""]
["Maîtrise de soi",null,null,null,null,null,null,null,"Saisir une valeur !",""]
["Discrétion professionnelle",null,null,null,null,null,null,null,"Saisir une valeur !",""]
["Respect de la hiérarchie",null,null,null,null,null,null,null,"Saisir une valeur !",""]
["Adaptabilité",null,null,null,null,null,null,null,"Saisir une valeur !",""]
["Motivation",null,null,null,null,null,null,null,"Saisir une valeur !",""]
[null,null,null,null,null,null,null,null,"Saisir une valeur !",""]
[null,null,null,null,null,null,null,null,"Saisir une valeur !",""]
[null,null,null,null,null,null,null,null,"Saisir une valeur !",""]
[]
["SYNTESE"]
[null,null,null,null,null,null,{"$f":"B3","v":"SALARIE 9"},{"$f":"'SYNTHESE EQUIPE'!L3","v":"Σ EQUIPE"},"OBJECTIF SALARIE FIXE"]
[{"$f":"A11","v":"FORMATION"},null,null,null,null,null,{"$f":"H11","v":0},{"$f":"'SYNTHESE EQUIPE'!L4","v":20},10]
[{"$f":"A26","v":"SAVOIR-FAIRE - TELESKI"},null,null,null,null,null,{"$f":"H26","v":0},{"$f":"'SYNTHESE EQUIPE'!L5","v":17.142857142857142},10]
[{"$f":"A51","v":"SAVOIR-FAIRE - TELESIEGES PINCES FIXES (TSF)"},null,null,null,null,null,{"$f":"H51","v":0},{"$f":"'SYNTHESE EQUIPE'!L6","v":11.25},10]
[{"$f":"A74","v":"SAVOIR-FAIRE - TELESIEGES DEBRAYABLES (TSD)"},null,null,null,null,null,{"$f":"H74","v":0},{"$f":"'SYNTHESE EQUIPE'!L7","v":14.5},10]
[{"$f":"A95","v":"SAVOIR-ETRE"},null,null,null,null,null,{"$f":"H95","v":0},{"$f":"'SYNTHESE EQUIPE'!L8","v":11.818181818181818},10]

{"sheet":"SALARIE 10","index":9,"n_rows":116,"n_cols":10,"rows_kept":116,"cut":false,"hidden":false,"merged":[[105,0,105,1],[106,0,106,1],[110,0,110,5],[22,0,22,1],[22,2,22,3],[22,4,22,5],[22,6,22,7],[23,0,23,1],[23,2,23,3],[23,4,23,5],[23,6,23,7],[100,0,100,1],[101,0,101,1],[102,0,102,1],[103,0,103,1],[104,0,104,1],[95,0,95,1],[96,0,96,1],[97,0,97,1],[98,0,98,1],[99,0,99,1],[85,0,85,1],[87,0,87,1],[75,0,75,1],[10,0,10,1],[24,0,24,7],[72,0,72,7],[93,0,93,7],[20,0,20,1],[20,6,20,7],[20,2,20,3],[20,4,20,5],[21,0,21,1],[21,2,21,3],[81,0,81,1],[88,0,88,1],[90,0,90,1],[89,0,89,1],[92,0,92,1],[82,0,82,1],[83,0,83,1],[84,0,84,1],[76,0,76,1],[77,0,77,1],[36,6,36,7],[37,6,37,7],[38,0,38,1],[38,6,38,7],[39,6,39,7],[59,0,59,1],[65,0,65,1],[53,0,53,1],[54,0,54,1],[55,0,55,1],[56,0,56,1],[60,0,60,1],[40,0,40,1],[41,0,41,1],[51,0,51,1],[52,0,52,1],[48,0,48,1],[61,0,61,1],[62,0,62,1],[63,0,63,1],[50,0,50,1],[41,6,41,7],[42,6,42,7],[43,0,43,1],[43,6,43,7],[44,0,44,1],[44,6,44,7],[45,6,45,7],[13,6,13,7],[26,0,26,1],[21,4,21,5],[21,6,21,7],[14,6,14,7],[15,6,15,7],[4,2,4,7],[10,2,10,3],[10,4,10,5],[11,2,11,3],[11,4,11,5],[12,2,12,3],[12,4,12,5],[13,2,13,3],[13,4,13,5],[14,2,14,3],[14,4,14,5],[15,2,15,3],[15,4,15,5],[16,6,16,7],[17,6,17,7],[18,6,18,7],[19,6,19,7],[26,6,26,7],[34,6,34,7],[40,6,40,7],[51,6,51,7],[59,6,59,7],[66,6,66,7],[74,6,74,7],[81,6,81,7],[88,6,88,7],[16,0,16,1],[17,0,17,1],[35,0,35,1],[36,0,36,1],[37,0,37,1],[39,0,39,1],[34,0,34,1],[30,0,30,1],[31,0,31,1],[33,0,33,1],[18,0,18,1],[19,0,19,1],[27,0,27,1],[28,0,28,1],[29,0,29,1],[35,6,35,7],[7,0,7,9],[27,6,27,7],[28,6,28,7],[29,6,29,7],[30,6,30,7],[31,6,31,7],[32,0,32,1],[32,6,32,7],[33,6,33,7],[11,0,11,1],[12,0,12,1],[13,0,13,1],[14,0,14,1],[15,0,15,1],[16,2,16,3],[16,4,16,5],[17,2,17,3],[17,4,17,5],[18,2,18,3],[18,4,18,5],[19,2,19,3],[19,4,19,5],[11,6,11,7],[12,6,12,7],[46,6,46,7],[47,0,47,1],[47,6,47,7],[48,6,48,7],[52,6,52,7],[53,6,53,7],[54,6,54,7],[55,6,55,7],[56,6,56,7],[57,0,57,1],[57,6,57,7],[58,0,58,1],[58,6,58,7],[60,6,60,7],[61,6,61,7],[62,6,62,7],[63,6,63,7],[64,0,64,1],[64,6,64,7],[65,6,65,7],[67,6,67,7],[68,6,68,7],[66,0,66,1],[67,0,67,1],[68,0,68,1],[69,6,69,7],[70,0,70,1],[70,6,70,7],[71,0,71,1],[71,6,71,7],[75,6,75,7],[76,6,76,7],[77,6,77,7],[78,6,78,7],[78,0,78,1],[69,0,69,1],[74,0,74,1],[97,6,97,7],[98,6,98,7],[79,6,79,7],[80,6,80,7],[82,6,82,7],[83,6,83,7],[84,6,84,7],[85,6,85,7],[86,0,86,1],[86,6,86,7],[87,6,87,7],[80,0,80,1],[79,0,79,1],[94,0,94,1],[0,0,0,9],[2,5,2,9],[3,2,3,4],[3,5,3,9],[110,8,110,9],[109,0,109,9],[9,6,9,7],[99,6,99,7],[100,6,100,7],[101,6,101,7],[102,6,102,7],[103,6,103,7],[104,6,104,7],[105,6,105,7],[106,6,106,7],[107,0,107,1],[107,6,107,7],[89,6,89,7],[90,6,90,7],[91,0,91,1],[91,6,91,7],[92,6,92,7],[95,6,95,7],[96,6,96,7]]}
["OUVRIER ENTRETIEN MECANIQUE"]
[]
["Nom :","SALARIE 10","Dâte d'entrée :"]
["Prénom :",null,"Service :"]
["Poste occupé :"]
[]
[]
["NA = non acquis        ECA = en cours d'acquisition          A = acquis          M = maîtrisé"]
[]
[null,null,"NA","ECA","A","M","Commentaires"]
["FORMATION",null,{"$f":"COUNTIF(C12:D24,\"=X\")*0","v":0},null,{"$f":"COUNTIF(E12:F24,\"=X\")*1","v":0},null,{"$f":"COUNTA(A12:B24)*1","v":9},{"$f":"SUM(C11:F11)/G11*20","v":0}]
["Habilitation électrique",null,null,null,null,null,null,null,{"$f":"IF(AND(C12=\"\",E12=\"\"),\"Saisir une valeur !\",\"\")","v":"Saisir une valeur !"},{"$f":"IF(COUNTA(C12:F12)>1,\"Une seule réponse SVP !\",\"\")","v":""}]
["Formation SST",null,null,null,null,null,null,null,{"$f":"IF(AND(C13=\"\",E13=\"\"),\"Saisir une valeur !\",\"\")","v":"Saisir une valeur !"},{"$f":"IF(COUNTA(C13:F13)>1,\"Une seule réponse SVP !\",\"\")","v":""}]
["Habilitation pinces LPA",null,null,null,null,null,null,null,"Saisir une valeur !",{"$f":"IF(COUNTA(C14:F14)>1,\"Une seule réponse SVP !\",\"\")","v":""}]
["Habilitation pinces LA672",null,null,null,null,null,null,null,"Saisir une valeur !",{"$f":"IF(COUNTA(C15:F15)>1,\"Une seule réponse SVP !\",\"\")","v":""}]
["Habilitation pinces D-OMEGA T",null,null,null,null,null,null,null,"Saisir une valeur !",{"$f":"IF(COUNTA(C16:F16)>1,\"Une seule réponse SVP !\",\"\")","v":""}]
["Formation réglage gares",null,null,null,null,null,null,null,"Saisir une valeur !",{"$f":"IF(COUNTA(C17:F17)>1,\"Une seule réponse SVP !\",\"\")","v":""}]
["Formation réglage freins",null,null,null,null,null,null,null,"Saisir une valeur !",""]
["Epissures",null,null,null,null,null,null,null,"Saisir une valeur !",""]
["Habilitation travail en hauteur",null,null,null,null,null,null,null,"Saisir une valeur !",""]
[null,null,null,null,null,null,null,null,"Saisir une valeur !",""]
[null,null,null,null,null,null,null,null,"Saisir une valeur !",""]
[null,null,null,null,null,null,null,null,"Saisir une valeur !",""]
[null,null,null,null,null,null,null,null,"Saisir une valeur !",""]
[null,null,null,null,null,null,null,null,null,{"$f":"IF(AND(C25<>\"\",E25<>\"\"),\"Une seule réponse SVP !\",\"\")","v":""}]
["SAVOIR-FAIRE - TELESKI",null,null,null,null,null,{"$f":"COUNTA(A28:B34,A36:B40,A42:B49)*4","v":56},{"$f":"(SUM(C27:F27)+SUM(C35:F35)+SUM(C41:F41))/G26*20","v":0},null,""]
["Téleski - gare motrice",null,{"$f":"COUNTIF(C28:C34,\"=X\")*1","v":0},{"$f":"COUNTIF(D28:D34,\"=X\")*2","v":0},{"$f":"COUNTIF(E28:E34,\"=X\")*3","v":0},{"$f":"COUNTIF(F28:F34,\"=X\")*4","v":0}]
["Décablage - reprise de tension",null,null,null,null,null,null,null,{"$f":"IF(AND(C28=\"\",D28=\"\",E28=\"\",F28=\"\"),\"Saisir une valeur !\",\"\")","v":"Saisir une valeur !"},{"$f":"IF(COUNTA(C28:F28)>1,\"Une seule réponse SVP !\",\"\")","v":""}]
["Changement bandage, roulement",null,null,null,null,null,null,null,{"$f":"IF(AND(C29=\"\",D29=\"\",E29=\"\",F29=\"\"),\"Saisir une valeur !\",\"\")","v":"Saisir une valeur !"},{"$f":"IF(COUNTA(C29:F29)>1,\"Une seule réponse SVP !\",\"\")","v":""}]
["Réglage gare",null,null,null,null,null,null,null,"Saisir une valeur !",""]
["Changement protection gare",null,null,null,null,null,null,null,"Saisir une valeur !",""]
["Contrôle visuel du câble et épissure",null,null,null,null,null,null,null,"Saisir une valeur !",""]
[null,null,null,null,null,null,null,null,{"$f":"IF(AND(C33=\"\",D33=\"\",E33=\"\",F33=\"\"),\"Saisir une valeur !\",\"\")","v":"Saisir une valeur !"},""]
[null,null,null,null,null,null,null,null,{"$f":"IF(AND(C34=\"\",D34=\"\",E34=\"\",F34=\"\"),\"Saisir une valeur !\",\"\")","v":"Saisir une valeur !"},""]
["Téleski - ligne",null,{"$f":"COUNTIF(C36:C40,\"=X\")*1","v":0},{"$f":"COUNTIF(D36:D40,\"=X\")*2","v":0},{"$f":"COUNTIF(E36:E40,\"=X\")*3","v":0},{"$f":"COUNTIF(F36:F40,\"=X\")*4","v":0}]
["Pylônes - contrôle général",null,null,null,null,null,null,null,{"$f":"IF(AND(C36=\"\",D36=\"\",E36=\"\",F36=\"\"),\"Saisir une valeur !\",\"\")","v":"Saisir une valeur !"},{"$f":"IF(COUNTA(C36:F36)>1,\"Une seule réponse SVP !\",\"\")","v":""}]
["Décâblage",null,null,null,null,null,null,null,"Saisir une valeur !",""]
["Contrôle et changement bandage, roulements",null,null,null,null,null,null,null,"Saisir une valeur !",""]
[null,null,null,null,null,null,null,null,"Saisir une valeur !",""]
[null,null,null,null,null,null,null,null,"Saisir une valeur !",""]
["Téleski - poulie retour",null,{"$f":"COUNTIF(C42:C49,\"=X\")*1","v":0},{"$f":"COUNTIF(D42:D49,\"=X\")*2","v":0},{"$f":"COUNTIF(E42:E49,\"=X\")*3","v":0},{"$f":"COUNTIF(F42:F49,\"=X\")*4","v":0}]
["Pose de la poulie avec reprise de la tension",null,null,null,null,null,null,null,{"$f":"IF(AND(C42=\"\",D42=\"\",E42=\"\",F42=\"\"),\"Saisir une valeur !\",\"\")","v":"Saisir une valeur !"},{"$f":"IF(COUNTA(C42:F42)>1,\"Une seule réponse SVP !\",\"\")","v":""}]
["Contrôle et changement bandage, roulements",null,null,null,null,null,null,null,"Saisir une valeur !",""]
["Graissage",null,null,null,null,null,null,null,"Saisir une valeur !",""]
["Contrôle général",null,null,null,null,null,null,null,"Saisir une valeur !",""]
["Contrôle fonctionnement tir-fort",null,null,null,null,null,null,null,"Saisir une valeur !",""]
["Réparation perches et enrouleurs",null,null,null,null,null,null,null,"Saisir une valeur !",""]
[null,null,null,null,null,null,null,null,"Saisir une valeur !",""]
[null,null,null,null,null,null,null,null,"Saisir une valeur !",""]
[null,null,null,null,null,null,null,null,null,""]
["SAVOIR-FAIRE - TELESIEGES PINCES FIXES (TSF)",null,null,null,null,null,{"$f":"COUNTA(A53:B59,A61:B66,A68:B72)*4","v":48},{"$f":"(SUM(C52:F52)+SUM(C60:F60)+SUM(C67:F67))/G51*20","v":0},null,""]
["Télésiège - gare motrice",null,{"$f":"COUNTIF(C53:C59,\"=X\")*1","v":0},{"$f":"COUNTIF(D53:D59,\"=X\")*2","v":0},{"$f":"COUNTIF(E53:E59,\"=X\")*3","v":0},{"$f":"COUNTIF(F53:F59,\"=X\")*4","v":0}]
["Contrôle et réglage frein (changement plaquettes et rondelles belleville)",null,null,null,null,null,null,null,{"$f":"IF(AND(C53=\"\",D53=\"\",E53=\"\",F53=\"\"),\"Saisir une valeur !\",\"\")","v":"Saisir une valeur !"},{"$f":"IF(COUNTA(C53:F53)>1,\"Une seule réponse SVP !\",\"\")","v":""}]
["Points d graissage",null,null,null,null,null,null,null,"Saisir une valeur !",""]
["Contrôle courroie",null,null,null,null,null,null,null,"Saisir une valeur !",""]
["Réducteur (contrôle sonore, niveau huile, vidange)",null,null,null,null,null,null,null,"Saisir une valeur !",""]
["Contrôle moteur thermique",null,null,null,null,null,null,null,"Saisir une valeur !",""]
[null,null,null,null,null,null,null,null,"Saisir une valeur !",""]
[null,null,null,null,null,null,null,null,"Saisir une valeur !",""]
["Télésiège - ligne",null,{"$f":"COUNTIF(C61:C66,\"=X\")*1","v":0},{"$f":"COUNTIF(D61:D66,\"=X\")*2","v":0},{"$f":"COUNTIF(E61:E66,\"=X\")*3","v":0},{"$f":"COUNTIF(F61:F66,\"=X\")*4","v":0}]
["Pylônes - contrôle général",null,null,null,null,null,null,null,{"$f":"IF(AND(C61=\"\",D61=\"\",E61=\"\",F61=\"\"),\"Saisir une valeur !\",\"\")","v":"Saisir une valeur !"},{"$f":"IF(COUNTA(C61:F61)>1,\"Une seule réponse SVP !\",\"\")","v":""}]
["Décâblage et graissage hors charge",null,null,null,null,null,null,null,"Saisir une valeur !",""]
["Contrôle et changement bandage, roulements",null,null,null,null,null,null,null,"Saisir une valeur !",""]
["Changement de galet ",null,null,null,null,null,null,null,"Saisir une valeur !",""]
[null,null,null,null,null,null,null,null,"Saisir une valeur !",""]
[null,null,null,null,null,null,null,null,"Saisir une valeur !",""]
["Télésiège - poulie retour",null,{"$f":"COUNTIF(C68:C72,\"=X\")*1","v":0},{"$f":"COUNTIF(D68:D72,\"=X\")*2","v":0},{"$f":"COUNTIF(E68:E72,\"=X\")*3","v":0},{"$f":"COUNTIF(F68:F72,\"=X\")*4","v":0}]
["Graissage",null,null,null,null,null,null,null,{"$f":"IF(AND(C68=\"\",D68=\"\",E68=\"\",F68=\"\"),\"Saisir une valeur !\",\"\")","v":"Saisir une valeur !"},{"$f":"IF(COUNTA(C68:F68)>1,\"Une seule réponse SVP !\",\"\")","v":""}]
["Contrôle état général (fisure serrage boulonnerie contrôle massif + serrage des ancrages)",null,null,null,null,null,null,null,"Saisir une valeur !",""]
["Contrôle bandage",null,null,null,null,null,null,null,"Saisir une valeur !",""]
[null,null,null,null,null,null,null,null,"Saisir une valeur !",""]
[null,null,null,null,null,null,null,null,"Saisir une valeur !",""]
[null,null,null,null,null,null,null,null,null,""]
["SAVOIR-FAIRE - TELESIEGES DEBRAYABLES (TSD)",null,null,null,null,null,{"$f":"COUNTA(A76:B81,A83:B88,A90:B93)*4","v":40},{"$f":"(SUM(C75:F75)+SUM(C82:F82)+SUM(C89:F89))/G74*20","v":0},null,""]
["Télésiège - gare motrice",null,{"$f":"COUNTIF(C76:C81,\"=X\")*1","v":0},{"$f":"COUNTIF(D76:D81,\"=X\")*2","v":0},{"$f":"COUNTIF(E76:E81,\"=X\")*3","v":0},{"$f":"COUNTIF(F76:F81,\"=X\")*4","v":0}]
["Contrôle et réglage frein (changement plaquettes et rondelles belleville)",null,null,null,null,null,null,null,{"$f":"IF(AND(C76=\"\",D76=\"\",E76=\"\",F76=\"\"),\"Saisir une valeur !\",\"\")","v":"Saisir une valeur !"},{"$f":"IF(COUNTA(C76:F76)>1,\"Une seule réponse SVP !\",\"\")","v":""}]
["Contrôle et réglage gabarit de gare",null,null,null,null,null,null,null,"Saisir une valeur !",""]
["Contrôle état général (pneus, courroies, badage)",null,null,null,null,null,null,null,"Saisir une valeur !",""]
["Réducteur (contrôle sonore, niveau huile, vidange)",null,null,null,null,null,null,null,"Saisir une valeur !",""]
[null,null,null,null,null,null,null,null,"Saisir une valeur !",""]
[null,null,null,null,null,null,null,null,"Saisir une valeur !",""]
["Télésiège - ligne",null,{"$f":"COUNTIF(C83:C88,\"=X\")*1","v":0},{"$f":"COUNTIF(D83:D88,\"=X\")*2","v":0},{"$f":"COUNTIF(E83:E88,\"=X\")*3","v":0},{"$f":"COUNTIF(F83:F88,\"=X\")*4","v":0}]
["Pylônes - contrôle général",null,null,null,null,null,null,null,{"$f":"IF(AND(C83=\"\",D83=\"\",E83=\"\",F83=\"\"),\"Saisir une valeur !\",\"\")","v":"Saisir une valeur !"},{"$f":"IF(COUNTA(C83:F83)>1,\"Une seule réponse SVP !\",\"\")","v":""}]
["Décâblage et graissage hors charge",null,null,null,null,null,null,null,"Saisir une valeur !",""]
["Contrôle et changement bandage, roulements",null,null,null,null,null,null,null,"Saisir une valeur !",""]
["Changement de galets",null,null,null,null,null,null,null,"Saisir une valeur !",""]
[null,null,null,null,null,null,null,null,"Saisir une valeur !",""]
[null,null,null,null,null,null,null,null,"Saisir une valeur !",""]
["Télésiège - poulie retour",null,{"$f":"COUNTIF(C90:C93,\"=X\")*1","v":0},{"$f":"COUNTIF(D90:D93,\"=X\")*2","v":0},{"$f":"COUNTIF(E90:E93,\"=X\")*3","v":0},{"$f":"COUNTIF(F90:F93,\"=X\")*4","v":0}]
["Contrôle et réglage gabarit de gare",null,null,null,null,null,null,null,{"$f":"IF(AND(C90=\"\",D90=\"\",E90=\"\",F90=\"\"),\"Saisir une valeur !\",\"\")","v":"Saisir une valeur !"},{"$f":"IF(COUNTA(C90:F90)>1,\"Une seule réponse SVP !\",\"\")","v":""}]
["Contrôle état général (pneus, courroies, bandages)",null,null,null,null,null,null,null,"Saisir une valeur !",""]
[null,null,null,null,null,null,null,null,"Saisir une valeur !",""]
[null,null,null,null,null,null,null,null,"Saisir une valeur !",""]
[]
["SAVOIR-ETRE",null,{"$f":"COUNTIF(C96:C108,\"=X\")*1","v":0},{"$f":"COUNTIF(D96:D108,\"=X\")*2","v":0},{"$f":"COUNTIF(E96:E108,\"=X\")*3","v":0},{"$f":"COUNTIF(F96:F108,\"=X\")*4","v":0},{"$f":"COUNTA(A96:B108)*4","v":40},{"$f":"SUM(C95:F95)/G95*20","v":0}]
["Rigueur dans les contôles",null,null,null,null,null,null,null,{"$f":"IF(AND(C96=\"\",D96=\"\",E96=\"\",F96=\"\"),\"Saisir une valeur !\",\"\")","v":"Saisir une valeur !"},{"$f":"IF(COUNTA(C96:F96)>1,\"Une seule réponse SVP !\",\"\")","v":""}]
["Respect et propreté du matériel et des batiments ",null,null,null,null,null,null,null,"Saisir une valeur !",""]
["Prise d'initiative",null,null,null,null,null,null,null,"Saisir une valeur !",""]
["Ponctualité",null,null,null,null,null,null,null,"Saisir une valeur !",""]
["Respect de la sécurité (EPI, collègues de travail)",null,null,null,null,null,null,null,"Saisir une valeur !",""]
["Maîtrise de soi",null,null,null,null,null,null,null,"Saisir une valeur !",""]
["Discrétion professionnelle",null,null,null,null,null,null,null,"Saisir une valeur !",""]
["Respect de la hiérarchie",null,null,null,null,null,null,null,"Saisir une valeur !",""]
["Adaptabilité",null,null,null,null,null,null,null,"Saisir une valeur !",""]
["Motivation",null,null,null,null,null,null,null,"Saisir une valeur !",""]
[null,null,null,null,null,null,null,null,"Saisir une valeur !",""]
[null,null,null,null,null,null,null,null,"Saisir une valeur !",""]
[null,null,null,null,null,null,null,null,"Saisir une valeur !",""]
[]
["SYNTESE"]
[null,null,null,null,null,null,{"$f":"B3","v":"SALARIE 10"},{"$f":"'SYNTHESE EQUIPE'!L3","v":"Σ EQUIPE"},"OBJECTIF SALARIE FIXE"]
[{"$f":"A11","v":"FORMATION"},null,null,null,null,null,{"$f":"H11","v":0},{"$f":"'SYNTHESE EQUIPE'!L4","v":20},10]
[{"$f":"A26","v":"SAVOIR-FAIRE - TELESKI"},null,null,null,null,null,{"$f":"H26","v":0},{"$f":"'SYNTHESE EQUIPE'!L5","v":17.142857142857142},10]
[{"$f":"A51","v":"SAVOIR-FAIRE - TELESIEGES PINCES FIXES (TSF)"},null,null,null,null,null,{"$f":"H51","v":0},{"$f":"'SYNTHESE EQUIPE'!L6","v":11.25},10]
[{"$f":"A74","v":"SAVOIR-FAIRE - TELESIEGES DEBRAYABLES (TSD)"},null,null,null,null,null,{"$f":"H74","v":0},{"$f":"'SYNTHESE EQUIPE'!L7","v":14.5},10]
[{"$f":"A95","v":"SAVOIR-ETRE"},null,null,null,null,null,{"$f":"H95","v":0},{"$f":"'SYNTHESE EQUIPE'!L8","v":11.818181818181818},10]

{"sheet":"SYNTHESE EQUIPE","index":10,"n_rows":8,"n_cols":13,"rows_kept":8,"cut":false,"hidden":false,"merged":[[2,12,2,15],[0,0,0,15]]}
["SYNTHESE EQUIPE"]
[]
["X",{"$f":"SUBNAME1","v":"SALARIE 1"},{"$f":"SUBNAME2","v":"SALARIE 2"},{"$f":"SUBNAME3","v":"SALARIE 3"},{"$f":"SUBNAME4","v":"SALARIE 4"},{"$f":"SUBNAME5","v":"SALARIE 5"},{"$f":"SUBNAME6","v":"rrrrr"},{"$f":"SUBNAME7","v":"SALARIE 7"},{"$f":"SUBNAME8","v":"SALARIE 8"},{"$f":"SUBNAME9","v":"SALARIE 9"},{"$f":"SUBNAME10","v":"SALARIE 10"},"Σ EQUIPE","OBJECTIF EQUIPE"]
[{"$f":"'SALARIE 1'!A113","v":"FORMATION"},{"$f":"'SALARIE 1'!G113","v":20},{"$f":"'SALARIE 2'!G112","v":0},{"$f":"'SALARIE 3'!G112","v":0},{"$f":"'SALARIE 4'!G112","v":0},{"$f":"'SALARIE 5'!G112","v":0},{"$f":"'SALARIE 6'!G112","v":0},{"$f":"'SALARIE 7'!G112","v":0},{"$f":"'SALARIE 8'!G112","v":0},{"$f":"'SALARIE 9'!G112","v":0},{"$f":"'SALARIE 10'!G112","v":0},{"$f":"SUM(B4:K4)/(COUNTIF(B4:K4,\">0\"))","v":20},13]
[{"$f":"'SALARIE 1'!A114","v":"SAVOIR-FAIRE - TELESKI"},{"$f":"'SALARIE 1'!G114","v":17.142857142857142},{"$f":"'SALARIE 2'!G113","v":0},{"$f":"'SALARIE 3'!G113","v":0},{"$f":"'SALARIE 4'!G113","v":0},{"$f":"'SALARIE 5'!G113","v":0},{"$f":"'SALARIE 6'!G113","v":0},{"$f":"'SALARIE 7'!G113","v":0},{"$f":"'SALARIE 8'!G113","v":0},{"$f":"'SALARIE 9'!G113","v":0},{"$f":"'SALARIE 10'!G113","v":0},{"$f":"SUM(B5:K5)/(COUNTIF(B5:K5,\">0\"))","v":17.142857142857142},14]
[{"$f":"'SALARIE 1'!A115","v":"SAVOIR-FAIRE - TELESIEGES PINCES FIXES (TSF)"},{"$f":"'SALARIE 1'!G115","v":11.25},{"$f":"'SALARIE 2'!G114","v":0},{"$f":"'SALARIE 3'!G114","v":0},{"$f":"'SALARIE 4'!G114","v":0},{"$f":"'SALARIE 5'!G114","v":0},{"$f":"'SALARIE 6'!G114","v":0},{"$f":"'SALARIE 7'!G114","v":0},{"$f":"'SALARIE 8'!G114","v":0},{"$f":"'SALARIE 9'!G114","v":0},{"$f":"'SALARIE 10'!G114","v":0},11.25,15]
[{"$f":"'SALARIE 1'!A116","v":"SAVOIR-FAIRE - TELESIEGES DEBRAYABLES (TSD)"},{"$f":"'SALARIE 1'!G116","v":14.5},{"$f":"'SALARIE 2'!G115","v":0},{"$f":"'SALARIE 3'!G115","v":0},{"$f":"'SALARIE 4'!G115","v":0},{"$f":"'SALARIE 5'!G115","v":0},{"$f":"'SALARIE 6'!G115","v":0},{"$f":"'SALARIE 7'!G115","v":0},{"$f":"'SALARIE 8'!G115","v":0},{"$f":"'SALARIE 9'!G115","v":0},{"$f":"'SALARIE 10'!G115","v":0},14.5,15]
[{"$f":"'SALARIE 1'!A117","v":"SAVOIR-ETRE"},{"$f":"'SALARIE 1'!G117","v":11.818181818181818},{"$f":"'SALARIE 2'!G116","v":0},{"$f":"'SALARIE 3'!G116","v":0},{"$f":"'SALARIE 4'!G116","v":0},{"$f":"'SALARIE 5'!G116","v":0},{"$f":"'SALARIE 6'!G116","v":0},{"$f":"'SALARIE 7'!G116","v":0},{"$f":"'SALARIE 8'!G116","v":0},{"$f":"'SALARIE 9'!G116","v":0},{"$f":"'SALARIE 10'!G116","v":0},{"$f":"SUM(B8:K8)/(COUNTIF(B8:K8,\">0\"))","v":11.818181818181818},15]