{"text_format":"1","workbook":"xlsx","n_sheets":5,"sheets":["tableau","trame","Ligues","Danses","Clubs"],"not_rendered":{"charts":0,"images":4,"macros":1,"external_links":2,"defined_names":9,"comments":1,"pivot_tables":0},"unopened":[],"bounds":{"document_bytes":16777216,"sheet_cells":100000,"rows_first":2000,"rows_last":500,"rows_between":2000,"halvings":0,"cell_chars":16384,"cell_head_chars":4096},"cells_cut":0,"cells_raw":0,"read":"whole","date_system":"1900"}

{"sheet":"tableau","index":0,"n_rows":39,"n_cols":6,"rows_kept":39,"cut":false,"hidden":false,"merged":[[1,2,3,5]]}
[]
[null,null," CATEGORIE BRONZE"]
[]
["Création onglet"]
[]
["NOM","PRENOM","DATE DE NAISSANCE","CLUB","TEST","N° DE LICENCE"]
["BIZET","Margot","2003-06-25","FRANCONVILLE","Préliminaire"]
["BROSSARD","Suzie","2003-07-04","VIRY","Préliminaire"]
["CAILLON","Emma","2004-08-09","FRANCONVILLE","Préliminaire"]
["DEBORD","Louna","2005-11-05","ORLEANS","Préliminaire"]
["DUPREY","Léa","2001-11-06","FRANCONVILLE","Préliminaire"]
["LABRO","Romane","2004-10-24","CERGY","Préliminaire"]
["RICQUEBOURG","Pauline","2002-11-21","WASQUEHAL","Préliminaire"]
["RICQUEBOURG","Manon","2005-09-07","WASQUEHAL","Préliminaire"]
["SCHOONHEERE","Léa","2006-02-16","CERGY","Préliminaire"]
["AHAMADA","Lenah","2005-03-04","VIRY","Préliminaire"]
["BANUVONG","Julie ","2001-03-29","VITRY","Préliminaire"]
["BOUILLET","Dorianne","2004-09-08","MEUDON","Préliminaire"]
["DA CUNHA","Helena","2004-12-04","FONTENAY","Préliminaire"]
["JARDAT","Anastasia","2006-11-24","VITRY","Préliminaire"]
["MATHIEU","Faustine","2004-10-22","FONTENAY","Préliminaire"]
["NABAIS","Léane","2004-10-22","VITRY","Préliminaire"]
["SZNAJDER","Diane","2006-08-18","VITRY","Préliminaire"]
["GRUNDRICK","Adèle","2005-05-21","CERGY","Préliminaire"]
["HELIOT","Alexia","2003-07-18","VIRY","Préliminaire"]
["LEBRUN","Marianna","2004-03-03","VIRY","Préliminaire"]
["MONNIER","Kevin","2002-08-06","VITRY","Préliminaire"]
["TADDET-DUGUE","Tahory ","2007-05-13","VITRY","Préliminaire"]
["YILMAZ","Camelia","2003-08-13","VIRY","Préliminaire"]
["DUBRULLE","Kalista","2006-01-20","WASQUEHAL","Préliminaire"]
["VANDESTOKE","Cyrille","2001-11-19","WASQUEHAL","Préliminaire"]
["FREIXO","Lisa","2001-06-25","FRANCONVILLE","Préliminaire"]
["GAULTIER","Anastasia","2004-11-14","MEUDON","Préliminaire"]
["GOBARD","Anne-Claire","1979-10-26","FRANCONVILLE","Préliminaire"]
["POLINYCE","Amel","2006-03-24","MEUDON","Préliminaire"]
["BECCARRI--NAGAMATSU","Maya","2005-06-09","VITRY","Préliminaire"]
["DUBRULLE","Kalista","2006-01-20","WASQUEHAL","Préliminaire"]
["GOBARD","Anne-Claire","1979-10-26","FRANCONVILLE","Préliminaire"]
["POLINYCE","Amel","2006-03-24","MEUDON","Préliminaire"]

{"sheet":"trame","index":1,"n_rows":87,"n_cols":22,"rows_kept":87,"cut":false,"hidden":false,"merged":[[9,8,10,8],[10,0,10,1],[10,2,10,3],[1,0,1,4],[1,5,2,5],[1,6,2,8],[2,0,2,4],[3,6,3,8],[10,5,10,7],[4,0,4,1],[4,2,4,7],[5,0,5,1],[5,2,5,3],[5,5,5,7],[6,0,6,2],[6,3,7,4],[7,0,7,2],[7,5,8,5],[7,6,8,6],[7,7,8,7],[11,0,11,1],[11,2,11,3],[12,0,12,1],[12,2,12,3],[13,0,13,1],[13,2,13,3],[8,0,8,2],[8,3,8,4],[9,1,9,7],[18,0,18,1],[18,2,18,3],[19,0,19,1],[19,2,19,3],[20,0,20,1],[20,2,20,3],[14,1,14,3],[16,1,16,7],[16,8,17,8],[17,0,17,1],[17,2,17,3],[17,5,17,7],[23,8,24,8],[24,0,24,1],[24,2,24,3],[24,5,24,7],[25,0,25,1],[25,2,25,3],[21,1,21,3],[22,0,22,1],[22,2,22,3],[22,5,22,7],[23,1,23,7],[30,8,31,8],[31,0,31,1],[31,2,31,3],[31,5,31,7],[26,0,26,1],[26,2,26,3],[27,0,27,1],[27,2,27,3],[28,1,28,3],[32,0,32,1],[32,2,32,3],[33,0,33,1],[33,2,33,3],[34,0,34,1],[34,2,34,3],[29,0,29,1],[29,2,29,3],[29,5,29,7],[30,1,30,7],[37,8,38,8],[38,0,38,1],[38,2,38,3],[38,5,38,7],[39,0,39,1],[39,2,39,3],[35,1,35,3],[36,0,36,1],[36,2,36,3],[36,5,36,7],[37,1,37,7],[43,0,43,1],[43,2,43,3],[43,5,43,7],[44,1,44,7],[44,8,45,8],[45,0,45,1],[45,2,45,3],[45,5,45,7],[40,0,40,1],[40,2,40,3],[41,0,41,1],[41,2,41,3],[42,1,42,3],[51,8,52,8],[52,0,52,1],[52,2,52,3],[52,5,52,7],[53,0,53,1],[53,2,53,3],[46,0,46,1],[46,2,46,3],[47,0,47,1],[47,2,47,3],[48,0,48,1],[48,2,48,3],[49,1,49,3],[50,0,50,1],[50,2,50,3],[50,5,50,7],[51,1,51,7],[66,0,66,4],[67,0,67,4],[68,0,68,4],[69,0,69,4],[54,0,54,1],[54,2,54,3],[55,0,55,1],[55,2,55,3],[56,1,56,3],[57,0,57,1],[57,2,57,3],[62,0,62,1],[62,2,62,3],[63,1,63,3],[57,5,57,7],[58,1,58,7],[58,8,59,8],[59,0,59,1],[59,2,59,3],[59,5,59,7],[60,0,60,1],[60,2,60,3],[61,0,61,1],[61,2,61,3]]}
[]
["Fédération Française des Sports de Glace",null,null,null,null,null,"RAPPORT DE TESTS FEDERAUX\n"]
["Commission Sportive Nationale de Danse sur Glace"]
[null,null,null,null,null,null,"version du 01/12/2014"]
["Club organisateur :"]
["ou Ligue organisatrice :",null,null,null,"et Ville :"]
["Président du Jury\nNom et prénom",null,null,"Date",null,"Nom du juge\nn° 1","Nom du juge\nn° 2","Nom du juge\nn° 3"]
[]
["Signature",null,null,null,null,null,null,null,"Résultat\nFINAL\nOUI - NON"]
["TEST",null,null,null,null,null,null,null,"Résultat final",null,null,null,null,null,null,null,null,null,null,{"$f":"B10","v":0}]
["NOM",null,"PRENOM",null,"DANSE","Résultat par danse et par juge (oui / non)"]
[null,null,null,null,{"$f":"IF(ISNA(HLOOKUP(B10,Danses!$A$1:$AB$5,2,FALSE)),\"\",(HLOOKUP(B10,Danses!$A$1:$AB$5,2,FALSE)))","v":""},null,null,null,null,null,null,null,null,null,null,null,null,null,null,{"$f":"HLOOKUP($T$10,#REF!,2,FALSE)","v":{"$error":"#REF!"}},{"$f":"IFERROR(VLOOKUP(E12,$T$12:$T$15,1,FALSE),\"bad\")","v":"bad"}]
["N° DE LICENCE",null,"DATE DE NAISSANCE",null,{"$f":"IF(ISNA(HLOOKUP(B10,Danses!$A$1:$AB$5,3,FALSE)),\"\",(HLOOKUP(B10,Danses!$A$1:$AB$5,3,FALSE)))","v":""},null,null,null,null,null,null,null,null,null,null,null,null,null,null,{"$f":"HLOOKUP($T$10,#REF!,3,FALSE)","v":{"$error":"#REF!"}},{"$f":"IFERROR(VLOOKUP(E13,$T$12:$T$15,1,FALSE),\"bad\")","v":"bad"}]
[null,null,null,null,{"$f":"IF(ISNA(HLOOKUP(B10,Danses!$A$1:$AB$5,4,FALSE)),\"\",(HLOOKUP(B10,Danses!$A$1:$AB$5,4,FALSE)))","v":""},null,null,null,null,null,null,null,null,null,null,null,null,null,null,{"$f":"HLOOKUP($T$10,#REF!,4,FALSE)","v":{"$error":"#REF!"}},{"$f":"IFERROR(VLOOKUP(E14,$T$12:$T$15,1,FALSE),\"bad\")","v":"bad"}]
["CLUB",null,null,null,{"$f":"IF(ISNA(HLOOKUP(B10,Danses!$A$1:$AB$5,5,FALSE)),\"\",(HLOOKUP(B10,Danses!$A$1:$AB$5,5,FALSE)))","v":""},null,null,null,null,null,null,null,null,null,null,null,null,null,null,{"$f":"HLOOKUP($T$10,#REF!,5,FALSE)","v":{"$error":"#REF!"}},{"$f":"IFERROR(VLOOKUP(E15,$T$12:$T$15,1,FALSE),\"bad\")","v":"bad"}]
[]
["TEST",null,null,null,null,null,null,null,"Résultat final",null,null,null,null,null,null,null,null,null,null,{"$f":"B17","v":0}]
["NOM",null,"PRENOM",null,"DANSE","Résultat par danse et par juge (oui / non)"]
[null,null,null,null,{"$f":"IF(ISNA(HLOOKUP(B17,Danses!$A$1:$AB$5,2,FALSE)),\"\",(HLOOKUP(B17,Danses!$A$1:$AB$5,2,FALSE)))","v":""},null,null,null,null,null,null,null,null,null,null,null,null,null,null,{"$f":"HLOOKUP($T$10,#REF!,2,FALSE)","v":{"$error":"#REF!"}},{"$f":"IFERROR(VLOOKUP(E19,$T$12:$T$15,1,FALSE),\"bad\")","v":"bad"}]
["N° DE LICENCE",null,"DATE DE NAISSANCE",null,{"$f":"IF(ISNA(HLOOKUP(B17,Danses!$A$1:$AB$5,3,FALSE)),\"\",(HLOOKUP(B17,Danses!$A$1:$AB$5,3,FALSE)))","v":""},null,null,null,null,null,null,null,null,null,null,null,null,null,null,{"$f":"HLOOKUP($T$10,#REF!,3,FALSE)","v":{"$error":"#REF!"}},{"$f":"IFERROR(VLOOKUP(E20,$T$12:$T$15,1,FALSE),\"bad\")","v":"bad"}]
[null,null,null,null,{"$f":"IF(ISNA(HLOOKUP(B17,Danses!$A$1:$AB$5,4,FALSE)),\"\",(HLOOKUP(B17,Danses!$A$1:$AB$5,4,FALSE)))","v":""},null,null,null,null,null,null,null,null,null,null,null,null,null,null,{"$f":"HLOOKUP($T$10,#REF!,4,FALSE)","v":{"$error":"#REF!"}},{"$f":"IFERROR(VLOOKUP(E21,$T$12:$T$15,1,FALSE),\"bad\")","v":"bad"}]
["CLUB",null,null,null,{"$f":"IF(ISNA(HLOOKUP(B17,Danses!$A$1:$AB$5,5,FALSE)),\"\",(HLOOKUP(B17,Danses!$A$1:$AB$5,5,FALSE)))","v":""},null,null,null,null,null,null,null,null,null,null,null,null,null,null,{"$f":"HLOOKUP($T$10,#REF!,5,FALSE)","v":{"$error":"#REF!"}},{"$f":"IFERROR(VLOOKUP(E22,$T$12:$T$15,1,FALSE),\"bad\")","v":"bad"}]
[]
["TEST",null,null,null,null,null,null,null,"Résultat final",null,null,null,null,null,null,null,null,null,null,{"$f":"B24","v":0}]
["NOM",null,"PRENOM",null,"DANSE","Résultat par danse et par juge (oui / non)"]
[null,null,null,null,{"$f":"IF(ISNA(HLOOKUP(B24,Danses!$A$1:$AB$5,2,FALSE)),\"\",(HLOOKUP(B24,Danses!$A$1:$AB$5,2,FALSE)))","v":""},null,null,null,null,null,null,null,null,null,null,null,null,null,null,{"$f":"HLOOKUP($T$10,#REF!,2,FALSE)","v":{"$error":"#REF!"}},{"$f":"IFERROR(VLOOKUP(E26,$T$12:$T$15,1,FALSE),\"bad\")","v":"bad"}]
["N° DE LICENCE",null,"DATE DE NAISSANCE",null,{"$f":"IF(ISNA(HLOOKUP(B24,Danses!$A$1:$AB$5,3,FALSE)),\"\",(HLOOKUP(B24,Danses!$A$1:$AB$5,3,FALSE)))","v":""},null,null,null,null,null,null,null,null,null,null,null,null,null,null,{"$f":"HLOOKUP($T$10,#REF!,3,FALSE)","v":{"$error":"#REF!"}},{"$f":"IFERROR(VLOOKUP(E27,$T$12:$T$15,1,FALSE),\"bad\")","v":"bad"}]
[null,null,null,null,{"$f":"IF(ISNA(HLOOKUP(B24,Danses!$A$1:$AB$5,4,FALSE)),\"\",(HLOOKUP(B24,Danses!$A$1:$AB$5,4,FALSE)))","v":""},null,null,null,null,null,null,null,null,null,null,null,null,null,null,{"$f":"HLOOKUP($T$10,#REF!,4,FALSE)","v":{"$error":"#REF!"}},{"$f":"IFERROR(VLOOKUP(E28,$T$12:$T$15,1,FALSE),\"bad\")","v":"bad"}]
["CLUB",null,null,null,{"$f":"IF(ISNA(HLOOKUP(B24,Danses!$A$1:$AB$5,5,FALSE)),\"\",(HLOOKUP(B24,Danses!$A$1:$AB$5,5,FALSE)))","v":""},null,null,null,null,null,null,null,null,null,null,null,null,null,null,{"$f":"HLOOKUP($T$10,#REF!,5,FALSE)","v":{"$error":"#REF!"}},{"$f":"IFERROR(VLOOKUP(E29,$T$12:$T$15,1,FALSE),\"bad\")","v":"bad"}]
[]
["TEST",null,null,null,null,null,null,null,"Résultat final",null,null,null,null,null,null,null,null,null,null,{"$f":"B31","v":0}]
["NOM",null,"PRENOM",null,"DANSE","Résultat par danse et par juge (oui / non)"]
[null,null,null,null,{"$f":"IF(ISNA(HLOOKUP(B31,Danses!$A$1:$AB$5,2,FALSE)),\"\",(HLOOKUP(B31,Danses!$A$1:$AB$5,2,FALSE)))","v":""},null,null,null,null,null,null,null,null,null,null,null,null,null,null,{"$f":"HLOOKUP($T$10,#REF!,2,FALSE)","v":{"$error":"#REF!"}},{"$f":"IFERROR(VLOOKUP(E33,$T$12:$T$15,1,FALSE),\"bad\")","v":"bad"}]
["N° DE LICENCE",null,"DATE DE NAISSANCE",null,{"$f":"IF(ISNA(HLOOKUP(B31,Danses!$A$1:$AB$5,3,FALSE)),\"\",(HLOOKUP(B31,Danses!$A$1:$AB$5,3,FALSE)))","v":""},null,null,null,null,null,null,null,null,null,null,null,null,null,null,{"$f":"HLOOKUP($T$10,#REF!,3,FALSE)","v":{"$error":"#REF!"}},{"$f":"IFERROR(VLOOKUP(E34,$T$12:$T$15,1,FALSE),\"bad\")","v":"bad"}]
[null,null,null,null,{"$f":"IF(ISNA(HLOOKUP(B31,Danses!$A$1:$AB$5,4,FALSE)),\"\",(HLOOKUP(B31,Danses!$A$1:$AB$5,4,FALSE)))","v":""},null,null,null,null,null,null,null,null,null,null,null,null,null,null,{"$f":"HLOOKUP($T$10,#REF!,4,FALSE)","v":{"$error":"#REF!"}},{"$f":"IFERROR(VLOOKUP(E35,$T$12:$T$15,1,FALSE),\"bad\")","v":"bad"}]
["CLUB",null,null,null,{"$f":"IF(ISNA(HLOOKUP(B31,Danses!$A$1:$AB$5,5,FALSE)),\"\",(HLOOKUP(B31,Danses!$A$1:$AB$5,5,FALSE)))","v":""},null,null,null,null,null,null,null,null,null,null,null,null,null,null,{"$f":"HLOOKUP($T$10,#REF!,5,FALSE)","v":{"$error":"#REF!"}},{"$f":"IFERROR(VLOOKUP(E36,$T$12:$T$15,1,FALSE),\"bad\")","v":"bad"}]
[]
["TEST",null,null,null,null,null,null,null,"Résultat final",null,null,null,null,null,null,null,null,null,null,{"$f":"B38","v":0}]
["NOM",null,"PRENOM",null,"DANSE","Résultat par danse et par juge (oui / non)"]
[null,null,null,null,{"$f":"IF(ISNA(HLOOKUP(B38,Danses!$A$1:$AB$5,2,FALSE)),\"\",(HLOOKUP(B38,Danses!$A$1:$AB$5,2,FALSE)))","v":""},null,null,null,null,null,null,null,null,null,null,null,null,null,null,{"$f":"HLOOKUP($T$10,#REF!,2,FALSE)","v":{"$error":"#REF!"}},{"$f":"IFERROR(VLOOKUP(E40,$T$12:$T$15,1,FALSE),\"bad\")","v":"bad"}]
["N° DE LICENCE",null,"DATE DE NAISSANCE",null,{"$f":"IF(ISNA(HLOOKUP(B38,Danses!$A$1:$AB$5,3,FALSE)),\"\",(HLOOKUP(B38,Danses!$A$1:$AB$5,3,FALSE)))","v":""},null,null,null,null,null,null,null,null,null,null,null,null,null,null,{"$f":"HLOOKUP($T$10,#REF!,3,FALSE)","v":{"$error":"#REF!"}},{"$f":"IFERROR(VLOOKUP(E41,$T$12:$T$15,1,FALSE),\"bad\")","v":"bad"}]
[null,null,null,null,{"$f":"IF(ISNA(HLOOKUP(B38,Danses!$A$1:$AB$5,4,FALSE)),\"\",(HLOOKUP(B38,Danses!$A$1:$AB$5,4,FALSE)))","v":""},null,null,null,null,null,null,null,null,null,null,null,null,null,null,{"$f":"HLOOKUP($T$10,#REF!,4,FALSE)","v":{"$error":"#REF!"}},{"$f":"IFERROR(VLOOKUP(E42,$T$12:$T$15,1,FALSE),\"bad\")","v":"bad"}]
["CLUB",null,null,null,{"$f":"IF(ISNA(HLOOKUP(B38,Danses!$A$1:$AB$5,5,FALSE)),\"\",(HLOOKUP(B38,Danses!$A$1:$AB$5,5,FALSE)))","v":""},null,null,null,null,null,null,null,null,null,null,null,null,null,null,{"$f":"HLOOKUP($T$10,#REF!,5,FALSE)","v":{"$error":"#REF!"}},{"$f":"IFERROR(VLOOKUP(E43,$T$12:$T$15,1,FALSE),\"bad\")","v":"bad"}]
[]
["TEST",null,null,null,null,null,null,null,"Résultat final",null,null,null,null,null,null,null,null,null,null,{"$f":"B45","v":0}]
["NOM",null,"PRENOM",null,"DANSE","Résultat par danse et par juge (oui / non)"]
[null,null,null,null,{"$f":"IF(ISNA(HLOOKUP(B45,Danses!$A$1:$AB$5,2,FALSE)),\"\",(HLOOKUP(B45,Danses!$A$1:$AB$5,2,FALSE)))","v":""},null,null,null,null,null,null,null,null,null,null,null,null,null,null,{"$f":"HLOOKUP($T$10,#REF!,2,FALSE)","v":{"$error":"#REF!"}},{"$f":"IFERROR(VLOOKUP(E47,$T$12:$T$15,1,FALSE),\"bad\")","v":"bad"}]
["N° DE LICENCE",null,"DATE DE NAISSANCE",null,{"$f":"IF(ISNA(HLOOKUP(B45,Danses!$A$1:$AB$5,3,FALSE)),\"\",(HLOOKUP(B45,Danses!$A$1:$AB$5,3,FALSE)))","v":""},null,null,null,null,null,null,null,null,null,null,null,null,null,null,{"$f":"HLOOKUP($T$10,#REF!,3,FALSE)","v":{"$error":"#REF!"}},{"$f":"IFERROR(VLOOKUP(E48,$T$12:$T$15,1,FALSE),\"bad\")","v":"bad"}]
[null,null,null,null,{"$f":"IF(ISNA(HLOOKUP(B45,Danses!$A$1:$AB$5,4,FALSE)),\"\",(HLOOKUP(B45,Danses!$A$1:$AB$5,4,FALSE)))","v":""},null,null,null,null,null,null,null,null,null,null,null,null,null,null,{"$f":"HLOOKUP($T$10,#REF!,4,FALSE)","v":{"$error":"#REF!"}},{"$f":"IFERROR(VLOOKUP(E49,$T$12:$T$15,1,FALSE),\"bad\")","v":"bad"}]
["CLUB",null,null,null,{"$f":"IF(ISNA(HLOOKUP(B45,Danses!$A$1:$AB$5,5,FALSE)),\"\",(HLOOKUP(B45,Danses!$A$1:$AB$5,5,FALSE)))","v":""},null,null,null,null,null,null,null,null,null,null,null,null,null,null,{"$f":"HLOOKUP($T$10,#REF!,5,FALSE)","v":{"$error":"#REF!"}},{"$f":"IFERROR(VLOOKUP(E50,$T$12:$T$15,1,FALSE),\"bad\")","v":"bad"}]
[]
["TEST",null,null,null,null,null,null,null,"Résultat final",null,null,null,null,null,null,null,null,null,null,{"$f":"B52","v":0}]
["NOM",null,"PRENOM",null,"DANSE","Résultat par danse et par juge (oui / non)"]
[null,null,null,null,{"$f":"IF(ISNA(HLOOKUP(B52,Danses!$A$1:$AB$5,2,FALSE)),\"\",(HLOOKUP(B52,Danses!$A$1:$AB$5,2,FALSE)))","v":""},null,null,null,null,null,null,null,null,null,null,null,null,null,null,{"$f":"HLOOKUP($T$10,#REF!,2,FALSE)","v":{"$error":"#REF!"}},{"$f":"IFERROR(VLOOKUP(E54,$T$12:$T$15,1,FALSE),\"bad\")","v":"bad"}]
["N° DE LICENCE",null,"DATE DE NAISSANCE",null,{"$f":"IF(ISNA(HLOOKUP(B52,Danses!$A$1:$AB$5,3,FALSE)),\"\",(HLOOKUP(B52,Danses!$A$1:$AB$5,3,FALSE)))","v":""},null,null,null,null,null,null,null,null,null,null,null,null,null,null,{"$f":"HLOOKUP($T$10,#REF!,3,FALSE)","v":{"$error":"#REF!"}},{"$f":"IFERROR(VLOOKUP(E55,$T$12:$T$15,1,FALSE),\"bad\")","v":"bad"}]
[null,null,null,null,{"$f":"IF(ISNA(HLOOKUP(B52,Danses!$A$1:$AB$5,4,FALSE)),\"\",(HLOOKUP(B52,Danses!$A$1:$AB$5,4,FALSE)))","v":""},null,null,null,null,null,null,null,null,null,null,null,null,null,null,{"$f":"HLOOKUP($T$10,#REF!,4,FALSE)","v":{"$error":"#REF!"}},{"$f":"IFERROR(VLOOKUP(E56,$T$12:$T$15,1,FALSE),\"bad\")","v":"bad"}]
["CLUB",null,null,null,{"$f":"IF(ISNA(HLOOKUP(B52,Danses!$A$1:$AB$5,5,FALSE)),\"\",(HLOOKUP(B52,Danses!$A$1:$AB$5,5,FALSE)))","v":""},null,null,null,null,null,null,null,null,null,null,null,null,null,null,{"$f":"HLOOKUP($T$10,#REF!,5,FALSE)","v":{"$error":"#REF!"}},{"$f":"IFERROR(VLOOKUP(E57,$T$12:$T$15,1,FALSE),\"bad\")","v":"bad"}]
[]
["TEST",null,null,null,null,null,null,null,"Résultat final",null,null,null,null,null,null,null,null,null,null,{"$f":"B59","v":0}]
["NOM",null,"PRENOM",null,"DANSE","Résultat par danse et par juge (oui / non)"]
{"$rows_left_out":28}
{"sheet":"Ligues","index":2,"n_rows":25,"n_cols":1,"rows_kept":25,"cut":false,"hidden":false,"merged":[]}
["Ligues"]
[]
["01 - ALSACE"]
["02 - AQUITAINE"]
["03 - AUVERGNE"]
["04 - BOURGOGNE"]
["05 - BRETAGNE"]
["06 - CENTRE"]
["07 - CHAMPAGNE ARDENNE"]
["08 - CORSE"]
["09 - FRANCHE COMTE"]
["10 - ILE DE France"]
["11 - LANGUEDOC ROUSILLON"]
["12 - LIMOUSIN"]
["13 - LORRAINE"]
["14 - MIDI PYRENEES"]
["15 - NORD PAS DE CALAIS"]
["16 - BASSE NORMANDIE"]
["17 - HAUTE NORMANDIE"]
["18 - PAYS DE LA LOIRE"]
["19 - PICARDIE"]
["20 - POITOU CHARENTES"]
["21 - PACA"]
["22 - RHONE ALPES"]
["23 - ST PIERRE ET MIQUELON"]

{"sheet":"Danses","index":3,"n_rows":5,"n_cols":28,"rows_kept":5,"cut":false,"hidden":false,"merged":[]}
[null,"Préliminaire","Préliminaire Major","Préparatoire","Préparatoire Major","Pré-bronze Standard de Danses Imposées","Pré-bronze Major de Danses Imposées","Pré-bronze Solo de Danses Imposées","Pré-bronze Major Solo de Danses Imposées","Bronze Standard de Danses Imposées","Bronze  Major de Danses Imposées","Bronze Solo de Danses Imposées","Bronze Major Solo de Danses Imposées","Argent Standard de Danses Imposées","Argent Major de Danses Imposées","Argent Solo de Danses Imposées","Argent Major Solo de Danses Imposées","Vermeil Standardde Danses Imposées","Vermeil Major de Danses Imposées","Vermeil Solo de Danses Imposées","Vermeil Major Solo de Danses Imposées","Petit or Standard de Danses Imposées","Petit or Major de Danses Imposées","Petit or Solo de Danses Imposées","Petit or Major Solo de Danses Imposées","Or Standard de Danses Imposées","Or Major de Danses Imposées","Platine de Danses Imposées"]
[null,"Canasta Tango","Canasta Tango","Danse Majeure","Danse Majeure","Ten Fox","Ten Fox","Ten Fox","Ten Fox","Pas de Quatorze","Pas de Quatorze","Pas de Quatorze","Pas de Quatorze","Rocker Foxtrot","Rocker Foxtrot","Rocker Foxtrot","Rocker Foxtrot","Valse Starlight","Valse Starlight","Valse Starlight","Valse Starlight","Valse Viennoise","Valse Viennoise","Valse Viennoise","Valse Viennoise","Valse Westminster","Valse Westminster","Valse Ravensburger"]
[null,null,null,null,null,"Valse Willow","Valse Willow","Valse Willow","Valse Willow","Fox Trot","Fox Trot","Fox Trot","Fox Trot","Valse Américaine","Valse Américaine","Valse Américaine","Valse Américaine","Paso Doble","Paso Doble","Paso Doble","Paso Doble","Quick Step","Quick Step","Quick Step","Quick Step","Valse Autrichienne","Valse Autrichienne","Valse d'Or"]
[null,null,null,null,null,"Tango Fiesta","Tango Fiesta","Tango Fiesta","Tango Fiesta","Valse Européenne","Valse Européenne","Valse Européenne","Valse Européenne","Kilian","Kilian","Kilian","Kilian","Blues","Blues","Blues","Blues","Cha Cha Congelado","Cha Cha Congelado","Cha Cha Congelado","Cha Cha Congelado","Rumba","Rumba","Yankee Polka"]
[null,null,null,null,null,null,null,null,null,null,null,null,null,"Tango","Tango","Tango","Tango",null,null,null,null,"Silver Samba","Silver Samba","Silver Samba","Silver Samba","Tango Argentin","Tango Argentin","Tango Romantica"]

{"sheet":"Clubs","index":4,"n_rows":151,"n_cols":6,"rows_kept":151,"cut":false,"hidden":false,"merged":[]}
["Clubs"]
[null,null,"abréviation","ville","nom","n° affiliation"]
[{"$f":"CONCATENATE(D3,\" - \",C3,\" - \",E3,\" - \",F3)","v":"ALBERTVILLE - ALB - ALBERTVILLE OGC - 73002"},null,"ALB","ALBERTVILLE","ALBERTVILLE OGC",73002]
["ALES - ALE - ALES SPORTS DE GLACE - 30004",null,"ALE","ALES","ALES SPORTS DE GLACE",30004]
["ALPE D'HUEZ - ALH - ALPE D'HUEZ PATINAGE CLUB - 38002",null,"ALH","ALPE D'HUEZ","ALPE D'HUEZ PATINAGE CLUB",38002]
["AMIENS - AMI - AMIENS PATINAGE CLUB - 80001",null,"AMI","AMIENS","AMIENS PATINAGE CLUB",80001]
["ANGERS - AGA - ASGA ARTISTIQUE ET SYNCHRONISE - 49002",null,"AGA","ANGERS","ASGA ARTISTIQUE ET SYNCHRONISE",49002]
["ANGERS - AGD - ASSOCIATION SG ANGERS DANSE - 49004",null,"AGD","ANGERS","ASSOCIATION SG ANGERS DANSE",49004]
["ANGERS - ANG - ASG ANGERS - 49001",null,"ANG","ANGERS","ASG ANGERS",49001]
["ANGLET - ANT - ANGLET SPORTS DE GLACE - 64001",null,"ANT","ANGLET","ANGLET SPORTS DE GLACE",64001]
["ANGOULEME - AGO - ANGOULEME SPORTS DE GLACE - 16004",null,"AGO","ANGOULEME","ANGOULEME SPORTS DE GLACE",16004]
["ANNECY - ANN - ANNECY SPORT DE GLACE - 74007",null,"ANN","ANNECY","ANNECY SPORT DE GLACE",74007]
["ARGENTEUIL - ARG - ARGENTEUI SPORTS DE GLACE - 95006",null,"ARG","ARGENTEUIL","ARGENTEUI SPORTS DE GLACE",95006]
["ASNIERES SUR SEINE - ASN - ASNIERES PATINAGE - 92002",null,"ASN","ASNIERES SUR SEINE","ASNIERES PATINAGE",92002]
["ATHIS-MONS - ATH - ATHIS PARAY ICE DANCE - 91002",null,"ATH","ATHIS-MONS","ATHIS PARAY ICE DANCE",91002]
["AUBAGNE - ABG - ECOLE DE PATINAGE AUBAGNE - 13006",null,"ABG","AUBAGNE","ECOLE DE PATINAGE AUBAGNE",13006]
["AUBAGNE - AUB - SPORT OLYMPIQUE DE GLACE MARSEILLE AUBAGNE - 13002",null,"AUB","AUBAGNE","SPORT OLYMPIQUE DE GLACE MARSEILLE AUBAGNE",13002]
["AUXERRE - AUX - USAPI - 89002",null,"AUX","AUXERRE","USAPI",89002]
["AVIGNON - AVI - CLUB DES SPORTS DE GLACE D'AVIGNON - 84001",null,"AVI","AVIGNON","CLUB DES SPORTS DE GLACE D'AVIGNON",84001]
["AVIGNON - AVS - AVIGNON SPORTS DE GLACE - 84002",null,"AVS","AVIGNON","AVIGNON SPORTS DE GLACE",84002]
["BELFORT - BEL - BELFORT A.S.M - 90001",null,"BEL","BELFORT","BELFORT A.S.M",90001]
["BESANCON - ASB - ASSOCIATION SPORTS DE GLACE BESANCON - 25002",null,"ASB","BESANCON","ASSOCIATION SPORTS DE GLACE BESANCON",25002]
["BESANCON - BAP - BESANCON ASS PATINAGE ARTISTIQUE - 25003",null,"BAP","BESANCON","BESANCON ASS PATINAGE ARTISTIQUE",25003]
["BESANCON - BES - BESANCON SKATING CLUB - 25001",null,"BES","BESANCON","BESANCON SKATING CLUB",25001]
["BESSE SAINT ANASTAISE - BSA - SUPER BESSE CLUB DE PATINAGE - 63001",null,"BSA","BESSE SAINT ANASTAISE","SUPER BESSE CLUB DE PATINAGE",63001]
["BETHUNE - BET - BETHUNE BEFFY PATINAGE CLUB - 62001",null,"BET","BETHUNE","BETHUNE BEFFY PATINAGE CLUB",62001]
["BLAGNAC - BLA - BLAGNAC PATINAGE SUR GLACE - 31001",null,"BLA","BLAGNAC","BLAGNAC PATINAGE SUR GLACE",31001]
["BORDEAUX - BOR - BORDEAUX SPORTS DE GLACE - 33001",null,"BOR","BORDEAUX","BORDEAUX SPORTS DE GLACE",33001]
["BOULOGNE BILLANCOURT - BOU - BOULOGNE ACBB - 92001",null,"BOU","BOULOGNE BILLANCOURT","BOULOGNE ACBB",92001]
["BREST - BRS - BREST SPORT ET PATINAGE - 29001",null,"BRS","BREST","BREST SPORT ET PATINAGE",29001]
["BRIANCON - BRG - BRIANCON GLISSE 2000 - 5004",null,"BRG","BRIANCON","BRIANCON GLISSE 2000",5004]
["BRIANCON - BRI - BRIANCON LES ESCARTONS - 5003",null,"BRI","BRIANCON","BRIANCON LES ESCARTONS",5003]
["BRIVE - BPC - BRIVE PATINAGE CLUB - 19001",null,"BPC","BRIVE","BRIVE PATINAGE CLUB",19001]
["CAEN - CAE - CAEN ACSEL - 14001",null,"CAE","CAEN","CAEN ACSEL",14001]
[{"$f":"CONCATENATE(D35,\" - \",C35,\" - \",E35,\" - \",F35)","v":"CANNES - CAN - CANNES AZUR PATINAGE - 6002"},null,"CAN","CANNES","CANNES AZUR PATINAGE",6002]
["CASTRES - CAS - CASTRES SPORTS DE GLACE - 81001",null,"CAS","CASTRES","CASTRES SPORTS DE GLACE",81001]
["CASTRES - CAT - CASTRES HOCKEY CLUB PATINAGE - 81002",null,"CAT","CASTRES","CASTRES HOCKEY CLUB PATINAGE",81002]
["CAVEIRAC - CAV - NIMES METROPOLE CAMARGUES - 30002",null,"CAV","CAVEIRAC","NIMES METROPOLE CAMARGUES",30002]
["CERGY PONTOISE - CER - CERGY PONTOISE C.S.G - 95001",null,"CER","CERGY PONTOISE","CERGY PONTOISE C.S.G",95001]
["CHALONS EN CHAMPAGNE - CHL - ASSO DES SPORTS DE GLACE CHALONNAIS - 51001",null,"CHL","CHALONS EN CHAMPAGNE","ASSO DES SPORTS DE GLACE CHALONNAIS",51001]
["CHAMBERY - CHY - CLUB DANSE SUR GLACE CHAMBERY - 73003",null,"CHY","CHAMBERY","CLUB DANSE SUR GLACE CHAMBERY",73003]
["CHAMBERY - CSG - CHAMBERY CSG - 73005",null,"CSG","CHAMBERY","CHAMBERY CSG",73005]
["CHAMONIX - CMX - CHAMONIX CLUB DES SPORTS - 74001",null,"CMX","CHAMONIX","CHAMONIX CLUB DES SPORTS",74001]
["CHAMPIGNY SUR MARNE - CSM - CHAMPIGNY CSG - 94002",null,"CSM","CHAMPIGNY SUR MARNE","CHAMPIGNY CSG",94002]
["CHARLEVILLE MEZIERES - CHM - CHARLEVILLE MEZIERES S.G - 8001",null,"CHM","CHARLEVILLE MEZIERES","CHARLEVILLE MEZIERES S.G",8001]
["CHATELLERAULT - CLT - CHATELLERAULT CSAC - 86002",null,"CLT","CHATELLERAULT","CHATELLERAULT CSAC",86002]
["CHERBOURG - CHE - CLUB CHERBOURGEOIS SPORTS DE GLACE - 50001",null,"CHE","CHERBOURG","CLUB CHERBOURGEOIS SPORTS DE GLACE",50001]
["CHOLET - CHO - ASSO CHOLETAISE DE PATINAGE SUR GLACE - 49003",null,"CHO","CHOLET","ASSO CHOLETAISE DE PATINAGE SUR GLACE",49003]
["CLERMONT FERRAND - CLE - AUVERGNE DANSE SUR GLACE - 63004",null,"CLE","CLERMONT FERRAND","AUVERGNE DANSE SUR GLACE",63004]
["COGNAC - COG - ASS COGNACAISE DES SPORTS DE GLACE - 16002",null,"COG","COGNAC","ASS COGNACAISE DES SPORTS DE GLACE",16002]
["COLOMBES - COL - COLOMBES CSG - 92005",null,"COL","COLOMBES","COLOMBES CSG",92005]
["COMPIEGNE - COM - SKATING CLUB COMPIEGNE OISE - 60001",null,"COM","COMPIEGNE","SKATING CLUB COMPIEGNE OISE",60001]
["COURBEVOIE - COU - CLUB OLYMPIQUE DE COUBEVOIE - 92003",null,"COU","COURBEVOIE","CLUB OLYMPIQUE DE COUBEVOIE",92003]
["COURCHEVEL - COP - COURCHEVEL PATINAGE SPORTS DE GLACE - 73004",null,"COP","COURCHEVEL","COURCHEVEL PATINAGE SPORTS DE GLACE",73004]
["DAMMARIE LES LYS - DAM - DAMMARIE CSG - 77001",null,"DAM","DAMMARIE LES LYS","DAMMARIE CSG",77001]
["DEUIL LA BARRE - DLB - VALLEE MONTMORENCY CSG - 95003",null,"DLB","DEUIL LA BARRE","VALLEE MONTMORENCY CSG",95003]
["DIJON - DIJ - ACADEMIE SPORT DE GLACE DIJON-BOURGOGNE - 21002",null,"DIJ","DIJON","ACADEMIE SPORT DE GLACE DIJON-BOURGOGNE",21002]
["DUNKERQUE - DUN - DUNKERQUE PATINAGE - 59002",null,"DUN","DUNKERQUE","DUNKERQUE PATINAGE",59002]
["ECHIROLLES - ECH - ECHIROLLES CGALE - 38005",null,"ECH","ECHIROLLES","ECHIROLLES CGALE",38005]
["EPINAL - EPI - EPINAL CLUB DE PATINAGE SUR GLACE - 88001",null,"EPI","EPINAL","EPINAL CLUB DE PATINAGE SUR GLACE",88001]
{"$rows_left_out":91}