{"text_format":"1","workbook":"xlsx","n_sheets":5,"sheets":["MOUVEMENT DES STOCKS","JOURNAL DES STOCKS","STOCK GLOBAL","STOCK TOTAL PAR ARTICLE","LISTE PRODUITS"],"not_rendered":{"charts":0,"images":0,"macros":1,"external_links":0,"defined_names":14,"comments":0,"pivot_tables":5},"unopened":[],"bounds":{"document_bytes":16777216,"sheet_cells":100000,"rows_first":2000,"rows_last":500,"rows_between":2000,"halvings":0,"cell_chars":16384,"cell_head_chars":4096},"cells_cut":0,"cells_raw":0,"read":"whole","date_system":"1900"}

{"sheet":"MOUVEMENT DES STOCKS","index":0,"n_rows":23,"n_cols":6,"rows_kept":23,"cut":false,"hidden":false,"merged":[]}
[]
[]
[]
[]
[null,null,null,"ACTION"]
[]
[null,null,null,"ORIGINE"]
[]
[null,"DATE D'ENTREE",null,null,null,"DATE DE SORTIE"]
[]
[null,"PRODUIT",null,null,null,"PRODUIT"]
[]
[null,"REFERENCE",null,null,null,"REFERENCE"]
[]
[null,"N° LOT",null,null,null,"N° LOT"]
[]
[null,"CONSOM_SAC",null,null,null,"SORTIE_ (kg)"]
[]
[null,"ENTREE_CARTON",null,null,null,"PERTE_PROD"]
[]
[null,"ENTREE_kg",null,null,null,"DATE DE RETOUR"]
[]
[null,"PERTE_INJ",null,null,null,"QTE RETOURNEE_(kg)"]

{"sheet":"JOURNAL DES STOCKS","index":1,"n_rows":219,"n_cols":20,"rows_kept":219,"cut":false,"hidden":false,"merged":[[2,4,2,5],[3,4,3,5],[1,4,1,5]]}
[]
[null,null,null,null,"Portoirs/carton",null,200]
[null,null,null,null,"Poids (kg)Bouchon =",null,5.9999999999999995E-4]
[null,null,null,null,"Poids (kg) tube =",null,2E-3]
[null,null,null,null,{"$f":"IF(D5=\"\",\"\",D5/$G$4)","v":""},null,null,null,null,null,{"$f":"IF(J5=\"\",\"\",J5/$G$4)","v":""}]
[]
[]
[]
[]
[]
[]
[null,null,null,null,null,null,null,null,null,null,{"$f":"IF(C12=\"SORTIE\",\"\",IF(C12=\"RETOUR\",\"\",IF(E12=\"TPP\",J12/$G$4,IF(E12=\"BC\",J12/$G$3,IF(J12=\"\",\"\")))))","v":""}]
[]
[]
["ACTION","DATE_ENTREE","REFERENCE","PRODUIT","N° LOT","CONSOM_SAC","ENTREE_CARTON","ENTREE_kg","ENTREE_U","PERTE_INJ","ORIGINE","DATE DE SORTIE","SORTIE_CARTON","SORTIE_kg","SORTIE_U","PERTE_PROD","DATE_RETOUR","RETOUR_kg","RETOUR_CARTON","RETOUR_U"]
["ENTREE","2018-05-28","BC","Bouchons Verts","BV280518A",0.5,null,11.752000000000001,{"$f":"IF(A16=\"SORTIE\",\"\",IF(A16=\"RETOUR\",\"\",IF(C16=\"TPP\",H16/$G$4,IF(C16=\"BC\",H16/$G$3,IF(C16=\"PR\",G16*$G$2)))))","v":19586.666666666668},null,"INJ PLASTIQUE",null,null,null,{"$f":"IF(A16=\"ENTREE\",\"\",IF(A16=\"RETOUR\",\"\",IF(C16=\"TPP\",N16/$G$4,IF(C16=\"BC\",N16/$G$3,IF(C16=\"PR\",M16*$G$2)))))","v":""},null,null,null,null,{"$f":"IF(A16=\"ENTREE\",\"\",IF(A16=\"SORTIE\",\"\",IF(C16=\"TPP\",R16/$G$4,IF(C16=\"BC\",R16/$G$3,IF(C16=\"PR\",S16*$G$2)))))","v":""}]
["ENTREE","2018-05-28","TPP","Tubes PP","TPP280518B",6,18,131.4,65700,null,"INJ PLASTIQUE",null,null,null,null,null,null,null,null,""]
["ENTREE","2018-05-28","TPP","Tubes PP","TPP280518A",3,9,65.7,32850,null,"INJ PLASTIQUE",null,null,null,null,null,null,null,null,""]
["ENTREE","2018-05-27","BC","Bouchons Verts","BV270518B",1,null,25.4,42333.333333333336,null,"INJ PLASTIQUE",null,null,null,null,null,null,null,null,""]
["ENTREE","2018-05-27","BC","Bouchons Verts","BV270518A",0.5,null,12.125999999999999,20210,null,"INJ PLASTIQUE",null,null,null,null,null,null,null,null,""]
["ENTREE","2018-05-27","TPP","Tubes PP","TPP270518B",6,18,131.4,65700,null,"INJ PLASTIQUE",null,null,null,null,null,null,null,null,""]
["ENTREE","2018-05-27","TPP","Tubes PP","TPP270518A",4,9,65.7,32850,null,"INJ PLASTIQUE",null,null,null,null,null,null,null,null,""]
["ENTREE","2018-05-26","BC","Bouchons Verts","BV260518B",1,null,24.056000000000001,40093.333333333336,null,"INJ PLASTIQUE",null,null,null,null,null,null,null,null,""]
["ENTREE","2018-05-26","BC","Bouchons Verts","BV260518A",0.5,null,14.058,23430,null,"INJ PLASTIQUE",null,null,null,null,null,null,null,null,""]
["ENTREE","2018-05-26","TPP","Tubes PP","TPP260518B",6,18,131.4,65700,null,"INJ PLASTIQUE",null,null,null,null,null,null,null,null,""]
["ENTREE","2018-05-26","TPP","Tubes PP","TPP260518A",4,10,73,36500,null,"INJ PLASTIQUE",null,null,null,null,null,null,null,null,""]
["ENTREE","2018-05-25","BC","Bouchons Verts","BV250518B",1,null,26.108000000000001,43513.333333333336,null,"INJ PLASTIQUE",null,null,null,null,null,null,null,null,""]
["ENTREE","2018-05-25","BC","Bouchons Verts","BV250518A",0.5,null,12.417999999999999,20696.666666666668,null,"INJ PLASTIQUE",null,null,null,null,null,null,null,null,""]
["ENTREE","2018-05-25","TPP","Tubes PP","TPP250518B",6,18,131.4,65700,null,"INJ PLASTIQUE",null,null,null,null,null,null,null,null,""]
["ENTREE","2018-05-25","TPP","Tubes PP","TPP250518A",4,10,73,36500,null,"INJ PLASTIQUE",null,null,null,null,null,null,null,null,""]
["ENTREE","2018-05-24","BC","Bouchons Verts","BV240518B",1,null,25.795999999999999,42993.333333333336,null,"INJ PLASTIQUE",null,null,null,null,null,null,null,null,""]
["ENTREE","2018-05-24","BC","Bouchons Verts","BV240518A",0.5,null,12.724,21206.666666666668,null,"INJ PLASTIQUE",null,null,null,null,null,null,null,null,""]
["ENTREE","2018-05-24","TPP","Tubes PP","TPP240518B",6,19,138.69999999999999,69350,null,"INJ PLASTIQUE",null,null,null,null,null,null,null,null,""]
["ENTREE","2018-05-24","TPP","Tubes PP","TPP240518A",4,9,65.7,32850,null,"INJ PLASTIQUE",null,null,null,null,null,null,null,null,""]
["ENTREE","2018-05-23","BC","Bouchons Verts","BV230518B",1,null,24.94,41566.666666666672,null,"INJ PLASTIQUE",null,null,null,null,null,null,null,null,""]
["ENTREE","2018-05-23","BC","Bouchons Verts","BV230518A",0.5,null,12.77,21283.333333333336,null,"INJ PLASTIQUE",null,null,null,null,null,null,null,null,""]
["ENTREE","2018-05-23","TPP","Tubes PP","TPP230518B",6,19,138.69999999999999,69350,null,"INJ PLASTIQUE",null,null,null,null,null,null,null,null,""]
["ENTREE","2018-05-23","TPP","Tubes PP","TPP230518A",3,10,73,36500,null,"INJ PLASTIQUE",null,null,null,null,null,null,null,null,""]
["ENTREE","2018-05-22","BC","Bouchons Verts","BV220518B",1,null,24.56,40933.333333333336,null,"INJ PLASTIQUE",null,null,null,null,null,null,null,null,""]
["ENTREE","2018-05-22","BC","Bouchons Verts","BV220518A",0.5,null,12,20000,null,"INJ PLASTIQUE",null,null,null,null,null,null,null,null,""]
["ENTREE","2018-05-22","TPP","Tubes PP","TPP220518B",6,19,138.69999999999999,69350,null,"INJ PLASTIQUE",null,null,null,null,null,null,null,null,""]
["ENTREE","2018-05-22","TPP","Tubes PP","TPP220518A",3,9,65.7,32850,null,"INJ PLASTIQUE",null,null,null,null,null,null,null,null,""]
["ENTREE","2018-05-22","PR","Portoirs","P027",3,12.975,null,2595,null,"INJ PLASTIQUE",null,null,null,null,null,null,null,null,""]
["ENTREE","2018-05-21","BC","Bouchons Verts","BV210518B",1,null,24.87,41450.000000000007,null,"INJ PLASTIQUE",null,null,null,null,null,null,null,null,""]
["ENTREE","2018-05-21","BC","Bouchons Verts","BV210518A",0.5,null,12.096,20160.000000000004,null,"INJ PLASTIQUE",null,null,null,null,null,null,null,null,""]
["ENTREE","2018-05-21","TPP","Tubes PP","TPP210518B",6,17,124.1,62049.999999999993,null,"INJ PLASTIQUE",null,null,null,null,null,null,null,null,""]
["ENTREE","2018-05-21","TPP","Tubes PP","TPP210518A",3,10,73,36500,null,"INJ PLASTIQUE",null,null,null,null,null,null,null,null,""]
["ENTREE","2018-05-21","PR","Portoirs","P026",2,null,9.68,{"$f":"IF(A48=\"SORTIE\",\"\",IF(A48=\"RETOUR\",\"\",IF(C48=\"TPP\",H48/$G$4,IF(C48=\"BC\",H48/$G$3,IF(C48=\"PR\",G48*$G$2)))))","v":0},null,"INJ PLASTIQUE",null,null,null,null,null,null,null,null,""]
["ENTREE","2018-05-20","TPP","Tubes PP","TPP200518B",6,18,131.4,65700,null,"INJ PLASTIQUE",null,null,null,null,null,null,null,null,""]
["ENTREE","2018-05-20","TPP","Tubes PP","TPP200518A",3,9,65.7,32850,null,"INJ PLASTIQUE",null,null,null,null,null,null,null,null,""]
["ENTREE","2018-05-19","BC","Bouchons Verts","BV190518B",1,null,24,40000,null,"INJ PLASTIQUE",null,null,null,null,null,null,null,null,""]
["ENTREE","2018-05-19","BC","Bouchons Verts","BV190518A",0.5,null,12.84,21400,null,"INJ PLASTIQUE",null,null,null,null,null,null,null,null,""]
["ENTREE","2018-05-19","TPP","Tubes PP","TPP190518B",6,19,138.69999999999999,69350,null,"INJ PLASTIQUE",null,null,null,null,null,null,null,null,""]
["ENTREE","2018-05-19","TPP","Tubes PP","TPP190518A",3,9,65.7,32850,null,"INJ PLASTIQUE",null,null,null,null,null,null,null,null,""]
["ENTREE","2018-05-19","PR","Portoirs","P025",2,10.85,null,2170,null,"INJ PLASTIQUE",null,null,null,null,null,null,null,null,""]
["ENTREE","2018-05-18","BC","Bouchons Verts","BV180518B",1,null,19.984999999999999,33308.333333333336,null,"INJ PLASTIQUE",null,null,null,null,null,null,null,null,""]
["ENTREE","2018-05-18","BC","Bouchons Verts","BV180518A",1,null,21.692,36153.333333333336,null,"INJ PLASTIQUE",null,null,null,null,null,null,null,null,""]
["ENTREE","2018-05-18","TPP","Tubes PP","TPP180518B",5,22,160.6,80300,null,"INJ PLASTIQUE",null,null,null,null,null,null,null,null,""]
["ENTREE","2018-05-18","TPP","Tubes PP","TPP180518A",3,22,160.6,80300,null,"INJ PLASTIQUE",null,null,null,null,null,null,null,null,""]
["ENTREE","2018-05-17","BC","Bouchons Verts","BV170518B",1,null,14.04,23400,null,"INJ PLASTIQUE",null,null,null,null,null,null,null,null,""]
["ENTREE","2018-05-17","BC","Bouchons Verts","BV170518A",0.5,null,12.334,20556.666666666668,null,"INJ PLASTIQUE",null,null,null,null,null,null,null,null,""]
["ENTREE","2018-05-17","TPP","Tubes PP","TPP170518B",3,12,87.6,43799.999999999993,null,"INJ PLASTIQUE",null,null,null,null,null,null,null,null,""]
["ENTREE","2018-05-17","TPP","Tubes PP","TPP170518A",3,12,87.6,43799.999999999993,null,"INJ PLASTIQUE",null,null,null,null,null,null,null,null,""]
["ENTREE","2018-05-17","PR","Portoirs","P024",2,14.41,null,2882,null,"INJ PLASTIQUE",null,null,null,null,null,null,null,null,""]
["ENTREE","2018-05-16","BC","Bouchons Verts","BC160518B",1.5,null,24.452000000000002,40753.333333333343,null,"INJ PLASTIQUE",null,null,null,null,null,null,null,null,""]
["ENTREE","2018-05-16","BC","Bouchons Verts","BC160518A",0.5,null,13.701000000000001,22835.000000000004,null,"INJ PLASTIQUE",null,null,null,null,null,null,null,null,""]
["ENTREE","2018-05-16","TPP","Tubes PP","TPP160518B",3,20,146,73000,null,"INJ PLASTIQUE",null,null,null,null,null,null,null,null,""]
["ENTREE","2018-05-16","TPP","Tubes PP","TPP160518A",3,11,80.3,40150,null,"INJ PLASTIQUE",null,null,null,null,null,null,null,null,""]
["ENTREE","2018-05-15","BC","Bouchons Verts","BV150518B",1.05,null,20.5,34166.666666666672,null,"INJ PLASTIQUE",null,null,null,null,null,null,null,null,""]
["ENTREE","2018-05-15","BC","Bouchons Verts","BV150518A",0.5,null,13.545999999999999,22576.666666666668,null,"INJ PLASTIQUE",null,null,null,null,null,null,null,null,""]
["ENTREE","2018-05-15","TPP","Tubes PP","TPP150518B",6,19,138.69999999999999,69350,null,"INJ PLASTIQUE",null,null,null,null,null,null,null,null,""]
["ENTREE","2018-05-15","TPP","Tubes PP","TPP150518A",4,11,80.3,40150,null,"INJ PLASTIQUE",null,null,null,null,null,null,null,null,""]
["ENTREE","2018-05-14","BC","Bouchons Verts","BV140518B",1,null,33.082000000000001,55136.666666666672,null,"INJ PLASTIQUE",null,null,null,null,null,null,null,null,""]
["ENTREE","2018-05-14","BC","Bouchons Verts","BV140518A",0.5,null,11.311999999999999,18853.333333333336,null,"INJ PLASTIQUE",null,null,null,null,null,null,null,null,""]
["ENTREE","2018-05-14","TPP","Tubes PP","TPP140518B",6,18,131.4,65700,null,"INJ PLASTIQUE",null,null,null,null,null,null,null,null,""]
["ENTREE","2018-05-14","TPP","Tubes PP","TPP140518A",4,12,87.6,43799.999999999993,null,"INJ PLASTIQUE",null,null,null,null,null,null,null,null,""]
["ENTREE","2018-05-13","BC","Bouchons Verts","BV130518B",0.5,null,14,23333.333333333336,null,"INJ PLASTIQUE",null,null,null,null,null,null,null,null,""]
["ENTREE","2018-05-13","TPP","Tubes PP","TPP130518B",6,17,124.1,62049.999999999993,null,"INJ PLASTIQUE",null,null,null,null,null,null,null,null,""]
["ENTREE","2018-05-12","BC","Bouchons Verts","BV120518B",0.5,null,22.62,37700.000000000007,null,"INJ PLASTIQUE",null,null,null,null,null,null,null,null,""]
["ENTREE","2018-05-12","BC","Bouchons Verts","BV120518A",0.5,null,13.316000000000001,{"$f":"IF(A80=\"SORTIE\",\"\",IF(A80=\"RETOUR\",\"\",IF(C80=\"TPP\",H80/$G$4,IF(C80=\"BC\",H80/$G$3,IF(C80=\"PR\",G80*$G$2)))))","v":22193.333333333336},null,"INJ PLASTIQUE",null,null,null,null,null,null,null,null,{"$f":"IF(A80=\"ENTREE\",\"\",IF(A80=\"SORTIE\",\"\",IF(C80=\"TPP\",R80/$G$4,IF(C80=\"BC\",R80/$G$3,IF(C80=\"PR\",S80*$G$2)))))","v":""}]
["ENTREE","2018-05-12","TPP","Tubes PP","TPP120518B",3,18,131.4,65700,null,"INJ PLASTIQUE",null,null,null,null,null,null,null,null,""]
["ENTREE","2018-05-12","TPP","Tubes PP","TPP120518A",1,2,14.6,7300,null,"INJ PLASTIQUE",null,null,null,null,null,null,null,null,""]
["ENTREE","2018-05-12","PR","Portoirs","P023",1,20.34,null,4068,null,"INJ PLASTIQUE",null,null,null,null,null,null,null,null,""]
["ENTREE","2018-05-11","BC","Bouchons Verts","BV110518A",0.5,null,13.15,21916.666666666668,null,"INJ PLASTIQUE",null,null,null,null,null,null,null,null,""]
["ENTREE","2018-05-11","TPP","Tubes PP","TPP110518A",4,11,80.3,40150,null,"INJ PLASTIQUE",null,null,null,null,null,null,null,null,""]
["ENTREE","2018-05-10","BC","Bouchons Verts","BV100518A",0.5,null,12.92,21533.333333333336,null,"INJ PLASTIQUE",null,null,null,null,null,null,null,null,""]
["ENTREE","2018-05-10","TPP","Tubes PP","TPP100518A",3,7,51.1,25550,null,"INJ PLASTIQUE",null,null,null,null,null,null,null,null,""]
["ENTREE","2018-05-07","PR","Portoirs","P022",0.5,16,null,3200,null,"INJ PLASTIQUE",null,null,null,null,null,null,null,null,""]
["ENTREE","2018-05-06","BC","Bouchons Verts","BV060518B",0.5,null,12.744999999999999,21241.666666666668,null,"INJ PLASTIQUE",null,null,null,null,null,null,null,null,""]
["ENTREE","2018-05-06","BC","Bouchons Verts","BV060518A",0.5,null,13.06,21766.666666666668,24,"INJ PLASTIQUE",null,null,null,null,null,null,null,null,""]
["ENTREE","2018-05-06","TPP","Tubes PP","TPP060518B",4,10,73,36500,0,"INJ PLASTIQUE",null,null,null,null,null,null,null,null,""]
["ENTREE","2018-05-06","TPP","Tubes PP","TPP060518A",3,9,65.7,32850,13,"INJ PLASTIQUE",null,null,null,null,null,null,null,null,""]
["ENTREE","2018-05-06","PR","Portoirs","P021",3,14.305,null,2861,16,"INJ PLASTIQUE",null,null,null,null,null,null,null,null,""]
["ENTREE","2018-05-05","BC","Bouchons Verts","BC050518B",0.5,null,13.05,21750.000000000004,16,"INJ PLASTIQUE",null,null,null,null,null,null,null,null,""]
["ENTREE","2018-05-05","BC","Bouchons Verts","BC050518A",0.5,null,13,21666.666666666668,24,"INJ PLASTIQUE",null,null,null,null,null,null,null,null,""]
["ENTREE","2018-05-05","TPP","Tubes PP","TPP050518B",4,10,73,36500,0,"INJ PLASTIQUE",null,null,null,null,null,null,null,null,""]
["ENTREE","2018-05-05","TPP","Tubes PP","TPP050518A",4,null,null,0,null,"INJ PLASTIQUE",null,null,null,null,null,null,null,null,""]
["ENTREE","2018-05-04","BC","Bouchons Verts","BV040518B",0.5,null,13.69,22816.666666666668,0,"INJ PLASTIQUE",null,null,null,null,null,null,null,null,""]
["ENTREE","2018-05-04","BC","Bouchons Verts","BV040518A",0.5,null,12.24,20400.000000000004,24,"INJ PLASTIQUE",null,null,null,null,null,null,null,null,""]
["ENTREE","2018-05-04","TPP","Tubes PP","TPP040518B",0.5,9,65.7,32850,0,"INJ PLASTIQUE",null,null,null,null,null,null,null,null,""]
["ENTREE","2018-05-03","BC","Bouchons Verts","BV030518B",0.5,null,13.35,22250,0,"INJ PLASTIQUE",null,null,null,null,null,null,null,null,""]
["ENTREE","2018-05-03","BC","Bouchons Verts","BV030518A",0.5,null,13.1,21833.333333333336,273,"INJ PLASTIQUE",null,null,null,null,null,null,null,null,""]
["ENTREE","2018-05-03","TPP","Tubes PP","TPP030518B",4,10,73,36500,0,"INJ PLASTIQUE",null,null,null,null,null,null,null,null,""]
["ENTREE","2018-05-03","TPP","Tubes PP","TPP030518A",4,10,73,36500,36,"INJ PLASTIQUE",null,null,null,null,null,null,null,null,""]
["ENTREE","2018-05-03","PR","Portoirs","P020",3,14.975,null,2995,140,"INJ PLASTIQUE",null,null,null,null,null,null,null,null,""]
["ENTREE","2018-05-02","BC","Bouchons Verts","BV020518B",0.5,null,13,21666.666666666668,0,"INJ PLASTIQUE",null,null,null,null,null,null,null,null,""]
["ENTREE","2018-05-02","BC","Bouchons Verts","BV020518A",0.5,null,13.24,22066.666666666668,32,"INJ PLASTIQUE",null,null,null,null,null,null,null,null,""]
["ENTREE","2018-03-17","BC","Bouchons Mauves","BM170318A",0.5,null,15.677,{"$f":"IF(A108=\"SORTIE\",\"\",IF(A108=\"RETOUR\",\"\",IF(C108=\"TPP\",H108/$G$4,IF(C108=\"BC\",H108/$G$3,IF(C108=\"PR\",G108*$G$2)))))","v":26128.333333333336},null,"INJ PLASTIQUE",null,null,null,{"$f":"IF(A108=\"ENTREE\",\"\",IF(A108=\"RETOUR\",\"\",IF(C108=\"TPP\",N108/$G$4,IF(C108=\"BC\",N108/$G$3,IF(C108=\"PR\",M108*$G$2)))))","v":""},null,null,null,null,{"$f":"IF(A108=\"ENTREE\",\"\",IF(A108=\"SORTIE\",\"\",IF(C108=\"TPP\",R108/$G$4,IF(C108=\"BC\",R108/$G$3,IF(C108=\"PR\",S108*$G$2)))))","v":""}]
["ENTREE","2018-03-16","BC","Bouchons Mauves","BM160318A",1,null,26.745999999999999,44576.666666666672,null,"INJ PLASTIQUE",null,null,null,"",null,null,null,null,""]
["ENTREE","2018-03-15","BC","Bouchons Mauves","BM150318B",1.5,null,28.404,47340.000000000007,null,"INJ PLASTIQUE",null,null,null,"",null,null,null,null,""]
["ENTREE","2018-03-15","BC","Bouchons Mauves","BM150318A",0.5,null,15.653,{"$f":"IF(A111=\"SORTIE\",\"\",IF(A111=\"RETOUR\",\"\",IF(C111=\"TPP\",H111/$G$4,IF(C111=\"BC\",H111/$G$3,IF(C111=\"PR\",G111*$G$2)))))","v":26088.333333333336},null,"INJ PLASTIQUE",null,null,null,"",null,null,null,null,""]
["ENTREE","2018-03-14","BC","Bouchons Mauves","BM140318B",1.5,null,26.088000000000001,{"$f":"IF(A112=\"SORTIE\",\"\",IF(A112=\"RETOUR\",\"\",IF(C112=\"TPP\",H112/$G$4,IF(C112=\"BC\",H112/$G$3,IF(C112=\"PR\",G112*$G$2)))))","v":43480.000000000007},null,"INJ PLASTIQUE",null,null,null,"",null,null,null,null,""]
["ENTREE","2018-03-14","BC","Bouchons Mauves","BM140318A",0.5,null,13.114000000000001,21856.666666666672,null,"INJ PLASTIQUE",null,null,null,"",null,null,null,null,""]
["ENTREE","2018-03-13","BC","Bouchons Mauves","BM130318B",1,null,28.061,46768.333333333336,null,"INJ PLASTIQUE",null,null,null,"",null,null,null,null,""]
["ENTREE","2018-03-13","BC","Bouchons Mauves","BM130318A",0.5,null,15.273999999999999,25456.666666666668,null,"INJ PLASTIQUE",null,null,null,"",null,null,null,null,""]
["ENTREE","2018-03-12","BC","Bouchons Mauves","BM120318B",0.5,null,27.125,45208.333333333336,null,"INJ PLASTIQUE",null,null,null,"",null,null,null,null,""]
["ENTREE","2018-03-12","BC","Bouchons Mauves","BM120318B",0.5,null,12.528,20880.000000000004,null,"INJ PLASTIQUE",null,null,null,"",null,null,null,null,""]
["ENTREE","2018-03-11","BC","Bouchons Mauves","BM110318B",1,null,28.027000000000001,46711.666666666672,null,"INJ PLASTIQUE",null,null,null,"",null,null,null,null,""]
["ENTREE","2018-03-11","BC","Bouchons Mauves","BM110318A",0.5,null,15.682,26136.666666666668,null,"INJ PLASTIQUE",null,null,null,"",null,null,null,null,""]
["ENTREE","2018-03-10","BC","Bouchons Mauves","BM100318B",1,null,27.864000000000001,46440.000000000007,null,"INJ PLASTIQUE",null,null,null,"",null,null,null,null,""]
{"$rows_left_out":100}
{"sheet":"STOCK GLOBAL","index":2,"n_rows":11,"n_cols":15,"rows_kept":11,"cut":false,"hidden":false,"merged":[[2,1,2,2],[2,4,2,5],[2,7,2,8],[2,10,2,11],[2,13,2,14]]}
[]
[]
[null,"STOCK-ENTREE",null,null,"STOCK_SORTI",null,null,"STOCK_RETOURNE",null,null,"PERTE_INJ",null,null,"PERTE_PROD"]
[null,"Étiquettes de lignes","Somme de ENTREE_U",null,"Étiquettes de lignes","Somme de SORTIE_U",null,"Étiquettes de lignes","Somme de RETOUR_U",null,"Étiquettes de lignes","Somme de PERTE_INJ",null,"Étiquettes de lignes","Somme de PERTE_PROD"]
[null,"(vide)",null,null,"(vide)",null,null,"(vide)",null,null,"(vide)",null,null,"(vide)"]
[null,"Tubes PP",10037530,null,"Tubes PP",1050500,null,"Tubes PP",null,null,"Tubes PP",20793,null,"Tubes PP"]
[null,"Bouchons Mauves",4470613.333333334,null,"Bouchons Mauves",0,null,"Bouchons Mauves",null,null,"Bouchons Mauves",6183,null,"Bouchons Mauves"]
[null,"Bouchons Bleus",797865,null,"Bouchons Bleus",0,null,"Bouchons Bleus",null,null,"Bouchons Bleus",2000,null,"Bouchons Bleus"]
[null,"Bouchons Verts",2618685,null,"Bouchons Verts",0,null,"Bouchons Verts",null,null,"Bouchons Verts",677,null,"Bouchons Verts"]
[null,"Portoirs",74913,null,"Portoirs",null,null,"Portoirs",null,null,"Portoirs",1366,null,"Portoirs"]
[null,"Total général",17999606.333333336,null,"Total général",1050500,null,"Total général",null,null,"Total général",31019,null,"Total général"]

{"sheet":"STOCK TOTAL PAR ARTICLE","index":3,"n_rows":14,"n_cols":8,"rows_kept":14,"cut":false,"hidden":false,"merged":[]}
["SUIVI DE STOCK"]
[1]
[null,"PRODUITS","ENTREE","SORTIE","PERTE","STOCK RESTANT","STOCK MIN","ALERTE"]
[null,{"$f":"INDEX('LISTE PRODUITS'!A2:A6,'STOCK TOTAL PAR ARTICLE'!$A$2)","v":"BOUCHONS BLEUS"},{"$f":"IFERROR(GETPIVOTDATA(\"ENTREE_kg\",'STOCK GLOBAL'!$B$4,\"PRODUIT\",B4),\"\")","v":""},{"$f":"IFERROR(GETPIVOTDATA(\"SORTIE_kg\",'STOCK GLOBAL'!$E$4,\"PRODUIT\",B4),\"\")","v":""}]
[null,{"$f":"INDEX('LISTE PRODUITS'!A3:A7,'STOCK TOTAL PAR ARTICLE'!$A$2)","v":"BOUCHONS VERTS"},{"$f":"IFERROR(GETPIVOTDATA(\"ENTREE_kg\",'STOCK GLOBAL'!$B$4,\"PRODUIT\",B5),\"\")","v":""},{"$f":"IFERROR(GETPIVOTDATA(\"SORTIE_kg\",'STOCK GLOBAL'!$E$4,\"PRODUIT\",B5),\"\")","v":""}]
[null,{"$f":"INDEX('LISTE PRODUITS'!A4:A8,'STOCK TOTAL PAR ARTICLE'!$A$2)","v":"BOUCHONS MAUVES"},{"$f":"IFERROR(GETPIVOTDATA(\"ENTREE_kg\",'STOCK GLOBAL'!$B$4,\"PRODUIT\",B6),\"\")","v":""},{"$f":"IFERROR(GETPIVOTDATA(\"SORTIE_kg\",'STOCK GLOBAL'!$E$4,\"PRODUIT\",B6),\"\")","v":""}]
[null,{"$f":"INDEX('LISTE PRODUITS'!A5:A9,'STOCK TOTAL PAR ARTICLE'!$A$2)","v":"TUBES PP"},{"$f":"IFERROR(GETPIVOTDATA(\"ENTREE_kg\",'STOCK GLOBAL'!$B$4,\"PRODUIT\",B7),\"\")","v":""},{"$f":"IFERROR(GETPIVOTDATA(\"SORTIE_kg\",'STOCK GLOBAL'!$E$4,\"PRODUIT\",B7),\"\")","v":""}]
[null,"PORTOIRS",{"$f":"IFERROR(GETPIVOTDATA(\"ENTREE_kg\",'STOCK GLOBAL'!$B$4,\"PRODUIT\",#REF!),\"\")","v":""},{"$f":"IFERROR(GETPIVOTDATA(\"SORTIE_kg\",'STOCK GLOBAL'!$E$4,\"PRODUIT\",#REF!),\"\")","v":""}]
[null,null,{"$f":"IFERROR(GETPIVOTDATA(\"ENTREE_kg\",'STOCK GLOBAL'!$B$4,\"PRODUIT\",#REF!),\"\")","v":""},{"$f":"IFERROR(GETPIVOTDATA(\"SORTIE_kg\",'STOCK GLOBAL'!$E$4,\"PRODUIT\",#REF!),\"\")","v":""}]
[null,null,{"$f":"IFERROR(GETPIVOTDATA(\"ENTREE_kg\",'STOCK GLOBAL'!$B$4,\"PRODUIT\",#REF!),\"\")","v":""},{"$f":"IFERROR(GETPIVOTDATA(\"SORTIE_kg\",'STOCK GLOBAL'!$E$4,\"PRODUIT\",#REF!),\"\")","v":""}]
[null,null,{"$f":"IFERROR(GETPIVOTDATA(\"ENTREE_kg\",'STOCK GLOBAL'!$B$4,\"PRODUIT\",B11),\"\")","v":""},{"$f":"IFERROR(GETPIVOTDATA(\"SORTIE_kg\",'STOCK GLOBAL'!$E$4,\"PRODUIT\",B11),\"\")","v":""}]
[null,null,{"$f":"IFERROR(GETPIVOTDATA(\"ENTREE_kg\",'STOCK GLOBAL'!$B$4,\"PRODUIT\",B12),\"\")","v":""},{"$f":"IFERROR(GETPIVOTDATA(\"SORTIE_kg\",'STOCK GLOBAL'!$E$4,\"PRODUIT\",B12),\"\")","v":""}]
[null,null,{"$f":"IFERROR(GETPIVOTDATA(\"ENTREE_kg\",'STOCK GLOBAL'!$B$4,\"PRODUIT\",B13),\"\")","v":""},{"$f":"IFERROR(GETPIVOTDATA(\"SORTIE_kg\",'STOCK GLOBAL'!$E$4,\"PRODUIT\",B13),\"\")","v":""}]
[null,null,null,{"$f":"IFERROR(GETPIVOTDATA(\"SORTIE_kg\",'STOCK GLOBAL'!$E$4,\"PRODUIT\",B14),\"\")","v":""}]

{"sheet":"LISTE PRODUITS","index":4,"n_rows":6,"n_cols":5,"rows_kept":6,"cut":false,"hidden":false,"merged":[]}
[{"$f":"\"LISTE PRODUITS\"","v":"LISTE PRODUITS"},"ATELIER","REFERENCE","POIDS (kg)","ACTION"]
["BOUCHONS BLEUS","INJECTION","BC",5.9999999999999995E-4,"ENTREE"]
["BOUCHONS VERTS","PRODATC","BC",5.9999999999999995E-4,"SORTIE"]
["BOUCHONS MAUVES",null,"BC",5.9999999999999995E-4,"RETOUR"]
["TUBES PP",null,"TPP",2E-3]
["PORTOIRS",null,"PR"]