{"text_format":"1","workbook":"xlsx","n_sheets":4,"sheets":["Feuille de route","Listing Avions","Listes","Listing CPB"],"not_rendered":{"charts":0,"images":0,"macros":1,"external_links":0,"defined_names":6,"comments":0,"pivot_tables":0},"unopened":[],"bounds":{"document_bytes":16777216,"sheet_cells":100000,"rows_first":2000,"rows_last":500,"rows_between":2000,"halvings":0,"cell_chars":16384,"cell_head_chars":4096},"cells_cut":0,"cells_raw":0,"read":"whole","date_system":"1900"}

{"sheet":"Feuille de route","index":0,"n_rows":18,"n_cols":17,"rows_kept":18,"cut":false,"hidden":false,"merged":[[1,16,2,16],[5,5,5,6],[6,5,6,6],[16,1,16,13],[7,5,7,6],[8,5,8,6],[13,2,13,4],[14,2,14,4],[17,1,17,13],[10,8,10,13],[10,1,10,6],[11,2,11,4],[12,2,12,4],[1,2,1,5],[1,9,1,12],[14,9,14,11],[2,5,2,6],[7,12,7,13],[8,12,8,13],[11,9,11,11],[12,9,12,11],[13,9,13,11],[2,12,2,13],[3,12,3,13],[4,12,4,13],[5,12,5,13],[6,12,6,13],[3,5,3,6],[4,5,4,6]]}
[]
[null,8276,"Visites Client",null,null,null,"MD1",null,8221,"Visites Client",null,null,null,"MD2",null,null,"Dernière sauvegarde le :"]
[null,"Item","Description","Statut","Date","Observation",null,null,"Item","Description","Statut","Date","Observation"]
[null,"3.10","Présentation C65",{"$f":"VLOOKUP(B2,Tableau6[],5,FALSE)","v":"Fait P25"},{"$f":"VLOOKUP(B2,Tableau6[],6,FALSE)","v":""},{"$f":"VLOOKUP(B2,Tableau6[],7,FALSE)","v":""},null,null,"3.10","Présentation C65",{"$f":"VLOOKUP(I2,Tableau6[],5,FALSE)","v":"Fait P25"},{"$f":"VLOOKUP(I2,Tableau6[],6,FALSE)","v":" "},{"$f":"VLOOKUP(I2,Tableau6[],7,FALSE)","v":"Pas de presentation sur CIS"},null,null,null,"2018-04-24T11:05:38"]
[null,"3.19","Présentation C34",{"$f":"VLOOKUP(B2,Tableau6[],8,FALSE)","v":"Fait P25"},{"$f":"VLOOKUP(B2,Tableau6[],9,FALSE)","v":""},{"$f":"VLOOKUP(B2,Tableau6[],10,FALSE)","v":""},null,null,"3.19","Présentation C34",{"$f":"VLOOKUP(I2,Tableau6[],8,FALSE)","v":"A Faire"},{"$f":"VLOOKUP(I2,Tableau6[],9,FALSE)","v":" "},{"$f":"VLOOKUP(I2,Tableau6[],10,FALSE)","v":"RATE"},null,null,null,"ng5e9ce"]
[null,"3.24","Présentation C24",{"$f":"VLOOKUP(B2,Tableau6[],11,FALSE)","v":"Fait P25"},{"$f":"VLOOKUP(B2,Tableau6[],12,FALSE)","v":""},{"$f":"VLOOKUP(B2,Tableau6[],13,FALSE)","v":""},null,null,"3.24","Présentation C24",{"$f":"VLOOKUP(I2,Tableau6[],11,FALSE)","v":"A Faire"},{"$f":"VLOOKUP(I2,Tableau6[],12,FALSE)","v":" "},{"$f":"VLOOKUP(I2,Tableau6[],13,FALSE)","v":"RATE"}]
[null,"3.25","Présentation Final Soute 2",{"$f":"VLOOKUP(B2,Tableau6[],14,FALSE)","v":"Fait P25"},{"$f":"VLOOKUP(B2,Tableau6[],15,FALSE)","v":""},{"$f":"VLOOKUP(B2,Tableau6[],16,FALSE)","v":""},null,null,"3.25","Présentation Final Soute 2",{"$f":"VLOOKUP(I2,Tableau6[],14,FALSE)","v":"Fait P25"},{"$f":"VLOOKUP(I2,Tableau6[],15,FALSE)","v":"19/03/2018"},{"$f":"VLOOKUP(I2,Tableau6[],16,FALSE)","v":" "}]
[null,"3.26","Présentation Final Soute 1",{"$f":"VLOOKUP(B2,Tableau6[],17,FALSE)","v":"Fait P25"},{"$f":"VLOOKUP(B2,Tableau6[],18,FALSE)","v":""},{"$f":"VLOOKUP(B2,Tableau6[],19,FALSE)","v":""},null,null,"3.26","Présentation Final Soute 1",{"$f":"VLOOKUP(I2,Tableau6[],17,FALSE)","v":"A Faire"},{"$f":"VLOOKUP(I2,Tableau6[],18,FALSE)","v":" "},{"$f":"VLOOKUP(I2,Tableau6[],19,FALSE)","v":"RATE"}]
[null,"3.27","Présentation Final Cabine",{"$f":"VLOOKUP(B2,Tableau6[],20,FALSE)","v":"A Faire"},{"$f":"VLOOKUP(B2,Tableau6[],21,FALSE)","v":""},{"$f":"VLOOKUP(B2,Tableau6[],22,FALSE)","v":"prévu pour le 12/04/2018"},null,null,"3.27","Présentation Final Cabine",{"$f":"VLOOKUP(I2,Tableau6[],20,FALSE)","v":"Fait WP"},{"$f":"VLOOKUP(I2,Tableau6[],21,FALSE)","v":" 04/04/2018"},{"$f":"VLOOKUP(I2,Tableau6[],22,FALSE)","v":"  "}]
[]
[null,"CPB",null,null,null,null,null,null,"CPB"]
[null,"N°","Description",null,null,"Statut","Stamp",null,"N°","Description",null,null,"Statut","Stamp"]
[null,{"$f":"VLOOKUP(B2,Tableau62[],2,FALSE)","v":" "},{"$f":"VLOOKUP(B2,Tableau62[],3,FALSE)","v":" "},null,null,{"$f":"VLOOKUP(B2,Tableau62[],4,FALSE)","v":" "},{"$f":"VLOOKUP(B2,Tableau62[],5,FALSE)","v":" "},null,{"$f":"VLOOKUP(I2,Tableau62[],2,FALSE)","v":"6028621 "},{"$f":"VLOOKUP(I2,Tableau62[],3,FALSE)","v":"Vérification de l'absence de PR dans trou de drainage sur ferrures CLS soutes 1 et 2"},null,null,{"$f":"VLOOKUP(I2,Tableau62[],4,FALSE)","v":"A Faire"},{"$f":"VLOOKUP(I2,Tableau62[],5,FALSE)","v":""}]
[null,{"$f":"VLOOKUP(B2,Tableau62[],6,FALSE)","v":" "},{"$f":"VLOOKUP(B2,Tableau62[],7,FALSE)","v":" "},null,null,{"$f":"VLOOKUP(B2,Tableau62[],8,FALSE)","v":" "},{"$f":"VLOOKUP(B2,Tableau62[],9,FALSE)","v":" "},null,{"$f":"VLOOKUP(I2,Tableau62[],6,FALSE)","v":""},{"$f":"VLOOKUP(I2,Tableau62[],7,FALSE)","v":""},null,null,{"$f":"VLOOKUP(I2,Tableau62[],8,FALSE)","v":""},{"$f":"VLOOKUP(I2,Tableau62[],9,FALSE)","v":""}]
[null,{"$f":"VLOOKUP(B2,Tableau62[],10,FALSE)","v":" "},{"$f":"VLOOKUP(B2,Tableau62[],11,FALSE)","v":" "},null,null,{"$f":"VLOOKUP(B2,Tableau62[],12,FALSE)","v":" "},{"$f":"VLOOKUP(B2,Tableau62[],13,FALSE)","v":" "},null,{"$f":"VLOOKUP(I2,Tableau62[],10,FALSE)","v":""},{"$f":"VLOOKUP(I2,Tableau62[],11,FALSE)","v":""},null,null,{"$f":"VLOOKUP(I2,Tableau62[],12,FALSE)","v":""},{"$f":"VLOOKUP(I2,Tableau62[],13,FALSE)","v":""}]
[]
[null,"Commentaire"]
[null,"L03 : MSN 8247 Final Soute 2 non fait lors du passage en WP sera peut-être fait aujourd'hui. Attente retour suite à la réunions de ce matin pour savoir qui la prend en charge."]

{"sheet":"Listing Avions","index":1,"n_rows":16,"n_cols":22,"rows_kept":16,"cut":false,"hidden":false,"merged":[[2,0,4,0],[2,1,4,1],[2,2,4,2],[2,3,4,3],[2,4,2,21],[3,11,3,12],[3,8,3,9],[0,6,1,21],[3,20,3,21],[3,5,3,6],[3,14,3,15],[3,17,3,18]]}
[null,null,null,null,null,null,"MSN WP 320 Cabine"]
[]
["MSN","Poste","Entrée","Sortie","Visites Client"]
[null,null,null,null,"3.10","Présentation C65",null,"3.19","Présentation C34",null,"3.24 ","Présentation C24",null,"3.25 ","Final Soute 2",null,"3.26  ","Final Soute 1",null,"3.27 ","Final Cabine"]
[null,null,null,null,"Statut","Date","Observations","Statut","Date","Observations","Statut","Date","Observations","Statut","Date","Observations","Statut","Date","Observations","Statut","Date","Observations"]
["MSN","-5145","06/02/1914","06/02/19142","06/02/19143","21/01/1924","21/01/19242","21/01/19243","21/01/19244","05/11/1908","05/11/19082","05/11/19083","18/11/1900","3.25 Statut","3.25 Date","3.25 Observations","3.26 Statut","3.26 Date","3.26 Observations","3.27 Statut","3.27 Date","3.27 Observations"]
["-","-","-","-","-","-","-","-","-","-","-","-","-","-","-","-","-","-","-","-","-","-"]
[7992,"P25A","23/03/2018","26/03/2018","Fait Wp","2017-06-11"," ","Fait P25","23/10/2017"," ","Fait P25","23/10/2017"," ","Fait WP","2017-07-11"," ","Fait WP","2017-07-11"," ","Fait WP","2017-08-11"," "]
[8244,"P25B","26/03/2018","27/03/2018","Fait P25","14/03/2018"," ","Fait P25","13/03/2018"," ","Fait P25","13/03/2018"," ","A Faire"," ","Prévue le 27/03/2018","Fait P25","13/03/2018"," ","Fait P25","13/03/2018"," "]
[8252,"P25C","27/03/2018","28/03/2018","Fait P25","14/03/2018"," ","Fait P25","13/03/2018"," ","Fait P25","13/03/2018"," ","Fait P25","15/03/2018"," ","Fait P25","15/03/2018"," ","A Faire"," ","MC7  - Final Cabine repoussé ultérieurement"]
[8221,"P25D","27/03/2018 ","2018-04-04","Fait P25"," ","Pas de presentation sur CIS","A Faire"," ","RATE","A Faire"," ","RATE","Fait P25","19/03/2018"," ","A Faire"," ","RATE","Fait WP"," 04/04/2018","  "]
[8231,"P25A","29/03/2018","2018-04-05","Fait P25","19/03/2018"," ","Fait P25","19/03/2018"," ","Fait P25","19/03/2018"," ","Fait P25","20/03/2018"," ","Fait P25","20/03/2018"," ","A Faire"," 05/04/2018","             Prévu le 05/04/18"]
[8247,"P25D","2018-04-05","2018-04-06","N/A"," ","Pas selectionné par client","Fait P25","2018-03-22"," ","N/A"," ","Pas selectionné par client","A Faire"," ","Prévu le 06/04/18     (  travaux fuselage  E/C )","Fait P25","26/03/18"," ","Fait P25","26/03/18"," "]
[8240,"P25A","05/04/2018","09/04/2018","Fait P25","","","Fait P25","","","Fait P25","","","A Faire","09/04/2018","","Fait P25","","","Fait P25","",""]
[8276,"P25B","09/04/2018","12/04/2018","Fait P25","","","Fait P25","","","Fait P25","","","Fait P25","","","Fait P25","","","A Faire","","prévu pour le 12/04/2018"]
[8173,"P25C","2018-04-06","2018-04-10","Fait P25"," "," ","Fait P25"," "," ","Fait P25"," "," ","A Faire"," "," par la RATE","A Faire"," ","par la RATE","Fait P25"," "," "]

{"sheet":"Listes","index":2,"n_rows":7,"n_cols":7,"rows_kept":7,"cut":false,"hidden":true,"merged":[]}
[]
[]
[null,null,"Statut",null,"Poste",null,"Statut2"]
[null,null,"Fait P25",null,"P25A",null,"Fait"]
[null,null,"Fait WP",null,"P25B",null,"A Faire"]
[null,null,"A Faire",null,"P25C",null,"N/A"]
[null,null,"N/A",null,"P25D"]

{"sheet":"Listing CPB","index":3,"n_rows":15,"n_cols":13,"rows_kept":15,"cut":false,"hidden":false,"merged":[[0,1,1,12]]}
[null,"Liste CPB"]
[]
["MSN","N°","Description","Statut","Stamp","N°","Description","Statut","Stamp","N°","Description","Statut","Stamp"]
["MSN","N°","Description","Statut","Colonne1","N°2","Description3","Statut4","Colonne15","N°3","Description4","Statut5","Colonne16"]
["-","-","-","-","-","-","-","-","-","-","-","-","-"]
[7992," "," "," "," "," "," "," "," "," "," "," "," "]
[8244," "," "," "," "," "," "," "," "," "," "," "," "]
[8252,"","","","","","","","","","","",""]
[8221,"6028621 ","Vérification de l'absence de PR dans trou de drainage sur ferrures CLS soutes 1 et 2","A Faire","","","","","","","","",""]
[8231," "," "," ",""," "," "," "," "," "," "," "," "]
[8247," "," "," "," "," "," "," "," "," "," "," "," "]
[8240," "," "," "," "," "," "," "," "," "," "," "," "]
[8276," "," "," "," "," "," "," "," "," "," "," "," "]
[8173," "," "," "," "," "," "," ",""," "," "," "," "]
[8276,"","RAS","","","","","","","","","",""]