{"text_format":"1","workbook":"xlsx","n_sheets":12,"sheets":["Explications","Classement auteurs","Classement clubs","Défi-1","Défi-2","Défi-3","Défi-4","Défi-5","Défi-6","Défi-7","Liste des clubs","Comparaison auteurs"],"not_rendered":{"charts":0,"images":0,"macros":1,"external_links":0,"defined_names":2,"comments":0,"pivot_tables":0},"unopened":[],"bounds":{"document_bytes":16777216,"sheet_cells":100000,"rows_first":2000,"rows_last":500,"rows_between":2000,"halvings":0,"cell_chars":16384,"cell_head_chars":4096},"cells_cut":0,"cells_raw":0,"read":"whole","date_system":"1900"}

{"sheet":"Explications","index":0,"n_rows":28,"n_cols":2,"rows_kept":28,"cut":false,"hidden":false,"merged":[[15,1,21,8],[27,1,33,8],[8,1,13,8],[23,1,25,8],[1,1,2,8],[3,1,4,8],[5,1,6,8]]}
[]
[null,"Je suis le gestionnaire d'un concours photo, composé de 7 défis. Les défis s'étalent de Novembre à Mai pour une durée d'un mois."]
[]
[null,"Chaque auteur ne peut participar qu'avec une seule photo dans un même défi. Les photos sont jugées par 3 juges. Après chaque jugement je récupère un fichier de notation."]
[]
[null,"Les fichiers de notations sont insérées dans ce classeur manuellement dans des onglets nommés de Défi-1 à Défi-7."]
[]
[]
[null,"Chaque  auteur est identifié par le un numéro, de 12 chiffres, qui se trouve dans la colonne \"fichier\". Il a la forme suivante 131353000101. il se décomose de la manière suivante :\n- Les deux premiers chiffres 13 corresponds au N° de l'UR.\n- Les quatre suivantes 1353 correspondent au N° du club.\n- les quatres suivante 0001 correspondent au N° d'adhérent.\n- Les deux derniers 01 correspondent au N° d'ordre."]
[]
[]
[]
[]
[]
[]
[null,"Deux classement sont effectués après chaque défi.\n- Un classement auteur qui s'obtient par totalisation des notes obtenues par un auteur dans chacun des défis auquel il a participé. Ce classement se fait sur la totalité du N° de fichier.La participation à tous les défis n'est pas obligatoire.\n- Un classement club obtenu par addition des trois meilleures photos d'un même club dans un défi. Ce classement doit se faire sur les quatre chiffres vert. On ne classe que les club ayant au moins trois auteurs. Avec 1 ou 2 auteur le club n'est pas classé."]
[]
[]
[]
[]
[]
[]
[]
[null,"Ce que je souhaiterais faire, c'est qu'après chaque défi et après avoir inséré le fichier de notation, dans l'onglet correspondant à un défi, soit effectué automatiquement le classement auteur et le classement club."]
[]
[]
[]
[null,"J'arrive à le faire manuellement, mais je suis incapable d'écrire les macros permettant d'effectuer automatiquement ces deux classements.\n\nJe suis à votre disposition pour toutes autres précisions.\n\nMerci d'avance pour votre aide."]

{"sheet":"Classement auteurs","index":1,"n_rows":281,"n_cols":13,"rows_kept":281,"cut":false,"hidden":false,"merged":[[3,12,3,17],[5,12,6,17],[8,12,18,17]]}
[]
[null,"Fichier","Défi-1","Défi-2","Défi-3","Défi-4","Défi-5","Défi-6","Défi-7","Total"]
[null,131683007901,54,39,38,51,58,51,42,{"$f":"SUM(C3:I3)","v":333}]
[null,131110000901,51,45,56,43,41,43,36,{"$f":"SUM(C4:I4)","v":315},null,null,"Ce classement sera toujours maintenu dans l'ordre décroissant.."]
[null,131824001901,52,40,45,48,44,40,45,{"$f":"SUM(C5:I5)","v":314}]
[null,130987024201,46,43,48,45,39,45,43,{"$f":"SUM(C6:I6)","v":309},null,null,"Etant le premier, le Défi-1 sert de base de départ pour les 6 autres. Pour cela on utilise les 4 premières colonnes et la colonne total."]
[null,132193000301,48,37,40,45,38,38,55,{"$f":"SUM(C7:I7)","v":301}]
[null,130527009401,50,53,46,50,51,null,49,{"$f":"SUM(C8:I8)","v":299}]
[null,130987015701,48,39,34,41,46,34,52,{"$f":"SUM(C9:I9)","v":294},null,null,"Suite à une remarque de Gbinforme j'ai supprimer les colonne inutiles.\nEn incluanant la formule :\n=SIERREUR(RECHERCHEV($B4;'Défi-5'!$C$2:$J$146;8;FAUX);\"\")\nj'ai réussit à récuperer , pour un auteur donné, les notes obtenues dans les autres défis.\nPar contre il manque maintenant les auteurs présents sur les autres défis et absents du 1er. Le but étant d'avoir dans ce classement tous les auteurs des 7 défis.\nC'est un début ..."]
[null,131499006801,35,39,48,52,42,42,36,{"$f":"SUM(C10:I10)","v":294}]
[null,131683006301,57,36,34,47,45,34,36,{"$f":"SUM(C11:I11)","v":289}]
[null,131353000101,45,36,46,47,57,null,56,{"$f":"SUM(C12:I12)","v":287}]
[null,131879000801,50,null,58,40,36,58,44,{"$f":"SUM(C13:I13)","v":286}]
[null,130987024101,40,39,36,46,44,36,39,{"$f":"SUM(C14:I14)","v":280}]
[null,131376018301,31,34,57,41,44,31,42,{"$f":"SUM(C15:I15)","v":280}]
[null,130987019701,51,40,40,39,37,37,33,{"$f":"SUM(C16:I16)","v":277}]
[null,131619004501,51,48,48,46,37,null,47,{"$f":"SUM(C17:I17)","v":277}]
[null,131823004901,44,25,43,39,41,41,43,{"$f":"SUM(C18:I18)","v":276}]
[null,130925007701,46,50,48,44,37,50,null,{"$f":"SUM(C19:I19)","v":275}]
[null,131683005101,36,33,41,44,49,33,38,{"$f":"SUM(C20:I20)","v":274}]
[null,131683008001,48,47,47,39,52,39,null,{"$f":"SUM(C21:I21)","v":272}]
[null,132060001701,37,45,33,37,37,45,35,{"$f":"SUM(C22:I22)","v":269}]
[null,131353000701,48,42,39,57,41,null,41,{"$f":"SUM(C23:I23)","v":268}]
[null,131376014701,43,23,39,41,44,43,33,{"$f":"SUM(C24:I24)","v":266},null,null,"=SIERREUR(RECHERCHEV($B4;'Défi-5'!$C$2:$J$146;8;FAUX);\"\")"]
[null,131956004501,38,38,35,37,39,37,42,{"$f":"SUM(C25:I25)","v":266}]
[null,131499005201,44,31,49,37,39,31,34,{"$f":"SUM(C26:I26)","v":265}]
[null,131862002201,41,35,44,27,43,35,37,{"$f":"SUM(C27:I27)","v":262}]
[null,130878014101,36,37,44,18,56,37,33,{"$f":"SUM(C28:I28)","v":261}]
[null,131956004601,null,47,50,38,27,47,52,{"$f":"SUM(C29:I29)","v":261}]
[null,130000020401,31,37,35,35,43,35,41,{"$f":"SUM(C30:I30)","v":257}]
[null,130987013801,38,null,45,42,42,38,51,{"$f":"SUM(C31:I31)","v":256}]
[null,130987019601,39,37,36,44,34,34,29,{"$f":"SUM(C32:I32)","v":253}]
[null,131110001001,41,41,40,47,35,47,null,{"$f":"SUM(C33:I33)","v":251}]
[null,131499008701,44,29,39,33,34,33,34,{"$f":"SUM(C34:I34)","v":246}]
[null,131845001401,41,34,48,39,43,null,37,{"$f":"SUM(C35:I35)","v":242}]
[null,130000019901,32,41,44,24,37,24,37,{"$f":"SUM(C36:I36)","v":239}]
[null,130527002501,41,37,38,30,32,32,29,{"$f":"SUM(C37:I37)","v":239}]
[null,131956002601,null,44,44,34,30,44,43,{"$f":"SUM(C38:I38)","v":239}]
[null,131353004301,18,28,35,47,24,47,38,{"$f":"SUM(C39:I39)","v":237}]
[null,131879000501,38,39,40,41,39,38,null,{"$f":"SUM(C40:I40)","v":235}]
[null,131353000201,33,37,25,36,37,33,34,{"$f":"SUM(C41:I41)","v":235}]
[null,131845000101,42,null,41,18,41,42,50,{"$f":"SUM(C42:I42)","v":234}]
[null,132086002301,36,31,35,35,32,32,33,{"$f":"SUM(C43:I43)","v":234}]
[null,132084001701,45,36,40,null,41,41,31,{"$f":"SUM(C44:I44)","v":234}]
[null,132084004001,null,40,32,40,42,42,36,{"$f":"SUM(C45:I45)","v":232}]
[null,131879000601,47,37,34,31,null,47,35,{"$f":"SUM(C46:I46)","v":231}]
[null,131879001301,42,30,46,null,42,42,29,{"$f":"SUM(C47:I47)","v":231}]
[null,130925009801,44,36,41,34,40,36,null,{"$f":"SUM(C48:I48)","v":231}]
[null,131845004001,40,33,42,39,41,33,null,{"$f":"SUM(C49:I49)","v":228}]
[null,130527012401,41,36,18,47,null,47,38,{"$f":"SUM(C50:I50)","v":227}]
[null,132060000701,38,29,31,25,36,38,28,{"$f":"SUM(C51:I51)","v":225}]
[null,130878013001,41,null,39,40,26,39,39,{"$f":"SUM(C52:I52)","v":224}]
[null,131956002401,28,36,40,35,43,null,42,{"$f":"SUM(C53:I53)","v":224}]
[null,131494000201,39,34,42,35,37,35,null,{"$f":"SUM(C54:I54)","v":222}]
[null,131353006101,null,41,36,38,36,36,35,{"$f":"SUM(C55:I55)","v":222}]
[null,130878007201,36,null,37,32,35,36,44,{"$f":"SUM(C56:I56)","v":220}]
[null,132060001801,38,38,40,22,47,null,35,{"$f":"SUM(C57:I57)","v":220}]
[null,131879000101,41,41,38,null,28,28,40,{"$f":"SUM(C58:I58)","v":216}]
[null,130987024001,46,44,44,null,null,44,37,{"$f":"SUM(C59:I59)","v":215}]
[null,131499006901,42,45,43,39,46,null,null,{"$f":"SUM(C60:I60)","v":215}]
[null,131353003001,45,30,37,null,35,30,36,{"$f":"SUM(C61:I61)","v":213}]
[null,131499010001,42,42,43,42,42,null,null,{"$f":"SUM(C62:I62)","v":211}]
[null,130925007601,null,44,43,39,41,44,null,{"$f":"SUM(C63:I63)","v":211}]
[null,131992000301,40,33,32,null,31,40,33,{"$f":"SUM(C64:I64)","v":209}]
[null,130987023901,40,30,40,35,30,null,34,{"$f":"SUM(C65:I65)","v":209}]
[null,131499009801,42,null,35,54,42,35,null,{"$f":"SUM(C66:I66)","v":208}]
[null,131823008301,null,40,48,null,42,42,36,{"$f":"SUM(C67:I67)","v":208}]
[null,131683007601,null,42,31,42,32,31,29,{"$f":"SUM(C68:I68)","v":207}]
[null,130925010201,46,30,31,33,null,31,35,{"$f":"SUM(C69:I69)","v":206}]
[null,130527017001,55,40,31,29,51,null,null,{"$f":"SUM(C70:I70)","v":206}]
[null,131879002001,null,47,42,41,38,38,null,{"$f":"SUM(C71:I71)","v":206}]
[null,131110001101,36,24,38,36,45,24,null,{"$f":"SUM(C72:I72)","v":203}]
[null,131499010501,35,41,47,41,36,null,null,{"$f":"SUM(C73:I73)","v":200}]
[null,131376012601,31,29,40,null,34,31,33,{"$f":"SUM(C74:I74)","v":198}]
[null,131499003901,42,null,40,45,39,null,32,{"$f":"SUM(C75:I75)","v":198}]
[null,131683006601,40,26,42,null,49,null,41,{"$f":"SUM(C76:I76)","v":198}]
[null,130987007401,31,32,28,38,37,31,null,{"$f":"SUM(C77:I77)","v":197}]
[null,132060001201,46,null,39,40,39,null,33,{"$f":"SUM(C78:I78)","v":197}]
[null,131499008201,45,41,null,41,49,null,20,{"$f":"SUM(C79:I79)","v":196}]
[null,131499010601,46,40,37,32,39,null,null,{"$f":"SUM(C80:I80)","v":194}]
[null,131956005701,36,31,34,28,38,null,27,{"$f":"SUM(C81:I81)","v":194}]
[null,131992000401,null,39,32,20,45,32,24,{"$f":"SUM(C82:I82)","v":192}]
[null,131227008601,null,null,53,44,42,53,null,{"$f":"SUM(C83:I83)","v":192}]
[null,132086001401,33,41,37,46,34,null,null,{"$f":"SUM(C84:I84)","v":191}]
[null,130878013401,null,30,36,35,30,30,28,{"$f":"SUM(C85:I85)","v":189}]
[null,131499003601,34,33,35,null,50,null,36,{"$f":"SUM(C86:I86)","v":188}]
[null,130987028401,32,38,27,27,36,27,null,{"$f":"SUM(C87:I87)","v":187}]
[null,130527015501,46,null,45,31,32,null,32,{"$f":"SUM(C88:I88)","v":186}]
[null,131956001401,null,32,38,18,35,32,31,{"$f":"SUM(C89:I89)","v":186}]
[null,132193000401,41,37,null,null,33,37,37,{"$f":"SUM(C90:I90)","v":185}]
[null,130878014301,38,23,52,18,29,23,null,{"$f":"SUM(C91:I91)","v":183}]
[null,131376017701,51,null,48,18,null,18,47,{"$f":"SUM(C92:I92)","v":182}]
[null,130925008401,51,39,40,null,51,null,null,{"$f":"SUM(C93:I93)","v":181}]
[null,132084002301,null,37,54,43,null,43,null,{"$f":"SUM(C94:I94)","v":177}]
[null,132060000401,18,null,43,36,40,null,39,{"$f":"SUM(C95:I95)","v":176}]
[null,130987001601,35,36,35,32,37,null,null,{"$f":"SUM(C96:I96)","v":175}]
[null,131353006201,null,31,39,35,37,null,31,{"$f":"SUM(C97:I97)","v":173}]
[null,130925009901,30,38,34,32,37,null,null,{"$f":"SUM(C98:I98)","v":171}]
[null,131956000201,null,47,44,41,39,null,null,{"$f":"SUM(C99:I99)","v":171}]
[null,131683008101,null,null,37,null,43,43,48,{"$f":"SUM(C100:I100)","v":171}]
[null,130527013301,47,39,40,44,null,null,null,{"$f":"SUM(C101:I101)","v":170}]
[null,131956002901,43,null,40,28,28,28,null,{"$f":"SUM(C102:I102)","v":167}]
[null,130462001101,null,null,38,45,43,38,null,{"$f":"SUM(C103:I103)","v":164}]
[null,132103002301,46,43,43,null,null,null,31,{"$f":"SUM(C104:I104)","v":163}]
[null,132193001201,null,34,null,37,37,37,18,{"$f":"SUM(C105:I105)","v":163}]
[null,131499010401,37,null,43,41,41,null,null,{"$f":"SUM(C106:I106)","v":162}]
[null,132084003501,null,43,null,40,38,40,null,{"$f":"SUM(C107:I107)","v":161}]
[null,132060000901,35,28,null,38,30,null,29,{"$f":"SUM(C108:I108)","v":160}]
[null,131619004601,35,null,39,null,43,null,43,{"$f":"SUM(C109:I109)","v":160}]
[null,130878015201,43,null,null,18,42,18,39,{"$f":"SUM(C110:I110)","v":160}]
[null,131845004101,29,34,34,26,36,null,null,{"$f":"SUM(C111:I111)","v":159}]
[null,131376011801,48,null,null,18,46,46,null,{"$f":"SUM(C112:I112)","v":158}]
[null,131845002101,38,34,42,null,44,null,null,{"$f":"SUM(C113:I113)","v":158}]
[null,131824003101,42,33,41,null,null,41,null,{"$f":"SUM(C114:I114)","v":157}]
[null,130987002301,null,44,40,39,34,null,null,{"$f":"SUM(C115:I115)","v":157}]
[null,130987014001,48,37,23,null,null,48,null,{"$f":"SUM(C116:I116)","v":156}]
[null,132084003601,null,33,null,55,35,33,null,{"$f":"SUM(C117:I117)","v":156}]
[null,131353007301,null,40,38,null,38,40,null,{"$f":"SUM(C118:I118)","v":156}]
[null,132060000101,29,null,33,null,34,29,29,{"$f":"SUM(C119:I119)","v":154}]
[null,131956003401,37,24,34,null,33,24,null,{"$f":"SUM(C120:I120)","v":152}]
[null,131823006401,null,38,39,37,37,null,null,{"$f":"SUM(C121:I121)","v":151}]
[null,131823007601,33,null,40,null,30,null,43,{"$f":"SUM(C122:I122)","v":146}]
[null,132147000101,null,null,null,38,36,36,35,{"$f":"SUM(C123:I123)","v":145}]
[null,131683000701,32,30,48,null,null,32,null,{"$f":"SUM(C124:I124)","v":142}]
[null,132193000501,null,25,null,21,41,25,30,{"$f":"SUM(C125:I125)","v":142}]
[null,132084000301,null,39,40,24,null,39,null,{"$f":"SUM(C126:I126)","v":142}]
[null,131845000801,36,null,null,null,34,36,34,{"$f":"SUM(C127:I127)","v":140}]
[null,132086002501,38,32,38,null,null,32,null,{"$f":"SUM(C128:I128)","v":140}]
[null,130925008601,33,36,34,null,null,36,null,{"$f":"SUM(C129:I129)","v":139}]
[null,131845002501,30,41,32,null,null,null,36,{"$f":"SUM(C130:I130)","v":139}]
[null,131499009301,29,null,35,null,null,35,39,{"$f":"SUM(C131:I131)","v":138}]
[null,131823005701,36,28,37,null,null,null,37,{"$f":"SUM(C132:I132)","v":138}]
[null,131353007101,37,30,33,null,37,null,null,{"$f":"SUM(C133:I133)","v":137}]
[null,132086002601,32,26,null,39,40,null,null,{"$f":"SUM(C134:I134)","v":137}]
[null,132089000101,36,29,null,null,36,null,34,{"$f":"SUM(C135:I135)","v":135}]
[null,131862000801,51,24,36,null,null,24,null,{"$f":"SUM(C136:I136)","v":135}]
[null,130878013601,null,34,null,null,34,34,33,{"$f":"SUM(C137:I137)","v":135}]
[null,132060002201,41,29,36,null,null,null,27,{"$f":"SUM(C138:I138)","v":133}]
[null,132103000101,null,23,55,null,null,55,null,{"$f":"SUM(C139:I139)","v":133}]
[null,131683006901,null,null,51,null,41,41,null,{"$f":"SUM(C140:I140)","v":133}]
[null,132089000201,24,31,43,null,null,31,null,{"$f":"SUM(C141:I141)","v":129}]
[null,132060000801,30,32,33,33,null,null,null,{"$f":"SUM(C142:I142)","v":128}]
[null,132023000101,null,18,38,null,36,36,null,{"$f":"SUM(C143:I143)","v":128}]
[null,132203000701,null,null,40,45,40,null,null,{"$f":"SUM(C144:I144)","v":125}]
[null,130987012601,null,41,42,null,null,41,null,{"$f":"SUM(C145:I145)","v":124}]
[null,131845003401,28,27,null,null,40,28,null,{"$f":"SUM(C146:I146)","v":123}]
[null,131619005001,null,39,null,null,45,39,null,{"$f":"SUM(C147:I147)","v":123}]
[null,130993012301,null,null,null,40,41,41,null,{"$f":"SUM(C148:I148)","v":122}]
[null,131499008601,null,null,40,null,41,40,null,{"$f":"SUM(C149:I149)","v":121}]
[null,131353007401,null,38,40,null,41,null,null,{"$f":"SUM(C150:I150)","v":119}]
[null,131376017601,32,24,null,35,null,24,null,{"$f":"SUM(C151:I151)","v":115}]
[null,130527009201,null,35,null,40,null,40,null,{"$f":"SUM(C152:I152)","v":115}]
[null,131862001001,null,39,36,null,null,39,null,{"$f":"SUM(C153:I153)","v":114}]
[null,131956005901,43,null,null,33,37,null,null,{"$f":"SUM(C154:I154)","v":113}]
[null,130925008701,null,34,39,37,null,null,null,{"$f":"SUM(C155:I155)","v":110}]
[null,131494002301,null,35,32,null,42,null,null,{"$f":"SUM(C156:I156)","v":109}]
[null,130987025001,null,39,null,30,40,null,null,{"$f":"SUM(C157:I157)","v":109}]
[null,130987026701,null,null,32,37,40,null,null,{"$f":"SUM(C158:I158)","v":109}]
[null,131956006501,null,null,34,39,36,null,null,{"$f":"SUM(C159:I159)","v":109}]
[null,131956006201,null,25,39,null,null,null,44,{"$f":"SUM(C160:I160)","v":108}]
[null,130527011601,39,null,37,null,null,null,31,{"$f":"SUM(C161:I161)","v":107}]
[null,131494003201,null,null,39,29,null,39,null,{"$f":"SUM(C162:I162)","v":107}]
[null,130987016601,null,null,null,38,30,38,null,{"$f":"SUM(C163:I163)","v":106}]
[null,131879001101,null,null,null,29,38,38,null,{"$f":"SUM(C164:I164)","v":105}]
[null,130987028201,42,null,null,31,null,31,null,{"$f":"SUM(C165:I165)","v":104}]
[null,130993015401,42,null,null,null,31,31,null,{"$f":"SUM(C166:I166)","v":104}]
[null,131956005101,34,34,null,null,null,34,null,{"$f":"SUM(C167:I167)","v":102}]
[null,131499010101,37,null,null,31,34,null,null,{"$f":"SUM(C168:I168)","v":102}]
[null,131862005801,null,34,33,null,null,34,null,{"$f":"SUM(C169:I169)","v":101}]
[null,131862001101,29,30,41,null,null,null,null,{"$f":"SUM(C170:I170)","v":100}]
[null,132060002401,35,31,32,null,null,null,null,{"$f":"SUM(C171:I171)","v":98}]
[null,130878015801,null,null,null,null,49,49,null,{"$f":"SUM(C172:I172)","v":98}]
[null,131823008701,null,41,28,null,null,28,null,{"$f":"SUM(C173:I173)","v":97}]
[null,131823004201,null,null,34,29,34,null,null,{"$f":"SUM(C174:I174)","v":97}]
[null,130993013301,null,null,null,47,null,47,null,{"$f":"SUM(C175:I175)","v":94}]
[null,131683002601,null,37,null,56,null,null,null,{"$f":"SUM(C176:I176)","v":93}]
[null,131499011001,null,null,null,42,51,null,null,{"$f":"SUM(C177:I177)","v":93}]
[null,132089000301,31,null,31,30,null,null,null,{"$f":"SUM(C178:I178)","v":92}]
[null,131683006501,null,28,34,30,null,null,null,{"$f":"SUM(C179:I179)","v":92}]
[null,132023002201,null,null,null,49,43,null,null,{"$f":"SUM(C180:I180)","v":92}]
[null,131956006001,50,null,null,null,null,null,39,{"$f":"SUM(C181:I181)","v":89}]
[null,132193000601,null,null,44,null,null,44,null,{"$f":"SUM(C182:I182)","v":88}]
[null,130925010501,null,null,46,41,null,null,null,{"$f":"SUM(C183:I183)","v":87}]
[null,130993015101,18,null,null,43,null,18,null,{"$f":"SUM(C184:I184)","v":79}]
[null,131494002101,null,29,null,25,null,25,null,{"$f":"SUM(C185:I185)","v":79}]
[null,131683005001,null,null,39,null,null,39,null,{"$f":"SUM(C186:I186)","v":78}]
[null,131376018001,38,38,null,null,null,null,null,{"$f":"SUM(C187:I187)","v":76}]
[null,131845000201,null,null,null,18,40,18,null,{"$f":"SUM(C188:I188)","v":76}]
[null,130993013801,null,null,null,null,38,38,null,{"$f":"SUM(C189:I189)","v":76}]
[null,132084000201,null,null,null,null,38,38,null,{"$f":"SUM(C190:I190)","v":76}]
[null,131956000401,33,null,null,null,null,null,41,{"$f":"SUM(C191:I191)","v":74}]
[null,131956005401,null,null,34,null,null,null,40,{"$f":"SUM(C192:I192)","v":74}]
[null,131376015801,36,null,null,37,null,null,null,{"$f":"SUM(C193:I193)","v":73}]
[null,131845001101,41,null,null,null,32,null,null,{"$f":"SUM(C194:I194)","v":73}]
[null,131879000901,null,null,44,null,29,null,null,{"$f":"SUM(C195:I195)","v":73}]
[null,131845000301,36,null,null,null,null,36,null,{"$f":"SUM(C196:I196)","v":72}]
[null,130987028801,36,null,null,null,null,36,null,{"$f":"SUM(C197:I197)","v":72}]
[null,130878013301,null,null,null,36,null,36,null,{"$f":"SUM(C198:I198)","v":72}]
[null,131499010801,null,30,null,41,null,null,null,{"$f":"SUM(C199:I199)","v":71}]
[null,131227008301,null,null,null,37,34,null,null,{"$f":"SUM(C200:I200)","v":71}]
[null,130993016501,null,35,null,null,null,35,null,{"$f":"SUM(C201:I201)","v":70}]
[null,131956005501,null,33,null,null,null,null,37,{"$f":"SUM(C202:I202)","v":70}]
[null,132060002001,43,null,null,null,null,null,26,{"$f":"SUM(C203:I203)","v":69}]
[null,131956000601,null,null,41,null,27,null,null,{"$f":"SUM(C204:I204)","v":68}]
[null,132217000101,null,null,30,37,null,null,null,{"$f":"SUM(C205:I205)","v":67}]
[null,131683007001,null,null,null,null,33,33,null,{"$f":"SUM(C206:I206)","v":66}]
[null,132060001501,35,null,null,27,null,null,null,{"$f":"SUM(C207:I207)","v":62}]
[null,130987029901,null,null,31,null,null,31,null,{"$f":"SUM(C208:I208)","v":62}]
[null,132217000601,null,null,null,null,29,29,null,{"$f":"SUM(C209:I209)","v":58}]
[null,131683008201,null,null,null,null,null,null,57,{"$f":"SUM(C210:I210)","v":57}]
[null,132203000601,null,null,null,null,28,28,null,{"$f":"SUM(C211:I211)","v":56}]
[null,132147001701,null,null,null,27,null,27,null,{"$f":"SUM(C212:I212)","v":54}]
[null,131985003401,null,null,null,null,null,null,54,{"$f":"SUM(C213:I213)","v":54}]
[null,130527019601,null,null,29,null,null,null,24,{"$f":"SUM(C214:I214)","v":53}]
[null,131683003301,null,null,null,53,null,null,null,{"$f":"SUM(C215:I215)","v":53}]
[null,132203001001,null,null,null,18,35,null,null,{"$f":"SUM(C216:I216)","v":53}]
[null,131619004201,18,null,null,null,34,null,null,{"$f":"SUM(C217:I217)","v":52}]
[null,130987030301,null,null,null,26,null,26,null,{"$f":"SUM(C218:I218)","v":52}]
[null,131499010301,null,null,null,null,50,null,null,{"$f":"SUM(C219:I219)","v":50}]
[null,132203000901,null,48,null,null,null,null,null,{"$f":"SUM(C220:I220)","v":48}]
[null,131494003001,null,null,null,null,24,24,null,{"$f":"SUM(C221:I221)","v":48}]
[null,131353002601,null,null,null,null,null,48,null,{"$f":"SUM(C222:I222)","v":48}]
[null,132103000401,null,null,null,null,null,null,47,{"$f":"SUM(C223:I223)","v":47}]
[null,132003002201,null,null,null,null,null,null,47,{"$f":"SUM(C224:I224)","v":47}]
[null,131845000901,null,null,null,null,null,null,45,{"$f":"SUM(C225:I225)","v":45}]
[null,132103000201,null,null,44,null,null,null,null,{"$f":"SUM(C226:I226)","v":44}]
[null,132203001101,null,null,44,null,null,null,null,{"$f":"SUM(C227:I227)","v":44}]
[null,132084004801,null,null,null,null,null,null,44,{"$f":"SUM(C228:I228)","v":44}]
[null,131619005301,null,null,null,null,43,null,null,{"$f":"SUM(C229:I229)","v":43}]
[null,131985003601,null,null,null,null,null,null,43,{"$f":"SUM(C230:I230)","v":43}]
[null,131862001601,null,null,null,null,null,null,43,{"$f":"SUM(C231:I231)","v":43}]
[null,130000021001,null,null,21,null,null,21,null,{"$f":"SUM(C232:I232)","v":42}]
[null,130993016601,null,null,null,42,null,null,null,{"$f":"SUM(C233:I233)","v":42}]
[null,131956006101,null,null,null,null,42,null,null,{"$f":"SUM(C234:I234)","v":42}]
[null,130993010201,null,null,null,41,null,null,null,{"$f":"SUM(C235:I235)","v":41}]
[null,131899000801,null,null,null,null,41,null,null,{"$f":"SUM(C236:I236)","v":41}]
[null,130000015001,null,null,null,null,null,null,41,{"$f":"SUM(C237:I237)","v":41}]
[null,132060002101,null,null,null,null,null,null,41,{"$f":"SUM(C238:I238)","v":41}]
[null,130000020801,40,null,null,null,null,null,null,{"$f":"SUM(C239:I239)","v":40}]
[null,131992000901,null,null,null,null,null,null,40,{"$f":"SUM(C240:I240)","v":40}]
[null,132089000501,null,39,null,null,null,null,null,{"$f":"SUM(C241:I241)","v":39}]
[null,132084005001,null,null,39,null,null,null,null,{"$f":"SUM(C242:I242)","v":39}]
[null,132193001901,null,null,null,null,39,null,null,{"$f":"SUM(C243:I243)","v":39}]
[null,130878015701,null,null,null,null,null,null,39,{"$f":"SUM(C244:I244)","v":39}]
[null,132023001701,null,null,null,null,38,null,null,{"$f":"SUM(C245:I245)","v":38}]
[null,130527012601,null,37,null,null,null,null,null,{"$f":"SUM(C246:I246)","v":37}]
[null,132103000501,null,null,37,null,null,null,null,{"$f":"SUM(C247:I247)","v":37}]
[null,131899003801,null,null,null,null,37,null,null,{"$f":"SUM(C248:I248)","v":37}]
[null,131376000101,null,null,null,null,37,null,null,{"$f":"SUM(C249:I249)","v":37}]
[null,132193000801,null,null,null,null,null,null,37,{"$f":"SUM(C250:I250)","v":37}]
[null,131824000201,null,null,null,null,null,null,37,{"$f":"SUM(C251:I251)","v":37}]
[null,131956005601,null,null,null,null,null,null,37,{"$f":"SUM(C252:I252)","v":37}]
[null,130527006401,36,null,null,null,null,null,null,{"$f":"SUM(C253:I253)","v":36}]
[null,131862001501,null,null,null,null,null,null,36,{"$f":"SUM(C254:I254)","v":36}]
[null,131823002301,null,null,null,null,null,null,36,{"$f":"SUM(C255:I255)","v":36}]
[null,131956004901,null,null,null,null,null,null,36,{"$f":"SUM(C256:I256)","v":36}]
[null,132060001401,null,null,35,null,null,null,null,{"$f":"SUM(C257:I257)","v":35}]
[null,130462009601,null,null,null,null,35,null,null,{"$f":"SUM(C258:I258)","v":35}]
[null,132193000701,null,null,null,null,null,null,35,{"$f":"SUM(C259:I259)","v":35}]
[null,131879001901,null,null,null,34,null,null,null,{"$f":"SUM(C260:I260)","v":34}]
[null,130921006401,null,null,null,34,null,null,null,{"$f":"SUM(C261:I261)","v":34}]
[null,131619004801,null,null,null,null,34,null,null,{"$f":"SUM(C262:I262)","v":34}]
[null,131823009001,null,null,null,null,null,null,34,{"$f":"SUM(C263:I263)","v":34}]
[null,131619002601,null,null,null,null,null,null,34,{"$f":"SUM(C264:I264)","v":34}]
[null,131499010701,null,null,null,null,33,null,null,{"$f":"SUM(C265:I265)","v":33}]
[null,131823007701,null,null,null,null,null,null,33,{"$f":"SUM(C266:I266)","v":33}]
[null,131956005301,null,null,null,null,32,null,null,{"$f":"SUM(C267:I267)","v":32}]
[null,130993014001,null,null,null,null,31,null,null,{"$f":"SUM(C268:I268)","v":31}]
[null,131862003801,null,null,null,null,null,null,31,{"$f":"SUM(C269:I269)","v":31}]
[null,131823007801,30,null,null,null,null,null,null,{"$f":"SUM(C270:I270)","v":30}]
[null,131499010201,null,30,null,null,null,null,null,{"$f":"SUM(C271:I271)","v":30}]
[null,132203000501,null,null,30,null,null,null,null,{"$f":"SUM(C272:I272)","v":30}]
[null,132147000601,null,null,null,null,null,null,30,{"$f":"SUM(C273:I273)","v":30}]
[null,130987023201,null,null,null,null,null,null,30,{"$f":"SUM(C274:I274)","v":30}]
[null,131956004301,null,null,null,null,null,null,29,{"$f":"SUM(C275:I275)","v":29}]
[null,131683007101,null,null,null,null,null,null,29,{"$f":"SUM(C276:I276)","v":29}]
[null,132060003301,28,null,null,null,null,null,null,{"$f":"SUM(C277:I277)","v":28}]
[null,131823008801,null,28,null,null,null,null,null,{"$f":"SUM(C278:I278)","v":28}]
[null,131845003501,null,null,null,null,null,null,28,{"$f":"SUM(C279:I279)","v":28}]
[null,131862001401,null,27,null,null,null,null,null,{"$f":"SUM(C280:I280)","v":27}]
[null,132060002801,null,null,null,null,null,null,26,{"$f":"SUM(C281:I281)","v":26}]

{"sheet":"Classement clubs","index":2,"n_rows":53,"n_cols":14,"rows_kept":53,"cut":false,"hidden":false,"merged":[[2,13,2,19],[4,13,12,19],[14,13,14,19]]}
[]
[null,"N° de club","Nom","Défi-1","Défi-2","Défi-3","Défi-4","Défi-5","Défi-6","Défi-7","Total"]
[1,1683,"Marius Saint-Mitre-les-Remparts",159,128,146,160,159,156,147,{"$f":"SUM(D3:J3)","v":1055},null,null,"Ce classement sera toujours maintenu dans l'ordre décroissant.."]
[2,987,"Cl. Phot’Azur Six-Fours-les-Plages",147,131,137,135,132,147,146,{"$f":"SUM(D4:J4)","v":975}]
[3,1353,"Photo Club de La Crau",138,123,125,151,139,135,135,{"$f":"SUM(D5:J5)","v":946},null,null,"Ce classement a été fait manuellement à partir de l'onglet Défi-1 et de la façon suivante :\n- un premier tri, dans l'ordre croissant, sur le N° de fichier.\n- un second tri pour classer les photos d'un même club dans l'ordre décroissant.\n- Ensuite j'ai fait le total des 3 premières photos.\n- j'ai supprimé les lignes inutiles,pour ne garder qu'une ligne par club.\n- j'ai fait un tris décroissant sur le total.\n- j'ai extrait le N° de club,\n- à partir de ce N° j'ai récupéré le nom du club dans l'onglet \"Liste des clubs\".\n"]
[4,1499,"Images Expressions – Cagnes sur Mer",135,128,144,151,151,126,111,{"$f":"SUM(D6:J6)","v":946}]
[5,527,"Photo Club de Martigues",152,132,131,141,134,119,119,{"$f":"SUM(D7:J7)","v":928}]
[6,1956,"Photo Contact Puyricard",136,138,138,118,124,129,139,{"$f":"SUM(D8:J8)","v":922}]
[7,1879,"Association Sportive de Berre",139,127,148,122,119,147,119,{"$f":"SUM(D9:J9)","v":921}]
[8,1376,"PHOCAL",142,101,145,119,134,146,122,{"$f":"SUM(D10:J10)","v":909}]
[9,878,"PC Antoine Santoru-Port de Bouc",122,101,135,111,147,134,122,{"$f":"SUM(D11:J11)","v":872}]
[10,1823,"Photo Club Mouansois",113,119,131,105,120,133,123,{"$f":"SUM(D12:J12)","v":844}]
[11,1845,"Photo Club Carqueirannais",124,109,132,104,128,114,132,{"$f":"SUM(D13:J13)","v":843}]
[12,2060,"Image Club Gardéen",130,115,122,115,126,117,115,{"$f":"SUM(D14:J14)","v":840}]
[13,925,"A.S.L.P.S. Photo Fos-sur-Mer",143,133,137,124,132,130,null,{"$f":"SUM(D15:J15)","v":799},null,null,"Cette opération est à faire après chaque défi."]
[14,2084,"Azur Photo Passion",null,122,134,138,121,154,111,{"$f":"SUM(D16:J16)","v":780}]
[15,1110,"Ciné Photo Club de Peymeinade",128,110,134,126,121,126,null,{"$f":"SUM(D17:J17)","v":745}]
[16,2086,"Objectif Image Nice",107,104,110,120,106,100,null,{"$f":"SUM(D18:J18)","v":647}]
[17,2193,"Antibes Photo Club",null,108,null,103,118,137,129,{"$f":"SUM(D19:J19)","v":595}]
[18,1862,"Déclic et des Claps – Roquefort les Pins",121,108,121,null,null,118,116,{"$f":"SUM(D20:J20)","v":584}]
[19,1494,"Photo-Club du Brianconnais",null,98,113,89,103,99,null,{"$f":"SUM(D21:J21)","v":502}]
[20,993,"P.C. La Garde – Marseille",null,null,null,132,110,131,null,{"$f":"SUM(D22:J22)","v":373}]
[21,1619,"Optique Diaporama Marseille",104,null,null,null,131,null,124,{"$f":"SUM(D23:J23)","v":359}]
[22,2203,"Club Photo de Saignon",null,null,114,null,103,null,null,{"$f":"SUM(D24:J24)","v":217}]
[23,2089,"La Farledo Objectif Club",91,99,null,null,null,null,null,{"$f":"SUM(D25:J25)","v":190}]
[24,2103,"Club Photo St Laurent du Var",null,null,142,null,null,null,null,{"$f":"SUM(D26:J26)","v":142}]
[25,1824,"Photo Club IBM Cote d’Azur",null,null,null,null,null,141,null,{"$f":"SUM(D27:J27)","v":141}]
[26,2023,"Club Art Déclic de l’ Argens",null,null,null,null,117,null,null,{"$f":"SUM(D28:J28)","v":117}]
[27,1992,"Photo Club Velauxien – Clin d’Œil",null,null,null,null,null,null,97,{"$f":"SUM(D29:J29)","v":97}]
[28,435,"Beausoleil Ciné Photo Club",null,null,null,null,null,null,null,{"$f":"SUM(D30:J30)","v":0}]
[29,462,"Image 2000",null,null,null,null,null,null,null,{"$f":"SUM(D31:J31)","v":0}]
[30,921,"Photo Club M.P.T. Vitrolles",null,null,null,null,null,null,null,{"$f":"SUM(D32:J32)","v":0}]
[31,1227,"Photo Ciné Club Courthezonnais",null,null,null,null,null,null,null,{"$f":"SUM(D33:J33)","v":0}]
[32,1426,"Diaphragme et Lumière Var – Ollioules",null,null,null,null,null,null,null,{"$f":"SUM(D34:J34)","v":0}]
[33,1441,"Club mage Monaco",null,null,null,null,null,null,null,{"$f":"SUM(D35:J35)","v":0}]
[34,1450,"Arc Images- Rousset",null,null,null,null,null,null,null,{"$f":"SUM(D36:J36)","v":0}]
[35,1601,"Club Pugetois de L’image",null,null,null,null,null,null,null,{"$f":"SUM(D37:J37)","v":0}]
[36,1777,"Club Photo et Vidéo Plan de La Tour",null,null,null,null,null,null,null,{"$f":"SUM(D38:J38)","v":0}]
[37,1796,"Ciné Caméra Club de Cannes",null,null,null,null,null,null,null,{"$f":"SUM(D39:J39)","v":0}]
[38,1867,"PhotoMenton",null,null,null,null,null,null,null,{"$f":"SUM(D40:J40)","v":0}]
[39,1899,"Club de l’Image",null,null,null,null,null,null,null,{"$f":"SUM(D41:J41)","v":0}]
[40,1969,"Mission Photo – Cannes la Bocca",null,null,null,null,null,null,null,{"$f":"SUM(D42:J42)","v":0}]
[41,1985,"Rognonas Image Regard Espace",null,null,null,null,null,null,null,{"$f":"SUM(D43:J43)","v":0}]
[42,2003,"Photo Club Moriérois",null,null,null,null,null,null,null,{"$f":"SUM(D44:J44)","v":0}]
[43,2028,"Association Regards du Sud",null,null,null,null,null,null,null,{"$f":"SUM(D45:J45)","v":0}]
[44,2147,"Club Photo Saint Savournin",null,null,null,null,null,null,null,{"$f":"SUM(D46:J46)","v":0}]
[45,2158,"Café Photo Marseille",null,null,null,null,null,null,null,{"$f":"SUM(D47:J47)","v":0}]
[46,2180,"Photo Club Carry Côte Bleue",null,null,null,null,null,null,null,{"$f":"SUM(D48:J48)","v":0}]
[47,2211,"Club Photo UAICF de Gap",null,null,null,null,null,null,null,{"$f":"SUM(D49:J49)","v":0}]
[48,2217,"ADSB – Club Photo Bouc Bel Air",null,null,null,null,null,null,null,{"$f":"SUM(D50:J50)","v":0}]
[49,2222,"Association Culturelle Photo Club de Neffes",null,null,null,null,null,null,null,{"$f":"SUM(D51:J51)","v":0}]
[50]
[80]

{"sheet":"Défi-1","index":3,"n_rows":138,"n_cols":19,"rows_kept":138,"cut":false,"hidden":false,"merged":[[6,18,6,22],[4,18,4,22],[8,18,9,22]]}
["colis","photologic","fichier","titre","note1","note2","note3","note4","note5","total","place","passage","statut","medaille","retenue",null,"0=absent\n1=présent"]
[13,1,131845003401,"Avant la régate         ",9,7,12,0,0,{"$f":"SUM(E2:I2)","v":28},0,31,0,null,0,null,{"$f":"COUNTIF('Classement auteurs'!B:B,C2)","v":1}]
[13,4,130987015701,"Rêve de Mérous       ",14,17,17,0,0,{"$f":"SUM(E3:I3)","v":48},0,109,0,null,0,null,{"$f":"COUNTIF('Classement auteurs'!B:B,C3)","v":1}]
[13,5,131845000801,"Le soleil se lève       ",13,12,11,0,0,36,0,136,0,null,0,null,{"$f":"COUNTIF('Classement auteurs'!B:B,C4)","v":1},null,"ATTENTION :"]
[13,6,131845000101,"Skate Park               ",12,12,18,0,0,42,0,132,0,null,0,null,{"$f":"COUNTIF('Classement auteurs'!B:B,C5)","v":1},null,"Le total des notes est fait sur chaque onglet après insertion."]
[13,7,130987028201,"Water selfie             ",13,14,15,0,0,42,0,117,0,null,0,null,{"$f":"COUNTIF('Classement auteurs'!B:B,C6)","v":1}]
[13,9,130987007401,"Adrien                   ",10,11,10,0,0,31,0,79,0,null,0,null,{"$f":"COUNTIF('Classement auteurs'!B:B,C7)","v":1},null,"L'architecture du fichier notation est toujours la même."]
[13,10,131845000301,"Variation d'ocres        ",9,13,14,0,0,36,0,53,0,null,0,null,{"$f":"COUNTIF('Classement auteurs'!B:B,C8)","v":1}]
[13,12,131683008001,"Transparences            ",19,13,16,0,0,48,0,59,0,null,0,null,{"$f":"COUNTIF('Classement auteurs'!B:B,C9)","v":1},null,"La colonne Q permet de verifier laprésence de l'auteur dans le classement auteur."]
[13,14,131499008701,"Geisha                   ",15,14,15,0,0,44,0,43,0,null,0,null,{"$f":"COUNTIF('Classement auteurs'!B:B,C10)","v":1}]
[13,15,130878013001,"Perle de rose            ",11,15,15,0,0,41,0,83,0,null,0,null,{"$f":"COUNTIF('Classement auteurs'!B:B,C11)","v":1}]
[13,18,130987024101,"L'Andine                 ",12,12,16,0,0,40,0,114,0,null,0,null,{"$f":"COUNTIF('Classement auteurs'!B:B,C12)","v":1}]
[13,19,131992000301,"Le tatoueur de Madurai.  ",12,12,16,0,0,40,0,25,0,null,0,null,{"$f":"COUNTIF('Classement auteurs'!B:B,C13)","v":1}]
[13,20,130993015101,"Criquet vert             ",6,6,6,0,0,18,0,125,0,null,0,null,{"$f":"COUNTIF('Classement auteurs'!B:B,C14)","v":1}]
[13,21,131879000601,"Hong Kong la nuit        ",15,17,15,0,0,47,0,4,0,null,0,null,{"$f":"COUNTIF('Classement auteurs'!B:B,C15)","v":1}]
[13,22,131879000101,"Tangueros                ",12,16,13,0,0,41,0,67,0,null,0,null,{"$f":"COUNTIF('Classement auteurs'!B:B,C16)","v":1}]
[13,24,130987024001,"Dorures d'autonne        ",16,15,15,0,0,46,0,42,0,null,0,null,{"$f":"COUNTIF('Classement auteurs'!B:B,C17)","v":1}]
[13,25,130987013801,"Maréchal-ferrant        ",12,12,14,0,0,38,0,58,0,null,0,null,{"$f":"COUNTIF('Classement auteurs'!B:B,C18)","v":1}]
[13,27,131879000501,"Barques                  ",12,12,14,0,0,38,0,127,0,null,0,null,{"$f":"COUNTIF('Classement auteurs'!B:B,C19)","v":1}]
[13,28,131376012601,"Utopie                   ",11,12,8,0,0,31,0,60,0,null,0,null,{"$f":"COUNTIF('Classement auteurs'!B:B,C20)","v":1}]
[13,29,130987024201,"Planet Caraïbes         ",14,13,19,0,0,46,0,7,0,null,0,null,{"$f":"COUNTIF('Classement auteurs'!B:B,C21)","v":1}]
[13,30,131824003101,"Ice attack               ",12,13,17,0,0,42,0,89,0,null,0,null,{"$f":"COUNTIF('Classement auteurs'!B:B,C22)","v":1}]
[13,31,130987019601,"Fraîcheur               ",12,14,13,0,0,39,0,1,0,null,0,null,{"$f":"COUNTIF('Classement auteurs'!B:B,C23)","v":1}]
[13,32,130987019701,"Sommet                   ",15,16,20,0,0,51,0,54,0,null,0,null,{"$f":"COUNTIF('Classement auteurs'!B:B,C24)","v":1}]
[13,33,130878007201,"Abri multicolore         ",13,8,15,0,0,36,0,57,0,null,0,null,{"$f":"COUNTIF('Classement auteurs'!B:B,C25)","v":1}]
[13,34,132193000301,"Ambiance New York        ",12,18,18,0,0,48,0,69,0,null,0,null,{"$f":"COUNTIF('Classement auteurs'!B:B,C26)","v":1}]
[13,35,131683006301,"Avant l'orage            ",18,19,20,0,0,57,0,93,0,null,0,null,{"$f":"COUNTIF('Classement auteurs'!B:B,C27)","v":1}]
[13,36,132060000101,"Signature artistique     ",6,16,7,0,0,29,0,26,0,null,0,null,{"$f":"COUNTIF('Classement auteurs'!B:B,C28)","v":1}]
[13,37,130987014001,"Le coeur dans les nuages ",14,15,19,0,0,48,0,61,0,null,0,null,{"$f":"COUNTIF('Classement auteurs'!B:B,C29)","v":1}]
[13,38,130878014301,"La souffreuse            ",12,12,14,0,0,38,0,131,0,null,0,null,{"$f":"COUNTIF('Classement auteurs'!B:B,C30)","v":1}]
[13,39,132086002301,"Parade en rose           ",11,13,12,0,0,36,0,29,0,null,0,null,{"$f":"COUNTIF('Classement auteurs'!B:B,C31)","v":1}]
[13,40,132060000701,"Paris La Défense        ",13,11,14,0,0,38,0,73,0,null,0,null,{"$f":"COUNTIF('Classement auteurs'!B:B,C32)","v":1}]
[13,41,131376018301,"Rêve d'Orient           ",12,9,10,0,0,31,0,111,0,null,0,null,{"$f":"COUNTIF('Classement auteurs'!B:B,C33)","v":1}]
[13,42,130987028801,"Feu Art                  ",11,10,15,0,0,36,0,113,0,null,0,null,{"$f":"COUNTIF('Classement auteurs'!B:B,C34)","v":1}]
[13,43,131683000701,"SAYONARA                 ",10,11,11,0,0,32,0,2,0,null,0,null,{"$f":"COUNTIF('Classement auteurs'!B:B,C35)","v":1}]
[13,44,131376014701,"Enfant sous la pluie     ",14,13,16,0,0,43,0,75,0,null,0,null,{"$f":"COUNTIF('Classement auteurs'!B:B,C36)","v":1}]
[13,45,131824001901,"Juste une éclaircie     ",20,14,18,0,0,52,0,126,0,null,0,null,{"$f":"COUNTIF('Classement auteurs'!B:B,C37)","v":1}]
[13,46,131956005101,"Litter Litter            ",9,8,17,0,0,34,0,15,0,null,0,null,{"$f":"COUNTIF('Classement auteurs'!B:B,C38)","v":1}]
[13,47,131353000201,"Fleur                    ",9,11,13,0,0,33,0,41,0,null,0,null,{"$f":"COUNTIF('Classement auteurs'!B:B,C39)","v":1}]
[13,48,130000019901,"La vie en rose           ",10,10,12,0,0,32,0,99,6,null,0,null,{"$f":"COUNTIF('Classement auteurs'!B:B,C40)","v":1}]
[13,50,132084001701,"Champs d'ail             ",11,18,16,0,0,45,0,129,0,null,0,null,{"$f":"COUNTIF('Classement auteurs'!B:B,C41)","v":1}]
[13,51,132060002201,"Collégiennes à Londres ",14,11,16,0,0,41,0,88,0,null,0,null,{"$f":"COUNTIF('Classement auteurs'!B:B,C42)","v":1}]
[13,53,130878014101,"Tag                      ",12,14,10,0,0,36,0,92,0,null,0,null,{"$f":"COUNTIF('Classement auteurs'!B:B,C43)","v":1}]
[13,55,131499010101,"Tout l'océan est à eux ",8,10,19,0,0,37,0,108,0,null,0,null,{"$f":"COUNTIF('Classement auteurs'!B:B,C44)","v":1}]
[13,56,131499005201,"Rèverie                 ",13,16,15,0,0,44,0,39,0,null,0,null,{"$f":"COUNTIF('Classement auteurs'!B:B,C45)","v":1}]
[13,57,130925010201,"Mae                      ",12,15,19,0,0,46,0,91,0,null,0,null,{"$f":"COUNTIF('Classement auteurs'!B:B,C46)","v":1}]
[13,58,130987028401,"Marée verte             ",6,12,14,0,0,32,0,22,0,null,0,null,{"$f":"COUNTIF('Classement auteurs'!B:B,C47)","v":1}]
[13,59,132193000401,"Multicolore              ",12,14,15,0,0,41,0,82,0,null,0,null,{"$f":"COUNTIF('Classement auteurs'!B:B,C48)","v":1}]
[13,60,130527011601,"Repos                    ",11,14,14,0,0,39,0,55,0,null,0,null,{"$f":"COUNTIF('Classement auteurs'!B:B,C49)","v":1}]
[13,61,131845004101,"Clair et foncé          ",7,13,9,0,0,29,0,38,0,null,0,null,{"$f":"COUNTIF('Classement auteurs'!B:B,C50)","v":1}]
[13,62,130993015401,"J'étais la plus belle   ",13,15,14,0,0,42,0,33,0,null,0,null,{"$f":"COUNTIF('Classement auteurs'!B:B,C51)","v":1}]
[13,63,131353003001,"Pas facile               ",17,11,17,0,0,45,0,105,0,null,0,null,{"$f":"COUNTIF('Classement auteurs'!B:B,C52)","v":1}]
[13,64,131353007101,"Street art               ",11,13,13,0,0,37,0,116,0,null,0,null,{"$f":"COUNTIF('Classement auteurs'!B:B,C53)","v":1}]
[13,65,132089000101,"Les Cinq Terres          ",11,13,12,0,0,36,0,94,0,null,0,null,{"$f":"COUNTIF('Classement auteurs'!B:B,C54)","v":1}]
[13,66,131376017701,"Dragster                 ",17,16,18,0,0,51,0,20,0,null,0,null,{"$f":"COUNTIF('Classement auteurs'!B:B,C55)","v":1}]
[13,67,131879000801,"La fille au chapeau      ",17,16,17,0,0,50,0,115,0,null,0,null,{"$f":"COUNTIF('Classement auteurs'!B:B,C56)","v":1}]
[13,68,131499010401,"En course                ",11,12,14,0,0,37,0,56,0,null,0,null,{"$f":"COUNTIF('Classement auteurs'!B:B,C57)","v":1}]
[13,69,131823004901,"Flamenco à Gorbio       ",16,14,14,0,0,44,0,64,0,null,0,null,{"$f":"COUNTIF('Classement auteurs'!B:B,C58)","v":1}]
[13,70,131956004501,"Paganello                ",13,14,11,0,0,38,0,3,0,null,0,null,{"$f":"COUNTIF('Classement auteurs'!B:B,C59)","v":1}]
[13,71,131956003401,"Feerie                   ",11,15,11,0,0,37,0,68,0,null,0,null,{"$f":"COUNTIF('Classement auteurs'!B:B,C60)","v":1}]
[13,72,131683007901,"Regard perçant          ",18,16,20,0,0,54,0,70,0,null,0,null,{"$f":"COUNTIF('Classement auteurs'!B:B,C61)","v":1}]
[13,73,131110000901,"Dune                     ",16,17,18,0,0,51,0,130,0,null,0,null,{"$f":"COUNTIF('Classement auteurs'!B:B,C62)","v":1}]
[13,74,132086001401,"TEMPS DE PAUSE           ",10,12,11,0,0,33,0,121,0,null,0,null,{"$f":"COUNTIF('Classement auteurs'!B:B,C63)","v":1}]
[13,75,131499003901,"Ablution                 ",15,14,13,0,0,42,0,107,0,null,0,null,{"$f":"COUNTIF('Classement auteurs'!B:B,C64)","v":1}]
[13,76,132060001701,"Luminaires               ",11,14,12,0,0,37,0,101,0,null,0,null,{"$f":"COUNTIF('Classement auteurs'!B:B,C65)","v":1}]
[13,77,132103002301,"Couleurs du Japon        ",12,16,18,0,0,46,0,17,0,null,0,null,{"$f":"COUNTIF('Classement auteurs'!B:B,C66)","v":1}]
[13,78,132089000201,"CD en MACRO              ",7,8,9,0,0,{"$f":"SUM(E67:I67)","v":24},0,23,0,null,0,null,{"$f":"COUNTIF('Classement auteurs'!B:B,C67)","v":1}]
[13,79,131862002201,"Automne                  ",15,13,13,0,0,41,0,135,0,null,0,null,{"$f":"COUNTIF('Classement auteurs'!B:B,C68)","v":1}]
[13,81,131956000401,"Gourmandise              ",12,9,12,0,0,33,0,112,0,null,0,null,{"$f":"COUNTIF('Classement auteurs'!B:B,C69)","v":1}]
[13,82,130527012401,"Mistral                  ",12,12,17,0,0,41,0,12,0,null,0,null,{"$f":"COUNTIF('Classement auteurs'!B:B,C70)","v":1}]
[13,83,131683005101,"La Crau un autre désert ",9,12,15,0,0,36,0,84,0,null,0,null,{"$f":"COUNTIF('Classement auteurs'!B:B,C71)","v":1}]
[13,84,131956006001,"Light under the milky way",16,17,17,0,0,50,0,104,0,null,0,null,{"$f":"COUNTIF('Classement auteurs'!B:B,C72)","v":1}]
[13,85,132060002001,"Bleu, blanc, rouge       ",12,15,16,0,0,43,0,137,0,null,0,null,{"$f":"COUNTIF('Classement auteurs'!B:B,C73)","v":1}]
[13,86,130000020401,"Je t'ai à l'oeil        ",8,11,12,0,0,31,0,13,6,null,0,null,{"$f":"COUNTIF('Classement auteurs'!B:B,C74)","v":1}]
[13,88,131619004201,"DEMOISELLE               ",6,6,6,0,0,18,0,86,0,null,0,null,{"$f":"COUNTIF('Classement auteurs'!B:B,C75)","v":1}]
[13,89,130527013301,"Rue de Cuba              ",13,14,20,0,0,47,0,97,0,null,0,null,{"$f":"COUNTIF('Classement auteurs'!B:B,C76)","v":1}]
[13,90,130527006401,"Bleu, blanc, noir        ",6,16,14,0,0,36,0,71,0,null,0,null,{"$f":"COUNTIF('Classement auteurs'!B:B,C77)","v":1}]
[13,91,131879001301,"Le chat                  ",12,15,15,0,0,42,0,118,0,null,0,null,{"$f":"COUNTIF('Classement auteurs'!B:B,C78)","v":1}]
[13,92,132060002401,"Orchidées incandescents ",7,14,14,0,0,35,0,51,0,null,0,null,{"$f":"COUNTIF('Classement auteurs'!B:B,C79)","v":1}]
[13,93,130527002501,"Parapluies               ",14,15,12,0,0,41,0,63,0,null,0,null,{"$f":"COUNTIF('Classement auteurs'!B:B,C80)","v":1}]
[13,94,132060000901,"Face au mur              ",13,9,13,0,0,35,0,30,0,null,0,null,{"$f":"COUNTIF('Classement auteurs'!B:B,C81)","v":1}]
[13,95,132060001801,"No limit                 ",10,13,15,0,0,38,0,74,0,null,0,null,{"$f":"COUNTIF('Classement auteurs'!B:B,C82)","v":1}]
[13,96,131499010501,"Au musée                ",9,13,13,0,0,35,0,95,0,null,0,null,{"$f":"COUNTIF('Classement auteurs'!B:B,C83)","v":1}]
[13,97,131499010601,"Petits navires ...       ",14,15,17,0,0,46,0,47,0,null,0,null,{"$f":"COUNTIF('Classement auteurs'!B:B,C84)","v":1}]
[13,98,131862001101,"Le guitariste            ",10,9,10,0,0,29,0,72,0,null,0,null,{"$f":"COUNTIF('Classement auteurs'!B:B,C85)","v":1}]
[13,99,130987023901,"Street Painting          ",10,15,15,0,0,40,0,27,0,null,0,null,{"$f":"COUNTIF('Classement auteurs'!B:B,C86)","v":1}]
[13,100,131499010001,"Une jolie voix de Cassel ",11,15,16,0,0,42,0,100,0,null,0,null,{"$f":"COUNTIF('Classement auteurs'!B:B,C87)","v":1}]
[13,101,130925008401,"Chorégraphie            ",16,16,19,0,0,51,0,76,0,null,0,null,{"$f":"COUNTIF('Classement auteurs'!B:B,C88)","v":1}]
[13,102,131499009801,"Mystère                 ",10,15,17,0,0,42,0,10,0,null,0,null,{"$f":"COUNTIF('Classement auteurs'!B:B,C89)","v":1}]
[13,104,130527015501,"Roses                    ",14,19,13,0,0,46,0,32,0,null,0,null,{"$f":"COUNTIF('Classement auteurs'!B:B,C90)","v":1}]
[13,105,132060001501,"Profitons vite           ",9,12,14,0,0,35,0,96,0,null,0,null,{"$f":"COUNTIF('Classement auteurs'!B:B,C91)","v":1}]
[13,106,130925008601,"Rouge                    ",13,7,13,0,0,33,0,66,0,null,0,null,{"$f":"COUNTIF('Classement auteurs'!B:B,C92)","v":1}]
[13,107,131353004301,"Vert et rouge            ",6,6,6,0,0,18,0,90,0,null,0,null,{"$f":"COUNTIF('Classement auteurs'!B:B,C93)","v":1}]
[13,108,131376011801,"BAMBINS HIMBAS           ",14,16,18,0,0,48,0,85,7,null,0,null,{"$f":"COUNTIF('Classement auteurs'!B:B,C94)","v":1}]
[13,109,131619004601,"Balle au nez             ",9,12,14,0,0,35,0,44,0,null,0,null,{"$f":"COUNTIF('Classement auteurs'!B:B,C95)","v":1}]
[13,110,130000020801,"Un soir sur la Saône    ",13,13,14,0,0,40,0,34,6,null,0,null,{"$f":"COUNTIF('Classement auteurs'!B:B,C96)","v":1}]
[13,111,131110001101,"Lotus au petit matin     ",11,12,13,0,0,36,0,134,0,null,0,null,{"$f":"COUNTIF('Classement auteurs'!B:B,C97)","v":1}]
[13,113,131494000201,"Vélo d'enfer            ",13,10,16,0,0,39,0,78,0,null,0,null,{"$f":"COUNTIF('Classement auteurs'!B:B,C98)","v":1}]
[13,114,131499009301,"Lights                   ",8,14,7,0,0,29,0,80,0,null,0,null,{"$f":"COUNTIF('Classement auteurs'!B:B,C99)","v":1}]
[13,115,131823007801,"Eucalyptus               ",8,10,12,0,0,30,0,11,0,null,0,null,{"$f":"COUNTIF('Classement auteurs'!B:B,C100)","v":1}]
[13,116,131845002501,"Avenue de Tayac          ",7,13,10,0,0,30,0,98,0,null,0,null,{"$f":"COUNTIF('Classement auteurs'!B:B,C101)","v":1}]
[13,117,131499006801,"Reflets sur St Honorat   ",13,8,14,0,0,35,0,45,0,null,0,null,{"$f":"COUNTIF('Classement auteurs'!B:B,C102)","v":1}]
[13,118,131845001401,"Seul au monde            ",11,13,17,0,0,41,0,19,0,null,0,null,{"$f":"COUNTIF('Classement auteurs'!B:B,C103)","v":1}]
[13,119,130878015201,"Magie des lumières      ",13,14,16,0,0,43,0,122,0,null,0,null,{"$f":"COUNTIF('Classement auteurs'!B:B,C104)","v":1}]
[13,120,131823005701,"Cannes régates royales  ",10,11,15,0,0,36,0,124,0,null,0,null,{"$f":"COUNTIF('Classement auteurs'!B:B,C105)","v":1}]
[13,121,132060003301,"Floraison                ",7,11,10,0,0,28,0,128,7,null,0,null,{"$f":"COUNTIF('Classement auteurs'!B:B,C106)","v":1}]
[13,122,131845004001,"Le cheval de cirque      ",7,16,17,0,0,40,0,103,0,null,0,null,{"$f":"COUNTIF('Classement auteurs'!B:B,C107)","v":1}]
[13,123,130925007701,"Arbres pétrifiés       ",15,13,18,0,0,46,0,37,0,null,0,null,{"$f":"COUNTIF('Classement auteurs'!B:B,C108)","v":1}]
[13,124,131376017601,"Au fond de mon verre     ",11,9,12,0,0,32,0,120,0,null,0,null,{"$f":"COUNTIF('Classement auteurs'!B:B,C109)","v":1}]
[13,126,131683006601,"La fillette et sa glace  ",13,11,16,0,0,40,0,21,0,null,0,null,{"$f":"COUNTIF('Classement auteurs'!B:B,C110)","v":1}]
[13,127,131862000801,"Bleu de nice             ",15,17,19,0,0,51,0,8,0,null,0,null,{"$f":"COUNTIF('Classement auteurs'!B:B,C111)","v":1}]
[13,128,132089000301,"Festirun                 ",10,10,11,0,0,31,0,40,0,null,0,null,{"$f":"COUNTIF('Classement auteurs'!B:B,C112)","v":1}]
[13,129,131499003601,"Casquettes               ",9,10,15,0,0,34,0,102,0,null,0,null,{"$f":"COUNTIF('Classement auteurs'!B:B,C113)","v":1}]
[13,130,130925009801,"Vite !                   ",14,14,16,0,0,44,0,18,0,null,0,null,{"$f":"COUNTIF('Classement auteurs'!B:B,C114)","v":1}]
[13,131,131499008201,"Champ jaune et vert      ",12,17,16,0,0,45,0,35,0,null,0,null,{"$f":"COUNTIF('Classement auteurs'!B:B,C115)","v":1}]
[13,132,131376018001,"DemonstrationTimesSquare ",11,13,14,0,0,38,0,9,0,null,0,null,{"$f":"COUNTIF('Classement auteurs'!B:B,C116)","v":1}]
[13,134,131110001001,"Transhumance             ",13,14,14,0,0,41,0,77,0,null,0,null,{"$f":"COUNTIF('Classement auteurs'!B:B,C117)","v":1}]
[13,136,131376015801,"Quiétude                ",13,12,11,0,0,36,0,49,0,null,0,null,{"$f":"COUNTIF('Classement auteurs'!B:B,C118)","v":1}]
[13,137,131619004501,"Foncouverte              ",19,14,18,0,0,51,0,133,0,null,0,null,{"$f":"COUNTIF('Classement auteurs'!B:B,C119)","v":1}]
[13,138,131956005901,"Couleurs de Montréal    ",10,15,18,0,0,43,0,52,0,null,0,null,{"$f":"COUNTIF('Classement auteurs'!B:B,C120)","v":1}]
[13,139,132060000401,"Butineuse au travail     ",6,6,6,0,0,18,0,65,0,null,0,null,{"$f":"COUNTIF('Classement auteurs'!B:B,C121)","v":1}]
[13,140,131499006901,"Florence                 ",10,16,16,0,0,42,0,81,0,null,0,null,{"$f":"COUNTIF('Classement auteurs'!B:B,C122)","v":1}]
[13,141,132086002601,"Fluidité arborescente   ",8,15,9,0,0,32,0,48,0,null,0,null,{"$f":"COUNTIF('Classement auteurs'!B:B,C123)","v":1}]
[13,142,132060000801,"Entre ciel et terre      ",7,10,13,0,0,30,0,14,0,null,0,null,{"$f":"COUNTIF('Classement auteurs'!B:B,C124)","v":1}]
[13,143,131823007601,"Orange Grassoise         ",8,11,14,0,0,33,0,46,0,null,0,null,{"$f":"COUNTIF('Classement auteurs'!B:B,C125)","v":1}]
[13,144,130527017001,"Les mots envolés.       ",20,15,20,0,0,55,0,6,0,null,0,null,{"$f":"COUNTIF('Classement auteurs'!B:B,C126)","v":1}]
[13,146,132086002501,"Retour du marché        ",8,13,17,0,0,38,0,123,0,null,0,null,{"$f":"COUNTIF('Classement auteurs'!B:B,C127)","v":1}]
[13,148,131845002101,"Abandon                  ",9,13,16,0,0,38,0,87,0,null,0,null,{"$f":"COUNTIF('Classement auteurs'!B:B,C128)","v":1}]
[13,149,131845001101,"...vers la culture       ",14,13,14,0,0,41,0,28,0,null,0,null,{"$f":"COUNTIF('Classement auteurs'!B:B,C129)","v":1}]
[13,150,130527009401,"Chez l'artiste ...       ",16,18,16,0,0,50,0,50,0,null,0,null,{"$f":"COUNTIF('Classement auteurs'!B:B,C130)","v":1}]
[13,151,131956002401,"Chut Silence             ",8,11,9,0,0,{"$f":"SUM(E131:I131)","v":28},0,16,0,null,0,null,{"$f":"COUNTIF('Classement auteurs'!B:B,C131)","v":1}]
[13,152,131956002901,"Rouge salant             ",14,14,15,0,0,43,0,5,0,null,0,null,{"$f":"COUNTIF('Classement auteurs'!B:B,C132)","v":1}]
[13,153,130925009901,"Belles coiffes           ",10,9,11,0,0,30,0,119,0,null,0,null,{"$f":"COUNTIF('Classement auteurs'!B:B,C133)","v":1}]
[13,154,132060001201,"Atomes                   ",15,16,15,0,0,46,0,36,0,null,0,null,{"$f":"COUNTIF('Classement auteurs'!B:B,C134)","v":1}]
[13,155,130987001601,"Envol                    ",11,11,13,0,0,35,0,106,0,null,0,null,{"$f":"COUNTIF('Classement auteurs'!B:B,C135)","v":1}]
[13,156,131956005701,"Solitudes                ",11,12,13,0,0,36,0,62,0,null,0,null,{"$f":"COUNTIF('Classement auteurs'!B:B,C136)","v":1}]
[13,158,131353000701,"Cellulose du Rhône      ",14,20,14,0,0,48,0,24,0,null,0,null,{"$f":"COUNTIF('Classement auteurs'!B:B,C137)","v":1}]
[13,159,131353000101,"Ambiance automnale       ",14,14,17,0,0,45,0,110,0,null,0,null,{"$f":"COUNTIF('Classement auteurs'!B:B,C138)","v":1}]

{"sheet":"Défi-2","index":4,"n_rows":146,"n_cols":17,"rows_kept":146,"cut":false,"hidden":false,"merged":[]}
["colis","photologic","fichier","titre","note1","note2","note3","note4","note5","total","place","passage","statut","medaille","retenue",null,"0=absent\n1=présent"]
[13,1,131499010201,"Edsel 1958 Cuba          ",12,10,8,0,0,{"$f":"SUM(E2:I2)","v":30},0,132,0,null,0,null,{"$f":"COUNTIF('Classement auteurs'!B:B,C2)","v":1}]
[13,2,131862001101,"Le V                     ",11,10,9,0,0,{"$f":"SUM(E3:I3)","v":30},0,57,0,null,0,null,{"$f":"COUNTIF('Classement auteurs'!B:B,C3)","v":1}]
[13,4,131683000701,"L'ARBRE DE VIE           ",12,10,8,0,0,30,0,35,0,null,0,null,{"$f":"COUNTIF('Classement auteurs'!B:B,C4)","v":1}]
[13,5,132193000301,"Peuple Uros lac Titicaca ",12,12,13,0,0,37,0,101,7,null,0,null,{"$f":"COUNTIF('Classement auteurs'!B:B,C5)","v":1}]
[13,6,130987024201,"La nuit des Sans         ",15,12,16,0,0,43,0,141,0,null,0,null,{"$f":"COUNTIF('Classement auteurs'!B:B,C6)","v":1}]
[13,7,130987024101,"Ado Himba                ",12,12,15,0,0,39,0,87,0,null,0,null,{"$f":"COUNTIF('Classement auteurs'!B:B,C7)","v":1}]
[13,8,132203000901,"Femme Ousbèque          ",14,16,18,0,0,48,0,5,0,null,0,null,{"$f":"COUNTIF('Classement auteurs'!B:B,C8)","v":1}]
[13,9,131879000101,"Fille Akha               ",14,10,17,0,0,41,0,95,0,null,0,null,{"$f":"COUNTIF('Classement auteurs'!B:B,C9)","v":1}]
[13,10,131376018301,"Holi                     ",11,11,12,0,0,34,0,38,0,null,0,null,{"$f":"COUNTIF('Classement auteurs'!B:B,C10)","v":1}]
[13,11,131992000301,"Famille Tamoul.          ",11,10,12,0,0,33,0,91,0,null,0,null,{"$f":"COUNTIF('Classement auteurs'!B:B,C11)","v":1}]
[13,12,131683007601,"Don sacré               ",13,14,15,0,0,42,0,13,0,null,0,null,{"$f":"COUNTIF('Classement auteurs'!B:B,C12)","v":1}]
[13,13,130527013301,"New york 1               ",13,11,15,0,0,39,0,18,0,null,0,null,{"$f":"COUNTIF('Classement auteurs'!B:B,C13)","v":1}]
[13,14,131823004901,"Pas de doute             ",11,6,8,0,0,25,0,74,0,null,0,null,{"$f":"COUNTIF('Classement auteurs'!B:B,C14)","v":1}]
[13,15,131494002101,"Retour à la bergerie    ",11,9,9,0,0,29,0,1,0,null,0,null,{"$f":"COUNTIF('Classement auteurs'!B:B,C15)","v":1}]
[13,17,130925010201,"Tempête sur l'Angleterre",11,11,8,0,0,30,0,82,0,null,0,null,{"$f":"COUNTIF('Classement auteurs'!B:B,C16)","v":1}]
[13,18,130987024001,"Tre Cime                 ",13,12,19,0,0,44,0,129,0,null,0,null,{"$f":"COUNTIF('Classement auteurs'!B:B,C17)","v":1}]
[13,19,131110001001,"étudiant birman         ",12,11,18,0,0,41,0,86,0,null,0,null,{"$f":"COUNTIF('Classement auteurs'!B:B,C18)","v":1}]
[13,20,131376012601,"Festival des cultures    ",12,9,8,0,0,29,0,17,0,null,0,null,{"$f":"COUNTIF('Classement auteurs'!B:B,C19)","v":1}]
[13,21,131683008001,"Les tanneurs de Fes      ",12,16,19,0,0,47,0,135,0,null,0,null,{"$f":"COUNTIF('Classement auteurs'!B:B,C20)","v":1}]
[13,22,130987028401,"Pêche traditionnelle    ",13,13,12,0,0,38,0,133,0,null,0,null,{"$f":"COUNTIF('Classement auteurs'!B:B,C21)","v":1}]
[13,23,131353000201,"Arc en ciel              ",13,13,11,0,0,37,0,84,0,null,0,null,{"$f":"COUNTIF('Classement auteurs'!B:B,C22)","v":1}]
[13,24,131879001301,"Inde                     ",11,12,7,0,0,30,0,36,0,null,0,null,{"$f":"COUNTIF('Classement auteurs'!B:B,C23)","v":1}]
[13,25,131499008701,"Si vaste et si fragile...",10,7,12,0,0,29,0,112,0,null,0,null,{"$f":"COUNTIF('Classement auteurs'!B:B,C24)","v":1}]
[13,27,132084004001,"La vache et le soldat    ",12,10,18,0,0,40,0,106,0,null,0,null,{"$f":"COUNTIF('Classement auteurs'!B:B,C25)","v":1}]
[13,28,131823008801,"Mais pourquoi ?          ",11,8,9,0,0,28,0,61,0,null,0,null,{"$f":"COUNTIF('Classement auteurs'!B:B,C26)","v":1}]
[13,29,130987019701,"Venezia                  ",13,11,16,0,0,40,0,69,0,null,0,null,{"$f":"COUNTIF('Classement auteurs'!B:B,C27)","v":1}]
[13,30,130987019601,"Padaung Karen            ",12,10,15,0,0,37,0,40,0,null,0,null,{"$f":"COUNTIF('Classement auteurs'!B:B,C28)","v":1}]
[13,31,131845004101,"Regard réprobateur      ",11,8,15,0,0,34,0,24,0,null,0,null,{"$f":"COUNTIF('Classement auteurs'!B:B,C29)","v":1}]
[13,32,131992000401,"Regard envoutant         ",13,10,16,0,0,39,0,21,0,null,0,null,{"$f":"COUNTIF('Classement auteurs'!B:B,C30)","v":1}]
[13,33,131879002001,"La faiseuse de briques   ",14,13,20,0,0,47,0,26,0,null,0,null,{"$f":"COUNTIF('Classement auteurs'!B:B,C31)","v":1}]
[13,35,131353004301,"Mucem 2016               ",11,7,10,0,0,28,0,32,0,null,0,null,{"$f":"COUNTIF('Classement auteurs'!B:B,C32)","v":1}]
[13,36,130987007401,"Florence                 ",11,13,8,0,0,32,0,105,0,null,0,null,{"$f":"COUNTIF('Classement auteurs'!B:B,C33)","v":1}]
[13,37,131956005101,"L'Égypte à Madrid      ",12,11,11,0,0,34,0,16,0,null,0,null,{"$f":"COUNTIF('Classement auteurs'!B:B,C34)","v":1}]
[13,38,130987014001,"Sourire de Bahia         ",12,10,15,0,0,37,0,47,0,null,0,null,{"$f":"COUNTIF('Classement auteurs'!B:B,C35)","v":1}]
[13,39,132084001701,"Venise                   ",12,11,13,0,0,36,0,73,0,null,0,null,{"$f":"COUNTIF('Classement auteurs'!B:B,C36)","v":1}]
[13,40,132086001401,"Il neige sur Venise      ",13,13,15,0,0,41,0,102,0,null,0,null,{"$f":"COUNTIF('Classement auteurs'!B:B,C37)","v":1}]
[13,41,131823008301,"Afrique                  ",12,10,18,0,0,40,0,92,0,null,0,null,{"$f":"COUNTIF('Classement auteurs'!B:B,C38)","v":1}]
[13,42,131824003101,"Croisement de regard     ",11,13,9,0,0,33,0,131,0,null,0,null,{"$f":"COUNTIF('Classement auteurs'!B:B,C39)","v":1}]
[13,43,131499010001,"Dans la cour de l'école ",13,15,14,0,0,42,0,44,0,null,0,null,{"$f":"COUNTIF('Classement auteurs'!B:B,C40)","v":1}]
[13,44,132023000101,"Mésange à la lune      ",6,6,6,0,0,18,0,55,0,null,0,null,{"$f":"COUNTIF('Classement auteurs'!B:B,C41)","v":1}]
[13,45,131499005201,"Pizzaiolo                ",11,7,13,0,0,31,0,46,0,null,0,null,{"$f":"COUNTIF('Classement auteurs'!B:B,C42)","v":1}]
[13,46,131376017601,"Les touristes            ",9,6,9,0,0,24,0,64,0,null,0,null,{"$f":"COUNTIF('Classement auteurs'!B:B,C43)","v":1}]
[13,47,131683006301,"Regards indiens          ",12,15,9,0,0,36,0,127,0,null,0,null,{"$f":"COUNTIF('Classement auteurs'!B:B,C44)","v":1}]
[13,48,131824001901,"Auprès de mon arbre.... ",13,9,18,0,0,40,0,62,0,null,0,null,{"$f":"COUNTIF('Classement auteurs'!B:B,C45)","v":1}]
[13,49,130925009801,"Shanghai                 ",12,10,14,0,0,36,0,11,0,null,0,null,{"$f":"COUNTIF('Classement auteurs'!B:B,C46)","v":1}]
[13,50,130000020401,"Khiva - La Roue          ",13,11,13,0,0,37,0,123,6,null,0,null,{"$f":"COUNTIF('Classement auteurs'!B:B,C47)","v":1}]
[13,51,132193000501,"Guerrier irlandais       ",11,7,7,0,0,25,0,41,7,null,0,null,{"$f":"COUNTIF('Classement auteurs'!B:B,C48)","v":1}]
[13,52,131956003401,"Regard de la foret       ",11,6,7,0,0,24,0,56,0,null,0,null,{"$f":"COUNTIF('Classement auteurs'!B:B,C49)","v":1}]
[13,53,132086002501,"Le Chianti moderne       ",14,7,11,0,0,32,0,29,0,null,0,null,{"$f":"COUNTIF('Classement auteurs'!B:B,C50)","v":1}]
[13,54,131683005101,"Clarisse                 ",15,6,12,0,0,33,0,126,0,null,0,null,{"$f":"COUNTIF('Classement auteurs'!B:B,C51)","v":1}]
[13,55,130987012601,"Taxi à Tokyo.           ",12,12,17,0,0,41,0,136,0,null,0,null,{"$f":"COUNTIF('Classement auteurs'!B:B,C52)","v":1}]
[13,56,130993016501,"Reflet_Asie              ",13,12,10,0,0,35,0,31,0,null,0,null,{"$f":"COUNTIF('Classement auteurs'!B:B,C53)","v":1}]
[13,57,131862001001,"Petite Vietnamienne      ",12,12,15,0,0,39,0,139,0,null,0,null,{"$f":"COUNTIF('Classement auteurs'!B:B,C54)","v":1}]
[13,58,132084003501,"Coiffes Himbas           ",14,12,17,0,0,43,0,34,0,null,0,null,{"$f":"COUNTIF('Classement auteurs'!B:B,C55)","v":1}]
[13,59,132084003601,"Kaokoland airport        ",11,12,10,0,0,33,0,98,0,null,0,null,{"$f":"COUNTIF('Classement auteurs'!B:B,C56)","v":1}]
[13,60,131353007301,"LAGUNA COLORADA BOLIVIE  ",14,11,15,0,0,40,0,37,0,null,0,null,{"$f":"COUNTIF('Classement auteurs'!B:B,C57)","v":1}]
[13,61,130878014301,"L’œil de la terre     ",10,6,7,0,0,23,0,7,0,null,0,null,{"$f":"COUNTIF('Classement auteurs'!B:B,C58)","v":1}]
[13,62,131353003001,"Regard de l'inconnue     ",12,6,12,0,0,30,0,48,0,null,0,null,{"$f":"COUNTIF('Classement auteurs'!B:B,C59)","v":1}]
[13,63,130878014101,"Orientation              ",11,7,19,0,0,37,0,76,0,null,0,null,{"$f":"COUNTIF('Classement auteurs'!B:B,C60)","v":1}]
[13,64,131619005001,"Regard sur le haut atlas ",11,15,13,0,0,39,0,77,0,null,0,null,{"$f":"COUNTIF('Classement auteurs'!B:B,C61)","v":1}]
[13,65,131879000501,"Tromso                   ",14,14,11,0,0,39,0,142,0,null,0,null,{"$f":"COUNTIF('Classement auteurs'!B:B,C62)","v":1}]
[13,66,131956002601,"Berlin                   ",14,14,16,0,0,44,0,68,0,null,0,null,{"$f":"COUNTIF('Classement auteurs'!B:B,C63)","v":1}]
[13,67,131823008701,"école en Sulawesi       ",12,13,16,0,0,41,0,97,0,null,0,null,{"$f":"COUNTIF('Classement auteurs'!B:B,C64)","v":1}]
[13,68,130925008601,"Amerique                 ",13,7,16,0,0,36,0,85,0,null,0,null,{"$f":"COUNTIF('Classement auteurs'!B:B,C65)","v":1}]
[13,69,130878013601,"L'enfant et le torri     ",12,9,13,0,0,34,0,72,0,null,0,null,{"$f":"COUNTIF('Classement auteurs'!B:B,C66)","v":1}]
[13,70,131845004001,"VIETAMIENNE              ",11,9,13,0,0,{"$f":"SUM(E67:I67)","v":33},0,66,0,null,0,null,{"$f":"COUNTIF('Classement auteurs'!B:B,C67)","v":1}]
[13,71,130925007601,"Famille Himba            ",14,13,17,0,0,44,0,45,0,null,0,null,{"$f":"COUNTIF('Classement auteurs'!B:B,C68)","v":1}]
[13,72,130925007701,"Regards d'enfants        ",14,17,19,0,0,50,0,119,0,null,0,null,{"$f":"COUNTIF('Classement auteurs'!B:B,C69)","v":1}]
[13,73,132060001701,"Enfant gitan de la mer   ",14,14,17,0,0,45,0,42,0,null,0,null,{"$f":"COUNTIF('Classement auteurs'!B:B,C70)","v":1}]
[13,74,131862000801,"Le Chat du Rabin         ",11,6,7,0,0,24,0,78,0,null,0,null,{"$f":"COUNTIF('Classement auteurs'!B:B,C71)","v":1}]
[13,75,132084000301,"Croisère à Kotor       ",14,11,14,0,0,39,0,120,0,null,0,null,{"$f":"COUNTIF('Classement auteurs'!B:B,C72)","v":1}]
[13,76,130000019901,"Recueillement            ",13,13,15,0,0,41,0,115,6,null,0,null,{"$f":"COUNTIF('Classement auteurs'!B:B,C73)","v":1}]
[13,77,132193000401,"Un pont entre 2 mondes   ",12,12,13,0,0,37,0,93,7,null,0,null,{"$f":"COUNTIF('Classement auteurs'!B:B,C74)","v":1}]
[13,78,131956004601,"Regards sur notre galaxie",13,19,15,0,0,47,0,20,0,null,0,null,{"$f":"COUNTIF('Classement auteurs'!B:B,C75)","v":1}]
[13,79,130987015701,"Les Falaises de Moher    ",14,9,16,0,0,39,0,111,0,null,0,null,{"$f":"COUNTIF('Classement auteurs'!B:B,C76)","v":1}]
[13,80,131956001401,"Regard Colombien         ",11,10,11,0,0,32,0,134,0,null,0,null,{"$f":"COUNTIF('Classement auteurs'!B:B,C77)","v":1}]
[13,81,131862002201,"Matsumoto. Japon         ",12,11,12,0,0,35,0,50,0,null,0,null,{"$f":"COUNTIF('Classement auteurs'!B:B,C78)","v":1}]
[13,82,132089000201,"Au Radjastan             ",10,11,10,0,0,31,0,6,0,null,0,null,{"$f":"COUNTIF('Classement auteurs'!B:B,C79)","v":1}]
[13,83,131862005801,"Suivez mon regard        ",11,11,12,0,0,34,0,52,0,null,0,null,{"$f":"COUNTIF('Classement auteurs'!B:B,C80)","v":1}]
[13,84,131956004501,"Aquarius                 ",12,14,12,0,0,38,0,54,0,null,0,null,{"$f":"COUNTIF('Classement auteurs'!B:B,C81)","v":1}]
[13,85,131110001101,"Le petit guitariste      ",11,6,7,0,0,24,0,108,0,null,0,null,{"$f":"COUNTIF('Classement auteurs'!B:B,C82)","v":1}]
[13,86,132060000701,"Flamenco andalou         ",12,10,7,0,0,29,0,30,0,null,0,null,{"$f":"COUNTIF('Classement auteurs'!B:B,C83)","v":1}]
[13,87,131494002301,"Gondoles                 ",11,10,14,0,0,35,0,113,0,null,0,null,{"$f":"COUNTIF('Classement auteurs'!B:B,C84)","v":1}]
[13,88,131494000201,"Enfants Masaï           ",14,11,9,0,0,34,0,121,0,null,0,null,{"$f":"COUNTIF('Classement auteurs'!B:B,C85)","v":1}]
[13,89,131845003401,"Flotte internationale    ",11,6,10,0,0,27,0,96,0,null,0,null,{"$f":"COUNTIF('Classement auteurs'!B:B,C86)","v":1}]
[13,91,132089000501,"Ma Thaïlande            ",12,14,13,0,0,39,0,125,0,null,0,null,{"$f":"COUNTIF('Classement auteurs'!B:B,C87)","v":1}]
[13,92,131845002101,"Baigneuse coréenne      ",11,10,13,0,0,34,0,117,0,null,0,null,{"$f":"COUNTIF('Classement auteurs'!B:B,C88)","v":1}]
[13,93,131956005501,"European flags           ",10,14,9,0,0,33,0,81,0,null,0,null,{"$f":"COUNTIF('Classement auteurs'!B:B,C89)","v":1}]
[13,94,131376014701,"Le cri                   ",9,7,7,0,0,23,0,118,0,null,0,null,{"$f":"COUNTIF('Classement auteurs'!B:B,C90)","v":1}]
[13,95,131845002501,"Séville. Place d'Espagne.",14,14,13,0,0,41,0,99,0,null,0,null,{"$f":"COUNTIF('Classement auteurs'!B:B,C91)","v":1}]
[13,96,131110000901,"Marcher sur l'eau        ",13,12,20,0,0,45,0,103,0,null,0,null,{"$f":"COUNTIF('Classement auteurs'!B:B,C92)","v":1}]
[13,97,131683006601,"Un kilt assumé          ",11,8,7,0,0,26,0,39,0,null,0,null,{"$f":"COUNTIF('Classement auteurs'!B:B,C93)","v":1}]
[13,98,131499010801,"Hommage de New York      ",12,9,9,0,0,30,0,51,0,null,0,null,{"$f":"COUNTIF('Classement auteurs'!B:B,C94)","v":1}]
[13,99,131353007401,"Regards de Bolivie       ",14,12,12,0,0,38,0,4,0,null,0,null,{"$f":"COUNTIF('Classement auteurs'!B:B,C95)","v":1}]
[13,100,132193001201,"La potion magique        ",12,12,10,0,0,34,0,130,7,null,0,null,{"$f":"COUNTIF('Classement auteurs'!B:B,C96)","v":1}]
[13,101,130878013401,"01 Globe terreste        ",11,11,8,0,0,30,0,63,0,null,0,null,{"$f":"COUNTIF('Classement auteurs'!B:B,C97)","v":1}]
[13,102,130987023901,"Love in the air          ",11,8,11,0,0,30,0,8,0,null,0,null,{"$f":"COUNTIF('Classement auteurs'!B:B,C98)","v":1}]
[13,103,131956006201,"Larmes de sang           ",12,6,7,0,0,25,0,109,0,null,0,null,{"$f":"COUNTIF('Classement auteurs'!B:B,C99)","v":1}]
[13,104,130527002501,"Internation              ",12,11,14,0,0,37,0,144,0,null,0,null,{"$f":"COUNTIF('Classement auteurs'!B:B,C100)","v":1}]
[13,105,130527012601,"Transport                ",12,10,15,0,0,37,0,143,0,null,0,null,{"$f":"COUNTIF('Classement auteurs'!B:B,C101)","v":1}]
[13,106,132060000801,"Vision cubaine           ",11,10,11,0,0,32,0,122,0,null,0,null,{"$f":"COUNTIF('Classement auteurs'!B:B,C102)","v":1}]
[13,107,132103000101,"Quel vol déja           ",8,7,8,0,0,23,0,124,0,null,0,null,{"$f":"COUNTIF('Classement auteurs'!B:B,C103)","v":1}]
[13,108,132086002301,"Le poids des traditions  ",10,11,10,0,0,31,0,14,0,null,0,null,{"$f":"COUNTIF('Classement auteurs'!B:B,C104)","v":1}]
[13,109,131956000201,"Femme lepcha sikkim inde ",11,18,18,0,0,47,0,60,0,null,0,null,{"$f":"COUNTIF('Classement auteurs'!B:B,C105)","v":1}]
[13,110,131879000601,"Magique Islande          ",12,10,15,0,0,37,0,107,0,null,0,null,{"$f":"COUNTIF('Classement auteurs'!B:B,C106)","v":1}]
[13,111,131683007901,"Lueur D'espoir           ",12,7,20,0,0,39,0,128,0,null,0,null,{"$f":"COUNTIF('Classement auteurs'!B:B,C107)","v":1}]
[13,112,131862001401,"Vahine                   ",11,9,7,0,0,27,0,49,0,null,0,null,{"$f":"COUNTIF('Classement auteurs'!B:B,C108)","v":1}]
[13,113,132086002601,"Regards partagés        ",12,6,8,0,0,26,0,27,0,null,0,null,{"$f":"COUNTIF('Classement auteurs'!B:B,C109)","v":1}]
[13,114,132060002201,"Festival du rire Montréal",11,10,8,0,0,29,0,58,0,null,0,null,{"$f":"COUNTIF('Classement auteurs'!B:B,C110)","v":1}]
[13,115,131353007101,"Regads de l'étranger    ",11,9,10,0,0,30,0,67,0,null,0,null,{"$f":"COUNTIF('Classement auteurs'!B:B,C111)","v":1}]
[13,116,131823005701,"Lever-soleil-Suède      ",9,12,7,0,0,28,0,83,0,null,0,null,{"$f":"COUNTIF('Classement auteurs'!B:B,C112)","v":1}]
[13,117,131956005701,"Bancroft way Berkeley    ",10,12,9,0,0,31,0,116,0,null,0,null,{"$f":"COUNTIF('Classement auteurs'!B:B,C113)","v":1}]
[13,118,132060001801,"Jiwa et la femme au betel",12,12,14,0,0,38,0,94,0,null,0,null,{"$f":"COUNTIF('Classement auteurs'!B:B,C114)","v":1}]
[13,119,130527009201,"Aki Matsuri              ",12,12,11,0,0,35,0,2,0,null,0,null,{"$f":"COUNTIF('Classement auteurs'!B:B,C115)","v":1}]
[13,120,130987001601,"Marché Gabonais         ",10,10,16,0,0,36,0,114,0,null,0,null,{"$f":"COUNTIF('Classement auteurs'!B:B,C116)","v":1}]
[13,121,132060002401,"Voyage familial          ",12,12,7,0,0,31,0,75,0,null,0,null,{"$f":"COUNTIF('Classement auteurs'!B:B,C117)","v":1}]
[13,122,130527009401,"Bella ciao               ",13,20,20,0,0,53,0,43,0,null,0,null,{"$f":"COUNTIF('Classement auteurs'!B:B,C118)","v":1}]
[13,123,131499006801,"Retour des troupeaux     ",13,14,12,0,0,39,0,33,0,null,0,null,{"$f":"COUNTIF('Classement auteurs'!B:B,C119)","v":1}]
[13,124,130527017001,"Un monde curieux.        ",15,13,12,0,0,40,0,12,0,null,0,null,{"$f":"COUNTIF('Classement auteurs'!B:B,C120)","v":1}]
[13,125,131376018001,"Immigration              ",11,15,12,0,0,38,0,104,0,null,0,null,{"$f":"COUNTIF('Classement auteurs'!B:B,C121)","v":1}]
[13,127,131499008201,"Train à Madagascar      ",15,11,15,0,0,41,0,138,0,null,0,null,{"$f":"COUNTIF('Classement auteurs'!B:B,C122)","v":1}]
[13,128,131845001401,"Voyage                   ",12,6,16,0,0,34,0,70,0,null,0,null,{"$f":"COUNTIF('Classement auteurs'!B:B,C123)","v":1}]
[13,129,131499003601,"Gargote japonaise        ",11,14,8,0,0,33,0,19,0,null,0,null,{"$f":"COUNTIF('Classement auteurs'!B:B,C124)","v":1}]
[13,130,130987002301,"Entrez sans frapper      ",13,13,18,0,0,44,0,88,0,null,0,null,{"$f":"COUNTIF('Classement auteurs'!B:B,C125)","v":1}]
[13,131,132089000101,"Milan 2015               ",11,10,8,0,0,29,0,100,0,null,0,null,{"$f":"COUNTIF('Classement auteurs'!B:B,C126)","v":1}]
[13,132,131499006901,"Les tanneurs de Fès     ",14,12,19,0,0,45,0,9,0,null,0,null,{"$f":"COUNTIF('Classement auteurs'!B:B,C127)","v":1}]
[13,133,130925009901,"Tatouage                 ",12,9,17,0,0,38,0,89,0,null,0,null,{"$f":"COUNTIF('Classement auteurs'!B:B,C128)","v":1}]
[13,134,131619004501,"Colisé                  ",14,15,19,0,0,48,0,10,0,null,0,null,{"$f":"COUNTIF('Classement auteurs'!B:B,C129)","v":1}]
[13,135,132084002301,"Moaïs                   ",13,9,15,0,0,37,0,137,0,null,0,null,{"$f":"COUNTIF('Classement auteurs'!B:B,C130)","v":1}]
[13,136,130925008401,"Temps passé             ",15,7,17,0,0,{"$f":"SUM(E131:I131)","v":39},0,140,0,null,0,null,{"$f":"COUNTIF('Classement auteurs'!B:B,C131)","v":1}]
[13,137,130987025001,"Repos du pêcheur        ",13,14,12,0,0,39,0,80,0,null,0,null,{"$f":"COUNTIF('Classement auteurs'!B:B,C132)","v":1}]
[13,138,131499010601,"Journal birman           ",12,11,17,0,0,40,0,71,0,null,0,null,{"$f":"COUNTIF('Classement auteurs'!B:B,C133)","v":1}]
[13,139,131499010501,"Retour de marché        ",12,13,16,0,0,41,0,59,0,null,0,null,{"$f":"COUNTIF('Classement auteurs'!B:B,C134)","v":1}]
[13,140,130527012401,"Allée de baobabs        ",13,10,13,0,0,36,0,22,0,null,0,null,{"$f":"COUNTIF('Classement auteurs'!B:B,C135)","v":1}]
[13,141,131353006201,"La tour olympique        ",11,11,9,0,0,31,0,3,0,null,0,null,{"$f":"COUNTIF('Classement auteurs'!B:B,C136)","v":1}]
[13,142,131683006501,"A la croix del condor    ",11,9,8,0,0,28,0,110,0,null,0,null,{"$f":"COUNTIF('Classement auteurs'!B:B,C137)","v":1}]
[13,143,131683002601,"Lumière sublime d'Afrique",14,11,12,0,0,37,0,65,0,null,0,null,{"$f":"COUNTIF('Classement auteurs'!B:B,C138)","v":1}]
[13,144,131823006401,"Flash sur l'artiste      ",12,7,19,0,0,38,0,53,0,null,0]
[13,145,131353006101,"Santorin                 ",13,11,17,0,0,41,0,15,0,null,0]
[13,146,132060000901,"Lever de soleil africain ",12,9,7,0,0,28,0,28,7,null,0]
[13,147,130925008701,"Derviche tourneur        ",13,10,11,0,0,34,0,145,0,null,0]
[13,148,132103002301,"Les yeux de l'Inde       ",13,13,17,0,0,43,0,79,0,null,0]
[13,149,131956002401,"Réunion au sommet - lima",12,12,12,0,0,36,0,23,0,null,0]
[13,150,131353000101,"Travail des rizières    ",13,11,12,0,0,36,0,25,0,null,0]
[13,151,131353000701,"Vietnamese little girls  ",12,12,18,0,0,42,0,90,0,null,0]

{"sheet":"Défi-3","index":5,"n_rows":163,"n_cols":17,"rows_kept":163,"cut":false,"hidden":false,"merged":[]}
["colis","photologic","fichier","titre","note1","note2","note3","note4","note5","total","place","passage","statut","medaille","retenue",null,"0=absent\n1=présent"]
[13,1,130987024201,"Cracheur de Feu          ",17,18,13,0,0,{"$f":"SUM(E2:I2)","v":48},0,50,0,null,0,null,{"$f":"COUNTIF('Classement auteurs'!B:B,C2)","v":1}]
[13,2,130987024101,"A l'affut                ",15,11,10,0,0,{"$f":"SUM(E3:I3)","v":36},0,65,0,null,0,null,{"$f":"COUNTIF('Classement auteurs'!B:B,C3)","v":1}]
[13,4,130987012601,"Répétition.            ",14,15,13,0,0,42,0,149,0,null,0,null,{"$f":"COUNTIF('Classement auteurs'!B:B,C4)","v":1}]
[13,5,131376018301,"La poursuite             ",19,18,20,0,0,57,0,132,0,null,0,null,{"$f":"COUNTIF('Classement auteurs'!B:B,C5)","v":1}]
[13,6,132193000601,"Proue inversée          ",17,14,13,0,0,44,0,26,0,null,0,null,{"$f":"COUNTIF('Classement auteurs'!B:B,C6)","v":1}]
[13,7,131683008001,"Espiègle                ",16,19,12,0,0,47,0,153,0,null,0,null,{"$f":"COUNTIF('Classement auteurs'!B:B,C7)","v":1}]
[13,8,131823008301,"Portrait de rue          ",16,18,14,0,0,48,0,12,0,null,0,null,{"$f":"COUNTIF('Classement auteurs'!B:B,C8)","v":1}]
[13,9,132103000101,"Prendre de le temps      ",19,19,17,0,0,55,0,152,0,null,0,null,{"$f":"COUNTIF('Classement auteurs'!B:B,C9)","v":1}]
[13,10,131494003201,"Jeans                    ",15,13,11,0,0,39,0,64,0,null,0,null,{"$f":"COUNTIF('Classement auteurs'!B:B,C10)","v":1}]
[13,11,130000021001," Un voyage à LONDRES    ",7,6,8,0,0,21,0,137,6,null,0,null,{"$f":"COUNTIF('Classement auteurs'!B:B,C11)","v":1}]
[13,12,130987029901,"Rodin.jpg                ",9,11,11,0,0,31,0,113,0,null,0,null,{"$f":"COUNTIF('Classement auteurs'!B:B,C12)","v":1}]
[13,13,131683007601,"Maillot jaune            ",11,10,10,0,0,31,0,20,0,null,0,null,{"$f":"COUNTIF('Classement auteurs'!B:B,C13)","v":1}]
[13,14,131823004901,"Ça chauffe              ",14,16,13,0,0,43,0,48,0,null,0,null,{"$f":"COUNTIF('Classement auteurs'!B:B,C14)","v":1}]
[13,15,131683005001,"Rêverie                 ",14,13,12,0,0,39,0,31,0,null,0,null,{"$f":"COUNTIF('Classement auteurs'!B:B,C15)","v":1}]
[13,16,131499008701,"Suivre notre chemin...   ",13,14,12,0,0,39,0,158,0,null,0,null,{"$f":"COUNTIF('Classement auteurs'!B:B,C16)","v":1}]
[13,17,132193000301,"Salsa                    ",20,7,13,0,0,40,0,4,0,null,0,null,{"$f":"COUNTIF('Classement auteurs'!B:B,C17)","v":1}]
[13,18,131823008701,"Jusqu'au ciel            ",8,10,10,0,0,28,0,115,0,null,0,null,{"$f":"COUNTIF('Classement auteurs'!B:B,C18)","v":1}]
[13,20,130987028401,"Sensibilité de Granit   ",11,7,9,0,0,27,0,93,0,null,0,null,{"$f":"COUNTIF('Classement auteurs'!B:B,C19)","v":1}]
[13,21,131824001901,"Terre Secrete Mâconnaise",17,14,14,0,0,45,0,66,0,null,0,null,{"$f":"COUNTIF('Classement auteurs'!B:B,C20)","v":1}]
[13,22,130878013001,"La plage                 ",15,12,12,0,0,39,0,80,0,null,0,null,{"$f":"COUNTIF('Classement auteurs'!B:B,C21)","v":1}]
[13,23,132084002301,"Les petits hommes        ",19,18,17,0,0,54,0,8,0,null,0,null,{"$f":"COUNTIF('Classement auteurs'!B:B,C22)","v":1}]
[13,24,131683006301,"Graphisme rural          ",11,13,10,0,0,34,0,118,0,null,0,null,{"$f":"COUNTIF('Classement auteurs'!B:B,C23)","v":1}]
[13,25,131862002201,"Les fiancés             ",18,12,14,0,0,44,0,144,0,null,0,null,{"$f":"COUNTIF('Classement auteurs'!B:B,C24)","v":1}]
[13,26,130462001101,"Oeuvre 1-mucem           ",13,11,14,0,0,38,0,161,0,null,0,null,{"$f":"COUNTIF('Classement auteurs'!B:B,C25)","v":1}]
[13,27,130987024001,"Ambiance nordique        ",15,15,14,0,0,44,0,121,0,null,0,null,{"$f":"COUNTIF('Classement auteurs'!B:B,C26)","v":1}]
[13,28,131683000701,"MARIE                    ",18,13,17,0,0,48,0,40,0,null,0,null,{"$f":"COUNTIF('Classement auteurs'!B:B,C27)","v":1}]
[13,29,131879000801,"Harmonie                 ",19,19,20,0,0,58,0,99,0,null,0,null,{"$f":"COUNTIF('Classement auteurs'!B:B,C28)","v":1}]
[13,30,131499009301,"Les parasols             ",11,11,13,0,0,35,0,96,0,null,0,null,{"$f":"COUNTIF('Classement auteurs'!B:B,C29)","v":1}]
[13,31,131879000101,"Shinkansen-japon         ",13,15,10,0,0,38,0,74,0,null,0,null,{"$f":"COUNTIF('Classement auteurs'!B:B,C30)","v":1}]
[13,32,131824003101,"Encre du Japon           ",15,12,14,0,0,41,0,104,0,null,0,null,{"$f":"COUNTIF('Classement auteurs'!B:B,C31)","v":1}]
[13,33,131353006101,"Mains d'Argile           ",15,11,10,0,0,36,0,63,0,null,0,null,{"$f":"COUNTIF('Classement auteurs'!B:B,C32)","v":1}]
[13,34,131499009801,"Bella musica             ",13,10,12,0,0,35,0,82,0,null,0,null,{"$f":"COUNTIF('Classement auteurs'!B:B,C33)","v":1}]
[13,35,132023000101,"L'homme au damier        ",16,8,14,0,0,38,0,92,0,null,0,null,{"$f":"COUNTIF('Classement auteurs'!B:B,C34)","v":1}]
[13,36,130987015701,"Douceur                  ",12,9,13,0,0,34,0,147,0,null,0,null,{"$f":"COUNTIF('Classement auteurs'!B:B,C35)","v":1}]
[13,38,131499008601,"Il potassait...          ",14,11,15,0,0,40,0,159,0,null,0,null,{"$f":"COUNTIF('Classement auteurs'!B:B,C36)","v":1}]
[13,39,131992000401,"Fantôme de Noel         ",12,9,11,0,0,32,0,138,0,null,0,null,{"$f":"COUNTIF('Classement auteurs'!B:B,C37)","v":1}]
[13,40,130925010201,"Arles                    ",10,11,10,0,0,31,0,15,0,null,0,null,{"$f":"COUNTIF('Classement auteurs'!B:B,C38)","v":1}]
[13,41,131227008601,"Après la pluie          ",20,17,16,0,0,53,0,2,0,null,0,null,{"$f":"COUNTIF('Classement auteurs'!B:B,C39)","v":1}]
[13,42,130878014101,"Voilier echoué          ",15,13,16,0,0,44,0,35,0,null,0,null,{"$f":"COUNTIF('Classement auteurs'!B:B,C40)","v":1}]
[13,44,130000020401,"The Camps                ",12,11,12,0,0,35,0,131,6,null,0,null,{"$f":"COUNTIF('Classement auteurs'!B:B,C41)","v":1}]
[13,46,131499005201,"James                    ",18,14,17,0,0,49,0,28,0,null,0,null,{"$f":"COUNTIF('Classement auteurs'!B:B,C42)","v":1}]
[13,47,131376014701,"Trompette                ",13,13,13,0,0,39,0,95,0,null,0,null,{"$f":"COUNTIF('Classement auteurs'!B:B,C43)","v":1}]
[13,48,131956001401,"Escalier Iranien         ",14,9,15,0,0,38,0,105,0,null,0,null,{"$f":"COUNTIF('Classement auteurs'!B:B,C44)","v":1}]
[13,49,131879000501,"Rencontre                ",12,13,15,0,0,40,0,85,0,null,0,null,{"$f":"COUNTIF('Classement auteurs'!B:B,C45)","v":1}]
[13,50,130987013801,"Massilia 2017            ",16,14,15,0,0,45,0,11,0,null,0,null,{"$f":"COUNTIF('Classement auteurs'!B:B,C46)","v":1}]
[13,51,132060000801,"Ramasseurs de coquillages",15,7,11,0,0,33,0,17,0,null,0,null,{"$f":"COUNTIF('Classement auteurs'!B:B,C47)","v":1}]
[13,52,132084000301,"Fuir la cité maudite    ",14,14,12,0,0,40,0,108,0,null,0,null,{"$f":"COUNTIF('Classement auteurs'!B:B,C48)","v":1}]
[13,53,131376012601,"Ecume des mers           ",13,13,14,0,0,40,0,3,0,null,0,null,{"$f":"COUNTIF('Classement auteurs'!B:B,C49)","v":1}]
[13,54,130987019601,"La photographe           ",11,12,13,0,0,36,0,19,0,null,0,null,{"$f":"COUNTIF('Classement auteurs'!B:B,C50)","v":1}]
[13,55,130987019701,"Big Ben                  ",12,16,12,0,0,40,0,33,0,null,0,null,{"$f":"COUNTIF('Classement auteurs'!B:B,C51)","v":1}]
[13,56,130925008601,"Silhouette               ",15,8,11,0,0,34,0,155,0,null,0,null,{"$f":"COUNTIF('Classement auteurs'!B:B,C52)","v":1}]
[13,57,130878007201,"Marlène                 ",13,11,13,0,0,37,0,112,0,null,0,null,{"$f":"COUNTIF('Classement auteurs'!B:B,C53)","v":1}]
[13,58,131845004001,"John peter               ",17,11,14,0,0,42,0,72,0,null,0,null,{"$f":"COUNTIF('Classement auteurs'!B:B,C54)","v":1}]
[13,59,132084001701,"Au bout... la mer        ",14,12,14,0,0,40,0,27,0,null,0,null,{"$f":"COUNTIF('Classement auteurs'!B:B,C55)","v":1}]
[13,60,132060001701,"Artiste dans l'atelier   ",14,8,11,0,0,33,0,55,0,null,0,null,{"$f":"COUNTIF('Classement auteurs'!B:B,C56)","v":1}]
[13,61,131862001001,"Brume et Givre           ",13,10,13,0,0,36,0,49,0,null,0,null,{"$f":"COUNTIF('Classement auteurs'!B:B,C57)","v":1}]
[13,62,132103002301,"Nobody... nowhere        ",13,16,14,0,0,43,0,89,0,null,0,null,{"$f":"COUNTIF('Classement auteurs'!B:B,C58)","v":1}]
[13,63,132217000101,"Dans le vent             ",9,8,13,0,0,30,0,22,0,null,0,null,{"$f":"COUNTIF('Classement auteurs'!B:B,C59)","v":1}]
[13,64,131353006201,"Cairn à Quiberon        ",12,14,13,0,0,39,0,46,0,null,0,null,{"$f":"COUNTIF('Classement auteurs'!B:B,C60)","v":1}]
[13,65,132084004001,"Village Diola            ",13,8,11,0,0,32,0,71,0,null,0,null,{"$f":"COUNTIF('Classement auteurs'!B:B,C61)","v":1}]
[13,66,132103000201,"La femme du village      ",14,18,12,0,0,44,0,51,0,null,0,null,{"$f":"COUNTIF('Classement auteurs'!B:B,C62)","v":1}]
[13,68,130527013301,"New york                 ",12,14,14,0,0,40,0,62,0,null,0,null,{"$f":"COUNTIF('Classement auteurs'!B:B,C63)","v":1}]
[13,69,130527011601,"THE BIG APPLE            ",12,11,14,0,0,37,0,7,0,null,0,null,{"$f":"COUNTIF('Classement auteurs'!B:B,C64)","v":1}]
[13,70,131494002301,"Vagues à l'âme         ",11,9,12,0,0,32,0,116,0,null,0,null,{"$f":"COUNTIF('Classement auteurs'!B:B,C65)","v":1}]
[13,71,130987001601,"Il chante!!!             ",14,7,14,0,0,35,0,111,0,null,0,null,{"$f":"COUNTIF('Classement auteurs'!B:B,C66)","v":1}]
[13,72,131823005701,"L'ange                   ",13,12,12,0,0,{"$f":"SUM(E67:I67)","v":37},0,45,0,null,0,null,{"$f":"COUNTIF('Classement auteurs'!B:B,C67)","v":1}]
[13,73,130987014001,"Prière                  ",8,7,8,0,0,23,0,76,0,null,0,null,{"$f":"COUNTIF('Classement auteurs'!B:B,C68)","v":1}]
[13,74,131845002501,"Spartan à St Tropez     ",11,11,10,0,0,32,0,87,0,null,0,null,{"$f":"COUNTIF('Classement auteurs'!B:B,C69)","v":1}]
[13,75,130878013401,"Prison                   ",14,9,13,0,0,36,0,162,0,null,0,null,{"$f":"COUNTIF('Classement auteurs'!B:B,C70)","v":1}]
[13,76,130878014301,"L'homme                  ",19,16,17,0,0,52,0,107,0,null,0,null,{"$f":"COUNTIF('Classement auteurs'!B:B,C71)","v":1}]
[13,77,131879001301,"Rue                      ",17,16,13,0,0,46,0,14,0,null,0,null,{"$f":"COUNTIF('Classement auteurs'!B:B,C72)","v":1}]
[13,78,130527015501,"Amaryllis                ",14,19,12,0,0,45,0,140,0,null,0,null,{"$f":"COUNTIF('Classement auteurs'!B:B,C73)","v":1}]
[13,79,131823006401,"Solitude                 ",16,10,13,0,0,39,0,23,0,null,0,null,{"$f":"COUNTIF('Classement auteurs'!B:B,C74)","v":1}]
[13,81,131683006601,"Escaliers                ",13,15,14,0,0,42,0,110,0,null,0,null,{"$f":"COUNTIF('Classement auteurs'!B:B,C75)","v":1}]
[13,82,132060001801,"Est-ce la bonne direction ?",17,11,12,0,0,40,0,44,0,null,0,null,{"$f":"COUNTIF('Classement auteurs'!B:B,C76)","v":1}]
[13,83,130527019601,"Flatiron building        ",9,10,10,0,0,29,0,91,0,null,0,null,{"$f":"COUNTIF('Classement auteurs'!B:B,C77)","v":1}]
[13,84,130527012401,"En vallée d'Aspe        ",6,6,6,0,0,18,0,136,0,null,0,null,{"$f":"COUNTIF('Classement auteurs'!B:B,C78)","v":1}]
[13,85,130925008701,"Cimetière               ",18,9,12,0,0,39,0,43,0,null,0,null,{"$f":"COUNTIF('Classement auteurs'!B:B,C79)","v":1}]
[13,86,131823007601,"Cha NB                   ",14,13,13,0,0,40,0,67,0,null,0,null,{"$f":"COUNTIF('Classement auteurs'!B:B,C80)","v":1}]
[13,87,130987026701,"Tamaris Le Matin_ St Mandrier _26.08.17",12,12,8,0,0,32,0,84,0,null,0,null,{"$f":"COUNTIF('Classement auteurs'!B:B,C81)","v":1}]
[13,88,132086001401,"Rêverie                 ",15,10,12,0,0,37,0,37,0,null,0,null,{"$f":"COUNTIF('Classement auteurs'!B:B,C82)","v":1}]
[13,89,130527002501,"Méfiance                ",17,11,10,0,0,38,0,25,0,null,0,null,{"$f":"COUNTIF('Classement auteurs'!B:B,C83)","v":1}]
[13,90,132203000501,"L'embarras du choix      ",10,9,11,0,0,30,0,117,0,null,0,null,{"$f":"COUNTIF('Classement auteurs'!B:B,C84)","v":1}]
[13,91,131992000301,"Petit matin dans la mare ",10,12,10,0,0,32,0,160,0,null,0,null,{"$f":"COUNTIF('Classement auteurs'!B:B,C85)","v":1}]
[13,92,132086002301,"Elle part                ",17,7,11,0,0,35,0,54,0,null,0,null,{"$f":"COUNTIF('Classement auteurs'!B:B,C86)","v":1}]
[13,93,131499010401,"Salins                   ",18,11,14,0,0,43,0,109,0,null,0,null,{"$f":"COUNTIF('Classement auteurs'!B:B,C87)","v":1}]
[13,94,131683005101,"Regard sur la rue        ",13,15,13,0,0,41,0,39,0,null,0,null,{"$f":"COUNTIF('Classement auteurs'!B:B,C88)","v":1}]
[13,95,130987023901,"Infiniment petit dans l'infiniment grand",12,14,14,0,0,40,0,129,0,null,0,null,{"$f":"COUNTIF('Classement auteurs'!B:B,C89)","v":1}]
[13,96,130000019901,"Arles                    ",17,12,15,0,0,44,0,34,6,null,0,null,{"$f":"COUNTIF('Classement auteurs'!B:B,C90)","v":1}]
[13,97,132060002401,"La force Polynésienne   ",13,8,11,0,0,32,0,47,0,null,0,null,{"$f":"COUNTIF('Classement auteurs'!B:B,C91)","v":1}]
[13,98,130925008401,"Exploration              ",16,13,11,0,0,40,0,42,0,null,0,null,{"$f":"COUNTIF('Classement auteurs'!B:B,C92)","v":1}]
[13,99,131862001101,"Fabrice Bistoni à Opio  ",13,13,15,0,0,41,0,24,0,null,0,null,{"$f":"COUNTIF('Classement auteurs'!B:B,C93)","v":1}]
[13,100,131879002001,"Brume hivernale          ",17,12,13,0,0,42,0,16,0,null,0,null,{"$f":"COUNTIF('Classement auteurs'!B:B,C94)","v":1}]
[13,101,131110001101,"Jeu d'ombres             ",12,10,16,0,0,38,0,101,0,null,0,null,{"$f":"COUNTIF('Classement auteurs'!B:B,C95)","v":1}]
[13,102,131683008101,"L'alchimiste             ",13,12,12,0,0,37,0,146,0,null,0,null,{"$f":"COUNTIF('Classement auteurs'!B:B,C96)","v":1}]
[13,103,131499010001,"Continue !               ",16,13,14,0,0,43,0,139,0,null,0,null,{"$f":"COUNTIF('Classement auteurs'!B:B,C97)","v":1}]
[13,104,131683007901,"Caresse de lumière      ",13,12,13,0,0,38,0,88,0,null,0,null,{"$f":"COUNTIF('Classement auteurs'!B:B,C98)","v":1}]
[13,105,130925009801,"Le signe                 ",15,9,17,0,0,41,0,32,0,null,0,null,{"$f":"COUNTIF('Classement auteurs'!B:B,C99)","v":1}]
[13,107,131879000901,"Clip                     ",14,16,14,0,0,44,0,143,0,null,0,null,{"$f":"COUNTIF('Classement auteurs'!B:B,C100)","v":1}]
[13,108,131110000901,"Pecheur Intha            ",18,20,18,0,0,56,0,83,0,null,0,null,{"$f":"COUNTIF('Classement auteurs'!B:B,C101)","v":1}]
[13,109,130925009901,"Tchatche                 ",15,7,12,0,0,34,0,97,0,null,0,null,{"$f":"COUNTIF('Classement auteurs'!B:B,C102)","v":1}]
[13,110,131110001001,"Le chemin                ",13,15,12,0,0,40,0,122,0,null,0,null,{"$f":"COUNTIF('Classement auteurs'!B:B,C103)","v":1}]
[13,111,131956002401,"Haut alpin bienveillant  ",14,15,11,0,0,40,0,150,0,null,0,null,{"$f":"COUNTIF('Classement auteurs'!B:B,C104)","v":1}]
[13,112,131845000101,"Tempête du 11 décembre 2017",14,14,13,0,0,41,0,120,0,null,0,null,{"$f":"COUNTIF('Classement auteurs'!B:B,C105)","v":1}]
[13,113,131494000201,"Lucy                     ",14,13,15,0,0,42,0,18,0,null,0,null,{"$f":"COUNTIF('Classement auteurs'!B:B,C106)","v":1}]
[13,114,131956004501,"Sète                    ",16,9,10,0,0,35,0,77,0,null,0,null,{"$f":"COUNTIF('Classement auteurs'!B:B,C107)","v":1}]
[13,115,130987007401,"Venise                   ",10,7,11,0,0,28,0,145,0,null,0,null,{"$f":"COUNTIF('Classement auteurs'!B:B,C108)","v":1}]
[13,116,132084005001,"Quand vient la fin de l'été",15,11,13,0,0,39,0,128,0,null,0,null,{"$f":"COUNTIF('Classement auteurs'!B:B,C109)","v":1}]
[13,117,131956006501,"LA SOUPE DE BOGOTA       ",13,10,11,0,0,34,0,124,0,null,0,null,{"$f":"COUNTIF('Classement auteurs'!B:B,C110)","v":1}]
[13,118,130925010501,"Nathalie                 ",18,10,18,0,0,46,0,103,0,null,0,null,{"$f":"COUNTIF('Classement auteurs'!B:B,C111)","v":1}]
[13,119,132089000301,"Vieux Cabanon            ",12,10,9,0,0,31,0,36,0,null,0,null,{"$f":"COUNTIF('Classement auteurs'!B:B,C112)","v":1}]
[13,120,132089000201,"Demoiselle d'Honneur     ",14,16,13,0,0,43,0,81,0,null,0,null,{"$f":"COUNTIF('Classement auteurs'!B:B,C113)","v":1}]
[13,121,132203000701,"Sortir de l'ombre        ",18,10,12,0,0,40,0,141,0,null,0,null,{"$f":"COUNTIF('Classement auteurs'!B:B,C114)","v":1}]
[13,122,132103000501,"Arrosage Municipal       ",13,10,14,0,0,37,0,1,0,null,0,null,{"$f":"COUNTIF('Classement auteurs'!B:B,C115)","v":1}]
[13,123,131353004301,"Rencontre                ",12,13,10,0,0,35,0,100,0,null,0,null,{"$f":"COUNTIF('Classement auteurs'!B:B,C116)","v":1}]
[13,124,132060000701,"Vertige                  ",11,9,11,0,0,31,0,90,0,null,0,null,{"$f":"COUNTIF('Classement auteurs'!B:B,C117)","v":1}]
[13,125,131353003001,"Sur le chemin de Saint-Jacques",12,13,12,0,0,37,0,5,0,null,0,null,{"$f":"COUNTIF('Classement auteurs'!B:B,C118)","v":1}]
[13,126,131353007101,"Du blanc ou du rouge?    ",13,7,13,0,0,33,0,102,0,null,0,null,{"$f":"COUNTIF('Classement auteurs'!B:B,C119)","v":1}]
[13,127,131376017701,"Echec et Mat?            ",19,15,14,0,0,48,0,114,0,null,0,null,{"$f":"COUNTIF('Classement auteurs'!B:B,C120)","v":1}]
[13,128,131845004101,"Petite fille au parapluie",11,10,13,0,0,34,0,134,0,null,0,null,{"$f":"COUNTIF('Classement auteurs'!B:B,C121)","v":1}]
[13,129,131862000801,"Cosmos 1999              ",12,11,13,0,0,36,0,79,0,null,0,null,{"$f":"COUNTIF('Classement auteurs'!B:B,C122)","v":1}]
[13,130,131862005801,"Dentelle métallique     ",13,9,11,0,0,33,0,148,0,null,0,null,{"$f":"COUNTIF('Classement auteurs'!B:B,C123)","v":1}]
[13,131,131823004201,"Nature orfèvre          ",16,10,8,0,0,34,0,69,0,null,0,null,{"$f":"COUNTIF('Classement auteurs'!B:B,C124)","v":1}]
[13,132,132203001101,"Bouton de tournesol      ",15,16,13,0,0,44,0,127,0,null,0,null,{"$f":"COUNTIF('Classement auteurs'!B:B,C125)","v":1}]
[13,133,132060002201,"Feu d'artifice           ",13,11,12,0,0,36,0,135,0,null,0,null,{"$f":"COUNTIF('Classement auteurs'!B:B,C126)","v":1}]
[13,134,131499006801,"Complicité              ",18,16,14,0,0,48,0,156,0,null,0,null,{"$f":"COUNTIF('Classement auteurs'!B:B,C127)","v":1}]
[13,135,132060000101,"Bien à l'Ombre          ",11,11,11,0,0,33,0,70,0,null,0,null,{"$f":"COUNTIF('Classement auteurs'!B:B,C128)","v":1}]
[13,136,131956000201,"Solitude urbaine         ",16,14,14,0,0,44,0,9,0,null,0,null,{"$f":"COUNTIF('Classement auteurs'!B:B,C129)","v":1}]
[13,137,131619004501,"Suivez la digue          ",15,18,15,0,0,48,0,78,0,null,0,null,{"$f":"COUNTIF('Classement auteurs'!B:B,C130)","v":1}]
[13,138,131683006901,"Trois hommes et un goret ",19,16,16,0,0,{"$f":"SUM(E131:I131)","v":51},0,126,0,null,0,null,{"$f":"COUNTIF('Classement auteurs'!B:B,C131)","v":1}]
[13,139,132060000401,"L'estacade               ",15,15,13,0,0,43,0,125,0,null,0,null,{"$f":"COUNTIF('Classement auteurs'!B:B,C132)","v":1}]
[13,140,132060001401,"Scène de vie            ",13,8,14,0,0,35,0,86,0,null,0,null,{"$f":"COUNTIF('Classement auteurs'!B:B,C133)","v":1}]
[13,141,131499003901,"Plage d'hiver            ",15,11,14,0,0,40,0,59,0,null,0,null,{"$f":"COUNTIF('Classement auteurs'!B:B,C134)","v":1}]
[13,142,131845001401,"Sous le cône            ",13,17,18,0,0,48,0,123,0,null,0,null,{"$f":"COUNTIF('Classement auteurs'!B:B,C135)","v":1}]
[13,143,131956004601,"Le Mont chauve, Géant de Provence",18,17,15,0,0,50,0,10,0,null,0,null,{"$f":"COUNTIF('Classement auteurs'!B:B,C136)","v":1}]
[13,144,131499010601,"Sur les marches          ",13,12,12,0,0,37,0,106,0,null,0,null,{"$f":"COUNTIF('Classement auteurs'!B:B,C137)","v":1}]
[13,145,131956003401,"Influence                ",13,10,11,0,0,34,0,75,0,null,0,null,{"$f":"COUNTIF('Classement auteurs'!B:B,C138)","v":1}]
[13,146,131499010501,"Spirituals               ",14,16,17,0,0,47,0,38,0,null,0]
[13,147,132060001201,"Vis-à-Vis               ",12,14,13,0,0,39,0,119,0,null,0]
[13,148,130925007601,"Femme hmong              ",15,14,14,0,0,43,0,30,0,null,0]
[13,149,130925007701,"Le Vélo                 ",18,16,14,0,0,48,0,57,0,null,0]
[13,150,131956002901,"Victoire de la beauté   ",15,10,15,0,0,40,0,157,0,null,0]
[13,151,131499006901,"Là haut                 ",16,16,11,0,0,43,0,142,0,null,0]
[13,152,131353007401,"Marché d'Arequipa Pérou",12,15,13,0,0,40,0,56,0,null,0]
[13,153,130527017001,"L'envol...               ",15,7,9,0,0,31,0,94,0,null,0]
[13,154,131353007301,"Marché d'Ampato Equateur",14,12,12,0,0,38,0,151,0,null,0]
[13,155,130527009401,"Matinale...              ",16,14,16,0,0,46,0,73,0,null,0]
[13,156,131956005701,"L'attente                ",11,13,10,0,0,34,0,21,0,null,0]
[13,157,131956000601,"Tour CMA-CGM             ",12,16,13,0,0,41,0,41,0,null,0]
[13,158,131845002101,"Vertige                  ",13,13,16,0,0,42,0,13,0,null,0]
[13,159,131879000601,"Albi                     ",13,10,11,0,0,34,0,68,0,null,0]
[13,160,131956006201,"Le maître de la horde   ",14,14,11,0,0,39,0,29,0,null,0]
[13,161,131683006501,"Au travers               ",17,7,10,0,0,34,0,60,0,null,0]
[13,162,132086002501,"Petit Gitan              ",12,13,13,0,0,38,0,154,0,null,0]
[13,163,131956005401,"La dame en noir          ",12,10,12,0,0,34,0,58,0,null,0]
[13,164,130987002301,"Clic                     ",15,14,11,0,0,40,0,6,0,null,0]
[13,165,131499003601,"Préfouns                ",14,10,11,0,0,35,0,133,0,null,0]
[13,166,131956002601,"Soupir                   ",13,17,14,0,0,44,0,98,0,null,0]
[13,167,131619004601,"Axe majeur               ",14,11,14,0,0,39,0,52,0,null,0]
[13,168,131353000101,"Avec maman               ",15,18,13,0,0,46,0,61,0,null,0]
[13,169,131353000701,"Solitaire                ",12,13,14,0,0,39,0,53,0,null,0]
[13,170,131353000201,"Pigeons                  ",9,8,8,0,0,25,0,130,0,null,0]

{"sheet":"Défi-4","index":6,"n_rows":143,"n_cols":17,"rows_kept":143,"cut":false,"hidden":false,"merged":[]}
["colis","photologic","fichier","titre","note1","note2","note3","note4","note5","total","place","passage","statut","medaille","retenue",null,"0=absent\n1=présent"]
[13,1,130878015201,"Je m'amuse               ",6,6,6,0,0,{"$f":"SUM(E2:I2)","v":18},0,37,0,null,0,null,{"$f":"COUNTIF('Classement auteurs'!B:B,C2)","v":1}]
[13,2,130000020401,"La Goutte                ",10,13,12,0,0,{"$f":"SUM(E3:I3)","v":35},0,103,6,null,0,null,{"$f":"COUNTIF('Classement auteurs'!B:B,C3)","v":1}]
[13,3,131499008701,"Symbiose                 ",12,11,10,0,0,33,0,18,0,null,0,null,{"$f":"COUNTIF('Classement auteurs'!B:B,C4)","v":1}]
[13,4,131879000501,"Calin                    ",14,13,14,0,0,41,0,89,0,null,0,null,{"$f":"COUNTIF('Classement auteurs'!B:B,C5)","v":1}]
[13,5,131110001001,"Quietude                 ",15,14,18,0,0,47,0,71,0,null,0,null,{"$f":"COUNTIF('Classement auteurs'!B:B,C6)","v":1}]
[13,6,130878013301,"Desert                   ",11,11,14,0,0,36,0,142,0,null,0,null,{"$f":"COUNTIF('Classement auteurs'!B:B,C7)","v":1}]
[13,7,132193000301,"Survol de la mer de glace",14,15,16,0,0,45,0,140,0,null,0,null,{"$f":"COUNTIF('Classement auteurs'!B:B,C8)","v":1}]
[13,8,130987028201,"La sieste du rhino blanc ",11,11,9,0,0,31,0,26,0,null,0,null,{"$f":"COUNTIF('Classement auteurs'!B:B,C9)","v":1}]
[13,9,130987024101,"Chevèchette perlée     ",16,16,14,0,0,46,0,28,0,null,0,null,{"$f":"COUNTIF('Classement auteurs'!B:B,C10)","v":1}]
[13,10,130987030301,"Coquelicot du Lot        ",10,10,6,0,0,26,0,141,0,null,0,null,{"$f":"COUNTIF('Classement auteurs'!B:B,C11)","v":1}]
[13,11,131683008001,"Sentinelle du désert    ",13,13,13,0,0,39,0,58,0,null,0,null,{"$f":"COUNTIF('Classement auteurs'!B:B,C12)","v":1}]
[13,12,130987013801,"Lever de soleil après la pluie",14,15,13,0,0,42,0,73,0,null,0,null,{"$f":"COUNTIF('Classement auteurs'!B:B,C13)","v":1}]
[13,14,130993015101,"En suspension            ",14,16,13,0,0,43,0,9,0,null,0,null,{"$f":"COUNTIF('Classement auteurs'!B:B,C14)","v":1}]
[13,16,132147001701,"L'herbe et le vent...    ",12,8,7,0,0,27,0,101,0,null,0,null,{"$f":"COUNTIF('Classement auteurs'!B:B,C15)","v":1}]
[13,17,131376017601,"Ombre chinoise           ",13,10,12,0,0,35,0,107,0,null,0,null,{"$f":"COUNTIF('Classement auteurs'!B:B,C16)","v":1}]
[13,18,131494000201,"Envol                    ",10,11,14,0,0,35,0,6,0,null,0,null,{"$f":"COUNTIF('Classement auteurs'!B:B,C17)","v":1}]
[13,19,131683006301,"Mésange et chardons     ",15,16,16,0,0,47,0,125,0,null,0,null,{"$f":"COUNTIF('Classement auteurs'!B:B,C18)","v":1}]
[13,20,130993013301,"Le repas du Rollier      ",14,17,16,0,0,47,0,34,0,null,0,null,{"$f":"COUNTIF('Classement auteurs'!B:B,C19)","v":1}]
[13,21,130987015701,"Thomise                  ",14,14,13,0,0,41,0,3,0,null,0,null,{"$f":"COUNTIF('Classement auteurs'!B:B,C20)","v":1}]
[13,22,130527009201,"On partage ?             ",12,13,15,0,0,40,0,123,0,null,0,null,{"$f":"COUNTIF('Classement auteurs'!B:B,C21)","v":1}]
[13,23,130987016601,"Lac guichard             ",13,12,13,0,0,38,0,106,0,null,0,null,{"$f":"COUNTIF('Classement auteurs'!B:B,C22)","v":1}]
[13,24,131683005101,"HERON                    ",15,15,14,0,0,44,0,42,0,null,0,null,{"$f":"COUNTIF('Classement auteurs'!B:B,C23)","v":1}]
[13,25,130987024201,"Jeux interdits           ",14,17,14,0,0,45,0,65,0,null,0,null,{"$f":"COUNTIF('Classement auteurs'!B:B,C24)","v":1}]
[13,26,131956004501,"Campanules               ",12,12,13,0,0,37,0,52,0,null,0,null,{"$f":"COUNTIF('Classement auteurs'!B:B,C25)","v":1}]
[13,27,130527012401,"Milan                    ",15,17,15,0,0,47,0,128,0,null,0,null,{"$f":"COUNTIF('Classement auteurs'!B:B,C26)","v":1}]
[13,28,132193001201,"Mes tourterelles         ",13,9,15,0,0,37,0,82,0,null,0,null,{"$f":"COUNTIF('Classement auteurs'!B:B,C27)","v":1}]
[13,30,131376017701,"Solaire                  ",6,6,6,0,0,18,0,94,0,null,0,null,{"$f":"COUNTIF('Classement auteurs'!B:B,C28)","v":1}]
[13,31,132084003501,"Leopard dans le delta de l'okavango",14,14,12,0,0,40,0,51,0,null,0,null,{"$f":"COUNTIF('Classement auteurs'!B:B,C29)","v":1}]
[13,32,131845000201,"Au vol                   ",6,6,6,0,0,18,0,53,0,null,0,null,{"$f":"COUNTIF('Classement auteurs'!B:B,C30)","v":1}]
[13,33,131845000101,"Surveillance de la marée",6,6,6,0,0,18,0,116,0,null,0,null,{"$f":"COUNTIF('Classement auteurs'!B:B,C31)","v":1}]
[13,34,132084002301,"Mamooth lake             ",16,13,14,0,0,43,0,25,0,null,0,null,{"$f":"COUNTIF('Classement auteurs'!B:B,C32)","v":1}]
[13,35,131353000201,"Butinage                 ",12,13,11,0,0,36,0,1,0,null,0,null,{"$f":"COUNTIF('Classement auteurs'!B:B,C33)","v":1}]
[13,36,132084003601,"Mini la grenouille       ",17,18,20,0,0,55,0,137,0,null,0,null,{"$f":"COUNTIF('Classement auteurs'!B:B,C34)","v":1}]
[13,37,131683007901,"Kiai                     ",16,20,15,0,0,51,0,7,0,null,0,null,{"$f":"COUNTIF('Classement auteurs'!B:B,C35)","v":1}]
[13,38,131110000901,"Rosée                   ",16,12,15,0,0,43,0,22,0,null,0,null,{"$f":"COUNTIF('Classement auteurs'!B:B,C36)","v":1}]
[13,39,131110001101,"Fleur sauvage            ",13,14,9,0,0,36,0,113,0,null,0,null,{"$f":"COUNTIF('Classement auteurs'!B:B,C37)","v":1}]
[13,40,130000019901,"Phacélie                ",6,10,8,0,0,24,0,72,6,null,0,null,{"$f":"COUNTIF('Classement auteurs'!B:B,C38)","v":1}]
[13,41,130462001101,"Apres la pluie           ",18,12,15,0,0,45,0,105,0,null,0,null,{"$f":"COUNTIF('Classement auteurs'!B:B,C39)","v":1}]
[13,42,131494002101,"Atterrissage             ",9,9,7,0,0,25,0,90,0,null,0,null,{"$f":"COUNTIF('Classement auteurs'!B:B,C40)","v":1}]
[13,43,131353004301,"Jeune Cigale             ",16,16,15,0,0,47,0,46,0,null,0,null,{"$f":"COUNTIF('Classement auteurs'!B:B,C41)","v":1}]
[13,44,130878013401,"Sur le nid               ",12,11,12,0,0,35,0,86,0,null,0,null,{"$f":"COUNTIF('Classement auteurs'!B:B,C42)","v":1}]
[13,45,130878007201,"Au sommet                ",12,8,12,0,0,32,0,16,0,null,0,null,{"$f":"COUNTIF('Classement auteurs'!B:B,C43)","v":1}]
[13,46,131992000401,"Nouvelle nature          ",8,6,6,0,0,20,0,84,0,null,0,null,{"$f":"COUNTIF('Classement auteurs'!B:B,C44)","v":1}]
[13,47,131494003201,"Alors, çà mord ?       ",11,8,10,0,0,29,0,131,0,null,0,null,{"$f":"COUNTIF('Classement auteurs'!B:B,C45)","v":1}]
[13,48,130987028401,"Estany de la Comassa     ",8,11,8,0,0,27,0,96,0,null,0,null,{"$f":"COUNTIF('Classement auteurs'!B:B,C46)","v":1}]
[13,49,132086002301,"Sombre-couchant          ",12,12,11,0,0,35,0,41,0,null,0,null,{"$f":"COUNTIF('Classement auteurs'!B:B,C47)","v":1}]
[13,50,130878014301,"Carotte                  ",6,6,6,0,0,18,0,47,0,null,0,null,{"$f":"COUNTIF('Classement auteurs'!B:B,C48)","v":1}]
[13,51,130993012301,"Vautour fauve            ",13,15,12,0,0,40,0,111,0,null,0,null,{"$f":"COUNTIF('Classement auteurs'!B:B,C49)","v":1}]
[13,52,130925010201,"Balanin en balade        ",9,12,12,0,0,33,0,11,0,null,0,null,{"$f":"COUNTIF('Classement auteurs'!B:B,C50)","v":1}]
[13,53,131376011801,"Alcyon                   ",6,6,6,0,0,18,0,130,0,null,0,null,{"$f":"COUNTIF('Classement auteurs'!B:B,C51)","v":1}]
[13,54,131353006101,"Bon appétit             ",14,12,12,0,0,38,0,81,0,null,0,null,{"$f":"COUNTIF('Classement auteurs'!B:B,C52)","v":1}]
[13,55,130527015501,"Fleur                    ",11,11,9,0,0,31,0,49,0,null,0,null,{"$f":"COUNTIF('Classement auteurs'!B:B,C53)","v":1}]
[13,56,131956002601,"Campanule                ",10,10,14,0,0,34,0,62,0,null,0,null,{"$f":"COUNTIF('Classement auteurs'!B:B,C54)","v":1}]
[13,57,131845004001,"Vue du castellet         ",13,9,17,0,0,39,0,121,0,null,0,null,{"$f":"COUNTIF('Classement auteurs'!B:B,C55)","v":1}]
[13,58,131879000801,"Le reflet                ",13,12,15,0,0,40,0,99,0,null,0,null,{"$f":"COUNTIF('Classement auteurs'!B:B,C56)","v":1}]
[13,59,131376018301,"Butineuse                ",13,12,16,0,0,41,0,126,0,null,0,null,{"$f":"COUNTIF('Classement auteurs'!B:B,C57)","v":1}]
[13,60,131499009801,"La becquée              ",18,18,18,0,0,54,0,13,0,null,0,null,{"$f":"COUNTIF('Classement auteurs'!B:B,C58)","v":1}]
[13,61,131499008201,"Portrait buffle oiseau   ",13,12,16,0,0,41,0,5,0,null,0,null,{"$f":"COUNTIF('Classement auteurs'!B:B,C59)","v":1}]
[13,62,131824001901,"Love                     ",19,14,15,0,0,48,0,54,0,null,0,null,{"$f":"COUNTIF('Classement auteurs'!B:B,C60)","v":1}]
[13,63,132084000301,"Face à face             ",7,7,10,0,0,24,0,85,0,null,0,null,{"$f":"COUNTIF('Classement auteurs'!B:B,C61)","v":1}]
[13,64,132089000301,"Giens par grand vent     ",9,11,10,0,0,30,0,127,0,null,0,null,{"$f":"COUNTIF('Classement auteurs'!B:B,C62)","v":1}]
[13,65,130878013001,"Perle de pluie           ",16,9,15,0,0,40,0,43,0,null,0,null,{"$f":"COUNTIF('Classement auteurs'!B:B,C63)","v":1}]
[13,66,130987007401,"La Claree                ",14,11,13,0,0,38,0,134,0,null,0,null,{"$f":"COUNTIF('Classement auteurs'!B:B,C64)","v":1}]
[13,67,130925008701,"Puma                     ",10,14,13,0,0,37,0,8,0,null,0,null,{"$f":"COUNTIF('Classement auteurs'!B:B,C65)","v":1}]
[13,68,131956002901,"Sable d'or               ",10,9,9,0,0,28,0,74,0,null,0,null,{"$f":"COUNTIF('Classement auteurs'!B:B,C66)","v":1}]
[13,69,131499011001,"L'ours blanc et noir     ",14,14,14,0,0,{"$f":"SUM(E67:I67)","v":42},0,133,0,null,0,null,{"$f":"COUNTIF('Classement auteurs'!B:B,C67)","v":1}]
[13,70,132193000501,"Cotton tree              ",6,7,8,0,0,21,0,27,0,null,0,null,{"$f":"COUNTIF('Classement auteurs'!B:B,C68)","v":1}]
[13,71,131376015801,"Butinage                 ",14,13,10,0,0,37,0,15,0,null,0,null,{"$f":"COUNTIF('Classement auteurs'!B:B,C69)","v":1}]
[13,72,131683003301,"Reflets sur la laguna Leija 4340m",17,17,19,0,0,53,0,10,0,null,0,null,{"$f":"COUNTIF('Classement auteurs'!B:B,C70)","v":1}]
[13,73,132203000701,"Tout dans la séduction  ",16,14,15,0,0,45,0,57,0,null,0,null,{"$f":"COUNTIF('Classement auteurs'!B:B,C71)","v":1}]
[13,74,131879002001,"Aras                     ",16,11,14,0,0,41,0,55,0,null,0,null,{"$f":"COUNTIF('Classement auteurs'!B:B,C72)","v":1}]
[13,75,130925007601,"Eléphants du désert    ",12,14,13,0,0,39,0,60,0,null,0,null,{"$f":"COUNTIF('Classement auteurs'!B:B,C73)","v":1}]
[13,76,130925007701,"L'arbre vert             ",15,14,15,0,0,44,0,39,0,null,0,null,{"$f":"COUNTIF('Classement auteurs'!B:B,C74)","v":1}]
[13,77,132086001401,"Butinage                 ",14,17,15,0,0,46,0,77,0,null,0,null,{"$f":"COUNTIF('Classement auteurs'!B:B,C75)","v":1}]
[13,78,130878014101,"Chardon                  ",6,6,6,0,0,18,0,88,0,null,0,null,{"$f":"COUNTIF('Classement auteurs'!B:B,C76)","v":1}]
[13,79,130527013301,"Pelican                  ",15,15,14,0,0,44,0,80,0,null,0,null,{"$f":"COUNTIF('Classement auteurs'!B:B,C77)","v":1}]
[13,80,131499010401,"La vie à deux           ",14,12,15,0,0,41,0,136,0,null,0,null,{"$f":"COUNTIF('Classement auteurs'!B:B,C78)","v":1}]
[13,81,131227008301,"Enlacer                  ",13,13,11,0,0,37,0,17,0,null,0,null,{"$f":"COUNTIF('Classement auteurs'!B:B,C79)","v":1}]
[13,82,130987019601,"Martin-chasseur du Sénégal",15,15,14,0,0,44,0,120,0,null,0,null,{"$f":"COUNTIF('Classement auteurs'!B:B,C80)","v":1}]
[13,83,131862002201,"Scarabé rhino           ",12,8,7,0,0,27,0,124,0,null,0,null,{"$f":"COUNTIF('Classement auteurs'!B:B,C81)","v":1}]
[13,84,130987019701,"Red bishop               ",12,13,14,0,0,39,0,122,0,null,0,null,{"$f":"COUNTIF('Classement auteurs'!B:B,C82)","v":1}]
[13,87,131879001901,"Flamant                  ",13,9,12,0,0,34,0,64,0,null,0,null,{"$f":"COUNTIF('Classement auteurs'!B:B,C83)","v":1}]
[13,88,131956004601,"Neige fraiche au lever du soleil",14,13,11,0,0,38,0,139,0,null,0,null,{"$f":"COUNTIF('Classement auteurs'!B:B,C84)","v":1}]
[13,89,132084004001,"Désert Blanc            ",14,13,13,0,0,40,0,129,0,null,0,null,{"$f":"COUNTIF('Classement auteurs'!B:B,C85)","v":1}]
[13,90,130925009901,"Monstrueuse fracture     ",13,8,11,0,0,32,0,56,0,null,0,null,{"$f":"COUNTIF('Classement auteurs'!B:B,C86)","v":1}]
[13,91,130925009801,"Iguane                   ",12,12,10,0,0,34,0,118,0,null,0,null,{"$f":"COUNTIF('Classement auteurs'!B:B,C87)","v":1}]
[13,92,131956006501,"Butinage                 ",15,12,12,0,0,39,0,114,0,null,0,null,{"$f":"COUNTIF('Classement auteurs'!B:B,C88)","v":1}]
[13,93,131823004901,"Sa trompe énormément   ",15,12,12,0,0,39,0,61,0,null,0,null,{"$f":"COUNTIF('Classement auteurs'!B:B,C89)","v":1}]
[13,94,131376014701,"La mue                   ",14,16,11,0,0,41,0,24,0,null,0,null,{"$f":"COUNTIF('Classement auteurs'!B:B,C90)","v":1}]
[13,95,131683007601,"Hautain                  ",14,15,13,0,0,42,0,33,0,null,0,null,{"$f":"COUNTIF('Classement auteurs'!B:B,C91)","v":1}]
[13,96,131956000201,"Au pied du Viso          ",15,12,14,0,0,41,0,59,0,null,0,null,{"$f":"COUNTIF('Classement auteurs'!B:B,C92)","v":1}]
[13,97,130527009401,"La rivière noire        ",16,18,16,0,0,50,0,87,0,null,0,null,{"$f":"COUNTIF('Classement auteurs'!B:B,C93)","v":1}]
[13,98,132060000701,"Qu'est-ce qu'elle a ma gueule?",12,7,6,0,0,25,0,63,0,null,0,null,{"$f":"COUNTIF('Classement auteurs'!B:B,C94)","v":1}]
[13,99,131879001101,"Envol                    ",13,7,9,0,0,29,0,70,0,null,0,null,{"$f":"COUNTIF('Classement auteurs'!B:B,C95)","v":1}]
[13,100,132060001701,"Lueurs nocturnes         ",12,12,13,0,0,37,0,93,0,null,0,null,{"$f":"COUNTIF('Classement auteurs'!B:B,C96)","v":1}]
[13,101,132060001501,"Quiétude                ",11,8,8,0,0,27,0,4,0,null,0,null,{"$f":"COUNTIF('Classement auteurs'!B:B,C97)","v":1}]
[13,102,130993016601,"Libellule sur Nenuphar   ",15,14,13,0,0,42,0,29,0,null,0,null,{"$f":"COUNTIF('Classement auteurs'!B:B,C98)","v":1}]
[13,103,131499003901,"Les marques du temps     ",13,19,13,0,0,45,0,119,0,null,0,null,{"$f":"COUNTIF('Classement auteurs'!B:B,C99)","v":1}]
[13,104,132086002601,"Renard                   ",14,13,12,0,0,39,0,45,0,null,0,null,{"$f":"COUNTIF('Classement auteurs'!B:B,C100)","v":1}]
[13,105,131499010001,"C'est mon petit          ",14,15,13,0,0,42,0,75,0,null,0,null,{"$f":"COUNTIF('Classement auteurs'!B:B,C101)","v":1}]
[13,106,132060000801,"L'abeille et le nénuphar",13,10,10,0,0,33,0,78,0,null,0,null,{"$f":"COUNTIF('Classement auteurs'!B:B,C102)","v":1}]
[13,107,131499005201,"Mesange                  ",13,12,12,0,0,37,0,12,0,null,0,null,{"$f":"COUNTIF('Classement auteurs'!B:B,C103)","v":1}]
[13,108,131499010801,"Poissons papillon        ",15,10,16,0,0,41,0,66,0,null,0,null,{"$f":"COUNTIF('Classement auteurs'!B:B,C104)","v":1}]
[13,109,132217000101,"Blanc Bleu               ",11,14,12,0,0,37,0,97,0,null,0,null,{"$f":"COUNTIF('Classement auteurs'!B:B,C105)","v":1}]
[13,110,131956005901,"En vol                   ",12,11,10,0,0,33,0,19,0,null,0,null,{"$f":"COUNTIF('Classement auteurs'!B:B,C106)","v":1}]
[13,111,131956002401,"Danseur à cornes        ",12,11,12,0,0,35,0,76,0,null,0,null,{"$f":"COUNTIF('Classement auteurs'!B:B,C107)","v":1}]
[13,112,131227008601,"Lac de monteux           ",13,17,14,0,0,44,0,32,0,null,0,null,{"$f":"COUNTIF('Classement auteurs'!B:B,C108)","v":1}]
[13,113,132147000101,"Cincle plongeur          ",14,13,11,0,0,38,0,38,0,null,0,null,{"$f":"COUNTIF('Classement auteurs'!B:B,C109)","v":1}]
[13,114,132023002201,"La sortie du bain        ",16,16,17,0,0,49,0,109,0,null,0,null,{"$f":"COUNTIF('Classement auteurs'!B:B,C110)","v":1}]
[13,115,131845004101,"Cigognes en Camargue     ",6,9,11,0,0,26,0,135,0,null,0,null,{"$f":"COUNTIF('Classement auteurs'!B:B,C111)","v":1}]
[13,116,131499006901,"Câlin aquatique         ",14,10,15,0,0,39,0,36,0,null,0,null,{"$f":"COUNTIF('Classement auteurs'!B:B,C112)","v":1}]
[13,117,131956001401,"Etang du Vaccarès       ",6,6,6,0,0,18,0,31,0,null,0,null,{"$f":"COUNTIF('Classement auteurs'!B:B,C113)","v":1}]
[13,118,132060001201,"Transparence             ",13,12,15,0,0,40,0,30,0,null,0,null,{"$f":"COUNTIF('Classement auteurs'!B:B,C114)","v":1}]
[13,119,132203001001,"Coucher dans l'herbe     ",6,6,6,0,0,18,0,100,0,null,0,null,{"$f":"COUNTIF('Classement auteurs'!B:B,C115)","v":1}]
[13,120,130987026701,"Miroir et Flamant rose   ",12,12,13,0,0,37,0,110,0,null,0,null,{"$f":"COUNTIF('Classement auteurs'!B:B,C116)","v":1}]
[13,121,131619004501,"Lac Lavoir               ",16,15,15,0,0,46,0,79,0,null,0,null,{"$f":"COUNTIF('Classement auteurs'!B:B,C117)","v":1}]
[13,122,132060000401,"En pêche                ",13,12,11,0,0,36,0,115,0,null,0,null,{"$f":"COUNTIF('Classement auteurs'!B:B,C118)","v":1}]
[13,123,132060000901,"Martin pêcheur à l'affût",11,15,12,0,0,38,0,91,0,null,0,null,{"$f":"COUNTIF('Classement auteurs'!B:B,C119)","v":1}]
[13,124,130527002501,"Sphins                   ",10,11,9,0,0,30,0,40,0,null,0,null,{"$f":"COUNTIF('Classement auteurs'!B:B,C120)","v":1}]
[13,125,130987023901,"Avant l'orage            ",13,13,9,0,0,35,0,132,0,null,0,null,{"$f":"COUNTIF('Classement auteurs'!B:B,C121)","v":1}]
[13,126,130987001601,"Iceland                  ",13,12,7,0,0,32,0,48,0,null,0,null,{"$f":"COUNTIF('Classement auteurs'!B:B,C122)","v":1}]
[13,127,131499006801,"Le Butineur              ",17,18,17,0,0,52,0,68,0,null,0,null,{"$f":"COUNTIF('Classement auteurs'!B:B,C123)","v":1}]
[13,128,130993010201,"Vulpes vulpes            ",15,12,14,0,0,41,0,98,0,null,0,null,{"$f":"COUNTIF('Classement auteurs'!B:B,C124)","v":1}]
[13,129,130921006401,"En attendant le poisson  ",13,11,10,0,0,34,0,117,0,null,0,null,{"$f":"COUNTIF('Classement auteurs'!B:B,C125)","v":1}]
[13,130,131353006201,"Bientôt du miel         ",14,12,9,0,0,35,0,50,0,null,0,null,{"$f":"COUNTIF('Classement auteurs'!B:B,C126)","v":1}]
[13,131,132060001801,"Aurore... presque boréale !",8,8,6,0,0,22,0,108,0,null,0,null,{"$f":"COUNTIF('Classement auteurs'!B:B,C127)","v":1}]
[13,132,131879000601,"Solfatare en Islande     ",10,13,8,0,0,31,0,95,0,null,0,null,{"$f":"COUNTIF('Classement auteurs'!B:B,C128)","v":1}]
[13,133,130987002301,"Sapajous Brun            ",11,14,14,0,0,39,0,102,0,null,0,null,{"$f":"COUNTIF('Classement auteurs'!B:B,C129)","v":1}]
[13,134,131683002601,"Chouette de Tengmalm     ",20,18,18,0,0,56,0,14,0,null,0,null,{"$f":"COUNTIF('Classement auteurs'!B:B,C130)","v":1}]
[13,135,131499010501,"Saut de bonite           ",15,13,13,0,0,{"$f":"SUM(E131:I131)","v":41},0,2,0,null,0,null,{"$f":"COUNTIF('Classement auteurs'!B:B,C131)","v":1}]
[13,136,131499010601,"Goutte de bec            ",8,13,11,0,0,32,0,23,0,null,0,null,{"$f":"COUNTIF('Classement auteurs'!B:B,C132)","v":1}]
[13,137,130925010501,"Le temps des amours      ",15,13,13,0,0,41,0,67,0,null,0,null,{"$f":"COUNTIF('Classement auteurs'!B:B,C133)","v":1}]
[13,138,131956005701,"Rencontre par surprise   ",11,10,7,0,0,28,0,69,0,null,0,null,{"$f":"COUNTIF('Classement auteurs'!B:B,C134)","v":1}]
[13,139,131845001401,"Affût                   ",14,11,14,0,0,39,0,35,0,null,0,null,{"$f":"COUNTIF('Classement auteurs'!B:B,C135)","v":1}]
[13,140,131683006501,"Jonquille                ",12,10,8,0,0,30,0,138,0,null,0,null,{"$f":"COUNTIF('Classement auteurs'!B:B,C136)","v":1}]
[13,141,131499010101,"En retard                ",16,7,8,0,0,31,0,104,0,null,0,null,{"$f":"COUNTIF('Classement auteurs'!B:B,C137)","v":1}]
[13,142,130527017001,"A chacun sa chevelure ...",12,11,6,0,0,29,0,112,0,null,0,null,{"$f":"COUNTIF('Classement auteurs'!B:B,C138)","v":1}]
[13,143,130987025001,"Caillou sur la plage     ",13,10,7,0,0,30,0,44,0,null,0]
[13,144,131823006401,"Fusion                   ",13,12,12,0,0,37,0,83,0,null,0]
[13,145,131823004201,"Ourlé de blanc          ",13,9,7,0,0,29,0,21,0,null,0]
[13,146,131353000101,"Criquet                  ",13,19,15,0,0,47,0,20,0,null,0]
[13,147,131353000701,"Mante religieuse         ",20,20,17,0,0,57,0,92,0,null,0]

{"sheet":"Défi-5","index":7,"n_rows":165,"n_cols":17,"rows_kept":165,"cut":false,"hidden":false,"merged":[]}
["colis","photologic","fichier","titre","note1","note2","note3","note4","note5","total","place","passage","statut","medaille","retenue",null,"0=absent\n1=présent"]
[13,1,131494003001,"Reflet nocturne          ",10,7,7,0,0,{"$f":"SUM(E2:I2)","v":24},0,120,0,null,0,null,{"$f":"COUNTIF('Classement auteurs'!B:B,C2)","v":1}]
[13,2,131823008301,"Promenade                ",14,15,13,0,0,{"$f":"SUM(E3:I3)","v":42},0,143,0,null,0,null,{"$f":"COUNTIF('Classement auteurs'!B:B,C3)","v":1}]
[13,3,132147000101,"Reflet Vénitien         ",11,15,10,0,0,36,0,33,0,null,0,null,{"$f":"COUNTIF('Classement auteurs'!B:B,C4)","v":1}]
[13,4,130987024101,"La caravane              ",11,19,14,0,0,44,0,149,0,null,0,null,{"$f":"COUNTIF('Classement auteurs'!B:B,C5)","v":1}]
[13,6,130527002501,"Tacle                    ",7,11,14,0,0,32,0,164,0,null,0,null,{"$f":"COUNTIF('Classement auteurs'!B:B,C6)","v":1}]
[13,7,132023000101,"Cabanes de pêcheurs     ",11,10,15,0,0,36,0,4,0,null,0,null,{"$f":"COUNTIF('Classement auteurs'!B:B,C7)","v":1}]
[13,8,132084004001,"La négociation          ",11,18,13,0,0,42,0,96,0,null,0,null,{"$f":"COUNTIF('Classement auteurs'!B:B,C8)","v":1}]
[13,9,131683008101,"Lola                     ",14,14,15,0,0,43,0,69,0,null,0,null,{"$f":"COUNTIF('Classement auteurs'!B:B,C9)","v":1}]
[13,10,130987019701,"Face à face             ",14,10,13,0,0,37,0,86,0,null,0,null,{"$f":"COUNTIF('Classement auteurs'!B:B,C10)","v":1}]
[13,11,130987019601,"Les pénitents           ",10,7,17,0,0,34,0,88,0,null,0,null,{"$f":"COUNTIF('Classement auteurs'!B:B,C11)","v":1}]
[13,13,130878013601,"En attente               ",8,12,14,0,0,34,0,18,0,null,0,null,{"$f":"COUNTIF('Classement auteurs'!B:B,C12)","v":1}]
[13,14,130993012301,"Flamenco                 ",13,13,15,0,0,41,0,106,0,null,0,null,{"$f":"COUNTIF('Classement auteurs'!B:B,C13)","v":1}]
[13,15,132086002301,"Tourbillon d'or          ",12,8,12,0,0,32,0,25,0,null,0,null,{"$f":"COUNTIF('Classement auteurs'!B:B,C14)","v":1}]
[13,16,130987028401,"Au bout... de la Presqu'île",11,14,11,0,0,36,0,65,0,null,0,null,{"$f":"COUNTIF('Classement auteurs'!B:B,C15)","v":1}]
[13,17,130987013801,"Gymnaste en compétition ",11,18,13,0,0,42,0,153,0,null,0,null,{"$f":"COUNTIF('Classement auteurs'!B:B,C16)","v":1}]
[13,18,131376012601,"Jour de neige            ",14,14,6,0,0,34,0,22,0,null,0,null,{"$f":"COUNTIF('Classement auteurs'!B:B,C17)","v":1}]
[13,19,131956002901,"Regard                   ",7,10,11,0,0,28,0,61,0,null,0,null,{"$f":"COUNTIF('Classement auteurs'!B:B,C18)","v":1}]
[13,20,132084001701,"Eglise                   ",14,15,12,0,0,41,0,78,0,null,0,null,{"$f":"COUNTIF('Classement auteurs'!B:B,C19)","v":1}]
[13,21,131376011801,"Moines du Djokang        ",13,18,15,0,0,46,0,111,0,null,0,null,{"$f":"COUNTIF('Classement auteurs'!B:B,C20)","v":1}]
[13,22,130993013801,"Promeneur du soir        ",13,14,11,0,0,38,0,110,0,null,0,null,{"$f":"COUNTIF('Classement auteurs'!B:B,C21)","v":1}]
[13,23,132060000101,"FETE AU CHATEAU          ",9,16,9,0,0,34,0,115,0,null,0,null,{"$f":"COUNTIF('Classement auteurs'!B:B,C22)","v":1}]
[13,24,131823004901,"Dans les bras de Morphée",11,15,15,0,0,41,0,35,0,null,0,null,{"$f":"COUNTIF('Classement auteurs'!B:B,C23)","v":1}]
[13,25,131824001901,"Un matin sur ma planète ",16,15,13,0,0,44,0,107,0,null,0,null,{"$f":"COUNTIF('Classement auteurs'!B:B,C24)","v":1}]
[13,26,130878015801,"Laveur d'Affiche         ",18,13,18,0,0,49,0,32,0,null,0,null,{"$f":"COUNTIF('Classement auteurs'!B:B,C25)","v":1}]
[13,28,131499006801,"Fauteuil Rouge           ",8,15,19,0,0,42,0,67,0,null,0,null,{"$f":"COUNTIF('Classement auteurs'!B:B,C26)","v":1}]
[13,29,131879000101,"Cerisiers en fleurs      ",8,12,8,0,0,28,0,77,0,null,0,null,{"$f":"COUNTIF('Classement auteurs'!B:B,C27)","v":1}]
[13,30,132084000201,"Tristesse                ",13,15,10,0,0,38,0,104,0,null,0,null,{"$f":"COUNTIF('Classement auteurs'!B:B,C28)","v":1}]
[13,31,131879001101,"Couleurs d'automne       ",13,13,12,0,0,38,0,128,0,null,0,null,{"$f":"COUNTIF('Classement auteurs'!B:B,C29)","v":1}]
[13,32,130878013401,"Lady                     ",8,11,11,0,0,30,0,47,0,null,0,null,{"$f":"COUNTIF('Classement auteurs'!B:B,C30)","v":1}]
[13,33,131683006901,"Un p'tit coin de parapluie",17,13,11,0,0,41,0,75,0,null,0,null,{"$f":"COUNTIF('Classement auteurs'!B:B,C31)","v":1}]
[13,34,131683007001,"Ordre décroissant       ",9,14,10,0,0,33,0,157,0,null,0,null,{"$f":"COUNTIF('Classement auteurs'!B:B,C32)","v":1}]
[13,35,130993015401,"La cabanne du peuchère  ",9,11,11,0,0,31,0,63,0,null,0,null,{"$f":"COUNTIF('Classement auteurs'!B:B,C33)","v":1}]
[13,36,130987007401,"Orage imminent           ",10,15,12,0,0,37,0,41,0,null,0,null,{"$f":"COUNTIF('Classement auteurs'!B:B,C34)","v":1}]
[13,37,132217000601,"Ancienne taverne crétoise",8,10,11,0,0,29,0,7,0,null,0,null,{"$f":"COUNTIF('Classement auteurs'!B:B,C35)","v":1}]
[13,38,132193000301,"Solfar                   ",13,13,12,0,0,38,0,159,0,null,0,null,{"$f":"COUNTIF('Classement auteurs'!B:B,C36)","v":1}]
[13,39,131879002001,"Procession               ",12,13,13,0,0,38,0,20,0,null,0,null,{"$f":"COUNTIF('Classement auteurs'!B:B,C37)","v":1}]
[13,40,131879001301,"Regard                   ",18,14,10,0,0,42,0,38,0,null,0,null,{"$f":"COUNTIF('Classement auteurs'!B:B,C38)","v":1}]
[13,41,132203000601,"Soir                     ",11,7,10,0,0,28,0,72,0,null,0,null,{"$f":"COUNTIF('Classement auteurs'!B:B,C39)","v":1}]
[13,42,130878014301,"Bulle colorée           ",10,9,10,0,0,29,0,100,0,null,0,null,{"$f":"COUNTIF('Classement auteurs'!B:B,C40)","v":1}]
[13,43,131879000501,"Contemplation            ",13,10,16,0,0,39,0,68,0,null,0,null,{"$f":"COUNTIF('Classement auteurs'!B:B,C41)","v":1}]
[13,44,131683007901,"M à Venise              ",19,20,19,0,0,58,0,5,0,null,0,null,{"$f":"COUNTIF('Classement auteurs'!B:B,C42)","v":1}]
[13,46,131499008701,"Harmonie                 ",9,14,11,0,0,34,0,112,0,null,0,null,{"$f":"COUNTIF('Classement auteurs'!B:B,C43)","v":1}]
[13,47,130987015701,"Beauté voilée          ",12,16,18,0,0,46,0,21,0,null,0,null,{"$f":"COUNTIF('Classement auteurs'!B:B,C44)","v":1}]
[13,48,130000020401,"LUMA - Architecture de Demain",12,19,12,0,0,43,0,155,6,null,0,null,{"$f":"COUNTIF('Classement auteurs'!B:B,C45)","v":1}]
[13,49,130878007201,"Photosphore              ",12,13,10,0,0,35,0,73,0,null,0,null,{"$f":"COUNTIF('Classement auteurs'!B:B,C46)","v":1}]
[13,51,131376018301,"Marché de nuit          ",9,18,17,0,0,44,0,14,0,null,0,null,{"$f":"COUNTIF('Classement auteurs'!B:B,C47)","v":1}]
[13,52,132193001901,"Flamboyant ciel          ",14,12,13,0,0,39,0,133,0,null,0,null,{"$f":"COUNTIF('Classement auteurs'!B:B,C48)","v":1}]
[13,53,131956003401,"Bise                     ",9,12,12,0,0,33,0,139,0,null,0,null,{"$f":"COUNTIF('Classement auteurs'!B:B,C49)","v":1}]
[13,54,131353000201,"Petit garçon au chapeau ",10,15,12,0,0,37,0,151,0,null,0,null,{"$f":"COUNTIF('Classement auteurs'!B:B,C50)","v":1}]
[13,55,131227008301,"Bord du Rhône           ",14,9,11,0,0,34,0,98,0,null,0,null,{"$f":"COUNTIF('Classement auteurs'!B:B,C51)","v":1}]
[13,56,131992000401,"J'aime l'école          ",12,18,15,0,0,45,0,44,0,null,0,null,{"$f":"COUNTIF('Classement auteurs'!B:B,C52)","v":1}]
[13,57,131899000801,"Furtive                  ",19,9,13,0,0,41,0,11,0,null,0,null,{"$f":"COUNTIF('Classement auteurs'!B:B,C53)","v":1}]
[13,58,131992000301,"Contournement.           ",12,9,10,0,0,31,0,40,0,null,0,null,{"$f":"COUNTIF('Classement auteurs'!B:B,C54)","v":1}]
[13,59,132023002201,"La porte de l'ecole      ",12,18,13,0,0,43,0,31,0,null,0,null,{"$f":"COUNTIF('Classement auteurs'!B:B,C55)","v":1}]
[13,60,131683007601,"Sous terre               ",9,11,12,0,0,32,0,156,0,null,0,null,{"$f":"COUNTIF('Classement auteurs'!B:B,C56)","v":1}]
[13,61,131823007601,"Gardian                  ",11,8,11,0,0,30,0,137,0,null,0,null,{"$f":"COUNTIF('Classement auteurs'!B:B,C57)","v":1}]
[13,62,132060001801,"Sérénité              ",14,16,17,0,0,47,0,144,0,null,0,null,{"$f":"COUNTIF('Classement auteurs'!B:B,C58)","v":1}]
[13,64,131499011001,"Le C                     ",18,16,17,0,0,51,0,54,0,null,0,null,{"$f":"COUNTIF('Classement auteurs'!B:B,C59)","v":1}]
[13,65,130987024201,"Danse des esprits        ",9,14,16,0,0,39,0,101,0,null,0,null,{"$f":"COUNTIF('Classement auteurs'!B:B,C60)","v":1}]
[13,66,131110001101,"Chanteur de blues        ",17,17,11,0,0,45,0,79,0,null,0,null,{"$f":"COUNTIF('Classement auteurs'!B:B,C61)","v":1}]
[13,67,132193000401,"Promenade dans les ocres ",9,15,9,0,0,33,0,82,0,null,0,null,{"$f":"COUNTIF('Classement auteurs'!B:B,C62)","v":1}]
[13,68,132060001701,"Pause café              ",11,12,14,0,0,37,0,87,0,null,0,null,{"$f":"COUNTIF('Classement auteurs'!B:B,C63)","v":1}]
[13,69,130878014101,"Echoué                  ",17,20,19,0,0,56,0,26,0,null,0,null,{"$f":"COUNTIF('Classement auteurs'!B:B,C64)","v":1}]
[13,71,131499009801,"Mon beau miroir          ",13,16,13,0,0,42,0,39,0,null,0,null,{"$f":"COUNTIF('Classement auteurs'!B:B,C65)","v":1}]
[13,72,131499010401,"Filets du petit matin    ",12,15,14,0,0,41,0,76,0,null,0,null,{"$f":"COUNTIF('Classement auteurs'!B:B,C66)","v":1}]
[13,73,132084003501,"Le chemin des couleurs   ",11,14,13,0,0,{"$f":"SUM(E67:I67)","v":38},0,113,0,null,0,null,{"$f":"COUNTIF('Classement auteurs'!B:B,C67)","v":1}]
[13,74,131956001401,"Virage Gondole           ",9,14,12,0,0,35,0,9,0,null,0,null,{"$f":"COUNTIF('Classement auteurs'!B:B,C68)","v":1}]
[13,75,131879000801,"La fille au masque       ",11,12,13,0,0,36,0,74,0,null,0,null,{"$f":"COUNTIF('Classement auteurs'!B:B,C69)","v":1}]
[13,76,132023001701,"Mongolfière             ",11,14,13,0,0,38,0,141,0,null,0,null,{"$f":"COUNTIF('Classement auteurs'!B:B,C70)","v":1}]
[13,77,131619004601,"Pêche en Brenne         ",13,17,13,0,0,43,0,146,0,null,0,null,{"$f":"COUNTIF('Classement auteurs'!B:B,C71)","v":1}]
[13,78,132193000501,"La Nuit du carrefour     ",13,15,13,0,0,41,0,90,0,null,0,null,{"$f":"COUNTIF('Classement auteurs'!B:B,C72)","v":1}]
[13,79,130000019901,"Paris                    ",9,13,15,0,0,37,0,81,6,null,0,null,{"$f":"COUNTIF('Classement auteurs'!B:B,C73)","v":1}]
[13,80,131499010101,"Aurore                   ",10,12,12,0,0,34,0,136,0,null,0,null,{"$f":"COUNTIF('Classement auteurs'!B:B,C74)","v":1}]
[13,81,132084003601,"Voie en couleur          ",9,14,12,0,0,35,0,119,0,null,0,null,{"$f":"COUNTIF('Classement auteurs'!B:B,C75)","v":1}]
[13,82,131499010301,"Face au large            ",19,16,15,0,0,50,0,114,0,null,0,null,{"$f":"COUNTIF('Classement auteurs'!B:B,C76)","v":1}]
[13,83,132193001201,"Meton au lever de soleil ",10,13,14,0,0,37,0,129,0,null,0,null,{"$f":"COUNTIF('Classement auteurs'!B:B,C77)","v":1}]
[13,84,131499010001,"Olivia Ruiz aux Nuits du Sud",11,15,16,0,0,42,0,48,0,null,0,null,{"$f":"COUNTIF('Classement auteurs'!B:B,C78)","v":1}]
[13,86,130527015501,"Couleurs                 ",9,12,11,0,0,32,0,162,0,null,0,null,{"$f":"COUNTIF('Classement auteurs'!B:B,C79)","v":1}]
[13,87,130993014001,"Le passage               ",11,8,12,0,0,31,0,66,0,null,0,null,{"$f":"COUNTIF('Classement auteurs'!B:B,C80)","v":1}]
[13,88,131353006101,"Regard bleu              ",10,14,12,0,0,36,0,15,0,null,0,null,{"$f":"COUNTIF('Classement auteurs'!B:B,C81)","v":1}]
[13,89,131499008201,"L'arrêt de bus          ",13,17,19,0,0,49,0,140,0,null,0,null,{"$f":"COUNTIF('Classement auteurs'!B:B,C82)","v":1}]
[13,90,131683006301,"Blanc                    ",16,17,12,0,0,45,0,138,0,null,0,null,{"$f":"COUNTIF('Classement auteurs'!B:B,C83)","v":1}]
[13,91,131353003001,"Femme Nature             ",9,16,10,0,0,35,0,28,0,null,0,null,{"$f":"COUNTIF('Classement auteurs'!B:B,C84)","v":1}]
[13,92,131353007101,"Bravo!                   ",9,15,13,0,0,37,0,2,0,null,0,null,{"$f":"COUNTIF('Classement auteurs'!B:B,C85)","v":1}]
[13,93,131110000901,"Le cycliste              ",16,14,11,0,0,41,0,58,0,null,0,null,{"$f":"COUNTIF('Classement auteurs'!B:B,C86)","v":1}]
[13,94,131499005201,"Femme au chapeau         ",9,17,13,0,0,39,0,94,0,null,0,null,{"$f":"COUNTIF('Classement auteurs'!B:B,C87)","v":1}]
[13,95,131499003901,"Campagne beaujolaise     ",19,12,8,0,0,39,0,109,0,null,0,null,{"$f":"COUNTIF('Classement auteurs'!B:B,C88)","v":1}]
[13,96,131879000901,"Corvette                 ",9,8,12,0,0,29,0,126,0,null,0,null,{"$f":"COUNTIF('Classement auteurs'!B:B,C89)","v":1}]
[13,97,131494000201,"Voile  7                 ",16,9,12,0,0,37,0,80,0,null,0,null,{"$f":"COUNTIF('Classement auteurs'!B:B,C90)","v":1}]
[13,98,131683006601,"Balade nocturne          ",14,18,17,0,0,49,0,49,0,null,0,null,{"$f":"COUNTIF('Classement auteurs'!B:B,C91)","v":1}]
[13,99,131353004301,"Eventail                 ",10,7,7,0,0,24,0,59,0,null,0,null,{"$f":"COUNTIF('Classement auteurs'!B:B,C92)","v":1}]
[13,100,131494002301,"Dans le sable.           ",10,16,16,0,0,42,0,13,0,null,0,null,{"$f":"COUNTIF('Classement auteurs'!B:B,C93)","v":1}]
[13,101,132203000701,"Le p'tit café! place Garibaldi.....",11,15,14,0,0,40,0,45,0,null,0,null,{"$f":"COUNTIF('Classement auteurs'!B:B,C94)","v":1}]
[13,103,130925009901,"Exposition Universelle Milan",9,15,13,0,0,37,0,56,0,null,0,null,{"$f":"COUNTIF('Classement auteurs'!B:B,C95)","v":1}]
[13,105,131845003401,"Et danse la peinture     ",11,16,13,0,0,40,0,37,0,null,0,null,{"$f":"COUNTIF('Classement auteurs'!B:B,C96)","v":1}]
[13,106,131376014701,"Le père et l'enfant     ",14,17,13,0,0,44,0,158,0,null,0,null,{"$f":"COUNTIF('Classement auteurs'!B:B,C97)","v":1}]
[13,107,131956004601,"Graphismes camarguais    ",10,9,8,0,0,27,0,10,0,null,0,null,{"$f":"COUNTIF('Classement auteurs'!B:B,C98)","v":1}]
[13,108,131956006101,"Dans les nuages          ",14,14,14,0,0,42,0,62,0,null,0,null,{"$f":"COUNTIF('Classement auteurs'!B:B,C99)","v":1}]
[13,109,130462009601,"Sticky Boys              ",13,10,12,0,0,35,0,116,0,null,0,null,{"$f":"COUNTIF('Classement auteurs'!B:B,C100)","v":1}]
[13,110,131899003801,"Bord de mer              ",11,13,13,0,0,37,0,53,0,null,0,null,{"$f":"COUNTIF('Classement auteurs'!B:B,C101)","v":1}]
[13,111,131956006501,"éclosion                ",11,14,11,0,0,36,0,42,0,null,0,null,{"$f":"COUNTIF('Classement auteurs'!B:B,C102)","v":1}]
[13,112,131683008001,"Dans la chaleur des moteurs",16,17,19,0,0,52,0,57,0,null,0,null,{"$f":"COUNTIF('Classement auteurs'!B:B,C103)","v":1}]
[13,113,131845001101,"L'insolite               ",11,13,8,0,0,32,0,130,0,null,0,null,{"$f":"COUNTIF('Classement auteurs'!B:B,C104)","v":1}]
[13,114,131619005001,"Antilope Canyon          ",16,17,12,0,0,45,0,89,0,null,0,null,{"$f":"COUNTIF('Classement auteurs'!B:B,C105)","v":1}]
[13,115,132060000701,"Beaubourg                ",11,11,14,0,0,36,0,148,0,null,0,null,{"$f":"COUNTIF('Classement auteurs'!B:B,C106)","v":1}]
[13,116,131683005101,"Sérénité              ",19,17,13,0,0,49,0,105,0,null,0,null,{"$f":"COUNTIF('Classement auteurs'!B:B,C107)","v":1}]
[13,117,132060001201,"Au delà du mur          ",9,16,14,0,0,39,0,160,0,null,0,null,{"$f":"COUNTIF('Classement auteurs'!B:B,C108)","v":1}]
[13,118,132086002601,"Urban city               ",9,15,16,0,0,40,0,142,0,null,0,null,{"$f":"COUNTIF('Classement auteurs'!B:B,C109)","v":1}]
[13,119,131862002201,"Randonnée               ",10,15,18,0,0,43,0,83,0,null,0,null,{"$f":"COUNTIF('Classement auteurs'!B:B,C110)","v":1}]
[13,120,130925009801,"Prédicateur             ",10,17,13,0,0,40,0,27,0,null,0,null,{"$f":"COUNTIF('Classement auteurs'!B:B,C111)","v":1}]
[13,121,131956002401,"Reflet du lac            ",17,12,14,0,0,43,0,8,0,null,0,null,{"$f":"COUNTIF('Classement auteurs'!B:B,C112)","v":1}]
[13,122,131845001401,"St Cast en feu           ",12,16,15,0,0,43,0,131,0,null,0,null,{"$f":"COUNTIF('Classement auteurs'!B:B,C113)","v":1}]
[13,123,131956005901,"Vers la tour             ",10,15,12,0,0,37,0,55,0,null,0,null,{"$f":"COUNTIF('Classement auteurs'!B:B,C114)","v":1}]
[13,124,131227008601,"Le phare de Cassis       ",17,14,11,0,0,42,0,23,0,null,0,null,{"$f":"COUNTIF('Classement auteurs'!B:B,C115)","v":1}]
[13,125,131353006201,"Plein champ              ",9,16,12,0,0,37,0,132,0,null,0,null,{"$f":"COUNTIF('Classement auteurs'!B:B,C116)","v":1}]
[13,126,131956004501,"Le pont routier          ",13,16,10,0,0,39,0,64,0,null,0,null,{"$f":"COUNTIF('Classement auteurs'!B:B,C117)","v":1}]
[13,127,131353007401,"74_MG_Malecon Cuba.jpg   ",9,16,16,0,0,41,0,36,0,null,0,null,{"$f":"COUNTIF('Classement auteurs'!B:B,C118)","v":1}]
[13,128,130878013001,"Voyage                   ",9,8,9,0,0,26,0,12,0,null,0,null,{"$f":"COUNTIF('Classement auteurs'!B:B,C119)","v":1}]
[13,129,132086001401,"Géometrie               ",10,14,10,0,0,34,0,147,0,null,0,null,{"$f":"COUNTIF('Classement auteurs'!B:B,C120)","v":1}]
[13,130,131353007301,"73_PG_Musicien Des Rues La Havane.jpg",10,16,12,0,0,38,0,127,0,null,0,null,{"$f":"COUNTIF('Classement auteurs'!B:B,C121)","v":1}]
[13,131,130987025001,"Buren en couleur         ",12,16,12,0,0,40,0,95,0,null,0,null,{"$f":"COUNTIF('Classement auteurs'!B:B,C122)","v":1}]
[13,132,131956002601,"Erosion                  ",9,13,8,0,0,30,0,34,0,null,0,null,{"$f":"COUNTIF('Classement auteurs'!B:B,C123)","v":1}]
[13,133,130987023901,"\"Dream\"                  ",10,9,11,0,0,30,0,6,0,null,0,null,{"$f":"COUNTIF('Classement auteurs'!B:B,C124)","v":1}]
[13,134,130462001101,"Etang du Lavalduc        ",14,16,13,0,0,43,0,135,0,null,0,null,{"$f":"COUNTIF('Classement auteurs'!B:B,C125)","v":1}]
[13,135,132089000101,"Il va neiger dans le Var ",10,14,12,0,0,36,0,16,0,null,0,null,{"$f":"COUNTIF('Classement auteurs'!B:B,C126)","v":1}]
[13,136,131845004001,"Chantiers de la Seyne    ",16,13,12,0,0,41,0,46,0,null,0,null,{"$f":"COUNTIF('Classement auteurs'!B:B,C127)","v":1}]
[13,137,131619005301,"Princess Street          ",16,13,14,0,0,43,0,145,0,null,0,null,{"$f":"COUNTIF('Classement auteurs'!B:B,C128)","v":1}]
[13,138,131956000201,"Camaieu Camarguais       ",18,10,11,0,0,39,0,108,0,null,0,null,{"$f":"COUNTIF('Classement auteurs'!B:B,C129)","v":1}]
[13,139,130925008401,"Spleen                   ",14,19,18,0,0,51,0,161,0,null,0,null,{"$f":"COUNTIF('Classement auteurs'!B:B,C130)","v":1}]
[13,140,130925007701,"Dans la brume            ",10,13,14,0,0,{"$f":"SUM(E131:I131)","v":37},0,123,0,null,0,null,{"$f":"COUNTIF('Classement auteurs'!B:B,C131)","v":1}]
[13,141,130987016601,"Carla                    ",10,11,9,0,0,30,0,99,0,null,0,null,{"$f":"COUNTIF('Classement auteurs'!B:B,C132)","v":1}]
[13,142,131845004101,"Londres                  ",9,12,15,0,0,36,0,3,0,null,0,null,{"$f":"COUNTIF('Classement auteurs'!B:B,C133)","v":1}]
[13,143,131499010601,"Ocres                    ",13,12,14,0,0,39,0,125,0,null,0,null,{"$f":"COUNTIF('Classement auteurs'!B:B,C134)","v":1}]
[13,144,131499010501,"Selfie dans les lavandes ",10,13,13,0,0,36,0,50,0,null,0,null,{"$f":"COUNTIF('Classement auteurs'!B:B,C135)","v":1}]
[13,146,131823004201,"La fanfare               ",10,13,11,0,0,34,0,93,0,null,0,null,{"$f":"COUNTIF('Classement auteurs'!B:B,C136)","v":1}]
[13,147,131956005301,"Bo-Kaap Maison au palmier",9,14,9,0,0,32,0,84,0,null,0,null,{"$f":"COUNTIF('Classement auteurs'!B:B,C137)","v":1}]
[13,148,131823006401,"Le petit port            ",10,13,14,0,0,37,0,121,0,null,0,null,{"$f":"COUNTIF('Classement auteurs'!B:B,C138)","v":1}]
[13,149,131845000801,"Sama Danse des Derviches Tourneurs",7,15,12,0,0,34,0,24,0,null,0]
[13,150,131956000601,"En cuisine!              ",12,7,8,0,0,27,0,118,0,null,0]
[13,151,131845000101,"Façade provençale      ",14,15,12,0,0,41,0,51,0,null,0]
[13,152,131845000201,"Dans le Panier           ",13,13,14,0,0,40,0,60,0,null,0]
[13,153,131376000101,"Précautions!            ",8,15,14,0,0,37,0,43,0,null,0]
[13,154,131956005701,"Matin calme à Pokhara   ",10,15,13,0,0,38,0,19,0,null,0]
[13,155,131619004501,"Sant' Angelo             ",12,14,11,0,0,37,0,124,0,null,0]
[13,156,130987001601,"Gerbera                  ",14,13,10,0,0,37,0,92,0,null,0]
[13,157,130925007601,"Birmane                  ",9,20,12,0,0,41,0,85,0,null,0]
[13,158,131845002101,"Mariage de l'eau et du feu",14,18,12,0,0,44,0,52,0,null,0]
[13,159,132060000901,"Un air de Noël          ",9,10,11,0,0,30,0,163,0,null,0]
[13,160,130527009401,"Terre de Sienne          ",18,19,14,0,0,51,0,30,0,null,0]
[13,161,130527017001,"L'art solitaire...       ",14,17,20,0,0,51,0,29,0,null,0]
[13,162,130987002301,"Moulin Sicilien          ",10,11,13,0,0,34,0,122,0,null,0]
[13,163,132060000401,"Solitaire                ",11,16,13,0,0,40,0,102,0,null,0]
[13,164,131499003601,"Les fruits du marché    ",16,19,15,0,0,50,0,91,0,null,0]
[13,165,131499006901,"Design                   ",18,14,14,0,0,46,0,1,0,null,0]
[13,166,131499010701,"Vapeur d'arc en ciel     ",14,7,12,0,0,33,0,103,0,null,0]
[13,167,131619004201,"Les Goudes               ",12,7,15,0,0,34,0,70,0,null,0]
[13,168,131619004801,"La Lune                  ",12,8,14,0,0,34,0,117,0,null,0]
[13,169,130878015201,"Du blanc à la couleur   ",14,15,13,0,0,42,0,71,0,null,0]
[13,170,131499008601,"Peint ta rue             ",12,17,12,0,0,41,0,154,0,null,0]
[13,171,130987026701,"Cabanons de Cabasson     ",10,12,18,0,0,40,0,17,0,null,0]
[13,172,131110001001,"Selfie                   ",9,14,12,0,0,35,0,152,0,null,0]
[13,173,132203001001,"L'ocre en provence       ",13,13,9,0,0,35,0,134,0,null,0]
[13,174,131353000701,"Pierrot à la rose       ",11,17,13,0,0,41,0,150,0,null,0]
[13,175,131353000101,"Riomaggiore              ",18,19,20,0,0,57,0,97,0,null,0]

{"sheet":"Défi-6","index":8,"n_rows":202,"n_cols":17,"rows_kept":202,"cut":false,"hidden":false,"merged":[]}
["colis","photologic","fichier","titre","note1","note2","note3","note4","note5","total","place","passage","statut","medaille","retenue",null,"0=absent\n1=présent"]
[13,29,131879000801,"Harmonie                 ",19,19,20,0,0,58,0,99,0,null,0,null,{"$f":"COUNTIF('Classement auteurs'!B:B,C2)","v":1}]
[13,35,131683006301,"Avant l'orage            ",18,19,20,0,0,57,0,93,0,null,0,null,{"$f":"COUNTIF('Classement auteurs'!B:B,C3)","v":1}]
[13,5,131376018301,"La poursuite             ",19,18,20,0,0,57,0,132,0,null,0,null,{"$f":"COUNTIF('Classement auteurs'!B:B,C4)","v":1}]
[13,9,132103000101,"Prendre de le temps      ",19,19,17,0,0,55,0,152,0,null,0,null,{"$f":"COUNTIF('Classement auteurs'!B:B,C5)","v":1}]
[13,36,132084003601,"Mini la grenouille       ",17,18,20,0,0,55,0,137,0,null,0,null,{"$f":"COUNTIF('Classement auteurs'!B:B,C6)","v":1}]
[13,23,132084002301,"Les petits hommes        ",19,18,17,0,0,54,0,8,0,null,0,null,{"$f":"COUNTIF('Classement auteurs'!B:B,C7)","v":1}]
[13,41,131227008601,"Après la pluie          ",20,17,16,0,0,53,0,2,0,null,0,null,{"$f":"COUNTIF('Classement auteurs'!B:B,C8)","v":1}]
[13,45,131824001901,"Juste une éclaircie     ",20,14,18,0,0,52,0,126,0,null,0,null,{"$f":"COUNTIF('Classement auteurs'!B:B,C9)","v":1}]
[13,32,130987019701,"Sommet                   ",15,16,20,0,0,51,0,54,0,null,0,null,{"$f":"COUNTIF('Classement auteurs'!B:B,C10)","v":1}]
[13,37,131683007901,"Kiai                     ",16,20,15,0,0,51,0,7,0,null,0,null,{"$f":"COUNTIF('Classement auteurs'!B:B,C11)","v":1}]
[13,72,130925007701,"Regards d'enfants        ",14,17,19,0,0,50,0,119,0,null,0,null,{"$f":"COUNTIF('Classement auteurs'!B:B,C12)","v":1}]
[13,26,130878015801,"Laveur d'Affiche         ",18,13,18,0,0,49,0,32,0,null,0,null,{"$f":"COUNTIF('Classement auteurs'!B:B,C13)","v":1}]
[13,4,130987015701,"Rêve de Mérous       ",14,17,17,0,0,48,0,109,0,null,0,null,{"$f":"COUNTIF('Classement auteurs'!B:B,C14)","v":1}]
[13,12,131683008001,"Transparences            ",19,13,16,0,0,48,0,59,0,null,0,null,{"$f":"COUNTIF('Classement auteurs'!B:B,C15)","v":1}]
[13,34,132193000301,"Ambiance New York        ",12,18,18,0,0,48,0,69,0,null,0,null,{"$f":"COUNTIF('Classement auteurs'!B:B,C16)","v":1}]
[13,37,130987014001,"Le coeur dans les nuages ",14,15,19,0,0,48,0,61,0,null,0,null,{"$f":"COUNTIF('Classement auteurs'!B:B,C17)","v":1}]
[13,1,130987024201,"Cracheur de Feu          ",17,18,13,0,0,48,0,50,0,null,0,null,{"$f":"COUNTIF('Classement auteurs'!B:B,C18)","v":1}]
[13,8,131823008301,"Portrait de rue          ",16,18,14,0,0,48,0,12,0,null,0,null,{"$f":"COUNTIF('Classement auteurs'!B:B,C19)","v":1}]
[13,28,131683000701,"MARIE                    ",18,13,17,0,0,48,0,40,0,null,0,null,{"$f":"COUNTIF('Classement auteurs'!B:B,C20)","v":1}]
[13,33,131353002601,"Chambley 1",15,16,17,0,0,48,0,116,0,null,0,null,{"$f":"COUNTIF('Classement auteurs'!B:B,C21)","v":1}]
[13,21,131879000601,"Hong Kong la nuit        ",15,17,15,0,0,47,0,4,0,null,0,null,{"$f":"COUNTIF('Classement auteurs'!B:B,C22)","v":1}]
[13,78,131956004601,"Regards sur notre galaxie",13,19,15,0,0,47,0,20,0,null,0,null,{"$f":"COUNTIF('Classement auteurs'!B:B,C23)","v":1}]
[13,7,131683008001,"Espiègle                ",16,19,12,0,0,47,0,153,0,null,0,null,{"$f":"COUNTIF('Classement auteurs'!B:B,C24)","v":1}]
[13,5,131110001001,"Quietude                 ",15,14,18,0,0,47,0,71,0,null,0,null,{"$f":"COUNTIF('Classement auteurs'!B:B,C25)","v":1}]
[13,19,131683006301,"Mésange et chardons     ",15,16,16,0,0,47,0,125,0,null,0,null,{"$f":"COUNTIF('Classement auteurs'!B:B,C26)","v":1}]
[13,20,130993013301,"Le repas du Rollier      ",14,17,16,0,0,47,0,34,0,null,0,null,{"$f":"COUNTIF('Classement auteurs'!B:B,C27)","v":1}]
[13,27,130527012401,"Milan                    ",15,17,15,0,0,47,0,128,0,null,0,null,{"$f":"COUNTIF('Classement auteurs'!B:B,C28)","v":1}]
[13,43,131353004301,"Jeune Cigale             ",16,16,15,0,0,47,0,46,0,null,0,null,{"$f":"COUNTIF('Classement auteurs'!B:B,C29)","v":1}]
[13,24,130987024001,"Dorures d'autonne        ",16,15,15,0,0,46,0,42,0,null,0,null,{"$f":"COUNTIF('Classement auteurs'!B:B,C30)","v":1}]
[13,29,130987024201,"Planet Caraïbes         ",14,13,19,0,0,46,0,7,0,null,0,null,{"$f":"COUNTIF('Classement auteurs'!B:B,C31)","v":1}]
[13,9,130987024101,"Chevèchette perlée     ",16,16,14,0,0,46,0,28,0,null,0,null,{"$f":"COUNTIF('Classement auteurs'!B:B,C32)","v":1}]
[13,21,131376011801,"Moines du Djokang        ",13,18,15,0,0,46,0,111,0,null,0,null,{"$f":"COUNTIF('Classement auteurs'!B:B,C33)","v":1}]
[13,50,132084001701,"Champs d'ail             ",11,18,16,0,0,45,0,129,0,null,0,null,{"$f":"COUNTIF('Classement auteurs'!B:B,C34)","v":1}]
[13,73,132060001701,"Enfant gitan de la mer   ",14,14,17,0,0,45,0,42,0,null,0,null,{"$f":"COUNTIF('Classement auteurs'!B:B,C35)","v":1}]
[13,21,131824001901,"Terre Secrete Mâconnaise",17,14,14,0,0,45,0,66,0,null,0,null,{"$f":"COUNTIF('Classement auteurs'!B:B,C36)","v":1}]
[13,7,132193000301,"Survol de la mer de glace",14,15,16,0,0,45,0,140,0,null,0,null,{"$f":"COUNTIF('Classement auteurs'!B:B,C37)","v":1}]
[13,25,130987024201,"Jeux interdits           ",14,17,14,0,0,45,0,65,0,null,0,null,{"$f":"COUNTIF('Classement auteurs'!B:B,C38)","v":1}]
[13,41,130462001101,"Apres la pluie           ",18,12,15,0,0,45,0,105,0,null,0,null,{"$f":"COUNTIF('Classement auteurs'!B:B,C39)","v":1}]
[13,14,131499008701,"Geisha                   ",15,14,15,0,0,44,0,43,0,null,0,null,{"$f":"COUNTIF('Classement auteurs'!B:B,C40)","v":1}]
[13,66,131956002601,"Berlin                   ",14,14,16,0,0,44,0,68,0,null,0,null,{"$f":"COUNTIF('Classement auteurs'!B:B,C41)","v":1}]
[13,71,130925007601,"Famille Himba            ",14,13,17,0,0,44,0,45,0,null,0,null,{"$f":"COUNTIF('Classement auteurs'!B:B,C42)","v":1}]
[13,6,132193000601,"Proue inversée          ",17,14,13,0,0,44,0,26,0,null,0,null,{"$f":"COUNTIF('Classement auteurs'!B:B,C43)","v":1}]
[13,25,131862002201,"Les fiancés             ",18,12,14,0,0,44,0,144,0,null,0,null,{"$f":"COUNTIF('Classement auteurs'!B:B,C44)","v":1}]
[13,27,130987024001,"Ambiance nordique        ",15,15,14,0,0,44,0,121,0,null,0,null,{"$f":"COUNTIF('Classement auteurs'!B:B,C45)","v":1}]
[13,42,130878014101,"Voilier echoué          ",15,13,16,0,0,44,0,35,0,null,0,null,{"$f":"COUNTIF('Classement auteurs'!B:B,C46)","v":1}]
[13,24,131683005101,"HERON                    ",15,15,14,0,0,44,0,42,0,null,0,null,{"$f":"COUNTIF('Classement auteurs'!B:B,C47)","v":1}]
[13,4,130987024101,"La caravane              ",11,19,14,0,0,44,0,149,0,null,0,null,{"$f":"COUNTIF('Classement auteurs'!B:B,C48)","v":1}]
[13,25,131824001901,"Un matin sur ma planète ",16,15,13,0,0,44,0,107,0,null,0,null,{"$f":"COUNTIF('Classement auteurs'!B:B,C49)","v":1}]
[13,44,131376014701,"Enfant sous la pluie     ",14,13,16,0,0,43,0,75,0,null,0,null,{"$f":"COUNTIF('Classement auteurs'!B:B,C50)","v":1}]
[13,58,132084003501,"Coiffes Himbas           ",14,12,17,0,0,43,0,34,0,null,0,null,{"$f":"COUNTIF('Classement auteurs'!B:B,C51)","v":1}]
[13,14,131823004901,"Ça chauffe              ",14,16,13,0,0,43,0,48,0,null,0,null,{"$f":"COUNTIF('Classement auteurs'!B:B,C52)","v":1}]
[13,14,130993015101,"En suspension            ",14,16,13,0,0,43,0,9,0,null,0,null,{"$f":"COUNTIF('Classement auteurs'!B:B,C53)","v":1}]
[13,34,132084002301,"Mamooth lake             ",16,13,14,0,0,43,0,25,0,null,0,null,{"$f":"COUNTIF('Classement auteurs'!B:B,C54)","v":1}]
[13,38,131110000901,"Rosée                   ",16,12,15,0,0,43,0,22,0,null,0,null,{"$f":"COUNTIF('Classement auteurs'!B:B,C55)","v":1}]
[13,9,131683008101,"Lola                     ",14,14,15,0,0,43,0,69,0,null,0,null,{"$f":"COUNTIF('Classement auteurs'!B:B,C56)","v":1}]
[13,6,131845000101,"Skate Park               ",12,12,18,0,0,42,0,132,0,null,0,null,{"$f":"COUNTIF('Classement auteurs'!B:B,C57)","v":1}]
[13,7,130987028201,"Water selfie             ",13,14,15,0,0,42,0,117,0,null,0,null,{"$f":"COUNTIF('Classement auteurs'!B:B,C58)","v":1}]
[13,30,131824003101,"Ice attack               ",12,13,17,0,0,42,0,89,0,null,0,null,{"$f":"COUNTIF('Classement auteurs'!B:B,C59)","v":1}]
[13,4,130987012601,"Répétition.            ",14,15,13,0,0,42,0,149,0,null,0,null,{"$f":"COUNTIF('Classement auteurs'!B:B,C60)","v":1}]
[13,12,130987013801,"Lever de soleil après la pluie",14,15,13,0,0,42,0,73,0,null,0,null,{"$f":"COUNTIF('Classement auteurs'!B:B,C61)","v":1}]
[13,2,131823008301,"Promenade                ",14,15,13,0,0,42,0,143,0,null,0,null,{"$f":"COUNTIF('Classement auteurs'!B:B,C62)","v":1}]
[13,8,132084004001,"La négociation          ",11,18,13,0,0,42,0,96,0,null,0,null,{"$f":"COUNTIF('Classement auteurs'!B:B,C63)","v":1}]
[13,17,130987013801,"Gymnaste en compétition ",11,18,13,0,0,42,0,153,0,null,0,null,{"$f":"COUNTIF('Classement auteurs'!B:B,C64)","v":1}]
[13,28,131499006801,"Fauteuil Rouge           ",8,15,19,0,0,42,0,67,0,null,0,null,{"$f":"COUNTIF('Classement auteurs'!B:B,C65)","v":1}]
[13,40,131879001301,"Regard                   ",18,14,10,0,0,42,0,38,0,null,0,null,{"$f":"COUNTIF('Classement auteurs'!B:B,C66)","v":1}]
[13,15,130878013001,"Perle de rose            ",11,15,15,0,0,41,0,83,0,null,0,null,{"$f":"COUNTIF('Classement auteurs'!B:B,C67)","v":1}]
[13,22,131879000101,"Tangueros                ",12,16,13,0,0,41,0,67,0,null,0,null,{"$f":"COUNTIF('Classement auteurs'!B:B,C68)","v":1}]
[13,55,130987012601,"Taxi à Tokyo.           ",12,12,17,0,0,41,0,136,0,null,0,null,{"$f":"COUNTIF('Classement auteurs'!B:B,C69)","v":1}]
[13,67,131823008701,"école en Sulawesi       ",12,13,16,0,0,41,0,97,0,null,0,null,{"$f":"COUNTIF('Classement auteurs'!B:B,C70)","v":1}]
[13,76,130000019901,"Recueillement            ",13,13,15,0,0,41,0,115,6,null,0,null,{"$f":"COUNTIF('Classement auteurs'!B:B,C71)","v":1}]
[13,32,131824003101,"Encre du Japon           ",15,12,14,0,0,41,0,104,0,null,0,null,{"$f":"COUNTIF('Classement auteurs'!B:B,C72)","v":1}]
[13,4,131879000501,"Calin                    ",14,13,14,0,0,41,0,89,0,null,0,null,{"$f":"COUNTIF('Classement auteurs'!B:B,C73)","v":1}]
[13,21,130987015701,"Thomise                  ",14,14,13,0,0,41,0,3,0,null,0,null,{"$f":"COUNTIF('Classement auteurs'!B:B,C74)","v":1}]
[13,14,130993012301,"Flamenco                 ",13,13,15,0,0,41,0,106,0,null,0,null,{"$f":"COUNTIF('Classement auteurs'!B:B,C75)","v":1}]
[13,20,132084001701,"Eglise                   ",14,15,12,0,0,41,0,78,0,null,0,null,{"$f":"COUNTIF('Classement auteurs'!B:B,C76)","v":1}]
[13,24,131823004901,"Dans les bras de Morphée",11,15,15,0,0,41,0,35,0,null,0,null,{"$f":"COUNTIF('Classement auteurs'!B:B,C77)","v":1}]
[13,33,131683006901,"Un p'tit coin de parapluie",17,13,11,0,0,41,0,75,0,null,0,null,{"$f":"COUNTIF('Classement auteurs'!B:B,C78)","v":1}]
[13,18,130987024101,"L'Andine                 ",12,12,16,0,0,40,0,114,0,null,0,null,{"$f":"COUNTIF('Classement auteurs'!B:B,C79)","v":1}]
[13,19,131992000301,"Le tatoueur de Madurai.  ",12,12,16,0,0,40,0,25,0,null,0,null,{"$f":"COUNTIF('Classement auteurs'!B:B,C80)","v":1}]
[13,48,131824001901,"Auprès de mon arbre.... ",13,9,18,0,0,40,0,62,0,null,0,null,{"$f":"COUNTIF('Classement auteurs'!B:B,C81)","v":1}]
[13,60,131353007301,"LAGUNA COLORADA BOLIVIE  ",14,11,15,0,0,40,0,37,0,null,0,null,{"$f":"COUNTIF('Classement auteurs'!B:B,C82)","v":1}]
[13,17,132193000301,"Salsa                    ",20,7,13,0,0,40,0,4,0,null,0,null,{"$f":"COUNTIF('Classement auteurs'!B:B,C83)","v":1}]
[13,38,131499008601,"Il potassait...          ",14,11,15,0,0,40,0,159,0,null,0,null,{"$f":"COUNTIF('Classement auteurs'!B:B,C84)","v":1}]
[13,22,130527009201,"On partage ?             ",12,13,15,0,0,40,0,123,0,null,0,null,{"$f":"COUNTIF('Classement auteurs'!B:B,C85)","v":1}]
[13,31,132084003501,"Leopard dans le delta de l'okavango",14,14,12,0,0,40,0,51,0,null,0,null,{"$f":"COUNTIF('Classement auteurs'!B:B,C86)","v":1}]
[13,31,130987019601,"Fraîcheur               ",12,14,13,0,0,39,0,1,0,null,0,null,{"$f":"COUNTIF('Classement auteurs'!B:B,C87)","v":1}]
[13,57,131862001001,"Petite Vietnamienne      ",12,12,15,0,0,39,0,139,0,null,0,null,{"$f":"COUNTIF('Classement auteurs'!B:B,C88)","v":1}]
[13,64,131619005001,"Regard sur le haut atlas ",11,15,13,0,0,39,0,77,0,null,0,null,{"$f":"COUNTIF('Classement auteurs'!B:B,C89)","v":1}]
[13,65,131879000501,"Tromso                   ",14,14,11,0,0,39,0,142,0,null,0,null,{"$f":"COUNTIF('Classement auteurs'!B:B,C90)","v":1}]
[13,75,132084000301,"Croisère à Kotor       ",14,11,14,0,0,39,0,120,0,null,0,null,{"$f":"COUNTIF('Classement auteurs'!B:B,C91)","v":1}]
[13,79,130987015701,"Les Falaises de Moher    ",14,9,16,0,0,39,0,111,0,null,0,null,{"$f":"COUNTIF('Classement auteurs'!B:B,C92)","v":1}]
[13,10,131494003201,"Jeans                    ",15,13,11,0,0,39,0,64,0,null,0,null,{"$f":"COUNTIF('Classement auteurs'!B:B,C93)","v":1}]
[13,15,131683005001,"Rêverie                 ",14,13,12,0,0,39,0,31,0,null,0,null,{"$f":"COUNTIF('Classement auteurs'!B:B,C94)","v":1}]
[13,16,131499008701,"Suivre notre chemin...   ",13,14,12,0,0,39,0,158,0,null,0,null,{"$f":"COUNTIF('Classement auteurs'!B:B,C95)","v":1}]
[13,22,130878013001,"La plage                 ",15,12,12,0,0,39,0,80,0,null,0,null,{"$f":"COUNTIF('Classement auteurs'!B:B,C96)","v":1}]
[13,11,131683008001,"Sentinelle du désert    ",13,13,13,0,0,39,0,58,0,null,0,null,{"$f":"COUNTIF('Classement auteurs'!B:B,C97)","v":1}]
[13,43,131879000501,"Contemplation            ",13,10,16,0,0,39,0,68,0,null,0,null,{"$f":"COUNTIF('Classement auteurs'!B:B,C98)","v":1}]
[13,25,130987013801,"Maréchal-ferrant        ",12,12,14,0,0,38,0,58,0,null,0,null,{"$f":"COUNTIF('Classement auteurs'!B:B,C99)","v":1}]
[13,27,131879000501,"Barques                  ",12,12,14,0,0,38,0,127,0,null,0,null,{"$f":"COUNTIF('Classement auteurs'!B:B,C100)","v":1}]
[13,38,130878014301,"La souffreuse            ",12,12,14,0,0,38,0,131,0,null,0,null,{"$f":"COUNTIF('Classement auteurs'!B:B,C101)","v":1}]
[13,40,132060000701,"Paris La Défense        ",13,11,14,0,0,38,0,73,0,null,0,null,{"$f":"COUNTIF('Classement auteurs'!B:B,C102)","v":1}]
[13,84,131956004501,"Aquarius                 ",12,14,12,0,0,38,0,54,0,null,0,null,{"$f":"COUNTIF('Classement auteurs'!B:B,C103)","v":1}]
[13,26,130462001101,"Oeuvre 1-mucem           ",13,11,14,0,0,38,0,161,0,null,0,null,{"$f":"COUNTIF('Classement auteurs'!B:B,C104)","v":1}]
[13,31,131879000101,"Shinkansen-japon         ",13,15,10,0,0,38,0,74,0,null,0,null,{"$f":"COUNTIF('Classement auteurs'!B:B,C105)","v":1}]
[13,35,132023000101,"L'homme au damier        ",16,8,14,0,0,38,0,92,0,null,0,null,{"$f":"COUNTIF('Classement auteurs'!B:B,C106)","v":1}]
[13,23,130987016601,"Lac guichard             ",13,12,13,0,0,38,0,106,0,null,0,null,{"$f":"COUNTIF('Classement auteurs'!B:B,C107)","v":1}]
[13,22,130993013801,"Promeneur du soir        ",13,14,11,0,0,38,0,110,0,null,0,null,{"$f":"COUNTIF('Classement auteurs'!B:B,C108)","v":1}]
[13,30,132084000201,"Tristesse                ",13,15,10,0,0,38,0,104,0,null,0,null,{"$f":"COUNTIF('Classement auteurs'!B:B,C109)","v":1}]
[13,31,131879001101,"Couleurs d'automne       ",13,13,12,0,0,38,0,128,0,null,0,null,{"$f":"COUNTIF('Classement auteurs'!B:B,C110)","v":1}]
[13,38,132193000301,"Solfar                   ",13,13,12,0,0,38,0,159,0,null,0,null,{"$f":"COUNTIF('Classement auteurs'!B:B,C111)","v":1}]
[13,39,131879002001,"Procession               ",12,13,13,0,0,38,0,20,0,null,0,null,{"$f":"COUNTIF('Classement auteurs'!B:B,C112)","v":1}]
[13,50,130000020401,"Khiva - La Roue          ",13,11,13,0,0,37,0,123,6,null,0,null,{"$f":"COUNTIF('Classement auteurs'!B:B,C113)","v":1}]
[13,63,130878014101,"Orientation              ",11,7,19,0,0,37,0,76,0,null,0,null,{"$f":"COUNTIF('Classement auteurs'!B:B,C114)","v":1}]
[13,77,132193000401,"Un pont entre 2 mondes   ",12,12,13,0,0,37,0,93,7,null,0,null,{"$f":"COUNTIF('Classement auteurs'!B:B,C115)","v":1}]
[13,26,131956004501,"Campanules               ",12,12,13,0,0,37,0,52,0,null,0,null,{"$f":"COUNTIF('Classement auteurs'!B:B,C116)","v":1}]
[13,28,132193001201,"Mes tourterelles         ",13,9,15,0,0,37,0,82,0,null,0,null,{"$f":"COUNTIF('Classement auteurs'!B:B,C117)","v":1}]
[13,10,130987019701,"Face à face             ",14,10,13,0,0,37,0,86,0,null,0,null,{"$f":"COUNTIF('Classement auteurs'!B:B,C118)","v":1}]
[13,36,130987007401,"Orage imminent           ",10,15,12,0,0,37,0,41,0,null,0,null,{"$f":"COUNTIF('Classement auteurs'!B:B,C119)","v":1}]
[13,5,131845000801,"Le soleil se lève       ",13,12,11,0,0,36,0,136,0,null,0,null,{"$f":"COUNTIF('Classement auteurs'!B:B,C120)","v":1}]
[13,10,131845000301,"Variation d'ocres        ",9,13,14,0,0,36,0,53,0,null,0,null,{"$f":"COUNTIF('Classement auteurs'!B:B,C121)","v":1}]
[13,33,130878007201,"Abri multicolore         ",13,8,15,0,0,36,0,57,0,null,0,null,{"$f":"COUNTIF('Classement auteurs'!B:B,C122)","v":1}]
[13,39,132086002301,"Parade en rose           ",11,13,12,0,0,36,0,29,0,null,0,null,{"$f":"COUNTIF('Classement auteurs'!B:B,C123)","v":1}]
[13,42,130987028801,"Feu Art                  ",11,10,15,0,0,36,0,113,0,null,0,null,{"$f":"COUNTIF('Classement auteurs'!B:B,C124)","v":1}]
[13,47,131683006301,"Regards indiens          ",12,15,9,0,0,36,0,127,0,null,0,null,{"$f":"COUNTIF('Classement auteurs'!B:B,C125)","v":1}]
[13,49,130925009801,"Shanghai                 ",12,10,14,0,0,36,0,11,0,null,0,null,{"$f":"COUNTIF('Classement auteurs'!B:B,C126)","v":1}]
[13,68,130925008601,"Amerique                 ",13,7,16,0,0,36,0,85,0,null,0,null,{"$f":"COUNTIF('Classement auteurs'!B:B,C127)","v":1}]
[13,2,130987024101,"A l'affut                ",15,11,10,0,0,36,0,65,0,null,0,null,{"$f":"COUNTIF('Classement auteurs'!B:B,C128)","v":1}]
[13,33,131353006101,"Mains d'Argile           ",15,11,10,0,0,36,0,63,0,null,0,null,{"$f":"COUNTIF('Classement auteurs'!B:B,C129)","v":1}]
[13,6,130878013301,"Desert                   ",11,11,14,0,0,36,0,142,0,null,0,null,{"$f":"COUNTIF('Classement auteurs'!B:B,C130)","v":1}]
[13,35,131353000201,"Butinage                 ",12,13,11,0,0,36,0,1,0,null,0,null,{"$f":"COUNTIF('Classement auteurs'!B:B,C131)","v":1}]
[13,39,131110001101,"Fleur sauvage            ",13,14,9,0,0,36,0,113,0,null,0,null,{"$f":"COUNTIF('Classement auteurs'!B:B,C132)","v":1}]
[13,3,132147000101,"Reflet Vénitien         ",11,15,10,0,0,36,0,33,0,null,0,null,{"$f":"COUNTIF('Classement auteurs'!B:B,C133)","v":1}]
[13,7,132023000101,"Cabanes de pêcheurs     ",11,10,15,0,0,36,0,4,0,null,0,null,{"$f":"COUNTIF('Classement auteurs'!B:B,C134)","v":1}]
[13,16,130987028401,"Au bout... de la Presqu'île",11,14,11,0,0,36,0,65,0,null,0,null,{"$f":"COUNTIF('Classement auteurs'!B:B,C135)","v":1}]
[13,56,130993016501,"Reflet_Asie              ",13,12,10,0,0,35,0,31,0,null,0,null,{"$f":"COUNTIF('Classement auteurs'!B:B,C136)","v":1}]
[13,81,131862002201,"Matsumoto. Japon         ",12,11,12,0,0,35,0,50,0,null,0,null,{"$f":"COUNTIF('Classement auteurs'!B:B,C137)","v":1}]
[13,30,131499009301,"Les parasols             ",11,11,13,0,0,35,0,96,0,null,0,null,{"$f":"COUNTIF('Classement auteurs'!B:B,C138)","v":1}]
[13,34,131499009801,"Bella musica             ",13,10,12,0,0,35,0,82,0,null,0]
[13,44,130000020401,"The Camps                ",12,11,12,0,0,35,0,131,6,null,0]
[13,2,130000020401,"La Goutte                ",10,13,12,0,0,35,0,103,6,null,0]
[13,17,131376017601,"Ombre chinoise           ",13,10,12,0,0,35,0,107,0,null,0]
[13,18,131494000201,"Envol                    ",10,11,14,0,0,35,0,6,0,null,0]
[13,46,131956005101,"Litter Litter            ",9,8,17,0,0,34,0,15,0,null,0]
[13,69,130878013601,"L'enfant et le torri     ",12,9,13,0,0,34,0,72,0,null,0]
[13,83,131862005801,"Suivez mon regard        ",11,11,12,0,0,34,0,52,0,null,0]
[13,24,131683006301,"Graphisme rural          ",11,13,10,0,0,34,0,118,0,null,0]
[13,36,130987015701,"Douceur                  ",12,9,13,0,0,34,0,147,0,null,0]
[13,11,130987019601,"Les pénitents           ",10,7,17,0,0,34,0,88,0,null,0]
[13,13,130878013601,"En attente               ",8,12,14,0,0,34,0,18,0,null,0]
[13,18,131376012601,"Jour de neige            ",14,14,6,0,0,34,0,22,0,null,0]
[13,23,132060000101,"FETE AU CHATEAU          ",9,16,9,0,0,34,0,115,0,null,0]
[13,47,131353000201,"Fleur                    ",9,11,13,0,0,33,0,41,0,null,0]
[13,54,131683005101,"Clarisse                 ",15,6,12,0,0,33,0,126,0,null,0]
[13,59,132084003601,"Kaokoland airport        ",11,12,10,0,0,33,0,98,0,null,0]
[13,70,131845004001,"VIETAMIENNE              ",11,9,13,0,0,33,0,66,0,null,0]
[13,3,131499008701,"Symbiose                 ",12,11,10,0,0,33,0,18,0,null,0]
[13,34,131683007001,"Ordre décroissant       ",9,14,10,0,0,33,0,157,0,null,0]
[13,43,131683000701,"SAYONARA                 ",10,11,11,0,0,32,0,2,0,null,0]
[13,48,130000019901,"La vie en rose           ",10,10,12,0,0,32,0,99,6,null,0]
[13,53,132086002501,"Le Chianti moderne       ",14,7,11,0,0,32,0,29,0,null,0]
[13,80,131956001401,"Regard Colombien         ",11,10,11,0,0,32,0,134,0,null,0]
[13,39,131992000401,"Fantôme de Noel         ",12,9,11,0,0,32,0,138,0,null,0]
[13,6,130527002501,"Tacle                    ",7,11,14,0,0,32,0,164,0,null,0]
[13,15,132086002301,"Tourbillon d'or          ",12,8,12,0,0,32,0,25,0,null,0]
[13,9,130987007401,"Adrien                   ",10,11,10,0,0,31,0,79,0,null,0]
[13,28,131376012601,"Utopie                   ",11,12,8,0,0,31,0,60,0,null,0]
[13,41,131376018301,"Rêve d'Orient           ",12,9,10,0,0,31,0,111,0,null,0]
[13,45,131499005201,"Pizzaiolo                ",11,7,13,0,0,31,0,46,0,null,0]
[13,82,132089000201,"Au Radjastan             ",10,11,10,0,0,31,0,6,0,null,0]
[13,12,130987029901,"Rodin.jpg                ",9,11,11,0,0,31,0,113,0,null,0]
[13,13,131683007601,"Maillot jaune            ",11,10,10,0,0,31,0,20,0,null,0]
[13,40,130925010201,"Arles                    ",10,11,10,0,0,31,0,15,0,null,0]
[13,8,130987028201,"La sieste du rhino blanc ",11,11,9,0,0,31,0,26,0,null,0]
[13,35,130993015401,"La cabanne du peuchère  ",9,11,11,0,0,31,0,63,0,null,0]
[13,62,131353003001,"Regard de l'inconnue     ",12,6,12,0,0,30,0,48,0,null,0]
[13,32,130878013401,"Lady                     ",8,11,11,0,0,30,0,47,0,null,0]
[13,36,132060000101,"Signature artistique     ",6,16,7,0,0,29,0,26,0,null,0]
[13,37,132217000601,"Ancienne taverne crétoise",8,10,11,0,0,29,0,7,0,null,0]
[13,42,130878014301,"Bulle colorée           ",10,9,10,0,0,29,0,100,0,null,0]
[13,1,131845003401,"Avant la régate         ",9,7,12,0,0,28,0,31,0,null,0]
[13,18,131823008701,"Jusqu'au ciel            ",8,10,10,0,0,28,0,115,0,null,0]
[13,19,131956002901,"Regard                   ",7,10,11,0,0,28,0,61,0,null,0]
[13,29,131879000101,"Cerisiers en fleurs      ",8,12,8,0,0,28,0,77,0,null,0]
[13,41,132203000601,"Soir                     ",11,7,10,0,0,28,0,72,0,null,0]
[13,20,130987028401,"Sensibilité de Granit   ",11,7,9,0,0,27,0,93,0,null,0]
[13,16,132147001701,"L'herbe et le vent...    ",12,8,7,0,0,27,0,101,0,null,0]
[13,10,130987030301,"Coquelicot du Lot        ",10,10,6,0,0,26,0,141,0,null,0]
[13,51,132193000501,"Guerrier irlandais       ",11,7,7,0,0,25,0,41,7,null,0]
[13,42,131494002101,"Atterrissage             ",9,9,7,0,0,25,0,90,0,null,0]
[13,46,131376017601,"Les touristes            ",9,6,9,0,0,24,0,64,0,null,0]
[13,52,131956003401,"Regard de la foret       ",11,6,7,0,0,24,0,56,0,null,0]
[13,74,131862000801,"Le Chat du Rabin         ",11,6,7,0,0,24,0,78,0,null,0]
[13,85,131110001101,"Le petit guitariste      ",11,6,7,0,0,24,0,108,0,null,0]
[13,40,130000019901,"Phacélie                ",6,10,8,0,0,24,0,72,6,null,0]
[13,1,131494003001,"Reflet nocturne          ",10,7,7,0,0,24,0,120,0,null,0]
[13,61,130878014301,"L’œil de la terre     ",10,6,7,0,0,23,0,7,0,null,0]
[13,11,130000021001," Un voyage à LONDRES    ",7,6,8,0,0,21,0,137,6,null,0]
[13,20,130993015101,"Criquet vert             ",6,6,6,0,0,18,0,125,0,null,0]
[13,1,130878015201,"Je m'amuse               ",6,6,6,0,0,18,0,37,0,null,0]
[13,30,131376017701,"Solaire                  ",6,6,6,0,0,18,0,94,0,null,0]
[13,32,131845000201,"Au vol                   ",6,6,6,0,0,18,0,53,0,null,0]

{"sheet":"Défi-7","index":9,"n_rows":138,"n_cols":17,"rows_kept":138,"cut":false,"hidden":false,"merged":[]}
["colis","photologic","fichier","titre","note1","note2","note3","note4","note5","total","place","passage","statut","medaille","retenue",null,"0=absent\n1=présent"]
[13,122,131683008201,"Alysée                  ",19,19,19,0,0,57,0,20," ",null,null,null,{"$f":"COUNTIF('Classement auteurs'!B:B,C2)","v":1}]
[13,85,131353000101,"La chapelle              ",17,20,19,0,0,56,0,67," ",null,null,null,{"$f":"COUNTIF('Classement auteurs'!B:B,C3)","v":1}]
[13,7,132193000301,"Invitation au voyage     ",19,18,18,0,0,55,0,94," ",null,null,null,{"$f":"COUNTIF('Classement auteurs'!B:B,C4)","v":1}]
[13,11,131985003401,"Jeune fille himbas       ",20,16,18,0,0,54,0,118," ",null,null,null,{"$f":"COUNTIF('Classement auteurs'!B:B,C5)","v":1}]
[13,6,130987015701,"Orage                    ",19,16,17,0,0,52,0,23," ",null,null,null,{"$f":"COUNTIF('Classement auteurs'!B:B,C6)","v":1}]
[13,107,131956004601,"L'homme de pierre        ",17,17,18,0,0,52,0,76," ",null,null,null,{"$f":"COUNTIF('Classement auteurs'!B:B,C7)","v":1}]
[13,26,130987013801,"Championnat de France de ",18,17,16,0,0,51,0,122," ",null,null,null,{"$f":"COUNTIF('Classement auteurs'!B:B,C8)","v":1}]
[13,53,131845000101,"Ponton                   ",17,17,16,0,0,50,0,39," ",null,null,null,{"$f":"COUNTIF('Classement auteurs'!B:B,C9)","v":1}]
[13,100,130527009401,"La route                 ",14,16,19,0,0,49,0,28," ",null,null,null,{"$f":"COUNTIF('Classement auteurs'!B:B,C10)","v":1}]
[13,115,131683008101,"La cascade du roy        ",16,15,17,0,0,48,0,88," ",null,null,null,{"$f":"COUNTIF('Classement auteurs'!B:B,C11)","v":1}]
[13,3,132103000401,"Sort-tu es toujours atten",18,15,14,0,0,47,0,40," ",null,null,null,{"$f":"COUNTIF('Classement auteurs'!B:B,C12)","v":1}]
[13,5,132003002201,"Ubiquité.               ",20,10,17,0,0,47,0,47," ",null,null,null,{"$f":"COUNTIF('Classement auteurs'!B:B,C13)","v":1}]
[13,15,131376017701,"Sprint final             ",15,19,13,0,0,47,0,103," ",null,null,null,{"$f":"COUNTIF('Classement auteurs'!B:B,C14)","v":1}]
[13,125,131619004501,"L'echelle                ",13,14,20,0,0,47,0,58," ",null,null,null,{"$f":"COUNTIF('Classement auteurs'!B:B,C15)","v":1}]
[13,37,131824001901,"Mini'Home                ",14,14,17,0,0,45,0,83," ",null,null,null,{"$f":"COUNTIF('Classement auteurs'!B:B,C16)","v":1}]
[13,46,131845000901,"Concert acrobatique      ",18,14,13,0,0,45,0,1," ",null,null,null,{"$f":"COUNTIF('Classement auteurs'!B:B,C17)","v":1}]
[13,56,130878007201,"Ibrahima                 ",17,13,14,0,0,44,0,73," ",null,null,null,{"$f":"COUNTIF('Classement auteurs'!B:B,C18)","v":1}]
[13,63,132084004801,"Père & Fils             ",14,11,19,0,0,44,0,82," ",null,null,null,{"$f":"COUNTIF('Classement auteurs'!B:B,C19)","v":1}]
[13,82,131879000801,"Madone                   ",14,14,16,0,0,44,0,41," ",null,null,null,{"$f":"COUNTIF('Classement auteurs'!B:B,C20)","v":1}]
[13,112,131956006201,"Promenade en terrasse    ",12,16,16,0,0,44,0,75," ",null,null,null,{"$f":"COUNTIF('Classement auteurs'!B:B,C21)","v":1}]
[13,27,130987024201,"Back in black            ",16,12,15,0,0,43,0,119," ",null,null,null,{"$f":"COUNTIF('Classement auteurs'!B:B,C22)","v":1}]
[13,44,131823007601,"Spirale                  ",15,13,15,0,0,43,0,114," ",null,null,null,{"$f":"COUNTIF('Classement auteurs'!B:B,C23)","v":1}]
[13,51,131823004901,"Evanescence              ",12,16,15,0,0,43,0,93," ",null,null,null,{"$f":"COUNTIF('Classement auteurs'!B:B,C24)","v":1}]
[13,58,131985003601,"Vino                     ",14,12,17,0,0,43,0,55," ",null,null,null,{"$f":"COUNTIF('Classement auteurs'!B:B,C25)","v":1}]
[13,64,131619004601,"Marche à l'ombre        ",12,15,16,0,0,43,0,81," ",null,null,null,{"$f":"COUNTIF('Classement auteurs'!B:B,C26)","v":1}]
[13,119,131956002601,"Trace                    ",11,15,17,0,0,43,0,99," ",null,null,null,{"$f":"COUNTIF('Classement auteurs'!B:B,C27)","v":1}]
[13,127,131862001601,"Vers l'orage             ",17,9,17,0,0,43,0,102," ",null,null,null,{"$f":"COUNTIF('Classement auteurs'!B:B,C28)","v":1}]
[13,10,131956004501,"La souche                ",10,14,18,0,0,42,0,62," ",null,null,null,{"$f":"COUNTIF('Classement auteurs'!B:B,C29)","v":1}]
[13,12,131376018301,"La penseuse !            ",12,14,16,0,0,42,0,42," ",null,null,null,{"$f":"COUNTIF('Classement auteurs'!B:B,C30)","v":1}]
[13,97,131683007901,"Tête d'oeuf             ",13,11,18,0,0,42,0,117," ",null,null,null,{"$f":"COUNTIF('Classement auteurs'!B:B,C31)","v":1}]
[13,114,131956002401,"Grand Mère              ",13,15,14,0,0,42,0,24," ",null,null,null,{"$f":"COUNTIF('Classement auteurs'!B:B,C32)","v":1}]
[13,9,130000015001,"Vu                       ",15,14,12,0,0,41,0,53," ",null,null,null,{"$f":"COUNTIF('Classement auteurs'!B:B,C33)","v":1}]
[13,40,130000020401,"Alcôve                  ",13,13,15,0,0,41,0,51," ",null,null,null,{"$f":"COUNTIF('Classement auteurs'!B:B,C34)","v":1}]
[13,86,131353000701,"Sous la pluie            ",14,12,15,0,0,41,0,3," ",null,null,null,{"$f":"COUNTIF('Classement auteurs'!B:B,C35)","v":1}]
[13,89,132060002101,"Pont araignée sur le Rhon",14,12,15,0,0,41,0,107," ",null,null,null,{"$f":"COUNTIF('Classement auteurs'!B:B,C36)","v":1}]
[13,105,131683006601,"Comme un génie          ",14,13,14,0,0,41,0,78," ",null,null,null,{"$f":"COUNTIF('Classement auteurs'!B:B,C37)","v":1}]
[13,111,131956000401,"Westminster              ",14,12,15,0,0,41,0,86," ",null,null,null,{"$f":"COUNTIF('Classement auteurs'!B:B,C38)","v":1}]
[13,32,131879000101,"Vite!                    ",12,12,16,0,0,40,0,77," ",null,null,null,{"$f":"COUNTIF('Classement auteurs'!B:B,C39)","v":1}]
[13,38,131992000901,"Le passage               ",13,15,12,0,0,40,0,85," ",null,null,null,{"$f":"COUNTIF('Classement auteurs'!B:B,C40)","v":1}]
[13,130,131956005401,"Graphisme urbain         ",16,12,12,0,0,40,0,90," ",null,null,null,{"$f":"COUNTIF('Classement auteurs'!B:B,C41)","v":1}]
[13,24,130878015201,"Rêverie                 ",15,13,11,0,0,39,0,125," ",null,null,null,{"$f":"COUNTIF('Classement auteurs'!B:B,C42)","v":1}]
[13,28,130987024101,"Peu ou proue...          ",13,15,11,0,0,39,0,36," ",null,null,null,{"$f":"COUNTIF('Classement auteurs'!B:B,C43)","v":1}]
[13,33,131499009301,"Chemin de traverse       ",12,14,13,0,0,39,0,113," ",null,null,null,{"$f":"COUNTIF('Classement auteurs'!B:B,C44)","v":1}]
[13,49,130878013001,"Complices                ",13,15,11,0,0,39,0,110," ",null,null,null,{"$f":"COUNTIF('Classement auteurs'!B:B,C45)","v":1}]
[13,57,130878015701,"Damien                   ",12,14,13,0,0,39,0,61," ",null,null,null,{"$f":"COUNTIF('Classement auteurs'!B:B,C46)","v":1}]
[13,77,131956006001,"Le vieux port en mouvemen",10,13,16,0,0,39,0,98," ",null,null,null,{"$f":"COUNTIF('Classement auteurs'!B:B,C47)","v":1}]
[13,118,132060000401,"Pont de dentelle         ",11,12,16,0,0,39,0,84," ",null,null,null,{"$f":"COUNTIF('Classement auteurs'!B:B,C48)","v":1}]
[13,50,131683005101,"Le buron oublié         ",11,14,13,0,0,38,0,87," ",null,null,null,{"$f":"COUNTIF('Classement auteurs'!B:B,C49)","v":1}]
[13,61,130527012401,"Fillette avec ses poisson",12,12,14,0,0,38,0,106," ",null,null,null,{"$f":"COUNTIF('Classement auteurs'!B:B,C50)","v":1}]
[13,84,131353004301,"Tombes de sable          ",15,7,16,0,0,38,0,17," ",null,null,null,{"$f":"COUNTIF('Classement auteurs'!B:B,C51)","v":1}]
[13,25,132193000801,"Au marché provencale    ",12,12,13,0,0,37,0,5," ",null,null,null,{"$f":"COUNTIF('Classement auteurs'!B:B,C52)","v":1}]
[13,43,131956005501,"En montant à notre Dame d",13,10,14,0,0,37,0,97," ",null,null,null,{"$f":"COUNTIF('Classement auteurs'!B:B,C53)","v":1}]
[13,47,130000019901,"Barques                  ",12,13,12,0,0,37,0,92," ",null,null,null,{"$f":"COUNTIF('Classement auteurs'!B:B,C54)","v":1}]
[13,52,131824000201,"Cubissime                ",14,12,11,0,0,37,0,18," ",null,null,null,{"$f":"COUNTIF('Classement auteurs'!B:B,C55)","v":1}]
[13,59,131862002201,"Imploration              ",16,11,10,0,0,37,0,64," ",null,null,null,{"$f":"COUNTIF('Classement auteurs'!B:B,C56)","v":1}]
[13,78,130987024001,"L'orage arrive           ",12,11,14,0,0,37,0,32," ",null,null,null,{"$f":"COUNTIF('Classement auteurs'!B:B,C57)","v":1}]
[13,102,131823005701,"Voile                    ",13,10,14,0,0,37,0,109," ",null,null,null,{"$f":"COUNTIF('Classement auteurs'!B:B,C58)","v":1}]
[13,103,132193000401,"Le damier                ",12,13,12,0,0,37,0,49," ",null,null,null,{"$f":"COUNTIF('Classement auteurs'!B:B,C59)","v":1}]
[13,113,131845001401,"L'arbre et la lune       ",12,7,18,0,0,37,0,46," ",null,null,null,{"$f":"COUNTIF('Classement auteurs'!B:B,C60)","v":1}]
[13,120,131956005601,"Saxo                     ",11,14,12,0,0,37,0,16," ",null,null,null,{"$f":"COUNTIF('Classement auteurs'!B:B,C61)","v":1}]
[13,22,131683006301,"La jetée                ",14,9,13,0,0,36,0,71," ",null,null,null,{"$f":"COUNTIF('Classement auteurs'!B:B,C62)","v":1}]
[13,30,132084004001,"La guerre des mondes     ",11,11,14,0,0,36,0,35," ",null,null,null,{"$f":"COUNTIF('Classement auteurs'!B:B,C63)","v":1}]
[13,39,131862001501,"Le solitaire             ",11,10,15,0,0,36,0,116," ",null,null,null,{"$f":"COUNTIF('Classement auteurs'!B:B,C64)","v":1}]
[13,54,131823008301,"Liberté surveillée     ",12,14,10,0,0,36,0,45," ",null,null,null,{"$f":"COUNTIF('Classement auteurs'!B:B,C65)","v":1}]
[13,60,131499003601,"Dans la rue              ",11,12,13,0,0,36,0,37," ",null,null,null,{"$f":"COUNTIF('Classement auteurs'!B:B,C66)","v":1}]
[13,81,131110000901,"Blues man                ",12,14,10,0,0,36,0,65," ",null,null,null,{"$f":"COUNTIF('Classement auteurs'!B:B,C67)","v":1}]
[13,101,131823002301,"Bord de mer              ",10,12,14,0,0,36,0,66," ",null,null,null,{"$f":"COUNTIF('Classement auteurs'!B:B,C68)","v":1}]
[13,108,131353003001,"Chômage technique.      ",13,12,11,0,0,36,0,121," ",null,null,null,{"$f":"COUNTIF('Classement auteurs'!B:B,C69)","v":1}]
[13,109,131845002501,"Canal du centre          ",11,13,12,0,0,36,0,96," ",null,null,null,{"$f":"COUNTIF('Classement auteurs'!B:B,C70)","v":1}]
[13,110,131956004901,"Imploration              ",13,9,14,0,0,36,0,15," ",null,null,null,{"$f":"COUNTIF('Classement auteurs'!B:B,C71)","v":1}]
[13,121,131499006801,"Potier à l'ouvrage      ",10,15,11,0,0,36,0,105," ",null,null,null,{"$f":"COUNTIF('Classement auteurs'!B:B,C72)","v":1}]
[13,14,130925010201,"La chevelure             ",12,12,11,0,0,35,0,56," ",null,null,null,{"$f":"COUNTIF('Classement auteurs'!B:B,C73)","v":1}]
[13,16,132193000701,"Contemplation            ",15,11,9,0,0,35,0,50," ",null,null,null,{"$f":"COUNTIF('Classement auteurs'!B:B,C74)","v":1}]
[13,62,132147000101,"Musique                  ",11,16,8,0,0,35,0,9," ",null,null,null,{"$f":"COUNTIF('Classement auteurs'!B:B,C75)","v":1}]
[13,76,132060001701,"Rêveries                ",9,12,14,0,0,35,0,111," ",null,null,null,{"$f":"COUNTIF('Classement auteurs'!B:B,C76)","v":1}]
[13,83,131879000601,"Urbain le matin          ",11,11,13,0,0,35,0,100," ",null,null,null,{"$f":"COUNTIF('Classement auteurs'!B:B,C77)","v":1}]
[13,123,132060001801,"Timidité...             ",14,13,8,0,0,35,0,12," ",null,null,null,{"$f":"COUNTIF('Classement auteurs'!B:B,C78)","v":1}]
[13,124,131353006101,"Les yeux d'Athéna       ",14,9,12,0,0,35,0,44," ",null,null,null,{"$f":"COUNTIF('Classement auteurs'!B:B,C79)","v":1}]
[13,1,131845000801,"Au fond de l'eau         ",12,8,14,0,0,34,0,29," ",null,null,null,{"$f":"COUNTIF('Classement auteurs'!B:B,C80)","v":1}]
[13,29,131499008701,"Rencontre ...            ",11,10,13,0,0,34,0,19," ",null,null,null,{"$f":"COUNTIF('Classement auteurs'!B:B,C81)","v":1}]
[13,31,131353000201,"Cité des vins à Bordeaux",11,10,13,0,0,34,0,33," ",null,null,null,{"$f":"COUNTIF('Classement auteurs'!B:B,C82)","v":1}]
[13,34,131499005201,"Jumping                  ",12,12,10,0,0,34,0,6," ",null,null,null,{"$f":"COUNTIF('Classement auteurs'!B:B,C83)","v":1}]
[13,48,131823009001,"Feria carmaguaise        ",10,14,10,0,0,34,0,13," ",null,null,null,{"$f":"COUNTIF('Classement auteurs'!B:B,C84)","v":1}]
[13,80,130987023901,"Paradoxe                 ",13,11,10,0,0,34,0,57," ",null,null,null,{"$f":"COUNTIF('Classement auteurs'!B:B,C85)","v":1}]
[13,92,132089000101,"C'est la pause ...       ",13,13,8,0,0,34,0,60," ",null,null,null,{"$f":"COUNTIF('Classement auteurs'!B:B,C86)","v":1}]
[13,95,131619002601,"Sortie en ville          ",10,12,12,0,0,34,0,34," ",null,null,null,{"$f":"COUNTIF('Classement auteurs'!B:B,C87)","v":1}]
[13,13,131376014701,"Souffrance               ",9,11,13,0,0,33,0,7," ",null,null,null,{"$f":"COUNTIF('Classement auteurs'!B:B,C88)","v":1}]
[13,20,131376012601,"Prophétic               ",9,10,14,0,0,33,0,91," ",null,null,null,{"$f":"COUNTIF('Classement auteurs'!B:B,C89)","v":1}]
[13,23,131992000301,"Champ d'échalotes       ",11,9,13,0,0,33,0,4," ",null,null,null,{"$f":"COUNTIF('Classement auteurs'!B:B,C90)","v":1}]
[13,35,130878014101,"Pin-up                   ",14,9,10,0,0,33,0,112," ",null,null,null,{"$f":"COUNTIF('Classement auteurs'!B:B,C91)","v":1}]
[13,42,132086002301,"J'espionne               ",10,10,13,0,0,33,0,31," ",null,null,null,{"$f":"COUNTIF('Classement auteurs'!B:B,C92)","v":1}]
[13,55,131823007701,"Pétrolette              ",12,9,12,0,0,33,0,43," ",null,null,null,{"$f":"COUNTIF('Classement auteurs'!B:B,C93)","v":1}]
[13,70,130878013601,"Reflet dans une tasse de ",10,8,15,0,0,33,0,72," ",null,null,null,{"$f":"COUNTIF('Classement auteurs'!B:B,C94)","v":1}]
[13,88,130987019701,"Coaching                 ",11,14,8,0,0,33,0,123," ",null,null,null,{"$f":"COUNTIF('Classement auteurs'!B:B,C95)","v":1}]
[13,93,132060001201,"Nocturne à la Défense  ",10,11,12,0,0,33,0,70," ",null,null,null,{"$f":"COUNTIF('Classement auteurs'!B:B,C96)","v":1}]
[13,45,131499003901,"La cavalière            ",11,9,12,0,0,32,0,68," ",null,null,null,{"$f":"COUNTIF('Classement auteurs'!B:B,C97)","v":1}]
[13,67,130527015501,"Contre jour2             ",8,9,15,0,0,32,0,80," ",null,null,null,{"$f":"COUNTIF('Classement auteurs'!B:B,C98)","v":1}]
[13,4,132084001701,"Pavés                   ",10,10,11,0,0,31,0,69," ",null,null,null,{"$f":"COUNTIF('Classement auteurs'!B:B,C99)","v":1}]
[13,41,131862003801,"Plage de Piemanson       ",11,9,11,0,0,31,0,48," ",null,null,null,{"$f":"COUNTIF('Classement auteurs'!B:B,C100)","v":1}]
[13,65,132103002301,"Napoli g'ART             ",13,9,9,0,0,31,0,8," ",null,null,null,{"$f":"COUNTIF('Classement auteurs'!B:B,C101)","v":1}]
[13,104,130527011601,"Amour de pierre          ",10,11,10,0,0,31,0,30," ",null,null,null,{"$f":"COUNTIF('Classement auteurs'!B:B,C102)","v":1}]
[13,106,131956001401,"St Pétersbourg l'hiver  ",10,8,13,0,0,31,0,26," ",null,null,null,{"$f":"COUNTIF('Classement auteurs'!B:B,C103)","v":1}]
[13,126,131353006201,"Descente aux flambeaux   ",8,12,11,0,0,31,0,14," ",null,null,null,{"$f":"COUNTIF('Classement auteurs'!B:B,C104)","v":1}]
[13,2,132147000601,"Ours                     ",13,6,11,0,0,30,0,104," ",null,null,null,{"$f":"COUNTIF('Classement auteurs'!B:B,C105)","v":1}]
[13,8,132193000501,"Alphabet                 ",9,10,11,0,0,30,0,2," ",null,null,null,{"$f":"COUNTIF('Classement auteurs'!B:B,C106)","v":1}]
[13,99,130987023201,"Felleng                  ",11,7,12,0,0,30,0,22," ",null,null,null,{"$f":"COUNTIF('Classement auteurs'!B:B,C107)","v":1}]
[13,36,131879001301,"Noir et blanc            ",11,10,8,0,0,29,0,10," ",null,null,null,{"$f":"COUNTIF('Classement auteurs'!B:B,C108)","v":1}]
[13,66,130527002501,"Percheron                ",7,11,11,0,0,29,0,21," ",null,null,null,{"$f":"COUNTIF('Classement auteurs'!B:B,C109)","v":1}]
[13,87,130987019601,"Les yeux d'une mère     ",11,9,9,0,0,29,0,25," ",null,null,null,{"$f":"COUNTIF('Classement auteurs'!B:B,C110)","v":1}]
[13,90,132060000101,"Cimetière Marin         ",8,7,14,0,0,29,0,38," ",null,null,null,{"$f":"COUNTIF('Classement auteurs'!B:B,C111)","v":1}]
[13,91,131956004301,"L'heure de la prière    ",11,7,11,0,0,29,0,54," ",null,null,null,{"$f":"COUNTIF('Classement auteurs'!B:B,C112)","v":1}]
[13,96,131683007601,"Dans l'attente           ",9,8,12,0,0,29,0,95," ",null,null,null,{"$f":"COUNTIF('Classement auteurs'!B:B,C113)","v":1}]
[13,116,132060000901,"La force de la nature    ",10,7,12,0,0,29,0,52," ",null,null,null,{"$f":"COUNTIF('Classement auteurs'!B:B,C114)","v":1}]
[13,117,131683007101,"Les biquettes de jouques ",9,7,13,0,0,29,0,108," ",null,null,null,{"$f":"COUNTIF('Classement auteurs'!B:B,C115)","v":1}]
[13,21,131845003501,"Le voisin nous a quitté ",10,8,10,0,0,28,0,101," ",null,null,null,{"$f":"COUNTIF('Classement auteurs'!B:B,C116)","v":1}]
[13,68,130878013401,"La visite                ",9,9,10,0,0,28,0,79," ",null,null,null,{"$f":"COUNTIF('Classement auteurs'!B:B,C117)","v":1}]
[13,74,132060000701,"Défense d'entrer        ",9,10,9,0,0,28,0,120," ",null,null,null,{"$f":"COUNTIF('Classement auteurs'!B:B,C118)","v":1}]
[13,75,132060002201,"Petite sieste            ",12,9,6,0,0,27,0,11," ",null,null,null,{"$f":"COUNTIF('Classement auteurs'!B:B,C119)","v":1}]
[13,129,131956005701,"Solitude                 ",10,8,9,0,0,27,0,115," ",null,null,null,{"$f":"COUNTIF('Classement auteurs'!B:B,C120)","v":1}]
[13,98,132060002801,"Marabout kaouki          ",12,7,7,0,0,26,0,124," ",null,null,null,{"$f":"COUNTIF('Classement auteurs'!B:B,C121)","v":1}]
[13,128,132060002001,"Suivez les flèches !    ",7,7,12,0,0,26,0,89," ",null,null,null,{"$f":"COUNTIF('Classement auteurs'!B:B,C122)","v":1}]
[13,17,130527019601,"Ile de Goré: les adieux ",8,9,7,0,0,24,0,27," ",null,null,null,{"$f":"COUNTIF('Classement auteurs'!B:B,C123)","v":1}]
[13,72,131992000401,"Jeux de lumière         ",8,7,9,0,0,24,0,74," ",null,null,null,{"$f":"COUNTIF('Classement auteurs'!B:B,C124)","v":1}]
[13,69,131499008201,"Bateau échoué          ",14,6,0,0,0,20,0,63," ",null,null,null,{"$f":"COUNTIF('Classement auteurs'!B:B,C125)","v":1}]
[13,94,132193001201,"Le pied                  ",6,6,6,0,0,18,0,59," ",null,null,null,{"$f":"COUNTIF('Classement auteurs'!B:B,C126)","v":1}]
[null,null,null,null,null,null,null,null,null,null,null,null,null,null,null,null,{"$f":"COUNTIF('Classement auteurs'!B:B,C127)","v":0}]
[null,null,null,null,null,null,null,null,null,null,null,null,null,null,null,null,{"$f":"COUNTIF('Classement auteurs'!B:B,C128)","v":0}]
[null,null,null,null,null,null,null,null,null,null,null,null,null,null,null,null,{"$f":"COUNTIF('Classement auteurs'!B:B,C129)","v":0}]
[null,null,null,null,null,null,null,null,null,null,null,null,null,null,null,null,{"$f":"COUNTIF('Classement auteurs'!B:B,C130)","v":0}]
[null,null,null,null,null,null,null,null,null,null,null,null,null,null,null,null,{"$f":"COUNTIF('Classement auteurs'!B:B,C131)","v":0}]
[null,null,null,null,null,null,null,null,null,null,null,null,null,null,null,null,{"$f":"COUNTIF('Classement auteurs'!B:B,C132)","v":0}]
[null,null,null,null,null,null,null,null,null,null,null,null,null,null,null,null,{"$f":"COUNTIF('Classement auteurs'!B:B,C133)","v":0}]
[null,null,null,null,null,null,null,null,null,null,null,null,null,null,null,null,{"$f":"COUNTIF('Classement auteurs'!B:B,C134)","v":0}]
[null,null,null,null,null,null,null,null,null,null,null,null,null,null,null,null,{"$f":"COUNTIF('Classement auteurs'!B:B,C135)","v":0}]
[null,null,null,null,null,null,null,null,null,null,null,null,null,null,null,null,{"$f":"COUNTIF('Classement auteurs'!B:B,C136)","v":0}]
[null,null,null,null,null,null,null,null,null,null,null,null,null,null,null,null,{"$f":"COUNTIF('Classement auteurs'!B:B,C137)","v":0}]
[null,null,null,null,null,null,null,null,null,null,null,null,null,null,null,null,{"$f":"COUNTIF('Classement auteurs'!B:B,C138)","v":0}]

{"sheet":"Liste des clubs","index":10,"n_rows":51,"n_cols":5,"rows_kept":51,"cut":false,"hidden":false,"merged":[]}
[]
[null,"N° de club","Nom","Département","Ville"]
[1,435,"Beausoleil Ciné Photo Club",6,"Beausoleil"]
[2,462,"Image 2000",13,"Marignane"]
[3,527,"Photo Club de Martigues",13,"Lavéra"]
[4,878,"PC Antoine Santoru-Port de Bouc",13,"Port-de-Bouc"]
[5,921,"Photo Club M.P.T. Vitrolles",13,"Vitrolles"]
[6,925,"A.S.L.P.S. Photo Fos-sur-Mer",13,"Fos-Sur-Mer"]
[7,987,"Cl. Phot’Azur Six-Fours-les-Plages",83,"Six-Fours-Les-Plages"]
[8,993,"P.C. La Garde – Marseille",13,"Marseille"]
[9,1110,"Ciné Photo Club de Peymeinade",6,"Peymeinade"]
[10,1227,"Photo Ciné Club Courthezonnais",84,"Bedarrides"]
[11,1353,"Photo Club de La Crau",13,"Saint-Martin-De-Crau"]
[12,1376,"PHOCAL",13,"Allauch-Cedex"]
[13,1426,"Diaphragme et Lumière Var – Ollioules",83,"Ollioules"]
[14,1441,"Club mage Monaco",98,"Monaco"]
[15,1450,"Arc Images- Rousset",13,"Rousset"]
[16,1494,"Photo-Club du Brianconnais",5,"Briancon"]
[17,1499,"Images Expressions – Cagnes sur Mer",6,"Cagnes-Sur-Mer"]
[18,1601,"Club Pugetois de L’image",83,"Puget-Sur-Argens"]
[19,1619,"Optique Diaporama Marseille",13,"La Bouilladisse"]
[20,1683,"Marius Saint-Mitre-les-Remparts",13,"Saint-Mitre-Les-Remparts"]
[21,1777,"Club Photo et Vidéo Plan de La Tour",83,"Plan-de-la-Tour"]
[22,1796,"Ciné Caméra Club de Cannes",6,"Cannes"]
[23,1823,"Photo Club Mouansois",6,"Mouans-Sartoux"]
[24,1824,"Photo Club IBM Cote d’Azur",6,"Nice"]
[25,1845,"Photo Club Carqueirannais",83,"Carqueiranne"]
[26,1862,"Déclic et des Claps – Roquefort les Pins",6,"Roquefort-les-Pins"]
[27,1867,"PhotoMenton",6,"Menton"]
[28,1879,"Association Sportive de Berre",13,"Berre-L'Etang"]
[29,1899,"Club de l’Image",83,"Sollies-Pont"]
[30,1956,"Photo Contact Puyricard",13,"Puyricard"]
[31,1969,"Mission Photo – Cannes la Bocca",6,"Cannes-la-Bocca"]
[32,1985,"Rognonas Image Regard Espace",13,"Rognonas"]
[33,1992,"Photo Club Velauxien – Clin d’Œil",13,"Velaux"]
[34,2003,"Photo Club Moriérois",84,"Morieres-les-Avignon"]
[35,2023,"Club Art Déclic de l’ Argens",83,"Puget-sur-Argens"]
[36,2028,"Association Regards du Sud",6,"Aspremont"]
[37,2060,"Image Club Gardéen",83,"La Garde"]
[38,2084,"Azur Photo Passion",6,"Cagnes-Sur-Mer"]
[39,2086,"Objectif Image Nice",6,"Nice"]
[40,2089,"La Farledo Objectif Club",83,"La Farlède"]
[41,2103,"Club Photo St Laurent du Var",6,"Saint-Laurent-du-Var"]
[42,2147,"Club Photo Saint Savournin",13,"Saint-Savournin"]
[43,2158,"Café Photo Marseille",13,"Marseille"]
[44,2180,"Photo Club Carry Côte Bleue",13,"Carry-le-Rouet"]
[45,2193,"Antibes Photo Club",6,"Antibes"]
[46,2203,"Club Photo de Saignon",84,"Saignon"]
[47,2211,"Club Photo UAICF de Gap",5,"Gap"]
[48,2217,"ADSB – Club Photo Bouc Bel Air",13,"Bouc-Bel-Air"]
[49,2222,"Association Culturelle Photo Club de Neffes",5,"Neffes"]

{"sheet":"Comparaison auteurs","index":11,"n_rows":281,"n_cols":30,"rows_kept":281,"cut":false,"hidden":false,"merged":[[0,1,0,9],[0,21,0,29],[0,11,0,19]]}
[null,"Classement Mistral",null,null,null,null,null,null,null,null,null,"Comparaison",null,null,null,null,null,null,null,null,null,"Classement Gbinforme","Classement Mistral"]
[null,"Fichier","Défi-1","Défi-2","Défi-3","Défi-4","Défi-5","Défi-6","Défi-7","Total",null,"Fichier","Défi-1","Défi-2","Défi-3","Défi-4","Défi-5","Défi-6","Défi-7","Total",null,"Fichier","Défi-1","Défi-2","Défi-3","Défi-4","Défi-5","Défi-6","Défi-7","Total"]
[null,131683007901,{"$f":"IFERROR(VLOOKUP($B3,'Défi-1'!$C$2:$J$200,8,FALSE),\"\")","v":54},{"$f":"IFERROR(VLOOKUP($B3,'Défi-2'!$C$2:$J$200,8,FALSE),\"\")","v":39},{"$f":"IFERROR(VLOOKUP($B3,'Défi-3'!$C$2:$J$200,8,FALSE),\"\")","v":38},{"$f":"IFERROR(VLOOKUP($B3,'Défi-4'!$C$2:$J$200,8,FALSE),\"\")","v":51},{"$f":"IFERROR(VLOOKUP($B3,'Défi-5'!$C$2:$J$200,8,FALSE),\"\")","v":58},{"$f":"IFERROR(VLOOKUP($B3,'Défi-6'!$C$2:$J$200,8,FALSE),\"\")","v":51},{"$f":"IFERROR(VLOOKUP($B3,'Défi-7'!$C$2:$J$200,8,FALSE),\"\")","v":42},{"$f":"SUM(C3:I3)","v":333},null,{"$f":"IF(B3=V3,\"OK\",\"KO\")","v":"OK"},{"$f":"IF(C3=W3,\"OK\",\"KO\")","v":"OK"},"OK","OK","OK","OK","OK","OK","OK",null,{"$f":"'Classement auteurs'!$B3","v":131683007901},{"$f":"IF('Classement auteurs'!C3=\"\",\"\",'Classement auteurs'!C3)","v":54},{"$f":"IF('Classement auteurs'!D3=\"\",\"\",'Classement auteurs'!D3)","v":39},{"$f":"IF('Classement auteurs'!E3=\"\",\"\",'Classement auteurs'!E3)","v":38},{"$f":"IF('Classement auteurs'!F3=\"\",\"\",'Classement auteurs'!F3)","v":51},{"$f":"IF('Classement auteurs'!G3=\"\",\"\",'Classement auteurs'!G3)","v":58},{"$f":"IF('Classement auteurs'!H3=\"\",\"\",'Classement auteurs'!H3)","v":51},{"$f":"IF('Classement auteurs'!I3=\"\",\"\",'Classement auteurs'!I3)","v":42},{"$f":"IF('Classement auteurs'!J3=\"\",\"\",'Classement auteurs'!J3)","v":333}]
[null,131110000901,{"$f":"IFERROR(VLOOKUP($B4,'Défi-1'!$C$2:$J$200,8,FALSE),\"\")","v":51},{"$f":"IFERROR(VLOOKUP($B4,'Défi-2'!$C$2:$J$200,8,FALSE),\"\")","v":45},{"$f":"IFERROR(VLOOKUP($B4,'Défi-3'!$C$2:$J$200,8,FALSE),\"\")","v":56},{"$f":"IFERROR(VLOOKUP($B4,'Défi-4'!$C$2:$J$200,8,FALSE),\"\")","v":43},{"$f":"IFERROR(VLOOKUP($B4,'Défi-5'!$C$2:$J$200,8,FALSE),\"\")","v":41},{"$f":"IFERROR(VLOOKUP($B4,'Défi-6'!$C$2:$J$200,8,FALSE),\"\")","v":43},{"$f":"IFERROR(VLOOKUP($B4,'Défi-7'!$C$2:$J$200,8,FALSE),\"\")","v":36},{"$f":"SUM(C4:I4)","v":315},null,{"$f":"IF(B4=V4,\"OK\",\"KO\")","v":"OK"},{"$f":"IF(C4=W4,\"OK\",\"KO\")","v":"OK"},{"$f":"IF(D4=X4,\"OK\",\"KO\")","v":"OK"},{"$f":"IF(E4=Y4,\"OK\",\"KO\")","v":"OK"},{"$f":"IF(F4=Z4,\"OK\",\"KO\")","v":"OK"},{"$f":"IF(G4=AA4,\"OK\",\"KO\")","v":"OK"},{"$f":"IF(H4=AB4,\"OK\",\"KO\")","v":"OK"},{"$f":"IF(I4=AC4,\"OK\",\"KO\")","v":"OK"},{"$f":"IF(J4=AD4,\"OK\",\"KO\")","v":"OK"},null,{"$f":"'Classement auteurs'!$B4","v":131110000901},{"$f":"IF('Classement auteurs'!C4=\"\",\"\",'Classement auteurs'!C4)","v":51},{"$f":"IF('Classement auteurs'!D4=\"\",\"\",'Classement auteurs'!D4)","v":45},{"$f":"IF('Classement auteurs'!E4=\"\",\"\",'Classement auteurs'!E4)","v":56},{"$f":"IF('Classement auteurs'!F4=\"\",\"\",'Classement auteurs'!F4)","v":43},{"$f":"IF('Classement auteurs'!G4=\"\",\"\",'Classement auteurs'!G4)","v":41},{"$f":"IF('Classement auteurs'!H4=\"\",\"\",'Classement auteurs'!H4)","v":43},{"$f":"IF('Classement auteurs'!I4=\"\",\"\",'Classement auteurs'!I4)","v":36},{"$f":"IF('Classement auteurs'!J4=\"\",\"\",'Classement auteurs'!J4)","v":315}]
[null,131824001901,{"$f":"IFERROR(VLOOKUP($B5,'Défi-1'!$C$2:$J$200,8,FALSE),\"\")","v":52},{"$f":"IFERROR(VLOOKUP($B5,'Défi-2'!$C$2:$J$200,8,FALSE),\"\")","v":40},{"$f":"IFERROR(VLOOKUP($B5,'Défi-3'!$C$2:$J$200,8,FALSE),\"\")","v":45},{"$f":"IFERROR(VLOOKUP($B5,'Défi-4'!$C$2:$J$200,8,FALSE),\"\")","v":48},{"$f":"IFERROR(VLOOKUP($B5,'Défi-5'!$C$2:$J$200,8,FALSE),\"\")","v":44},{"$f":"IFERROR(VLOOKUP($B5,'Défi-6'!$C$2:$J$200,8,FALSE),\"\")","v":52},{"$f":"IFERROR(VLOOKUP($B5,'Défi-7'!$C$2:$J$200,8,FALSE),\"\")","v":45},326,null,"OK","OK","OK","OK","OK","OK","KO","OK","KO",null,{"$f":"'Classement auteurs'!$B5","v":131824001901},{"$f":"IF('Classement auteurs'!C5=\"\",\"\",'Classement auteurs'!C5)","v":52},{"$f":"IF('Classement auteurs'!D5=\"\",\"\",'Classement auteurs'!D5)","v":40},{"$f":"IF('Classement auteurs'!E5=\"\",\"\",'Classement auteurs'!E5)","v":45},{"$f":"IF('Classement auteurs'!F5=\"\",\"\",'Classement auteurs'!F5)","v":48},{"$f":"IF('Classement auteurs'!G5=\"\",\"\",'Classement auteurs'!G5)","v":44},{"$f":"IF('Classement auteurs'!H5=\"\",\"\",'Classement auteurs'!H5)","v":40},{"$f":"IF('Classement auteurs'!I5=\"\",\"\",'Classement auteurs'!I5)","v":45},{"$f":"IF('Classement auteurs'!J5=\"\",\"\",'Classement auteurs'!J5)","v":314}]
[null,130987024201,{"$f":"IFERROR(VLOOKUP($B6,'Défi-1'!$C$2:$J$200,8,FALSE),\"\")","v":46},{"$f":"IFERROR(VLOOKUP($B6,'Défi-2'!$C$2:$J$200,8,FALSE),\"\")","v":43},{"$f":"IFERROR(VLOOKUP($B6,'Défi-3'!$C$2:$J$200,8,FALSE),\"\")","v":48},{"$f":"IFERROR(VLOOKUP($B6,'Défi-4'!$C$2:$J$200,8,FALSE),\"\")","v":45},{"$f":"IFERROR(VLOOKUP($B6,'Défi-5'!$C$2:$J$200,8,FALSE),\"\")","v":39},{"$f":"IFERROR(VLOOKUP($B6,'Défi-6'!$C$2:$J$200,8,FALSE),\"\")","v":48},{"$f":"IFERROR(VLOOKUP($B6,'Défi-7'!$C$2:$J$200,8,FALSE),\"\")","v":43},312,null,"OK","OK","OK","OK","OK","OK","KO","OK","KO",null,{"$f":"'Classement auteurs'!$B6","v":130987024201},{"$f":"IF('Classement auteurs'!C6=\"\",\"\",'Classement auteurs'!C6)","v":46},{"$f":"IF('Classement auteurs'!D6=\"\",\"\",'Classement auteurs'!D6)","v":43},{"$f":"IF('Classement auteurs'!E6=\"\",\"\",'Classement auteurs'!E6)","v":48},{"$f":"IF('Classement auteurs'!F6=\"\",\"\",'Classement auteurs'!F6)","v":45},{"$f":"IF('Classement auteurs'!G6=\"\",\"\",'Classement auteurs'!G6)","v":39},{"$f":"IF('Classement auteurs'!H6=\"\",\"\",'Classement auteurs'!H6)","v":45},{"$f":"IF('Classement auteurs'!I6=\"\",\"\",'Classement auteurs'!I6)","v":43},{"$f":"IF('Classement auteurs'!J6=\"\",\"\",'Classement auteurs'!J6)","v":309}]
[null,132193000301,{"$f":"IFERROR(VLOOKUP($B7,'Défi-1'!$C$2:$J$200,8,FALSE),\"\")","v":48},{"$f":"IFERROR(VLOOKUP($B7,'Défi-2'!$C$2:$J$200,8,FALSE),\"\")","v":37},{"$f":"IFERROR(VLOOKUP($B7,'Défi-3'!$C$2:$J$200,8,FALSE),\"\")","v":40},{"$f":"IFERROR(VLOOKUP($B7,'Défi-4'!$C$2:$J$200,8,FALSE),\"\")","v":45},{"$f":"IFERROR(VLOOKUP($B7,'Défi-5'!$C$2:$J$200,8,FALSE),\"\")","v":38},{"$f":"IFERROR(VLOOKUP($B7,'Défi-6'!$C$2:$J$200,8,FALSE),\"\")","v":48},{"$f":"IFERROR(VLOOKUP($B7,'Défi-7'!$C$2:$J$200,8,FALSE),\"\")","v":55},311,null,"OK","OK","OK","OK","OK","OK","KO","OK","KO",null,{"$f":"'Classement auteurs'!$B7","v":132193000301},{"$f":"IF('Classement auteurs'!C7=\"\",\"\",'Classement auteurs'!C7)","v":48},{"$f":"IF('Classement auteurs'!D7=\"\",\"\",'Classement auteurs'!D7)","v":37},{"$f":"IF('Classement auteurs'!E7=\"\",\"\",'Classement auteurs'!E7)","v":40},{"$f":"IF('Classement auteurs'!F7=\"\",\"\",'Classement auteurs'!F7)","v":45},{"$f":"IF('Classement auteurs'!G7=\"\",\"\",'Classement auteurs'!G7)","v":38},{"$f":"IF('Classement auteurs'!H7=\"\",\"\",'Classement auteurs'!H7)","v":38},{"$f":"IF('Classement auteurs'!I7=\"\",\"\",'Classement auteurs'!I7)","v":55},{"$f":"IF('Classement auteurs'!J7=\"\",\"\",'Classement auteurs'!J7)","v":301}]
[null,130527009401,{"$f":"IFERROR(VLOOKUP($B8,'Défi-1'!$C$2:$J$200,8,FALSE),\"\")","v":50},{"$f":"IFERROR(VLOOKUP($B8,'Défi-2'!$C$2:$J$200,8,FALSE),\"\")","v":53},{"$f":"IFERROR(VLOOKUP($B8,'Défi-3'!$C$2:$J$200,8,FALSE),\"\")","v":46},{"$f":"IFERROR(VLOOKUP($B8,'Défi-4'!$C$2:$J$200,8,FALSE),\"\")","v":50},{"$f":"IFERROR(VLOOKUP($B8,'Défi-5'!$C$2:$J$200,8,FALSE),\"\")","v":51},{"$f":"IFERROR(VLOOKUP($B8,'Défi-6'!$C$2:$J$200,8,FALSE),\"\")","v":""},{"$f":"IFERROR(VLOOKUP($B8,'Défi-7'!$C$2:$J$200,8,FALSE),\"\")","v":49},299,null,"OK","OK","OK","OK","OK","OK","OK","OK","OK",null,{"$f":"'Classement auteurs'!$B8","v":130527009401},{"$f":"IF('Classement auteurs'!C8=\"\",\"\",'Classement auteurs'!C8)","v":50},{"$f":"IF('Classement auteurs'!D8=\"\",\"\",'Classement auteurs'!D8)","v":53},{"$f":"IF('Classement auteurs'!E8=\"\",\"\",'Classement auteurs'!E8)","v":46},{"$f":"IF('Classement auteurs'!F8=\"\",\"\",'Classement auteurs'!F8)","v":50},{"$f":"IF('Classement auteurs'!G8=\"\",\"\",'Classement auteurs'!G8)","v":51},{"$f":"IF('Classement auteurs'!H8=\"\",\"\",'Classement auteurs'!H8)","v":""},{"$f":"IF('Classement auteurs'!I8=\"\",\"\",'Classement auteurs'!I8)","v":49},{"$f":"IF('Classement auteurs'!J8=\"\",\"\",'Classement auteurs'!J8)","v":299}]
[null,130987015701,{"$f":"IFERROR(VLOOKUP($B9,'Défi-1'!$C$2:$J$200,8,FALSE),\"\")","v":48},{"$f":"IFERROR(VLOOKUP($B9,'Défi-2'!$C$2:$J$200,8,FALSE),\"\")","v":39},{"$f":"IFERROR(VLOOKUP($B9,'Défi-3'!$C$2:$J$200,8,FALSE),\"\")","v":34},{"$f":"IFERROR(VLOOKUP($B9,'Défi-4'!$C$2:$J$200,8,FALSE),\"\")","v":41},{"$f":"IFERROR(VLOOKUP($B9,'Défi-5'!$C$2:$J$200,8,FALSE),\"\")","v":46},{"$f":"IFERROR(VLOOKUP($B9,'Défi-6'!$C$2:$J$200,8,FALSE),\"\")","v":48},{"$f":"IFERROR(VLOOKUP($B9,'Défi-7'!$C$2:$J$200,8,FALSE),\"\")","v":52},{"$f":"SUM(C9:I9)","v":308},null,{"$f":"IF(B9=V9,\"OK\",\"KO\")","v":"OK"},"OK","OK","OK","OK","OK","KO","OK","KO",null,{"$f":"'Classement auteurs'!$B9","v":130987015701},{"$f":"IF('Classement auteurs'!C9=\"\",\"\",'Classement auteurs'!C9)","v":48},{"$f":"IF('Classement auteurs'!D9=\"\",\"\",'Classement auteurs'!D9)","v":39},{"$f":"IF('Classement auteurs'!E9=\"\",\"\",'Classement auteurs'!E9)","v":34},{"$f":"IF('Classement auteurs'!F9=\"\",\"\",'Classement auteurs'!F9)","v":41},{"$f":"IF('Classement auteurs'!G9=\"\",\"\",'Classement auteurs'!G9)","v":46},{"$f":"IF('Classement auteurs'!H9=\"\",\"\",'Classement auteurs'!H9)","v":34},{"$f":"IF('Classement auteurs'!I9=\"\",\"\",'Classement auteurs'!I9)","v":52},{"$f":"IF('Classement auteurs'!J9=\"\",\"\",'Classement auteurs'!J9)","v":294}]
[null,131499006801,{"$f":"IFERROR(VLOOKUP($B10,'Défi-1'!$C$2:$J$200,8,FALSE),\"\")","v":35},{"$f":"IFERROR(VLOOKUP($B10,'Défi-2'!$C$2:$J$200,8,FALSE),\"\")","v":39},{"$f":"IFERROR(VLOOKUP($B10,'Défi-3'!$C$2:$J$200,8,FALSE),\"\")","v":48},{"$f":"IFERROR(VLOOKUP($B10,'Défi-4'!$C$2:$J$200,8,FALSE),\"\")","v":52},{"$f":"IFERROR(VLOOKUP($B10,'Défi-5'!$C$2:$J$200,8,FALSE),\"\")","v":42},{"$f":"IFERROR(VLOOKUP($B10,'Défi-6'!$C$2:$J$200,8,FALSE),\"\")","v":42},{"$f":"IFERROR(VLOOKUP($B10,'Défi-7'!$C$2:$J$200,8,FALSE),\"\")","v":36},{"$f":"SUM(C10:I10)","v":294},null,{"$f":"IF(B10=V10,\"OK\",\"KO\")","v":"OK"},{"$f":"IF(C10=W10,\"OK\",\"KO\")","v":"OK"},{"$f":"IF(D10=X10,\"OK\",\"KO\")","v":"OK"},{"$f":"IF(E10=Y10,\"OK\",\"KO\")","v":"OK"},{"$f":"IF(F10=Z10,\"OK\",\"KO\")","v":"OK"},{"$f":"IF(G10=AA10,\"OK\",\"KO\")","v":"OK"},{"$f":"IF(H10=AB10,\"OK\",\"KO\")","v":"OK"},{"$f":"IF(I10=AC10,\"OK\",\"KO\")","v":"OK"},{"$f":"IF(J10=AD10,\"OK\",\"KO\")","v":"OK"},null,{"$f":"'Classement auteurs'!$B10","v":131499006801},{"$f":"IF('Classement auteurs'!C10=\"\",\"\",'Classement auteurs'!C10)","v":35},{"$f":"IF('Classement auteurs'!D10=\"\",\"\",'Classement auteurs'!D10)","v":39},{"$f":"IF('Classement auteurs'!E10=\"\",\"\",'Classement auteurs'!E10)","v":48},{"$f":"IF('Classement auteurs'!F10=\"\",\"\",'Classement auteurs'!F10)","v":52},{"$f":"IF('Classement auteurs'!G10=\"\",\"\",'Classement auteurs'!G10)","v":42},{"$f":"IF('Classement auteurs'!H10=\"\",\"\",'Classement auteurs'!H10)","v":42},{"$f":"IF('Classement auteurs'!I10=\"\",\"\",'Classement auteurs'!I10)","v":36},{"$f":"IF('Classement auteurs'!J10=\"\",\"\",'Classement auteurs'!J10)","v":294}]
[null,131683006301,{"$f":"IFERROR(VLOOKUP($B11,'Défi-1'!$C$2:$J$200,8,FALSE),\"\")","v":57},{"$f":"IFERROR(VLOOKUP($B11,'Défi-2'!$C$2:$J$200,8,FALSE),\"\")","v":36},{"$f":"IFERROR(VLOOKUP($B11,'Défi-3'!$C$2:$J$200,8,FALSE),\"\")","v":34},{"$f":"IFERROR(VLOOKUP($B11,'Défi-4'!$C$2:$J$200,8,FALSE),\"\")","v":47},{"$f":"IFERROR(VLOOKUP($B11,'Défi-5'!$C$2:$J$200,8,FALSE),\"\")","v":45},{"$f":"IFERROR(VLOOKUP($B11,'Défi-6'!$C$2:$J$200,8,FALSE),\"\")","v":57},{"$f":"IFERROR(VLOOKUP($B11,'Défi-7'!$C$2:$J$200,8,FALSE),\"\")","v":36},312,null,"OK","OK","OK","OK","OK","OK","KO","OK","KO",null,{"$f":"'Classement auteurs'!$B11","v":131683006301},{"$f":"IF('Classement auteurs'!C11=\"\",\"\",'Classement auteurs'!C11)","v":57},{"$f":"IF('Classement auteurs'!D11=\"\",\"\",'Classement auteurs'!D11)","v":36},{"$f":"IF('Classement auteurs'!E11=\"\",\"\",'Classement auteurs'!E11)","v":34},{"$f":"IF('Classement auteurs'!F11=\"\",\"\",'Classement auteurs'!F11)","v":47},{"$f":"IF('Classement auteurs'!G11=\"\",\"\",'Classement auteurs'!G11)","v":45},{"$f":"IF('Classement auteurs'!H11=\"\",\"\",'Classement auteurs'!H11)","v":34},{"$f":"IF('Classement auteurs'!I11=\"\",\"\",'Classement auteurs'!I11)","v":36},{"$f":"IF('Classement auteurs'!J11=\"\",\"\",'Classement auteurs'!J11)","v":289}]
[null,131353000101,{"$f":"IFERROR(VLOOKUP($B12,'Défi-1'!$C$2:$J$200,8,FALSE),\"\")","v":45},{"$f":"IFERROR(VLOOKUP($B12,'Défi-2'!$C$2:$J$200,8,FALSE),\"\")","v":36},{"$f":"IFERROR(VLOOKUP($B12,'Défi-3'!$C$2:$J$200,8,FALSE),\"\")","v":46},{"$f":"IFERROR(VLOOKUP($B12,'Défi-4'!$C$2:$J$200,8,FALSE),\"\")","v":47},{"$f":"IFERROR(VLOOKUP($B12,'Défi-5'!$C$2:$J$200,8,FALSE),\"\")","v":57},{"$f":"IFERROR(VLOOKUP($B12,'Défi-6'!$C$2:$J$200,8,FALSE),\"\")","v":""},{"$f":"IFERROR(VLOOKUP($B12,'Défi-7'!$C$2:$J$200,8,FALSE),\"\")","v":56},{"$f":"SUM(C12:I12)","v":287},null,{"$f":"IF(B12=V12,\"OK\",\"KO\")","v":"OK"},{"$f":"IF(C12=W12,\"OK\",\"KO\")","v":"OK"},{"$f":"IF(D12=X12,\"OK\",\"KO\")","v":"OK"},{"$f":"IF(E12=Y12,\"OK\",\"KO\")","v":"OK"},{"$f":"IF(F12=Z12,\"OK\",\"KO\")","v":"OK"},{"$f":"IF(G12=AA12,\"OK\",\"KO\")","v":"OK"},{"$f":"IF(H12=AB12,\"OK\",\"KO\")","v":"OK"},{"$f":"IF(I12=AC12,\"OK\",\"KO\")","v":"OK"},{"$f":"IF(J12=AD12,\"OK\",\"KO\")","v":"OK"},null,{"$f":"'Classement auteurs'!$B12","v":131353000101},{"$f":"IF('Classement auteurs'!C12=\"\",\"\",'Classement auteurs'!C12)","v":45},{"$f":"IF('Classement auteurs'!D12=\"\",\"\",'Classement auteurs'!D12)","v":36},{"$f":"IF('Classement auteurs'!E12=\"\",\"\",'Classement auteurs'!E12)","v":46},{"$f":"IF('Classement auteurs'!F12=\"\",\"\",'Classement auteurs'!F12)","v":47},{"$f":"IF('Classement auteurs'!G12=\"\",\"\",'Classement auteurs'!G12)","v":57},{"$f":"IF('Classement auteurs'!H12=\"\",\"\",'Classement auteurs'!H12)","v":""},{"$f":"IF('Classement auteurs'!I12=\"\",\"\",'Classement auteurs'!I12)","v":56},{"$f":"IF('Classement auteurs'!J12=\"\",\"\",'Classement auteurs'!J12)","v":287}]
[null,131879000801,{"$f":"IFERROR(VLOOKUP($B13,'Défi-1'!$C$2:$J$200,8,FALSE),\"\")","v":50},{"$f":"IFERROR(VLOOKUP($B13,'Défi-2'!$C$2:$J$200,8,FALSE),\"\")","v":""},{"$f":"IFERROR(VLOOKUP($B13,'Défi-3'!$C$2:$J$200,8,FALSE),\"\")","v":58},{"$f":"IFERROR(VLOOKUP($B13,'Défi-4'!$C$2:$J$200,8,FALSE),\"\")","v":40},{"$f":"IFERROR(VLOOKUP($B13,'Défi-5'!$C$2:$J$200,8,FALSE),\"\")","v":36},{"$f":"IFERROR(VLOOKUP($B13,'Défi-6'!$C$2:$J$200,8,FALSE),\"\")","v":58},{"$f":"IFERROR(VLOOKUP($B13,'Défi-7'!$C$2:$J$200,8,FALSE),\"\")","v":44},286,null,"OK","OK","OK","OK","OK","OK","OK","OK","OK",null,{"$f":"'Classement auteurs'!$B13","v":131879000801},{"$f":"IF('Classement auteurs'!C13=\"\",\"\",'Classement auteurs'!C13)","v":50},{"$f":"IF('Classement auteurs'!D13=\"\",\"\",'Classement auteurs'!D13)","v":""},{"$f":"IF('Classement auteurs'!E13=\"\",\"\",'Classement auteurs'!E13)","v":58},{"$f":"IF('Classement auteurs'!F13=\"\",\"\",'Classement auteurs'!F13)","v":40},{"$f":"IF('Classement auteurs'!G13=\"\",\"\",'Classement auteurs'!G13)","v":36},{"$f":"IF('Classement auteurs'!H13=\"\",\"\",'Classement auteurs'!H13)","v":58},{"$f":"IF('Classement auteurs'!I13=\"\",\"\",'Classement auteurs'!I13)","v":44},{"$f":"IF('Classement auteurs'!J13=\"\",\"\",'Classement auteurs'!J13)","v":286}]
[null,130987024101,{"$f":"IFERROR(VLOOKUP($B14,'Défi-1'!$C$2:$J$200,8,FALSE),\"\")","v":40},{"$f":"IFERROR(VLOOKUP($B14,'Défi-2'!$C$2:$J$200,8,FALSE),\"\")","v":39},{"$f":"IFERROR(VLOOKUP($B14,'Défi-3'!$C$2:$J$200,8,FALSE),\"\")","v":36},{"$f":"IFERROR(VLOOKUP($B14,'Défi-4'!$C$2:$J$200,8,FALSE),\"\")","v":46},{"$f":"IFERROR(VLOOKUP($B14,'Défi-5'!$C$2:$J$200,8,FALSE),\"\")","v":44},{"$f":"IFERROR(VLOOKUP($B14,'Défi-6'!$C$2:$J$200,8,FALSE),\"\")","v":46},{"$f":"IFERROR(VLOOKUP($B14,'Défi-7'!$C$2:$J$200,8,FALSE),\"\")","v":39},290,null,"OK","OK","OK","OK","OK","OK","KO","OK","KO",null,{"$f":"'Classement auteurs'!$B14","v":130987024101},{"$f":"IF('Classement auteurs'!C14=\"\",\"\",'Classement auteurs'!C14)","v":40},{"$f":"IF('Classement auteurs'!D14=\"\",\"\",'Classement auteurs'!D14)","v":39},{"$f":"IF('Classement auteurs'!E14=\"\",\"\",'Classement auteurs'!E14)","v":36},{"$f":"IF('Classement auteurs'!F14=\"\",\"\",'Classement auteurs'!F14)","v":46},{"$f":"IF('Classement auteurs'!G14=\"\",\"\",'Classement auteurs'!G14)","v":44},{"$f":"IF('Classement auteurs'!H14=\"\",\"\",'Classement auteurs'!H14)","v":36},{"$f":"IF('Classement auteurs'!I14=\"\",\"\",'Classement auteurs'!I14)","v":39},{"$f":"IF('Classement auteurs'!J14=\"\",\"\",'Classement auteurs'!J14)","v":280}]
[null,131376018301,{"$f":"IFERROR(VLOOKUP($B15,'Défi-1'!$C$2:$J$200,8,FALSE),\"\")","v":31},{"$f":"IFERROR(VLOOKUP($B15,'Défi-2'!$C$2:$J$200,8,FALSE),\"\")","v":34},{"$f":"IFERROR(VLOOKUP($B15,'Défi-3'!$C$2:$J$200,8,FALSE),\"\")","v":57},{"$f":"IFERROR(VLOOKUP($B15,'Défi-4'!$C$2:$J$200,8,FALSE),\"\")","v":41},{"$f":"IFERROR(VLOOKUP($B15,'Défi-5'!$C$2:$J$200,8,FALSE),\"\")","v":44},{"$f":"IFERROR(VLOOKUP($B15,'Défi-6'!$C$2:$J$200,8,FALSE),\"\")","v":57},{"$f":"IFERROR(VLOOKUP($B15,'Défi-7'!$C$2:$J$200,8,FALSE),\"\")","v":42},306,null,"OK","OK","OK","OK","OK","OK","KO","OK","KO",null,{"$f":"'Classement auteurs'!$B15","v":131376018301},{"$f":"IF('Classement auteurs'!C15=\"\",\"\",'Classement auteurs'!C15)","v":31},{"$f":"IF('Classement auteurs'!D15=\"\",\"\",'Classement auteurs'!D15)","v":34},{"$f":"IF('Classement auteurs'!E15=\"\",\"\",'Classement auteurs'!E15)","v":57},{"$f":"IF('Classement auteurs'!F15=\"\",\"\",'Classement auteurs'!F15)","v":41},{"$f":"IF('Classement auteurs'!G15=\"\",\"\",'Classement auteurs'!G15)","v":44},{"$f":"IF('Classement auteurs'!H15=\"\",\"\",'Classement auteurs'!H15)","v":31},{"$f":"IF('Classement auteurs'!I15=\"\",\"\",'Classement auteurs'!I15)","v":42},{"$f":"IF('Classement auteurs'!J15=\"\",\"\",'Classement auteurs'!J15)","v":280}]
[null,130987019701,{"$f":"IFERROR(VLOOKUP($B16,'Défi-1'!$C$2:$J$200,8,FALSE),\"\")","v":51},{"$f":"IFERROR(VLOOKUP($B16,'Défi-2'!$C$2:$J$200,8,FALSE),\"\")","v":40},{"$f":"IFERROR(VLOOKUP($B16,'Défi-3'!$C$2:$J$200,8,FALSE),\"\")","v":40},{"$f":"IFERROR(VLOOKUP($B16,'Défi-4'!$C$2:$J$200,8,FALSE),\"\")","v":39},{"$f":"IFERROR(VLOOKUP($B16,'Défi-5'!$C$2:$J$200,8,FALSE),\"\")","v":37},{"$f":"IFERROR(VLOOKUP($B16,'Défi-6'!$C$2:$J$200,8,FALSE),\"\")","v":51},{"$f":"IFERROR(VLOOKUP($B16,'Défi-7'!$C$2:$J$200,8,FALSE),\"\")","v":33},291,null,"OK","OK","OK","OK","OK","OK","KO","OK","KO",null,{"$f":"'Classement auteurs'!$B16","v":130987019701},{"$f":"IF('Classement auteurs'!C16=\"\",\"\",'Classement auteurs'!C16)","v":51},{"$f":"IF('Classement auteurs'!D16=\"\",\"\",'Classement auteurs'!D16)","v":40},{"$f":"IF('Classement auteurs'!E16=\"\",\"\",'Classement auteurs'!E16)","v":40},{"$f":"IF('Classement auteurs'!F16=\"\",\"\",'Classement auteurs'!F16)","v":39},{"$f":"IF('Classement auteurs'!G16=\"\",\"\",'Classement auteurs'!G16)","v":37},{"$f":"IF('Classement auteurs'!H16=\"\",\"\",'Classement auteurs'!H16)","v":37},{"$f":"IF('Classement auteurs'!I16=\"\",\"\",'Classement auteurs'!I16)","v":33},{"$f":"IF('Classement auteurs'!J16=\"\",\"\",'Classement auteurs'!J16)","v":277}]
[null,131619004501,{"$f":"IFERROR(VLOOKUP($B17,'Défi-1'!$C$2:$J$200,8,FALSE),\"\")","v":51},{"$f":"IFERROR(VLOOKUP($B17,'Défi-2'!$C$2:$J$200,8,FALSE),\"\")","v":48},{"$f":"IFERROR(VLOOKUP($B17,'Défi-3'!$C$2:$J$200,8,FALSE),\"\")","v":48},{"$f":"IFERROR(VLOOKUP($B17,'Défi-4'!$C$2:$J$200,8,FALSE),\"\")","v":46},{"$f":"IFERROR(VLOOKUP($B17,'Défi-5'!$C$2:$J$200,8,FALSE),\"\")","v":37},{"$f":"IFERROR(VLOOKUP($B17,'Défi-6'!$C$2:$J$200,8,FALSE),\"\")","v":""},{"$f":"IFERROR(VLOOKUP($B17,'Défi-7'!$C$2:$J$200,8,FALSE),\"\")","v":47},277,null,"OK","OK","OK","OK","OK","OK","OK","OK","OK",null,{"$f":"'Classement auteurs'!$B17","v":131619004501},{"$f":"IF('Classement auteurs'!C17=\"\",\"\",'Classement auteurs'!C17)","v":51},{"$f":"IF('Classement auteurs'!D17=\"\",\"\",'Classement auteurs'!D17)","v":48},{"$f":"IF('Classement auteurs'!E17=\"\",\"\",'Classement auteurs'!E17)","v":48},{"$f":"IF('Classement auteurs'!F17=\"\",\"\",'Classement auteurs'!F17)","v":46},{"$f":"IF('Classement auteurs'!G17=\"\",\"\",'Classement auteurs'!G17)","v":37},{"$f":"IF('Classement auteurs'!H17=\"\",\"\",'Classement auteurs'!H17)","v":""},{"$f":"IF('Classement auteurs'!I17=\"\",\"\",'Classement auteurs'!I17)","v":47},{"$f":"IF('Classement auteurs'!J17=\"\",\"\",'Classement auteurs'!J17)","v":277}]
[null,131823004901,{"$f":"IFERROR(VLOOKUP($B18,'Défi-1'!$C$2:$J$200,8,FALSE),\"\")","v":44},{"$f":"IFERROR(VLOOKUP($B18,'Défi-2'!$C$2:$J$200,8,FALSE),\"\")","v":25},{"$f":"IFERROR(VLOOKUP($B18,'Défi-3'!$C$2:$J$200,8,FALSE),\"\")","v":43},{"$f":"IFERROR(VLOOKUP($B18,'Défi-4'!$C$2:$J$200,8,FALSE),\"\")","v":39},{"$f":"IFERROR(VLOOKUP($B18,'Défi-5'!$C$2:$J$200,8,FALSE),\"\")","v":41},{"$f":"IFERROR(VLOOKUP($B18,'Défi-6'!$C$2:$J$200,8,FALSE),\"\")","v":43},{"$f":"IFERROR(VLOOKUP($B18,'Défi-7'!$C$2:$J$200,8,FALSE),\"\")","v":43},278,null,"OK","OK","OK","OK","OK","OK","KO","OK","KO",null,{"$f":"'Classement auteurs'!$B18","v":131823004901},{"$f":"IF('Classement auteurs'!C18=\"\",\"\",'Classement auteurs'!C18)","v":44},{"$f":"IF('Classement auteurs'!D18=\"\",\"\",'Classement auteurs'!D18)","v":25},{"$f":"IF('Classement auteurs'!E18=\"\",\"\",'Classement auteurs'!E18)","v":43},{"$f":"IF('Classement auteurs'!F18=\"\",\"\",'Classement auteurs'!F18)","v":39},{"$f":"IF('Classement auteurs'!G18=\"\",\"\",'Classement auteurs'!G18)","v":41},{"$f":"IF('Classement auteurs'!H18=\"\",\"\",'Classement auteurs'!H18)","v":41},{"$f":"IF('Classement auteurs'!I18=\"\",\"\",'Classement auteurs'!I18)","v":43},{"$f":"IF('Classement auteurs'!J18=\"\",\"\",'Classement auteurs'!J18)","v":276}]
[null,130925007701,{"$f":"IFERROR(VLOOKUP($B19,'Défi-1'!$C$2:$J$200,8,FALSE),\"\")","v":46},{"$f":"IFERROR(VLOOKUP($B19,'Défi-2'!$C$2:$J$200,8,FALSE),\"\")","v":50},{"$f":"IFERROR(VLOOKUP($B19,'Défi-3'!$C$2:$J$200,8,FALSE),\"\")","v":48},{"$f":"IFERROR(VLOOKUP($B19,'Défi-4'!$C$2:$J$200,8,FALSE),\"\")","v":44},{"$f":"IFERROR(VLOOKUP($B19,'Défi-5'!$C$2:$J$200,8,FALSE),\"\")","v":37},{"$f":"IFERROR(VLOOKUP($B19,'Défi-6'!$C$2:$J$200,8,FALSE),\"\")","v":50},{"$f":"IFERROR(VLOOKUP($B19,'Défi-7'!$C$2:$J$200,8,FALSE),\"\")","v":""},275,null,"OK","OK","OK","OK","OK","OK","OK","OK","OK",null,{"$f":"'Classement auteurs'!$B19","v":130925007701},{"$f":"IF('Classement auteurs'!C19=\"\",\"\",'Classement auteurs'!C19)","v":46},{"$f":"IF('Classement auteurs'!D19=\"\",\"\",'Classement auteurs'!D19)","v":50},{"$f":"IF('Classement auteurs'!E19=\"\",\"\",'Classement auteurs'!E19)","v":48},{"$f":"IF('Classement auteurs'!F19=\"\",\"\",'Classement auteurs'!F19)","v":44},{"$f":"IF('Classement auteurs'!G19=\"\",\"\",'Classement auteurs'!G19)","v":37},{"$f":"IF('Classement auteurs'!H19=\"\",\"\",'Classement auteurs'!H19)","v":50},{"$f":"IF('Classement auteurs'!I19=\"\",\"\",'Classement auteurs'!I19)","v":""},{"$f":"IF('Classement auteurs'!J19=\"\",\"\",'Classement auteurs'!J19)","v":275}]
[null,131683005101,{"$f":"IFERROR(VLOOKUP($B20,'Défi-1'!$C$2:$J$200,8,FALSE),\"\")","v":36},{"$f":"IFERROR(VLOOKUP($B20,'Défi-2'!$C$2:$J$200,8,FALSE),\"\")","v":33},{"$f":"IFERROR(VLOOKUP($B20,'Défi-3'!$C$2:$J$200,8,FALSE),\"\")","v":41},{"$f":"IFERROR(VLOOKUP($B20,'Défi-4'!$C$2:$J$200,8,FALSE),\"\")","v":44},{"$f":"IFERROR(VLOOKUP($B20,'Défi-5'!$C$2:$J$200,8,FALSE),\"\")","v":49},{"$f":"IFERROR(VLOOKUP($B20,'Défi-6'!$C$2:$J$200,8,FALSE),\"\")","v":44},{"$f":"IFERROR(VLOOKUP($B20,'Défi-7'!$C$2:$J$200,8,FALSE),\"\")","v":38},285,null,"OK","OK","OK","OK","OK","OK","KO","OK","KO",null,{"$f":"'Classement auteurs'!$B20","v":131683005101},{"$f":"IF('Classement auteurs'!C20=\"\",\"\",'Classement auteurs'!C20)","v":36},{"$f":"IF('Classement auteurs'!D20=\"\",\"\",'Classement auteurs'!D20)","v":33},{"$f":"IF('Classement auteurs'!E20=\"\",\"\",'Classement auteurs'!E20)","v":41},{"$f":"IF('Classement auteurs'!F20=\"\",\"\",'Classement auteurs'!F20)","v":44},{"$f":"IF('Classement auteurs'!G20=\"\",\"\",'Classement auteurs'!G20)","v":49},{"$f":"IF('Classement auteurs'!H20=\"\",\"\",'Classement auteurs'!H20)","v":33},{"$f":"IF('Classement auteurs'!I20=\"\",\"\",'Classement auteurs'!I20)","v":38},{"$f":"IF('Classement auteurs'!J20=\"\",\"\",'Classement auteurs'!J20)","v":274}]
[null,131683008001,{"$f":"IFERROR(VLOOKUP($B21,'Défi-1'!$C$2:$J$200,8,FALSE),\"\")","v":48},{"$f":"IFERROR(VLOOKUP($B21,'Défi-2'!$C$2:$J$200,8,FALSE),\"\")","v":47},{"$f":"IFERROR(VLOOKUP($B21,'Défi-3'!$C$2:$J$200,8,FALSE),\"\")","v":47},{"$f":"IFERROR(VLOOKUP($B21,'Défi-4'!$C$2:$J$200,8,FALSE),\"\")","v":39},{"$f":"IFERROR(VLOOKUP($B21,'Défi-5'!$C$2:$J$200,8,FALSE),\"\")","v":52},{"$f":"IFERROR(VLOOKUP($B21,'Défi-6'!$C$2:$J$200,8,FALSE),\"\")","v":48},{"$f":"IFERROR(VLOOKUP($B21,'Défi-7'!$C$2:$J$200,8,FALSE),\"\")","v":""},281,null,"OK","OK","OK","OK","OK","OK","KO","OK","KO",null,{"$f":"'Classement auteurs'!$B21","v":131683008001},{"$f":"IF('Classement auteurs'!C21=\"\",\"\",'Classement auteurs'!C21)","v":48},{"$f":"IF('Classement auteurs'!D21=\"\",\"\",'Classement auteurs'!D21)","v":47},{"$f":"IF('Classement auteurs'!E21=\"\",\"\",'Classement auteurs'!E21)","v":47},{"$f":"IF('Classement auteurs'!F21=\"\",\"\",'Classement auteurs'!F21)","v":39},{"$f":"IF('Classement auteurs'!G21=\"\",\"\",'Classement auteurs'!G21)","v":52},{"$f":"IF('Classement auteurs'!H21=\"\",\"\",'Classement auteurs'!H21)","v":39},{"$f":"IF('Classement auteurs'!I21=\"\",\"\",'Classement auteurs'!I21)","v":""},{"$f":"IF('Classement auteurs'!J21=\"\",\"\",'Classement auteurs'!J21)","v":272}]
[null,132060001701,{"$f":"IFERROR(VLOOKUP($B22,'Défi-1'!$C$2:$J$200,8,FALSE),\"\")","v":37},{"$f":"IFERROR(VLOOKUP($B22,'Défi-2'!$C$2:$J$200,8,FALSE),\"\")","v":45},{"$f":"IFERROR(VLOOKUP($B22,'Défi-3'!$C$2:$J$200,8,FALSE),\"\")","v":33},{"$f":"IFERROR(VLOOKUP($B22,'Défi-4'!$C$2:$J$200,8,FALSE),\"\")","v":37},{"$f":"IFERROR(VLOOKUP($B22,'Défi-5'!$C$2:$J$200,8,FALSE),\"\")","v":37},{"$f":"IFERROR(VLOOKUP($B22,'Défi-6'!$C$2:$J$200,8,FALSE),\"\")","v":45},{"$f":"IFERROR(VLOOKUP($B22,'Défi-7'!$C$2:$J$200,8,FALSE),\"\")","v":35},269,null,"OK","OK","OK","OK","OK","OK","OK","OK","OK",null,{"$f":"'Classement auteurs'!$B22","v":132060001701},{"$f":"IF('Classement auteurs'!C22=\"\",\"\",'Classement auteurs'!C22)","v":37},{"$f":"IF('Classement auteurs'!D22=\"\",\"\",'Classement auteurs'!D22)","v":45},{"$f":"IF('Classement auteurs'!E22=\"\",\"\",'Classement auteurs'!E22)","v":33},{"$f":"IF('Classement auteurs'!F22=\"\",\"\",'Classement auteurs'!F22)","v":37},{"$f":"IF('Classement auteurs'!G22=\"\",\"\",'Classement auteurs'!G22)","v":37},{"$f":"IF('Classement auteurs'!H22=\"\",\"\",'Classement auteurs'!H22)","v":45},{"$f":"IF('Classement auteurs'!I22=\"\",\"\",'Classement auteurs'!I22)","v":35},{"$f":"IF('Classement auteurs'!J22=\"\",\"\",'Classement auteurs'!J22)","v":269}]
[null,131353000701,{"$f":"IFERROR(VLOOKUP($B23,'Défi-1'!$C$2:$J$200,8,FALSE),\"\")","v":48},{"$f":"IFERROR(VLOOKUP($B23,'Défi-2'!$C$2:$J$200,8,FALSE),\"\")","v":42},{"$f":"IFERROR(VLOOKUP($B23,'Défi-3'!$C$2:$J$200,8,FALSE),\"\")","v":39},{"$f":"IFERROR(VLOOKUP($B23,'Défi-4'!$C$2:$J$200,8,FALSE),\"\")","v":57},{"$f":"IFERROR(VLOOKUP($B23,'Défi-5'!$C$2:$J$200,8,FALSE),\"\")","v":41},{"$f":"IFERROR(VLOOKUP($B23,'Défi-6'!$C$2:$J$200,8,FALSE),\"\")","v":""},{"$f":"IFERROR(VLOOKUP($B23,'Défi-7'!$C$2:$J$200,8,FALSE),\"\")","v":41},268,null,"OK","OK","OK","OK","OK","OK","OK","OK","OK",null,{"$f":"'Classement auteurs'!$B23","v":131353000701},{"$f":"IF('Classement auteurs'!C23=\"\",\"\",'Classement auteurs'!C23)","v":48},{"$f":"IF('Classement auteurs'!D23=\"\",\"\",'Classement auteurs'!D23)","v":42},{"$f":"IF('Classement auteurs'!E23=\"\",\"\",'Classement auteurs'!E23)","v":39},{"$f":"IF('Classement auteurs'!F23=\"\",\"\",'Classement auteurs'!F23)","v":57},{"$f":"IF('Classement auteurs'!G23=\"\",\"\",'Classement auteurs'!G23)","v":41},{"$f":"IF('Classement auteurs'!H23=\"\",\"\",'Classement auteurs'!H23)","v":""},{"$f":"IF('Classement auteurs'!I23=\"\",\"\",'Classement auteurs'!I23)","v":41},{"$f":"IF('Classement auteurs'!J23=\"\",\"\",'Classement auteurs'!J23)","v":268}]
[null,131376014701,{"$f":"IFERROR(VLOOKUP($B24,'Défi-1'!$C$2:$J$200,8,FALSE),\"\")","v":43},{"$f":"IFERROR(VLOOKUP($B24,'Défi-2'!$C$2:$J$200,8,FALSE),\"\")","v":23},{"$f":"IFERROR(VLOOKUP($B24,'Défi-3'!$C$2:$J$200,8,FALSE),\"\")","v":39},{"$f":"IFERROR(VLOOKUP($B24,'Défi-4'!$C$2:$J$200,8,FALSE),\"\")","v":41},{"$f":"IFERROR(VLOOKUP($B24,'Défi-5'!$C$2:$J$200,8,FALSE),\"\")","v":44},{"$f":"IFERROR(VLOOKUP($B24,'Défi-6'!$C$2:$J$200,8,FALSE),\"\")","v":43},{"$f":"IFERROR(VLOOKUP($B24,'Défi-7'!$C$2:$J$200,8,FALSE),\"\")","v":33},266,null,"OK","OK","OK","OK","OK","OK","OK","OK","OK",null,{"$f":"'Classement auteurs'!$B24","v":131376014701},{"$f":"IF('Classement auteurs'!C24=\"\",\"\",'Classement auteurs'!C24)","v":43},{"$f":"IF('Classement auteurs'!D24=\"\",\"\",'Classement auteurs'!D24)","v":23},{"$f":"IF('Classement auteurs'!E24=\"\",\"\",'Classement auteurs'!E24)","v":39},{"$f":"IF('Classement auteurs'!F24=\"\",\"\",'Classement auteurs'!F24)","v":41},{"$f":"IF('Classement auteurs'!G24=\"\",\"\",'Classement auteurs'!G24)","v":44},{"$f":"IF('Classement auteurs'!H24=\"\",\"\",'Classement auteurs'!H24)","v":43},{"$f":"IF('Classement auteurs'!I24=\"\",\"\",'Classement auteurs'!I24)","v":33},{"$f":"IF('Classement auteurs'!J24=\"\",\"\",'Classement auteurs'!J24)","v":266}]
[null,131956004501,{"$f":"IFERROR(VLOOKUP($B25,'Défi-1'!$C$2:$J$200,8,FALSE),\"\")","v":38},{"$f":"IFERROR(VLOOKUP($B25,'Défi-2'!$C$2:$J$200,8,FALSE),\"\")","v":38},{"$f":"IFERROR(VLOOKUP($B25,'Défi-3'!$C$2:$J$200,8,FALSE),\"\")","v":35},{"$f":"IFERROR(VLOOKUP($B25,'Défi-4'!$C$2:$J$200,8,FALSE),\"\")","v":37},{"$f":"IFERROR(VLOOKUP($B25,'Défi-5'!$C$2:$J$200,8,FALSE),\"\")","v":39},{"$f":"IFERROR(VLOOKUP($B25,'Défi-6'!$C$2:$J$200,8,FALSE),\"\")","v":38},{"$f":"IFERROR(VLOOKUP($B25,'Défi-7'!$C$2:$J$200,8,FALSE),\"\")","v":42},267,null,"OK","OK","OK","OK","OK","OK","KO","OK","KO",null,{"$f":"'Classement auteurs'!$B25","v":131956004501},{"$f":"IF('Classement auteurs'!C25=\"\",\"\",'Classement auteurs'!C25)","v":38},{"$f":"IF('Classement auteurs'!D25=\"\",\"\",'Classement auteurs'!D25)","v":38},{"$f":"IF('Classement auteurs'!E25=\"\",\"\",'Classement auteurs'!E25)","v":35},{"$f":"IF('Classement auteurs'!F25=\"\",\"\",'Classement auteurs'!F25)","v":37},{"$f":"IF('Classement auteurs'!G25=\"\",\"\",'Classement auteurs'!G25)","v":39},{"$f":"IF('Classement auteurs'!H25=\"\",\"\",'Classement auteurs'!H25)","v":37},{"$f":"IF('Classement auteurs'!I25=\"\",\"\",'Classement auteurs'!I25)","v":42},{"$f":"IF('Classement auteurs'!J25=\"\",\"\",'Classement auteurs'!J25)","v":266}]
[null,131499005201,{"$f":"IFERROR(VLOOKUP($B26,'Défi-1'!$C$2:$J$200,8,FALSE),\"\")","v":44},{"$f":"IFERROR(VLOOKUP($B26,'Défi-2'!$C$2:$J$200,8,FALSE),\"\")","v":31},{"$f":"IFERROR(VLOOKUP($B26,'Défi-3'!$C$2:$J$200,8,FALSE),\"\")","v":49},{"$f":"IFERROR(VLOOKUP($B26,'Défi-4'!$C$2:$J$200,8,FALSE),\"\")","v":37},{"$f":"IFERROR(VLOOKUP($B26,'Défi-5'!$C$2:$J$200,8,FALSE),\"\")","v":39},{"$f":"IFERROR(VLOOKUP($B26,'Défi-6'!$C$2:$J$200,8,FALSE),\"\")","v":31},{"$f":"IFERROR(VLOOKUP($B26,'Défi-7'!$C$2:$J$200,8,FALSE),\"\")","v":34},265,null,"OK","OK","OK","OK","OK","OK","OK","OK","OK",null,{"$f":"'Classement auteurs'!$B26","v":131499005201},{"$f":"IF('Classement auteurs'!C26=\"\",\"\",'Classement auteurs'!C26)","v":44},{"$f":"IF('Classement auteurs'!D26=\"\",\"\",'Classement auteurs'!D26)","v":31},{"$f":"IF('Classement auteurs'!E26=\"\",\"\",'Classement auteurs'!E26)","v":49},{"$f":"IF('Classement auteurs'!F26=\"\",\"\",'Classement auteurs'!F26)","v":37},{"$f":"IF('Classement auteurs'!G26=\"\",\"\",'Classement auteurs'!G26)","v":39},{"$f":"IF('Classement auteurs'!H26=\"\",\"\",'Classement auteurs'!H26)","v":31},{"$f":"IF('Classement auteurs'!I26=\"\",\"\",'Classement auteurs'!I26)","v":34},{"$f":"IF('Classement auteurs'!J26=\"\",\"\",'Classement auteurs'!J26)","v":265}]
[null,131862002201,{"$f":"IFERROR(VLOOKUP($B27,'Défi-1'!$C$2:$J$200,8,FALSE),\"\")","v":41},{"$f":"IFERROR(VLOOKUP($B27,'Défi-2'!$C$2:$J$200,8,FALSE),\"\")","v":35},{"$f":"IFERROR(VLOOKUP($B27,'Défi-3'!$C$2:$J$200,8,FALSE),\"\")","v":44},{"$f":"IFERROR(VLOOKUP($B27,'Défi-4'!$C$2:$J$200,8,FALSE),\"\")","v":27},{"$f":"IFERROR(VLOOKUP($B27,'Défi-5'!$C$2:$J$200,8,FALSE),\"\")","v":43},{"$f":"IFERROR(VLOOKUP($B27,'Défi-6'!$C$2:$J$200,8,FALSE),\"\")","v":44},{"$f":"IFERROR(VLOOKUP($B27,'Défi-7'!$C$2:$J$200,8,FALSE),\"\")","v":37},271,null,"OK","OK","OK","OK","OK","OK","KO","OK","KO",null,{"$f":"'Classement auteurs'!$B27","v":131862002201},{"$f":"IF('Classement auteurs'!C27=\"\",\"\",'Classement auteurs'!C27)","v":41},{"$f":"IF('Classement auteurs'!D27=\"\",\"\",'Classement auteurs'!D27)","v":35},{"$f":"IF('Classement auteurs'!E27=\"\",\"\",'Classement auteurs'!E27)","v":44},{"$f":"IF('Classement auteurs'!F27=\"\",\"\",'Classement auteurs'!F27)","v":27},{"$f":"IF('Classement auteurs'!G27=\"\",\"\",'Classement auteurs'!G27)","v":43},{"$f":"IF('Classement auteurs'!H27=\"\",\"\",'Classement auteurs'!H27)","v":35},{"$f":"IF('Classement auteurs'!I27=\"\",\"\",'Classement auteurs'!I27)","v":37},{"$f":"IF('Classement auteurs'!J27=\"\",\"\",'Classement auteurs'!J27)","v":262}]
[null,130878014101,{"$f":"IFERROR(VLOOKUP($B28,'Défi-1'!$C$2:$J$200,8,FALSE),\"\")","v":36},{"$f":"IFERROR(VLOOKUP($B28,'Défi-2'!$C$2:$J$200,8,FALSE),\"\")","v":37},{"$f":"IFERROR(VLOOKUP($B28,'Défi-3'!$C$2:$J$200,8,FALSE),\"\")","v":44},{"$f":"IFERROR(VLOOKUP($B28,'Défi-4'!$C$2:$J$200,8,FALSE),\"\")","v":18},{"$f":"IFERROR(VLOOKUP($B28,'Défi-5'!$C$2:$J$200,8,FALSE),\"\")","v":56},{"$f":"IFERROR(VLOOKUP($B28,'Défi-6'!$C$2:$J$200,8,FALSE),\"\")","v":44},{"$f":"IFERROR(VLOOKUP($B28,'Défi-7'!$C$2:$J$200,8,FALSE),\"\")","v":33},268,null,"OK","OK","OK","OK","OK","OK","KO","OK","KO",null,{"$f":"'Classement auteurs'!$B28","v":130878014101},{"$f":"IF('Classement auteurs'!C28=\"\",\"\",'Classement auteurs'!C28)","v":36},{"$f":"IF('Classement auteurs'!D28=\"\",\"\",'Classement auteurs'!D28)","v":37},{"$f":"IF('Classement auteurs'!E28=\"\",\"\",'Classement auteurs'!E28)","v":44},{"$f":"IF('Classement auteurs'!F28=\"\",\"\",'Classement auteurs'!F28)","v":18},{"$f":"IF('Classement auteurs'!G28=\"\",\"\",'Classement auteurs'!G28)","v":56},{"$f":"IF('Classement auteurs'!H28=\"\",\"\",'Classement auteurs'!H28)","v":37},{"$f":"IF('Classement auteurs'!I28=\"\",\"\",'Classement auteurs'!I28)","v":33},{"$f":"IF('Classement auteurs'!J28=\"\",\"\",'Classement auteurs'!J28)","v":261}]
[null,131956004601,{"$f":"IFERROR(VLOOKUP($B29,'Défi-1'!$C$2:$J$200,8,FALSE),\"\")","v":""},{"$f":"IFERROR(VLOOKUP($B29,'Défi-2'!$C$2:$J$200,8,FALSE),\"\")","v":47},{"$f":"IFERROR(VLOOKUP($B29,'Défi-3'!$C$2:$J$200,8,FALSE),\"\")","v":50},{"$f":"IFERROR(VLOOKUP($B29,'Défi-4'!$C$2:$J$200,8,FALSE),\"\")","v":38},{"$f":"IFERROR(VLOOKUP($B29,'Défi-5'!$C$2:$J$200,8,FALSE),\"\")","v":27},{"$f":"IFERROR(VLOOKUP($B29,'Défi-6'!$C$2:$J$200,8,FALSE),\"\")","v":47},{"$f":"IFERROR(VLOOKUP($B29,'Défi-7'!$C$2:$J$200,8,FALSE),\"\")","v":52},261,null,"OK","OK","OK","OK","OK","OK","OK","OK","OK",null,{"$f":"'Classement auteurs'!$B29","v":131956004601},{"$f":"IF('Classement auteurs'!C29=\"\",\"\",'Classement auteurs'!C29)","v":""},{"$f":"IF('Classement auteurs'!D29=\"\",\"\",'Classement auteurs'!D29)","v":47},{"$f":"IF('Classement auteurs'!E29=\"\",\"\",'Classement auteurs'!E29)","v":50},{"$f":"IF('Classement auteurs'!F29=\"\",\"\",'Classement auteurs'!F29)","v":38},{"$f":"IF('Classement auteurs'!G29=\"\",\"\",'Classement auteurs'!G29)","v":27},{"$f":"IF('Classement auteurs'!H29=\"\",\"\",'Classement auteurs'!H29)","v":47},{"$f":"IF('Classement auteurs'!I29=\"\",\"\",'Classement auteurs'!I29)","v":52},{"$f":"IF('Classement auteurs'!J29=\"\",\"\",'Classement auteurs'!J29)","v":261}]
[null,130000020401,{"$f":"IFERROR(VLOOKUP($B30,'Défi-1'!$C$2:$J$200,8,FALSE),\"\")","v":31},{"$f":"IFERROR(VLOOKUP($B30,'Défi-2'!$C$2:$J$200,8,FALSE),\"\")","v":37},{"$f":"IFERROR(VLOOKUP($B30,'Défi-3'!$C$2:$J$200,8,FALSE),\"\")","v":35},{"$f":"IFERROR(VLOOKUP($B30,'Défi-4'!$C$2:$J$200,8,FALSE),\"\")","v":35},{"$f":"IFERROR(VLOOKUP($B30,'Défi-5'!$C$2:$J$200,8,FALSE),\"\")","v":43},{"$f":"IFERROR(VLOOKUP($B30,'Défi-6'!$C$2:$J$200,8,FALSE),\"\")","v":37},{"$f":"IFERROR(VLOOKUP($B30,'Défi-7'!$C$2:$J$200,8,FALSE),\"\")","v":41},259,null,"OK","OK","OK","OK","OK","OK","KO","OK","KO",null,{"$f":"'Classement auteurs'!$B30","v":130000020401},{"$f":"IF('Classement auteurs'!C30=\"\",\"\",'Classement auteurs'!C30)","v":31},{"$f":"IF('Classement auteurs'!D30=\"\",\"\",'Classement auteurs'!D30)","v":37},{"$f":"IF('Classement auteurs'!E30=\"\",\"\",'Classement auteurs'!E30)","v":35},{"$f":"IF('Classement auteurs'!F30=\"\",\"\",'Classement auteurs'!F30)","v":35},{"$f":"IF('Classement auteurs'!G30=\"\",\"\",'Classement auteurs'!G30)","v":43},{"$f":"IF('Classement auteurs'!H30=\"\",\"\",'Classement auteurs'!H30)","v":35},{"$f":"IF('Classement auteurs'!I30=\"\",\"\",'Classement auteurs'!I30)","v":41},{"$f":"IF('Classement auteurs'!J30=\"\",\"\",'Classement auteurs'!J30)","v":257}]
[null,130987013801,{"$f":"IFERROR(VLOOKUP($B31,'Défi-1'!$C$2:$J$200,8,FALSE),\"\")","v":38},{"$f":"IFERROR(VLOOKUP($B31,'Défi-2'!$C$2:$J$200,8,FALSE),\"\")","v":""},{"$f":"IFERROR(VLOOKUP($B31,'Défi-3'!$C$2:$J$200,8,FALSE),\"\")","v":45},{"$f":"IFERROR(VLOOKUP($B31,'Défi-4'!$C$2:$J$200,8,FALSE),\"\")","v":42},{"$f":"IFERROR(VLOOKUP($B31,'Défi-5'!$C$2:$J$200,8,FALSE),\"\")","v":42},{"$f":"IFERROR(VLOOKUP($B31,'Défi-6'!$C$2:$J$200,8,FALSE),\"\")","v":42},{"$f":"IFERROR(VLOOKUP($B31,'Défi-7'!$C$2:$J$200,8,FALSE),\"\")","v":51},260,null,"OK","OK","OK","OK","OK","OK","KO","OK","KO",null,{"$f":"'Classement auteurs'!$B31","v":130987013801},{"$f":"IF('Classement auteurs'!C31=\"\",\"\",'Classement auteurs'!C31)","v":38},{"$f":"IF('Classement auteurs'!D31=\"\",\"\",'Classement auteurs'!D31)","v":""},{"$f":"IF('Classement auteurs'!E31=\"\",\"\",'Classement auteurs'!E31)","v":45},{"$f":"IF('Classement auteurs'!F31=\"\",\"\",'Classement auteurs'!F31)","v":42},{"$f":"IF('Classement auteurs'!G31=\"\",\"\",'Classement auteurs'!G31)","v":42},{"$f":"IF('Classement auteurs'!H31=\"\",\"\",'Classement auteurs'!H31)","v":38},{"$f":"IF('Classement auteurs'!I31=\"\",\"\",'Classement auteurs'!I31)","v":51},{"$f":"IF('Classement auteurs'!J31=\"\",\"\",'Classement auteurs'!J31)","v":256}]
[null,130987019601,{"$f":"IFERROR(VLOOKUP($B32,'Défi-1'!$C$2:$J$200,8,FALSE),\"\")","v":39},{"$f":"IFERROR(VLOOKUP($B32,'Défi-2'!$C$2:$J$200,8,FALSE),\"\")","v":37},{"$f":"IFERROR(VLOOKUP($B32,'Défi-3'!$C$2:$J$200,8,FALSE),\"\")","v":36},{"$f":"IFERROR(VLOOKUP($B32,'Défi-4'!$C$2:$J$200,8,FALSE),\"\")","v":44},{"$f":"IFERROR(VLOOKUP($B32,'Défi-5'!$C$2:$J$200,8,FALSE),\"\")","v":34},{"$f":"IFERROR(VLOOKUP($B32,'Défi-6'!$C$2:$J$200,8,FALSE),\"\")","v":39},{"$f":"IFERROR(VLOOKUP($B32,'Défi-7'!$C$2:$J$200,8,FALSE),\"\")","v":29},258,null,"OK","OK","OK","OK","OK","OK","KO","OK","KO",null,{"$f":"'Classement auteurs'!$B32","v":130987019601},{"$f":"IF('Classement auteurs'!C32=\"\",\"\",'Classement auteurs'!C32)","v":39},{"$f":"IF('Classement auteurs'!D32=\"\",\"\",'Classement auteurs'!D32)","v":37},{"$f":"IF('Classement auteurs'!E32=\"\",\"\",'Classement auteurs'!E32)","v":36},{"$f":"IF('Classement auteurs'!F32=\"\",\"\",'Classement auteurs'!F32)","v":44},{"$f":"IF('Classement auteurs'!G32=\"\",\"\",'Classement auteurs'!G32)","v":34},{"$f":"IF('Classement auteurs'!H32=\"\",\"\",'Classement auteurs'!H32)","v":34},{"$f":"IF('Classement auteurs'!I32=\"\",\"\",'Classement auteurs'!I32)","v":29},{"$f":"IF('Classement auteurs'!J32=\"\",\"\",'Classement auteurs'!J32)","v":253}]
[null,131110001001,{"$f":"IFERROR(VLOOKUP($B33,'Défi-1'!$C$2:$J$200,8,FALSE),\"\")","v":41},{"$f":"IFERROR(VLOOKUP($B33,'Défi-2'!$C$2:$J$200,8,FALSE),\"\")","v":41},{"$f":"IFERROR(VLOOKUP($B33,'Défi-3'!$C$2:$J$200,8,FALSE),\"\")","v":40},{"$f":"IFERROR(VLOOKUP($B33,'Défi-4'!$C$2:$J$200,8,FALSE),\"\")","v":47},{"$f":"IFERROR(VLOOKUP($B33,'Défi-5'!$C$2:$J$200,8,FALSE),\"\")","v":35},{"$f":"IFERROR(VLOOKUP($B33,'Défi-6'!$C$2:$J$200,8,FALSE),\"\")","v":47},{"$f":"IFERROR(VLOOKUP($B33,'Défi-7'!$C$2:$J$200,8,FALSE),\"\")","v":""},251,null,"OK","OK","OK","OK","OK","OK","OK","OK","OK",null,{"$f":"'Classement auteurs'!$B33","v":131110001001},{"$f":"IF('Classement auteurs'!C33=\"\",\"\",'Classement auteurs'!C33)","v":41},{"$f":"IF('Classement auteurs'!D33=\"\",\"\",'Classement auteurs'!D33)","v":41},{"$f":"IF('Classement auteurs'!E33=\"\",\"\",'Classement auteurs'!E33)","v":40},{"$f":"IF('Classement auteurs'!F33=\"\",\"\",'Classement auteurs'!F33)","v":47},{"$f":"IF('Classement auteurs'!G33=\"\",\"\",'Classement auteurs'!G33)","v":35},{"$f":"IF('Classement auteurs'!H33=\"\",\"\",'Classement auteurs'!H33)","v":47},{"$f":"IF('Classement auteurs'!I33=\"\",\"\",'Classement auteurs'!I33)","v":""},{"$f":"IF('Classement auteurs'!J33=\"\",\"\",'Classement auteurs'!J33)","v":251}]
[null,131499008701,{"$f":"IFERROR(VLOOKUP($B34,'Défi-1'!$C$2:$J$200,8,FALSE),\"\")","v":44},{"$f":"IFERROR(VLOOKUP($B34,'Défi-2'!$C$2:$J$200,8,FALSE),\"\")","v":29},{"$f":"IFERROR(VLOOKUP($B34,'Défi-3'!$C$2:$J$200,8,FALSE),\"\")","v":39},{"$f":"IFERROR(VLOOKUP($B34,'Défi-4'!$C$2:$J$200,8,FALSE),\"\")","v":33},{"$f":"IFERROR(VLOOKUP($B34,'Défi-5'!$C$2:$J$200,8,FALSE),\"\")","v":34},{"$f":"IFERROR(VLOOKUP($B34,'Défi-6'!$C$2:$J$200,8,FALSE),\"\")","v":44},{"$f":"IFERROR(VLOOKUP($B34,'Défi-7'!$C$2:$J$200,8,FALSE),\"\")","v":34},257,null,"OK","OK","OK","OK","OK","OK","KO","OK","KO",null,{"$f":"'Classement auteurs'!$B34","v":131499008701},{"$f":"IF('Classement auteurs'!C34=\"\",\"\",'Classement auteurs'!C34)","v":44},{"$f":"IF('Classement auteurs'!D34=\"\",\"\",'Classement auteurs'!D34)","v":29},{"$f":"IF('Classement auteurs'!E34=\"\",\"\",'Classement auteurs'!E34)","v":39},{"$f":"IF('Classement auteurs'!F34=\"\",\"\",'Classement auteurs'!F34)","v":33},{"$f":"IF('Classement auteurs'!G34=\"\",\"\",'Classement auteurs'!G34)","v":34},{"$f":"IF('Classement auteurs'!H34=\"\",\"\",'Classement auteurs'!H34)","v":33},{"$f":"IF('Classement auteurs'!I34=\"\",\"\",'Classement auteurs'!I34)","v":34},{"$f":"IF('Classement auteurs'!J34=\"\",\"\",'Classement auteurs'!J34)","v":246}]
[null,131845001401,{"$f":"IFERROR(VLOOKUP($B35,'Défi-1'!$C$2:$J$200,8,FALSE),\"\")","v":41},{"$f":"IFERROR(VLOOKUP($B35,'Défi-2'!$C$2:$J$200,8,FALSE),\"\")","v":34},{"$f":"IFERROR(VLOOKUP($B35,'Défi-3'!$C$2:$J$200,8,FALSE),\"\")","v":48},{"$f":"IFERROR(VLOOKUP($B35,'Défi-4'!$C$2:$J$200,8,FALSE),\"\")","v":39},{"$f":"IFERROR(VLOOKUP($B35,'Défi-5'!$C$2:$J$200,8,FALSE),\"\")","v":43},{"$f":"IFERROR(VLOOKUP($B35,'Défi-6'!$C$2:$J$200,8,FALSE),\"\")","v":""},{"$f":"IFERROR(VLOOKUP($B35,'Défi-7'!$C$2:$J$200,8,FALSE),\"\")","v":37},242,null,"OK","OK","OK","OK","OK","OK","OK","OK","OK",null,{"$f":"'Classement auteurs'!$B35","v":131845001401},{"$f":"IF('Classement auteurs'!C35=\"\",\"\",'Classement auteurs'!C35)","v":41},{"$f":"IF('Classement auteurs'!D35=\"\",\"\",'Classement auteurs'!D35)","v":34},{"$f":"IF('Classement auteurs'!E35=\"\",\"\",'Classement auteurs'!E35)","v":48},{"$f":"IF('Classement auteurs'!F35=\"\",\"\",'Classement auteurs'!F35)","v":39},{"$f":"IF('Classement auteurs'!G35=\"\",\"\",'Classement auteurs'!G35)","v":43},{"$f":"IF('Classement auteurs'!H35=\"\",\"\",'Classement auteurs'!H35)","v":""},{"$f":"IF('Classement auteurs'!I35=\"\",\"\",'Classement auteurs'!I35)","v":37},{"$f":"IF('Classement auteurs'!J35=\"\",\"\",'Classement auteurs'!J35)","v":242}]
[null,130000019901,{"$f":"IFERROR(VLOOKUP($B36,'Défi-1'!$C$2:$J$200,8,FALSE),\"\")","v":32},{"$f":"IFERROR(VLOOKUP($B36,'Défi-2'!$C$2:$J$200,8,FALSE),\"\")","v":41},{"$f":"IFERROR(VLOOKUP($B36,'Défi-3'!$C$2:$J$200,8,FALSE),\"\")","v":44},{"$f":"IFERROR(VLOOKUP($B36,'Défi-4'!$C$2:$J$200,8,FALSE),\"\")","v":24},{"$f":"IFERROR(VLOOKUP($B36,'Défi-5'!$C$2:$J$200,8,FALSE),\"\")","v":37},{"$f":"IFERROR(VLOOKUP($B36,'Défi-6'!$C$2:$J$200,8,FALSE),\"\")","v":41},{"$f":"IFERROR(VLOOKUP($B36,'Défi-7'!$C$2:$J$200,8,FALSE),\"\")","v":37},256,null,"OK","OK","OK","OK","OK","OK","KO","OK","KO",null,{"$f":"'Classement auteurs'!$B36","v":130000019901},{"$f":"IF('Classement auteurs'!C36=\"\",\"\",'Classement auteurs'!C36)","v":32},{"$f":"IF('Classement auteurs'!D36=\"\",\"\",'Classement auteurs'!D36)","v":41},{"$f":"IF('Classement auteurs'!E36=\"\",\"\",'Classement auteurs'!E36)","v":44},{"$f":"IF('Classement auteurs'!F36=\"\",\"\",'Classement auteurs'!F36)","v":24},{"$f":"IF('Classement auteurs'!G36=\"\",\"\",'Classement auteurs'!G36)","v":37},{"$f":"IF('Classement auteurs'!H36=\"\",\"\",'Classement auteurs'!H36)","v":24},{"$f":"IF('Classement auteurs'!I36=\"\",\"\",'Classement auteurs'!I36)","v":37},{"$f":"IF('Classement auteurs'!J36=\"\",\"\",'Classement auteurs'!J36)","v":239}]
[null,130527002501,{"$f":"IFERROR(VLOOKUP($B37,'Défi-1'!$C$2:$J$200,8,FALSE),\"\")","v":41},{"$f":"IFERROR(VLOOKUP($B37,'Défi-2'!$C$2:$J$200,8,FALSE),\"\")","v":37},{"$f":"IFERROR(VLOOKUP($B37,'Défi-3'!$C$2:$J$200,8,FALSE),\"\")","v":38},{"$f":"IFERROR(VLOOKUP($B37,'Défi-4'!$C$2:$J$200,8,FALSE),\"\")","v":30},{"$f":"IFERROR(VLOOKUP($B37,'Défi-5'!$C$2:$J$200,8,FALSE),\"\")","v":32},{"$f":"IFERROR(VLOOKUP($B37,'Défi-6'!$C$2:$J$200,8,FALSE),\"\")","v":32},{"$f":"IFERROR(VLOOKUP($B37,'Défi-7'!$C$2:$J$200,8,FALSE),\"\")","v":29},239,null,"OK","OK","OK","OK","OK","OK","OK","OK","OK",null,{"$f":"'Classement auteurs'!$B37","v":130527002501},{"$f":"IF('Classement auteurs'!C37=\"\",\"\",'Classement auteurs'!C37)","v":41},{"$f":"IF('Classement auteurs'!D37=\"\",\"\",'Classement auteurs'!D37)","v":37},{"$f":"IF('Classement auteurs'!E37=\"\",\"\",'Classement auteurs'!E37)","v":38},{"$f":"IF('Classement auteurs'!F37=\"\",\"\",'Classement auteurs'!F37)","v":30},{"$f":"IF('Classement auteurs'!G37=\"\",\"\",'Classement auteurs'!G37)","v":32},{"$f":"IF('Classement auteurs'!H37=\"\",\"\",'Classement auteurs'!H37)","v":32},{"$f":"IF('Classement auteurs'!I37=\"\",\"\",'Classement auteurs'!I37)","v":29},{"$f":"IF('Classement auteurs'!J37=\"\",\"\",'Classement auteurs'!J37)","v":239}]
[null,131956002601,{"$f":"IFERROR(VLOOKUP($B38,'Défi-1'!$C$2:$J$200,8,FALSE),\"\")","v":""},{"$f":"IFERROR(VLOOKUP($B38,'Défi-2'!$C$2:$J$200,8,FALSE),\"\")","v":44},{"$f":"IFERROR(VLOOKUP($B38,'Défi-3'!$C$2:$J$200,8,FALSE),\"\")","v":44},{"$f":"IFERROR(VLOOKUP($B38,'Défi-4'!$C$2:$J$200,8,FALSE),\"\")","v":34},{"$f":"IFERROR(VLOOKUP($B38,'Défi-5'!$C$2:$J$200,8,FALSE),\"\")","v":30},{"$f":"IFERROR(VLOOKUP($B38,'Défi-6'!$C$2:$J$200,8,FALSE),\"\")","v":44},{"$f":"IFERROR(VLOOKUP($B38,'Défi-7'!$C$2:$J$200,8,FALSE),\"\")","v":43},239,null,"OK","OK","OK","OK","OK","OK","OK","OK","OK",null,{"$f":"'Classement auteurs'!$B38","v":131956002601},{"$f":"IF('Classement auteurs'!C38=\"\",\"\",'Classement auteurs'!C38)","v":""},{"$f":"IF('Classement auteurs'!D38=\"\",\"\",'Classement auteurs'!D38)","v":44},{"$f":"IF('Classement auteurs'!E38=\"\",\"\",'Classement auteurs'!E38)","v":44},{"$f":"IF('Classement auteurs'!F38=\"\",\"\",'Classement auteurs'!F38)","v":34},{"$f":"IF('Classement auteurs'!G38=\"\",\"\",'Classement auteurs'!G38)","v":30},{"$f":"IF('Classement auteurs'!H38=\"\",\"\",'Classement auteurs'!H38)","v":44},{"$f":"IF('Classement auteurs'!I38=\"\",\"\",'Classement auteurs'!I38)","v":43},{"$f":"IF('Classement auteurs'!J38=\"\",\"\",'Classement auteurs'!J38)","v":239}]
[null,131353004301,{"$f":"IFERROR(VLOOKUP($B39,'Défi-1'!$C$2:$J$200,8,FALSE),\"\")","v":18},{"$f":"IFERROR(VLOOKUP($B39,'Défi-2'!$C$2:$J$200,8,FALSE),\"\")","v":28},{"$f":"IFERROR(VLOOKUP($B39,'Défi-3'!$C$2:$J$200,8,FALSE),\"\")","v":35},{"$f":"IFERROR(VLOOKUP($B39,'Défi-4'!$C$2:$J$200,8,FALSE),\"\")","v":47},{"$f":"IFERROR(VLOOKUP($B39,'Défi-5'!$C$2:$J$200,8,FALSE),\"\")","v":24},{"$f":"IFERROR(VLOOKUP($B39,'Défi-6'!$C$2:$J$200,8,FALSE),\"\")","v":47},{"$f":"IFERROR(VLOOKUP($B39,'Défi-7'!$C$2:$J$200,8,FALSE),\"\")","v":38},237,null,"OK","OK","OK","OK","OK","OK","OK","OK","OK",null,{"$f":"'Classement auteurs'!$B39","v":131353004301},{"$f":"IF('Classement auteurs'!C39=\"\",\"\",'Classement auteurs'!C39)","v":18},{"$f":"IF('Classement auteurs'!D39=\"\",\"\",'Classement auteurs'!D39)","v":28},{"$f":"IF('Classement auteurs'!E39=\"\",\"\",'Classement auteurs'!E39)","v":35},{"$f":"IF('Classement auteurs'!F39=\"\",\"\",'Classement auteurs'!F39)","v":47},{"$f":"IF('Classement auteurs'!G39=\"\",\"\",'Classement auteurs'!G39)","v":24},{"$f":"IF('Classement auteurs'!H39=\"\",\"\",'Classement auteurs'!H39)","v":47},{"$f":"IF('Classement auteurs'!I39=\"\",\"\",'Classement auteurs'!I39)","v":38},{"$f":"IF('Classement auteurs'!J39=\"\",\"\",'Classement auteurs'!J39)","v":237}]
[null,131879000501,{"$f":"IFERROR(VLOOKUP($B40,'Défi-1'!$C$2:$J$200,8,FALSE),\"\")","v":38},{"$f":"IFERROR(VLOOKUP($B40,'Défi-2'!$C$2:$J$200,8,FALSE),\"\")","v":39},{"$f":"IFERROR(VLOOKUP($B40,'Défi-3'!$C$2:$J$200,8,FALSE),\"\")","v":40},{"$f":"IFERROR(VLOOKUP($B40,'Défi-4'!$C$2:$J$200,8,FALSE),\"\")","v":41},{"$f":"IFERROR(VLOOKUP($B40,'Défi-5'!$C$2:$J$200,8,FALSE),\"\")","v":39},{"$f":"IFERROR(VLOOKUP($B40,'Défi-6'!$C$2:$J$200,8,FALSE),\"\")","v":41},{"$f":"IFERROR(VLOOKUP($B40,'Défi-7'!$C$2:$J$200,8,FALSE),\"\")","v":""},238,null,"OK","OK","OK","OK","OK","OK","KO","OK","KO",null,{"$f":"'Classement auteurs'!$B40","v":131879000501},{"$f":"IF('Classement auteurs'!C40=\"\",\"\",'Classement auteurs'!C40)","v":38},{"$f":"IF('Classement auteurs'!D40=\"\",\"\",'Classement auteurs'!D40)","v":39},{"$f":"IF('Classement auteurs'!E40=\"\",\"\",'Classement auteurs'!E40)","v":40},{"$f":"IF('Classement auteurs'!F40=\"\",\"\",'Classement auteurs'!F40)","v":41},{"$f":"IF('Classement auteurs'!G40=\"\",\"\",'Classement auteurs'!G40)","v":39},{"$f":"IF('Classement auteurs'!H40=\"\",\"\",'Classement auteurs'!H40)","v":38},{"$f":"IF('Classement auteurs'!I40=\"\",\"\",'Classement auteurs'!I40)","v":""},{"$f":"IF('Classement auteurs'!J40=\"\",\"\",'Classement auteurs'!J40)","v":235}]
[null,131353000201,{"$f":"IFERROR(VLOOKUP($B41,'Défi-1'!$C$2:$J$200,8,FALSE),\"\")","v":33},{"$f":"IFERROR(VLOOKUP($B41,'Défi-2'!$C$2:$J$200,8,FALSE),\"\")","v":37},{"$f":"IFERROR(VLOOKUP($B41,'Défi-3'!$C$2:$J$200,8,FALSE),\"\")","v":25},{"$f":"IFERROR(VLOOKUP($B41,'Défi-4'!$C$2:$J$200,8,FALSE),\"\")","v":36},{"$f":"IFERROR(VLOOKUP($B41,'Défi-5'!$C$2:$J$200,8,FALSE),\"\")","v":37},{"$f":"IFERROR(VLOOKUP($B41,'Défi-6'!$C$2:$J$200,8,FALSE),\"\")","v":36},{"$f":"IFERROR(VLOOKUP($B41,'Défi-7'!$C$2:$J$200,8,FALSE),\"\")","v":34},238,null,"OK","OK","OK","OK","OK","OK","KO","OK","KO",null,{"$f":"'Classement auteurs'!$B41","v":131353000201},{"$f":"IF('Classement auteurs'!C41=\"\",\"\",'Classement auteurs'!C41)","v":33},{"$f":"IF('Classement auteurs'!D41=\"\",\"\",'Classement auteurs'!D41)","v":37},{"$f":"IF('Classement auteurs'!E41=\"\",\"\",'Classement auteurs'!E41)","v":25},{"$f":"IF('Classement auteurs'!F41=\"\",\"\",'Classement auteurs'!F41)","v":36},{"$f":"IF('Classement auteurs'!G41=\"\",\"\",'Classement auteurs'!G41)","v":37},{"$f":"IF('Classement auteurs'!H41=\"\",\"\",'Classement auteurs'!H41)","v":33},{"$f":"IF('Classement auteurs'!I41=\"\",\"\",'Classement auteurs'!I41)","v":34},{"$f":"IF('Classement auteurs'!J41=\"\",\"\",'Classement auteurs'!J41)","v":235}]
[null,131845000101,{"$f":"IFERROR(VLOOKUP($B42,'Défi-1'!$C$2:$J$200,8,FALSE),\"\")","v":42},{"$f":"IFERROR(VLOOKUP($B42,'Défi-2'!$C$2:$J$200,8,FALSE),\"\")","v":""},{"$f":"IFERROR(VLOOKUP($B42,'Défi-3'!$C$2:$J$200,8,FALSE),\"\")","v":41},{"$f":"IFERROR(VLOOKUP($B42,'Défi-4'!$C$2:$J$200,8,FALSE),\"\")","v":18},{"$f":"IFERROR(VLOOKUP($B42,'Défi-5'!$C$2:$J$200,8,FALSE),\"\")","v":41},{"$f":"IFERROR(VLOOKUP($B42,'Défi-6'!$C$2:$J$200,8,FALSE),\"\")","v":42},{"$f":"IFERROR(VLOOKUP($B42,'Défi-7'!$C$2:$J$200,8,FALSE),\"\")","v":50},234,null,"OK","OK","OK","OK","OK","OK","OK","OK","OK",null,{"$f":"'Classement auteurs'!$B42","v":131845000101},{"$f":"IF('Classement auteurs'!C42=\"\",\"\",'Classement auteurs'!C42)","v":42},{"$f":"IF('Classement auteurs'!D42=\"\",\"\",'Classement auteurs'!D42)","v":""},{"$f":"IF('Classement auteurs'!E42=\"\",\"\",'Classement auteurs'!E42)","v":41},{"$f":"IF('Classement auteurs'!F42=\"\",\"\",'Classement auteurs'!F42)","v":18},{"$f":"IF('Classement auteurs'!G42=\"\",\"\",'Classement auteurs'!G42)","v":41},{"$f":"IF('Classement auteurs'!H42=\"\",\"\",'Classement auteurs'!H42)","v":42},{"$f":"IF('Classement auteurs'!I42=\"\",\"\",'Classement auteurs'!I42)","v":50},{"$f":"IF('Classement auteurs'!J42=\"\",\"\",'Classement auteurs'!J42)","v":234}]
[null,132086002301,{"$f":"IFERROR(VLOOKUP($B43,'Défi-1'!$C$2:$J$200,8,FALSE),\"\")","v":36},{"$f":"IFERROR(VLOOKUP($B43,'Défi-2'!$C$2:$J$200,8,FALSE),\"\")","v":31},{"$f":"IFERROR(VLOOKUP($B43,'Défi-3'!$C$2:$J$200,8,FALSE),\"\")","v":35},{"$f":"IFERROR(VLOOKUP($B43,'Défi-4'!$C$2:$J$200,8,FALSE),\"\")","v":35},{"$f":"IFERROR(VLOOKUP($B43,'Défi-5'!$C$2:$J$200,8,FALSE),\"\")","v":32},{"$f":"IFERROR(VLOOKUP($B43,'Défi-6'!$C$2:$J$200,8,FALSE),\"\")","v":36},{"$f":"IFERROR(VLOOKUP($B43,'Défi-7'!$C$2:$J$200,8,FALSE),\"\")","v":33},238,null,"OK","OK","OK","OK","OK","OK","KO","OK","KO",null,{"$f":"'Classement auteurs'!$B43","v":132086002301},{"$f":"IF('Classement auteurs'!C43=\"\",\"\",'Classement auteurs'!C43)","v":36},{"$f":"IF('Classement auteurs'!D43=\"\",\"\",'Classement auteurs'!D43)","v":31},{"$f":"IF('Classement auteurs'!E43=\"\",\"\",'Classement auteurs'!E43)","v":35},{"$f":"IF('Classement auteurs'!F43=\"\",\"\",'Classement auteurs'!F43)","v":35},{"$f":"IF('Classement auteurs'!G43=\"\",\"\",'Classement auteurs'!G43)","v":32},{"$f":"IF('Classement auteurs'!H43=\"\",\"\",'Classement auteurs'!H43)","v":32},{"$f":"IF('Classement auteurs'!I43=\"\",\"\",'Classement auteurs'!I43)","v":33},{"$f":"IF('Classement auteurs'!J43=\"\",\"\",'Classement auteurs'!J43)","v":234}]
[null,132084001701,{"$f":"IFERROR(VLOOKUP($B44,'Défi-1'!$C$2:$J$200,8,FALSE),\"\")","v":45},{"$f":"IFERROR(VLOOKUP($B44,'Défi-2'!$C$2:$J$200,8,FALSE),\"\")","v":36},{"$f":"IFERROR(VLOOKUP($B44,'Défi-3'!$C$2:$J$200,8,FALSE),\"\")","v":40},{"$f":"IFERROR(VLOOKUP($B44,'Défi-4'!$C$2:$J$200,8,FALSE),\"\")","v":""},{"$f":"IFERROR(VLOOKUP($B44,'Défi-5'!$C$2:$J$200,8,FALSE),\"\")","v":41},{"$f":"IFERROR(VLOOKUP($B44,'Défi-6'!$C$2:$J$200,8,FALSE),\"\")","v":45},{"$f":"IFERROR(VLOOKUP($B44,'Défi-7'!$C$2:$J$200,8,FALSE),\"\")","v":31},238,null,"OK","OK","OK","OK","OK","OK","KO","OK","KO",null,{"$f":"'Classement auteurs'!$B44","v":132084001701},{"$f":"IF('Classement auteurs'!C44=\"\",\"\",'Classement auteurs'!C44)","v":45},{"$f":"IF('Classement auteurs'!D44=\"\",\"\",'Classement auteurs'!D44)","v":36},{"$f":"IF('Classement auteurs'!E44=\"\",\"\",'Classement auteurs'!E44)","v":40},{"$f":"IF('Classement auteurs'!F44=\"\",\"\",'Classement auteurs'!F44)","v":""},{"$f":"IF('Classement auteurs'!G44=\"\",\"\",'Classement auteurs'!G44)","v":41},{"$f":"IF('Classement auteurs'!H44=\"\",\"\",'Classement auteurs'!H44)","v":41},{"$f":"IF('Classement auteurs'!I44=\"\",\"\",'Classement auteurs'!I44)","v":31},{"$f":"IF('Classement auteurs'!J44=\"\",\"\",'Classement auteurs'!J44)","v":234}]
[null,132084004001,{"$f":"IFERROR(VLOOKUP($B45,'Défi-1'!$C$2:$J$200,8,FALSE),\"\")","v":""},{"$f":"IFERROR(VLOOKUP($B45,'Défi-2'!$C$2:$J$200,8,FALSE),\"\")","v":40},{"$f":"IFERROR(VLOOKUP($B45,'Défi-3'!$C$2:$J$200,8,FALSE),\"\")","v":32},{"$f":"IFERROR(VLOOKUP($B45,'Défi-4'!$C$2:$J$200,8,FALSE),\"\")","v":40},{"$f":"IFERROR(VLOOKUP($B45,'Défi-5'!$C$2:$J$200,8,FALSE),\"\")","v":42},{"$f":"IFERROR(VLOOKUP($B45,'Défi-6'!$C$2:$J$200,8,FALSE),\"\")","v":42},{"$f":"IFERROR(VLOOKUP($B45,'Défi-7'!$C$2:$J$200,8,FALSE),\"\")","v":36},232,null,"OK","OK","OK","OK","OK","OK","OK","OK","OK",null,{"$f":"'Classement auteurs'!$B45","v":132084004001},{"$f":"IF('Classement auteurs'!C45=\"\",\"\",'Classement auteurs'!C45)","v":""},{"$f":"IF('Classement auteurs'!D45=\"\",\"\",'Classement auteurs'!D45)","v":40},{"$f":"IF('Classement auteurs'!E45=\"\",\"\",'Classement auteurs'!E45)","v":32},{"$f":"IF('Classement auteurs'!F45=\"\",\"\",'Classement auteurs'!F45)","v":40},{"$f":"IF('Classement auteurs'!G45=\"\",\"\",'Classement auteurs'!G45)","v":42},{"$f":"IF('Classement auteurs'!H45=\"\",\"\",'Classement auteurs'!H45)","v":42},{"$f":"IF('Classement auteurs'!I45=\"\",\"\",'Classement auteurs'!I45)","v":36},{"$f":"IF('Classement auteurs'!J45=\"\",\"\",'Classement auteurs'!J45)","v":232}]
[null,131879000601,{"$f":"IFERROR(VLOOKUP($B46,'Défi-1'!$C$2:$J$200,8,FALSE),\"\")","v":47},{"$f":"IFERROR(VLOOKUP($B46,'Défi-2'!$C$2:$J$200,8,FALSE),\"\")","v":37},{"$f":"IFERROR(VLOOKUP($B46,'Défi-3'!$C$2:$J$200,8,FALSE),\"\")","v":34},{"$f":"IFERROR(VLOOKUP($B46,'Défi-4'!$C$2:$J$200,8,FALSE),\"\")","v":31},{"$f":"IFERROR(VLOOKUP($B46,'Défi-5'!$C$2:$J$200,8,FALSE),\"\")","v":""},{"$f":"IFERROR(VLOOKUP($B46,'Défi-6'!$C$2:$J$200,8,FALSE),\"\")","v":47},{"$f":"IFERROR(VLOOKUP($B46,'Défi-7'!$C$2:$J$200,8,FALSE),\"\")","v":35},231,null,"OK","OK","OK","OK","OK","OK","OK","OK","OK",null,{"$f":"'Classement auteurs'!$B46","v":131879000601},{"$f":"IF('Classement auteurs'!C46=\"\",\"\",'Classement auteurs'!C46)","v":47},{"$f":"IF('Classement auteurs'!D46=\"\",\"\",'Classement auteurs'!D46)","v":37},{"$f":"IF('Classement auteurs'!E46=\"\",\"\",'Classement auteurs'!E46)","v":34},{"$f":"IF('Classement auteurs'!F46=\"\",\"\",'Classement auteurs'!F46)","v":31},{"$f":"IF('Classement auteurs'!G46=\"\",\"\",'Classement auteurs'!G46)","v":""},{"$f":"IF('Classement auteurs'!H46=\"\",\"\",'Classement auteurs'!H46)","v":47},{"$f":"IF('Classement auteurs'!I46=\"\",\"\",'Classement auteurs'!I46)","v":35},{"$f":"IF('Classement auteurs'!J46=\"\",\"\",'Classement auteurs'!J46)","v":231}]
[null,131879001301,{"$f":"IFERROR(VLOOKUP($B47,'Défi-1'!$C$2:$J$200,8,FALSE),\"\")","v":42},{"$f":"IFERROR(VLOOKUP($B47,'Défi-2'!$C$2:$J$200,8,FALSE),\"\")","v":30},{"$f":"IFERROR(VLOOKUP($B47,'Défi-3'!$C$2:$J$200,8,FALSE),\"\")","v":46},{"$f":"IFERROR(VLOOKUP($B47,'Défi-4'!$C$2:$J$200,8,FALSE),\"\")","v":""},{"$f":"IFERROR(VLOOKUP($B47,'Défi-5'!$C$2:$J$200,8,FALSE),\"\")","v":42},{"$f":"IFERROR(VLOOKUP($B47,'Défi-6'!$C$2:$J$200,8,FALSE),\"\")","v":42},{"$f":"IFERROR(VLOOKUP($B47,'Défi-7'!$C$2:$J$200,8,FALSE),\"\")","v":29},231,null,"OK","OK","OK","OK","OK","OK","OK","OK","OK",null,{"$f":"'Classement auteurs'!$B47","v":131879001301},{"$f":"IF('Classement auteurs'!C47=\"\",\"\",'Classement auteurs'!C47)","v":42},{"$f":"IF('Classement auteurs'!D47=\"\",\"\",'Classement auteurs'!D47)","v":30},{"$f":"IF('Classement auteurs'!E47=\"\",\"\",'Classement auteurs'!E47)","v":46},{"$f":"IF('Classement auteurs'!F47=\"\",\"\",'Classement auteurs'!F47)","v":""},{"$f":"IF('Classement auteurs'!G47=\"\",\"\",'Classement auteurs'!G47)","v":42},{"$f":"IF('Classement auteurs'!H47=\"\",\"\",'Classement auteurs'!H47)","v":42},{"$f":"IF('Classement auteurs'!I47=\"\",\"\",'Classement auteurs'!I47)","v":29},{"$f":"IF('Classement auteurs'!J47=\"\",\"\",'Classement auteurs'!J47)","v":231}]
[null,130925009801,{"$f":"IFERROR(VLOOKUP($B48,'Défi-1'!$C$2:$J$200,8,FALSE),\"\")","v":44},{"$f":"IFERROR(VLOOKUP($B48,'Défi-2'!$C$2:$J$200,8,FALSE),\"\")","v":36},{"$f":"IFERROR(VLOOKUP($B48,'Défi-3'!$C$2:$J$200,8,FALSE),\"\")","v":41},{"$f":"IFERROR(VLOOKUP($B48,'Défi-4'!$C$2:$J$200,8,FALSE),\"\")","v":34},{"$f":"IFERROR(VLOOKUP($B48,'Défi-5'!$C$2:$J$200,8,FALSE),\"\")","v":40},{"$f":"IFERROR(VLOOKUP($B48,'Défi-6'!$C$2:$J$200,8,FALSE),\"\")","v":36},{"$f":"IFERROR(VLOOKUP($B48,'Défi-7'!$C$2:$J$200,8,FALSE),\"\")","v":""},231,null,"OK","OK","OK","OK","OK","OK","OK","OK","OK",null,{"$f":"'Classement auteurs'!$B48","v":130925009801},{"$f":"IF('Classement auteurs'!C48=\"\",\"\",'Classement auteurs'!C48)","v":44},{"$f":"IF('Classement auteurs'!D48=\"\",\"\",'Classement auteurs'!D48)","v":36},{"$f":"IF('Classement auteurs'!E48=\"\",\"\",'Classement auteurs'!E48)","v":41},{"$f":"IF('Classement auteurs'!F48=\"\",\"\",'Classement auteurs'!F48)","v":34},{"$f":"IF('Classement auteurs'!G48=\"\",\"\",'Classement auteurs'!G48)","v":40},{"$f":"IF('Classement auteurs'!H48=\"\",\"\",'Classement auteurs'!H48)","v":36},{"$f":"IF('Classement auteurs'!I48=\"\",\"\",'Classement auteurs'!I48)","v":""},{"$f":"IF('Classement auteurs'!J48=\"\",\"\",'Classement auteurs'!J48)","v":231}]
[null,131845004001,{"$f":"IFERROR(VLOOKUP($B49,'Défi-1'!$C$2:$J$200,8,FALSE),\"\")","v":40},{"$f":"IFERROR(VLOOKUP($B49,'Défi-2'!$C$2:$J$200,8,FALSE),\"\")","v":33},{"$f":"IFERROR(VLOOKUP($B49,'Défi-3'!$C$2:$J$200,8,FALSE),\"\")","v":42},{"$f":"IFERROR(VLOOKUP($B49,'Défi-4'!$C$2:$J$200,8,FALSE),\"\")","v":39},{"$f":"IFERROR(VLOOKUP($B49,'Défi-5'!$C$2:$J$200,8,FALSE),\"\")","v":41},{"$f":"IFERROR(VLOOKUP($B49,'Défi-6'!$C$2:$J$200,8,FALSE),\"\")","v":33},{"$f":"IFERROR(VLOOKUP($B49,'Défi-7'!$C$2:$J$200,8,FALSE),\"\")","v":""},228,null,"OK","OK","OK","OK","OK","OK","OK","OK","OK",null,{"$f":"'Classement auteurs'!$B49","v":131845004001},{"$f":"IF('Classement auteurs'!C49=\"\",\"\",'Classement auteurs'!C49)","v":40},{"$f":"IF('Classement auteurs'!D49=\"\",\"\",'Classement auteurs'!D49)","v":33},{"$f":"IF('Classement auteurs'!E49=\"\",\"\",'Classement auteurs'!E49)","v":42},{"$f":"IF('Classement auteurs'!F49=\"\",\"\",'Classement auteurs'!F49)","v":39},{"$f":"IF('Classement auteurs'!G49=\"\",\"\",'Classement auteurs'!G49)","v":41},{"$f":"IF('Classement auteurs'!H49=\"\",\"\",'Classement auteurs'!H49)","v":33},{"$f":"IF('Classement auteurs'!I49=\"\",\"\",'Classement auteurs'!I49)","v":""},{"$f":"IF('Classement auteurs'!J49=\"\",\"\",'Classement auteurs'!J49)","v":228}]
[null,130527012401,{"$f":"IFERROR(VLOOKUP($B50,'Défi-1'!$C$2:$J$200,8,FALSE),\"\")","v":41},{"$f":"IFERROR(VLOOKUP($B50,'Défi-2'!$C$2:$J$200,8,FALSE),\"\")","v":36},{"$f":"IFERROR(VLOOKUP($B50,'Défi-3'!$C$2:$J$200,8,FALSE),\"\")","v":18},{"$f":"IFERROR(VLOOKUP($B50,'Défi-4'!$C$2:$J$200,8,FALSE),\"\")","v":47},{"$f":"IFERROR(VLOOKUP($B50,'Défi-5'!$C$2:$J$200,8,FALSE),\"\")","v":""},{"$f":"IFERROR(VLOOKUP($B50,'Défi-6'!$C$2:$J$200,8,FALSE),\"\")","v":47},{"$f":"IFERROR(VLOOKUP($B50,'Défi-7'!$C$2:$J$200,8,FALSE),\"\")","v":38},227,null,"OK","OK","OK","OK","OK","OK","OK","OK","OK",null,{"$f":"'Classement auteurs'!$B50","v":130527012401},{"$f":"IF('Classement auteurs'!C50=\"\",\"\",'Classement auteurs'!C50)","v":41},{"$f":"IF('Classement auteurs'!D50=\"\",\"\",'Classement auteurs'!D50)","v":36},{"$f":"IF('Classement auteurs'!E50=\"\",\"\",'Classement auteurs'!E50)","v":18},{"$f":"IF('Classement auteurs'!F50=\"\",\"\",'Classement auteurs'!F50)","v":47},{"$f":"IF('Classement auteurs'!G50=\"\",\"\",'Classement auteurs'!G50)","v":""},{"$f":"IF('Classement auteurs'!H50=\"\",\"\",'Classement auteurs'!H50)","v":47},{"$f":"IF('Classement auteurs'!I50=\"\",\"\",'Classement auteurs'!I50)","v":38},{"$f":"IF('Classement auteurs'!J50=\"\",\"\",'Classement auteurs'!J50)","v":227}]
[null,132060000701,{"$f":"IFERROR(VLOOKUP($B51,'Défi-1'!$C$2:$J$200,8,FALSE),\"\")","v":38},{"$f":"IFERROR(VLOOKUP($B51,'Défi-2'!$C$2:$J$200,8,FALSE),\"\")","v":29},{"$f":"IFERROR(VLOOKUP($B51,'Défi-3'!$C$2:$J$200,8,FALSE),\"\")","v":31},{"$f":"IFERROR(VLOOKUP($B51,'Défi-4'!$C$2:$J$200,8,FALSE),\"\")","v":25},{"$f":"IFERROR(VLOOKUP($B51,'Défi-5'!$C$2:$J$200,8,FALSE),\"\")","v":36},{"$f":"IFERROR(VLOOKUP($B51,'Défi-6'!$C$2:$J$200,8,FALSE),\"\")","v":38},{"$f":"IFERROR(VLOOKUP($B51,'Défi-7'!$C$2:$J$200,8,FALSE),\"\")","v":28},225,null,"OK","OK","OK","OK","OK","OK","OK","OK","OK",null,{"$f":"'Classement auteurs'!$B51","v":132060000701},{"$f":"IF('Classement auteurs'!C51=\"\",\"\",'Classement auteurs'!C51)","v":38},{"$f":"IF('Classement auteurs'!D51=\"\",\"\",'Classement auteurs'!D51)","v":29},{"$f":"IF('Classement auteurs'!E51=\"\",\"\",'Classement auteurs'!E51)","v":31},{"$f":"IF('Classement auteurs'!F51=\"\",\"\",'Classement auteurs'!F51)","v":25},{"$f":"IF('Classement auteurs'!G51=\"\",\"\",'Classement auteurs'!G51)","v":36},{"$f":"IF('Classement auteurs'!H51=\"\",\"\",'Classement auteurs'!H51)","v":38},{"$f":"IF('Classement auteurs'!I51=\"\",\"\",'Classement auteurs'!I51)","v":28},{"$f":"IF('Classement auteurs'!J51=\"\",\"\",'Classement auteurs'!J51)","v":225}]
[null,130878013001,{"$f":"IFERROR(VLOOKUP($B52,'Défi-1'!$C$2:$J$200,8,FALSE),\"\")","v":41},{"$f":"IFERROR(VLOOKUP($B52,'Défi-2'!$C$2:$J$200,8,FALSE),\"\")","v":""},{"$f":"IFERROR(VLOOKUP($B52,'Défi-3'!$C$2:$J$200,8,FALSE),\"\")","v":39},{"$f":"IFERROR(VLOOKUP($B52,'Défi-4'!$C$2:$J$200,8,FALSE),\"\")","v":40},{"$f":"IFERROR(VLOOKUP($B52,'Défi-5'!$C$2:$J$200,8,FALSE),\"\")","v":26},{"$f":"IFERROR(VLOOKUP($B52,'Défi-6'!$C$2:$J$200,8,FALSE),\"\")","v":41},{"$f":"IFERROR(VLOOKUP($B52,'Défi-7'!$C$2:$J$200,8,FALSE),\"\")","v":39},226,null,"OK","OK","OK","OK","OK","OK","KO","OK","KO",null,{"$f":"'Classement auteurs'!$B52","v":130878013001},{"$f":"IF('Classement auteurs'!C52=\"\",\"\",'Classement auteurs'!C52)","v":41},{"$f":"IF('Classement auteurs'!D52=\"\",\"\",'Classement auteurs'!D52)","v":""},{"$f":"IF('Classement auteurs'!E52=\"\",\"\",'Classement auteurs'!E52)","v":39},{"$f":"IF('Classement auteurs'!F52=\"\",\"\",'Classement auteurs'!F52)","v":40},{"$f":"IF('Classement auteurs'!G52=\"\",\"\",'Classement auteurs'!G52)","v":26},{"$f":"IF('Classement auteurs'!H52=\"\",\"\",'Classement auteurs'!H52)","v":39},{"$f":"IF('Classement auteurs'!I52=\"\",\"\",'Classement auteurs'!I52)","v":39},{"$f":"IF('Classement auteurs'!J52=\"\",\"\",'Classement auteurs'!J52)","v":224}]
[null,131956002401,{"$f":"IFERROR(VLOOKUP($B53,'Défi-1'!$C$2:$J$200,8,FALSE),\"\")","v":28},{"$f":"IFERROR(VLOOKUP($B53,'Défi-2'!$C$2:$J$200,8,FALSE),\"\")","v":36},{"$f":"IFERROR(VLOOKUP($B53,'Défi-3'!$C$2:$J$200,8,FALSE),\"\")","v":40},{"$f":"IFERROR(VLOOKUP($B53,'Défi-4'!$C$2:$J$200,8,FALSE),\"\")","v":35},{"$f":"IFERROR(VLOOKUP($B53,'Défi-5'!$C$2:$J$200,8,FALSE),\"\")","v":43},{"$f":"IFERROR(VLOOKUP($B53,'Défi-6'!$C$2:$J$200,8,FALSE),\"\")","v":""},{"$f":"IFERROR(VLOOKUP($B53,'Défi-7'!$C$2:$J$200,8,FALSE),\"\")","v":42},224,null,"OK","OK","OK","OK","OK","OK","OK","OK","OK",null,{"$f":"'Classement auteurs'!$B53","v":131956002401},{"$f":"IF('Classement auteurs'!C53=\"\",\"\",'Classement auteurs'!C53)","v":28},{"$f":"IF('Classement auteurs'!D53=\"\",\"\",'Classement auteurs'!D53)","v":36},{"$f":"IF('Classement auteurs'!E53=\"\",\"\",'Classement auteurs'!E53)","v":40},{"$f":"IF('Classement auteurs'!F53=\"\",\"\",'Classement auteurs'!F53)","v":35},{"$f":"IF('Classement auteurs'!G53=\"\",\"\",'Classement auteurs'!G53)","v":43},{"$f":"IF('Classement auteurs'!H53=\"\",\"\",'Classement auteurs'!H53)","v":""},{"$f":"IF('Classement auteurs'!I53=\"\",\"\",'Classement auteurs'!I53)","v":42},{"$f":"IF('Classement auteurs'!J53=\"\",\"\",'Classement auteurs'!J53)","v":224}]
[null,131494000201,{"$f":"IFERROR(VLOOKUP($B54,'Défi-1'!$C$2:$J$200,8,FALSE),\"\")","v":39},{"$f":"IFERROR(VLOOKUP($B54,'Défi-2'!$C$2:$J$200,8,FALSE),\"\")","v":34},{"$f":"IFERROR(VLOOKUP($B54,'Défi-3'!$C$2:$J$200,8,FALSE),\"\")","v":42},{"$f":"IFERROR(VLOOKUP($B54,'Défi-4'!$C$2:$J$200,8,FALSE),\"\")","v":35},{"$f":"IFERROR(VLOOKUP($B54,'Défi-5'!$C$2:$J$200,8,FALSE),\"\")","v":37},{"$f":"IFERROR(VLOOKUP($B54,'Défi-6'!$C$2:$J$200,8,FALSE),\"\")","v":35},{"$f":"IFERROR(VLOOKUP($B54,'Défi-7'!$C$2:$J$200,8,FALSE),\"\")","v":""},222,null,"OK","OK","OK","OK","OK","OK","OK","OK","OK",null,{"$f":"'Classement auteurs'!$B54","v":131494000201},{"$f":"IF('Classement auteurs'!C54=\"\",\"\",'Classement auteurs'!C54)","v":39},{"$f":"IF('Classement auteurs'!D54=\"\",\"\",'Classement auteurs'!D54)","v":34},{"$f":"IF('Classement auteurs'!E54=\"\",\"\",'Classement auteurs'!E54)","v":42},{"$f":"IF('Classement auteurs'!F54=\"\",\"\",'Classement auteurs'!F54)","v":35},{"$f":"IF('Classement auteurs'!G54=\"\",\"\",'Classement auteurs'!G54)","v":37},{"$f":"IF('Classement auteurs'!H54=\"\",\"\",'Classement auteurs'!H54)","v":35},{"$f":"IF('Classement auteurs'!I54=\"\",\"\",'Classement auteurs'!I54)","v":""},{"$f":"IF('Classement auteurs'!J54=\"\",\"\",'Classement auteurs'!J54)","v":222}]
[null,131353006101,{"$f":"IFERROR(VLOOKUP($B55,'Défi-1'!$C$2:$J$200,8,FALSE),\"\")","v":""},{"$f":"IFERROR(VLOOKUP($B55,'Défi-2'!$C$2:$J$200,8,FALSE),\"\")","v":41},{"$f":"IFERROR(VLOOKUP($B55,'Défi-3'!$C$2:$J$200,8,FALSE),\"\")","v":36},{"$f":"IFERROR(VLOOKUP($B55,'Défi-4'!$C$2:$J$200,8,FALSE),\"\")","v":38},{"$f":"IFERROR(VLOOKUP($B55,'Défi-5'!$C$2:$J$200,8,FALSE),\"\")","v":36},{"$f":"IFERROR(VLOOKUP($B55,'Défi-6'!$C$2:$J$200,8,FALSE),\"\")","v":36},{"$f":"IFERROR(VLOOKUP($B55,'Défi-7'!$C$2:$J$200,8,FALSE),\"\")","v":35},222,null,"OK","OK","OK","OK","OK","OK","OK","OK","OK",null,{"$f":"'Classement auteurs'!$B55","v":131353006101},{"$f":"IF('Classement auteurs'!C55=\"\",\"\",'Classement auteurs'!C55)","v":""},{"$f":"IF('Classement auteurs'!D55=\"\",\"\",'Classement auteurs'!D55)","v":41},{"$f":"IF('Classement auteurs'!E55=\"\",\"\",'Classement auteurs'!E55)","v":36},{"$f":"IF('Classement auteurs'!F55=\"\",\"\",'Classement auteurs'!F55)","v":38},{"$f":"IF('Classement auteurs'!G55=\"\",\"\",'Classement auteurs'!G55)","v":36},{"$f":"IF('Classement auteurs'!H55=\"\",\"\",'Classement auteurs'!H55)","v":36},{"$f":"IF('Classement auteurs'!I55=\"\",\"\",'Classement auteurs'!I55)","v":35},{"$f":"IF('Classement auteurs'!J55=\"\",\"\",'Classement auteurs'!J55)","v":222}]
[null,130878007201,{"$f":"IFERROR(VLOOKUP($B56,'Défi-1'!$C$2:$J$200,8,FALSE),\"\")","v":36},{"$f":"IFERROR(VLOOKUP($B56,'Défi-2'!$C$2:$J$200,8,FALSE),\"\")","v":""},{"$f":"IFERROR(VLOOKUP($B56,'Défi-3'!$C$2:$J$200,8,FALSE),\"\")","v":37},{"$f":"IFERROR(VLOOKUP($B56,'Défi-4'!$C$2:$J$200,8,FALSE),\"\")","v":32},{"$f":"IFERROR(VLOOKUP($B56,'Défi-5'!$C$2:$J$200,8,FALSE),\"\")","v":35},{"$f":"IFERROR(VLOOKUP($B56,'Défi-6'!$C$2:$J$200,8,FALSE),\"\")","v":36},{"$f":"IFERROR(VLOOKUP($B56,'Défi-7'!$C$2:$J$200,8,FALSE),\"\")","v":44},220,null,"OK","OK","OK","OK","OK","OK","OK","OK","OK",null,{"$f":"'Classement auteurs'!$B56","v":130878007201},{"$f":"IF('Classement auteurs'!C56=\"\",\"\",'Classement auteurs'!C56)","v":36},{"$f":"IF('Classement auteurs'!D56=\"\",\"\",'Classement auteurs'!D56)","v":""},{"$f":"IF('Classement auteurs'!E56=\"\",\"\",'Classement auteurs'!E56)","v":37},{"$f":"IF('Classement auteurs'!F56=\"\",\"\",'Classement auteurs'!F56)","v":32},{"$f":"IF('Classement auteurs'!G56=\"\",\"\",'Classement auteurs'!G56)","v":35},{"$f":"IF('Classement auteurs'!H56=\"\",\"\",'Classement auteurs'!H56)","v":36},{"$f":"IF('Classement auteurs'!I56=\"\",\"\",'Classement auteurs'!I56)","v":44},{"$f":"IF('Classement auteurs'!J56=\"\",\"\",'Classement auteurs'!J56)","v":220}]
[null,132060001801,{"$f":"IFERROR(VLOOKUP($B57,'Défi-1'!$C$2:$J$200,8,FALSE),\"\")","v":38},{"$f":"IFERROR(VLOOKUP($B57,'Défi-2'!$C$2:$J$200,8,FALSE),\"\")","v":38},{"$f":"IFERROR(VLOOKUP($B57,'Défi-3'!$C$2:$J$200,8,FALSE),\"\")","v":40},{"$f":"IFERROR(VLOOKUP($B57,'Défi-4'!$C$2:$J$200,8,FALSE),\"\")","v":22},{"$f":"IFERROR(VLOOKUP($B57,'Défi-5'!$C$2:$J$200,8,FALSE),\"\")","v":47},{"$f":"IFERROR(VLOOKUP($B57,'Défi-6'!$C$2:$J$200,8,FALSE),\"\")","v":""},{"$f":"IFERROR(VLOOKUP($B57,'Défi-7'!$C$2:$J$200,8,FALSE),\"\")","v":35},220,null,"OK","OK","OK","OK","OK","OK","OK","OK","OK",null,{"$f":"'Classement auteurs'!$B57","v":132060001801},{"$f":"IF('Classement auteurs'!C57=\"\",\"\",'Classement auteurs'!C57)","v":38},{"$f":"IF('Classement auteurs'!D57=\"\",\"\",'Classement auteurs'!D57)","v":38},{"$f":"IF('Classement auteurs'!E57=\"\",\"\",'Classement auteurs'!E57)","v":40},{"$f":"IF('Classement auteurs'!F57=\"\",\"\",'Classement auteurs'!F57)","v":22},{"$f":"IF('Classement auteurs'!G57=\"\",\"\",'Classement auteurs'!G57)","v":47},{"$f":"IF('Classement auteurs'!H57=\"\",\"\",'Classement auteurs'!H57)","v":""},{"$f":"IF('Classement auteurs'!I57=\"\",\"\",'Classement auteurs'!I57)","v":35},{"$f":"IF('Classement auteurs'!J57=\"\",\"\",'Classement auteurs'!J57)","v":220}]
[null,131879000101,{"$f":"IFERROR(VLOOKUP($B58,'Défi-1'!$C$2:$J$200,8,FALSE),\"\")","v":41},{"$f":"IFERROR(VLOOKUP($B58,'Défi-2'!$C$2:$J$200,8,FALSE),\"\")","v":41},{"$f":"IFERROR(VLOOKUP($B58,'Défi-3'!$C$2:$J$200,8,FALSE),\"\")","v":38},{"$f":"IFERROR(VLOOKUP($B58,'Défi-4'!$C$2:$J$200,8,FALSE),\"\")","v":""},{"$f":"IFERROR(VLOOKUP($B58,'Défi-5'!$C$2:$J$200,8,FALSE),\"\")","v":28},{"$f":"IFERROR(VLOOKUP($B58,'Défi-6'!$C$2:$J$200,8,FALSE),\"\")","v":41},{"$f":"IFERROR(VLOOKUP($B58,'Défi-7'!$C$2:$J$200,8,FALSE),\"\")","v":40},229,null,"OK","OK","OK","OK","OK","OK","KO","OK","KO",null,{"$f":"'Classement auteurs'!$B58","v":131879000101},{"$f":"IF('Classement auteurs'!C58=\"\",\"\",'Classement auteurs'!C58)","v":41},{"$f":"IF('Classement auteurs'!D58=\"\",\"\",'Classement auteurs'!D58)","v":41},{"$f":"IF('Classement auteurs'!E58=\"\",\"\",'Classement auteurs'!E58)","v":38},{"$f":"IF('Classement auteurs'!F58=\"\",\"\",'Classement auteurs'!F58)","v":""},{"$f":"IF('Classement auteurs'!G58=\"\",\"\",'Classement auteurs'!G58)","v":28},{"$f":"IF('Classement auteurs'!H58=\"\",\"\",'Classement auteurs'!H58)","v":28},{"$f":"IF('Classement auteurs'!I58=\"\",\"\",'Classement auteurs'!I58)","v":40},{"$f":"IF('Classement auteurs'!J58=\"\",\"\",'Classement auteurs'!J58)","v":216}]
[null,130987024001,{"$f":"IFERROR(VLOOKUP($B59,'Défi-1'!$C$2:$J$200,8,FALSE),\"\")","v":46},{"$f":"IFERROR(VLOOKUP($B59,'Défi-2'!$C$2:$J$200,8,FALSE),\"\")","v":44},{"$f":"IFERROR(VLOOKUP($B59,'Défi-3'!$C$2:$J$200,8,FALSE),\"\")","v":44},{"$f":"IFERROR(VLOOKUP($B59,'Défi-4'!$C$2:$J$200,8,FALSE),\"\")","v":""},{"$f":"IFERROR(VLOOKUP($B59,'Défi-5'!$C$2:$J$200,8,FALSE),\"\")","v":""},{"$f":"IFERROR(VLOOKUP($B59,'Défi-6'!$C$2:$J$200,8,FALSE),\"\")","v":46},{"$f":"IFERROR(VLOOKUP($B59,'Défi-7'!$C$2:$J$200,8,FALSE),\"\")","v":37},217,null,"OK","OK","OK","OK","OK","OK","KO","OK","KO",null,{"$f":"'Classement auteurs'!$B59","v":130987024001},{"$f":"IF('Classement auteurs'!C59=\"\",\"\",'Classement auteurs'!C59)","v":46},{"$f":"IF('Classement auteurs'!D59=\"\",\"\",'Classement auteurs'!D59)","v":44},{"$f":"IF('Classement auteurs'!E59=\"\",\"\",'Classement auteurs'!E59)","v":44},{"$f":"IF('Classement auteurs'!F59=\"\",\"\",'Classement auteurs'!F59)","v":""},{"$f":"IF('Classement auteurs'!G59=\"\",\"\",'Classement auteurs'!G59)","v":""},{"$f":"IF('Classement auteurs'!H59=\"\",\"\",'Classement auteurs'!H59)","v":44},{"$f":"IF('Classement auteurs'!I59=\"\",\"\",'Classement auteurs'!I59)","v":37},{"$f":"IF('Classement auteurs'!J59=\"\",\"\",'Classement auteurs'!J59)","v":215}]
[null,131499006901,{"$f":"IFERROR(VLOOKUP($B60,'Défi-1'!$C$2:$J$200,8,FALSE),\"\")","v":42},{"$f":"IFERROR(VLOOKUP($B60,'Défi-2'!$C$2:$J$200,8,FALSE),\"\")","v":45},{"$f":"IFERROR(VLOOKUP($B60,'Défi-3'!$C$2:$J$200,8,FALSE),\"\")","v":43},{"$f":"IFERROR(VLOOKUP($B60,'Défi-4'!$C$2:$J$200,8,FALSE),\"\")","v":39},{"$f":"IFERROR(VLOOKUP($B60,'Défi-5'!$C$2:$J$200,8,FALSE),\"\")","v":46},{"$f":"IFERROR(VLOOKUP($B60,'Défi-6'!$C$2:$J$200,8,FALSE),\"\")","v":""},{"$f":"IFERROR(VLOOKUP($B60,'Défi-7'!$C$2:$J$200,8,FALSE),\"\")","v":""},215,null,"OK","OK","OK","OK","OK","OK","OK","OK","OK",null,{"$f":"'Classement auteurs'!$B60","v":131499006901},{"$f":"IF('Classement auteurs'!C60=\"\",\"\",'Classement auteurs'!C60)","v":42},{"$f":"IF('Classement auteurs'!D60=\"\",\"\",'Classement auteurs'!D60)","v":45},{"$f":"IF('Classement auteurs'!E60=\"\",\"\",'Classement auteurs'!E60)","v":43},{"$f":"IF('Classement auteurs'!F60=\"\",\"\",'Classement auteurs'!F60)","v":39},{"$f":"IF('Classement auteurs'!G60=\"\",\"\",'Classement auteurs'!G60)","v":46},{"$f":"IF('Classement auteurs'!H60=\"\",\"\",'Classement auteurs'!H60)","v":""},{"$f":"IF('Classement auteurs'!I60=\"\",\"\",'Classement auteurs'!I60)","v":""},{"$f":"IF('Classement auteurs'!J60=\"\",\"\",'Classement auteurs'!J60)","v":215}]
[null,131353003001,{"$f":"IFERROR(VLOOKUP($B61,'Défi-1'!$C$2:$J$200,8,FALSE),\"\")","v":45},{"$f":"IFERROR(VLOOKUP($B61,'Défi-2'!$C$2:$J$200,8,FALSE),\"\")","v":30},{"$f":"IFERROR(VLOOKUP($B61,'Défi-3'!$C$2:$J$200,8,FALSE),\"\")","v":37},{"$f":"IFERROR(VLOOKUP($B61,'Défi-4'!$C$2:$J$200,8,FALSE),\"\")","v":""},{"$f":"IFERROR(VLOOKUP($B61,'Défi-5'!$C$2:$J$200,8,FALSE),\"\")","v":35},{"$f":"IFERROR(VLOOKUP($B61,'Défi-6'!$C$2:$J$200,8,FALSE),\"\")","v":30},{"$f":"IFERROR(VLOOKUP($B61,'Défi-7'!$C$2:$J$200,8,FALSE),\"\")","v":36},213,null,"OK","OK","OK","OK","OK","OK","OK","OK","OK",null,{"$f":"'Classement auteurs'!$B61","v":131353003001},{"$f":"IF('Classement auteurs'!C61=\"\",\"\",'Classement auteurs'!C61)","v":45},{"$f":"IF('Classement auteurs'!D61=\"\",\"\",'Classement auteurs'!D61)","v":30},{"$f":"IF('Classement auteurs'!E61=\"\",\"\",'Classement auteurs'!E61)","v":37},{"$f":"IF('Classement auteurs'!F61=\"\",\"\",'Classement auteurs'!F61)","v":""},{"$f":"IF('Classement auteurs'!G61=\"\",\"\",'Classement auteurs'!G61)","v":35},{"$f":"IF('Classement auteurs'!H61=\"\",\"\",'Classement auteurs'!H61)","v":30},{"$f":"IF('Classement auteurs'!I61=\"\",\"\",'Classement auteurs'!I61)","v":36},{"$f":"IF('Classement auteurs'!J61=\"\",\"\",'Classement auteurs'!J61)","v":213}]
[null,131499010001,{"$f":"IFERROR(VLOOKUP($B62,'Défi-1'!$C$2:$J$200,8,FALSE),\"\")","v":42},{"$f":"IFERROR(VLOOKUP($B62,'Défi-2'!$C$2:$J$200,8,FALSE),\"\")","v":42},{"$f":"IFERROR(VLOOKUP($B62,'Défi-3'!$C$2:$J$200,8,FALSE),\"\")","v":43},{"$f":"IFERROR(VLOOKUP($B62,'Défi-4'!$C$2:$J$200,8,FALSE),\"\")","v":42},{"$f":"IFERROR(VLOOKUP($B62,'Défi-5'!$C$2:$J$200,8,FALSE),\"\")","v":42},{"$f":"IFERROR(VLOOKUP($B62,'Défi-6'!$C$2:$J$200,8,FALSE),\"\")","v":""},{"$f":"IFERROR(VLOOKUP($B62,'Défi-7'!$C$2:$J$200,8,FALSE),\"\")","v":""},211,null,"OK","OK","OK","OK","OK","OK","OK","OK","OK",null,{"$f":"'Classement auteurs'!$B62","v":131499010001},{"$f":"IF('Classement auteurs'!C62=\"\",\"\",'Classement auteurs'!C62)","v":42},{"$f":"IF('Classement auteurs'!D62=\"\",\"\",'Classement auteurs'!D62)","v":42},{"$f":"IF('Classement auteurs'!E62=\"\",\"\",'Classement auteurs'!E62)","v":43},{"$f":"IF('Classement auteurs'!F62=\"\",\"\",'Classement auteurs'!F62)","v":42},{"$f":"IF('Classement auteurs'!G62=\"\",\"\",'Classement auteurs'!G62)","v":42},{"$f":"IF('Classement auteurs'!H62=\"\",\"\",'Classement auteurs'!H62)","v":""},{"$f":"IF('Classement auteurs'!I62=\"\",\"\",'Classement auteurs'!I62)","v":""},{"$f":"IF('Classement auteurs'!J62=\"\",\"\",'Classement auteurs'!J62)","v":211}]
[null,130925007601,{"$f":"IFERROR(VLOOKUP($B63,'Défi-1'!$C$2:$J$200,8,FALSE),\"\")","v":""},{"$f":"IFERROR(VLOOKUP($B63,'Défi-2'!$C$2:$J$200,8,FALSE),\"\")","v":44},{"$f":"IFERROR(VLOOKUP($B63,'Défi-3'!$C$2:$J$200,8,FALSE),\"\")","v":43},{"$f":"IFERROR(VLOOKUP($B63,'Défi-4'!$C$2:$J$200,8,FALSE),\"\")","v":39},{"$f":"IFERROR(VLOOKUP($B63,'Défi-5'!$C$2:$J$200,8,FALSE),\"\")","v":41},{"$f":"IFERROR(VLOOKUP($B63,'Défi-6'!$C$2:$J$200,8,FALSE),\"\")","v":44},{"$f":"IFERROR(VLOOKUP($B63,'Défi-7'!$C$2:$J$200,8,FALSE),\"\")","v":""},211,null,"OK","OK","OK","OK","OK","OK","OK","OK","OK",null,{"$f":"'Classement auteurs'!$B63","v":130925007601},{"$f":"IF('Classement auteurs'!C63=\"\",\"\",'Classement auteurs'!C63)","v":""},{"$f":"IF('Classement auteurs'!D63=\"\",\"\",'Classement auteurs'!D63)","v":44},{"$f":"IF('Classement auteurs'!E63=\"\",\"\",'Classement auteurs'!E63)","v":43},{"$f":"IF('Classement auteurs'!F63=\"\",\"\",'Classement auteurs'!F63)","v":39},{"$f":"IF('Classement auteurs'!G63=\"\",\"\",'Classement auteurs'!G63)","v":41},{"$f":"IF('Classement auteurs'!H63=\"\",\"\",'Classement auteurs'!H63)","v":44},{"$f":"IF('Classement auteurs'!I63=\"\",\"\",'Classement auteurs'!I63)","v":""},{"$f":"IF('Classement auteurs'!J63=\"\",\"\",'Classement auteurs'!J63)","v":211}]
[null,131992000301,{"$f":"IFERROR(VLOOKUP($B64,'Défi-1'!$C$2:$J$200,8,FALSE),\"\")","v":40},{"$f":"IFERROR(VLOOKUP($B64,'Défi-2'!$C$2:$J$200,8,FALSE),\"\")","v":33},{"$f":"IFERROR(VLOOKUP($B64,'Défi-3'!$C$2:$J$200,8,FALSE),\"\")","v":32},{"$f":"IFERROR(VLOOKUP($B64,'Défi-4'!$C$2:$J$200,8,FALSE),\"\")","v":""},{"$f":"IFERROR(VLOOKUP($B64,'Défi-5'!$C$2:$J$200,8,FALSE),\"\")","v":31},{"$f":"IFERROR(VLOOKUP($B64,'Défi-6'!$C$2:$J$200,8,FALSE),\"\")","v":40},{"$f":"IFERROR(VLOOKUP($B64,'Défi-7'!$C$2:$J$200,8,FALSE),\"\")","v":33},209,null,"OK","OK","OK","OK","OK","OK","OK","OK","OK",null,{"$f":"'Classement auteurs'!$B64","v":131992000301},{"$f":"IF('Classement auteurs'!C64=\"\",\"\",'Classement auteurs'!C64)","v":40},{"$f":"IF('Classement auteurs'!D64=\"\",\"\",'Classement auteurs'!D64)","v":33},{"$f":"IF('Classement auteurs'!E64=\"\",\"\",'Classement auteurs'!E64)","v":32},{"$f":"IF('Classement auteurs'!F64=\"\",\"\",'Classement auteurs'!F64)","v":""},{"$f":"IF('Classement auteurs'!G64=\"\",\"\",'Classement auteurs'!G64)","v":31},{"$f":"IF('Classement auteurs'!H64=\"\",\"\",'Classement auteurs'!H64)","v":40},{"$f":"IF('Classement auteurs'!I64=\"\",\"\",'Classement auteurs'!I64)","v":33},{"$f":"IF('Classement auteurs'!J64=\"\",\"\",'Classement auteurs'!J64)","v":209}]
[null,130987023901,{"$f":"IFERROR(VLOOKUP($B65,'Défi-1'!$C$2:$J$200,8,FALSE),\"\")","v":40},{"$f":"IFERROR(VLOOKUP($B65,'Défi-2'!$C$2:$J$200,8,FALSE),\"\")","v":30},{"$f":"IFERROR(VLOOKUP($B65,'Défi-3'!$C$2:$J$200,8,FALSE),\"\")","v":40},{"$f":"IFERROR(VLOOKUP($B65,'Défi-4'!$C$2:$J$200,8,FALSE),\"\")","v":35},{"$f":"IFERROR(VLOOKUP($B65,'Défi-5'!$C$2:$J$200,8,FALSE),\"\")","v":30},{"$f":"IFERROR(VLOOKUP($B65,'Défi-6'!$C$2:$J$200,8,FALSE),\"\")","v":""},{"$f":"IFERROR(VLOOKUP($B65,'Défi-7'!$C$2:$J$200,8,FALSE),\"\")","v":34},209,null,"OK","OK","OK","OK","OK","OK","OK","OK","OK",null,{"$f":"'Classement auteurs'!$B65","v":130987023901},{"$f":"IF('Classement auteurs'!C65=\"\",\"\",'Classement auteurs'!C65)","v":40},{"$f":"IF('Classement auteurs'!D65=\"\",\"\",'Classement auteurs'!D65)","v":30},{"$f":"IF('Classement auteurs'!E65=\"\",\"\",'Classement auteurs'!E65)","v":40},{"$f":"IF('Classement auteurs'!F65=\"\",\"\",'Classement auteurs'!F65)","v":35},{"$f":"IF('Classement auteurs'!G65=\"\",\"\",'Classement auteurs'!G65)","v":30},{"$f":"IF('Classement auteurs'!H65=\"\",\"\",'Classement auteurs'!H65)","v":""},{"$f":"IF('Classement auteurs'!I65=\"\",\"\",'Classement auteurs'!I65)","v":34},{"$f":"IF('Classement auteurs'!J65=\"\",\"\",'Classement auteurs'!J65)","v":209}]
[null,131499009801,{"$f":"IFERROR(VLOOKUP($B66,'Défi-1'!$C$2:$J$200,8,FALSE),\"\")","v":42},{"$f":"IFERROR(VLOOKUP($B66,'Défi-2'!$C$2:$J$200,8,FALSE),\"\")","v":""},{"$f":"IFERROR(VLOOKUP($B66,'Défi-3'!$C$2:$J$200,8,FALSE),\"\")","v":35},{"$f":"IFERROR(VLOOKUP($B66,'Défi-4'!$C$2:$J$200,8,FALSE),\"\")","v":54},{"$f":"IFERROR(VLOOKUP($B66,'Défi-5'!$C$2:$J$200,8,FALSE),\"\")","v":42},{"$f":"IFERROR(VLOOKUP($B66,'Défi-6'!$C$2:$J$200,8,FALSE),\"\")","v":35},{"$f":"IFERROR(VLOOKUP($B66,'Défi-7'!$C$2:$J$200,8,FALSE),\"\")","v":""},208,null,"OK","OK","OK","OK","OK","OK","OK","OK","OK",null,{"$f":"'Classement auteurs'!$B66","v":131499009801},{"$f":"IF('Classement auteurs'!C66=\"\",\"\",'Classement auteurs'!C66)","v":42},{"$f":"IF('Classement auteurs'!D66=\"\",\"\",'Classement auteurs'!D66)","v":""},{"$f":"IF('Classement auteurs'!E66=\"\",\"\",'Classement auteurs'!E66)","v":35},{"$f":"IF('Classement auteurs'!F66=\"\",\"\",'Classement auteurs'!F66)","v":54},{"$f":"IF('Classement auteurs'!G66=\"\",\"\",'Classement auteurs'!G66)","v":42},{"$f":"IF('Classement auteurs'!H66=\"\",\"\",'Classement auteurs'!H66)","v":35},{"$f":"IF('Classement auteurs'!I66=\"\",\"\",'Classement auteurs'!I66)","v":""},{"$f":"IF('Classement auteurs'!J66=\"\",\"\",'Classement auteurs'!J66)","v":208}]
[null,131823008301,{"$f":"IFERROR(VLOOKUP($B67,'Défi-1'!$C$2:$J$200,8,FALSE),\"\")","v":""},{"$f":"IFERROR(VLOOKUP($B67,'Défi-2'!$C$2:$J$200,8,FALSE),\"\")","v":40},{"$f":"IFERROR(VLOOKUP($B67,'Défi-3'!$C$2:$J$200,8,FALSE),\"\")","v":48},{"$f":"IFERROR(VLOOKUP($B67,'Défi-4'!$C$2:$J$200,8,FALSE),\"\")","v":""},{"$f":"IFERROR(VLOOKUP($B67,'Défi-5'!$C$2:$J$200,8,FALSE),\"\")","v":42},{"$f":"IFERROR(VLOOKUP($B67,'Défi-6'!$C$2:$J$200,8,FALSE),\"\")","v":48},{"$f":"IFERROR(VLOOKUP($B67,'Défi-7'!$C$2:$J$200,8,FALSE),\"\")","v":36},214,null,"OK","OK","OK","OK","OK","OK","KO","OK","KO",null,{"$f":"'Classement auteurs'!$B67","v":131823008301},{"$f":"IF('Classement auteurs'!C67=\"\",\"\",'Classement auteurs'!C67)","v":""},{"$f":"IF('Classement auteurs'!D67=\"\",\"\",'Classement auteurs'!D67)","v":40},{"$f":"IF('Classement auteurs'!E67=\"\",\"\",'Classement auteurs'!E67)","v":48},{"$f":"IF('Classement auteurs'!F67=\"\",\"\",'Classement auteurs'!F67)","v":""},{"$f":"IF('Classement auteurs'!G67=\"\",\"\",'Classement auteurs'!G67)","v":42},{"$f":"IF('Classement auteurs'!H67=\"\",\"\",'Classement auteurs'!H67)","v":42},{"$f":"IF('Classement auteurs'!I67=\"\",\"\",'Classement auteurs'!I67)","v":36},{"$f":"IF('Classement auteurs'!J67=\"\",\"\",'Classement auteurs'!J67)","v":208}]
[null,131683007601,{"$f":"IFERROR(VLOOKUP($B68,'Défi-1'!$C$2:$J$200,8,FALSE),\"\")","v":""},{"$f":"IFERROR(VLOOKUP($B68,'Défi-2'!$C$2:$J$200,8,FALSE),\"\")","v":42},{"$f":"IFERROR(VLOOKUP($B68,'Défi-3'!$C$2:$J$200,8,FALSE),\"\")","v":31},{"$f":"IFERROR(VLOOKUP($B68,'Défi-4'!$C$2:$J$200,8,FALSE),\"\")","v":42},{"$f":"IFERROR(VLOOKUP($B68,'Défi-5'!$C$2:$J$200,8,FALSE),\"\")","v":32},{"$f":"IFERROR(VLOOKUP($B68,'Défi-6'!$C$2:$J$200,8,FALSE),\"\")","v":31},{"$f":"IFERROR(VLOOKUP($B68,'Défi-7'!$C$2:$J$200,8,FALSE),\"\")","v":29},207,null,"OK","OK","OK","OK","OK","OK","OK","OK","OK",null,{"$f":"'Classement auteurs'!$B68","v":131683007601},{"$f":"IF('Classement auteurs'!C68=\"\",\"\",'Classement auteurs'!C68)","v":""},{"$f":"IF('Classement auteurs'!D68=\"\",\"\",'Classement auteurs'!D68)","v":42},{"$f":"IF('Classement auteurs'!E68=\"\",\"\",'Classement auteurs'!E68)","v":31},{"$f":"IF('Classement auteurs'!F68=\"\",\"\",'Classement auteurs'!F68)","v":42},{"$f":"IF('Classement auteurs'!G68=\"\",\"\",'Classement auteurs'!G68)","v":32},{"$f":"IF('Classement auteurs'!H68=\"\",\"\",'Classement auteurs'!H68)","v":31},{"$f":"IF('Classement auteurs'!I68=\"\",\"\",'Classement auteurs'!I68)","v":29},{"$f":"IF('Classement auteurs'!J68=\"\",\"\",'Classement auteurs'!J68)","v":207}]
[null,130925010201,{"$f":"IFERROR(VLOOKUP($B69,'Défi-1'!$C$2:$J$200,8,FALSE),\"\")","v":46},{"$f":"IFERROR(VLOOKUP($B69,'Défi-2'!$C$2:$J$200,8,FALSE),\"\")","v":30},{"$f":"IFERROR(VLOOKUP($B69,'Défi-3'!$C$2:$J$200,8,FALSE),\"\")","v":31},{"$f":"IFERROR(VLOOKUP($B69,'Défi-4'!$C$2:$J$200,8,FALSE),\"\")","v":33},{"$f":"IFERROR(VLOOKUP($B69,'Défi-5'!$C$2:$J$200,8,FALSE),\"\")","v":""},{"$f":"IFERROR(VLOOKUP($B69,'Défi-6'!$C$2:$J$200,8,FALSE),\"\")","v":31},{"$f":"IFERROR(VLOOKUP($B69,'Défi-7'!$C$2:$J$200,8,FALSE),\"\")","v":35},206,null,"OK","OK","OK","OK","OK","OK","OK","OK","OK",null,{"$f":"'Classement auteurs'!$B69","v":130925010201},{"$f":"IF('Classement auteurs'!C69=\"\",\"\",'Classement auteurs'!C69)","v":46},{"$f":"IF('Classement auteurs'!D69=\"\",\"\",'Classement auteurs'!D69)","v":30},{"$f":"IF('Classement auteurs'!E69=\"\",\"\",'Classement auteurs'!E69)","v":31},{"$f":"IF('Classement auteurs'!F69=\"\",\"\",'Classement auteurs'!F69)","v":33},{"$f":"IF('Classement auteurs'!G69=\"\",\"\",'Classement auteurs'!G69)","v":""},{"$f":"IF('Classement auteurs'!H69=\"\",\"\",'Classement auteurs'!H69)","v":31},{"$f":"IF('Classement auteurs'!I69=\"\",\"\",'Classement auteurs'!I69)","v":35},{"$f":"IF('Classement auteurs'!J69=\"\",\"\",'Classement auteurs'!J69)","v":206}]
[null,130527017001,{"$f":"IFERROR(VLOOKUP($B70,'Défi-1'!$C$2:$J$200,8,FALSE),\"\")","v":55},{"$f":"IFERROR(VLOOKUP($B70,'Défi-2'!$C$2:$J$200,8,FALSE),\"\")","v":40},{"$f":"IFERROR(VLOOKUP($B70,'Défi-3'!$C$2:$J$200,8,FALSE),\"\")","v":31},{"$f":"IFERROR(VLOOKUP($B70,'Défi-4'!$C$2:$J$200,8,FALSE),\"\")","v":29},{"$f":"IFERROR(VLOOKUP($B70,'Défi-5'!$C$2:$J$200,8,FALSE),\"\")","v":51},{"$f":"IFERROR(VLOOKUP($B70,'Défi-6'!$C$2:$J$200,8,FALSE),\"\")","v":""},{"$f":"IFERROR(VLOOKUP($B70,'Défi-7'!$C$2:$J$200,8,FALSE),\"\")","v":""},206,null,"OK","OK","OK","OK","OK","OK","OK","OK","OK",null,{"$f":"'Classement auteurs'!$B70","v":130527017001},{"$f":"IF('Classement auteurs'!C70=\"\",\"\",'Classement auteurs'!C70)","v":55},{"$f":"IF('Classement auteurs'!D70=\"\",\"\",'Classement auteurs'!D70)","v":40},{"$f":"IF('Classement auteurs'!E70=\"\",\"\",'Classement auteurs'!E70)","v":31},{"$f":"IF('Classement auteurs'!F70=\"\",\"\",'Classement auteurs'!F70)","v":29},{"$f":"IF('Classement auteurs'!G70=\"\",\"\",'Classement auteurs'!G70)","v":51},{"$f":"IF('Classement auteurs'!H70=\"\",\"\",'Classement auteurs'!H70)","v":""},{"$f":"IF('Classement auteurs'!I70=\"\",\"\",'Classement auteurs'!I70)","v":""},{"$f":"IF('Classement auteurs'!J70=\"\",\"\",'Classement auteurs'!J70)","v":206}]
[null,131879002001,{"$f":"IFERROR(VLOOKUP($B71,'Défi-1'!$C$2:$J$200,8,FALSE),\"\")","v":""},{"$f":"IFERROR(VLOOKUP($B71,'Défi-2'!$C$2:$J$200,8,FALSE),\"\")","v":47},{"$f":"IFERROR(VLOOKUP($B71,'Défi-3'!$C$2:$J$200,8,FALSE),\"\")","v":42},{"$f":"IFERROR(VLOOKUP($B71,'Défi-4'!$C$2:$J$200,8,FALSE),\"\")","v":41},{"$f":"IFERROR(VLOOKUP($B71,'Défi-5'!$C$2:$J$200,8,FALSE),\"\")","v":38},{"$f":"IFERROR(VLOOKUP($B71,'Défi-6'!$C$2:$J$200,8,FALSE),\"\")","v":38},{"$f":"IFERROR(VLOOKUP($B71,'Défi-7'!$C$2:$J$200,8,FALSE),\"\")","v":""},206,null,"OK","OK","OK","OK","OK","OK","OK","OK","OK",null,{"$f":"'Classement auteurs'!$B71","v":131879002001},{"$f":"IF('Classement auteurs'!C71=\"\",\"\",'Classement auteurs'!C71)","v":""},{"$f":"IF('Classement auteurs'!D71=\"\",\"\",'Classement auteurs'!D71)","v":47},{"$f":"IF('Classement auteurs'!E71=\"\",\"\",'Classement auteurs'!E71)","v":42},{"$f":"IF('Classement auteurs'!F71=\"\",\"\",'Classement auteurs'!F71)","v":41},{"$f":"IF('Classement auteurs'!G71=\"\",\"\",'Classement auteurs'!G71)","v":38},{"$f":"IF('Classement auteurs'!H71=\"\",\"\",'Classement auteurs'!H71)","v":38},{"$f":"IF('Classement auteurs'!I71=\"\",\"\",'Classement auteurs'!I71)","v":""},{"$f":"IF('Classement auteurs'!J71=\"\",\"\",'Classement auteurs'!J71)","v":206}]
[null,131110001101,{"$f":"IFERROR(VLOOKUP($B72,'Défi-1'!$C$2:$J$200,8,FALSE),\"\")","v":36},{"$f":"IFERROR(VLOOKUP($B72,'Défi-2'!$C$2:$J$200,8,FALSE),\"\")","v":24},{"$f":"IFERROR(VLOOKUP($B72,'Défi-3'!$C$2:$J$200,8,FALSE),\"\")","v":38},{"$f":"IFERROR(VLOOKUP($B72,'Défi-4'!$C$2:$J$200,8,FALSE),\"\")","v":36},{"$f":"IFERROR(VLOOKUP($B72,'Défi-5'!$C$2:$J$200,8,FALSE),\"\")","v":45},{"$f":"IFERROR(VLOOKUP($B72,'Défi-6'!$C$2:$J$200,8,FALSE),\"\")","v":36},{"$f":"IFERROR(VLOOKUP($B72,'Défi-7'!$C$2:$J$200,8,FALSE),\"\")","v":""},215,null,"OK","OK","OK","OK","OK","OK","KO","OK","KO",null,{"$f":"'Classement auteurs'!$B72","v":131110001101},{"$f":"IF('Classement auteurs'!C72=\"\",\"\",'Classement auteurs'!C72)","v":36},{"$f":"IF('Classement auteurs'!D72=\"\",\"\",'Classement auteurs'!D72)","v":24},{"$f":"IF('Classement auteurs'!E72=\"\",\"\",'Classement auteurs'!E72)","v":38},{"$f":"IF('Classement auteurs'!F72=\"\",\"\",'Classement auteurs'!F72)","v":36},{"$f":"IF('Classement auteurs'!G72=\"\",\"\",'Classement auteurs'!G72)","v":45},{"$f":"IF('Classement auteurs'!H72=\"\",\"\",'Classement auteurs'!H72)","v":24},{"$f":"IF('Classement auteurs'!I72=\"\",\"\",'Classement auteurs'!I72)","v":""},{"$f":"IF('Classement auteurs'!J72=\"\",\"\",'Classement auteurs'!J72)","v":203}]
[null,131499010501,{"$f":"IFERROR(VLOOKUP($B73,'Défi-1'!$C$2:$J$200,8,FALSE),\"\")","v":35},{"$f":"IFERROR(VLOOKUP($B73,'Défi-2'!$C$2:$J$200,8,FALSE),\"\")","v":41},{"$f":"IFERROR(VLOOKUP($B73,'Défi-3'!$C$2:$J$200,8,FALSE),\"\")","v":47},{"$f":"IFERROR(VLOOKUP($B73,'Défi-4'!$C$2:$J$200,8,FALSE),\"\")","v":41},{"$f":"IFERROR(VLOOKUP($B73,'Défi-5'!$C$2:$J$200,8,FALSE),\"\")","v":36},{"$f":"IFERROR(VLOOKUP($B73,'Défi-6'!$C$2:$J$200,8,FALSE),\"\")","v":""},{"$f":"IFERROR(VLOOKUP($B73,'Défi-7'!$C$2:$J$200,8,FALSE),\"\")","v":""},200,null,"OK","OK","OK","OK","OK","OK","OK","OK","OK",null,{"$f":"'Classement auteurs'!$B73","v":131499010501},{"$f":"IF('Classement auteurs'!C73=\"\",\"\",'Classement auteurs'!C73)","v":35},{"$f":"IF('Classement auteurs'!D73=\"\",\"\",'Classement auteurs'!D73)","v":41},{"$f":"IF('Classement auteurs'!E73=\"\",\"\",'Classement auteurs'!E73)","v":47},{"$f":"IF('Classement auteurs'!F73=\"\",\"\",'Classement auteurs'!F73)","v":41},{"$f":"IF('Classement auteurs'!G73=\"\",\"\",'Classement auteurs'!G73)","v":36},{"$f":"IF('Classement auteurs'!H73=\"\",\"\",'Classement auteurs'!H73)","v":""},{"$f":"IF('Classement auteurs'!I73=\"\",\"\",'Classement auteurs'!I73)","v":""},{"$f":"IF('Classement auteurs'!J73=\"\",\"\",'Classement auteurs'!J73)","v":200}]
[null,131376012601,{"$f":"IFERROR(VLOOKUP($B74,'Défi-1'!$C$2:$J$200,8,FALSE),\"\")","v":31},{"$f":"IFERROR(VLOOKUP($B74,'Défi-2'!$C$2:$J$200,8,FALSE),\"\")","v":29},{"$f":"IFERROR(VLOOKUP($B74,'Défi-3'!$C$2:$J$200,8,FALSE),\"\")","v":40},{"$f":"IFERROR(VLOOKUP($B74,'Défi-4'!$C$2:$J$200,8,FALSE),\"\")","v":""},{"$f":"IFERROR(VLOOKUP($B74,'Défi-5'!$C$2:$J$200,8,FALSE),\"\")","v":34},{"$f":"IFERROR(VLOOKUP($B74,'Défi-6'!$C$2:$J$200,8,FALSE),\"\")","v":34},{"$f":"IFERROR(VLOOKUP($B74,'Défi-7'!$C$2:$J$200,8,FALSE),\"\")","v":33},201,null,"OK","OK","OK","OK","OK","OK","KO","OK","KO",null,{"$f":"'Classement auteurs'!$B74","v":131376012601},{"$f":"IF('Classement auteurs'!C74=\"\",\"\",'Classement auteurs'!C74)","v":31},{"$f":"IF('Classement auteurs'!D74=\"\",\"\",'Classement auteurs'!D74)","v":29},{"$f":"IF('Classement auteurs'!E74=\"\",\"\",'Classement auteurs'!E74)","v":40},{"$f":"IF('Classement auteurs'!F74=\"\",\"\",'Classement auteurs'!F74)","v":""},{"$f":"IF('Classement auteurs'!G74=\"\",\"\",'Classement auteurs'!G74)","v":34},{"$f":"IF('Classement auteurs'!H74=\"\",\"\",'Classement auteurs'!H74)","v":31},{"$f":"IF('Classement auteurs'!I74=\"\",\"\",'Classement auteurs'!I74)","v":33},{"$f":"IF('Classement auteurs'!J74=\"\",\"\",'Classement auteurs'!J74)","v":198}]
[null,131499003901,{"$f":"IFERROR(VLOOKUP($B75,'Défi-1'!$C$2:$J$200,8,FALSE),\"\")","v":42},{"$f":"IFERROR(VLOOKUP($B75,'Défi-2'!$C$2:$J$200,8,FALSE),\"\")","v":""},{"$f":"IFERROR(VLOOKUP($B75,'Défi-3'!$C$2:$J$200,8,FALSE),\"\")","v":40},{"$f":"IFERROR(VLOOKUP($B75,'Défi-4'!$C$2:$J$200,8,FALSE),\"\")","v":45},{"$f":"IFERROR(VLOOKUP($B75,'Défi-5'!$C$2:$J$200,8,FALSE),\"\")","v":39},{"$f":"IFERROR(VLOOKUP($B75,'Défi-6'!$C$2:$J$200,8,FALSE),\"\")","v":""},{"$f":"IFERROR(VLOOKUP($B75,'Défi-7'!$C$2:$J$200,8,FALSE),\"\")","v":32},198,null,"OK","OK","OK","OK","OK","OK","OK","OK","OK",null,{"$f":"'Classement auteurs'!$B75","v":131499003901},{"$f":"IF('Classement auteurs'!C75=\"\",\"\",'Classement auteurs'!C75)","v":42},{"$f":"IF('Classement auteurs'!D75=\"\",\"\",'Classement auteurs'!D75)","v":""},{"$f":"IF('Classement auteurs'!E75=\"\",\"\",'Classement auteurs'!E75)","v":40},{"$f":"IF('Classement auteurs'!F75=\"\",\"\",'Classement auteurs'!F75)","v":45},{"$f":"IF('Classement auteurs'!G75=\"\",\"\",'Classement auteurs'!G75)","v":39},{"$f":"IF('Classement auteurs'!H75=\"\",\"\",'Classement auteurs'!H75)","v":""},{"$f":"IF('Classement auteurs'!I75=\"\",\"\",'Classement auteurs'!I75)","v":32},{"$f":"IF('Classement auteurs'!J75=\"\",\"\",'Classement auteurs'!J75)","v":198}]
[null,131683006601,{"$f":"IFERROR(VLOOKUP($B76,'Défi-1'!$C$2:$J$200,8,FALSE),\"\")","v":40},{"$f":"IFERROR(VLOOKUP($B76,'Défi-2'!$C$2:$J$200,8,FALSE),\"\")","v":26},{"$f":"IFERROR(VLOOKUP($B76,'Défi-3'!$C$2:$J$200,8,FALSE),\"\")","v":42},{"$f":"IFERROR(VLOOKUP($B76,'Défi-4'!$C$2:$J$200,8,FALSE),\"\")","v":""},{"$f":"IFERROR(VLOOKUP($B76,'Défi-5'!$C$2:$J$200,8,FALSE),\"\")","v":49},{"$f":"IFERROR(VLOOKUP($B76,'Défi-6'!$C$2:$J$200,8,FALSE),\"\")","v":""},{"$f":"IFERROR(VLOOKUP($B76,'Défi-7'!$C$2:$J$200,8,FALSE),\"\")","v":41},{"$f":"SUM(C76:I76)","v":198},null,{"$f":"IF(B76=V76,\"OK\",\"KO\")","v":"OK"},{"$f":"IF(C76=W76,\"OK\",\"KO\")","v":"OK"},{"$f":"IF(D76=X76,\"OK\",\"KO\")","v":"OK"},{"$f":"IF(E76=Y76,\"OK\",\"KO\")","v":"OK"},{"$f":"IF(F76=Z76,\"OK\",\"KO\")","v":"OK"},{"$f":"IF(G76=AA76,\"OK\",\"KO\")","v":"OK"},{"$f":"IF(H76=AB76,\"OK\",\"KO\")","v":"OK"},{"$f":"IF(I76=AC76,\"OK\",\"KO\")","v":"OK"},{"$f":"IF(J76=AD76,\"OK\",\"KO\")","v":"OK"},null,{"$f":"'Classement auteurs'!$B76","v":131683006601},{"$f":"IF('Classement auteurs'!C76=\"\",\"\",'Classement auteurs'!C76)","v":40},{"$f":"IF('Classement auteurs'!D76=\"\",\"\",'Classement auteurs'!D76)","v":26},{"$f":"IF('Classement auteurs'!E76=\"\",\"\",'Classement auteurs'!E76)","v":42},{"$f":"IF('Classement auteurs'!F76=\"\",\"\",'Classement auteurs'!F76)","v":""},{"$f":"IF('Classement auteurs'!G76=\"\",\"\",'Classement auteurs'!G76)","v":49},{"$f":"IF('Classement auteurs'!H76=\"\",\"\",'Classement auteurs'!H76)","v":""},{"$f":"IF('Classement auteurs'!I76=\"\",\"\",'Classement auteurs'!I76)","v":41},{"$f":"IF('Classement auteurs'!J76=\"\",\"\",'Classement auteurs'!J76)","v":198}]
[null,130987007401,{"$f":"IFERROR(VLOOKUP($B77,'Défi-1'!$C$2:$J$200,8,FALSE),\"\")","v":31},{"$f":"IFERROR(VLOOKUP($B77,'Défi-2'!$C$2:$J$200,8,FALSE),\"\")","v":32},{"$f":"IFERROR(VLOOKUP($B77,'Défi-3'!$C$2:$J$200,8,FALSE),\"\")","v":28},{"$f":"IFERROR(VLOOKUP($B77,'Défi-4'!$C$2:$J$200,8,FALSE),\"\")","v":38},{"$f":"IFERROR(VLOOKUP($B77,'Défi-5'!$C$2:$J$200,8,FALSE),\"\")","v":37},{"$f":"IFERROR(VLOOKUP($B77,'Défi-6'!$C$2:$J$200,8,FALSE),\"\")","v":37},{"$f":"IFERROR(VLOOKUP($B77,'Défi-7'!$C$2:$J$200,8,FALSE),\"\")","v":""},203,null,"OK","OK","OK","OK","OK","OK","KO","OK","KO",null,{"$f":"'Classement auteurs'!$B77","v":130987007401},{"$f":"IF('Classement auteurs'!C77=\"\",\"\",'Classement auteurs'!C77)","v":31},{"$f":"IF('Classement auteurs'!D77=\"\",\"\",'Classement auteurs'!D77)","v":32},{"$f":"IF('Classement auteurs'!E77=\"\",\"\",'Classement auteurs'!E77)","v":28},{"$f":"IF('Classement auteurs'!F77=\"\",\"\",'Classement auteurs'!F77)","v":38},{"$f":"IF('Classement auteurs'!G77=\"\",\"\",'Classement auteurs'!G77)","v":37},{"$f":"IF('Classement auteurs'!H77=\"\",\"\",'Classement auteurs'!H77)","v":31},{"$f":"IF('Classement auteurs'!I77=\"\",\"\",'Classement auteurs'!I77)","v":""},{"$f":"IF('Classement auteurs'!J77=\"\",\"\",'Classement auteurs'!J77)","v":197}]
[null,132060001201,{"$f":"IFERROR(VLOOKUP($B78,'Défi-1'!$C$2:$J$200,8,FALSE),\"\")","v":46},{"$f":"IFERROR(VLOOKUP($B78,'Défi-2'!$C$2:$J$200,8,FALSE),\"\")","v":""},{"$f":"IFERROR(VLOOKUP($B78,'Défi-3'!$C$2:$J$200,8,FALSE),\"\")","v":39},{"$f":"IFERROR(VLOOKUP($B78,'Défi-4'!$C$2:$J$200,8,FALSE),\"\")","v":40},{"$f":"IFERROR(VLOOKUP($B78,'Défi-5'!$C$2:$J$200,8,FALSE),\"\")","v":39},{"$f":"IFERROR(VLOOKUP($B78,'Défi-6'!$C$2:$J$200,8,FALSE),\"\")","v":""},{"$f":"IFERROR(VLOOKUP($B78,'Défi-7'!$C$2:$J$200,8,FALSE),\"\")","v":33},197,null,"OK","OK","OK","OK","OK","OK","OK","OK","OK",null,{"$f":"'Classement auteurs'!$B78","v":132060001201},{"$f":"IF('Classement auteurs'!C78=\"\",\"\",'Classement auteurs'!C78)","v":46},{"$f":"IF('Classement auteurs'!D78=\"\",\"\",'Classement auteurs'!D78)","v":""},{"$f":"IF('Classement auteurs'!E78=\"\",\"\",'Classement auteurs'!E78)","v":39},{"$f":"IF('Classement auteurs'!F78=\"\",\"\",'Classement auteurs'!F78)","v":40},{"$f":"IF('Classement auteurs'!G78=\"\",\"\",'Classement auteurs'!G78)","v":39},{"$f":"IF('Classement auteurs'!H78=\"\",\"\",'Classement auteurs'!H78)","v":""},{"$f":"IF('Classement auteurs'!I78=\"\",\"\",'Classement auteurs'!I78)","v":33},{"$f":"IF('Classement auteurs'!J78=\"\",\"\",'Classement auteurs'!J78)","v":197}]
[null,131499008201,{"$f":"IFERROR(VLOOKUP($B79,'Défi-1'!$C$2:$J$200,8,FALSE),\"\")","v":45},{"$f":"IFERROR(VLOOKUP($B79,'Défi-2'!$C$2:$J$200,8,FALSE),\"\")","v":41},{"$f":"IFERROR(VLOOKUP($B79,'Défi-3'!$C$2:$J$200,8,FALSE),\"\")","v":""},{"$f":"IFERROR(VLOOKUP($B79,'Défi-4'!$C$2:$J$200,8,FALSE),\"\")","v":41},{"$f":"IFERROR(VLOOKUP($B79,'Défi-5'!$C$2:$J$200,8,FALSE),\"\")","v":49},{"$f":"IFERROR(VLOOKUP($B79,'Défi-6'!$C$2:$J$200,8,FALSE),\"\")","v":""},{"$f":"IFERROR(VLOOKUP($B79,'Défi-7'!$C$2:$J$200,8,FALSE),\"\")","v":20},196,null,"OK","OK","OK","OK","OK","OK","OK","OK","OK",null,{"$f":"'Classement auteurs'!$B79","v":131499008201},{"$f":"IF('Classement auteurs'!C79=\"\",\"\",'Classement auteurs'!C79)","v":45},{"$f":"IF('Classement auteurs'!D79=\"\",\"\",'Classement auteurs'!D79)","v":41},{"$f":"IF('Classement auteurs'!E79=\"\",\"\",'Classement auteurs'!E79)","v":""},{"$f":"IF('Classement auteurs'!F79=\"\",\"\",'Classement auteurs'!F79)","v":41},{"$f":"IF('Classement auteurs'!G79=\"\",\"\",'Classement auteurs'!G79)","v":49},{"$f":"IF('Classement auteurs'!H79=\"\",\"\",'Classement auteurs'!H79)","v":""},{"$f":"IF('Classement auteurs'!I79=\"\",\"\",'Classement auteurs'!I79)","v":20},{"$f":"IF('Classement auteurs'!J79=\"\",\"\",'Classement auteurs'!J79)","v":196}]
[null,131499010601,{"$f":"IFERROR(VLOOKUP($B80,'Défi-1'!$C$2:$J$200,8,FALSE),\"\")","v":46},{"$f":"IFERROR(VLOOKUP($B80,'Défi-2'!$C$2:$J$200,8,FALSE),\"\")","v":40},{"$f":"IFERROR(VLOOKUP($B80,'Défi-3'!$C$2:$J$200,8,FALSE),\"\")","v":37},{"$f":"IFERROR(VLOOKUP($B80,'Défi-4'!$C$2:$J$200,8,FALSE),\"\")","v":32},{"$f":"IFERROR(VLOOKUP($B80,'Défi-5'!$C$2:$J$200,8,FALSE),\"\")","v":39},{"$f":"IFERROR(VLOOKUP($B80,'Défi-6'!$C$2:$J$200,8,FALSE),\"\")","v":""},{"$f":"IFERROR(VLOOKUP($B80,'Défi-7'!$C$2:$J$200,8,FALSE),\"\")","v":""},194,null,"OK","OK","OK","OK","OK","OK","OK","OK","OK",null,{"$f":"'Classement auteurs'!$B80","v":131499010601},{"$f":"IF('Classement auteurs'!C80=\"\",\"\",'Classement auteurs'!C80)","v":46},{"$f":"IF('Classement auteurs'!D80=\"\",\"\",'Classement auteurs'!D80)","v":40},{"$f":"IF('Classement auteurs'!E80=\"\",\"\",'Classement auteurs'!E80)","v":37},{"$f":"IF('Classement auteurs'!F80=\"\",\"\",'Classement auteurs'!F80)","v":32},{"$f":"IF('Classement auteurs'!G80=\"\",\"\",'Classement auteurs'!G80)","v":39},{"$f":"IF('Classement auteurs'!H80=\"\",\"\",'Classement auteurs'!H80)","v":""},{"$f":"IF('Classement auteurs'!I80=\"\",\"\",'Classement auteurs'!I80)","v":""},{"$f":"IF('Classement auteurs'!J80=\"\",\"\",'Classement auteurs'!J80)","v":194}]
[null,131956005701,{"$f":"IFERROR(VLOOKUP($B81,'Défi-1'!$C$2:$J$200,8,FALSE),\"\")","v":36},{"$f":"IFERROR(VLOOKUP($B81,'Défi-2'!$C$2:$J$200,8,FALSE),\"\")","v":31},{"$f":"IFERROR(VLOOKUP($B81,'Défi-3'!$C$2:$J$200,8,FALSE),\"\")","v":34},{"$f":"IFERROR(VLOOKUP($B81,'Défi-4'!$C$2:$J$200,8,FALSE),\"\")","v":28},{"$f":"IFERROR(VLOOKUP($B81,'Défi-5'!$C$2:$J$200,8,FALSE),\"\")","v":38},{"$f":"IFERROR(VLOOKUP($B81,'Défi-6'!$C$2:$J$200,8,FALSE),\"\")","v":""},{"$f":"IFERROR(VLOOKUP($B81,'Défi-7'!$C$2:$J$200,8,FALSE),\"\")","v":27},194,null,"OK","OK","OK","OK","OK","OK","OK","OK","OK",null,{"$f":"'Classement auteurs'!$B81","v":131956005701},{"$f":"IF('Classement auteurs'!C81=\"\",\"\",'Classement auteurs'!C81)","v":36},{"$f":"IF('Classement auteurs'!D81=\"\",\"\",'Classement auteurs'!D81)","v":31},{"$f":"IF('Classement auteurs'!E81=\"\",\"\",'Classement auteurs'!E81)","v":34},{"$f":"IF('Classement auteurs'!F81=\"\",\"\",'Classement auteurs'!F81)","v":28},{"$f":"IF('Classement auteurs'!G81=\"\",\"\",'Classement auteurs'!G81)","v":38},{"$f":"IF('Classement auteurs'!H81=\"\",\"\",'Classement auteurs'!H81)","v":""},{"$f":"IF('Classement auteurs'!I81=\"\",\"\",'Classement auteurs'!I81)","v":27},{"$f":"IF('Classement auteurs'!J81=\"\",\"\",'Classement auteurs'!J81)","v":194}]
[null,131992000401,{"$f":"IFERROR(VLOOKUP($B82,'Défi-1'!$C$2:$J$200,8,FALSE),\"\")","v":""},{"$f":"IFERROR(VLOOKUP($B82,'Défi-2'!$C$2:$J$200,8,FALSE),\"\")","v":39},{"$f":"IFERROR(VLOOKUP($B82,'Défi-3'!$C$2:$J$200,8,FALSE),\"\")","v":32},{"$f":"IFERROR(VLOOKUP($B82,'Défi-4'!$C$2:$J$200,8,FALSE),\"\")","v":20},{"$f":"IFERROR(VLOOKUP($B82,'Défi-5'!$C$2:$J$200,8,FALSE),\"\")","v":45},{"$f":"IFERROR(VLOOKUP($B82,'Défi-6'!$C$2:$J$200,8,FALSE),\"\")","v":32},{"$f":"IFERROR(VLOOKUP($B82,'Défi-7'!$C$2:$J$200,8,FALSE),\"\")","v":24},192,null,"OK","OK","OK","OK","OK","OK","OK","OK","OK",null,{"$f":"'Classement auteurs'!$B82","v":131992000401},{"$f":"IF('Classement auteurs'!C82=\"\",\"\",'Classement auteurs'!C82)","v":""},{"$f":"IF('Classement auteurs'!D82=\"\",\"\",'Classement auteurs'!D82)","v":39},{"$f":"IF('Classement auteurs'!E82=\"\",\"\",'Classement auteurs'!E82)","v":32},{"$f":"IF('Classement auteurs'!F82=\"\",\"\",'Classement auteurs'!F82)","v":20},{"$f":"IF('Classement auteurs'!G82=\"\",\"\",'Classement auteurs'!G82)","v":45},{"$f":"IF('Classement auteurs'!H82=\"\",\"\",'Classement auteurs'!H82)","v":32},{"$f":"IF('Classement auteurs'!I82=\"\",\"\",'Classement auteurs'!I82)","v":24},{"$f":"IF('Classement auteurs'!J82=\"\",\"\",'Classement auteurs'!J82)","v":192}]
[null,131227008601,{"$f":"IFERROR(VLOOKUP($B83,'Défi-1'!$C$2:$J$200,8,FALSE),\"\")","v":""},{"$f":"IFERROR(VLOOKUP($B83,'Défi-2'!$C$2:$J$200,8,FALSE),\"\")","v":""},{"$f":"IFERROR(VLOOKUP($B83,'Défi-3'!$C$2:$J$200,8,FALSE),\"\")","v":53},{"$f":"IFERROR(VLOOKUP($B83,'Défi-4'!$C$2:$J$200,8,FALSE),\"\")","v":44},{"$f":"IFERROR(VLOOKUP($B83,'Défi-5'!$C$2:$J$200,8,FALSE),\"\")","v":42},{"$f":"IFERROR(VLOOKUP($B83,'Défi-6'!$C$2:$J$200,8,FALSE),\"\")","v":53},{"$f":"IFERROR(VLOOKUP($B83,'Défi-7'!$C$2:$J$200,8,FALSE),\"\")","v":""},192,null,"OK","OK","OK","OK","OK","OK","OK","OK","OK",null,{"$f":"'Classement auteurs'!$B83","v":131227008601},{"$f":"IF('Classement auteurs'!C83=\"\",\"\",'Classement auteurs'!C83)","v":""},{"$f":"IF('Classement auteurs'!D83=\"\",\"\",'Classement auteurs'!D83)","v":""},{"$f":"IF('Classement auteurs'!E83=\"\",\"\",'Classement auteurs'!E83)","v":53},{"$f":"IF('Classement auteurs'!F83=\"\",\"\",'Classement auteurs'!F83)","v":44},{"$f":"IF('Classement auteurs'!G83=\"\",\"\",'Classement auteurs'!G83)","v":42},{"$f":"IF('Classement auteurs'!H83=\"\",\"\",'Classement auteurs'!H83)","v":53},{"$f":"IF('Classement auteurs'!I83=\"\",\"\",'Classement auteurs'!I83)","v":""},{"$f":"IF('Classement auteurs'!J83=\"\",\"\",'Classement auteurs'!J83)","v":192}]
[null,132086001401,{"$f":"IFERROR(VLOOKUP($B84,'Défi-1'!$C$2:$J$200,8,FALSE),\"\")","v":33},{"$f":"IFERROR(VLOOKUP($B84,'Défi-2'!$C$2:$J$200,8,FALSE),\"\")","v":41},{"$f":"IFERROR(VLOOKUP($B84,'Défi-3'!$C$2:$J$200,8,FALSE),\"\")","v":37},{"$f":"IFERROR(VLOOKUP($B84,'Défi-4'!$C$2:$J$200,8,FALSE),\"\")","v":46},{"$f":"IFERROR(VLOOKUP($B84,'Défi-5'!$C$2:$J$200,8,FALSE),\"\")","v":34},{"$f":"IFERROR(VLOOKUP($B84,'Défi-6'!$C$2:$J$200,8,FALSE),\"\")","v":""},{"$f":"IFERROR(VLOOKUP($B84,'Défi-7'!$C$2:$J$200,8,FALSE),\"\")","v":""},191,null,"OK","OK","OK","OK","OK","OK","OK","OK","OK",null,{"$f":"'Classement auteurs'!$B84","v":132086001401},{"$f":"IF('Classement auteurs'!C84=\"\",\"\",'Classement auteurs'!C84)","v":33},{"$f":"IF('Classement auteurs'!D84=\"\",\"\",'Classement auteurs'!D84)","v":41},{"$f":"IF('Classement auteurs'!E84=\"\",\"\",'Classement auteurs'!E84)","v":37},{"$f":"IF('Classement auteurs'!F84=\"\",\"\",'Classement auteurs'!F84)","v":46},{"$f":"IF('Classement auteurs'!G84=\"\",\"\",'Classement auteurs'!G84)","v":34},{"$f":"IF('Classement auteurs'!H84=\"\",\"\",'Classement auteurs'!H84)","v":""},{"$f":"IF('Classement auteurs'!I84=\"\",\"\",'Classement auteurs'!I84)","v":""},{"$f":"IF('Classement auteurs'!J84=\"\",\"\",'Classement auteurs'!J84)","v":191}]
[null,130878013401,{"$f":"IFERROR(VLOOKUP($B85,'Défi-1'!$C$2:$J$200,8,FALSE),\"\")","v":""},{"$f":"IFERROR(VLOOKUP($B85,'Défi-2'!$C$2:$J$200,8,FALSE),\"\")","v":30},{"$f":"IFERROR(VLOOKUP($B85,'Défi-3'!$C$2:$J$200,8,FALSE),\"\")","v":36},{"$f":"IFERROR(VLOOKUP($B85,'Défi-4'!$C$2:$J$200,8,FALSE),\"\")","v":35},{"$f":"IFERROR(VLOOKUP($B85,'Défi-5'!$C$2:$J$200,8,FALSE),\"\")","v":30},{"$f":"IFERROR(VLOOKUP($B85,'Défi-6'!$C$2:$J$200,8,FALSE),\"\")","v":30},{"$f":"IFERROR(VLOOKUP($B85,'Défi-7'!$C$2:$J$200,8,FALSE),\"\")","v":28},189,null,"OK","OK","OK","OK","OK","OK","OK","OK","OK",null,{"$f":"'Classement auteurs'!$B85","v":130878013401},{"$f":"IF('Classement auteurs'!C85=\"\",\"\",'Classement auteurs'!C85)","v":""},{"$f":"IF('Classement auteurs'!D85=\"\",\"\",'Classement auteurs'!D85)","v":30},{"$f":"IF('Classement auteurs'!E85=\"\",\"\",'Classement auteurs'!E85)","v":36},{"$f":"IF('Classement auteurs'!F85=\"\",\"\",'Classement auteurs'!F85)","v":35},{"$f":"IF('Classement auteurs'!G85=\"\",\"\",'Classement auteurs'!G85)","v":30},{"$f":"IF('Classement auteurs'!H85=\"\",\"\",'Classement auteurs'!H85)","v":30},{"$f":"IF('Classement auteurs'!I85=\"\",\"\",'Classement auteurs'!I85)","v":28},{"$f":"IF('Classement auteurs'!J85=\"\",\"\",'Classement auteurs'!J85)","v":189}]
[null,131499003601,{"$f":"IFERROR(VLOOKUP($B86,'Défi-1'!$C$2:$J$200,8,FALSE),\"\")","v":34},{"$f":"IFERROR(VLOOKUP($B86,'Défi-2'!$C$2:$J$200,8,FALSE),\"\")","v":33},{"$f":"IFERROR(VLOOKUP($B86,'Défi-3'!$C$2:$J$200,8,FALSE),\"\")","v":35},{"$f":"IFERROR(VLOOKUP($B86,'Défi-4'!$C$2:$J$200,8,FALSE),\"\")","v":""},{"$f":"IFERROR(VLOOKUP($B86,'Défi-5'!$C$2:$J$200,8,FALSE),\"\")","v":50},{"$f":"IFERROR(VLOOKUP($B86,'Défi-6'!$C$2:$J$200,8,FALSE),\"\")","v":""},{"$f":"IFERROR(VLOOKUP($B86,'Défi-7'!$C$2:$J$200,8,FALSE),\"\")","v":36},188,null,"OK","OK","OK","OK","OK","OK","OK","OK","OK",null,{"$f":"'Classement auteurs'!$B86","v":131499003601},{"$f":"IF('Classement auteurs'!C86=\"\",\"\",'Classement auteurs'!C86)","v":34},{"$f":"IF('Classement auteurs'!D86=\"\",\"\",'Classement auteurs'!D86)","v":33},{"$f":"IF('Classement auteurs'!E86=\"\",\"\",'Classement auteurs'!E86)","v":35},{"$f":"IF('Classement auteurs'!F86=\"\",\"\",'Classement auteurs'!F86)","v":""},{"$f":"IF('Classement auteurs'!G86=\"\",\"\",'Classement auteurs'!G86)","v":50},{"$f":"IF('Classement auteurs'!H86=\"\",\"\",'Classement auteurs'!H86)","v":""},{"$f":"IF('Classement auteurs'!I86=\"\",\"\",'Classement auteurs'!I86)","v":36},{"$f":"IF('Classement auteurs'!J86=\"\",\"\",'Classement auteurs'!J86)","v":188}]
[null,130987028401,{"$f":"IFERROR(VLOOKUP($B87,'Défi-1'!$C$2:$J$200,8,FALSE),\"\")","v":32},{"$f":"IFERROR(VLOOKUP($B87,'Défi-2'!$C$2:$J$200,8,FALSE),\"\")","v":38},{"$f":"IFERROR(VLOOKUP($B87,'Défi-3'!$C$2:$J$200,8,FALSE),\"\")","v":27},{"$f":"IFERROR(VLOOKUP($B87,'Défi-4'!$C$2:$J$200,8,FALSE),\"\")","v":27},{"$f":"IFERROR(VLOOKUP($B87,'Défi-5'!$C$2:$J$200,8,FALSE),\"\")","v":36},{"$f":"IFERROR(VLOOKUP($B87,'Défi-6'!$C$2:$J$200,8,FALSE),\"\")","v":36},{"$f":"IFERROR(VLOOKUP($B87,'Défi-7'!$C$2:$J$200,8,FALSE),\"\")","v":""},196,null,"OK","OK","OK","OK","OK","OK","KO","OK","KO",null,{"$f":"'Classement auteurs'!$B87","v":130987028401},{"$f":"IF('Classement auteurs'!C87=\"\",\"\",'Classement auteurs'!C87)","v":32},{"$f":"IF('Classement auteurs'!D87=\"\",\"\",'Classement auteurs'!D87)","v":38},{"$f":"IF('Classement auteurs'!E87=\"\",\"\",'Classement auteurs'!E87)","v":27},{"$f":"IF('Classement auteurs'!F87=\"\",\"\",'Classement auteurs'!F87)","v":27},{"$f":"IF('Classement auteurs'!G87=\"\",\"\",'Classement auteurs'!G87)","v":36},{"$f":"IF('Classement auteurs'!H87=\"\",\"\",'Classement auteurs'!H87)","v":27},{"$f":"IF('Classement auteurs'!I87=\"\",\"\",'Classement auteurs'!I87)","v":""},{"$f":"IF('Classement auteurs'!J87=\"\",\"\",'Classement auteurs'!J87)","v":187}]
[null,130527015501,{"$f":"IFERROR(VLOOKUP($B88,'Défi-1'!$C$2:$J$200,8,FALSE),\"\")","v":46},{"$f":"IFERROR(VLOOKUP($B88,'Défi-2'!$C$2:$J$200,8,FALSE),\"\")","v":""},{"$f":"IFERROR(VLOOKUP($B88,'Défi-3'!$C$2:$J$200,8,FALSE),\"\")","v":45},{"$f":"IFERROR(VLOOKUP($B88,'Défi-4'!$C$2:$J$200,8,FALSE),\"\")","v":31},{"$f":"IFERROR(VLOOKUP($B88,'Défi-5'!$C$2:$J$200,8,FALSE),\"\")","v":32},{"$f":"IFERROR(VLOOKUP($B88,'Défi-6'!$C$2:$J$200,8,FALSE),\"\")","v":""},{"$f":"IFERROR(VLOOKUP($B88,'Défi-7'!$C$2:$J$200,8,FALSE),\"\")","v":32},186,null,"OK","OK","OK","OK","OK","OK","OK","OK","OK",null,{"$f":"'Classement auteurs'!$B88","v":130527015501},{"$f":"IF('Classement auteurs'!C88=\"\",\"\",'Classement auteurs'!C88)","v":46},{"$f":"IF('Classement auteurs'!D88=\"\",\"\",'Classement auteurs'!D88)","v":""},{"$f":"IF('Classement auteurs'!E88=\"\",\"\",'Classement auteurs'!E88)","v":45},{"$f":"IF('Classement auteurs'!F88=\"\",\"\",'Classement auteurs'!F88)","v":31},{"$f":"IF('Classement auteurs'!G88=\"\",\"\",'Classement auteurs'!G88)","v":32},{"$f":"IF('Classement auteurs'!H88=\"\",\"\",'Classement auteurs'!H88)","v":""},{"$f":"IF('Classement auteurs'!I88=\"\",\"\",'Classement auteurs'!I88)","v":32},{"$f":"IF('Classement auteurs'!J88=\"\",\"\",'Classement auteurs'!J88)","v":186}]
[null,131956001401,{"$f":"IFERROR(VLOOKUP($B89,'Défi-1'!$C$2:$J$200,8,FALSE),\"\")","v":""},{"$f":"IFERROR(VLOOKUP($B89,'Défi-2'!$C$2:$J$200,8,FALSE),\"\")","v":32},{"$f":"IFERROR(VLOOKUP($B89,'Défi-3'!$C$2:$J$200,8,FALSE),\"\")","v":38},{"$f":"IFERROR(VLOOKUP($B89,'Défi-4'!$C$2:$J$200,8,FALSE),\"\")","v":18},{"$f":"IFERROR(VLOOKUP($B89,'Défi-5'!$C$2:$J$200,8,FALSE),\"\")","v":35},{"$f":"IFERROR(VLOOKUP($B89,'Défi-6'!$C$2:$J$200,8,FALSE),\"\")","v":32},{"$f":"IFERROR(VLOOKUP($B89,'Défi-7'!$C$2:$J$200,8,FALSE),\"\")","v":31},186,null,"OK","OK","OK","OK","OK","OK","OK","OK","OK",null,{"$f":"'Classement auteurs'!$B89","v":131956001401},{"$f":"IF('Classement auteurs'!C89=\"\",\"\",'Classement auteurs'!C89)","v":""},{"$f":"IF('Classement auteurs'!D89=\"\",\"\",'Classement auteurs'!D89)","v":32},{"$f":"IF('Classement auteurs'!E89=\"\",\"\",'Classement auteurs'!E89)","v":38},{"$f":"IF('Classement auteurs'!F89=\"\",\"\",'Classement auteurs'!F89)","v":18},{"$f":"IF('Classement auteurs'!G89=\"\",\"\",'Classement auteurs'!G89)","v":35},{"$f":"IF('Classement auteurs'!H89=\"\",\"\",'Classement auteurs'!H89)","v":32},{"$f":"IF('Classement auteurs'!I89=\"\",\"\",'Classement auteurs'!I89)","v":31},{"$f":"IF('Classement auteurs'!J89=\"\",\"\",'Classement auteurs'!J89)","v":186}]
[null,132193000401,{"$f":"IFERROR(VLOOKUP($B90,'Défi-1'!$C$2:$J$200,8,FALSE),\"\")","v":41},{"$f":"IFERROR(VLOOKUP($B90,'Défi-2'!$C$2:$J$200,8,FALSE),\"\")","v":37},{"$f":"IFERROR(VLOOKUP($B90,'Défi-3'!$C$2:$J$200,8,FALSE),\"\")","v":""},{"$f":"IFERROR(VLOOKUP($B90,'Défi-4'!$C$2:$J$200,8,FALSE),\"\")","v":""},{"$f":"IFERROR(VLOOKUP($B90,'Défi-5'!$C$2:$J$200,8,FALSE),\"\")","v":33},{"$f":"IFERROR(VLOOKUP($B90,'Défi-6'!$C$2:$J$200,8,FALSE),\"\")","v":37},{"$f":"IFERROR(VLOOKUP($B90,'Défi-7'!$C$2:$J$200,8,FALSE),\"\")","v":37},185,null,"OK","OK","OK","OK","OK","OK","OK","OK","OK",null,{"$f":"'Classement auteurs'!$B90","v":132193000401},{"$f":"IF('Classement auteurs'!C90=\"\",\"\",'Classement auteurs'!C90)","v":41},{"$f":"IF('Classement auteurs'!D90=\"\",\"\",'Classement auteurs'!D90)","v":37},{"$f":"IF('Classement auteurs'!E90=\"\",\"\",'Classement auteurs'!E90)","v":""},{"$f":"IF('Classement auteurs'!F90=\"\",\"\",'Classement auteurs'!F90)","v":""},{"$f":"IF('Classement auteurs'!G90=\"\",\"\",'Classement auteurs'!G90)","v":33},{"$f":"IF('Classement auteurs'!H90=\"\",\"\",'Classement auteurs'!H90)","v":37},{"$f":"IF('Classement auteurs'!I90=\"\",\"\",'Classement auteurs'!I90)","v":37},{"$f":"IF('Classement auteurs'!J90=\"\",\"\",'Classement auteurs'!J90)","v":185}]
[null,130878014301,{"$f":"IFERROR(VLOOKUP($B91,'Défi-1'!$C$2:$J$200,8,FALSE),\"\")","v":38},{"$f":"IFERROR(VLOOKUP($B91,'Défi-2'!$C$2:$J$200,8,FALSE),\"\")","v":23},{"$f":"IFERROR(VLOOKUP($B91,'Défi-3'!$C$2:$J$200,8,FALSE),\"\")","v":52},{"$f":"IFERROR(VLOOKUP($B91,'Défi-4'!$C$2:$J$200,8,FALSE),\"\")","v":18},{"$f":"IFERROR(VLOOKUP($B91,'Défi-5'!$C$2:$J$200,8,FALSE),\"\")","v":29},{"$f":"IFERROR(VLOOKUP($B91,'Défi-6'!$C$2:$J$200,8,FALSE),\"\")","v":38},{"$f":"IFERROR(VLOOKUP($B91,'Défi-7'!$C$2:$J$200,8,FALSE),\"\")","v":""},198,null,"OK","OK","OK","OK","OK","OK","KO","OK","KO",null,{"$f":"'Classement auteurs'!$B91","v":130878014301},{"$f":"IF('Classement auteurs'!C91=\"\",\"\",'Classement auteurs'!C91)","v":38},{"$f":"IF('Classement auteurs'!D91=\"\",\"\",'Classement auteurs'!D91)","v":23},{"$f":"IF('Classement auteurs'!E91=\"\",\"\",'Classement auteurs'!E91)","v":52},{"$f":"IF('Classement auteurs'!F91=\"\",\"\",'Classement auteurs'!F91)","v":18},{"$f":"IF('Classement auteurs'!G91=\"\",\"\",'Classement auteurs'!G91)","v":29},{"$f":"IF('Classement auteurs'!H91=\"\",\"\",'Classement auteurs'!H91)","v":23},{"$f":"IF('Classement auteurs'!I91=\"\",\"\",'Classement auteurs'!I91)","v":""},{"$f":"IF('Classement auteurs'!J91=\"\",\"\",'Classement auteurs'!J91)","v":183}]
[null,131376017701,{"$f":"IFERROR(VLOOKUP($B92,'Défi-1'!$C$2:$J$200,8,FALSE),\"\")","v":51},{"$f":"IFERROR(VLOOKUP($B92,'Défi-2'!$C$2:$J$200,8,FALSE),\"\")","v":""},{"$f":"IFERROR(VLOOKUP($B92,'Défi-3'!$C$2:$J$200,8,FALSE),\"\")","v":48},{"$f":"IFERROR(VLOOKUP($B92,'Défi-4'!$C$2:$J$200,8,FALSE),\"\")","v":18},{"$f":"IFERROR(VLOOKUP($B92,'Défi-5'!$C$2:$J$200,8,FALSE),\"\")","v":""},{"$f":"IFERROR(VLOOKUP($B92,'Défi-6'!$C$2:$J$200,8,FALSE),\"\")","v":""},{"$f":"IFERROR(VLOOKUP($B92,'Défi-7'!$C$2:$J$200,8,FALSE),\"\")","v":47},164,null,"OK","OK","OK","OK","OK","OK","KO","OK","KO",null,{"$f":"'Classement auteurs'!$B92","v":131376017701},{"$f":"IF('Classement auteurs'!C92=\"\",\"\",'Classement auteurs'!C92)","v":51},{"$f":"IF('Classement auteurs'!D92=\"\",\"\",'Classement auteurs'!D92)","v":""},{"$f":"IF('Classement auteurs'!E92=\"\",\"\",'Classement auteurs'!E92)","v":48},{"$f":"IF('Classement auteurs'!F92=\"\",\"\",'Classement auteurs'!F92)","v":18},{"$f":"IF('Classement auteurs'!G92=\"\",\"\",'Classement auteurs'!G92)","v":""},{"$f":"IF('Classement auteurs'!H92=\"\",\"\",'Classement auteurs'!H92)","v":18},{"$f":"IF('Classement auteurs'!I92=\"\",\"\",'Classement auteurs'!I92)","v":47},{"$f":"IF('Classement auteurs'!J92=\"\",\"\",'Classement auteurs'!J92)","v":182}]
[null,130925008401,{"$f":"IFERROR(VLOOKUP($B93,'Défi-1'!$C$2:$J$200,8,FALSE),\"\")","v":51},{"$f":"IFERROR(VLOOKUP($B93,'Défi-2'!$C$2:$J$200,8,FALSE),\"\")","v":39},{"$f":"IFERROR(VLOOKUP($B93,'Défi-3'!$C$2:$J$200,8,FALSE),\"\")","v":40},{"$f":"IFERROR(VLOOKUP($B93,'Défi-4'!$C$2:$J$200,8,FALSE),\"\")","v":""},{"$f":"IFERROR(VLOOKUP($B93,'Défi-5'!$C$2:$J$200,8,FALSE),\"\")","v":51},{"$f":"IFERROR(VLOOKUP($B93,'Défi-6'!$C$2:$J$200,8,FALSE),\"\")","v":""},{"$f":"IFERROR(VLOOKUP($B93,'Défi-7'!$C$2:$J$200,8,FALSE),\"\")","v":""},181,null,"OK","OK","OK","OK","OK","OK","OK","OK","OK",null,{"$f":"'Classement auteurs'!$B93","v":130925008401},{"$f":"IF('Classement auteurs'!C93=\"\",\"\",'Classement auteurs'!C93)","v":51},{"$f":"IF('Classement auteurs'!D93=\"\",\"\",'Classement auteurs'!D93)","v":39},{"$f":"IF('Classement auteurs'!E93=\"\",\"\",'Classement auteurs'!E93)","v":40},{"$f":"IF('Classement auteurs'!F93=\"\",\"\",'Classement auteurs'!F93)","v":""},{"$f":"IF('Classement auteurs'!G93=\"\",\"\",'Classement auteurs'!G93)","v":51},{"$f":"IF('Classement auteurs'!H93=\"\",\"\",'Classement auteurs'!H93)","v":""},{"$f":"IF('Classement auteurs'!I93=\"\",\"\",'Classement auteurs'!I93)","v":""},{"$f":"IF('Classement auteurs'!J93=\"\",\"\",'Classement auteurs'!J93)","v":181}]
[null,132084002301,{"$f":"IFERROR(VLOOKUP($B94,'Défi-1'!$C$2:$J$200,8,FALSE),\"\")","v":""},{"$f":"IFERROR(VLOOKUP($B94,'Défi-2'!$C$2:$J$200,8,FALSE),\"\")","v":37},{"$f":"IFERROR(VLOOKUP($B94,'Défi-3'!$C$2:$J$200,8,FALSE),\"\")","v":54},{"$f":"IFERROR(VLOOKUP($B94,'Défi-4'!$C$2:$J$200,8,FALSE),\"\")","v":43},{"$f":"IFERROR(VLOOKUP($B94,'Défi-5'!$C$2:$J$200,8,FALSE),\"\")","v":""},{"$f":"IFERROR(VLOOKUP($B94,'Défi-6'!$C$2:$J$200,8,FALSE),\"\")","v":54},{"$f":"IFERROR(VLOOKUP($B94,'Défi-7'!$C$2:$J$200,8,FALSE),\"\")","v":""},188,null,"OK","OK","OK","OK","OK","OK","KO","OK","KO",null,{"$f":"'Classement auteurs'!$B94","v":132084002301},{"$f":"IF('Classement auteurs'!C94=\"\",\"\",'Classement auteurs'!C94)","v":""},{"$f":"IF('Classement auteurs'!D94=\"\",\"\",'Classement auteurs'!D94)","v":37},{"$f":"IF('Classement auteurs'!E94=\"\",\"\",'Classement auteurs'!E94)","v":54},{"$f":"IF('Classement auteurs'!F94=\"\",\"\",'Classement auteurs'!F94)","v":43},{"$f":"IF('Classement auteurs'!G94=\"\",\"\",'Classement auteurs'!G94)","v":""},{"$f":"IF('Classement auteurs'!H94=\"\",\"\",'Classement auteurs'!H94)","v":43},{"$f":"IF('Classement auteurs'!I94=\"\",\"\",'Classement auteurs'!I94)","v":""},{"$f":"IF('Classement auteurs'!J94=\"\",\"\",'Classement auteurs'!J94)","v":177}]
[null,132060000401,{"$f":"IFERROR(VLOOKUP($B95,'Défi-1'!$C$2:$J$200,8,FALSE),\"\")","v":18},{"$f":"IFERROR(VLOOKUP($B95,'Défi-2'!$C$2:$J$200,8,FALSE),\"\")","v":""},{"$f":"IFERROR(VLOOKUP($B95,'Défi-3'!$C$2:$J$200,8,FALSE),\"\")","v":43},{"$f":"IFERROR(VLOOKUP($B95,'Défi-4'!$C$2:$J$200,8,FALSE),\"\")","v":36},{"$f":"IFERROR(VLOOKUP($B95,'Défi-5'!$C$2:$J$200,8,FALSE),\"\")","v":40},{"$f":"IFERROR(VLOOKUP($B95,'Défi-6'!$C$2:$J$200,8,FALSE),\"\")","v":""},{"$f":"IFERROR(VLOOKUP($B95,'Défi-7'!$C$2:$J$200,8,FALSE),\"\")","v":39},176,null,"OK","OK","OK","OK","OK","OK","OK","OK","OK",null,{"$f":"'Classement auteurs'!$B95","v":132060000401},{"$f":"IF('Classement auteurs'!C95=\"\",\"\",'Classement auteurs'!C95)","v":18},{"$f":"IF('Classement auteurs'!D95=\"\",\"\",'Classement auteurs'!D95)","v":""},{"$f":"IF('Classement auteurs'!E95=\"\",\"\",'Classement auteurs'!E95)","v":43},{"$f":"IF('Classement auteurs'!F95=\"\",\"\",'Classement auteurs'!F95)","v":36},{"$f":"IF('Classement auteurs'!G95=\"\",\"\",'Classement auteurs'!G95)","v":40},{"$f":"IF('Classement auteurs'!H95=\"\",\"\",'Classement auteurs'!H95)","v":""},{"$f":"IF('Classement auteurs'!I95=\"\",\"\",'Classement auteurs'!I95)","v":39},{"$f":"IF('Classement auteurs'!J95=\"\",\"\",'Classement auteurs'!J95)","v":176}]
[null,130987001601,{"$f":"IFERROR(VLOOKUP($B96,'Défi-1'!$C$2:$J$200,8,FALSE),\"\")","v":35},{"$f":"IFERROR(VLOOKUP($B96,'Défi-2'!$C$2:$J$200,8,FALSE),\"\")","v":36},{"$f":"IFERROR(VLOOKUP($B96,'Défi-3'!$C$2:$J$200,8,FALSE),\"\")","v":35},{"$f":"IFERROR(VLOOKUP($B96,'Défi-4'!$C$2:$J$200,8,FALSE),\"\")","v":32},{"$f":"IFERROR(VLOOKUP($B96,'Défi-5'!$C$2:$J$200,8,FALSE),\"\")","v":37},{"$f":"IFERROR(VLOOKUP($B96,'Défi-6'!$C$2:$J$200,8,FALSE),\"\")","v":""},{"$f":"IFERROR(VLOOKUP($B96,'Défi-7'!$C$2:$J$200,8,FALSE),\"\")","v":""},175,null,"OK","OK","OK","OK","OK","OK","OK","OK","OK",null,{"$f":"'Classement auteurs'!$B96","v":130987001601},{"$f":"IF('Classement auteurs'!C96=\"\",\"\",'Classement auteurs'!C96)","v":35},{"$f":"IF('Classement auteurs'!D96=\"\",\"\",'Classement auteurs'!D96)","v":36},{"$f":"IF('Classement auteurs'!E96=\"\",\"\",'Classement auteurs'!E96)","v":35},{"$f":"IF('Classement auteurs'!F96=\"\",\"\",'Classement auteurs'!F96)","v":32},{"$f":"IF('Classement auteurs'!G96=\"\",\"\",'Classement auteurs'!G96)","v":37},{"$f":"IF('Classement auteurs'!H96=\"\",\"\",'Classement auteurs'!H96)","v":""},{"$f":"IF('Classement auteurs'!I96=\"\",\"\",'Classement auteurs'!I96)","v":""},{"$f":"IF('Classement auteurs'!J96=\"\",\"\",'Classement auteurs'!J96)","v":175}]
[null,131353006201,{"$f":"IFERROR(VLOOKUP($B97,'Défi-1'!$C$2:$J$200,8,FALSE),\"\")","v":""},{"$f":"IFERROR(VLOOKUP($B97,'Défi-2'!$C$2:$J$200,8,FALSE),\"\")","v":31},{"$f":"IFERROR(VLOOKUP($B97,'Défi-3'!$C$2:$J$200,8,FALSE),\"\")","v":39},{"$f":"IFERROR(VLOOKUP($B97,'Défi-4'!$C$2:$J$200,8,FALSE),\"\")","v":35},{"$f":"IFERROR(VLOOKUP($B97,'Défi-5'!$C$2:$J$200,8,FALSE),\"\")","v":37},{"$f":"IFERROR(VLOOKUP($B97,'Défi-6'!$C$2:$J$200,8,FALSE),\"\")","v":""},{"$f":"IFERROR(VLOOKUP($B97,'Défi-7'!$C$2:$J$200,8,FALSE),\"\")","v":31},173,null,"OK","OK","OK","OK","OK","OK","OK","OK","OK",null,{"$f":"'Classement auteurs'!$B97","v":131353006201},{"$f":"IF('Classement auteurs'!C97=\"\",\"\",'Classement auteurs'!C97)","v":""},{"$f":"IF('Classement auteurs'!D97=\"\",\"\",'Classement auteurs'!D97)","v":31},{"$f":"IF('Classement auteurs'!E97=\"\",\"\",'Classement auteurs'!E97)","v":39},{"$f":"IF('Classement auteurs'!F97=\"\",\"\",'Classement auteurs'!F97)","v":35},{"$f":"IF('Classement auteurs'!G97=\"\",\"\",'Classement auteurs'!G97)","v":37},{"$f":"IF('Classement auteurs'!H97=\"\",\"\",'Classement auteurs'!H97)","v":""},{"$f":"IF('Classement auteurs'!I97=\"\",\"\",'Classement auteurs'!I97)","v":31},{"$f":"IF('Classement auteurs'!J97=\"\",\"\",'Classement auteurs'!J97)","v":173}]
[null,130925009901,{"$f":"IFERROR(VLOOKUP($B98,'Défi-1'!$C$2:$J$200,8,FALSE),\"\")","v":30},{"$f":"IFERROR(VLOOKUP($B98,'Défi-2'!$C$2:$J$200,8,FALSE),\"\")","v":38},{"$f":"IFERROR(VLOOKUP($B98,'Défi-3'!$C$2:$J$200,8,FALSE),\"\")","v":34},{"$f":"IFERROR(VLOOKUP($B98,'Défi-4'!$C$2:$J$200,8,FALSE),\"\")","v":32},{"$f":"IFERROR(VLOOKUP($B98,'Défi-5'!$C$2:$J$200,8,FALSE),\"\")","v":37},{"$f":"IFERROR(VLOOKUP($B98,'Défi-6'!$C$2:$J$200,8,FALSE),\"\")","v":""},{"$f":"IFERROR(VLOOKUP($B98,'Défi-7'!$C$2:$J$200,8,FALSE),\"\")","v":""},171,null,"OK","OK","OK","OK","OK","OK","OK","OK","OK",null,{"$f":"'Classement auteurs'!$B98","v":130925009901},{"$f":"IF('Classement auteurs'!C98=\"\",\"\",'Classement auteurs'!C98)","v":30},{"$f":"IF('Classement auteurs'!D98=\"\",\"\",'Classement auteurs'!D98)","v":38},{"$f":"IF('Classement auteurs'!E98=\"\",\"\",'Classement auteurs'!E98)","v":34},{"$f":"IF('Classement auteurs'!F98=\"\",\"\",'Classement auteurs'!F98)","v":32},{"$f":"IF('Classement auteurs'!G98=\"\",\"\",'Classement auteurs'!G98)","v":37},{"$f":"IF('Classement auteurs'!H98=\"\",\"\",'Classement auteurs'!H98)","v":""},{"$f":"IF('Classement auteurs'!I98=\"\",\"\",'Classement auteurs'!I98)","v":""},{"$f":"IF('Classement auteurs'!J98=\"\",\"\",'Classement auteurs'!J98)","v":171}]
[null,131956000201,{"$f":"IFERROR(VLOOKUP($B99,'Défi-1'!$C$2:$J$200,8,FALSE),\"\")","v":""},{"$f":"IFERROR(VLOOKUP($B99,'Défi-2'!$C$2:$J$200,8,FALSE),\"\")","v":47},{"$f":"IFERROR(VLOOKUP($B99,'Défi-3'!$C$2:$J$200,8,FALSE),\"\")","v":44},{"$f":"IFERROR(VLOOKUP($B99,'Défi-4'!$C$2:$J$200,8,FALSE),\"\")","v":41},{"$f":"IFERROR(VLOOKUP($B99,'Défi-5'!$C$2:$J$200,8,FALSE),\"\")","v":39},{"$f":"IFERROR(VLOOKUP($B99,'Défi-6'!$C$2:$J$200,8,FALSE),\"\")","v":""},{"$f":"IFERROR(VLOOKUP($B99,'Défi-7'!$C$2:$J$200,8,FALSE),\"\")","v":""},171,null,"OK","OK","OK","OK","OK","OK","OK","OK","OK",null,{"$f":"'Classement auteurs'!$B99","v":131956000201},{"$f":"IF('Classement auteurs'!C99=\"\",\"\",'Classement auteurs'!C99)","v":""},{"$f":"IF('Classement auteurs'!D99=\"\",\"\",'Classement auteurs'!D99)","v":47},{"$f":"IF('Classement auteurs'!E99=\"\",\"\",'Classement auteurs'!E99)","v":44},{"$f":"IF('Classement auteurs'!F99=\"\",\"\",'Classement auteurs'!F99)","v":41},{"$f":"IF('Classement auteurs'!G99=\"\",\"\",'Classement auteurs'!G99)","v":39},{"$f":"IF('Classement auteurs'!H99=\"\",\"\",'Classement auteurs'!H99)","v":""},{"$f":"IF('Classement auteurs'!I99=\"\",\"\",'Classement auteurs'!I99)","v":""},{"$f":"IF('Classement auteurs'!J99=\"\",\"\",'Classement auteurs'!J99)","v":171}]
[null,131683008101,{"$f":"IFERROR(VLOOKUP($B100,'Défi-1'!$C$2:$J$200,8,FALSE),\"\")","v":""},{"$f":"IFERROR(VLOOKUP($B100,'Défi-2'!$C$2:$J$200,8,FALSE),\"\")","v":""},{"$f":"IFERROR(VLOOKUP($B100,'Défi-3'!$C$2:$J$200,8,FALSE),\"\")","v":37},{"$f":"IFERROR(VLOOKUP($B100,'Défi-4'!$C$2:$J$200,8,FALSE),\"\")","v":""},{"$f":"IFERROR(VLOOKUP($B100,'Défi-5'!$C$2:$J$200,8,FALSE),\"\")","v":43},{"$f":"IFERROR(VLOOKUP($B100,'Défi-6'!$C$2:$J$200,8,FALSE),\"\")","v":43},{"$f":"IFERROR(VLOOKUP($B100,'Défi-7'!$C$2:$J$200,8,FALSE),\"\")","v":48},171,null,"OK","OK","OK","OK","OK","OK","OK","OK","OK",null,{"$f":"'Classement auteurs'!$B100","v":131683008101},{"$f":"IF('Classement auteurs'!C100=\"\",\"\",'Classement auteurs'!C100)","v":""},{"$f":"IF('Classement auteurs'!D100=\"\",\"\",'Classement auteurs'!D100)","v":""},{"$f":"IF('Classement auteurs'!E100=\"\",\"\",'Classement auteurs'!E100)","v":37},{"$f":"IF('Classement auteurs'!F100=\"\",\"\",'Classement auteurs'!F100)","v":""},{"$f":"IF('Classement auteurs'!G100=\"\",\"\",'Classement auteurs'!G100)","v":43},{"$f":"IF('Classement auteurs'!H100=\"\",\"\",'Classement auteurs'!H100)","v":43},{"$f":"IF('Classement auteurs'!I100=\"\",\"\",'Classement auteurs'!I100)","v":48},{"$f":"IF('Classement auteurs'!J100=\"\",\"\",'Classement auteurs'!J100)","v":171}]
[null,130527013301,{"$f":"IFERROR(VLOOKUP($B101,'Défi-1'!$C$2:$J$200,8,FALSE),\"\")","v":47},{"$f":"IFERROR(VLOOKUP($B101,'Défi-2'!$C$2:$J$200,8,FALSE),\"\")","v":39},{"$f":"IFERROR(VLOOKUP($B101,'Défi-3'!$C$2:$J$200,8,FALSE),\"\")","v":40},{"$f":"IFERROR(VLOOKUP($B101,'Défi-4'!$C$2:$J$200,8,FALSE),\"\")","v":44},{"$f":"IFERROR(VLOOKUP($B101,'Défi-5'!$C$2:$J$200,8,FALSE),\"\")","v":""},{"$f":"IFERROR(VLOOKUP($B101,'Défi-6'!$C$2:$J$200,8,FALSE),\"\")","v":""},{"$f":"IFERROR(VLOOKUP($B101,'Défi-7'!$C$2:$J$200,8,FALSE),\"\")","v":""},170,null,"OK","OK","OK","OK","OK","OK","OK","OK","OK",null,{"$f":"'Classement auteurs'!$B101","v":130527013301},{"$f":"IF('Classement auteurs'!C101=\"\",\"\",'Classement auteurs'!C101)","v":47},{"$f":"IF('Classement auteurs'!D101=\"\",\"\",'Classement auteurs'!D101)","v":39},{"$f":"IF('Classement auteurs'!E101=\"\",\"\",'Classement auteurs'!E101)","v":40},{"$f":"IF('Classement auteurs'!F101=\"\",\"\",'Classement auteurs'!F101)","v":44},{"$f":"IF('Classement auteurs'!G101=\"\",\"\",'Classement auteurs'!G101)","v":""},{"$f":"IF('Classement auteurs'!H101=\"\",\"\",'Classement auteurs'!H101)","v":""},{"$f":"IF('Classement auteurs'!I101=\"\",\"\",'Classement auteurs'!I101)","v":""},{"$f":"IF('Classement auteurs'!J101=\"\",\"\",'Classement auteurs'!J101)","v":170}]
[null,131956002901,{"$f":"IFERROR(VLOOKUP($B102,'Défi-1'!$C$2:$J$200,8,FALSE),\"\")","v":43},{"$f":"IFERROR(VLOOKUP($B102,'Défi-2'!$C$2:$J$200,8,FALSE),\"\")","v":""},{"$f":"IFERROR(VLOOKUP($B102,'Défi-3'!$C$2:$J$200,8,FALSE),\"\")","v":40},{"$f":"IFERROR(VLOOKUP($B102,'Défi-4'!$C$2:$J$200,8,FALSE),\"\")","v":28},{"$f":"IFERROR(VLOOKUP($B102,'Défi-5'!$C$2:$J$200,8,FALSE),\"\")","v":28},{"$f":"IFERROR(VLOOKUP($B102,'Défi-6'!$C$2:$J$200,8,FALSE),\"\")","v":28},{"$f":"IFERROR(VLOOKUP($B102,'Défi-7'!$C$2:$J$200,8,FALSE),\"\")","v":""},167,null,"OK","OK","OK","OK","OK","OK","OK","OK","OK",null,{"$f":"'Classement auteurs'!$B102","v":131956002901},{"$f":"IF('Classement auteurs'!C102=\"\",\"\",'Classement auteurs'!C102)","v":43},{"$f":"IF('Classement auteurs'!D102=\"\",\"\",'Classement auteurs'!D102)","v":""},{"$f":"IF('Classement auteurs'!E102=\"\",\"\",'Classement auteurs'!E102)","v":40},{"$f":"IF('Classement auteurs'!F102=\"\",\"\",'Classement auteurs'!F102)","v":28},{"$f":"IF('Classement auteurs'!G102=\"\",\"\",'Classement auteurs'!G102)","v":28},{"$f":"IF('Classement auteurs'!H102=\"\",\"\",'Classement auteurs'!H102)","v":28},{"$f":"IF('Classement auteurs'!I102=\"\",\"\",'Classement auteurs'!I102)","v":""},{"$f":"IF('Classement auteurs'!J102=\"\",\"\",'Classement auteurs'!J102)","v":167}]
[null,130462001101,{"$f":"IFERROR(VLOOKUP($B103,'Défi-1'!$C$2:$J$200,8,FALSE),\"\")","v":""},{"$f":"IFERROR(VLOOKUP($B103,'Défi-2'!$C$2:$J$200,8,FALSE),\"\")","v":""},{"$f":"IFERROR(VLOOKUP($B103,'Défi-3'!$C$2:$J$200,8,FALSE),\"\")","v":38},{"$f":"IFERROR(VLOOKUP($B103,'Défi-4'!$C$2:$J$200,8,FALSE),\"\")","v":45},{"$f":"IFERROR(VLOOKUP($B103,'Défi-5'!$C$2:$J$200,8,FALSE),\"\")","v":43},{"$f":"IFERROR(VLOOKUP($B103,'Défi-6'!$C$2:$J$200,8,FALSE),\"\")","v":45},{"$f":"IFERROR(VLOOKUP($B103,'Défi-7'!$C$2:$J$200,8,FALSE),\"\")","v":""},171,null,"OK","OK","OK","OK","OK","OK","KO","OK","KO",null,{"$f":"'Classement auteurs'!$B103","v":130462001101},{"$f":"IF('Classement auteurs'!C103=\"\",\"\",'Classement auteurs'!C103)","v":""},{"$f":"IF('Classement auteurs'!D103=\"\",\"\",'Classement auteurs'!D103)","v":""},{"$f":"IF('Classement auteurs'!E103=\"\",\"\",'Classement auteurs'!E103)","v":38},{"$f":"IF('Classement auteurs'!F103=\"\",\"\",'Classement auteurs'!F103)","v":45},{"$f":"IF('Classement auteurs'!G103=\"\",\"\",'Classement auteurs'!G103)","v":43},{"$f":"IF('Classement auteurs'!H103=\"\",\"\",'Classement auteurs'!H103)","v":38},{"$f":"IF('Classement auteurs'!I103=\"\",\"\",'Classement auteurs'!I103)","v":""},{"$f":"IF('Classement auteurs'!J103=\"\",\"\",'Classement auteurs'!J103)","v":164}]
[null,132103002301,{"$f":"IFERROR(VLOOKUP($B104,'Défi-1'!$C$2:$J$200,8,FALSE),\"\")","v":46},{"$f":"IFERROR(VLOOKUP($B104,'Défi-2'!$C$2:$J$200,8,FALSE),\"\")","v":43},{"$f":"IFERROR(VLOOKUP($B104,'Défi-3'!$C$2:$J$200,8,FALSE),\"\")","v":43},{"$f":"IFERROR(VLOOKUP($B104,'Défi-4'!$C$2:$J$200,8,FALSE),\"\")","v":""},{"$f":"IFERROR(VLOOKUP($B104,'Défi-5'!$C$2:$J$200,8,FALSE),\"\")","v":""},{"$f":"IFERROR(VLOOKUP($B104,'Défi-6'!$C$2:$J$200,8,FALSE),\"\")","v":""},{"$f":"IFERROR(VLOOKUP($B104,'Défi-7'!$C$2:$J$200,8,FALSE),\"\")","v":31},163,null,"OK","OK","OK","OK","OK","OK","OK","OK","OK",null,{"$f":"'Classement auteurs'!$B104","v":132103002301},{"$f":"IF('Classement auteurs'!C104=\"\",\"\",'Classement auteurs'!C104)","v":46},{"$f":"IF('Classement auteurs'!D104=\"\",\"\",'Classement auteurs'!D104)","v":43},{"$f":"IF('Classement auteurs'!E104=\"\",\"\",'Classement auteurs'!E104)","v":43},{"$f":"IF('Classement auteurs'!F104=\"\",\"\",'Classement auteurs'!F104)","v":""},{"$f":"IF('Classement auteurs'!G104=\"\",\"\",'Classement auteurs'!G104)","v":""},{"$f":"IF('Classement auteurs'!H104=\"\",\"\",'Classement auteurs'!H104)","v":""},{"$f":"IF('Classement auteurs'!I104=\"\",\"\",'Classement auteurs'!I104)","v":31},{"$f":"IF('Classement auteurs'!J104=\"\",\"\",'Classement auteurs'!J104)","v":163}]
[null,132193001201,{"$f":"IFERROR(VLOOKUP($B105,'Défi-1'!$C$2:$J$200,8,FALSE),\"\")","v":""},{"$f":"IFERROR(VLOOKUP($B105,'Défi-2'!$C$2:$J$200,8,FALSE),\"\")","v":34},{"$f":"IFERROR(VLOOKUP($B105,'Défi-3'!$C$2:$J$200,8,FALSE),\"\")","v":""},{"$f":"IFERROR(VLOOKUP($B105,'Défi-4'!$C$2:$J$200,8,FALSE),\"\")","v":37},{"$f":"IFERROR(VLOOKUP($B105,'Défi-5'!$C$2:$J$200,8,FALSE),\"\")","v":37},{"$f":"IFERROR(VLOOKUP($B105,'Défi-6'!$C$2:$J$200,8,FALSE),\"\")","v":37},{"$f":"IFERROR(VLOOKUP($B105,'Défi-7'!$C$2:$J$200,8,FALSE),\"\")","v":18},163,null,"OK","OK","OK","OK","OK","OK","OK","OK","OK",null,{"$f":"'Classement auteurs'!$B105","v":132193001201},{"$f":"IF('Classement auteurs'!C105=\"\",\"\",'Classement auteurs'!C105)","v":""},{"$f":"IF('Classement auteurs'!D105=\"\",\"\",'Classement auteurs'!D105)","v":34},{"$f":"IF('Classement auteurs'!E105=\"\",\"\",'Classement auteurs'!E105)","v":""},{"$f":"IF('Classement auteurs'!F105=\"\",\"\",'Classement auteurs'!F105)","v":37},{"$f":"IF('Classement auteurs'!G105=\"\",\"\",'Classement auteurs'!G105)","v":37},{"$f":"IF('Classement auteurs'!H105=\"\",\"\",'Classement auteurs'!H105)","v":37},{"$f":"IF('Classement auteurs'!I105=\"\",\"\",'Classement auteurs'!I105)","v":18},{"$f":"IF('Classement auteurs'!J105=\"\",\"\",'Classement auteurs'!J105)","v":163}]
[null,131499010401,{"$f":"IFERROR(VLOOKUP($B106,'Défi-1'!$C$2:$J$200,8,FALSE),\"\")","v":37},{"$f":"IFERROR(VLOOKUP($B106,'Défi-2'!$C$2:$J$200,8,FALSE),\"\")","v":""},{"$f":"IFERROR(VLOOKUP($B106,'Défi-3'!$C$2:$J$200,8,FALSE),\"\")","v":43},{"$f":"IFERROR(VLOOKUP($B106,'Défi-4'!$C$2:$J$200,8,FALSE),\"\")","v":41},{"$f":"IFERROR(VLOOKUP($B106,'Défi-5'!$C$2:$J$200,8,FALSE),\"\")","v":41},{"$f":"IFERROR(VLOOKUP($B106,'Défi-6'!$C$2:$J$200,8,FALSE),\"\")","v":""},{"$f":"IFERROR(VLOOKUP($B106,'Défi-7'!$C$2:$J$200,8,FALSE),\"\")","v":""},162,null,"OK","OK","OK","OK","OK","OK","OK","OK","OK",null,{"$f":"'Classement auteurs'!$B106","v":131499010401},{"$f":"IF('Classement auteurs'!C106=\"\",\"\",'Classement auteurs'!C106)","v":37},{"$f":"IF('Classement auteurs'!D106=\"\",\"\",'Classement auteurs'!D106)","v":""},{"$f":"IF('Classement auteurs'!E106=\"\",\"\",'Classement auteurs'!E106)","v":43},{"$f":"IF('Classement auteurs'!F106=\"\",\"\",'Classement auteurs'!F106)","v":41},{"$f":"IF('Classement auteurs'!G106=\"\",\"\",'Classement auteurs'!G106)","v":41},{"$f":"IF('Classement auteurs'!H106=\"\",\"\",'Classement auteurs'!H106)","v":""},{"$f":"IF('Classement auteurs'!I106=\"\",\"\",'Classement auteurs'!I106)","v":""},{"$f":"IF('Classement auteurs'!J106=\"\",\"\",'Classement auteurs'!J106)","v":162}]
[null,132084003501,{"$f":"IFERROR(VLOOKUP($B107,'Défi-1'!$C$2:$J$200,8,FALSE),\"\")","v":""},{"$f":"IFERROR(VLOOKUP($B107,'Défi-2'!$C$2:$J$200,8,FALSE),\"\")","v":43},{"$f":"IFERROR(VLOOKUP($B107,'Défi-3'!$C$2:$J$200,8,FALSE),\"\")","v":""},{"$f":"IFERROR(VLOOKUP($B107,'Défi-4'!$C$2:$J$200,8,FALSE),\"\")","v":40},{"$f":"IFERROR(VLOOKUP($B107,'Défi-5'!$C$2:$J$200,8,FALSE),\"\")","v":38},{"$f":"IFERROR(VLOOKUP($B107,'Défi-6'!$C$2:$J$200,8,FALSE),\"\")","v":43},{"$f":"IFERROR(VLOOKUP($B107,'Défi-7'!$C$2:$J$200,8,FALSE),\"\")","v":""},164,null,"OK","OK","OK","OK","OK","OK","KO","OK","KO",null,{"$f":"'Classement auteurs'!$B107","v":132084003501},{"$f":"IF('Classement auteurs'!C107=\"\",\"\",'Classement auteurs'!C107)","v":""},{"$f":"IF('Classement auteurs'!D107=\"\",\"\",'Classement auteurs'!D107)","v":43},{"$f":"IF('Classement auteurs'!E107=\"\",\"\",'Classement auteurs'!E107)","v":""},{"$f":"IF('Classement auteurs'!F107=\"\",\"\",'Classement auteurs'!F107)","v":40},{"$f":"IF('Classement auteurs'!G107=\"\",\"\",'Classement auteurs'!G107)","v":38},{"$f":"IF('Classement auteurs'!H107=\"\",\"\",'Classement auteurs'!H107)","v":40},{"$f":"IF('Classement auteurs'!I107=\"\",\"\",'Classement auteurs'!I107)","v":""},{"$f":"IF('Classement auteurs'!J107=\"\",\"\",'Classement auteurs'!J107)","v":161}]
[null,132060000901,{"$f":"IFERROR(VLOOKUP($B108,'Défi-1'!$C$2:$J$200,8,FALSE),\"\")","v":35},{"$f":"IFERROR(VLOOKUP($B108,'Défi-2'!$C$2:$J$200,8,FALSE),\"\")","v":28},{"$f":"IFERROR(VLOOKUP($B108,'Défi-3'!$C$2:$J$200,8,FALSE),\"\")","v":""},{"$f":"IFERROR(VLOOKUP($B108,'Défi-4'!$C$2:$J$200,8,FALSE),\"\")","v":38},{"$f":"IFERROR(VLOOKUP($B108,'Défi-5'!$C$2:$J$200,8,FALSE),\"\")","v":30},{"$f":"IFERROR(VLOOKUP($B108,'Défi-6'!$C$2:$J$200,8,FALSE),\"\")","v":""},{"$f":"IFERROR(VLOOKUP($B108,'Défi-7'!$C$2:$J$200,8,FALSE),\"\")","v":29},160,null,"OK","OK","OK","OK","OK","OK","OK","OK","OK",null,{"$f":"'Classement auteurs'!$B108","v":132060000901},{"$f":"IF('Classement auteurs'!C108=\"\",\"\",'Classement auteurs'!C108)","v":35},{"$f":"IF('Classement auteurs'!D108=\"\",\"\",'Classement auteurs'!D108)","v":28},{"$f":"IF('Classement auteurs'!E108=\"\",\"\",'Classement auteurs'!E108)","v":""},{"$f":"IF('Classement auteurs'!F108=\"\",\"\",'Classement auteurs'!F108)","v":38},{"$f":"IF('Classement auteurs'!G108=\"\",\"\",'Classement auteurs'!G108)","v":30},{"$f":"IF('Classement auteurs'!H108=\"\",\"\",'Classement auteurs'!H108)","v":""},{"$f":"IF('Classement auteurs'!I108=\"\",\"\",'Classement auteurs'!I108)","v":29},{"$f":"IF('Classement auteurs'!J108=\"\",\"\",'Classement auteurs'!J108)","v":160}]
[null,131619004601,{"$f":"IFERROR(VLOOKUP($B109,'Défi-1'!$C$2:$J$200,8,FALSE),\"\")","v":35},{"$f":"IFERROR(VLOOKUP($B109,'Défi-2'!$C$2:$J$200,8,FALSE),\"\")","v":""},{"$f":"IFERROR(VLOOKUP($B109,'Défi-3'!$C$2:$J$200,8,FALSE),\"\")","v":39},{"$f":"IFERROR(VLOOKUP($B109,'Défi-4'!$C$2:$J$200,8,FALSE),\"\")","v":""},{"$f":"IFERROR(VLOOKUP($B109,'Défi-5'!$C$2:$J$200,8,FALSE),\"\")","v":43},{"$f":"IFERROR(VLOOKUP($B109,'Défi-6'!$C$2:$J$200,8,FALSE),\"\")","v":""},{"$f":"IFERROR(VLOOKUP($B109,'Défi-7'!$C$2:$J$200,8,FALSE),\"\")","v":43},160,null,"OK","OK","OK","OK","OK","OK","OK","OK","OK",null,{"$f":"'Classement auteurs'!$B109","v":131619004601},{"$f":"IF('Classement auteurs'!C109=\"\",\"\",'Classement auteurs'!C109)","v":35},{"$f":"IF('Classement auteurs'!D109=\"\",\"\",'Classement auteurs'!D109)","v":""},{"$f":"IF('Classement auteurs'!E109=\"\",\"\",'Classement auteurs'!E109)","v":39},{"$f":"IF('Classement auteurs'!F109=\"\",\"\",'Classement auteurs'!F109)","v":""},{"$f":"IF('Classement auteurs'!G109=\"\",\"\",'Classement auteurs'!G109)","v":43},{"$f":"IF('Classement auteurs'!H109=\"\",\"\",'Classement auteurs'!H109)","v":""},{"$f":"IF('Classement auteurs'!I109=\"\",\"\",'Classement auteurs'!I109)","v":43},{"$f":"IF('Classement auteurs'!J109=\"\",\"\",'Classement auteurs'!J109)","v":160}]
[null,130878015201,{"$f":"IFERROR(VLOOKUP($B110,'Défi-1'!$C$2:$J$200,8,FALSE),\"\")","v":43},{"$f":"IFERROR(VLOOKUP($B110,'Défi-2'!$C$2:$J$200,8,FALSE),\"\")","v":""},{"$f":"IFERROR(VLOOKUP($B110,'Défi-3'!$C$2:$J$200,8,FALSE),\"\")","v":""},{"$f":"IFERROR(VLOOKUP($B110,'Défi-4'!$C$2:$J$200,8,FALSE),\"\")","v":18},{"$f":"IFERROR(VLOOKUP($B110,'Défi-5'!$C$2:$J$200,8,FALSE),\"\")","v":42},{"$f":"IFERROR(VLOOKUP($B110,'Défi-6'!$C$2:$J$200,8,FALSE),\"\")","v":18},{"$f":"IFERROR(VLOOKUP($B110,'Défi-7'!$C$2:$J$200,8,FALSE),\"\")","v":39},160,null,"OK","OK","OK","OK","OK","OK","OK","OK","OK",null,{"$f":"'Classement auteurs'!$B110","v":130878015201},{"$f":"IF('Classement auteurs'!C110=\"\",\"\",'Classement auteurs'!C110)","v":43},{"$f":"IF('Classement auteurs'!D110=\"\",\"\",'Classement auteurs'!D110)","v":""},{"$f":"IF('Classement auteurs'!E110=\"\",\"\",'Classement auteurs'!E110)","v":""},{"$f":"IF('Classement auteurs'!F110=\"\",\"\",'Classement auteurs'!F110)","v":18},{"$f":"IF('Classement auteurs'!G110=\"\",\"\",'Classement auteurs'!G110)","v":42},{"$f":"IF('Classement auteurs'!H110=\"\",\"\",'Classement auteurs'!H110)","v":18},{"$f":"IF('Classement auteurs'!I110=\"\",\"\",'Classement auteurs'!I110)","v":39},{"$f":"IF('Classement auteurs'!J110=\"\",\"\",'Classement auteurs'!J110)","v":160}]
[null,131845004101,{"$f":"IFERROR(VLOOKUP($B111,'Défi-1'!$C$2:$J$200,8,FALSE),\"\")","v":29},{"$f":"IFERROR(VLOOKUP($B111,'Défi-2'!$C$2:$J$200,8,FALSE),\"\")","v":34},{"$f":"IFERROR(VLOOKUP($B111,'Défi-3'!$C$2:$J$200,8,FALSE),\"\")","v":34},{"$f":"IFERROR(VLOOKUP($B111,'Défi-4'!$C$2:$J$200,8,FALSE),\"\")","v":26},{"$f":"IFERROR(VLOOKUP($B111,'Défi-5'!$C$2:$J$200,8,FALSE),\"\")","v":36},{"$f":"IFERROR(VLOOKUP($B111,'Défi-6'!$C$2:$J$200,8,FALSE),\"\")","v":""},{"$f":"IFERROR(VLOOKUP($B111,'Défi-7'!$C$2:$J$200,8,FALSE),\"\")","v":""},159,null,"OK","OK","OK","OK","OK","OK","OK","OK","OK",null,{"$f":"'Classement auteurs'!$B111","v":131845004101},{"$f":"IF('Classement auteurs'!C111=\"\",\"\",'Classement auteurs'!C111)","v":29},{"$f":"IF('Classement auteurs'!D111=\"\",\"\",'Classement auteurs'!D111)","v":34},{"$f":"IF('Classement auteurs'!E111=\"\",\"\",'Classement auteurs'!E111)","v":34},{"$f":"IF('Classement auteurs'!F111=\"\",\"\",'Classement auteurs'!F111)","v":26},{"$f":"IF('Classement auteurs'!G111=\"\",\"\",'Classement auteurs'!G111)","v":36},{"$f":"IF('Classement auteurs'!H111=\"\",\"\",'Classement auteurs'!H111)","v":""},{"$f":"IF('Classement auteurs'!I111=\"\",\"\",'Classement auteurs'!I111)","v":""},{"$f":"IF('Classement auteurs'!J111=\"\",\"\",'Classement auteurs'!J111)","v":159}]
[null,131376011801,{"$f":"IFERROR(VLOOKUP($B112,'Défi-1'!$C$2:$J$200,8,FALSE),\"\")","v":48},{"$f":"IFERROR(VLOOKUP($B112,'Défi-2'!$C$2:$J$200,8,FALSE),\"\")","v":""},{"$f":"IFERROR(VLOOKUP($B112,'Défi-3'!$C$2:$J$200,8,FALSE),\"\")","v":""},{"$f":"IFERROR(VLOOKUP($B112,'Défi-4'!$C$2:$J$200,8,FALSE),\"\")","v":18},{"$f":"IFERROR(VLOOKUP($B112,'Défi-5'!$C$2:$J$200,8,FALSE),\"\")","v":46},{"$f":"IFERROR(VLOOKUP($B112,'Défi-6'!$C$2:$J$200,8,FALSE),\"\")","v":46},{"$f":"IFERROR(VLOOKUP($B112,'Défi-7'!$C$2:$J$200,8,FALSE),\"\")","v":""},158,null,"OK","OK","OK","OK","OK","OK","OK","OK","OK",null,{"$f":"'Classement auteurs'!$B112","v":131376011801},{"$f":"IF('Classement auteurs'!C112=\"\",\"\",'Classement auteurs'!C112)","v":48},{"$f":"IF('Classement auteurs'!D112=\"\",\"\",'Classement auteurs'!D112)","v":""},{"$f":"IF('Classement auteurs'!E112=\"\",\"\",'Classement auteurs'!E112)","v":""},{"$f":"IF('Classement auteurs'!F112=\"\",\"\",'Classement auteurs'!F112)","v":18},{"$f":"IF('Classement auteurs'!G112=\"\",\"\",'Classement auteurs'!G112)","v":46},{"$f":"IF('Classement auteurs'!H112=\"\",\"\",'Classement auteurs'!H112)","v":46},{"$f":"IF('Classement auteurs'!I112=\"\",\"\",'Classement auteurs'!I112)","v":""},{"$f":"IF('Classement auteurs'!J112=\"\",\"\",'Classement auteurs'!J112)","v":158}]
[null,131845002101,{"$f":"IFERROR(VLOOKUP($B113,'Défi-1'!$C$2:$J$200,8,FALSE),\"\")","v":38},{"$f":"IFERROR(VLOOKUP($B113,'Défi-2'!$C$2:$J$200,8,FALSE),\"\")","v":34},{"$f":"IFERROR(VLOOKUP($B113,'Défi-3'!$C$2:$J$200,8,FALSE),\"\")","v":42},{"$f":"IFERROR(VLOOKUP($B113,'Défi-4'!$C$2:$J$200,8,FALSE),\"\")","v":""},{"$f":"IFERROR(VLOOKUP($B113,'Défi-5'!$C$2:$J$200,8,FALSE),\"\")","v":44},{"$f":"IFERROR(VLOOKUP($B113,'Défi-6'!$C$2:$J$200,8,FALSE),\"\")","v":""},{"$f":"IFERROR(VLOOKUP($B113,'Défi-7'!$C$2:$J$200,8,FALSE),\"\")","v":""},158,null,"OK","OK","OK","OK","OK","OK","OK","OK","OK",null,{"$f":"'Classement auteurs'!$B113","v":131845002101},{"$f":"IF('Classement auteurs'!C113=\"\",\"\",'Classement auteurs'!C113)","v":38},{"$f":"IF('Classement auteurs'!D113=\"\",\"\",'Classement auteurs'!D113)","v":34},{"$f":"IF('Classement auteurs'!E113=\"\",\"\",'Classement auteurs'!E113)","v":42},{"$f":"IF('Classement auteurs'!F113=\"\",\"\",'Classement auteurs'!F113)","v":""},{"$f":"IF('Classement auteurs'!G113=\"\",\"\",'Classement auteurs'!G113)","v":44},{"$f":"IF('Classement auteurs'!H113=\"\",\"\",'Classement auteurs'!H113)","v":""},{"$f":"IF('Classement auteurs'!I113=\"\",\"\",'Classement auteurs'!I113)","v":""},{"$f":"IF('Classement auteurs'!J113=\"\",\"\",'Classement auteurs'!J113)","v":158}]
[null,131824003101,{"$f":"IFERROR(VLOOKUP($B114,'Défi-1'!$C$2:$J$200,8,FALSE),\"\")","v":42},{"$f":"IFERROR(VLOOKUP($B114,'Défi-2'!$C$2:$J$200,8,FALSE),\"\")","v":33},{"$f":"IFERROR(VLOOKUP($B114,'Défi-3'!$C$2:$J$200,8,FALSE),\"\")","v":41},{"$f":"IFERROR(VLOOKUP($B114,'Défi-4'!$C$2:$J$200,8,FALSE),\"\")","v":""},{"$f":"IFERROR(VLOOKUP($B114,'Défi-5'!$C$2:$J$200,8,FALSE),\"\")","v":""},{"$f":"IFERROR(VLOOKUP($B114,'Défi-6'!$C$2:$J$200,8,FALSE),\"\")","v":42},{"$f":"IFERROR(VLOOKUP($B114,'Défi-7'!$C$2:$J$200,8,FALSE),\"\")","v":""},158,null,"OK","OK","OK","OK","OK","OK","KO","OK","KO",null,{"$f":"'Classement auteurs'!$B114","v":131824003101},{"$f":"IF('Classement auteurs'!C114=\"\",\"\",'Classement auteurs'!C114)","v":42},{"$f":"IF('Classement auteurs'!D114=\"\",\"\",'Classement auteurs'!D114)","v":33},{"$f":"IF('Classement auteurs'!E114=\"\",\"\",'Classement auteurs'!E114)","v":41},{"$f":"IF('Classement auteurs'!F114=\"\",\"\",'Classement auteurs'!F114)","v":""},{"$f":"IF('Classement auteurs'!G114=\"\",\"\",'Classement auteurs'!G114)","v":""},{"$f":"IF('Classement auteurs'!H114=\"\",\"\",'Classement auteurs'!H114)","v":41},{"$f":"IF('Classement auteurs'!I114=\"\",\"\",'Classement auteurs'!I114)","v":""},{"$f":"IF('Classement auteurs'!J114=\"\",\"\",'Classement auteurs'!J114)","v":157}]
[null,130987002301,{"$f":"IFERROR(VLOOKUP($B115,'Défi-1'!$C$2:$J$200,8,FALSE),\"\")","v":""},{"$f":"IFERROR(VLOOKUP($B115,'Défi-2'!$C$2:$J$200,8,FALSE),\"\")","v":44},{"$f":"IFERROR(VLOOKUP($B115,'Défi-3'!$C$2:$J$200,8,FALSE),\"\")","v":40},{"$f":"IFERROR(VLOOKUP($B115,'Défi-4'!$C$2:$J$200,8,FALSE),\"\")","v":39},{"$f":"IFERROR(VLOOKUP($B115,'Défi-5'!$C$2:$J$200,8,FALSE),\"\")","v":34},{"$f":"IFERROR(VLOOKUP($B115,'Défi-6'!$C$2:$J$200,8,FALSE),\"\")","v":""},{"$f":"IFERROR(VLOOKUP($B115,'Défi-7'!$C$2:$J$200,8,FALSE),\"\")","v":""},157,null,"OK","OK","OK","OK","OK","OK","OK","OK","OK",null,{"$f":"'Classement auteurs'!$B115","v":130987002301},{"$f":"IF('Classement auteurs'!C115=\"\",\"\",'Classement auteurs'!C115)","v":""},{"$f":"IF('Classement auteurs'!D115=\"\",\"\",'Classement auteurs'!D115)","v":44},{"$f":"IF('Classement auteurs'!E115=\"\",\"\",'Classement auteurs'!E115)","v":40},{"$f":"IF('Classement auteurs'!F115=\"\",\"\",'Classement auteurs'!F115)","v":39},{"$f":"IF('Classement auteurs'!G115=\"\",\"\",'Classement auteurs'!G115)","v":34},{"$f":"IF('Classement auteurs'!H115=\"\",\"\",'Classement auteurs'!H115)","v":""},{"$f":"IF('Classement auteurs'!I115=\"\",\"\",'Classement auteurs'!I115)","v":""},{"$f":"IF('Classement auteurs'!J115=\"\",\"\",'Classement auteurs'!J115)","v":157}]
[null,130987014001,{"$f":"IFERROR(VLOOKUP($B116,'Défi-1'!$C$2:$J$200,8,FALSE),\"\")","v":48},{"$f":"IFERROR(VLOOKUP($B116,'Défi-2'!$C$2:$J$200,8,FALSE),\"\")","v":37},{"$f":"IFERROR(VLOOKUP($B116,'Défi-3'!$C$2:$J$200,8,FALSE),\"\")","v":23},{"$f":"IFERROR(VLOOKUP($B116,'Défi-4'!$C$2:$J$200,8,FALSE),\"\")","v":""},{"$f":"IFERROR(VLOOKUP($B116,'Défi-5'!$C$2:$J$200,8,FALSE),\"\")","v":""},{"$f":"IFERROR(VLOOKUP($B116,'Défi-6'!$C$2:$J$200,8,FALSE),\"\")","v":48},{"$f":"IFERROR(VLOOKUP($B116,'Défi-7'!$C$2:$J$200,8,FALSE),\"\")","v":""},156,null,"OK","OK","OK","OK","OK","OK","OK","OK","OK",null,{"$f":"'Classement auteurs'!$B116","v":130987014001},{"$f":"IF('Classement auteurs'!C116=\"\",\"\",'Classement auteurs'!C116)","v":48},{"$f":"IF('Classement auteurs'!D116=\"\",\"\",'Classement auteurs'!D116)","v":37},{"$f":"IF('Classement auteurs'!E116=\"\",\"\",'Classement auteurs'!E116)","v":23},{"$f":"IF('Classement auteurs'!F116=\"\",\"\",'Classement auteurs'!F116)","v":""},{"$f":"IF('Classement auteurs'!G116=\"\",\"\",'Classement auteurs'!G116)","v":""},{"$f":"IF('Classement auteurs'!H116=\"\",\"\",'Classement auteurs'!H116)","v":48},{"$f":"IF('Classement auteurs'!I116=\"\",\"\",'Classement auteurs'!I116)","v":""},{"$f":"IF('Classement auteurs'!J116=\"\",\"\",'Classement auteurs'!J116)","v":156}]
[null,132084003601,{"$f":"IFERROR(VLOOKUP($B117,'Défi-1'!$C$2:$J$200,8,FALSE),\"\")","v":""},{"$f":"IFERROR(VLOOKUP($B117,'Défi-2'!$C$2:$J$200,8,FALSE),\"\")","v":33},{"$f":"IFERROR(VLOOKUP($B117,'Défi-3'!$C$2:$J$200,8,FALSE),\"\")","v":""},{"$f":"IFERROR(VLOOKUP($B117,'Défi-4'!$C$2:$J$200,8,FALSE),\"\")","v":55},{"$f":"IFERROR(VLOOKUP($B117,'Défi-5'!$C$2:$J$200,8,FALSE),\"\")","v":35},{"$f":"IFERROR(VLOOKUP($B117,'Défi-6'!$C$2:$J$200,8,FALSE),\"\")","v":55},{"$f":"IFERROR(VLOOKUP($B117,'Défi-7'!$C$2:$J$200,8,FALSE),\"\")","v":""},178,null,"OK","OK","OK","OK","OK","OK","KO","OK","KO",null,{"$f":"'Classement auteurs'!$B117","v":132084003601},{"$f":"IF('Classement auteurs'!C117=\"\",\"\",'Classement auteurs'!C117)","v":""},{"$f":"IF('Classement auteurs'!D117=\"\",\"\",'Classement auteurs'!D117)","v":33},{"$f":"IF('Classement auteurs'!E117=\"\",\"\",'Classement auteurs'!E117)","v":""},{"$f":"IF('Classement auteurs'!F117=\"\",\"\",'Classement auteurs'!F117)","v":55},{"$f":"IF('Classement auteurs'!G117=\"\",\"\",'Classement auteurs'!G117)","v":35},{"$f":"IF('Classement auteurs'!H117=\"\",\"\",'Classement auteurs'!H117)","v":33},{"$f":"IF('Classement auteurs'!I117=\"\",\"\",'Classement auteurs'!I117)","v":""},{"$f":"IF('Classement auteurs'!J117=\"\",\"\",'Classement auteurs'!J117)","v":156}]
[null,131353007301,{"$f":"IFERROR(VLOOKUP($B118,'Défi-1'!$C$2:$J$200,8,FALSE),\"\")","v":""},{"$f":"IFERROR(VLOOKUP($B118,'Défi-2'!$C$2:$J$200,8,FALSE),\"\")","v":40},{"$f":"IFERROR(VLOOKUP($B118,'Défi-3'!$C$2:$J$200,8,FALSE),\"\")","v":38},{"$f":"IFERROR(VLOOKUP($B118,'Défi-4'!$C$2:$J$200,8,FALSE),\"\")","v":""},{"$f":"IFERROR(VLOOKUP($B118,'Défi-5'!$C$2:$J$200,8,FALSE),\"\")","v":38},{"$f":"IFERROR(VLOOKUP($B118,'Défi-6'!$C$2:$J$200,8,FALSE),\"\")","v":40},{"$f":"IFERROR(VLOOKUP($B118,'Défi-7'!$C$2:$J$200,8,FALSE),\"\")","v":""},156,null,"OK","OK","OK","OK","OK","OK","OK","OK","OK",null,{"$f":"'Classement auteurs'!$B118","v":131353007301},{"$f":"IF('Classement auteurs'!C118=\"\",\"\",'Classement auteurs'!C118)","v":""},{"$f":"IF('Classement auteurs'!D118=\"\",\"\",'Classement auteurs'!D118)","v":40},{"$f":"IF('Classement auteurs'!E118=\"\",\"\",'Classement auteurs'!E118)","v":38},{"$f":"IF('Classement auteurs'!F118=\"\",\"\",'Classement auteurs'!F118)","v":""},{"$f":"IF('Classement auteurs'!G118=\"\",\"\",'Classement auteurs'!G118)","v":38},{"$f":"IF('Classement auteurs'!H118=\"\",\"\",'Classement auteurs'!H118)","v":40},{"$f":"IF('Classement auteurs'!I118=\"\",\"\",'Classement auteurs'!I118)","v":""},{"$f":"IF('Classement auteurs'!J118=\"\",\"\",'Classement auteurs'!J118)","v":156}]
[null,132060000101,{"$f":"IFERROR(VLOOKUP($B119,'Défi-1'!$C$2:$J$200,8,FALSE),\"\")","v":29},{"$f":"IFERROR(VLOOKUP($B119,'Défi-2'!$C$2:$J$200,8,FALSE),\"\")","v":""},{"$f":"IFERROR(VLOOKUP($B119,'Défi-3'!$C$2:$J$200,8,FALSE),\"\")","v":33},{"$f":"IFERROR(VLOOKUP($B119,'Défi-4'!$C$2:$J$200,8,FALSE),\"\")","v":""},{"$f":"IFERROR(VLOOKUP($B119,'Défi-5'!$C$2:$J$200,8,FALSE),\"\")","v":34},{"$f":"IFERROR(VLOOKUP($B119,'Défi-6'!$C$2:$J$200,8,FALSE),\"\")","v":34},{"$f":"IFERROR(VLOOKUP($B119,'Défi-7'!$C$2:$J$200,8,FALSE),\"\")","v":29},159,null,"OK","OK","OK","OK","OK","OK","KO","OK","KO",null,{"$f":"'Classement auteurs'!$B119","v":132060000101},{"$f":"IF('Classement auteurs'!C119=\"\",\"\",'Classement auteurs'!C119)","v":29},{"$f":"IF('Classement auteurs'!D119=\"\",\"\",'Classement auteurs'!D119)","v":""},{"$f":"IF('Classement auteurs'!E119=\"\",\"\",'Classement auteurs'!E119)","v":33},{"$f":"IF('Classement auteurs'!F119=\"\",\"\",'Classement auteurs'!F119)","v":""},{"$f":"IF('Classement auteurs'!G119=\"\",\"\",'Classement auteurs'!G119)","v":34},{"$f":"IF('Classement auteurs'!H119=\"\",\"\",'Classement auteurs'!H119)","v":29},{"$f":"IF('Classement auteurs'!I119=\"\",\"\",'Classement auteurs'!I119)","v":29},{"$f":"IF('Classement auteurs'!J119=\"\",\"\",'Classement auteurs'!J119)","v":154}]
[null,131956003401,{"$f":"IFERROR(VLOOKUP($B120,'Défi-1'!$C$2:$J$200,8,FALSE),\"\")","v":37},{"$f":"IFERROR(VLOOKUP($B120,'Défi-2'!$C$2:$J$200,8,FALSE),\"\")","v":24},{"$f":"IFERROR(VLOOKUP($B120,'Défi-3'!$C$2:$J$200,8,FALSE),\"\")","v":34},{"$f":"IFERROR(VLOOKUP($B120,'Défi-4'!$C$2:$J$200,8,FALSE),\"\")","v":""},{"$f":"IFERROR(VLOOKUP($B120,'Défi-5'!$C$2:$J$200,8,FALSE),\"\")","v":33},{"$f":"IFERROR(VLOOKUP($B120,'Défi-6'!$C$2:$J$200,8,FALSE),\"\")","v":24},{"$f":"IFERROR(VLOOKUP($B120,'Défi-7'!$C$2:$J$200,8,FALSE),\"\")","v":""},152,null,"OK","OK","OK","OK","OK","OK","OK","OK","OK",null,{"$f":"'Classement auteurs'!$B120","v":131956003401},{"$f":"IF('Classement auteurs'!C120=\"\",\"\",'Classement auteurs'!C120)","v":37},{"$f":"IF('Classement auteurs'!D120=\"\",\"\",'Classement auteurs'!D120)","v":24},{"$f":"IF('Classement auteurs'!E120=\"\",\"\",'Classement auteurs'!E120)","v":34},{"$f":"IF('Classement auteurs'!F120=\"\",\"\",'Classement auteurs'!F120)","v":""},{"$f":"IF('Classement auteurs'!G120=\"\",\"\",'Classement auteurs'!G120)","v":33},{"$f":"IF('Classement auteurs'!H120=\"\",\"\",'Classement auteurs'!H120)","v":24},{"$f":"IF('Classement auteurs'!I120=\"\",\"\",'Classement auteurs'!I120)","v":""},{"$f":"IF('Classement auteurs'!J120=\"\",\"\",'Classement auteurs'!J120)","v":152}]
[null,131823006401,{"$f":"IFERROR(VLOOKUP($B121,'Défi-1'!$C$2:$J$200,8,FALSE),\"\")","v":""},{"$f":"IFERROR(VLOOKUP($B121,'Défi-2'!$C$2:$J$200,8,FALSE),\"\")","v":38},{"$f":"IFERROR(VLOOKUP($B121,'Défi-3'!$C$2:$J$200,8,FALSE),\"\")","v":39},{"$f":"IFERROR(VLOOKUP($B121,'Défi-4'!$C$2:$J$200,8,FALSE),\"\")","v":37},{"$f":"IFERROR(VLOOKUP($B121,'Défi-5'!$C$2:$J$200,8,FALSE),\"\")","v":37},{"$f":"IFERROR(VLOOKUP($B121,'Défi-6'!$C$2:$J$200,8,FALSE),\"\")","v":""},{"$f":"IFERROR(VLOOKUP($B121,'Défi-7'!$C$2:$J$200,8,FALSE),\"\")","v":""},151,null,"OK","OK","OK","OK","OK","OK","OK","OK","OK",null,{"$f":"'Classement auteurs'!$B121","v":131823006401},{"$f":"IF('Classement auteurs'!C121=\"\",\"\",'Classement auteurs'!C121)","v":""},{"$f":"IF('Classement auteurs'!D121=\"\",\"\",'Classement auteurs'!D121)","v":38},{"$f":"IF('Classement auteurs'!E121=\"\",\"\",'Classement auteurs'!E121)","v":39},{"$f":"IF('Classement auteurs'!F121=\"\",\"\",'Classement auteurs'!F121)","v":37},{"$f":"IF('Classement auteurs'!G121=\"\",\"\",'Classement auteurs'!G121)","v":37},{"$f":"IF('Classement auteurs'!H121=\"\",\"\",'Classement auteurs'!H121)","v":""},{"$f":"IF('Classement auteurs'!I121=\"\",\"\",'Classement auteurs'!I121)","v":""},{"$f":"IF('Classement auteurs'!J121=\"\",\"\",'Classement auteurs'!J121)","v":151}]
[null,131823007601,{"$f":"IFERROR(VLOOKUP($B122,'Défi-1'!$C$2:$J$200,8,FALSE),\"\")","v":33},{"$f":"IFERROR(VLOOKUP($B122,'Défi-2'!$C$2:$J$200,8,FALSE),\"\")","v":""},{"$f":"IFERROR(VLOOKUP($B122,'Défi-3'!$C$2:$J$200,8,FALSE),\"\")","v":40},{"$f":"IFERROR(VLOOKUP($B122,'Défi-4'!$C$2:$J$200,8,FALSE),\"\")","v":""},{"$f":"IFERROR(VLOOKUP($B122,'Défi-5'!$C$2:$J$200,8,FALSE),\"\")","v":30},{"$f":"IFERROR(VLOOKUP($B122,'Défi-6'!$C$2:$J$200,8,FALSE),\"\")","v":""},{"$f":"IFERROR(VLOOKUP($B122,'Défi-7'!$C$2:$J$200,8,FALSE),\"\")","v":43},146,null,"OK","OK","OK","OK","OK","OK","OK","OK","OK",null,{"$f":"'Classement auteurs'!$B122","v":131823007601},{"$f":"IF('Classement auteurs'!C122=\"\",\"\",'Classement auteurs'!C122)","v":33},{"$f":"IF('Classement auteurs'!D122=\"\",\"\",'Classement auteurs'!D122)","v":""},{"$f":"IF('Classement auteurs'!E122=\"\",\"\",'Classement auteurs'!E122)","v":40},{"$f":"IF('Classement auteurs'!F122=\"\",\"\",'Classement auteurs'!F122)","v":""},{"$f":"IF('Classement auteurs'!G122=\"\",\"\",'Classement auteurs'!G122)","v":30},{"$f":"IF('Classement auteurs'!H122=\"\",\"\",'Classement auteurs'!H122)","v":""},{"$f":"IF('Classement auteurs'!I122=\"\",\"\",'Classement auteurs'!I122)","v":43},{"$f":"IF('Classement auteurs'!J122=\"\",\"\",'Classement auteurs'!J122)","v":146}]
[null,132147000101,{"$f":"IFERROR(VLOOKUP($B123,'Défi-1'!$C$2:$J$200,8,FALSE),\"\")","v":""},{"$f":"IFERROR(VLOOKUP($B123,'Défi-2'!$C$2:$J$200,8,FALSE),\"\")","v":""},{"$f":"IFERROR(VLOOKUP($B123,'Défi-3'!$C$2:$J$200,8,FALSE),\"\")","v":""},{"$f":"IFERROR(VLOOKUP($B123,'Défi-4'!$C$2:$J$200,8,FALSE),\"\")","v":38},{"$f":"IFERROR(VLOOKUP($B123,'Défi-5'!$C$2:$J$200,8,FALSE),\"\")","v":36},{"$f":"IFERROR(VLOOKUP($B123,'Défi-6'!$C$2:$J$200,8,FALSE),\"\")","v":36},{"$f":"IFERROR(VLOOKUP($B123,'Défi-7'!$C$2:$J$200,8,FALSE),\"\")","v":35},145,null,"OK","OK","OK","OK","OK","OK","OK","OK","OK",null,{"$f":"'Classement auteurs'!$B123","v":132147000101},{"$f":"IF('Classement auteurs'!C123=\"\",\"\",'Classement auteurs'!C123)","v":""},{"$f":"IF('Classement auteurs'!D123=\"\",\"\",'Classement auteurs'!D123)","v":""},{"$f":"IF('Classement auteurs'!E123=\"\",\"\",'Classement auteurs'!E123)","v":""},{"$f":"IF('Classement auteurs'!F123=\"\",\"\",'Classement auteurs'!F123)","v":38},{"$f":"IF('Classement auteurs'!G123=\"\",\"\",'Classement auteurs'!G123)","v":36},{"$f":"IF('Classement auteurs'!H123=\"\",\"\",'Classement auteurs'!H123)","v":36},{"$f":"IF('Classement auteurs'!I123=\"\",\"\",'Classement auteurs'!I123)","v":35},{"$f":"IF('Classement auteurs'!J123=\"\",\"\",'Classement auteurs'!J123)","v":145}]
[null,131683000701,{"$f":"IFERROR(VLOOKUP($B124,'Défi-1'!$C$2:$J$200,8,FALSE),\"\")","v":32},{"$f":"IFERROR(VLOOKUP($B124,'Défi-2'!$C$2:$J$200,8,FALSE),\"\")","v":30},{"$f":"IFERROR(VLOOKUP($B124,'Défi-3'!$C$2:$J$200,8,FALSE),\"\")","v":48},{"$f":"IFERROR(VLOOKUP($B124,'Défi-4'!$C$2:$J$200,8,FALSE),\"\")","v":""},{"$f":"IFERROR(VLOOKUP($B124,'Défi-5'!$C$2:$J$200,8,FALSE),\"\")","v":""},{"$f":"IFERROR(VLOOKUP($B124,'Défi-6'!$C$2:$J$200,8,FALSE),\"\")","v":48},{"$f":"IFERROR(VLOOKUP($B124,'Défi-7'!$C$2:$J$200,8,FALSE),\"\")","v":""},158,null,"OK","OK","OK","OK","OK","OK","KO","OK","KO",null,{"$f":"'Classement auteurs'!$B124","v":131683000701},{"$f":"IF('Classement auteurs'!C124=\"\",\"\",'Classement auteurs'!C124)","v":32},{"$f":"IF('Classement auteurs'!D124=\"\",\"\",'Classement auteurs'!D124)","v":30},{"$f":"IF('Classement auteurs'!E124=\"\",\"\",'Classement auteurs'!E124)","v":48},{"$f":"IF('Classement auteurs'!F124=\"\",\"\",'Classement auteurs'!F124)","v":""},{"$f":"IF('Classement auteurs'!G124=\"\",\"\",'Classement auteurs'!G124)","v":""},{"$f":"IF('Classement auteurs'!H124=\"\",\"\",'Classement auteurs'!H124)","v":32},{"$f":"IF('Classement auteurs'!I124=\"\",\"\",'Classement auteurs'!I124)","v":""},{"$f":"IF('Classement auteurs'!J124=\"\",\"\",'Classement auteurs'!J124)","v":142}]
[null,132193000501,{"$f":"IFERROR(VLOOKUP($B125,'Défi-1'!$C$2:$J$200,8,FALSE),\"\")","v":""},{"$f":"IFERROR(VLOOKUP($B125,'Défi-2'!$C$2:$J$200,8,FALSE),\"\")","v":25},{"$f":"IFERROR(VLOOKUP($B125,'Défi-3'!$C$2:$J$200,8,FALSE),\"\")","v":""},{"$f":"IFERROR(VLOOKUP($B125,'Défi-4'!$C$2:$J$200,8,FALSE),\"\")","v":21},{"$f":"IFERROR(VLOOKUP($B125,'Défi-5'!$C$2:$J$200,8,FALSE),\"\")","v":41},{"$f":"IFERROR(VLOOKUP($B125,'Défi-6'!$C$2:$J$200,8,FALSE),\"\")","v":25},{"$f":"IFERROR(VLOOKUP($B125,'Défi-7'!$C$2:$J$200,8,FALSE),\"\")","v":30},142,null,"OK","OK","OK","OK","OK","OK","OK","OK","OK",null,{"$f":"'Classement auteurs'!$B125","v":132193000501},{"$f":"IF('Classement auteurs'!C125=\"\",\"\",'Classement auteurs'!C125)","v":""},{"$f":"IF('Classement auteurs'!D125=\"\",\"\",'Classement auteurs'!D125)","v":25},{"$f":"IF('Classement auteurs'!E125=\"\",\"\",'Classement auteurs'!E125)","v":""},{"$f":"IF('Classement auteurs'!F125=\"\",\"\",'Classement auteurs'!F125)","v":21},{"$f":"IF('Classement auteurs'!G125=\"\",\"\",'Classement auteurs'!G125)","v":41},{"$f":"IF('Classement auteurs'!H125=\"\",\"\",'Classement auteurs'!H125)","v":25},{"$f":"IF('Classement auteurs'!I125=\"\",\"\",'Classement auteurs'!I125)","v":30},{"$f":"IF('Classement auteurs'!J125=\"\",\"\",'Classement auteurs'!J125)","v":142}]
[null,132084000301,{"$f":"IFERROR(VLOOKUP($B126,'Défi-1'!$C$2:$J$200,8,FALSE),\"\")","v":""},{"$f":"IFERROR(VLOOKUP($B126,'Défi-2'!$C$2:$J$200,8,FALSE),\"\")","v":39},{"$f":"IFERROR(VLOOKUP($B126,'Défi-3'!$C$2:$J$200,8,FALSE),\"\")","v":40},{"$f":"IFERROR(VLOOKUP($B126,'Défi-4'!$C$2:$J$200,8,FALSE),\"\")","v":24},{"$f":"IFERROR(VLOOKUP($B126,'Défi-5'!$C$2:$J$200,8,FALSE),\"\")","v":""},{"$f":"IFERROR(VLOOKUP($B126,'Défi-6'!$C$2:$J$200,8,FALSE),\"\")","v":39},{"$f":"IFERROR(VLOOKUP($B126,'Défi-7'!$C$2:$J$200,8,FALSE),\"\")","v":""},142,null,"OK","OK","OK","OK","OK","OK","OK","OK","OK",null,{"$f":"'Classement auteurs'!$B126","v":132084000301},{"$f":"IF('Classement auteurs'!C126=\"\",\"\",'Classement auteurs'!C126)","v":""},{"$f":"IF('Classement auteurs'!D126=\"\",\"\",'Classement auteurs'!D126)","v":39},{"$f":"IF('Classement auteurs'!E126=\"\",\"\",'Classement auteurs'!E126)","v":40},{"$f":"IF('Classement auteurs'!F126=\"\",\"\",'Classement auteurs'!F126)","v":24},{"$f":"IF('Classement auteurs'!G126=\"\",\"\",'Classement auteurs'!G126)","v":""},{"$f":"IF('Classement auteurs'!H126=\"\",\"\",'Classement auteurs'!H126)","v":39},{"$f":"IF('Classement auteurs'!I126=\"\",\"\",'Classement auteurs'!I126)","v":""},{"$f":"IF('Classement auteurs'!J126=\"\",\"\",'Classement auteurs'!J126)","v":142}]
[null,131845000801,{"$f":"IFERROR(VLOOKUP($B127,'Défi-1'!$C$2:$J$200,8,FALSE),\"\")","v":36},{"$f":"IFERROR(VLOOKUP($B127,'Défi-2'!$C$2:$J$200,8,FALSE),\"\")","v":""},{"$f":"IFERROR(VLOOKUP($B127,'Défi-3'!$C$2:$J$200,8,FALSE),\"\")","v":""},{"$f":"IFERROR(VLOOKUP($B127,'Défi-4'!$C$2:$J$200,8,FALSE),\"\")","v":""},{"$f":"IFERROR(VLOOKUP($B127,'Défi-5'!$C$2:$J$200,8,FALSE),\"\")","v":34},{"$f":"IFERROR(VLOOKUP($B127,'Défi-6'!$C$2:$J$200,8,FALSE),\"\")","v":36},{"$f":"IFERROR(VLOOKUP($B127,'Défi-7'!$C$2:$J$200,8,FALSE),\"\")","v":34},140,null,"OK","OK","OK","OK","OK","OK","OK","OK","OK",null,{"$f":"'Classement auteurs'!$B127","v":131845000801},{"$f":"IF('Classement auteurs'!C127=\"\",\"\",'Classement auteurs'!C127)","v":36},{"$f":"IF('Classement auteurs'!D127=\"\",\"\",'Classement auteurs'!D127)","v":""},{"$f":"IF('Classement auteurs'!E127=\"\",\"\",'Classement auteurs'!E127)","v":""},{"$f":"IF('Classement auteurs'!F127=\"\",\"\",'Classement auteurs'!F127)","v":""},{"$f":"IF('Classement auteurs'!G127=\"\",\"\",'Classement auteurs'!G127)","v":34},{"$f":"IF('Classement auteurs'!H127=\"\",\"\",'Classement auteurs'!H127)","v":36},{"$f":"IF('Classement auteurs'!I127=\"\",\"\",'Classement auteurs'!I127)","v":34},{"$f":"IF('Classement auteurs'!J127=\"\",\"\",'Classement auteurs'!J127)","v":140}]
[null,132086002501,{"$f":"IFERROR(VLOOKUP($B128,'Défi-1'!$C$2:$J$200,8,FALSE),\"\")","v":38},{"$f":"IFERROR(VLOOKUP($B128,'Défi-2'!$C$2:$J$200,8,FALSE),\"\")","v":32},{"$f":"IFERROR(VLOOKUP($B128,'Défi-3'!$C$2:$J$200,8,FALSE),\"\")","v":38},{"$f":"IFERROR(VLOOKUP($B128,'Défi-4'!$C$2:$J$200,8,FALSE),\"\")","v":""},{"$f":"IFERROR(VLOOKUP($B128,'Défi-5'!$C$2:$J$200,8,FALSE),\"\")","v":""},{"$f":"IFERROR(VLOOKUP($B128,'Défi-6'!$C$2:$J$200,8,FALSE),\"\")","v":32},{"$f":"IFERROR(VLOOKUP($B128,'Défi-7'!$C$2:$J$200,8,FALSE),\"\")","v":""},140,null,"OK","OK","OK","OK","OK","OK","OK","OK","OK",null,{"$f":"'Classement auteurs'!$B128","v":132086002501},{"$f":"IF('Classement auteurs'!C128=\"\",\"\",'Classement auteurs'!C128)","v":38},{"$f":"IF('Classement auteurs'!D128=\"\",\"\",'Classement auteurs'!D128)","v":32},{"$f":"IF('Classement auteurs'!E128=\"\",\"\",'Classement auteurs'!E128)","v":38},{"$f":"IF('Classement auteurs'!F128=\"\",\"\",'Classement auteurs'!F128)","v":""},{"$f":"IF('Classement auteurs'!G128=\"\",\"\",'Classement auteurs'!G128)","v":""},{"$f":"IF('Classement auteurs'!H128=\"\",\"\",'Classement auteurs'!H128)","v":32},{"$f":"IF('Classement auteurs'!I128=\"\",\"\",'Classement auteurs'!I128)","v":""},{"$f":"IF('Classement auteurs'!J128=\"\",\"\",'Classement auteurs'!J128)","v":140}]
[null,130925008601,{"$f":"IFERROR(VLOOKUP($B129,'Défi-1'!$C$2:$J$200,8,FALSE),\"\")","v":33},{"$f":"IFERROR(VLOOKUP($B129,'Défi-2'!$C$2:$J$200,8,FALSE),\"\")","v":36},{"$f":"IFERROR(VLOOKUP($B129,'Défi-3'!$C$2:$J$200,8,FALSE),\"\")","v":34},{"$f":"IFERROR(VLOOKUP($B129,'Défi-4'!$C$2:$J$200,8,FALSE),\"\")","v":""},{"$f":"IFERROR(VLOOKUP($B129,'Défi-5'!$C$2:$J$200,8,FALSE),\"\")","v":""},{"$f":"IFERROR(VLOOKUP($B129,'Défi-6'!$C$2:$J$200,8,FALSE),\"\")","v":36},{"$f":"IFERROR(VLOOKUP($B129,'Défi-7'!$C$2:$J$200,8,FALSE),\"\")","v":""},139,null,"OK","OK","OK","OK","OK","OK","OK","OK","OK",null,{"$f":"'Classement auteurs'!$B129","v":130925008601},{"$f":"IF('Classement auteurs'!C129=\"\",\"\",'Classement auteurs'!C129)","v":33},{"$f":"IF('Classement auteurs'!D129=\"\",\"\",'Classement auteurs'!D129)","v":36},{"$f":"IF('Classement auteurs'!E129=\"\",\"\",'Classement auteurs'!E129)","v":34},{"$f":"IF('Classement auteurs'!F129=\"\",\"\",'Classement auteurs'!F129)","v":""},{"$f":"IF('Classement auteurs'!G129=\"\",\"\",'Classement auteurs'!G129)","v":""},{"$f":"IF('Classement auteurs'!H129=\"\",\"\",'Classement auteurs'!H129)","v":36},{"$f":"IF('Classement auteurs'!I129=\"\",\"\",'Classement auteurs'!I129)","v":""},{"$f":"IF('Classement auteurs'!J129=\"\",\"\",'Classement auteurs'!J129)","v":139}]
[null,131845002501,{"$f":"IFERROR(VLOOKUP($B130,'Défi-1'!$C$2:$J$200,8,FALSE),\"\")","v":30},{"$f":"IFERROR(VLOOKUP($B130,'Défi-2'!$C$2:$J$200,8,FALSE),\"\")","v":41},{"$f":"IFERROR(VLOOKUP($B130,'Défi-3'!$C$2:$J$200,8,FALSE),\"\")","v":32},{"$f":"IFERROR(VLOOKUP($B130,'Défi-4'!$C$2:$J$200,8,FALSE),\"\")","v":""},{"$f":"IFERROR(VLOOKUP($B130,'Défi-5'!$C$2:$J$200,8,FALSE),\"\")","v":""},{"$f":"IFERROR(VLOOKUP($B130,'Défi-6'!$C$2:$J$200,8,FALSE),\"\")","v":""},{"$f":"IFERROR(VLOOKUP($B130,'Défi-7'!$C$2:$J$200,8,FALSE),\"\")","v":36},139,null,"OK","OK","OK","OK","OK","OK","OK","OK","OK",null,{"$f":"'Classement auteurs'!$B130","v":131845002501},{"$f":"IF('Classement auteurs'!C130=\"\",\"\",'Classement auteurs'!C130)","v":30},{"$f":"IF('Classement auteurs'!D130=\"\",\"\",'Classement auteurs'!D130)","v":41},{"$f":"IF('Classement auteurs'!E130=\"\",\"\",'Classement auteurs'!E130)","v":32},{"$f":"IF('Classement auteurs'!F130=\"\",\"\",'Classement auteurs'!F130)","v":""},{"$f":"IF('Classement auteurs'!G130=\"\",\"\",'Classement auteurs'!G130)","v":""},{"$f":"IF('Classement auteurs'!H130=\"\",\"\",'Classement auteurs'!H130)","v":""},{"$f":"IF('Classement auteurs'!I130=\"\",\"\",'Classement auteurs'!I130)","v":36},{"$f":"IF('Classement auteurs'!J130=\"\",\"\",'Classement auteurs'!J130)","v":139}]
[null,131499009301,{"$f":"IFERROR(VLOOKUP($B131,'Défi-1'!$C$2:$J$200,8,FALSE),\"\")","v":29},{"$f":"IFERROR(VLOOKUP($B131,'Défi-2'!$C$2:$J$200,8,FALSE),\"\")","v":""},{"$f":"IFERROR(VLOOKUP($B131,'Défi-3'!$C$2:$J$200,8,FALSE),\"\")","v":35},{"$f":"IFERROR(VLOOKUP($B131,'Défi-4'!$C$2:$J$200,8,FALSE),\"\")","v":""},{"$f":"IFERROR(VLOOKUP($B131,'Défi-5'!$C$2:$J$200,8,FALSE),\"\")","v":""},{"$f":"IFERROR(VLOOKUP($B131,'Défi-6'!$C$2:$J$200,8,FALSE),\"\")","v":35},{"$f":"IFERROR(VLOOKUP($B131,'Défi-7'!$C$2:$J$200,8,FALSE),\"\")","v":39},138,null,"OK","OK","OK","OK","OK","OK","OK","OK","OK",null,{"$f":"'Classement auteurs'!$B131","v":131499009301},{"$f":"IF('Classement auteurs'!C131=\"\",\"\",'Classement auteurs'!C131)","v":29},{"$f":"IF('Classement auteurs'!D131=\"\",\"\",'Classement auteurs'!D131)","v":""},{"$f":"IF('Classement auteurs'!E131=\"\",\"\",'Classement auteurs'!E131)","v":35},{"$f":"IF('Classement auteurs'!F131=\"\",\"\",'Classement auteurs'!F131)","v":""},{"$f":"IF('Classement auteurs'!G131=\"\",\"\",'Classement auteurs'!G131)","v":""},{"$f":"IF('Classement auteurs'!H131=\"\",\"\",'Classement auteurs'!H131)","v":35},{"$f":"IF('Classement auteurs'!I131=\"\",\"\",'Classement auteurs'!I131)","v":39},{"$f":"IF('Classement auteurs'!J131=\"\",\"\",'Classement auteurs'!J131)","v":138}]
[null,131823005701,{"$f":"IFERROR(VLOOKUP($B132,'Défi-1'!$C$2:$J$200,8,FALSE),\"\")","v":36},{"$f":"IFERROR(VLOOKUP($B132,'Défi-2'!$C$2:$J$200,8,FALSE),\"\")","v":28},{"$f":"IFERROR(VLOOKUP($B132,'Défi-3'!$C$2:$J$200,8,FALSE),\"\")","v":37},{"$f":"IFERROR(VLOOKUP($B132,'Défi-4'!$C$2:$J$200,8,FALSE),\"\")","v":""},{"$f":"IFERROR(VLOOKUP($B132,'Défi-5'!$C$2:$J$200,8,FALSE),\"\")","v":""},{"$f":"IFERROR(VLOOKUP($B132,'Défi-6'!$C$2:$J$200,8,FALSE),\"\")","v":""},{"$f":"IFERROR(VLOOKUP($B132,'Défi-7'!$C$2:$J$200,8,FALSE),\"\")","v":37},138,null,"OK","OK","OK","OK","OK","OK","OK","OK","OK",null,{"$f":"'Classement auteurs'!$B132","v":131823005701},{"$f":"IF('Classement auteurs'!C132=\"\",\"\",'Classement auteurs'!C132)","v":36},{"$f":"IF('Classement auteurs'!D132=\"\",\"\",'Classement auteurs'!D132)","v":28},{"$f":"IF('Classement auteurs'!E132=\"\",\"\",'Classement auteurs'!E132)","v":37},{"$f":"IF('Classement auteurs'!F132=\"\",\"\",'Classement auteurs'!F132)","v":""},{"$f":"IF('Classement auteurs'!G132=\"\",\"\",'Classement auteurs'!G132)","v":""},{"$f":"IF('Classement auteurs'!H132=\"\",\"\",'Classement auteurs'!H132)","v":""},{"$f":"IF('Classement auteurs'!I132=\"\",\"\",'Classement auteurs'!I132)","v":37},{"$f":"IF('Classement auteurs'!J132=\"\",\"\",'Classement auteurs'!J132)","v":138}]
[null,131353007101,{"$f":"IFERROR(VLOOKUP($B133,'Défi-1'!$C$2:$J$200,8,FALSE),\"\")","v":37},{"$f":"IFERROR(VLOOKUP($B133,'Défi-2'!$C$2:$J$200,8,FALSE),\"\")","v":30},{"$f":"IFERROR(VLOOKUP($B133,'Défi-3'!$C$2:$J$200,8,FALSE),\"\")","v":33},{"$f":"IFERROR(VLOOKUP($B133,'Défi-4'!$C$2:$J$200,8,FALSE),\"\")","v":""},{"$f":"IFERROR(VLOOKUP($B133,'Défi-5'!$C$2:$J$200,8,FALSE),\"\")","v":37},{"$f":"IFERROR(VLOOKUP($B133,'Défi-6'!$C$2:$J$200,8,FALSE),\"\")","v":""},{"$f":"IFERROR(VLOOKUP($B133,'Défi-7'!$C$2:$J$200,8,FALSE),\"\")","v":""},137,null,"OK","OK","OK","OK","OK","OK","OK","OK","OK",null,{"$f":"'Classement auteurs'!$B133","v":131353007101},{"$f":"IF('Classement auteurs'!C133=\"\",\"\",'Classement auteurs'!C133)","v":37},{"$f":"IF('Classement auteurs'!D133=\"\",\"\",'Classement auteurs'!D133)","v":30},{"$f":"IF('Classement auteurs'!E133=\"\",\"\",'Classement auteurs'!E133)","v":33},{"$f":"IF('Classement auteurs'!F133=\"\",\"\",'Classement auteurs'!F133)","v":""},{"$f":"IF('Classement auteurs'!G133=\"\",\"\",'Classement auteurs'!G133)","v":37},{"$f":"IF('Classement auteurs'!H133=\"\",\"\",'Classement auteurs'!H133)","v":""},{"$f":"IF('Classement auteurs'!I133=\"\",\"\",'Classement auteurs'!I133)","v":""},{"$f":"IF('Classement auteurs'!J133=\"\",\"\",'Classement auteurs'!J133)","v":137}]
[null,132086002601,{"$f":"IFERROR(VLOOKUP($B134,'Défi-1'!$C$2:$J$200,8,FALSE),\"\")","v":32},{"$f":"IFERROR(VLOOKUP($B134,'Défi-2'!$C$2:$J$200,8,FALSE),\"\")","v":26},{"$f":"IFERROR(VLOOKUP($B134,'Défi-3'!$C$2:$J$200,8,FALSE),\"\")","v":""},{"$f":"IFERROR(VLOOKUP($B134,'Défi-4'!$C$2:$J$200,8,FALSE),\"\")","v":39},{"$f":"IFERROR(VLOOKUP($B134,'Défi-5'!$C$2:$J$200,8,FALSE),\"\")","v":40},{"$f":"IFERROR(VLOOKUP($B134,'Défi-6'!$C$2:$J$200,8,FALSE),\"\")","v":""},{"$f":"IFERROR(VLOOKUP($B134,'Défi-7'!$C$2:$J$200,8,FALSE),\"\")","v":""},137,null,"OK","OK","OK","OK","OK","OK","OK","OK","OK",null,{"$f":"'Classement auteurs'!$B134","v":132086002601},{"$f":"IF('Classement auteurs'!C134=\"\",\"\",'Classement auteurs'!C134)","v":32},{"$f":"IF('Classement auteurs'!D134=\"\",\"\",'Classement auteurs'!D134)","v":26},{"$f":"IF('Classement auteurs'!E134=\"\",\"\",'Classement auteurs'!E134)","v":""},{"$f":"IF('Classement auteurs'!F134=\"\",\"\",'Classement auteurs'!F134)","v":39},{"$f":"IF('Classement auteurs'!G134=\"\",\"\",'Classement auteurs'!G134)","v":40},{"$f":"IF('Classement auteurs'!H134=\"\",\"\",'Classement auteurs'!H134)","v":""},{"$f":"IF('Classement auteurs'!I134=\"\",\"\",'Classement auteurs'!I134)","v":""},{"$f":"IF('Classement auteurs'!J134=\"\",\"\",'Classement auteurs'!J134)","v":137}]
[null,132089000101,{"$f":"IFERROR(VLOOKUP($B135,'Défi-1'!$C$2:$J$200,8,FALSE),\"\")","v":36},{"$f":"IFERROR(VLOOKUP($B135,'Défi-2'!$C$2:$J$200,8,FALSE),\"\")","v":29},{"$f":"IFERROR(VLOOKUP($B135,'Défi-3'!$C$2:$J$200,8,FALSE),\"\")","v":""},{"$f":"IFERROR(VLOOKUP($B135,'Défi-4'!$C$2:$J$200,8,FALSE),\"\")","v":""},{"$f":"IFERROR(VLOOKUP($B135,'Défi-5'!$C$2:$J$200,8,FALSE),\"\")","v":36},{"$f":"IFERROR(VLOOKUP($B135,'Défi-6'!$C$2:$J$200,8,FALSE),\"\")","v":""},{"$f":"IFERROR(VLOOKUP($B135,'Défi-7'!$C$2:$J$200,8,FALSE),\"\")","v":34},135,null,"OK","OK","OK","OK","OK","OK","OK","OK","OK",null,{"$f":"'Classement auteurs'!$B135","v":132089000101},{"$f":"IF('Classement auteurs'!C135=\"\",\"\",'Classement auteurs'!C135)","v":36},{"$f":"IF('Classement auteurs'!D135=\"\",\"\",'Classement auteurs'!D135)","v":29},{"$f":"IF('Classement auteurs'!E135=\"\",\"\",'Classement auteurs'!E135)","v":""},{"$f":"IF('Classement auteurs'!F135=\"\",\"\",'Classement auteurs'!F135)","v":""},{"$f":"IF('Classement auteurs'!G135=\"\",\"\",'Classement auteurs'!G135)","v":36},{"$f":"IF('Classement auteurs'!H135=\"\",\"\",'Classement auteurs'!H135)","v":""},{"$f":"IF('Classement auteurs'!I135=\"\",\"\",'Classement auteurs'!I135)","v":34},{"$f":"IF('Classement auteurs'!J135=\"\",\"\",'Classement auteurs'!J135)","v":135}]
[null,131862000801,{"$f":"IFERROR(VLOOKUP($B136,'Défi-1'!$C$2:$J$200,8,FALSE),\"\")","v":51},{"$f":"IFERROR(VLOOKUP($B136,'Défi-2'!$C$2:$J$200,8,FALSE),\"\")","v":24},{"$f":"IFERROR(VLOOKUP($B136,'Défi-3'!$C$2:$J$200,8,FALSE),\"\")","v":36},{"$f":"IFERROR(VLOOKUP($B136,'Défi-4'!$C$2:$J$200,8,FALSE),\"\")","v":""},{"$f":"IFERROR(VLOOKUP($B136,'Défi-5'!$C$2:$J$200,8,FALSE),\"\")","v":""},{"$f":"IFERROR(VLOOKUP($B136,'Défi-6'!$C$2:$J$200,8,FALSE),\"\")","v":24},{"$f":"IFERROR(VLOOKUP($B136,'Défi-7'!$C$2:$J$200,8,FALSE),\"\")","v":""},135,null,"OK","OK","OK","OK","OK","OK","OK","OK","OK",null,{"$f":"'Classement auteurs'!$B136","v":131862000801},{"$f":"IF('Classement auteurs'!C136=\"\",\"\",'Classement auteurs'!C136)","v":51},{"$f":"IF('Classement auteurs'!D136=\"\",\"\",'Classement auteurs'!D136)","v":24},{"$f":"IF('Classement auteurs'!E136=\"\",\"\",'Classement auteurs'!E136)","v":36},{"$f":"IF('Classement auteurs'!F136=\"\",\"\",'Classement auteurs'!F136)","v":""},{"$f":"IF('Classement auteurs'!G136=\"\",\"\",'Classement auteurs'!G136)","v":""},{"$f":"IF('Classement auteurs'!H136=\"\",\"\",'Classement auteurs'!H136)","v":24},{"$f":"IF('Classement auteurs'!I136=\"\",\"\",'Classement auteurs'!I136)","v":""},{"$f":"IF('Classement auteurs'!J136=\"\",\"\",'Classement auteurs'!J136)","v":135}]
[null,130878013601,{"$f":"IFERROR(VLOOKUP($B137,'Défi-1'!$C$2:$J$200,8,FALSE),\"\")","v":""},{"$f":"IFERROR(VLOOKUP($B137,'Défi-2'!$C$2:$J$200,8,FALSE),\"\")","v":34},{"$f":"IFERROR(VLOOKUP($B137,'Défi-3'!$C$2:$J$200,8,FALSE),\"\")","v":""},{"$f":"IFERROR(VLOOKUP($B137,'Défi-4'!$C$2:$J$200,8,FALSE),\"\")","v":""},{"$f":"IFERROR(VLOOKUP($B137,'Défi-5'!$C$2:$J$200,8,FALSE),\"\")","v":34},{"$f":"IFERROR(VLOOKUP($B137,'Défi-6'!$C$2:$J$200,8,FALSE),\"\")","v":34},{"$f":"IFERROR(VLOOKUP($B137,'Défi-7'!$C$2:$J$200,8,FALSE),\"\")","v":33},135,null,"OK","OK","OK","OK","OK","OK","OK","OK","OK",null,{"$f":"'Classement auteurs'!$B137","v":130878013601},{"$f":"IF('Classement auteurs'!C137=\"\",\"\",'Classement auteurs'!C137)","v":""},{"$f":"IF('Classement auteurs'!D137=\"\",\"\",'Classement auteurs'!D137)","v":34},{"$f":"IF('Classement auteurs'!E137=\"\",\"\",'Classement auteurs'!E137)","v":""},{"$f":"IF('Classement auteurs'!F137=\"\",\"\",'Classement auteurs'!F137)","v":""},{"$f":"IF('Classement auteurs'!G137=\"\",\"\",'Classement auteurs'!G137)","v":34},{"$f":"IF('Classement auteurs'!H137=\"\",\"\",'Classement auteurs'!H137)","v":34},{"$f":"IF('Classement auteurs'!I137=\"\",\"\",'Classement auteurs'!I137)","v":33},{"$f":"IF('Classement auteurs'!J137=\"\",\"\",'Classement auteurs'!J137)","v":135}]
[null,132060002201,{"$f":"IFERROR(VLOOKUP($B138,'Défi-1'!$C$2:$J$200,8,FALSE),\"\")","v":41},{"$f":"IFERROR(VLOOKUP($B138,'Défi-2'!$C$2:$J$200,8,FALSE),\"\")","v":29},{"$f":"IFERROR(VLOOKUP($B138,'Défi-3'!$C$2:$J$200,8,FALSE),\"\")","v":36},{"$f":"IFERROR(VLOOKUP($B138,'Défi-4'!$C$2:$J$200,8,FALSE),\"\")","v":""},{"$f":"IFERROR(VLOOKUP($B138,'Défi-5'!$C$2:$J$200,8,FALSE),\"\")","v":""},{"$f":"IFERROR(VLOOKUP($B138,'Défi-6'!$C$2:$J$200,8,FALSE),\"\")","v":""},{"$f":"IFERROR(VLOOKUP($B138,'Défi-7'!$C$2:$J$200,8,FALSE),\"\")","v":27},133,null,"OK","OK","OK","OK","OK","OK","OK","OK","OK",null,{"$f":"'Classement auteurs'!$B138","v":132060002201},{"$f":"IF('Classement auteurs'!C138=\"\",\"\",'Classement auteurs'!C138)","v":41},{"$f":"IF('Classement auteurs'!D138=\"\",\"\",'Classement auteurs'!D138)","v":29},{"$f":"IF('Classement auteurs'!E138=\"\",\"\",'Classement auteurs'!E138)","v":36},{"$f":"IF('Classement auteurs'!F138=\"\",\"\",'Classement auteurs'!F138)","v":""},{"$f":"IF('Classement auteurs'!G138=\"\",\"\",'Classement auteurs'!G138)","v":""},{"$f":"IF('Classement auteurs'!H138=\"\",\"\",'Classement auteurs'!H138)","v":""},{"$f":"IF('Classement auteurs'!I138=\"\",\"\",'Classement auteurs'!I138)","v":27},{"$f":"IF('Classement auteurs'!J138=\"\",\"\",'Classement auteurs'!J138)","v":133}]
[null,132103000101,{"$f":"IFERROR(VLOOKUP($B139,'Défi-1'!$C$2:$J$200,8,FALSE),\"\")","v":""},{"$f":"IFERROR(VLOOKUP($B139,'Défi-2'!$C$2:$J$200,8,FALSE),\"\")","v":23},{"$f":"IFERROR(VLOOKUP($B139,'Défi-3'!$C$2:$J$200,8,FALSE),\"\")","v":55},{"$f":"IFERROR(VLOOKUP($B139,'Défi-4'!$C$2:$J$200,8,FALSE),\"\")","v":""},{"$f":"IFERROR(VLOOKUP($B139,'Défi-5'!$C$2:$J$200,8,FALSE),\"\")","v":""},{"$f":"IFERROR(VLOOKUP($B139,'Défi-6'!$C$2:$J$200,8,FALSE),\"\")","v":55},{"$f":"IFERROR(VLOOKUP($B139,'Défi-7'!$C$2:$J$200,8,FALSE),\"\")","v":""},133,null,"OK","OK","OK","OK","OK","OK","OK","OK","OK",null,{"$f":"'Classement auteurs'!$B139","v":132103000101},{"$f":"IF('Classement auteurs'!C139=\"\",\"\",'Classement auteurs'!C139)","v":""},{"$f":"IF('Classement auteurs'!D139=\"\",\"\",'Classement auteurs'!D139)","v":23},{"$f":"IF('Classement auteurs'!E139=\"\",\"\",'Classement auteurs'!E139)","v":55},{"$f":"IF('Classement auteurs'!F139=\"\",\"\",'Classement auteurs'!F139)","v":""},{"$f":"IF('Classement auteurs'!G139=\"\",\"\",'Classement auteurs'!G139)","v":""},{"$f":"IF('Classement auteurs'!H139=\"\",\"\",'Classement auteurs'!H139)","v":55},{"$f":"IF('Classement auteurs'!I139=\"\",\"\",'Classement auteurs'!I139)","v":""},{"$f":"IF('Classement auteurs'!J139=\"\",\"\",'Classement auteurs'!J139)","v":133}]
[null,131683006901,{"$f":"IFERROR(VLOOKUP($B140,'Défi-1'!$C$2:$J$200,8,FALSE),\"\")","v":""},{"$f":"IFERROR(VLOOKUP($B140,'Défi-2'!$C$2:$J$200,8,FALSE),\"\")","v":""},{"$f":"IFERROR(VLOOKUP($B140,'Défi-3'!$C$2:$J$200,8,FALSE),\"\")","v":51},{"$f":"IFERROR(VLOOKUP($B140,'Défi-4'!$C$2:$J$200,8,FALSE),\"\")","v":""},{"$f":"IFERROR(VLOOKUP($B140,'Défi-5'!$C$2:$J$200,8,FALSE),\"\")","v":41},{"$f":"IFERROR(VLOOKUP($B140,'Défi-6'!$C$2:$J$200,8,FALSE),\"\")","v":41},{"$f":"IFERROR(VLOOKUP($B140,'Défi-7'!$C$2:$J$200,8,FALSE),\"\")","v":""},{"$f":"SUM(C140:I140)","v":133},null,{"$f":"IF(B140=V140,\"OK\",\"KO\")","v":"OK"},{"$f":"IF(C140=W140,\"OK\",\"KO\")","v":"OK"},{"$f":"IF(D140=X140,\"OK\",\"KO\")","v":"OK"},{"$f":"IF(E140=Y140,\"OK\",\"KO\")","v":"OK"},{"$f":"IF(F140=Z140,\"OK\",\"KO\")","v":"OK"},{"$f":"IF(G140=AA140,\"OK\",\"KO\")","v":"OK"},{"$f":"IF(H140=AB140,\"OK\",\"KO\")","v":"OK"},{"$f":"IF(I140=AC140,\"OK\",\"KO\")","v":"OK"},{"$f":"IF(J140=AD140,\"OK\",\"KO\")","v":"OK"},null,{"$f":"'Classement auteurs'!$B140","v":131683006901},{"$f":"IF('Classement auteurs'!C140=\"\",\"\",'Classement auteurs'!C140)","v":""},{"$f":"IF('Classement auteurs'!D140=\"\",\"\",'Classement auteurs'!D140)","v":""},{"$f":"IF('Classement auteurs'!E140=\"\",\"\",'Classement auteurs'!E140)","v":51},{"$f":"IF('Classement auteurs'!F140=\"\",\"\",'Classement auteurs'!F140)","v":""},{"$f":"IF('Classement auteurs'!G140=\"\",\"\",'Classement auteurs'!G140)","v":41},{"$f":"IF('Classement auteurs'!H140=\"\",\"\",'Classement auteurs'!H140)","v":41},{"$f":"IF('Classement auteurs'!I140=\"\",\"\",'Classement auteurs'!I140)","v":""},{"$f":"IF('Classement auteurs'!J140=\"\",\"\",'Classement auteurs'!J140)","v":133}]
[null,132089000201,{"$f":"IFERROR(VLOOKUP($B141,'Défi-1'!$C$2:$J$200,8,FALSE),\"\")","v":24},{"$f":"IFERROR(VLOOKUP($B141,'Défi-2'!$C$2:$J$200,8,FALSE),\"\")","v":31},{"$f":"IFERROR(VLOOKUP($B141,'Défi-3'!$C$2:$J$200,8,FALSE),\"\")","v":43},{"$f":"IFERROR(VLOOKUP($B141,'Défi-4'!$C$2:$J$200,8,FALSE),\"\")","v":""},{"$f":"IFERROR(VLOOKUP($B141,'Défi-5'!$C$2:$J$200,8,FALSE),\"\")","v":""},{"$f":"IFERROR(VLOOKUP($B141,'Défi-6'!$C$2:$J$200,8,FALSE),\"\")","v":31},{"$f":"IFERROR(VLOOKUP($B141,'Défi-7'!$C$2:$J$200,8,FALSE),\"\")","v":""},129,null,"OK","OK","OK","OK","OK","OK","OK","OK","OK",null,{"$f":"'Classement auteurs'!$B141","v":132089000201},{"$f":"IF('Classement auteurs'!C141=\"\",\"\",'Classement auteurs'!C141)","v":24},{"$f":"IF('Classement auteurs'!D141=\"\",\"\",'Classement auteurs'!D141)","v":31},{"$f":"IF('Classement auteurs'!E141=\"\",\"\",'Classement auteurs'!E141)","v":43},{"$f":"IF('Classement auteurs'!F141=\"\",\"\",'Classement auteurs'!F141)","v":""},{"$f":"IF('Classement auteurs'!G141=\"\",\"\",'Classement auteurs'!G141)","v":""},{"$f":"IF('Classement auteurs'!H141=\"\",\"\",'Classement auteurs'!H141)","v":31},{"$f":"IF('Classement auteurs'!I141=\"\",\"\",'Classement auteurs'!I141)","v":""},{"$f":"IF('Classement auteurs'!J141=\"\",\"\",'Classement auteurs'!J141)","v":129}]
[null,132060000801,{"$f":"IFERROR(VLOOKUP($B142,'Défi-1'!$C$2:$J$200,8,FALSE),\"\")","v":30},{"$f":"IFERROR(VLOOKUP($B142,'Défi-2'!$C$2:$J$200,8,FALSE),\"\")","v":32},{"$f":"IFERROR(VLOOKUP($B142,'Défi-3'!$C$2:$J$200,8,FALSE),\"\")","v":33},{"$f":"IFERROR(VLOOKUP($B142,'Défi-4'!$C$2:$J$200,8,FALSE),\"\")","v":33},{"$f":"IFERROR(VLOOKUP($B142,'Défi-5'!$C$2:$J$200,8,FALSE),\"\")","v":""},{"$f":"IFERROR(VLOOKUP($B142,'Défi-6'!$C$2:$J$200,8,FALSE),\"\")","v":""},{"$f":"IFERROR(VLOOKUP($B142,'Défi-7'!$C$2:$J$200,8,FALSE),\"\")","v":""},128,null,"OK","OK","OK","OK","OK","OK","OK","OK","OK",null,{"$f":"'Classement auteurs'!$B142","v":132060000801},{"$f":"IF('Classement auteurs'!C142=\"\",\"\",'Classement auteurs'!C142)","v":30},{"$f":"IF('Classement auteurs'!D142=\"\",\"\",'Classement auteurs'!D142)","v":32},{"$f":"IF('Classement auteurs'!E142=\"\",\"\",'Classement auteurs'!E142)","v":33},{"$f":"IF('Classement auteurs'!F142=\"\",\"\",'Classement auteurs'!F142)","v":33},{"$f":"IF('Classement auteurs'!G142=\"\",\"\",'Classement auteurs'!G142)","v":""},{"$f":"IF('Classement auteurs'!H142=\"\",\"\",'Classement auteurs'!H142)","v":""},{"$f":"IF('Classement auteurs'!I142=\"\",\"\",'Classement auteurs'!I142)","v":""},{"$f":"IF('Classement auteurs'!J142=\"\",\"\",'Classement auteurs'!J142)","v":128}]
[null,132023000101,{"$f":"IFERROR(VLOOKUP($B143,'Défi-1'!$C$2:$J$200,8,FALSE),\"\")","v":""},{"$f":"IFERROR(VLOOKUP($B143,'Défi-2'!$C$2:$J$200,8,FALSE),\"\")","v":18},{"$f":"IFERROR(VLOOKUP($B143,'Défi-3'!$C$2:$J$200,8,FALSE),\"\")","v":38},{"$f":"IFERROR(VLOOKUP($B143,'Défi-4'!$C$2:$J$200,8,FALSE),\"\")","v":""},{"$f":"IFERROR(VLOOKUP($B143,'Défi-5'!$C$2:$J$200,8,FALSE),\"\")","v":36},{"$f":"IFERROR(VLOOKUP($B143,'Défi-6'!$C$2:$J$200,8,FALSE),\"\")","v":38},{"$f":"IFERROR(VLOOKUP($B143,'Défi-7'!$C$2:$J$200,8,FALSE),\"\")","v":""},130,null,"OK","OK","OK","OK","OK","OK","KO","OK","KO",null,{"$f":"'Classement auteurs'!$B143","v":132023000101},{"$f":"IF('Classement auteurs'!C143=\"\",\"\",'Classement auteurs'!C143)","v":""},{"$f":"IF('Classement auteurs'!D143=\"\",\"\",'Classement auteurs'!D143)","v":18},{"$f":"IF('Classement auteurs'!E143=\"\",\"\",'Classement auteurs'!E143)","v":38},{"$f":"IF('Classement auteurs'!F143=\"\",\"\",'Classement auteurs'!F143)","v":""},{"$f":"IF('Classement auteurs'!G143=\"\",\"\",'Classement auteurs'!G143)","v":36},{"$f":"IF('Classement auteurs'!H143=\"\",\"\",'Classement auteurs'!H143)","v":36},{"$f":"IF('Classement auteurs'!I143=\"\",\"\",'Classement auteurs'!I143)","v":""},{"$f":"IF('Classement auteurs'!J143=\"\",\"\",'Classement auteurs'!J143)","v":128}]
[null,132203000701,{"$f":"IFERROR(VLOOKUP($B144,'Défi-1'!$C$2:$J$200,8,FALSE),\"\")","v":""},{"$f":"IFERROR(VLOOKUP($B144,'Défi-2'!$C$2:$J$200,8,FALSE),\"\")","v":""},{"$f":"IFERROR(VLOOKUP($B144,'Défi-3'!$C$2:$J$200,8,FALSE),\"\")","v":40},{"$f":"IFERROR(VLOOKUP($B144,'Défi-4'!$C$2:$J$200,8,FALSE),\"\")","v":45},{"$f":"IFERROR(VLOOKUP($B144,'Défi-5'!$C$2:$J$200,8,FALSE),\"\")","v":40},{"$f":"IFERROR(VLOOKUP($B144,'Défi-6'!$C$2:$J$200,8,FALSE),\"\")","v":""},{"$f":"IFERROR(VLOOKUP($B144,'Défi-7'!$C$2:$J$200,8,FALSE),\"\")","v":""},125,null,"OK","OK","OK","OK","OK","OK","OK","OK","OK",null,{"$f":"'Classement auteurs'!$B144","v":132203000701},{"$f":"IF('Classement auteurs'!C144=\"\",\"\",'Classement auteurs'!C144)","v":""},{"$f":"IF('Classement auteurs'!D144=\"\",\"\",'Classement auteurs'!D144)","v":""},{"$f":"IF('Classement auteurs'!E144=\"\",\"\",'Classement auteurs'!E144)","v":40},{"$f":"IF('Classement auteurs'!F144=\"\",\"\",'Classement auteurs'!F144)","v":45},{"$f":"IF('Classement auteurs'!G144=\"\",\"\",'Classement auteurs'!G144)","v":40},{"$f":"IF('Classement auteurs'!H144=\"\",\"\",'Classement auteurs'!H144)","v":""},{"$f":"IF('Classement auteurs'!I144=\"\",\"\",'Classement auteurs'!I144)","v":""},{"$f":"IF('Classement auteurs'!J144=\"\",\"\",'Classement auteurs'!J144)","v":125}]
[null,130987012601,{"$f":"IFERROR(VLOOKUP($B145,'Défi-1'!$C$2:$J$200,8,FALSE),\"\")","v":""},{"$f":"IFERROR(VLOOKUP($B145,'Défi-2'!$C$2:$J$200,8,FALSE),\"\")","v":41},{"$f":"IFERROR(VLOOKUP($B145,'Défi-3'!$C$2:$J$200,8,FALSE),\"\")","v":42},{"$f":"IFERROR(VLOOKUP($B145,'Défi-4'!$C$2:$J$200,8,FALSE),\"\")","v":""},{"$f":"IFERROR(VLOOKUP($B145,'Défi-5'!$C$2:$J$200,8,FALSE),\"\")","v":""},{"$f":"IFERROR(VLOOKUP($B145,'Défi-6'!$C$2:$J$200,8,FALSE),\"\")","v":42},{"$f":"IFERROR(VLOOKUP($B145,'Défi-7'!$C$2:$J$200,8,FALSE),\"\")","v":""},125,null,"OK","OK","OK","OK","OK","OK","KO","OK","KO",null,{"$f":"'Classement auteurs'!$B145","v":130987012601},{"$f":"IF('Classement auteurs'!C145=\"\",\"\",'Classement auteurs'!C145)","v":""},{"$f":"IF('Classement auteurs'!D145=\"\",\"\",'Classement auteurs'!D145)","v":41},{"$f":"IF('Classement auteurs'!E145=\"\",\"\",'Classement auteurs'!E145)","v":42},{"$f":"IF('Classement auteurs'!F145=\"\",\"\",'Classement auteurs'!F145)","v":""},{"$f":"IF('Classement auteurs'!G145=\"\",\"\",'Classement auteurs'!G145)","v":""},{"$f":"IF('Classement auteurs'!H145=\"\",\"\",'Classement auteurs'!H145)","v":41},{"$f":"IF('Classement auteurs'!I145=\"\",\"\",'Classement auteurs'!I145)","v":""},{"$f":"IF('Classement auteurs'!J145=\"\",\"\",'Classement auteurs'!J145)","v":124}]
[null,131845003401,{"$f":"IFERROR(VLOOKUP($B146,'Défi-1'!$C$2:$J$200,8,FALSE),\"\")","v":28},{"$f":"IFERROR(VLOOKUP($B146,'Défi-2'!$C$2:$J$200,8,FALSE),\"\")","v":27},{"$f":"IFERROR(VLOOKUP($B146,'Défi-3'!$C$2:$J$200,8,FALSE),\"\")","v":""},{"$f":"IFERROR(VLOOKUP($B146,'Défi-4'!$C$2:$J$200,8,FALSE),\"\")","v":""},{"$f":"IFERROR(VLOOKUP($B146,'Défi-5'!$C$2:$J$200,8,FALSE),\"\")","v":40},{"$f":"IFERROR(VLOOKUP($B146,'Défi-6'!$C$2:$J$200,8,FALSE),\"\")","v":28},{"$f":"IFERROR(VLOOKUP($B146,'Défi-7'!$C$2:$J$200,8,FALSE),\"\")","v":""},123,null,"OK","OK","OK","OK","OK","OK","OK","OK","OK",null,{"$f":"'Classement auteurs'!$B146","v":131845003401},{"$f":"IF('Classement auteurs'!C146=\"\",\"\",'Classement auteurs'!C146)","v":28},{"$f":"IF('Classement auteurs'!D146=\"\",\"\",'Classement auteurs'!D146)","v":27},{"$f":"IF('Classement auteurs'!E146=\"\",\"\",'Classement auteurs'!E146)","v":""},{"$f":"IF('Classement auteurs'!F146=\"\",\"\",'Classement auteurs'!F146)","v":""},{"$f":"IF('Classement auteurs'!G146=\"\",\"\",'Classement auteurs'!G146)","v":40},{"$f":"IF('Classement auteurs'!H146=\"\",\"\",'Classement auteurs'!H146)","v":28},{"$f":"IF('Classement auteurs'!I146=\"\",\"\",'Classement auteurs'!I146)","v":""},{"$f":"IF('Classement auteurs'!J146=\"\",\"\",'Classement auteurs'!J146)","v":123}]
[null,131619005001,{"$f":"IFERROR(VLOOKUP($B147,'Défi-1'!$C$2:$J$200,8,FALSE),\"\")","v":""},{"$f":"IFERROR(VLOOKUP($B147,'Défi-2'!$C$2:$J$200,8,FALSE),\"\")","v":39},{"$f":"IFERROR(VLOOKUP($B147,'Défi-3'!$C$2:$J$200,8,FALSE),\"\")","v":""},{"$f":"IFERROR(VLOOKUP($B147,'Défi-4'!$C$2:$J$200,8,FALSE),\"\")","v":""},{"$f":"IFERROR(VLOOKUP($B147,'Défi-5'!$C$2:$J$200,8,FALSE),\"\")","v":45},{"$f":"IFERROR(VLOOKUP($B147,'Défi-6'!$C$2:$J$200,8,FALSE),\"\")","v":39},{"$f":"IFERROR(VLOOKUP($B147,'Défi-7'!$C$2:$J$200,8,FALSE),\"\")","v":""},123,null,"OK","OK","OK","OK","OK","OK","OK","OK","OK",null,{"$f":"'Classement auteurs'!$B147","v":131619005001},{"$f":"IF('Classement auteurs'!C147=\"\",\"\",'Classement auteurs'!C147)","v":""},{"$f":"IF('Classement auteurs'!D147=\"\",\"\",'Classement auteurs'!D147)","v":39},{"$f":"IF('Classement auteurs'!E147=\"\",\"\",'Classement auteurs'!E147)","v":""},{"$f":"IF('Classement auteurs'!F147=\"\",\"\",'Classement auteurs'!F147)","v":""},{"$f":"IF('Classement auteurs'!G147=\"\",\"\",'Classement auteurs'!G147)","v":45},{"$f":"IF('Classement auteurs'!H147=\"\",\"\",'Classement auteurs'!H147)","v":39},{"$f":"IF('Classement auteurs'!I147=\"\",\"\",'Classement auteurs'!I147)","v":""},{"$f":"IF('Classement auteurs'!J147=\"\",\"\",'Classement auteurs'!J147)","v":123}]
[null,130993012301,{"$f":"IFERROR(VLOOKUP($B148,'Défi-1'!$C$2:$J$200,8,FALSE),\"\")","v":""},{"$f":"IFERROR(VLOOKUP($B148,'Défi-2'!$C$2:$J$200,8,FALSE),\"\")","v":""},{"$f":"IFERROR(VLOOKUP($B148,'Défi-3'!$C$2:$J$200,8,FALSE),\"\")","v":""},{"$f":"IFERROR(VLOOKUP($B148,'Défi-4'!$C$2:$J$200,8,FALSE),\"\")","v":40},{"$f":"IFERROR(VLOOKUP($B148,'Défi-5'!$C$2:$J$200,8,FALSE),\"\")","v":41},{"$f":"IFERROR(VLOOKUP($B148,'Défi-6'!$C$2:$J$200,8,FALSE),\"\")","v":41},{"$f":"IFERROR(VLOOKUP($B148,'Défi-7'!$C$2:$J$200,8,FALSE),\"\")","v":""},122,null,"OK","OK","OK","OK","OK","OK","OK","OK","OK",null,{"$f":"'Classement auteurs'!$B148","v":130993012301},{"$f":"IF('Classement auteurs'!C148=\"\",\"\",'Classement auteurs'!C148)","v":""},{"$f":"IF('Classement auteurs'!D148=\"\",\"\",'Classement auteurs'!D148)","v":""},{"$f":"IF('Classement auteurs'!E148=\"\",\"\",'Classement auteurs'!E148)","v":""},{"$f":"IF('Classement auteurs'!F148=\"\",\"\",'Classement auteurs'!F148)","v":40},{"$f":"IF('Classement auteurs'!G148=\"\",\"\",'Classement auteurs'!G148)","v":41},{"$f":"IF('Classement auteurs'!H148=\"\",\"\",'Classement auteurs'!H148)","v":41},{"$f":"IF('Classement auteurs'!I148=\"\",\"\",'Classement auteurs'!I148)","v":""},{"$f":"IF('Classement auteurs'!J148=\"\",\"\",'Classement auteurs'!J148)","v":122}]
[null,131499008601,{"$f":"IFERROR(VLOOKUP($B149,'Défi-1'!$C$2:$J$200,8,FALSE),\"\")","v":""},{"$f":"IFERROR(VLOOKUP($B149,'Défi-2'!$C$2:$J$200,8,FALSE),\"\")","v":""},{"$f":"IFERROR(VLOOKUP($B149,'Défi-3'!$C$2:$J$200,8,FALSE),\"\")","v":40},{"$f":"IFERROR(VLOOKUP($B149,'Défi-4'!$C$2:$J$200,8,FALSE),\"\")","v":""},{"$f":"IFERROR(VLOOKUP($B149,'Défi-5'!$C$2:$J$200,8,FALSE),\"\")","v":41},{"$f":"IFERROR(VLOOKUP($B149,'Défi-6'!$C$2:$J$200,8,FALSE),\"\")","v":40},{"$f":"IFERROR(VLOOKUP($B149,'Défi-7'!$C$2:$J$200,8,FALSE),\"\")","v":""},121,null,"OK","OK","OK","OK","OK","OK","OK","OK","OK",null,{"$f":"'Classement auteurs'!$B149","v":131499008601},{"$f":"IF('Classement auteurs'!C149=\"\",\"\",'Classement auteurs'!C149)","v":""},{"$f":"IF('Classement auteurs'!D149=\"\",\"\",'Classement auteurs'!D149)","v":""},{"$f":"IF('Classement auteurs'!E149=\"\",\"\",'Classement auteurs'!E149)","v":40},{"$f":"IF('Classement auteurs'!F149=\"\",\"\",'Classement auteurs'!F149)","v":""},{"$f":"IF('Classement auteurs'!G149=\"\",\"\",'Classement auteurs'!G149)","v":41},{"$f":"IF('Classement auteurs'!H149=\"\",\"\",'Classement auteurs'!H149)","v":40},{"$f":"IF('Classement auteurs'!I149=\"\",\"\",'Classement auteurs'!I149)","v":""},{"$f":"IF('Classement auteurs'!J149=\"\",\"\",'Classement auteurs'!J149)","v":121}]
[null,131353007401,{"$f":"IFERROR(VLOOKUP($B150,'Défi-1'!$C$2:$J$200,8,FALSE),\"\")","v":""},{"$f":"IFERROR(VLOOKUP($B150,'Défi-2'!$C$2:$J$200,8,FALSE),\"\")","v":38},{"$f":"IFERROR(VLOOKUP($B150,'Défi-3'!$C$2:$J$200,8,FALSE),\"\")","v":40},{"$f":"IFERROR(VLOOKUP($B150,'Défi-4'!$C$2:$J$200,8,FALSE),\"\")","v":""},{"$f":"IFERROR(VLOOKUP($B150,'Défi-5'!$C$2:$J$200,8,FALSE),\"\")","v":41},{"$f":"IFERROR(VLOOKUP($B150,'Défi-6'!$C$2:$J$200,8,FALSE),\"\")","v":""},{"$f":"IFERROR(VLOOKUP($B150,'Défi-7'!$C$2:$J$200,8,FALSE),\"\")","v":""},119,null,"OK","OK","OK","OK","OK","OK","OK","OK","OK",null,{"$f":"'Classement auteurs'!$B150","v":131353007401},{"$f":"IF('Classement auteurs'!C150=\"\",\"\",'Classement auteurs'!C150)","v":""},{"$f":"IF('Classement auteurs'!D150=\"\",\"\",'Classement auteurs'!D150)","v":38},{"$f":"IF('Classement auteurs'!E150=\"\",\"\",'Classement auteurs'!E150)","v":40},{"$f":"IF('Classement auteurs'!F150=\"\",\"\",'Classement auteurs'!F150)","v":""},{"$f":"IF('Classement auteurs'!G150=\"\",\"\",'Classement auteurs'!G150)","v":41},{"$f":"IF('Classement auteurs'!H150=\"\",\"\",'Classement auteurs'!H150)","v":""},{"$f":"IF('Classement auteurs'!I150=\"\",\"\",'Classement auteurs'!I150)","v":""},{"$f":"IF('Classement auteurs'!J150=\"\",\"\",'Classement auteurs'!J150)","v":119}]
[null,131376017601,{"$f":"IFERROR(VLOOKUP($B151,'Défi-1'!$C$2:$J$200,8,FALSE),\"\")","v":32},{"$f":"IFERROR(VLOOKUP($B151,'Défi-2'!$C$2:$J$200,8,FALSE),\"\")","v":24},{"$f":"IFERROR(VLOOKUP($B151,'Défi-3'!$C$2:$J$200,8,FALSE),\"\")","v":""},{"$f":"IFERROR(VLOOKUP($B151,'Défi-4'!$C$2:$J$200,8,FALSE),\"\")","v":35},{"$f":"IFERROR(VLOOKUP($B151,'Défi-5'!$C$2:$J$200,8,FALSE),\"\")","v":""},{"$f":"IFERROR(VLOOKUP($B151,'Défi-6'!$C$2:$J$200,8,FALSE),\"\")","v":35},{"$f":"IFERROR(VLOOKUP($B151,'Défi-7'!$C$2:$J$200,8,FALSE),\"\")","v":""},126,null,"OK","OK","OK","OK","OK","OK","KO","OK","KO",null,{"$f":"'Classement auteurs'!$B151","v":131376017601},{"$f":"IF('Classement auteurs'!C151=\"\",\"\",'Classement auteurs'!C151)","v":32},{"$f":"IF('Classement auteurs'!D151=\"\",\"\",'Classement auteurs'!D151)","v":24},{"$f":"IF('Classement auteurs'!E151=\"\",\"\",'Classement auteurs'!E151)","v":""},{"$f":"IF('Classement auteurs'!F151=\"\",\"\",'Classement auteurs'!F151)","v":35},{"$f":"IF('Classement auteurs'!G151=\"\",\"\",'Classement auteurs'!G151)","v":""},{"$f":"IF('Classement auteurs'!H151=\"\",\"\",'Classement auteurs'!H151)","v":24},{"$f":"IF('Classement auteurs'!I151=\"\",\"\",'Classement auteurs'!I151)","v":""},{"$f":"IF('Classement auteurs'!J151=\"\",\"\",'Classement auteurs'!J151)","v":115}]
[null,130527009201,{"$f":"IFERROR(VLOOKUP($B152,'Défi-1'!$C$2:$J$200,8,FALSE),\"\")","v":""},{"$f":"IFERROR(VLOOKUP($B152,'Défi-2'!$C$2:$J$200,8,FALSE),\"\")","v":35},{"$f":"IFERROR(VLOOKUP($B152,'Défi-3'!$C$2:$J$200,8,FALSE),\"\")","v":""},{"$f":"IFERROR(VLOOKUP($B152,'Défi-4'!$C$2:$J$200,8,FALSE),\"\")","v":40},{"$f":"IFERROR(VLOOKUP($B152,'Défi-5'!$C$2:$J$200,8,FALSE),\"\")","v":""},{"$f":"IFERROR(VLOOKUP($B152,'Défi-6'!$C$2:$J$200,8,FALSE),\"\")","v":40},{"$f":"IFERROR(VLOOKUP($B152,'Défi-7'!$C$2:$J$200,8,FALSE),\"\")","v":""},115,null,"OK","OK","OK","OK","OK","OK","OK","OK","OK",null,{"$f":"'Classement auteurs'!$B152","v":130527009201},{"$f":"IF('Classement auteurs'!C152=\"\",\"\",'Classement auteurs'!C152)","v":""},{"$f":"IF('Classement auteurs'!D152=\"\",\"\",'Classement auteurs'!D152)","v":35},{"$f":"IF('Classement auteurs'!E152=\"\",\"\",'Classement auteurs'!E152)","v":""},{"$f":"IF('Classement auteurs'!F152=\"\",\"\",'Classement auteurs'!F152)","v":40},{"$f":"IF('Classement auteurs'!G152=\"\",\"\",'Classement auteurs'!G152)","v":""},{"$f":"IF('Classement auteurs'!H152=\"\",\"\",'Classement auteurs'!H152)","v":40},{"$f":"IF('Classement auteurs'!I152=\"\",\"\",'Classement auteurs'!I152)","v":""},{"$f":"IF('Classement auteurs'!J152=\"\",\"\",'Classement auteurs'!J152)","v":115}]
[null,131862001001,{"$f":"IFERROR(VLOOKUP($B153,'Défi-1'!$C$2:$J$200,8,FALSE),\"\")","v":""},{"$f":"IFERROR(VLOOKUP($B153,'Défi-2'!$C$2:$J$200,8,FALSE),\"\")","v":39},{"$f":"IFERROR(VLOOKUP($B153,'Défi-3'!$C$2:$J$200,8,FALSE),\"\")","v":36},{"$f":"IFERROR(VLOOKUP($B153,'Défi-4'!$C$2:$J$200,8,FALSE),\"\")","v":""},{"$f":"IFERROR(VLOOKUP($B153,'Défi-5'!$C$2:$J$200,8,FALSE),\"\")","v":""},{"$f":"IFERROR(VLOOKUP($B153,'Défi-6'!$C$2:$J$200,8,FALSE),\"\")","v":39},{"$f":"IFERROR(VLOOKUP($B153,'Défi-7'!$C$2:$J$200,8,FALSE),\"\")","v":""},114,null,"OK","OK","OK","OK","OK","OK","OK","OK","OK",null,{"$f":"'Classement auteurs'!$B153","v":131862001001},{"$f":"IF('Classement auteurs'!C153=\"\",\"\",'Classement auteurs'!C153)","v":""},{"$f":"IF('Classement auteurs'!D153=\"\",\"\",'Classement auteurs'!D153)","v":39},{"$f":"IF('Classement auteurs'!E153=\"\",\"\",'Classement auteurs'!E153)","v":36},{"$f":"IF('Classement auteurs'!F153=\"\",\"\",'Classement auteurs'!F153)","v":""},{"$f":"IF('Classement auteurs'!G153=\"\",\"\",'Classement auteurs'!G153)","v":""},{"$f":"IF('Classement auteurs'!H153=\"\",\"\",'Classement auteurs'!H153)","v":39},{"$f":"IF('Classement auteurs'!I153=\"\",\"\",'Classement auteurs'!I153)","v":""},{"$f":"IF('Classement auteurs'!J153=\"\",\"\",'Classement auteurs'!J153)","v":114}]
[null,131956005901,{"$f":"IFERROR(VLOOKUP($B154,'Défi-1'!$C$2:$J$200,8,FALSE),\"\")","v":43},{"$f":"IFERROR(VLOOKUP($B154,'Défi-2'!$C$2:$J$200,8,FALSE),\"\")","v":""},{"$f":"IFERROR(VLOOKUP($B154,'Défi-3'!$C$2:$J$200,8,FALSE),\"\")","v":""},{"$f":"IFERROR(VLOOKUP($B154,'Défi-4'!$C$2:$J$200,8,FALSE),\"\")","v":33},{"$f":"IFERROR(VLOOKUP($B154,'Défi-5'!$C$2:$J$200,8,FALSE),\"\")","v":37},{"$f":"IFERROR(VLOOKUP($B154,'Défi-6'!$C$2:$J$200,8,FALSE),\"\")","v":""},{"$f":"IFERROR(VLOOKUP($B154,'Défi-7'!$C$2:$J$200,8,FALSE),\"\")","v":""},113,null,"OK","OK","OK","OK","OK","OK","OK","OK","OK",null,{"$f":"'Classement auteurs'!$B154","v":131956005901},{"$f":"IF('Classement auteurs'!C154=\"\",\"\",'Classement auteurs'!C154)","v":43},{"$f":"IF('Classement auteurs'!D154=\"\",\"\",'Classement auteurs'!D154)","v":""},{"$f":"IF('Classement auteurs'!E154=\"\",\"\",'Classement auteurs'!E154)","v":""},{"$f":"IF('Classement auteurs'!F154=\"\",\"\",'Classement auteurs'!F154)","v":33},{"$f":"IF('Classement auteurs'!G154=\"\",\"\",'Classement auteurs'!G154)","v":37},{"$f":"IF('Classement auteurs'!H154=\"\",\"\",'Classement auteurs'!H154)","v":""},{"$f":"IF('Classement auteurs'!I154=\"\",\"\",'Classement auteurs'!I154)","v":""},{"$f":"IF('Classement auteurs'!J154=\"\",\"\",'Classement auteurs'!J154)","v":113}]
[null,130925008701,{"$f":"IFERROR(VLOOKUP($B155,'Défi-1'!$C$2:$J$200,8,FALSE),\"\")","v":""},{"$f":"IFERROR(VLOOKUP($B155,'Défi-2'!$C$2:$J$200,8,FALSE),\"\")","v":34},{"$f":"IFERROR(VLOOKUP($B155,'Défi-3'!$C$2:$J$200,8,FALSE),\"\")","v":39},{"$f":"IFERROR(VLOOKUP($B155,'Défi-4'!$C$2:$J$200,8,FALSE),\"\")","v":37},{"$f":"IFERROR(VLOOKUP($B155,'Défi-5'!$C$2:$J$200,8,FALSE),\"\")","v":""},{"$f":"IFERROR(VLOOKUP($B155,'Défi-6'!$C$2:$J$200,8,FALSE),\"\")","v":""},{"$f":"IFERROR(VLOOKUP($B155,'Défi-7'!$C$2:$J$200,8,FALSE),\"\")","v":""},110,null,"OK","OK","OK","OK","OK","OK","OK","OK","OK",null,{"$f":"'Classement auteurs'!$B155","v":130925008701},{"$f":"IF('Classement auteurs'!C155=\"\",\"\",'Classement auteurs'!C155)","v":""},{"$f":"IF('Classement auteurs'!D155=\"\",\"\",'Classement auteurs'!D155)","v":34},{"$f":"IF('Classement auteurs'!E155=\"\",\"\",'Classement auteurs'!E155)","v":39},{"$f":"IF('Classement auteurs'!F155=\"\",\"\",'Classement auteurs'!F155)","v":37},{"$f":"IF('Classement auteurs'!G155=\"\",\"\",'Classement auteurs'!G155)","v":""},{"$f":"IF('Classement auteurs'!H155=\"\",\"\",'Classement auteurs'!H155)","v":""},{"$f":"IF('Classement auteurs'!I155=\"\",\"\",'Classement auteurs'!I155)","v":""},{"$f":"IF('Classement auteurs'!J155=\"\",\"\",'Classement auteurs'!J155)","v":110}]
[null,131494002301,{"$f":"IFERROR(VLOOKUP($B156,'Défi-1'!$C$2:$J$200,8,FALSE),\"\")","v":""},{"$f":"IFERROR(VLOOKUP($B156,'Défi-2'!$C$2:$J$200,8,FALSE),\"\")","v":35},{"$f":"IFERROR(VLOOKUP($B156,'Défi-3'!$C$2:$J$200,8,FALSE),\"\")","v":32},{"$f":"IFERROR(VLOOKUP($B156,'Défi-4'!$C$2:$J$200,8,FALSE),\"\")","v":""},{"$f":"IFERROR(VLOOKUP($B156,'Défi-5'!$C$2:$J$200,8,FALSE),\"\")","v":42},{"$f":"IFERROR(VLOOKUP($B156,'Défi-6'!$C$2:$J$200,8,FALSE),\"\")","v":""},{"$f":"IFERROR(VLOOKUP($B156,'Défi-7'!$C$2:$J$200,8,FALSE),\"\")","v":""},109,null,"OK","OK","OK","OK","OK","OK","OK","OK","OK",null,{"$f":"'Classement auteurs'!$B156","v":131494002301},{"$f":"IF('Classement auteurs'!C156=\"\",\"\",'Classement auteurs'!C156)","v":""},{"$f":"IF('Classement auteurs'!D156=\"\",\"\",'Classement auteurs'!D156)","v":35},{"$f":"IF('Classement auteurs'!E156=\"\",\"\",'Classement auteurs'!E156)","v":32},{"$f":"IF('Classement auteurs'!F156=\"\",\"\",'Classement auteurs'!F156)","v":""},{"$f":"IF('Classement auteurs'!G156=\"\",\"\",'Classement auteurs'!G156)","v":42},{"$f":"IF('Classement auteurs'!H156=\"\",\"\",'Classement auteurs'!H156)","v":""},{"$f":"IF('Classement auteurs'!I156=\"\",\"\",'Classement auteurs'!I156)","v":""},{"$f":"IF('Classement auteurs'!J156=\"\",\"\",'Classement auteurs'!J156)","v":109}]
[null,130987025001,{"$f":"IFERROR(VLOOKUP($B157,'Défi-1'!$C$2:$J$200,8,FALSE),\"\")","v":""},{"$f":"IFERROR(VLOOKUP($B157,'Défi-2'!$C$2:$J$200,8,FALSE),\"\")","v":39},{"$f":"IFERROR(VLOOKUP($B157,'Défi-3'!$C$2:$J$200,8,FALSE),\"\")","v":""},{"$f":"IFERROR(VLOOKUP($B157,'Défi-4'!$C$2:$J$200,8,FALSE),\"\")","v":30},{"$f":"IFERROR(VLOOKUP($B157,'Défi-5'!$C$2:$J$200,8,FALSE),\"\")","v":40},{"$f":"IFERROR(VLOOKUP($B157,'Défi-6'!$C$2:$J$200,8,FALSE),\"\")","v":""},{"$f":"IFERROR(VLOOKUP($B157,'Défi-7'!$C$2:$J$200,8,FALSE),\"\")","v":""},109,null,"OK","OK","OK","OK","OK","OK","OK","OK","OK",null,{"$f":"'Classement auteurs'!$B157","v":130987025001},{"$f":"IF('Classement auteurs'!C157=\"\",\"\",'Classement auteurs'!C157)","v":""},{"$f":"IF('Classement auteurs'!D157=\"\",\"\",'Classement auteurs'!D157)","v":39},{"$f":"IF('Classement auteurs'!E157=\"\",\"\",'Classement auteurs'!E157)","v":""},{"$f":"IF('Classement auteurs'!F157=\"\",\"\",'Classement auteurs'!F157)","v":30},{"$f":"IF('Classement auteurs'!G157=\"\",\"\",'Classement auteurs'!G157)","v":40},{"$f":"IF('Classement auteurs'!H157=\"\",\"\",'Classement auteurs'!H157)","v":""},{"$f":"IF('Classement auteurs'!I157=\"\",\"\",'Classement auteurs'!I157)","v":""},{"$f":"IF('Classement auteurs'!J157=\"\",\"\",'Classement auteurs'!J157)","v":109}]
[null,130987026701,{"$f":"IFERROR(VLOOKUP($B158,'Défi-1'!$C$2:$J$200,8,FALSE),\"\")","v":""},{"$f":"IFERROR(VLOOKUP($B158,'Défi-2'!$C$2:$J$200,8,FALSE),\"\")","v":""},{"$f":"IFERROR(VLOOKUP($B158,'Défi-3'!$C$2:$J$200,8,FALSE),\"\")","v":32},{"$f":"IFERROR(VLOOKUP($B158,'Défi-4'!$C$2:$J$200,8,FALSE),\"\")","v":37},{"$f":"IFERROR(VLOOKUP($B158,'Défi-5'!$C$2:$J$200,8,FALSE),\"\")","v":40},{"$f":"IFERROR(VLOOKUP($B158,'Défi-6'!$C$2:$J$200,8,FALSE),\"\")","v":""},{"$f":"IFERROR(VLOOKUP($B158,'Défi-7'!$C$2:$J$200,8,FALSE),\"\")","v":""},109,null,"OK","OK","OK","OK","OK","OK","OK","OK","OK",null,{"$f":"'Classement auteurs'!$B158","v":130987026701},{"$f":"IF('Classement auteurs'!C158=\"\",\"\",'Classement auteurs'!C158)","v":""},{"$f":"IF('Classement auteurs'!D158=\"\",\"\",'Classement auteurs'!D158)","v":""},{"$f":"IF('Classement auteurs'!E158=\"\",\"\",'Classement auteurs'!E158)","v":32},{"$f":"IF('Classement auteurs'!F158=\"\",\"\",'Classement auteurs'!F158)","v":37},{"$f":"IF('Classement auteurs'!G158=\"\",\"\",'Classement auteurs'!G158)","v":40},{"$f":"IF('Classement auteurs'!H158=\"\",\"\",'Classement auteurs'!H158)","v":""},{"$f":"IF('Classement auteurs'!I158=\"\",\"\",'Classement auteurs'!I158)","v":""},{"$f":"IF('Classement auteurs'!J158=\"\",\"\",'Classement auteurs'!J158)","v":109}]
[null,131956006501,{"$f":"IFERROR(VLOOKUP($B159,'Défi-1'!$C$2:$J$200,8,FALSE),\"\")","v":""},{"$f":"IFERROR(VLOOKUP($B159,'Défi-2'!$C$2:$J$200,8,FALSE),\"\")","v":""},{"$f":"IFERROR(VLOOKUP($B159,'Défi-3'!$C$2:$J$200,8,FALSE),\"\")","v":34},{"$f":"IFERROR(VLOOKUP($B159,'Défi-4'!$C$2:$J$200,8,FALSE),\"\")","v":39},{"$f":"IFERROR(VLOOKUP($B159,'Défi-5'!$C$2:$J$200,8,FALSE),\"\")","v":36},{"$f":"IFERROR(VLOOKUP($B159,'Défi-6'!$C$2:$J$200,8,FALSE),\"\")","v":""},{"$f":"IFERROR(VLOOKUP($B159,'Défi-7'!$C$2:$J$200,8,FALSE),\"\")","v":""},109,null,"OK","OK","OK","OK","OK","OK","OK","OK","OK",null,{"$f":"'Classement auteurs'!$B159","v":131956006501},{"$f":"IF('Classement auteurs'!C159=\"\",\"\",'Classement auteurs'!C159)","v":""},{"$f":"IF('Classement auteurs'!D159=\"\",\"\",'Classement auteurs'!D159)","v":""},{"$f":"IF('Classement auteurs'!E159=\"\",\"\",'Classement auteurs'!E159)","v":34},{"$f":"IF('Classement auteurs'!F159=\"\",\"\",'Classement auteurs'!F159)","v":39},{"$f":"IF('Classement auteurs'!G159=\"\",\"\",'Classement auteurs'!G159)","v":36},{"$f":"IF('Classement auteurs'!H159=\"\",\"\",'Classement auteurs'!H159)","v":""},{"$f":"IF('Classement auteurs'!I159=\"\",\"\",'Classement auteurs'!I159)","v":""},{"$f":"IF('Classement auteurs'!J159=\"\",\"\",'Classement auteurs'!J159)","v":109}]
[null,131956006201,{"$f":"IFERROR(VLOOKUP($B160,'Défi-1'!$C$2:$J$200,8,FALSE),\"\")","v":""},{"$f":"IFERROR(VLOOKUP($B160,'Défi-2'!$C$2:$J$200,8,FALSE),\"\")","v":25},{"$f":"IFERROR(VLOOKUP($B160,'Défi-3'!$C$2:$J$200,8,FALSE),\"\")","v":39},{"$f":"IFERROR(VLOOKUP($B160,'Défi-4'!$C$2:$J$200,8,FALSE),\"\")","v":""},{"$f":"IFERROR(VLOOKUP($B160,'Défi-5'!$C$2:$J$200,8,FALSE),\"\")","v":""},{"$f":"IFERROR(VLOOKUP($B160,'Défi-6'!$C$2:$J$200,8,FALSE),\"\")","v":""},{"$f":"IFERROR(VLOOKUP($B160,'Défi-7'!$C$2:$J$200,8,FALSE),\"\")","v":44},108,null,"OK","OK","OK","OK","OK","OK","OK","OK","OK",null,{"$f":"'Classement auteurs'!$B160","v":131956006201},{"$f":"IF('Classement auteurs'!C160=\"\",\"\",'Classement auteurs'!C160)","v":""},{"$f":"IF('Classement auteurs'!D160=\"\",\"\",'Classement auteurs'!D160)","v":25},{"$f":"IF('Classement auteurs'!E160=\"\",\"\",'Classement auteurs'!E160)","v":39},{"$f":"IF('Classement auteurs'!F160=\"\",\"\",'Classement auteurs'!F160)","v":""},{"$f":"IF('Classement auteurs'!G160=\"\",\"\",'Classement auteurs'!G160)","v":""},{"$f":"IF('Classement auteurs'!H160=\"\",\"\",'Classement auteurs'!H160)","v":""},{"$f":"IF('Classement auteurs'!I160=\"\",\"\",'Classement auteurs'!I160)","v":44},{"$f":"IF('Classement auteurs'!J160=\"\",\"\",'Classement auteurs'!J160)","v":108}]
[null,130527011601,{"$f":"IFERROR(VLOOKUP($B161,'Défi-1'!$C$2:$J$200,8,FALSE),\"\")","v":39},{"$f":"IFERROR(VLOOKUP($B161,'Défi-2'!$C$2:$J$200,8,FALSE),\"\")","v":""},{"$f":"IFERROR(VLOOKUP($B161,'Défi-3'!$C$2:$J$200,8,FALSE),\"\")","v":37},{"$f":"IFERROR(VLOOKUP($B161,'Défi-4'!$C$2:$J$200,8,FALSE),\"\")","v":""},{"$f":"IFERROR(VLOOKUP($B161,'Défi-5'!$C$2:$J$200,8,FALSE),\"\")","v":""},{"$f":"IFERROR(VLOOKUP($B161,'Défi-6'!$C$2:$J$200,8,FALSE),\"\")","v":""},{"$f":"IFERROR(VLOOKUP($B161,'Défi-7'!$C$2:$J$200,8,FALSE),\"\")","v":31},107,null,"OK","OK","OK","OK","OK","OK","OK","OK","OK",null,{"$f":"'Classement auteurs'!$B161","v":130527011601},{"$f":"IF('Classement auteurs'!C161=\"\",\"\",'Classement auteurs'!C161)","v":39},{"$f":"IF('Classement auteurs'!D161=\"\",\"\",'Classement auteurs'!D161)","v":""},{"$f":"IF('Classement auteurs'!E161=\"\",\"\",'Classement auteurs'!E161)","v":37},{"$f":"IF('Classement auteurs'!F161=\"\",\"\",'Classement auteurs'!F161)","v":""},{"$f":"IF('Classement auteurs'!G161=\"\",\"\",'Classement auteurs'!G161)","v":""},{"$f":"IF('Classement auteurs'!H161=\"\",\"\",'Classement auteurs'!H161)","v":""},{"$f":"IF('Classement auteurs'!I161=\"\",\"\",'Classement auteurs'!I161)","v":31},{"$f":"IF('Classement auteurs'!J161=\"\",\"\",'Classement auteurs'!J161)","v":107}]
[null,131494003201,{"$f":"IFERROR(VLOOKUP($B162,'Défi-1'!$C$2:$J$200,8,FALSE),\"\")","v":""},{"$f":"IFERROR(VLOOKUP($B162,'Défi-2'!$C$2:$J$200,8,FALSE),\"\")","v":""},{"$f":"IFERROR(VLOOKUP($B162,'Défi-3'!$C$2:$J$200,8,FALSE),\"\")","v":39},{"$f":"IFERROR(VLOOKUP($B162,'Défi-4'!$C$2:$J$200,8,FALSE),\"\")","v":29},{"$f":"IFERROR(VLOOKUP($B162,'Défi-5'!$C$2:$J$200,8,FALSE),\"\")","v":""},{"$f":"IFERROR(VLOOKUP($B162,'Défi-6'!$C$2:$J$200,8,FALSE),\"\")","v":39},{"$f":"IFERROR(VLOOKUP($B162,'Défi-7'!$C$2:$J$200,8,FALSE),\"\")","v":""},107,null,"OK","OK","OK","OK","OK","OK","OK","OK","OK",null,{"$f":"'Classement auteurs'!$B162","v":131494003201},{"$f":"IF('Classement auteurs'!C162=\"\",\"\",'Classement auteurs'!C162)","v":""},{"$f":"IF('Classement auteurs'!D162=\"\",\"\",'Classement auteurs'!D162)","v":""},{"$f":"IF('Classement auteurs'!E162=\"\",\"\",'Classement auteurs'!E162)","v":39},{"$f":"IF('Classement auteurs'!F162=\"\",\"\",'Classement auteurs'!F162)","v":29},{"$f":"IF('Classement auteurs'!G162=\"\",\"\",'Classement auteurs'!G162)","v":""},{"$f":"IF('Classement auteurs'!H162=\"\",\"\",'Classement auteurs'!H162)","v":39},{"$f":"IF('Classement auteurs'!I162=\"\",\"\",'Classement auteurs'!I162)","v":""},{"$f":"IF('Classement auteurs'!J162=\"\",\"\",'Classement auteurs'!J162)","v":107}]
[null,130987016601,{"$f":"IFERROR(VLOOKUP($B163,'Défi-1'!$C$2:$J$200,8,FALSE),\"\")","v":""},{"$f":"IFERROR(VLOOKUP($B163,'Défi-2'!$C$2:$J$200,8,FALSE),\"\")","v":""},{"$f":"IFERROR(VLOOKUP($B163,'Défi-3'!$C$2:$J$200,8,FALSE),\"\")","v":""},{"$f":"IFERROR(VLOOKUP($B163,'Défi-4'!$C$2:$J$200,8,FALSE),\"\")","v":38},{"$f":"IFERROR(VLOOKUP($B163,'Défi-5'!$C$2:$J$200,8,FALSE),\"\")","v":30},{"$f":"IFERROR(VLOOKUP($B163,'Défi-6'!$C$2:$J$200,8,FALSE),\"\")","v":38},{"$f":"IFERROR(VLOOKUP($B163,'Défi-7'!$C$2:$J$200,8,FALSE),\"\")","v":""},106,null,"OK","OK","OK","OK","OK","OK","OK","OK","OK",null,{"$f":"'Classement auteurs'!$B163","v":130987016601},{"$f":"IF('Classement auteurs'!C163=\"\",\"\",'Classement auteurs'!C163)","v":""},{"$f":"IF('Classement auteurs'!D163=\"\",\"\",'Classement auteurs'!D163)","v":""},{"$f":"IF('Classement auteurs'!E163=\"\",\"\",'Classement auteurs'!E163)","v":""},{"$f":"IF('Classement auteurs'!F163=\"\",\"\",'Classement auteurs'!F163)","v":38},{"$f":"IF('Classement auteurs'!G163=\"\",\"\",'Classement auteurs'!G163)","v":30},{"$f":"IF('Classement auteurs'!H163=\"\",\"\",'Classement auteurs'!H163)","v":38},{"$f":"IF('Classement auteurs'!I163=\"\",\"\",'Classement auteurs'!I163)","v":""},{"$f":"IF('Classement auteurs'!J163=\"\",\"\",'Classement auteurs'!J163)","v":106}]
[null,131879001101,{"$f":"IFERROR(VLOOKUP($B164,'Défi-1'!$C$2:$J$200,8,FALSE),\"\")","v":""},{"$f":"IFERROR(VLOOKUP($B164,'Défi-2'!$C$2:$J$200,8,FALSE),\"\")","v":""},{"$f":"IFERROR(VLOOKUP($B164,'Défi-3'!$C$2:$J$200,8,FALSE),\"\")","v":""},{"$f":"IFERROR(VLOOKUP($B164,'Défi-4'!$C$2:$J$200,8,FALSE),\"\")","v":29},{"$f":"IFERROR(VLOOKUP($B164,'Défi-5'!$C$2:$J$200,8,FALSE),\"\")","v":38},{"$f":"IFERROR(VLOOKUP($B164,'Défi-6'!$C$2:$J$200,8,FALSE),\"\")","v":38},{"$f":"IFERROR(VLOOKUP($B164,'Défi-7'!$C$2:$J$200,8,FALSE),\"\")","v":""},105,null,"OK","OK","OK","OK","OK","OK","OK","OK","OK",null,{"$f":"'Classement auteurs'!$B164","v":131879001101},{"$f":"IF('Classement auteurs'!C164=\"\",\"\",'Classement auteurs'!C164)","v":""},{"$f":"IF('Classement auteurs'!D164=\"\",\"\",'Classement auteurs'!D164)","v":""},{"$f":"IF('Classement auteurs'!E164=\"\",\"\",'Classement auteurs'!E164)","v":""},{"$f":"IF('Classement auteurs'!F164=\"\",\"\",'Classement auteurs'!F164)","v":29},{"$f":"IF('Classement auteurs'!G164=\"\",\"\",'Classement auteurs'!G164)","v":38},{"$f":"IF('Classement auteurs'!H164=\"\",\"\",'Classement auteurs'!H164)","v":38},{"$f":"IF('Classement auteurs'!I164=\"\",\"\",'Classement auteurs'!I164)","v":""},{"$f":"IF('Classement auteurs'!J164=\"\",\"\",'Classement auteurs'!J164)","v":105}]
[null,130987028201,{"$f":"IFERROR(VLOOKUP($B165,'Défi-1'!$C$2:$J$200,8,FALSE),\"\")","v":42},{"$f":"IFERROR(VLOOKUP($B165,'Défi-2'!$C$2:$J$200,8,FALSE),\"\")","v":""},{"$f":"IFERROR(VLOOKUP($B165,'Défi-3'!$C$2:$J$200,8,FALSE),\"\")","v":""},{"$f":"IFERROR(VLOOKUP($B165,'Défi-4'!$C$2:$J$200,8,FALSE),\"\")","v":31},{"$f":"IFERROR(VLOOKUP($B165,'Défi-5'!$C$2:$J$200,8,FALSE),\"\")","v":""},{"$f":"IFERROR(VLOOKUP($B165,'Défi-6'!$C$2:$J$200,8,FALSE),\"\")","v":42},{"$f":"IFERROR(VLOOKUP($B165,'Défi-7'!$C$2:$J$200,8,FALSE),\"\")","v":""},115,null,"OK","OK","OK","OK","OK","OK","KO","OK","KO",null,{"$f":"'Classement auteurs'!$B165","v":130987028201},{"$f":"IF('Classement auteurs'!C165=\"\",\"\",'Classement auteurs'!C165)","v":42},{"$f":"IF('Classement auteurs'!D165=\"\",\"\",'Classement auteurs'!D165)","v":""},{"$f":"IF('Classement auteurs'!E165=\"\",\"\",'Classement auteurs'!E165)","v":""},{"$f":"IF('Classement auteurs'!F165=\"\",\"\",'Classement auteurs'!F165)","v":31},{"$f":"IF('Classement auteurs'!G165=\"\",\"\",'Classement auteurs'!G165)","v":""},{"$f":"IF('Classement auteurs'!H165=\"\",\"\",'Classement auteurs'!H165)","v":31},{"$f":"IF('Classement auteurs'!I165=\"\",\"\",'Classement auteurs'!I165)","v":""},{"$f":"IF('Classement auteurs'!J165=\"\",\"\",'Classement auteurs'!J165)","v":104}]
[null,130993015401,{"$f":"IFERROR(VLOOKUP($B166,'Défi-1'!$C$2:$J$200,8,FALSE),\"\")","v":42},{"$f":"IFERROR(VLOOKUP($B166,'Défi-2'!$C$2:$J$200,8,FALSE),\"\")","v":""},{"$f":"IFERROR(VLOOKUP($B166,'Défi-3'!$C$2:$J$200,8,FALSE),\"\")","v":""},{"$f":"IFERROR(VLOOKUP($B166,'Défi-4'!$C$2:$J$200,8,FALSE),\"\")","v":""},{"$f":"IFERROR(VLOOKUP($B166,'Défi-5'!$C$2:$J$200,8,FALSE),\"\")","v":31},{"$f":"IFERROR(VLOOKUP($B166,'Défi-6'!$C$2:$J$200,8,FALSE),\"\")","v":31},{"$f":"IFERROR(VLOOKUP($B166,'Défi-7'!$C$2:$J$200,8,FALSE),\"\")","v":""},104,null,"OK","OK","OK","OK","OK","OK","OK","OK","OK",null,{"$f":"'Classement auteurs'!$B166","v":130993015401},{"$f":"IF('Classement auteurs'!C166=\"\",\"\",'Classement auteurs'!C166)","v":42},{"$f":"IF('Classement auteurs'!D166=\"\",\"\",'Classement auteurs'!D166)","v":""},{"$f":"IF('Classement auteurs'!E166=\"\",\"\",'Classement auteurs'!E166)","v":""},{"$f":"IF('Classement auteurs'!F166=\"\",\"\",'Classement auteurs'!F166)","v":""},{"$f":"IF('Classement auteurs'!G166=\"\",\"\",'Classement auteurs'!G166)","v":31},{"$f":"IF('Classement auteurs'!H166=\"\",\"\",'Classement auteurs'!H166)","v":31},{"$f":"IF('Classement auteurs'!I166=\"\",\"\",'Classement auteurs'!I166)","v":""},{"$f":"IF('Classement auteurs'!J166=\"\",\"\",'Classement auteurs'!J166)","v":104}]
[null,131956005101,{"$f":"IFERROR(VLOOKUP($B167,'Défi-1'!$C$2:$J$200,8,FALSE),\"\")","v":34},{"$f":"IFERROR(VLOOKUP($B167,'Défi-2'!$C$2:$J$200,8,FALSE),\"\")","v":34},{"$f":"IFERROR(VLOOKUP($B167,'Défi-3'!$C$2:$J$200,8,FALSE),\"\")","v":""},{"$f":"IFERROR(VLOOKUP($B167,'Défi-4'!$C$2:$J$200,8,FALSE),\"\")","v":""},{"$f":"IFERROR(VLOOKUP($B167,'Défi-5'!$C$2:$J$200,8,FALSE),\"\")","v":""},{"$f":"IFERROR(VLOOKUP($B167,'Défi-6'!$C$2:$J$200,8,FALSE),\"\")","v":34},{"$f":"IFERROR(VLOOKUP($B167,'Défi-7'!$C$2:$J$200,8,FALSE),\"\")","v":""},102,null,"OK","OK","OK","OK","OK","OK","OK","OK","OK",null,{"$f":"'Classement auteurs'!$B167","v":131956005101},{"$f":"IF('Classement auteurs'!C167=\"\",\"\",'Classement auteurs'!C167)","v":34},{"$f":"IF('Classement auteurs'!D167=\"\",\"\",'Classement auteurs'!D167)","v":34},{"$f":"IF('Classement auteurs'!E167=\"\",\"\",'Classement auteurs'!E167)","v":""},{"$f":"IF('Classement auteurs'!F167=\"\",\"\",'Classement auteurs'!F167)","v":""},{"$f":"IF('Classement auteurs'!G167=\"\",\"\",'Classement auteurs'!G167)","v":""},{"$f":"IF('Classement auteurs'!H167=\"\",\"\",'Classement auteurs'!H167)","v":34},{"$f":"IF('Classement auteurs'!I167=\"\",\"\",'Classement auteurs'!I167)","v":""},{"$f":"IF('Classement auteurs'!J167=\"\",\"\",'Classement auteurs'!J167)","v":102}]
[null,131499010101,{"$f":"IFERROR(VLOOKUP($B168,'Défi-1'!$C$2:$J$200,8,FALSE),\"\")","v":37},{"$f":"IFERROR(VLOOKUP($B168,'Défi-2'!$C$2:$J$200,8,FALSE),\"\")","v":""},{"$f":"IFERROR(VLOOKUP($B168,'Défi-3'!$C$2:$J$200,8,FALSE),\"\")","v":""},{"$f":"IFERROR(VLOOKUP($B168,'Défi-4'!$C$2:$J$200,8,FALSE),\"\")","v":31},{"$f":"IFERROR(VLOOKUP($B168,'Défi-5'!$C$2:$J$200,8,FALSE),\"\")","v":34},{"$f":"IFERROR(VLOOKUP($B168,'Défi-6'!$C$2:$J$200,8,FALSE),\"\")","v":""},{"$f":"IFERROR(VLOOKUP($B168,'Défi-7'!$C$2:$J$200,8,FALSE),\"\")","v":""},102,null,"OK","OK","OK","OK","OK","OK","OK","OK","OK",null,{"$f":"'Classement auteurs'!$B168","v":131499010101},{"$f":"IF('Classement auteurs'!C168=\"\",\"\",'Classement auteurs'!C168)","v":37},{"$f":"IF('Classement auteurs'!D168=\"\",\"\",'Classement auteurs'!D168)","v":""},{"$f":"IF('Classement auteurs'!E168=\"\",\"\",'Classement auteurs'!E168)","v":""},{"$f":"IF('Classement auteurs'!F168=\"\",\"\",'Classement auteurs'!F168)","v":31},{"$f":"IF('Classement auteurs'!G168=\"\",\"\",'Classement auteurs'!G168)","v":34},{"$f":"IF('Classement auteurs'!H168=\"\",\"\",'Classement auteurs'!H168)","v":""},{"$f":"IF('Classement auteurs'!I168=\"\",\"\",'Classement auteurs'!I168)","v":""},{"$f":"IF('Classement auteurs'!J168=\"\",\"\",'Classement auteurs'!J168)","v":102}]
[null,131862005801,{"$f":"IFERROR(VLOOKUP($B169,'Défi-1'!$C$2:$J$200,8,FALSE),\"\")","v":""},{"$f":"IFERROR(VLOOKUP($B169,'Défi-2'!$C$2:$J$200,8,FALSE),\"\")","v":34},{"$f":"IFERROR(VLOOKUP($B169,'Défi-3'!$C$2:$J$200,8,FALSE),\"\")","v":33},{"$f":"IFERROR(VLOOKUP($B169,'Défi-4'!$C$2:$J$200,8,FALSE),\"\")","v":""},{"$f":"IFERROR(VLOOKUP($B169,'Défi-5'!$C$2:$J$200,8,FALSE),\"\")","v":""},{"$f":"IFERROR(VLOOKUP($B169,'Défi-6'!$C$2:$J$200,8,FALSE),\"\")","v":34},{"$f":"IFERROR(VLOOKUP($B169,'Défi-7'!$C$2:$J$200,8,FALSE),\"\")","v":""},101,null,"OK","OK","OK","OK","OK","OK","OK","OK","OK",null,{"$f":"'Classement auteurs'!$B169","v":131862005801},{"$f":"IF('Classement auteurs'!C169=\"\",\"\",'Classement auteurs'!C169)","v":""},{"$f":"IF('Classement auteurs'!D169=\"\",\"\",'Classement auteurs'!D169)","v":34},{"$f":"IF('Classement auteurs'!E169=\"\",\"\",'Classement auteurs'!E169)","v":33},{"$f":"IF('Classement auteurs'!F169=\"\",\"\",'Classement auteurs'!F169)","v":""},{"$f":"IF('Classement auteurs'!G169=\"\",\"\",'Classement auteurs'!G169)","v":""},{"$f":"IF('Classement auteurs'!H169=\"\",\"\",'Classement auteurs'!H169)","v":34},{"$f":"IF('Classement auteurs'!I169=\"\",\"\",'Classement auteurs'!I169)","v":""},{"$f":"IF('Classement auteurs'!J169=\"\",\"\",'Classement auteurs'!J169)","v":101}]
[null,131862001101,{"$f":"IFERROR(VLOOKUP($B170,'Défi-1'!$C$2:$J$200,8,FALSE),\"\")","v":29},{"$f":"IFERROR(VLOOKUP($B170,'Défi-2'!$C$2:$J$200,8,FALSE),\"\")","v":30},{"$f":"IFERROR(VLOOKUP($B170,'Défi-3'!$C$2:$J$200,8,FALSE),\"\")","v":41},{"$f":"IFERROR(VLOOKUP($B170,'Défi-4'!$C$2:$J$200,8,FALSE),\"\")","v":""},{"$f":"IFERROR(VLOOKUP($B170,'Défi-5'!$C$2:$J$200,8,FALSE),\"\")","v":""},{"$f":"IFERROR(VLOOKUP($B170,'Défi-6'!$C$2:$J$200,8,FALSE),\"\")","v":""},{"$f":"IFERROR(VLOOKUP($B170,'Défi-7'!$C$2:$J$200,8,FALSE),\"\")","v":""},100,null,"OK","OK","OK","OK","OK","OK","OK","OK","OK",null,{"$f":"'Classement auteurs'!$B170","v":131862001101},{"$f":"IF('Classement auteurs'!C170=\"\",\"\",'Classement auteurs'!C170)","v":29},{"$f":"IF('Classement auteurs'!D170=\"\",\"\",'Classement auteurs'!D170)","v":30},{"$f":"IF('Classement auteurs'!E170=\"\",\"\",'Classement auteurs'!E170)","v":41},{"$f":"IF('Classement auteurs'!F170=\"\",\"\",'Classement auteurs'!F170)","v":""},{"$f":"IF('Classement auteurs'!G170=\"\",\"\",'Classement auteurs'!G170)","v":""},{"$f":"IF('Classement auteurs'!H170=\"\",\"\",'Classement auteurs'!H170)","v":""},{"$f":"IF('Classement auteurs'!I170=\"\",\"\",'Classement auteurs'!I170)","v":""},{"$f":"IF('Classement auteurs'!J170=\"\",\"\",'Classement auteurs'!J170)","v":100}]
[null,132060002401,{"$f":"IFERROR(VLOOKUP($B171,'Défi-1'!$C$2:$J$200,8,FALSE),\"\")","v":35},{"$f":"IFERROR(VLOOKUP($B171,'Défi-2'!$C$2:$J$200,8,FALSE),\"\")","v":31},{"$f":"IFERROR(VLOOKUP($B171,'Défi-3'!$C$2:$J$200,8,FALSE),\"\")","v":32},{"$f":"IFERROR(VLOOKUP($B171,'Défi-4'!$C$2:$J$200,8,FALSE),\"\")","v":""},{"$f":"IFERROR(VLOOKUP($B171,'Défi-5'!$C$2:$J$200,8,FALSE),\"\")","v":""},{"$f":"IFERROR(VLOOKUP($B171,'Défi-6'!$C$2:$J$200,8,FALSE),\"\")","v":""},{"$f":"IFERROR(VLOOKUP($B171,'Défi-7'!$C$2:$J$200,8,FALSE),\"\")","v":""},98,null,"OK","OK","OK","OK","OK","OK","OK","OK","OK",null,{"$f":"'Classement auteurs'!$B171","v":132060002401},{"$f":"IF('Classement auteurs'!C171=\"\",\"\",'Classement auteurs'!C171)","v":35},{"$f":"IF('Classement auteurs'!D171=\"\",\"\",'Classement auteurs'!D171)","v":31},{"$f":"IF('Classement auteurs'!E171=\"\",\"\",'Classement auteurs'!E171)","v":32},{"$f":"IF('Classement auteurs'!F171=\"\",\"\",'Classement auteurs'!F171)","v":""},{"$f":"IF('Classement auteurs'!G171=\"\",\"\",'Classement auteurs'!G171)","v":""},{"$f":"IF('Classement auteurs'!H171=\"\",\"\",'Classement auteurs'!H171)","v":""},{"$f":"IF('Classement auteurs'!I171=\"\",\"\",'Classement auteurs'!I171)","v":""},{"$f":"IF('Classement auteurs'!J171=\"\",\"\",'Classement auteurs'!J171)","v":98}]
[null,130878015801,{"$f":"IFERROR(VLOOKUP($B172,'Défi-1'!$C$2:$J$200,8,FALSE),\"\")","v":""},{"$f":"IFERROR(VLOOKUP($B172,'Défi-2'!$C$2:$J$200,8,FALSE),\"\")","v":""},{"$f":"IFERROR(VLOOKUP($B172,'Défi-3'!$C$2:$J$200,8,FALSE),\"\")","v":""},{"$f":"IFERROR(VLOOKUP($B172,'Défi-4'!$C$2:$J$200,8,FALSE),\"\")","v":""},{"$f":"IFERROR(VLOOKUP($B172,'Défi-5'!$C$2:$J$200,8,FALSE),\"\")","v":49},{"$f":"IFERROR(VLOOKUP($B172,'Défi-6'!$C$2:$J$200,8,FALSE),\"\")","v":49},{"$f":"IFERROR(VLOOKUP($B172,'Défi-7'!$C$2:$J$200,8,FALSE),\"\")","v":""},98,null,"OK","OK","OK","OK","OK","OK","OK","OK","OK",null,{"$f":"'Classement auteurs'!$B172","v":130878015801},{"$f":"IF('Classement auteurs'!C172=\"\",\"\",'Classement auteurs'!C172)","v":""},{"$f":"IF('Classement auteurs'!D172=\"\",\"\",'Classement auteurs'!D172)","v":""},{"$f":"IF('Classement auteurs'!E172=\"\",\"\",'Classement auteurs'!E172)","v":""},{"$f":"IF('Classement auteurs'!F172=\"\",\"\",'Classement auteurs'!F172)","v":""},{"$f":"IF('Classement auteurs'!G172=\"\",\"\",'Classement auteurs'!G172)","v":49},{"$f":"IF('Classement auteurs'!H172=\"\",\"\",'Classement auteurs'!H172)","v":49},{"$f":"IF('Classement auteurs'!I172=\"\",\"\",'Classement auteurs'!I172)","v":""},{"$f":"IF('Classement auteurs'!J172=\"\",\"\",'Classement auteurs'!J172)","v":98}]
[null,131823008701,{"$f":"IFERROR(VLOOKUP($B173,'Défi-1'!$C$2:$J$200,8,FALSE),\"\")","v":""},{"$f":"IFERROR(VLOOKUP($B173,'Défi-2'!$C$2:$J$200,8,FALSE),\"\")","v":41},{"$f":"IFERROR(VLOOKUP($B173,'Défi-3'!$C$2:$J$200,8,FALSE),\"\")","v":28},{"$f":"IFERROR(VLOOKUP($B173,'Défi-4'!$C$2:$J$200,8,FALSE),\"\")","v":""},{"$f":"IFERROR(VLOOKUP($B173,'Défi-5'!$C$2:$J$200,8,FALSE),\"\")","v":""},{"$f":"IFERROR(VLOOKUP($B173,'Défi-6'!$C$2:$J$200,8,FALSE),\"\")","v":41},{"$f":"IFERROR(VLOOKUP($B173,'Défi-7'!$C$2:$J$200,8,FALSE),\"\")","v":""},110,null,"OK","OK","OK","OK","OK","OK","KO","OK","KO",null,{"$f":"'Classement auteurs'!$B173","v":131823008701},{"$f":"IF('Classement auteurs'!C173=\"\",\"\",'Classement auteurs'!C173)","v":""},{"$f":"IF('Classement auteurs'!D173=\"\",\"\",'Classement auteurs'!D173)","v":41},{"$f":"IF('Classement auteurs'!E173=\"\",\"\",'Classement auteurs'!E173)","v":28},{"$f":"IF('Classement auteurs'!F173=\"\",\"\",'Classement auteurs'!F173)","v":""},{"$f":"IF('Classement auteurs'!G173=\"\",\"\",'Classement auteurs'!G173)","v":""},{"$f":"IF('Classement auteurs'!H173=\"\",\"\",'Classement auteurs'!H173)","v":28},{"$f":"IF('Classement auteurs'!I173=\"\",\"\",'Classement auteurs'!I173)","v":""},{"$f":"IF('Classement auteurs'!J173=\"\",\"\",'Classement auteurs'!J173)","v":97}]
[null,131823004201,{"$f":"IFERROR(VLOOKUP($B174,'Défi-1'!$C$2:$J$200,8,FALSE),\"\")","v":""},{"$f":"IFERROR(VLOOKUP($B174,'Défi-2'!$C$2:$J$200,8,FALSE),\"\")","v":""},{"$f":"IFERROR(VLOOKUP($B174,'Défi-3'!$C$2:$J$200,8,FALSE),\"\")","v":34},{"$f":"IFERROR(VLOOKUP($B174,'Défi-4'!$C$2:$J$200,8,FALSE),\"\")","v":29},{"$f":"IFERROR(VLOOKUP($B174,'Défi-5'!$C$2:$J$200,8,FALSE),\"\")","v":34},{"$f":"IFERROR(VLOOKUP($B174,'Défi-6'!$C$2:$J$200,8,FALSE),\"\")","v":""},{"$f":"IFERROR(VLOOKUP($B174,'Défi-7'!$C$2:$J$200,8,FALSE),\"\")","v":""},97,null,"OK","OK","OK","OK","OK","OK","OK","OK","OK",null,{"$f":"'Classement auteurs'!$B174","v":131823004201},{"$f":"IF('Classement auteurs'!C174=\"\",\"\",'Classement auteurs'!C174)","v":""},{"$f":"IF('Classement auteurs'!D174=\"\",\"\",'Classement auteurs'!D174)","v":""},{"$f":"IF('Classement auteurs'!E174=\"\",\"\",'Classement auteurs'!E174)","v":34},{"$f":"IF('Classement auteurs'!F174=\"\",\"\",'Classement auteurs'!F174)","v":29},{"$f":"IF('Classement auteurs'!G174=\"\",\"\",'Classement auteurs'!G174)","v":34},{"$f":"IF('Classement auteurs'!H174=\"\",\"\",'Classement auteurs'!H174)","v":""},{"$f":"IF('Classement auteurs'!I174=\"\",\"\",'Classement auteurs'!I174)","v":""},{"$f":"IF('Classement auteurs'!J174=\"\",\"\",'Classement auteurs'!J174)","v":97}]
[null,130993013301,{"$f":"IFERROR(VLOOKUP($B175,'Défi-1'!$C$2:$J$200,8,FALSE),\"\")","v":""},{"$f":"IFERROR(VLOOKUP($B175,'Défi-2'!$C$2:$J$200,8,FALSE),\"\")","v":""},{"$f":"IFERROR(VLOOKUP($B175,'Défi-3'!$C$2:$J$200,8,FALSE),\"\")","v":""},{"$f":"IFERROR(VLOOKUP($B175,'Défi-4'!$C$2:$J$200,8,FALSE),\"\")","v":47},{"$f":"IFERROR(VLOOKUP($B175,'Défi-5'!$C$2:$J$200,8,FALSE),\"\")","v":""},{"$f":"IFERROR(VLOOKUP($B175,'Défi-6'!$C$2:$J$200,8,FALSE),\"\")","v":47},{"$f":"IFERROR(VLOOKUP($B175,'Défi-7'!$C$2:$J$200,8,FALSE),\"\")","v":""},94,null,"OK","OK","OK","OK","OK","OK","OK","OK","OK",null,{"$f":"'Classement auteurs'!$B175","v":130993013301},{"$f":"IF('Classement auteurs'!C175=\"\",\"\",'Classement auteurs'!C175)","v":""},{"$f":"IF('Classement auteurs'!D175=\"\",\"\",'Classement auteurs'!D175)","v":""},{"$f":"IF('Classement auteurs'!E175=\"\",\"\",'Classement auteurs'!E175)","v":""},{"$f":"IF('Classement auteurs'!F175=\"\",\"\",'Classement auteurs'!F175)","v":47},{"$f":"IF('Classement auteurs'!G175=\"\",\"\",'Classement auteurs'!G175)","v":""},{"$f":"IF('Classement auteurs'!H175=\"\",\"\",'Classement auteurs'!H175)","v":47},{"$f":"IF('Classement auteurs'!I175=\"\",\"\",'Classement auteurs'!I175)","v":""},{"$f":"IF('Classement auteurs'!J175=\"\",\"\",'Classement auteurs'!J175)","v":94}]
[null,131683002601,{"$f":"IFERROR(VLOOKUP($B176,'Défi-1'!$C$2:$J$200,8,FALSE),\"\")","v":""},{"$f":"IFERROR(VLOOKUP($B176,'Défi-2'!$C$2:$J$200,8,FALSE),\"\")","v":37},{"$f":"IFERROR(VLOOKUP($B176,'Défi-3'!$C$2:$J$200,8,FALSE),\"\")","v":""},{"$f":"IFERROR(VLOOKUP($B176,'Défi-4'!$C$2:$J$200,8,FALSE),\"\")","v":56},{"$f":"IFERROR(VLOOKUP($B176,'Défi-5'!$C$2:$J$200,8,FALSE),\"\")","v":""},{"$f":"IFERROR(VLOOKUP($B176,'Défi-6'!$C$2:$J$200,8,FALSE),\"\")","v":""},{"$f":"IFERROR(VLOOKUP($B176,'Défi-7'!$C$2:$J$200,8,FALSE),\"\")","v":""},93,null,"OK","OK","OK","OK","OK","OK","OK","OK","OK",null,{"$f":"'Classement auteurs'!$B176","v":131683002601},{"$f":"IF('Classement auteurs'!C176=\"\",\"\",'Classement auteurs'!C176)","v":""},{"$f":"IF('Classement auteurs'!D176=\"\",\"\",'Classement auteurs'!D176)","v":37},{"$f":"IF('Classement auteurs'!E176=\"\",\"\",'Classement auteurs'!E176)","v":""},{"$f":"IF('Classement auteurs'!F176=\"\",\"\",'Classement auteurs'!F176)","v":56},{"$f":"IF('Classement auteurs'!G176=\"\",\"\",'Classement auteurs'!G176)","v":""},{"$f":"IF('Classement auteurs'!H176=\"\",\"\",'Classement auteurs'!H176)","v":""},{"$f":"IF('Classement auteurs'!I176=\"\",\"\",'Classement auteurs'!I176)","v":""},{"$f":"IF('Classement auteurs'!J176=\"\",\"\",'Classement auteurs'!J176)","v":93}]
[null,131499011001,{"$f":"IFERROR(VLOOKUP($B177,'Défi-1'!$C$2:$J$200,8,FALSE),\"\")","v":""},{"$f":"IFERROR(VLOOKUP($B177,'Défi-2'!$C$2:$J$200,8,FALSE),\"\")","v":""},{"$f":"IFERROR(VLOOKUP($B177,'Défi-3'!$C$2:$J$200,8,FALSE),\"\")","v":""},{"$f":"IFERROR(VLOOKUP($B177,'Défi-4'!$C$2:$J$200,8,FALSE),\"\")","v":42},{"$f":"IFERROR(VLOOKUP($B177,'Défi-5'!$C$2:$J$200,8,FALSE),\"\")","v":51},{"$f":"IFERROR(VLOOKUP($B177,'Défi-6'!$C$2:$J$200,8,FALSE),\"\")","v":""},{"$f":"IFERROR(VLOOKUP($B177,'Défi-7'!$C$2:$J$200,8,FALSE),\"\")","v":""},93,null,"OK","OK","OK","OK","OK","OK","OK","OK","OK",null,{"$f":"'Classement auteurs'!$B177","v":131499011001},{"$f":"IF('Classement auteurs'!C177=\"\",\"\",'Classement auteurs'!C177)","v":""},{"$f":"IF('Classement auteurs'!D177=\"\",\"\",'Classement auteurs'!D177)","v":""},{"$f":"IF('Classement auteurs'!E177=\"\",\"\",'Classement auteurs'!E177)","v":""},{"$f":"IF('Classement auteurs'!F177=\"\",\"\",'Classement auteurs'!F177)","v":42},{"$f":"IF('Classement auteurs'!G177=\"\",\"\",'Classement auteurs'!G177)","v":51},{"$f":"IF('Classement auteurs'!H177=\"\",\"\",'Classement auteurs'!H177)","v":""},{"$f":"IF('Classement auteurs'!I177=\"\",\"\",'Classement auteurs'!I177)","v":""},{"$f":"IF('Classement auteurs'!J177=\"\",\"\",'Classement auteurs'!J177)","v":93}]
[null,132089000301,{"$f":"IFERROR(VLOOKUP($B178,'Défi-1'!$C$2:$J$200,8,FALSE),\"\")","v":31},{"$f":"IFERROR(VLOOKUP($B178,'Défi-2'!$C$2:$J$200,8,FALSE),\"\")","v":""},{"$f":"IFERROR(VLOOKUP($B178,'Défi-3'!$C$2:$J$200,8,FALSE),\"\")","v":31},{"$f":"IFERROR(VLOOKUP($B178,'Défi-4'!$C$2:$J$200,8,FALSE),\"\")","v":30},{"$f":"IFERROR(VLOOKUP($B178,'Défi-5'!$C$2:$J$200,8,FALSE),\"\")","v":""},{"$f":"IFERROR(VLOOKUP($B178,'Défi-6'!$C$2:$J$200,8,FALSE),\"\")","v":""},{"$f":"IFERROR(VLOOKUP($B178,'Défi-7'!$C$2:$J$200,8,FALSE),\"\")","v":""},92,null,"OK","OK","OK","OK","OK","OK","OK","OK","OK",null,{"$f":"'Classement auteurs'!$B178","v":132089000301},{"$f":"IF('Classement auteurs'!C178=\"\",\"\",'Classement auteurs'!C178)","v":31},{"$f":"IF('Classement auteurs'!D178=\"\",\"\",'Classement auteurs'!D178)","v":""},{"$f":"IF('Classement auteurs'!E178=\"\",\"\",'Classement auteurs'!E178)","v":31},{"$f":"IF('Classement auteurs'!F178=\"\",\"\",'Classement auteurs'!F178)","v":30},{"$f":"IF('Classement auteurs'!G178=\"\",\"\",'Classement auteurs'!G178)","v":""},{"$f":"IF('Classement auteurs'!H178=\"\",\"\",'Classement auteurs'!H178)","v":""},{"$f":"IF('Classement auteurs'!I178=\"\",\"\",'Classement auteurs'!I178)","v":""},{"$f":"IF('Classement auteurs'!J178=\"\",\"\",'Classement auteurs'!J178)","v":92}]
[null,131683006501,{"$f":"IFERROR(VLOOKUP($B179,'Défi-1'!$C$2:$J$200,8,FALSE),\"\")","v":""},{"$f":"IFERROR(VLOOKUP($B179,'Défi-2'!$C$2:$J$200,8,FALSE),\"\")","v":28},{"$f":"IFERROR(VLOOKUP($B179,'Défi-3'!$C$2:$J$200,8,FALSE),\"\")","v":34},{"$f":"IFERROR(VLOOKUP($B179,'Défi-4'!$C$2:$J$200,8,FALSE),\"\")","v":30},{"$f":"IFERROR(VLOOKUP($B179,'Défi-5'!$C$2:$J$200,8,FALSE),\"\")","v":""},{"$f":"IFERROR(VLOOKUP($B179,'Défi-6'!$C$2:$J$200,8,FALSE),\"\")","v":""},{"$f":"IFERROR(VLOOKUP($B179,'Défi-7'!$C$2:$J$200,8,FALSE),\"\")","v":""},92,null,"OK","OK","OK","OK","OK","OK","OK","OK","OK",null,{"$f":"'Classement auteurs'!$B179","v":131683006501},{"$f":"IF('Classement auteurs'!C179=\"\",\"\",'Classement auteurs'!C179)","v":""},{"$f":"IF('Classement auteurs'!D179=\"\",\"\",'Classement auteurs'!D179)","v":28},{"$f":"IF('Classement auteurs'!E179=\"\",\"\",'Classement auteurs'!E179)","v":34},{"$f":"IF('Classement auteurs'!F179=\"\",\"\",'Classement auteurs'!F179)","v":30},{"$f":"IF('Classement auteurs'!G179=\"\",\"\",'Classement auteurs'!G179)","v":""},{"$f":"IF('Classement auteurs'!H179=\"\",\"\",'Classement auteurs'!H179)","v":""},{"$f":"IF('Classement auteurs'!I179=\"\",\"\",'Classement auteurs'!I179)","v":""},{"$f":"IF('Classement auteurs'!J179=\"\",\"\",'Classement auteurs'!J179)","v":92}]
[null,132023002201,{"$f":"IFERROR(VLOOKUP($B180,'Défi-1'!$C$2:$J$200,8,FALSE),\"\")","v":""},{"$f":"IFERROR(VLOOKUP($B180,'Défi-2'!$C$2:$J$200,8,FALSE),\"\")","v":""},{"$f":"IFERROR(VLOOKUP($B180,'Défi-3'!$C$2:$J$200,8,FALSE),\"\")","v":""},{"$f":"IFERROR(VLOOKUP($B180,'Défi-4'!$C$2:$J$200,8,FALSE),\"\")","v":49},{"$f":"IFERROR(VLOOKUP($B180,'Défi-5'!$C$2:$J$200,8,FALSE),\"\")","v":43},{"$f":"IFERROR(VLOOKUP($B180,'Défi-6'!$C$2:$J$200,8,FALSE),\"\")","v":""},{"$f":"IFERROR(VLOOKUP($B180,'Défi-7'!$C$2:$J$200,8,FALSE),\"\")","v":""},92,null,"OK","OK","OK","OK","OK","OK","OK","OK","OK",null,{"$f":"'Classement auteurs'!$B180","v":132023002201},{"$f":"IF('Classement auteurs'!C180=\"\",\"\",'Classement auteurs'!C180)","v":""},{"$f":"IF('Classement auteurs'!D180=\"\",\"\",'Classement auteurs'!D180)","v":""},{"$f":"IF('Classement auteurs'!E180=\"\",\"\",'Classement auteurs'!E180)","v":""},{"$f":"IF('Classement auteurs'!F180=\"\",\"\",'Classement auteurs'!F180)","v":49},{"$f":"IF('Classement auteurs'!G180=\"\",\"\",'Classement auteurs'!G180)","v":43},{"$f":"IF('Classement auteurs'!H180=\"\",\"\",'Classement auteurs'!H180)","v":""},{"$f":"IF('Classement auteurs'!I180=\"\",\"\",'Classement auteurs'!I180)","v":""},{"$f":"IF('Classement auteurs'!J180=\"\",\"\",'Classement auteurs'!J180)","v":92}]
[null,131956006001,{"$f":"IFERROR(VLOOKUP($B181,'Défi-1'!$C$2:$J$200,8,FALSE),\"\")","v":50},{"$f":"IFERROR(VLOOKUP($B181,'Défi-2'!$C$2:$J$200,8,FALSE),\"\")","v":""},{"$f":"IFERROR(VLOOKUP($B181,'Défi-3'!$C$2:$J$200,8,FALSE),\"\")","v":""},{"$f":"IFERROR(VLOOKUP($B181,'Défi-4'!$C$2:$J$200,8,FALSE),\"\")","v":""},{"$f":"IFERROR(VLOOKUP($B181,'Défi-5'!$C$2:$J$200,8,FALSE),\"\")","v":""},{"$f":"IFERROR(VLOOKUP($B181,'Défi-6'!$C$2:$J$200,8,FALSE),\"\")","v":""},{"$f":"IFERROR(VLOOKUP($B181,'Défi-7'!$C$2:$J$200,8,FALSE),\"\")","v":39},89,null,"OK","OK","OK","OK","OK","OK","OK","OK","OK",null,{"$f":"'Classement auteurs'!$B181","v":131956006001},{"$f":"IF('Classement auteurs'!C181=\"\",\"\",'Classement auteurs'!C181)","v":50},{"$f":"IF('Classement auteurs'!D181=\"\",\"\",'Classement auteurs'!D181)","v":""},{"$f":"IF('Classement auteurs'!E181=\"\",\"\",'Classement auteurs'!E181)","v":""},{"$f":"IF('Classement auteurs'!F181=\"\",\"\",'Classement auteurs'!F181)","v":""},{"$f":"IF('Classement auteurs'!G181=\"\",\"\",'Classement auteurs'!G181)","v":""},{"$f":"IF('Classement auteurs'!H181=\"\",\"\",'Classement auteurs'!H181)","v":""},{"$f":"IF('Classement auteurs'!I181=\"\",\"\",'Classement auteurs'!I181)","v":39},{"$f":"IF('Classement auteurs'!J181=\"\",\"\",'Classement auteurs'!J181)","v":89}]
[null,132193000601,{"$f":"IFERROR(VLOOKUP($B182,'Défi-1'!$C$2:$J$200,8,FALSE),\"\")","v":""},{"$f":"IFERROR(VLOOKUP($B182,'Défi-2'!$C$2:$J$200,8,FALSE),\"\")","v":""},{"$f":"IFERROR(VLOOKUP($B182,'Défi-3'!$C$2:$J$200,8,FALSE),\"\")","v":44},{"$f":"IFERROR(VLOOKUP($B182,'Défi-4'!$C$2:$J$200,8,FALSE),\"\")","v":""},{"$f":"IFERROR(VLOOKUP($B182,'Défi-5'!$C$2:$J$200,8,FALSE),\"\")","v":""},{"$f":"IFERROR(VLOOKUP($B182,'Défi-6'!$C$2:$J$200,8,FALSE),\"\")","v":44},{"$f":"IFERROR(VLOOKUP($B182,'Défi-7'!$C$2:$J$200,8,FALSE),\"\")","v":""},88,null,"OK","OK","OK","OK","OK","OK","OK","OK","OK",null,{"$f":"'Classement auteurs'!$B182","v":132193000601},{"$f":"IF('Classement auteurs'!C182=\"\",\"\",'Classement auteurs'!C182)","v":""},{"$f":"IF('Classement auteurs'!D182=\"\",\"\",'Classement auteurs'!D182)","v":""},{"$f":"IF('Classement auteurs'!E182=\"\",\"\",'Classement auteurs'!E182)","v":44},{"$f":"IF('Classement auteurs'!F182=\"\",\"\",'Classement auteurs'!F182)","v":""},{"$f":"IF('Classement auteurs'!G182=\"\",\"\",'Classement auteurs'!G182)","v":""},{"$f":"IF('Classement auteurs'!H182=\"\",\"\",'Classement auteurs'!H182)","v":44},{"$f":"IF('Classement auteurs'!I182=\"\",\"\",'Classement auteurs'!I182)","v":""},{"$f":"IF('Classement auteurs'!J182=\"\",\"\",'Classement auteurs'!J182)","v":88}]
[null,130925010501,{"$f":"IFERROR(VLOOKUP($B183,'Défi-1'!$C$2:$J$200,8,FALSE),\"\")","v":""},{"$f":"IFERROR(VLOOKUP($B183,'Défi-2'!$C$2:$J$200,8,FALSE),\"\")","v":""},{"$f":"IFERROR(VLOOKUP($B183,'Défi-3'!$C$2:$J$200,8,FALSE),\"\")","v":46},{"$f":"IFERROR(VLOOKUP($B183,'Défi-4'!$C$2:$J$200,8,FALSE),\"\")","v":41},{"$f":"IFERROR(VLOOKUP($B183,'Défi-5'!$C$2:$J$200,8,FALSE),\"\")","v":""},{"$f":"IFERROR(VLOOKUP($B183,'Défi-6'!$C$2:$J$200,8,FALSE),\"\")","v":""},{"$f":"IFERROR(VLOOKUP($B183,'Défi-7'!$C$2:$J$200,8,FALSE),\"\")","v":""},87,null,"OK","OK","OK","OK","OK","OK","OK","OK","OK",null,{"$f":"'Classement auteurs'!$B183","v":130925010501},{"$f":"IF('Classement auteurs'!C183=\"\",\"\",'Classement auteurs'!C183)","v":""},{"$f":"IF('Classement auteurs'!D183=\"\",\"\",'Classement auteurs'!D183)","v":""},{"$f":"IF('Classement auteurs'!E183=\"\",\"\",'Classement auteurs'!E183)","v":46},{"$f":"IF('Classement auteurs'!F183=\"\",\"\",'Classement auteurs'!F183)","v":41},{"$f":"IF('Classement auteurs'!G183=\"\",\"\",'Classement auteurs'!G183)","v":""},{"$f":"IF('Classement auteurs'!H183=\"\",\"\",'Classement auteurs'!H183)","v":""},{"$f":"IF('Classement auteurs'!I183=\"\",\"\",'Classement auteurs'!I183)","v":""},{"$f":"IF('Classement auteurs'!J183=\"\",\"\",'Classement auteurs'!J183)","v":87}]
[null,130993015101,{"$f":"IFERROR(VLOOKUP($B184,'Défi-1'!$C$2:$J$200,8,FALSE),\"\")","v":18},{"$f":"IFERROR(VLOOKUP($B184,'Défi-2'!$C$2:$J$200,8,FALSE),\"\")","v":""},{"$f":"IFERROR(VLOOKUP($B184,'Défi-3'!$C$2:$J$200,8,FALSE),\"\")","v":""},{"$f":"IFERROR(VLOOKUP($B184,'Défi-4'!$C$2:$J$200,8,FALSE),\"\")","v":43},{"$f":"IFERROR(VLOOKUP($B184,'Défi-5'!$C$2:$J$200,8,FALSE),\"\")","v":""},{"$f":"IFERROR(VLOOKUP($B184,'Défi-6'!$C$2:$J$200,8,FALSE),\"\")","v":43},{"$f":"IFERROR(VLOOKUP($B184,'Défi-7'!$C$2:$J$200,8,FALSE),\"\")","v":""},104,null,"OK","OK","OK","OK","OK","OK","KO","OK","KO",null,{"$f":"'Classement auteurs'!$B184","v":130993015101},{"$f":"IF('Classement auteurs'!C184=\"\",\"\",'Classement auteurs'!C184)","v":18},{"$f":"IF('Classement auteurs'!D184=\"\",\"\",'Classement auteurs'!D184)","v":""},{"$f":"IF('Classement auteurs'!E184=\"\",\"\",'Classement auteurs'!E184)","v":""},{"$f":"IF('Classement auteurs'!F184=\"\",\"\",'Classement auteurs'!F184)","v":43},{"$f":"IF('Classement auteurs'!G184=\"\",\"\",'Classement auteurs'!G184)","v":""},{"$f":"IF('Classement auteurs'!H184=\"\",\"\",'Classement auteurs'!H184)","v":18},{"$f":"IF('Classement auteurs'!I184=\"\",\"\",'Classement auteurs'!I184)","v":""},{"$f":"IF('Classement auteurs'!J184=\"\",\"\",'Classement auteurs'!J184)","v":79}]
[null,131494002101,{"$f":"IFERROR(VLOOKUP($B185,'Défi-1'!$C$2:$J$200,8,FALSE),\"\")","v":""},{"$f":"IFERROR(VLOOKUP($B185,'Défi-2'!$C$2:$J$200,8,FALSE),\"\")","v":29},{"$f":"IFERROR(VLOOKUP($B185,'Défi-3'!$C$2:$J$200,8,FALSE),\"\")","v":""},{"$f":"IFERROR(VLOOKUP($B185,'Défi-4'!$C$2:$J$200,8,FALSE),\"\")","v":25},{"$f":"IFERROR(VLOOKUP($B185,'Défi-5'!$C$2:$J$200,8,FALSE),\"\")","v":""},{"$f":"IFERROR(VLOOKUP($B185,'Défi-6'!$C$2:$J$200,8,FALSE),\"\")","v":25},{"$f":"IFERROR(VLOOKUP($B185,'Défi-7'!$C$2:$J$200,8,FALSE),\"\")","v":""},79,null,"OK","OK","OK","OK","OK","OK","OK","OK","OK",null,{"$f":"'Classement auteurs'!$B185","v":131494002101},{"$f":"IF('Classement auteurs'!C185=\"\",\"\",'Classement auteurs'!C185)","v":""},{"$f":"IF('Classement auteurs'!D185=\"\",\"\",'Classement auteurs'!D185)","v":29},{"$f":"IF('Classement auteurs'!E185=\"\",\"\",'Classement auteurs'!E185)","v":""},{"$f":"IF('Classement auteurs'!F185=\"\",\"\",'Classement auteurs'!F185)","v":25},{"$f":"IF('Classement auteurs'!G185=\"\",\"\",'Classement auteurs'!G185)","v":""},{"$f":"IF('Classement auteurs'!H185=\"\",\"\",'Classement auteurs'!H185)","v":25},{"$f":"IF('Classement auteurs'!I185=\"\",\"\",'Classement auteurs'!I185)","v":""},{"$f":"IF('Classement auteurs'!J185=\"\",\"\",'Classement auteurs'!J185)","v":79}]
[null,131683005001,{"$f":"IFERROR(VLOOKUP($B186,'Défi-1'!$C$2:$J$200,8,FALSE),\"\")","v":""},{"$f":"IFERROR(VLOOKUP($B186,'Défi-2'!$C$2:$J$200,8,FALSE),\"\")","v":""},{"$f":"IFERROR(VLOOKUP($B186,'Défi-3'!$C$2:$J$200,8,FALSE),\"\")","v":39},{"$f":"IFERROR(VLOOKUP($B186,'Défi-4'!$C$2:$J$200,8,FALSE),\"\")","v":""},{"$f":"IFERROR(VLOOKUP($B186,'Défi-5'!$C$2:$J$200,8,FALSE),\"\")","v":""},{"$f":"IFERROR(VLOOKUP($B186,'Défi-6'!$C$2:$J$200,8,FALSE),\"\")","v":39},{"$f":"IFERROR(VLOOKUP($B186,'Défi-7'!$C$2:$J$200,8,FALSE),\"\")","v":""},78,null,"OK","OK","OK","OK","OK","OK","OK","OK","OK",null,{"$f":"'Classement auteurs'!$B186","v":131683005001},{"$f":"IF('Classement auteurs'!C186=\"\",\"\",'Classement auteurs'!C186)","v":""},{"$f":"IF('Classement auteurs'!D186=\"\",\"\",'Classement auteurs'!D186)","v":""},{"$f":"IF('Classement auteurs'!E186=\"\",\"\",'Classement auteurs'!E186)","v":39},{"$f":"IF('Classement auteurs'!F186=\"\",\"\",'Classement auteurs'!F186)","v":""},{"$f":"IF('Classement auteurs'!G186=\"\",\"\",'Classement auteurs'!G186)","v":""},{"$f":"IF('Classement auteurs'!H186=\"\",\"\",'Classement auteurs'!H186)","v":39},{"$f":"IF('Classement auteurs'!I186=\"\",\"\",'Classement auteurs'!I186)","v":""},{"$f":"IF('Classement auteurs'!J186=\"\",\"\",'Classement auteurs'!J186)","v":78}]
[null,131376018001,{"$f":"IFERROR(VLOOKUP($B187,'Défi-1'!$C$2:$J$200,8,FALSE),\"\")","v":38},{"$f":"IFERROR(VLOOKUP($B187,'Défi-2'!$C$2:$J$200,8,FALSE),\"\")","v":38},{"$f":"IFERROR(VLOOKUP($B187,'Défi-3'!$C$2:$J$200,8,FALSE),\"\")","v":""},{"$f":"IFERROR(VLOOKUP($B187,'Défi-4'!$C$2:$J$200,8,FALSE),\"\")","v":""},{"$f":"IFERROR(VLOOKUP($B187,'Défi-5'!$C$2:$J$200,8,FALSE),\"\")","v":""},{"$f":"IFERROR(VLOOKUP($B187,'Défi-6'!$C$2:$J$200,8,FALSE),\"\")","v":""},{"$f":"IFERROR(VLOOKUP($B187,'Défi-7'!$C$2:$J$200,8,FALSE),\"\")","v":""},76,null,"OK","OK","OK","OK","OK","OK","OK","OK","OK",null,{"$f":"'Classement auteurs'!$B187","v":131376018001},{"$f":"IF('Classement auteurs'!C187=\"\",\"\",'Classement auteurs'!C187)","v":38},{"$f":"IF('Classement auteurs'!D187=\"\",\"\",'Classement auteurs'!D187)","v":38},{"$f":"IF('Classement auteurs'!E187=\"\",\"\",'Classement auteurs'!E187)","v":""},{"$f":"IF('Classement auteurs'!F187=\"\",\"\",'Classement auteurs'!F187)","v":""},{"$f":"IF('Classement auteurs'!G187=\"\",\"\",'Classement auteurs'!G187)","v":""},{"$f":"IF('Classement auteurs'!H187=\"\",\"\",'Classement auteurs'!H187)","v":""},{"$f":"IF('Classement auteurs'!I187=\"\",\"\",'Classement auteurs'!I187)","v":""},{"$f":"IF('Classement auteurs'!J187=\"\",\"\",'Classement auteurs'!J187)","v":76}]
[null,131845000201,{"$f":"IFERROR(VLOOKUP($B188,'Défi-1'!$C$2:$J$200,8,FALSE),\"\")","v":""},{"$f":"IFERROR(VLOOKUP($B188,'Défi-2'!$C$2:$J$200,8,FALSE),\"\")","v":""},{"$f":"IFERROR(VLOOKUP($B188,'Défi-3'!$C$2:$J$200,8,FALSE),\"\")","v":""},{"$f":"IFERROR(VLOOKUP($B188,'Défi-4'!$C$2:$J$200,8,FALSE),\"\")","v":18},{"$f":"IFERROR(VLOOKUP($B188,'Défi-5'!$C$2:$J$200,8,FALSE),\"\")","v":40},{"$f":"IFERROR(VLOOKUP($B188,'Défi-6'!$C$2:$J$200,8,FALSE),\"\")","v":""},{"$f":"IFERROR(VLOOKUP($B188,'Défi-7'!$C$2:$J$200,8,FALSE),\"\")","v":""},58,null,"OK","OK","OK","OK","OK","OK","KO","OK","KO",null,{"$f":"'Classement auteurs'!$B188","v":131845000201},{"$f":"IF('Classement auteurs'!C188=\"\",\"\",'Classement auteurs'!C188)","v":""},{"$f":"IF('Classement auteurs'!D188=\"\",\"\",'Classement auteurs'!D188)","v":""},{"$f":"IF('Classement auteurs'!E188=\"\",\"\",'Classement auteurs'!E188)","v":""},{"$f":"IF('Classement auteurs'!F188=\"\",\"\",'Classement auteurs'!F188)","v":18},{"$f":"IF('Classement auteurs'!G188=\"\",\"\",'Classement auteurs'!G188)","v":40},{"$f":"IF('Classement auteurs'!H188=\"\",\"\",'Classement auteurs'!H188)","v":18},{"$f":"IF('Classement auteurs'!I188=\"\",\"\",'Classement auteurs'!I188)","v":""},{"$f":"IF('Classement auteurs'!J188=\"\",\"\",'Classement auteurs'!J188)","v":76}]
[null,130993013801,{"$f":"IFERROR(VLOOKUP($B189,'Défi-1'!$C$2:$J$200,8,FALSE),\"\")","v":""},{"$f":"IFERROR(VLOOKUP($B189,'Défi-2'!$C$2:$J$200,8,FALSE),\"\")","v":""},{"$f":"IFERROR(VLOOKUP($B189,'Défi-3'!$C$2:$J$200,8,FALSE),\"\")","v":""},{"$f":"IFERROR(VLOOKUP($B189,'Défi-4'!$C$2:$J$200,8,FALSE),\"\")","v":""},{"$f":"IFERROR(VLOOKUP($B189,'Défi-5'!$C$2:$J$200,8,FALSE),\"\")","v":38},{"$f":"IFERROR(VLOOKUP($B189,'Défi-6'!$C$2:$J$200,8,FALSE),\"\")","v":38},{"$f":"IFERROR(VLOOKUP($B189,'Défi-7'!$C$2:$J$200,8,FALSE),\"\")","v":""},76,null,"OK","OK","OK","OK","OK","OK","OK","OK","OK",null,{"$f":"'Classement auteurs'!$B189","v":130993013801},{"$f":"IF('Classement auteurs'!C189=\"\",\"\",'Classement auteurs'!C189)","v":""},{"$f":"IF('Classement auteurs'!D189=\"\",\"\",'Classement auteurs'!D189)","v":""},{"$f":"IF('Classement auteurs'!E189=\"\",\"\",'Classement auteurs'!E189)","v":""},{"$f":"IF('Classement auteurs'!F189=\"\",\"\",'Classement auteurs'!F189)","v":""},{"$f":"IF('Classement auteurs'!G189=\"\",\"\",'Classement auteurs'!G189)","v":38},{"$f":"IF('Classement auteurs'!H189=\"\",\"\",'Classement auteurs'!H189)","v":38},{"$f":"IF('Classement auteurs'!I189=\"\",\"\",'Classement auteurs'!I189)","v":""},{"$f":"IF('Classement auteurs'!J189=\"\",\"\",'Classement auteurs'!J189)","v":76}]
[null,132084000201,{"$f":"IFERROR(VLOOKUP($B190,'Défi-1'!$C$2:$J$200,8,FALSE),\"\")","v":""},{"$f":"IFERROR(VLOOKUP($B190,'Défi-2'!$C$2:$J$200,8,FALSE),\"\")","v":""},{"$f":"IFERROR(VLOOKUP($B190,'Défi-3'!$C$2:$J$200,8,FALSE),\"\")","v":""},{"$f":"IFERROR(VLOOKUP($B190,'Défi-4'!$C$2:$J$200,8,FALSE),\"\")","v":""},{"$f":"IFERROR(VLOOKUP($B190,'Défi-5'!$C$2:$J$200,8,FALSE),\"\")","v":38},{"$f":"IFERROR(VLOOKUP($B190,'Défi-6'!$C$2:$J$200,8,FALSE),\"\")","v":38},{"$f":"IFERROR(VLOOKUP($B190,'Défi-7'!$C$2:$J$200,8,FALSE),\"\")","v":""},76,null,"OK","OK","OK","OK","OK","OK","OK","OK","OK",null,{"$f":"'Classement auteurs'!$B190","v":132084000201},{"$f":"IF('Classement auteurs'!C190=\"\",\"\",'Classement auteurs'!C190)","v":""},{"$f":"IF('Classement auteurs'!D190=\"\",\"\",'Classement auteurs'!D190)","v":""},{"$f":"IF('Classement auteurs'!E190=\"\",\"\",'Classement auteurs'!E190)","v":""},{"$f":"IF('Classement auteurs'!F190=\"\",\"\",'Classement auteurs'!F190)","v":""},{"$f":"IF('Classement auteurs'!G190=\"\",\"\",'Classement auteurs'!G190)","v":38},{"$f":"IF('Classement auteurs'!H190=\"\",\"\",'Classement auteurs'!H190)","v":38},{"$f":"IF('Classement auteurs'!I190=\"\",\"\",'Classement auteurs'!I190)","v":""},{"$f":"IF('Classement auteurs'!J190=\"\",\"\",'Classement auteurs'!J190)","v":76}]
[null,131956000401,{"$f":"IFERROR(VLOOKUP($B191,'Défi-1'!$C$2:$J$200,8,FALSE),\"\")","v":33},{"$f":"IFERROR(VLOOKUP($B191,'Défi-2'!$C$2:$J$200,8,FALSE),\"\")","v":""},{"$f":"IFERROR(VLOOKUP($B191,'Défi-3'!$C$2:$J$200,8,FALSE),\"\")","v":""},{"$f":"IFERROR(VLOOKUP($B191,'Défi-4'!$C$2:$J$200,8,FALSE),\"\")","v":""},{"$f":"IFERROR(VLOOKUP($B191,'Défi-5'!$C$2:$J$200,8,FALSE),\"\")","v":""},{"$f":"IFERROR(VLOOKUP($B191,'Défi-6'!$C$2:$J$200,8,FALSE),\"\")","v":""},{"$f":"IFERROR(VLOOKUP($B191,'Défi-7'!$C$2:$J$200,8,FALSE),\"\")","v":41},74,null,"OK","OK","OK","OK","OK","OK","OK","OK","OK",null,{"$f":"'Classement auteurs'!$B191","v":131956000401},{"$f":"IF('Classement auteurs'!C191=\"\",\"\",'Classement auteurs'!C191)","v":33},{"$f":"IF('Classement auteurs'!D191=\"\",\"\",'Classement auteurs'!D191)","v":""},{"$f":"IF('Classement auteurs'!E191=\"\",\"\",'Classement auteurs'!E191)","v":""},{"$f":"IF('Classement auteurs'!F191=\"\",\"\",'Classement auteurs'!F191)","v":""},{"$f":"IF('Classement auteurs'!G191=\"\",\"\",'Classement auteurs'!G191)","v":""},{"$f":"IF('Classement auteurs'!H191=\"\",\"\",'Classement auteurs'!H191)","v":""},{"$f":"IF('Classement auteurs'!I191=\"\",\"\",'Classement auteurs'!I191)","v":41},{"$f":"IF('Classement auteurs'!J191=\"\",\"\",'Classement auteurs'!J191)","v":74}]
[null,131956005401,{"$f":"IFERROR(VLOOKUP($B192,'Défi-1'!$C$2:$J$200,8,FALSE),\"\")","v":""},{"$f":"IFERROR(VLOOKUP($B192,'Défi-2'!$C$2:$J$200,8,FALSE),\"\")","v":""},{"$f":"IFERROR(VLOOKUP($B192,'Défi-3'!$C$2:$J$200,8,FALSE),\"\")","v":34},{"$f":"IFERROR(VLOOKUP($B192,'Défi-4'!$C$2:$J$200,8,FALSE),\"\")","v":""},{"$f":"IFERROR(VLOOKUP($B192,'Défi-5'!$C$2:$J$200,8,FALSE),\"\")","v":""},{"$f":"IFERROR(VLOOKUP($B192,'Défi-6'!$C$2:$J$200,8,FALSE),\"\")","v":""},{"$f":"IFERROR(VLOOKUP($B192,'Défi-7'!$C$2:$J$200,8,FALSE),\"\")","v":40},74,null,"OK","OK","OK","OK","OK","OK","OK","OK","OK",null,{"$f":"'Classement auteurs'!$B192","v":131956005401},{"$f":"IF('Classement auteurs'!C192=\"\",\"\",'Classement auteurs'!C192)","v":""},{"$f":"IF('Classement auteurs'!D192=\"\",\"\",'Classement auteurs'!D192)","v":""},{"$f":"IF('Classement auteurs'!E192=\"\",\"\",'Classement auteurs'!E192)","v":34},{"$f":"IF('Classement auteurs'!F192=\"\",\"\",'Classement auteurs'!F192)","v":""},{"$f":"IF('Classement auteurs'!G192=\"\",\"\",'Classement auteurs'!G192)","v":""},{"$f":"IF('Classement auteurs'!H192=\"\",\"\",'Classement auteurs'!H192)","v":""},{"$f":"IF('Classement auteurs'!I192=\"\",\"\",'Classement auteurs'!I192)","v":40},{"$f":"IF('Classement auteurs'!J192=\"\",\"\",'Classement auteurs'!J192)","v":74}]
[null,131376015801,{"$f":"IFERROR(VLOOKUP($B193,'Défi-1'!$C$2:$J$200,8,FALSE),\"\")","v":36},{"$f":"IFERROR(VLOOKUP($B193,'Défi-2'!$C$2:$J$200,8,FALSE),\"\")","v":""},{"$f":"IFERROR(VLOOKUP($B193,'Défi-3'!$C$2:$J$200,8,FALSE),\"\")","v":""},{"$f":"IFERROR(VLOOKUP($B193,'Défi-4'!$C$2:$J$200,8,FALSE),\"\")","v":37},{"$f":"IFERROR(VLOOKUP($B193,'Défi-5'!$C$2:$J$200,8,FALSE),\"\")","v":""},{"$f":"IFERROR(VLOOKUP($B193,'Défi-6'!$C$2:$J$200,8,FALSE),\"\")","v":""},{"$f":"IFERROR(VLOOKUP($B193,'Défi-7'!$C$2:$J$200,8,FALSE),\"\")","v":""},73,null,"OK","OK","OK","OK","OK","OK","OK","OK","OK",null,{"$f":"'Classement auteurs'!$B193","v":131376015801},{"$f":"IF('Classement auteurs'!C193=\"\",\"\",'Classement auteurs'!C193)","v":36},{"$f":"IF('Classement auteurs'!D193=\"\",\"\",'Classement auteurs'!D193)","v":""},{"$f":"IF('Classement auteurs'!E193=\"\",\"\",'Classement auteurs'!E193)","v":""},{"$f":"IF('Classement auteurs'!F193=\"\",\"\",'Classement auteurs'!F193)","v":37},{"$f":"IF('Classement auteurs'!G193=\"\",\"\",'Classement auteurs'!G193)","v":""},{"$f":"IF('Classement auteurs'!H193=\"\",\"\",'Classement auteurs'!H193)","v":""},{"$f":"IF('Classement auteurs'!I193=\"\",\"\",'Classement auteurs'!I193)","v":""},{"$f":"IF('Classement auteurs'!J193=\"\",\"\",'Classement auteurs'!J193)","v":73}]
[null,131845001101,{"$f":"IFERROR(VLOOKUP($B194,'Défi-1'!$C$2:$J$200,8,FALSE),\"\")","v":41},{"$f":"IFERROR(VLOOKUP($B194,'Défi-2'!$C$2:$J$200,8,FALSE),\"\")","v":""},{"$f":"IFERROR(VLOOKUP($B194,'Défi-3'!$C$2:$J$200,8,FALSE),\"\")","v":""},{"$f":"IFERROR(VLOOKUP($B194,'Défi-4'!$C$2:$J$200,8,FALSE),\"\")","v":""},{"$f":"IFERROR(VLOOKUP($B194,'Défi-5'!$C$2:$J$200,8,FALSE),\"\")","v":32},{"$f":"IFERROR(VLOOKUP($B194,'Défi-6'!$C$2:$J$200,8,FALSE),\"\")","v":""},{"$f":"IFERROR(VLOOKUP($B194,'Défi-7'!$C$2:$J$200,8,FALSE),\"\")","v":""},73,null,"OK","OK","OK","OK","OK","OK","OK","OK","OK",null,{"$f":"'Classement auteurs'!$B194","v":131845001101},{"$f":"IF('Classement auteurs'!C194=\"\",\"\",'Classement auteurs'!C194)","v":41},{"$f":"IF('Classement auteurs'!D194=\"\",\"\",'Classement auteurs'!D194)","v":""},{"$f":"IF('Classement auteurs'!E194=\"\",\"\",'Classement auteurs'!E194)","v":""},{"$f":"IF('Classement auteurs'!F194=\"\",\"\",'Classement auteurs'!F194)","v":""},{"$f":"IF('Classement auteurs'!G194=\"\",\"\",'Classement auteurs'!G194)","v":32},{"$f":"IF('Classement auteurs'!H194=\"\",\"\",'Classement auteurs'!H194)","v":""},{"$f":"IF('Classement auteurs'!I194=\"\",\"\",'Classement auteurs'!I194)","v":""},{"$f":"IF('Classement auteurs'!J194=\"\",\"\",'Classement auteurs'!J194)","v":73}]
[null,131879000901,{"$f":"IFERROR(VLOOKUP($B195,'Défi-1'!$C$2:$J$200,8,FALSE),\"\")","v":""},{"$f":"IFERROR(VLOOKUP($B195,'Défi-2'!$C$2:$J$200,8,FALSE),\"\")","v":""},{"$f":"IFERROR(VLOOKUP($B195,'Défi-3'!$C$2:$J$200,8,FALSE),\"\")","v":44},{"$f":"IFERROR(VLOOKUP($B195,'Défi-4'!$C$2:$J$200,8,FALSE),\"\")","v":""},{"$f":"IFERROR(VLOOKUP($B195,'Défi-5'!$C$2:$J$200,8,FALSE),\"\")","v":29},{"$f":"IFERROR(VLOOKUP($B195,'Défi-6'!$C$2:$J$200,8,FALSE),\"\")","v":""},{"$f":"IFERROR(VLOOKUP($B195,'Défi-7'!$C$2:$J$200,8,FALSE),\"\")","v":""},73,null,"OK","OK","OK","OK","OK","OK","OK","OK","OK",null,{"$f":"'Classement auteurs'!$B195","v":131879000901},{"$f":"IF('Classement auteurs'!C195=\"\",\"\",'Classement auteurs'!C195)","v":""},{"$f":"IF('Classement auteurs'!D195=\"\",\"\",'Classement auteurs'!D195)","v":""},{"$f":"IF('Classement auteurs'!E195=\"\",\"\",'Classement auteurs'!E195)","v":44},{"$f":"IF('Classement auteurs'!F195=\"\",\"\",'Classement auteurs'!F195)","v":""},{"$f":"IF('Classement auteurs'!G195=\"\",\"\",'Classement auteurs'!G195)","v":29},{"$f":"IF('Classement auteurs'!H195=\"\",\"\",'Classement auteurs'!H195)","v":""},{"$f":"IF('Classement auteurs'!I195=\"\",\"\",'Classement auteurs'!I195)","v":""},{"$f":"IF('Classement auteurs'!J195=\"\",\"\",'Classement auteurs'!J195)","v":73}]
[null,131845000301,{"$f":"IFERROR(VLOOKUP($B196,'Défi-1'!$C$2:$J$200,8,FALSE),\"\")","v":36},{"$f":"IFERROR(VLOOKUP($B196,'Défi-2'!$C$2:$J$200,8,FALSE),\"\")","v":""},{"$f":"IFERROR(VLOOKUP($B196,'Défi-3'!$C$2:$J$200,8,FALSE),\"\")","v":""},{"$f":"IFERROR(VLOOKUP($B196,'Défi-4'!$C$2:$J$200,8,FALSE),\"\")","v":""},{"$f":"IFERROR(VLOOKUP($B196,'Défi-5'!$C$2:$J$200,8,FALSE),\"\")","v":""},{"$f":"IFERROR(VLOOKUP($B196,'Défi-6'!$C$2:$J$200,8,FALSE),\"\")","v":36},{"$f":"IFERROR(VLOOKUP($B196,'Défi-7'!$C$2:$J$200,8,FALSE),\"\")","v":""},72,null,"OK","OK","OK","OK","OK","OK","OK","OK","OK",null,{"$f":"'Classement auteurs'!$B196","v":131845000301},{"$f":"IF('Classement auteurs'!C196=\"\",\"\",'Classement auteurs'!C196)","v":36},{"$f":"IF('Classement auteurs'!D196=\"\",\"\",'Classement auteurs'!D196)","v":""},{"$f":"IF('Classement auteurs'!E196=\"\",\"\",'Classement auteurs'!E196)","v":""},{"$f":"IF('Classement auteurs'!F196=\"\",\"\",'Classement auteurs'!F196)","v":""},{"$f":"IF('Classement auteurs'!G196=\"\",\"\",'Classement auteurs'!G196)","v":""},{"$f":"IF('Classement auteurs'!H196=\"\",\"\",'Classement auteurs'!H196)","v":36},{"$f":"IF('Classement auteurs'!I196=\"\",\"\",'Classement auteurs'!I196)","v":""},{"$f":"IF('Classement auteurs'!J196=\"\",\"\",'Classement auteurs'!J196)","v":72}]
[null,130987028801,{"$f":"IFERROR(VLOOKUP($B197,'Défi-1'!$C$2:$J$200,8,FALSE),\"\")","v":36},{"$f":"IFERROR(VLOOKUP($B197,'Défi-2'!$C$2:$J$200,8,FALSE),\"\")","v":""},{"$f":"IFERROR(VLOOKUP($B197,'Défi-3'!$C$2:$J$200,8,FALSE),\"\")","v":""},{"$f":"IFERROR(VLOOKUP($B197,'Défi-4'!$C$2:$J$200,8,FALSE),\"\")","v":""},{"$f":"IFERROR(VLOOKUP($B197,'Défi-5'!$C$2:$J$200,8,FALSE),\"\")","v":""},{"$f":"IFERROR(VLOOKUP($B197,'Défi-6'!$C$2:$J$200,8,FALSE),\"\")","v":36},{"$f":"IFERROR(VLOOKUP($B197,'Défi-7'!$C$2:$J$200,8,FALSE),\"\")","v":""},72,null,"OK","OK","OK","OK","OK","OK","OK","OK","OK",null,{"$f":"'Classement auteurs'!$B197","v":130987028801},{"$f":"IF('Classement auteurs'!C197=\"\",\"\",'Classement auteurs'!C197)","v":36},{"$f":"IF('Classement auteurs'!D197=\"\",\"\",'Classement auteurs'!D197)","v":""},{"$f":"IF('Classement auteurs'!E197=\"\",\"\",'Classement auteurs'!E197)","v":""},{"$f":"IF('Classement auteurs'!F197=\"\",\"\",'Classement auteurs'!F197)","v":""},{"$f":"IF('Classement auteurs'!G197=\"\",\"\",'Classement auteurs'!G197)","v":""},{"$f":"IF('Classement auteurs'!H197=\"\",\"\",'Classement auteurs'!H197)","v":36},{"$f":"IF('Classement auteurs'!I197=\"\",\"\",'Classement auteurs'!I197)","v":""},{"$f":"IF('Classement auteurs'!J197=\"\",\"\",'Classement auteurs'!J197)","v":72}]
[null,130878013301,{"$f":"IFERROR(VLOOKUP($B198,'Défi-1'!$C$2:$J$200,8,FALSE),\"\")","v":""},{"$f":"IFERROR(VLOOKUP($B198,'Défi-2'!$C$2:$J$200,8,FALSE),\"\")","v":""},{"$f":"IFERROR(VLOOKUP($B198,'Défi-3'!$C$2:$J$200,8,FALSE),\"\")","v":""},{"$f":"IFERROR(VLOOKUP($B198,'Défi-4'!$C$2:$J$200,8,FALSE),\"\")","v":36},{"$f":"IFERROR(VLOOKUP($B198,'Défi-5'!$C$2:$J$200,8,FALSE),\"\")","v":""},{"$f":"IFERROR(VLOOKUP($B198,'Défi-6'!$C$2:$J$200,8,FALSE),\"\")","v":36},{"$f":"IFERROR(VLOOKUP($B198,'Défi-7'!$C$2:$J$200,8,FALSE),\"\")","v":""},72,null,"OK","OK","OK","OK","OK","OK","OK","OK","OK",null,{"$f":"'Classement auteurs'!$B198","v":130878013301},{"$f":"IF('Classement auteurs'!C198=\"\",\"\",'Classement auteurs'!C198)","v":""},{"$f":"IF('Classement auteurs'!D198=\"\",\"\",'Classement auteurs'!D198)","v":""},{"$f":"IF('Classement auteurs'!E198=\"\",\"\",'Classement auteurs'!E198)","v":""},{"$f":"IF('Classement auteurs'!F198=\"\",\"\",'Classement auteurs'!F198)","v":36},{"$f":"IF('Classement auteurs'!G198=\"\",\"\",'Classement auteurs'!G198)","v":""},{"$f":"IF('Classement auteurs'!H198=\"\",\"\",'Classement auteurs'!H198)","v":36},{"$f":"IF('Classement auteurs'!I198=\"\",\"\",'Classement auteurs'!I198)","v":""},{"$f":"IF('Classement auteurs'!J198=\"\",\"\",'Classement auteurs'!J198)","v":72}]
[null,131499010801,{"$f":"IFERROR(VLOOKUP($B199,'Défi-1'!$C$2:$J$200,8,FALSE),\"\")","v":""},{"$f":"IFERROR(VLOOKUP($B199,'Défi-2'!$C$2:$J$200,8,FALSE),\"\")","v":30},{"$f":"IFERROR(VLOOKUP($B199,'Défi-3'!$C$2:$J$200,8,FALSE),\"\")","v":""},{"$f":"IFERROR(VLOOKUP($B199,'Défi-4'!$C$2:$J$200,8,FALSE),\"\")","v":41},{"$f":"IFERROR(VLOOKUP($B199,'Défi-5'!$C$2:$J$200,8,FALSE),\"\")","v":""},{"$f":"IFERROR(VLOOKUP($B199,'Défi-6'!$C$2:$J$200,8,FALSE),\"\")","v":""},{"$f":"IFERROR(VLOOKUP($B199,'Défi-7'!$C$2:$J$200,8,FALSE),\"\")","v":""},71,null,"OK","OK","OK","OK","OK","OK","OK","OK","OK",null,{"$f":"'Classement auteurs'!$B199","v":131499010801},{"$f":"IF('Classement auteurs'!C199=\"\",\"\",'Classement auteurs'!C199)","v":""},{"$f":"IF('Classement auteurs'!D199=\"\",\"\",'Classement auteurs'!D199)","v":30},{"$f":"IF('Classement auteurs'!E199=\"\",\"\",'Classement auteurs'!E199)","v":""},{"$f":"IF('Classement auteurs'!F199=\"\",\"\",'Classement auteurs'!F199)","v":41},{"$f":"IF('Classement auteurs'!G199=\"\",\"\",'Classement auteurs'!G199)","v":""},{"$f":"IF('Classement auteurs'!H199=\"\",\"\",'Classement auteurs'!H199)","v":""},{"$f":"IF('Classement auteurs'!I199=\"\",\"\",'Classement auteurs'!I199)","v":""},{"$f":"IF('Classement auteurs'!J199=\"\",\"\",'Classement auteurs'!J199)","v":71}]
[null,131227008301,{"$f":"IFERROR(VLOOKUP($B200,'Défi-1'!$C$2:$J$200,8,FALSE),\"\")","v":""},{"$f":"IFERROR(VLOOKUP($B200,'Défi-2'!$C$2:$J$200,8,FALSE),\"\")","v":""},{"$f":"IFERROR(VLOOKUP($B200,'Défi-3'!$C$2:$J$200,8,FALSE),\"\")","v":""},{"$f":"IFERROR(VLOOKUP($B200,'Défi-4'!$C$2:$J$200,8,FALSE),\"\")","v":37},{"$f":"IFERROR(VLOOKUP($B200,'Défi-5'!$C$2:$J$200,8,FALSE),\"\")","v":34},{"$f":"IFERROR(VLOOKUP($B200,'Défi-6'!$C$2:$J$200,8,FALSE),\"\")","v":""},{"$f":"IFERROR(VLOOKUP($B200,'Défi-7'!$C$2:$J$200,8,FALSE),\"\")","v":""},71,null,"OK","OK","OK","OK","OK","OK","OK","OK","OK",null,{"$f":"'Classement auteurs'!$B200","v":131227008301},{"$f":"IF('Classement auteurs'!C200=\"\",\"\",'Classement auteurs'!C200)","v":""},{"$f":"IF('Classement auteurs'!D200=\"\",\"\",'Classement auteurs'!D200)","v":""},{"$f":"IF('Classement auteurs'!E200=\"\",\"\",'Classement auteurs'!E200)","v":""},{"$f":"IF('Classement auteurs'!F200=\"\",\"\",'Classement auteurs'!F200)","v":37},{"$f":"IF('Classement auteurs'!G200=\"\",\"\",'Classement auteurs'!G200)","v":34},{"$f":"IF('Classement auteurs'!H200=\"\",\"\",'Classement auteurs'!H200)","v":""},{"$f":"IF('Classement auteurs'!I200=\"\",\"\",'Classement auteurs'!I200)","v":""},{"$f":"IF('Classement auteurs'!J200=\"\",\"\",'Classement auteurs'!J200)","v":71}]
[null,130993016501,{"$f":"IFERROR(VLOOKUP($B201,'Défi-1'!$C$2:$J$200,8,FALSE),\"\")","v":""},{"$f":"IFERROR(VLOOKUP($B201,'Défi-2'!$C$2:$J$200,8,FALSE),\"\")","v":35},{"$f":"IFERROR(VLOOKUP($B201,'Défi-3'!$C$2:$J$200,8,FALSE),\"\")","v":""},{"$f":"IFERROR(VLOOKUP($B201,'Défi-4'!$C$2:$J$200,8,FALSE),\"\")","v":""},{"$f":"IFERROR(VLOOKUP($B201,'Défi-5'!$C$2:$J$200,8,FALSE),\"\")","v":""},{"$f":"IFERROR(VLOOKUP($B201,'Défi-6'!$C$2:$J$200,8,FALSE),\"\")","v":35},{"$f":"IFERROR(VLOOKUP($B201,'Défi-7'!$C$2:$J$200,8,FALSE),\"\")","v":""},70,null,"OK","OK","OK","OK","OK","OK","OK","OK","OK",null,{"$f":"'Classement auteurs'!$B201","v":130993016501},{"$f":"IF('Classement auteurs'!C201=\"\",\"\",'Classement auteurs'!C201)","v":""},{"$f":"IF('Classement auteurs'!D201=\"\",\"\",'Classement auteurs'!D201)","v":35},{"$f":"IF('Classement auteurs'!E201=\"\",\"\",'Classement auteurs'!E201)","v":""},{"$f":"IF('Classement auteurs'!F201=\"\",\"\",'Classement auteurs'!F201)","v":""},{"$f":"IF('Classement auteurs'!G201=\"\",\"\",'Classement auteurs'!G201)","v":""},{"$f":"IF('Classement auteurs'!H201=\"\",\"\",'Classement auteurs'!H201)","v":35},{"$f":"IF('Classement auteurs'!I201=\"\",\"\",'Classement auteurs'!I201)","v":""},{"$f":"IF('Classement auteurs'!J201=\"\",\"\",'Classement auteurs'!J201)","v":70}]
[null,131956005501,{"$f":"IFERROR(VLOOKUP($B202,'Défi-1'!$C$2:$J$200,8,FALSE),\"\")","v":""},{"$f":"IFERROR(VLOOKUP($B202,'Défi-2'!$C$2:$J$200,8,FALSE),\"\")","v":33},{"$f":"IFERROR(VLOOKUP($B202,'Défi-3'!$C$2:$J$200,8,FALSE),\"\")","v":""},{"$f":"IFERROR(VLOOKUP($B202,'Défi-4'!$C$2:$J$200,8,FALSE),\"\")","v":""},{"$f":"IFERROR(VLOOKUP($B202,'Défi-5'!$C$2:$J$200,8,FALSE),\"\")","v":""},{"$f":"IFERROR(VLOOKUP($B202,'Défi-6'!$C$2:$J$200,8,FALSE),\"\")","v":""},{"$f":"IFERROR(VLOOKUP($B202,'Défi-7'!$C$2:$J$200,8,FALSE),\"\")","v":37},70,null,"OK","OK","OK","OK","OK","OK","OK","OK","OK",null,{"$f":"'Classement auteurs'!$B202","v":131956005501},{"$f":"IF('Classement auteurs'!C202=\"\",\"\",'Classement auteurs'!C202)","v":""},{"$f":"IF('Classement auteurs'!D202=\"\",\"\",'Classement auteurs'!D202)","v":33},{"$f":"IF('Classement auteurs'!E202=\"\",\"\",'Classement auteurs'!E202)","v":""},{"$f":"IF('Classement auteurs'!F202=\"\",\"\",'Classement auteurs'!F202)","v":""},{"$f":"IF('Classement auteurs'!G202=\"\",\"\",'Classement auteurs'!G202)","v":""},{"$f":"IF('Classement auteurs'!H202=\"\",\"\",'Classement auteurs'!H202)","v":""},{"$f":"IF('Classement auteurs'!I202=\"\",\"\",'Classement auteurs'!I202)","v":37},{"$f":"IF('Classement auteurs'!J202=\"\",\"\",'Classement auteurs'!J202)","v":70}]
[null,132060002001,{"$f":"IFERROR(VLOOKUP($B203,'Défi-1'!$C$2:$J$200,8,FALSE),\"\")","v":43},{"$f":"IFERROR(VLOOKUP($B203,'Défi-2'!$C$2:$J$200,8,FALSE),\"\")","v":""},{"$f":"IFERROR(VLOOKUP($B203,'Défi-3'!$C$2:$J$200,8,FALSE),\"\")","v":""},{"$f":"IFERROR(VLOOKUP($B203,'Défi-4'!$C$2:$J$200,8,FALSE),\"\")","v":""},{"$f":"IFERROR(VLOOKUP($B203,'Défi-5'!$C$2:$J$200,8,FALSE),\"\")","v":""},{"$f":"IFERROR(VLOOKUP($B203,'Défi-6'!$C$2:$J$200,8,FALSE),\"\")","v":""},{"$f":"IFERROR(VLOOKUP($B203,'Défi-7'!$C$2:$J$200,8,FALSE),\"\")","v":26},69,null,"OK","OK","OK","OK","OK","OK","OK","OK","OK",null,{"$f":"'Classement auteurs'!$B203","v":132060002001},{"$f":"IF('Classement auteurs'!C203=\"\",\"\",'Classement auteurs'!C203)","v":43},{"$f":"IF('Classement auteurs'!D203=\"\",\"\",'Classement auteurs'!D203)","v":""},{"$f":"IF('Classement auteurs'!E203=\"\",\"\",'Classement auteurs'!E203)","v":""},{"$f":"IF('Classement auteurs'!F203=\"\",\"\",'Classement auteurs'!F203)","v":""},{"$f":"IF('Classement auteurs'!G203=\"\",\"\",'Classement auteurs'!G203)","v":""},{"$f":"IF('Classement auteurs'!H203=\"\",\"\",'Classement auteurs'!H203)","v":""},{"$f":"IF('Classement auteurs'!I203=\"\",\"\",'Classement auteurs'!I203)","v":26},{"$f":"IF('Classement auteurs'!J203=\"\",\"\",'Classement auteurs'!J203)","v":69}]
[null,131956000601,{"$f":"IFERROR(VLOOKUP($B204,'Défi-1'!$C$2:$J$200,8,FALSE),\"\")","v":""},{"$f":"IFERROR(VLOOKUP($B204,'Défi-2'!$C$2:$J$200,8,FALSE),\"\")","v":""},{"$f":"IFERROR(VLOOKUP($B204,'Défi-3'!$C$2:$J$200,8,FALSE),\"\")","v":41},{"$f":"IFERROR(VLOOKUP($B204,'Défi-4'!$C$2:$J$200,8,FALSE),\"\")","v":""},{"$f":"IFERROR(VLOOKUP($B204,'Défi-5'!$C$2:$J$200,8,FALSE),\"\")","v":27},{"$f":"IFERROR(VLOOKUP($B204,'Défi-6'!$C$2:$J$200,8,FALSE),\"\")","v":""},{"$f":"IFERROR(VLOOKUP($B204,'Défi-7'!$C$2:$J$200,8,FALSE),\"\")","v":""},{"$f":"SUM(C204:I204)","v":68},null,{"$f":"IF(B204=V204,\"OK\",\"KO\")","v":"OK"},{"$f":"IF(C204=W204,\"OK\",\"KO\")","v":"OK"},{"$f":"IF(D204=X204,\"OK\",\"KO\")","v":"OK"},{"$f":"IF(E204=Y204,\"OK\",\"KO\")","v":"OK"},{"$f":"IF(F204=Z204,\"OK\",\"KO\")","v":"OK"},{"$f":"IF(G204=AA204,\"OK\",\"KO\")","v":"OK"},{"$f":"IF(H204=AB204,\"OK\",\"KO\")","v":"OK"},{"$f":"IF(I204=AC204,\"OK\",\"KO\")","v":"OK"},{"$f":"IF(J204=AD204,\"OK\",\"KO\")","v":"OK"},null,{"$f":"'Classement auteurs'!$B204","v":131956000601},{"$f":"IF('Classement auteurs'!C204=\"\",\"\",'Classement auteurs'!C204)","v":""},{"$f":"IF('Classement auteurs'!D204=\"\",\"\",'Classement auteurs'!D204)","v":""},{"$f":"IF('Classement auteurs'!E204=\"\",\"\",'Classement auteurs'!E204)","v":41},{"$f":"IF('Classement auteurs'!F204=\"\",\"\",'Classement auteurs'!F204)","v":""},{"$f":"IF('Classement auteurs'!G204=\"\",\"\",'Classement auteurs'!G204)","v":27},{"$f":"IF('Classement auteurs'!H204=\"\",\"\",'Classement auteurs'!H204)","v":""},{"$f":"IF('Classement auteurs'!I204=\"\",\"\",'Classement auteurs'!I204)","v":""},{"$f":"IF('Classement auteurs'!J204=\"\",\"\",'Classement auteurs'!J204)","v":68}]
[null,132217000101,{"$f":"IFERROR(VLOOKUP($B205,'Défi-1'!$C$2:$J$200,8,FALSE),\"\")","v":""},{"$f":"IFERROR(VLOOKUP($B205,'Défi-2'!$C$2:$J$200,8,FALSE),\"\")","v":""},{"$f":"IFERROR(VLOOKUP($B205,'Défi-3'!$C$2:$J$200,8,FALSE),\"\")","v":30},{"$f":"IFERROR(VLOOKUP($B205,'Défi-4'!$C$2:$J$200,8,FALSE),\"\")","v":37},{"$f":"IFERROR(VLOOKUP($B205,'Défi-5'!$C$2:$J$200,8,FALSE),\"\")","v":""},{"$f":"IFERROR(VLOOKUP($B205,'Défi-6'!$C$2:$J$200,8,FALSE),\"\")","v":""},{"$f":"IFERROR(VLOOKUP($B205,'Défi-7'!$C$2:$J$200,8,FALSE),\"\")","v":""},67,null,"OK","OK","OK","OK","OK","OK","OK","OK","OK",null,{"$f":"'Classement auteurs'!$B205","v":132217000101},{"$f":"IF('Classement auteurs'!C205=\"\",\"\",'Classement auteurs'!C205)","v":""},{"$f":"IF('Classement auteurs'!D205=\"\",\"\",'Classement auteurs'!D205)","v":""},{"$f":"IF('Classement auteurs'!E205=\"\",\"\",'Classement auteurs'!E205)","v":30},{"$f":"IF('Classement auteurs'!F205=\"\",\"\",'Classement auteurs'!F205)","v":37},{"$f":"IF('Classement auteurs'!G205=\"\",\"\",'Classement auteurs'!G205)","v":""},{"$f":"IF('Classement auteurs'!H205=\"\",\"\",'Classement auteurs'!H205)","v":""},{"$f":"IF('Classement auteurs'!I205=\"\",\"\",'Classement auteurs'!I205)","v":""},{"$f":"IF('Classement auteurs'!J205=\"\",\"\",'Classement auteurs'!J205)","v":67}]
[null,131683007001,{"$f":"IFERROR(VLOOKUP($B206,'Défi-1'!$C$2:$J$200,8,FALSE),\"\")","v":""},{"$f":"IFERROR(VLOOKUP($B206,'Défi-2'!$C$2:$J$200,8,FALSE),\"\")","v":""},{"$f":"IFERROR(VLOOKUP($B206,'Défi-3'!$C$2:$J$200,8,FALSE),\"\")","v":""},{"$f":"IFERROR(VLOOKUP($B206,'Défi-4'!$C$2:$J$200,8,FALSE),\"\")","v":""},{"$f":"IFERROR(VLOOKUP($B206,'Défi-5'!$C$2:$J$200,8,FALSE),\"\")","v":33},{"$f":"IFERROR(VLOOKUP($B206,'Défi-6'!$C$2:$J$200,8,FALSE),\"\")","v":33},{"$f":"IFERROR(VLOOKUP($B206,'Défi-7'!$C$2:$J$200,8,FALSE),\"\")","v":""},66,null,"OK","OK","OK","OK","OK","OK","OK","OK","OK",null,{"$f":"'Classement auteurs'!$B206","v":131683007001},{"$f":"IF('Classement auteurs'!C206=\"\",\"\",'Classement auteurs'!C206)","v":""},{"$f":"IF('Classement auteurs'!D206=\"\",\"\",'Classement auteurs'!D206)","v":""},{"$f":"IF('Classement auteurs'!E206=\"\",\"\",'Classement auteurs'!E206)","v":""},{"$f":"IF('Classement auteurs'!F206=\"\",\"\",'Classement auteurs'!F206)","v":""},{"$f":"IF('Classement auteurs'!G206=\"\",\"\",'Classement auteurs'!G206)","v":33},{"$f":"IF('Classement auteurs'!H206=\"\",\"\",'Classement auteurs'!H206)","v":33},{"$f":"IF('Classement auteurs'!I206=\"\",\"\",'Classement auteurs'!I206)","v":""},{"$f":"IF('Classement auteurs'!J206=\"\",\"\",'Classement auteurs'!J206)","v":66}]
[null,132060001501,{"$f":"IFERROR(VLOOKUP($B207,'Défi-1'!$C$2:$J$200,8,FALSE),\"\")","v":35},{"$f":"IFERROR(VLOOKUP($B207,'Défi-2'!$C$2:$J$200,8,FALSE),\"\")","v":""},{"$f":"IFERROR(VLOOKUP($B207,'Défi-3'!$C$2:$J$200,8,FALSE),\"\")","v":""},{"$f":"IFERROR(VLOOKUP($B207,'Défi-4'!$C$2:$J$200,8,FALSE),\"\")","v":27},{"$f":"IFERROR(VLOOKUP($B207,'Défi-5'!$C$2:$J$200,8,FALSE),\"\")","v":""},{"$f":"IFERROR(VLOOKUP($B207,'Défi-6'!$C$2:$J$200,8,FALSE),\"\")","v":""},{"$f":"IFERROR(VLOOKUP($B207,'Défi-7'!$C$2:$J$200,8,FALSE),\"\")","v":""},62,null,"OK","OK","OK","OK","OK","OK","OK","OK","OK",null,{"$f":"'Classement auteurs'!$B207","v":132060001501},{"$f":"IF('Classement auteurs'!C207=\"\",\"\",'Classement auteurs'!C207)","v":35},{"$f":"IF('Classement auteurs'!D207=\"\",\"\",'Classement auteurs'!D207)","v":""},{"$f":"IF('Classement auteurs'!E207=\"\",\"\",'Classement auteurs'!E207)","v":""},{"$f":"IF('Classement auteurs'!F207=\"\",\"\",'Classement auteurs'!F207)","v":27},{"$f":"IF('Classement auteurs'!G207=\"\",\"\",'Classement auteurs'!G207)","v":""},{"$f":"IF('Classement auteurs'!H207=\"\",\"\",'Classement auteurs'!H207)","v":""},{"$f":"IF('Classement auteurs'!I207=\"\",\"\",'Classement auteurs'!I207)","v":""},{"$f":"IF('Classement auteurs'!J207=\"\",\"\",'Classement auteurs'!J207)","v":62}]
[null,130987029901,{"$f":"IFERROR(VLOOKUP($B208,'Défi-1'!$C$2:$J$200,8,FALSE),\"\")","v":""},{"$f":"IFERROR(VLOOKUP($B208,'Défi-2'!$C$2:$J$200,8,FALSE),\"\")","v":""},{"$f":"IFERROR(VLOOKUP($B208,'Défi-3'!$C$2:$J$200,8,FALSE),\"\")","v":31},{"$f":"IFERROR(VLOOKUP($B208,'Défi-4'!$C$2:$J$200,8,FALSE),\"\")","v":""},{"$f":"IFERROR(VLOOKUP($B208,'Défi-5'!$C$2:$J$200,8,FALSE),\"\")","v":""},{"$f":"IFERROR(VLOOKUP($B208,'Défi-6'!$C$2:$J$200,8,FALSE),\"\")","v":31},{"$f":"IFERROR(VLOOKUP($B208,'Défi-7'!$C$2:$J$200,8,FALSE),\"\")","v":""},62,null,"OK","OK","OK","OK","OK","OK","OK","OK","OK",null,{"$f":"'Classement auteurs'!$B208","v":130987029901},{"$f":"IF('Classement auteurs'!C208=\"\",\"\",'Classement auteurs'!C208)","v":""},{"$f":"IF('Classement auteurs'!D208=\"\",\"\",'Classement auteurs'!D208)","v":""},{"$f":"IF('Classement auteurs'!E208=\"\",\"\",'Classement auteurs'!E208)","v":31},{"$f":"IF('Classement auteurs'!F208=\"\",\"\",'Classement auteurs'!F208)","v":""},{"$f":"IF('Classement auteurs'!G208=\"\",\"\",'Classement auteurs'!G208)","v":""},{"$f":"IF('Classement auteurs'!H208=\"\",\"\",'Classement auteurs'!H208)","v":31},{"$f":"IF('Classement auteurs'!I208=\"\",\"\",'Classement auteurs'!I208)","v":""},{"$f":"IF('Classement auteurs'!J208=\"\",\"\",'Classement auteurs'!J208)","v":62}]
[null,132217000601,{"$f":"IFERROR(VLOOKUP($B209,'Défi-1'!$C$2:$J$200,8,FALSE),\"\")","v":""},{"$f":"IFERROR(VLOOKUP($B209,'Défi-2'!$C$2:$J$200,8,FALSE),\"\")","v":""},{"$f":"IFERROR(VLOOKUP($B209,'Défi-3'!$C$2:$J$200,8,FALSE),\"\")","v":""},{"$f":"IFERROR(VLOOKUP($B209,'Défi-4'!$C$2:$J$200,8,FALSE),\"\")","v":""},{"$f":"IFERROR(VLOOKUP($B209,'Défi-5'!$C$2:$J$200,8,FALSE),\"\")","v":29},{"$f":"IFERROR(VLOOKUP($B209,'Défi-6'!$C$2:$J$200,8,FALSE),\"\")","v":29},{"$f":"IFERROR(VLOOKUP($B209,'Défi-7'!$C$2:$J$200,8,FALSE),\"\")","v":""},58,null,"OK","OK","OK","OK","OK","OK","OK","OK","OK",null,{"$f":"'Classement auteurs'!$B209","v":132217000601},{"$f":"IF('Classement auteurs'!C209=\"\",\"\",'Classement auteurs'!C209)","v":""},{"$f":"IF('Classement auteurs'!D209=\"\",\"\",'Classement auteurs'!D209)","v":""},{"$f":"IF('Classement auteurs'!E209=\"\",\"\",'Classement auteurs'!E209)","v":""},{"$f":"IF('Classement auteurs'!F209=\"\",\"\",'Classement auteurs'!F209)","v":""},{"$f":"IF('Classement auteurs'!G209=\"\",\"\",'Classement auteurs'!G209)","v":29},{"$f":"IF('Classement auteurs'!H209=\"\",\"\",'Classement auteurs'!H209)","v":29},{"$f":"IF('Classement auteurs'!I209=\"\",\"\",'Classement auteurs'!I209)","v":""},{"$f":"IF('Classement auteurs'!J209=\"\",\"\",'Classement auteurs'!J209)","v":58}]
[null,131683008201,{"$f":"IFERROR(VLOOKUP($B210,'Défi-1'!$C$2:$J$200,8,FALSE),\"\")","v":""},{"$f":"IFERROR(VLOOKUP($B210,'Défi-2'!$C$2:$J$200,8,FALSE),\"\")","v":""},{"$f":"IFERROR(VLOOKUP($B210,'Défi-3'!$C$2:$J$200,8,FALSE),\"\")","v":""},{"$f":"IFERROR(VLOOKUP($B210,'Défi-4'!$C$2:$J$200,8,FALSE),\"\")","v":""},{"$f":"IFERROR(VLOOKUP($B210,'Défi-5'!$C$2:$J$200,8,FALSE),\"\")","v":""},{"$f":"IFERROR(VLOOKUP($B210,'Défi-6'!$C$2:$J$200,8,FALSE),\"\")","v":""},{"$f":"IFERROR(VLOOKUP($B210,'Défi-7'!$C$2:$J$200,8,FALSE),\"\")","v":57},57,null,"OK","OK","OK","OK","OK","OK","OK","OK","OK",null,{"$f":"'Classement auteurs'!$B210","v":131683008201},{"$f":"IF('Classement auteurs'!C210=\"\",\"\",'Classement auteurs'!C210)","v":""},{"$f":"IF('Classement auteurs'!D210=\"\",\"\",'Classement auteurs'!D210)","v":""},{"$f":"IF('Classement auteurs'!E210=\"\",\"\",'Classement auteurs'!E210)","v":""},{"$f":"IF('Classement auteurs'!F210=\"\",\"\",'Classement auteurs'!F210)","v":""},{"$f":"IF('Classement auteurs'!G210=\"\",\"\",'Classement auteurs'!G210)","v":""},{"$f":"IF('Classement auteurs'!H210=\"\",\"\",'Classement auteurs'!H210)","v":""},{"$f":"IF('Classement auteurs'!I210=\"\",\"\",'Classement auteurs'!I210)","v":57},{"$f":"IF('Classement auteurs'!J210=\"\",\"\",'Classement auteurs'!J210)","v":57}]
[null,132203000601,{"$f":"IFERROR(VLOOKUP($B211,'Défi-1'!$C$2:$J$200,8,FALSE),\"\")","v":""},{"$f":"IFERROR(VLOOKUP($B211,'Défi-2'!$C$2:$J$200,8,FALSE),\"\")","v":""},{"$f":"IFERROR(VLOOKUP($B211,'Défi-3'!$C$2:$J$200,8,FALSE),\"\")","v":""},{"$f":"IFERROR(VLOOKUP($B211,'Défi-4'!$C$2:$J$200,8,FALSE),\"\")","v":""},{"$f":"IFERROR(VLOOKUP($B211,'Défi-5'!$C$2:$J$200,8,FALSE),\"\")","v":28},{"$f":"IFERROR(VLOOKUP($B211,'Défi-6'!$C$2:$J$200,8,FALSE),\"\")","v":28},{"$f":"IFERROR(VLOOKUP($B211,'Défi-7'!$C$2:$J$200,8,FALSE),\"\")","v":""},56,null,"OK","OK","OK","OK","OK","OK","OK","OK","OK",null,{"$f":"'Classement auteurs'!$B211","v":132203000601},{"$f":"IF('Classement auteurs'!C211=\"\",\"\",'Classement auteurs'!C211)","v":""},{"$f":"IF('Classement auteurs'!D211=\"\",\"\",'Classement auteurs'!D211)","v":""},{"$f":"IF('Classement auteurs'!E211=\"\",\"\",'Classement auteurs'!E211)","v":""},{"$f":"IF('Classement auteurs'!F211=\"\",\"\",'Classement auteurs'!F211)","v":""},{"$f":"IF('Classement auteurs'!G211=\"\",\"\",'Classement auteurs'!G211)","v":28},{"$f":"IF('Classement auteurs'!H211=\"\",\"\",'Classement auteurs'!H211)","v":28},{"$f":"IF('Classement auteurs'!I211=\"\",\"\",'Classement auteurs'!I211)","v":""},{"$f":"IF('Classement auteurs'!J211=\"\",\"\",'Classement auteurs'!J211)","v":56}]
[null,132147001701,{"$f":"IFERROR(VLOOKUP($B212,'Défi-1'!$C$2:$J$200,8,FALSE),\"\")","v":""},{"$f":"IFERROR(VLOOKUP($B212,'Défi-2'!$C$2:$J$200,8,FALSE),\"\")","v":""},{"$f":"IFERROR(VLOOKUP($B212,'Défi-3'!$C$2:$J$200,8,FALSE),\"\")","v":""},{"$f":"IFERROR(VLOOKUP($B212,'Défi-4'!$C$2:$J$200,8,FALSE),\"\")","v":27},{"$f":"IFERROR(VLOOKUP($B212,'Défi-5'!$C$2:$J$200,8,FALSE),\"\")","v":""},{"$f":"IFERROR(VLOOKUP($B212,'Défi-6'!$C$2:$J$200,8,FALSE),\"\")","v":27},{"$f":"IFERROR(VLOOKUP($B212,'Défi-7'!$C$2:$J$200,8,FALSE),\"\")","v":""},54,null,"OK","OK","OK","OK","OK","OK","OK","OK","OK",null,{"$f":"'Classement auteurs'!$B212","v":132147001701},{"$f":"IF('Classement auteurs'!C212=\"\",\"\",'Classement auteurs'!C212)","v":""},{"$f":"IF('Classement auteurs'!D212=\"\",\"\",'Classement auteurs'!D212)","v":""},{"$f":"IF('Classement auteurs'!E212=\"\",\"\",'Classement auteurs'!E212)","v":""},{"$f":"IF('Classement auteurs'!F212=\"\",\"\",'Classement auteurs'!F212)","v":27},{"$f":"IF('Classement auteurs'!G212=\"\",\"\",'Classement auteurs'!G212)","v":""},{"$f":"IF('Classement auteurs'!H212=\"\",\"\",'Classement auteurs'!H212)","v":27},{"$f":"IF('Classement auteurs'!I212=\"\",\"\",'Classement auteurs'!I212)","v":""},{"$f":"IF('Classement auteurs'!J212=\"\",\"\",'Classement auteurs'!J212)","v":54}]
[null,131985003401,{"$f":"IFERROR(VLOOKUP($B213,'Défi-1'!$C$2:$J$200,8,FALSE),\"\")","v":""},{"$f":"IFERROR(VLOOKUP($B213,'Défi-2'!$C$2:$J$200,8,FALSE),\"\")","v":""},{"$f":"IFERROR(VLOOKUP($B213,'Défi-3'!$C$2:$J$200,8,FALSE),\"\")","v":""},{"$f":"IFERROR(VLOOKUP($B213,'Défi-4'!$C$2:$J$200,8,FALSE),\"\")","v":""},{"$f":"IFERROR(VLOOKUP($B213,'Défi-5'!$C$2:$J$200,8,FALSE),\"\")","v":""},{"$f":"IFERROR(VLOOKUP($B213,'Défi-6'!$C$2:$J$200,8,FALSE),\"\")","v":""},{"$f":"IFERROR(VLOOKUP($B213,'Défi-7'!$C$2:$J$200,8,FALSE),\"\")","v":54},54,null,"OK","OK","OK","OK","OK","OK","OK","OK","OK",null,{"$f":"'Classement auteurs'!$B213","v":131985003401},{"$f":"IF('Classement auteurs'!C213=\"\",\"\",'Classement auteurs'!C213)","v":""},{"$f":"IF('Classement auteurs'!D213=\"\",\"\",'Classement auteurs'!D213)","v":""},{"$f":"IF('Classement auteurs'!E213=\"\",\"\",'Classement auteurs'!E213)","v":""},{"$f":"IF('Classement auteurs'!F213=\"\",\"\",'Classement auteurs'!F213)","v":""},{"$f":"IF('Classement auteurs'!G213=\"\",\"\",'Classement auteurs'!G213)","v":""},{"$f":"IF('Classement auteurs'!H213=\"\",\"\",'Classement auteurs'!H213)","v":""},{"$f":"IF('Classement auteurs'!I213=\"\",\"\",'Classement auteurs'!I213)","v":54},{"$f":"IF('Classement auteurs'!J213=\"\",\"\",'Classement auteurs'!J213)","v":54}]
[null,130527019601,{"$f":"IFERROR(VLOOKUP($B214,'Défi-1'!$C$2:$J$200,8,FALSE),\"\")","v":""},{"$f":"IFERROR(VLOOKUP($B214,'Défi-2'!$C$2:$J$200,8,FALSE),\"\")","v":""},{"$f":"IFERROR(VLOOKUP($B214,'Défi-3'!$C$2:$J$200,8,FALSE),\"\")","v":29},{"$f":"IFERROR(VLOOKUP($B214,'Défi-4'!$C$2:$J$200,8,FALSE),\"\")","v":""},{"$f":"IFERROR(VLOOKUP($B214,'Défi-5'!$C$2:$J$200,8,FALSE),\"\")","v":""},{"$f":"IFERROR(VLOOKUP($B214,'Défi-6'!$C$2:$J$200,8,FALSE),\"\")","v":""},{"$f":"IFERROR(VLOOKUP($B214,'Défi-7'!$C$2:$J$200,8,FALSE),\"\")","v":24},53,null,"OK","OK","OK","OK","OK","OK","OK","OK","OK",null,{"$f":"'Classement auteurs'!$B214","v":130527019601},{"$f":"IF('Classement auteurs'!C214=\"\",\"\",'Classement auteurs'!C214)","v":""},{"$f":"IF('Classement auteurs'!D214=\"\",\"\",'Classement auteurs'!D214)","v":""},{"$f":"IF('Classement auteurs'!E214=\"\",\"\",'Classement auteurs'!E214)","v":29},{"$f":"IF('Classement auteurs'!F214=\"\",\"\",'Classement auteurs'!F214)","v":""},{"$f":"IF('Classement auteurs'!G214=\"\",\"\",'Classement auteurs'!G214)","v":""},{"$f":"IF('Classement auteurs'!H214=\"\",\"\",'Classement auteurs'!H214)","v":""},{"$f":"IF('Classement auteurs'!I214=\"\",\"\",'Classement auteurs'!I214)","v":24},{"$f":"IF('Classement auteurs'!J214=\"\",\"\",'Classement auteurs'!J214)","v":53}]
[null,131683003301,{"$f":"IFERROR(VLOOKUP($B215,'Défi-1'!$C$2:$J$200,8,FALSE),\"\")","v":""},{"$f":"IFERROR(VLOOKUP($B215,'Défi-2'!$C$2:$J$200,8,FALSE),\"\")","v":""},{"$f":"IFERROR(VLOOKUP($B215,'Défi-3'!$C$2:$J$200,8,FALSE),\"\")","v":""},{"$f":"IFERROR(VLOOKUP($B215,'Défi-4'!$C$2:$J$200,8,FALSE),\"\")","v":53},{"$f":"IFERROR(VLOOKUP($B215,'Défi-5'!$C$2:$J$200,8,FALSE),\"\")","v":""},{"$f":"IFERROR(VLOOKUP($B215,'Défi-6'!$C$2:$J$200,8,FALSE),\"\")","v":""},{"$f":"IFERROR(VLOOKUP($B215,'Défi-7'!$C$2:$J$200,8,FALSE),\"\")","v":""},53,null,"OK","OK","OK","OK","OK","OK","OK","OK","OK",null,{"$f":"'Classement auteurs'!$B215","v":131683003301},{"$f":"IF('Classement auteurs'!C215=\"\",\"\",'Classement auteurs'!C215)","v":""},{"$f":"IF('Classement auteurs'!D215=\"\",\"\",'Classement auteurs'!D215)","v":""},{"$f":"IF('Classement auteurs'!E215=\"\",\"\",'Classement auteurs'!E215)","v":""},{"$f":"IF('Classement auteurs'!F215=\"\",\"\",'Classement auteurs'!F215)","v":53},{"$f":"IF('Classement auteurs'!G215=\"\",\"\",'Classement auteurs'!G215)","v":""},{"$f":"IF('Classement auteurs'!H215=\"\",\"\",'Classement auteurs'!H215)","v":""},{"$f":"IF('Classement auteurs'!I215=\"\",\"\",'Classement auteurs'!I215)","v":""},{"$f":"IF('Classement auteurs'!J215=\"\",\"\",'Classement auteurs'!J215)","v":53}]
[null,132203001001,{"$f":"IFERROR(VLOOKUP($B216,'Défi-1'!$C$2:$J$200,8,FALSE),\"\")","v":""},{"$f":"IFERROR(VLOOKUP($B216,'Défi-2'!$C$2:$J$200,8,FALSE),\"\")","v":""},{"$f":"IFERROR(VLOOKUP($B216,'Défi-3'!$C$2:$J$200,8,FALSE),\"\")","v":""},{"$f":"IFERROR(VLOOKUP($B216,'Défi-4'!$C$2:$J$200,8,FALSE),\"\")","v":18},{"$f":"IFERROR(VLOOKUP($B216,'Défi-5'!$C$2:$J$200,8,FALSE),\"\")","v":35},{"$f":"IFERROR(VLOOKUP($B216,'Défi-6'!$C$2:$J$200,8,FALSE),\"\")","v":""},{"$f":"IFERROR(VLOOKUP($B216,'Défi-7'!$C$2:$J$200,8,FALSE),\"\")","v":""},53,null,"OK","OK","OK","OK","OK","OK","OK","OK","OK",null,{"$f":"'Classement auteurs'!$B216","v":132203001001},{"$f":"IF('Classement auteurs'!C216=\"\",\"\",'Classement auteurs'!C216)","v":""},{"$f":"IF('Classement auteurs'!D216=\"\",\"\",'Classement auteurs'!D216)","v":""},{"$f":"IF('Classement auteurs'!E216=\"\",\"\",'Classement auteurs'!E216)","v":""},{"$f":"IF('Classement auteurs'!F216=\"\",\"\",'Classement auteurs'!F216)","v":18},{"$f":"IF('Classement auteurs'!G216=\"\",\"\",'Classement auteurs'!G216)","v":35},{"$f":"IF('Classement auteurs'!H216=\"\",\"\",'Classement auteurs'!H216)","v":""},{"$f":"IF('Classement auteurs'!I216=\"\",\"\",'Classement auteurs'!I216)","v":""},{"$f":"IF('Classement auteurs'!J216=\"\",\"\",'Classement auteurs'!J216)","v":53}]
[null,131619004201,{"$f":"IFERROR(VLOOKUP($B217,'Défi-1'!$C$2:$J$200,8,FALSE),\"\")","v":18},{"$f":"IFERROR(VLOOKUP($B217,'Défi-2'!$C$2:$J$200,8,FALSE),\"\")","v":""},{"$f":"IFERROR(VLOOKUP($B217,'Défi-3'!$C$2:$J$200,8,FALSE),\"\")","v":""},{"$f":"IFERROR(VLOOKUP($B217,'Défi-4'!$C$2:$J$200,8,FALSE),\"\")","v":""},{"$f":"IFERROR(VLOOKUP($B217,'Défi-5'!$C$2:$J$200,8,FALSE),\"\")","v":34},{"$f":"IFERROR(VLOOKUP($B217,'Défi-6'!$C$2:$J$200,8,FALSE),\"\")","v":""},{"$f":"IFERROR(VLOOKUP($B217,'Défi-7'!$C$2:$J$200,8,FALSE),\"\")","v":""},52,null,"OK","OK","OK","OK","OK","OK","OK","OK","OK",null,{"$f":"'Classement auteurs'!$B217","v":131619004201},{"$f":"IF('Classement auteurs'!C217=\"\",\"\",'Classement auteurs'!C217)","v":18},{"$f":"IF('Classement auteurs'!D217=\"\",\"\",'Classement auteurs'!D217)","v":""},{"$f":"IF('Classement auteurs'!E217=\"\",\"\",'Classement auteurs'!E217)","v":""},{"$f":"IF('Classement auteurs'!F217=\"\",\"\",'Classement auteurs'!F217)","v":""},{"$f":"IF('Classement auteurs'!G217=\"\",\"\",'Classement auteurs'!G217)","v":34},{"$f":"IF('Classement auteurs'!H217=\"\",\"\",'Classement auteurs'!H217)","v":""},{"$f":"IF('Classement auteurs'!I217=\"\",\"\",'Classement auteurs'!I217)","v":""},{"$f":"IF('Classement auteurs'!J217=\"\",\"\",'Classement auteurs'!J217)","v":52}]
[null,130987030301,{"$f":"IFERROR(VLOOKUP($B218,'Défi-1'!$C$2:$J$200,8,FALSE),\"\")","v":""},{"$f":"IFERROR(VLOOKUP($B218,'Défi-2'!$C$2:$J$200,8,FALSE),\"\")","v":""},{"$f":"IFERROR(VLOOKUP($B218,'Défi-3'!$C$2:$J$200,8,FALSE),\"\")","v":""},{"$f":"IFERROR(VLOOKUP($B218,'Défi-4'!$C$2:$J$200,8,FALSE),\"\")","v":26},{"$f":"IFERROR(VLOOKUP($B218,'Défi-5'!$C$2:$J$200,8,FALSE),\"\")","v":""},{"$f":"IFERROR(VLOOKUP($B218,'Défi-6'!$C$2:$J$200,8,FALSE),\"\")","v":26},{"$f":"IFERROR(VLOOKUP($B218,'Défi-7'!$C$2:$J$200,8,FALSE),\"\")","v":""},52,null,"OK","OK","OK","OK","OK","OK","OK","OK","OK",null,{"$f":"'Classement auteurs'!$B218","v":130987030301},{"$f":"IF('Classement auteurs'!C218=\"\",\"\",'Classement auteurs'!C218)","v":""},{"$f":"IF('Classement auteurs'!D218=\"\",\"\",'Classement auteurs'!D218)","v":""},{"$f":"IF('Classement auteurs'!E218=\"\",\"\",'Classement auteurs'!E218)","v":""},{"$f":"IF('Classement auteurs'!F218=\"\",\"\",'Classement auteurs'!F218)","v":26},{"$f":"IF('Classement auteurs'!G218=\"\",\"\",'Classement auteurs'!G218)","v":""},{"$f":"IF('Classement auteurs'!H218=\"\",\"\",'Classement auteurs'!H218)","v":26},{"$f":"IF('Classement auteurs'!I218=\"\",\"\",'Classement auteurs'!I218)","v":""},{"$f":"IF('Classement auteurs'!J218=\"\",\"\",'Classement auteurs'!J218)","v":52}]
[null,131499010301,{"$f":"IFERROR(VLOOKUP($B219,'Défi-1'!$C$2:$J$200,8,FALSE),\"\")","v":""},{"$f":"IFERROR(VLOOKUP($B219,'Défi-2'!$C$2:$J$200,8,FALSE),\"\")","v":""},{"$f":"IFERROR(VLOOKUP($B219,'Défi-3'!$C$2:$J$200,8,FALSE),\"\")","v":""},{"$f":"IFERROR(VLOOKUP($B219,'Défi-4'!$C$2:$J$200,8,FALSE),\"\")","v":""},{"$f":"IFERROR(VLOOKUP($B219,'Défi-5'!$C$2:$J$200,8,FALSE),\"\")","v":50},{"$f":"IFERROR(VLOOKUP($B219,'Défi-6'!$C$2:$J$200,8,FALSE),\"\")","v":""},{"$f":"IFERROR(VLOOKUP($B219,'Défi-7'!$C$2:$J$200,8,FALSE),\"\")","v":""},50,null,"OK","OK","OK","OK","OK","OK","OK","OK","OK",null,{"$f":"'Classement auteurs'!$B219","v":131499010301},{"$f":"IF('Classement auteurs'!C219=\"\",\"\",'Classement auteurs'!C219)","v":""},{"$f":"IF('Classement auteurs'!D219=\"\",\"\",'Classement auteurs'!D219)","v":""},{"$f":"IF('Classement auteurs'!E219=\"\",\"\",'Classement auteurs'!E219)","v":""},{"$f":"IF('Classement auteurs'!F219=\"\",\"\",'Classement auteurs'!F219)","v":""},{"$f":"IF('Classement auteurs'!G219=\"\",\"\",'Classement auteurs'!G219)","v":50},{"$f":"IF('Classement auteurs'!H219=\"\",\"\",'Classement auteurs'!H219)","v":""},{"$f":"IF('Classement auteurs'!I219=\"\",\"\",'Classement auteurs'!I219)","v":""},{"$f":"IF('Classement auteurs'!J219=\"\",\"\",'Classement auteurs'!J219)","v":50}]
[null,132203000901,{"$f":"IFERROR(VLOOKUP($B220,'Défi-1'!$C$2:$J$200,8,FALSE),\"\")","v":""},{"$f":"IFERROR(VLOOKUP($B220,'Défi-2'!$C$2:$J$200,8,FALSE),\"\")","v":48},{"$f":"IFERROR(VLOOKUP($B220,'Défi-3'!$C$2:$J$200,8,FALSE),\"\")","v":""},{"$f":"IFERROR(VLOOKUP($B220,'Défi-4'!$C$2:$J$200,8,FALSE),\"\")","v":""},{"$f":"IFERROR(VLOOKUP($B220,'Défi-5'!$C$2:$J$200,8,FALSE),\"\")","v":""},{"$f":"IFERROR(VLOOKUP($B220,'Défi-6'!$C$2:$J$200,8,FALSE),\"\")","v":""},{"$f":"IFERROR(VLOOKUP($B220,'Défi-7'!$C$2:$J$200,8,FALSE),\"\")","v":""},48,null,"OK","OK","OK","OK","OK","OK","OK","OK","OK",null,{"$f":"'Classement auteurs'!$B220","v":132203000901},{"$f":"IF('Classement auteurs'!C220=\"\",\"\",'Classement auteurs'!C220)","v":""},{"$f":"IF('Classement auteurs'!D220=\"\",\"\",'Classement auteurs'!D220)","v":48},{"$f":"IF('Classement auteurs'!E220=\"\",\"\",'Classement auteurs'!E220)","v":""},{"$f":"IF('Classement auteurs'!F220=\"\",\"\",'Classement auteurs'!F220)","v":""},{"$f":"IF('Classement auteurs'!G220=\"\",\"\",'Classement auteurs'!G220)","v":""},{"$f":"IF('Classement auteurs'!H220=\"\",\"\",'Classement auteurs'!H220)","v":""},{"$f":"IF('Classement auteurs'!I220=\"\",\"\",'Classement auteurs'!I220)","v":""},{"$f":"IF('Classement auteurs'!J220=\"\",\"\",'Classement auteurs'!J220)","v":48}]
[null,131494003001,{"$f":"IFERROR(VLOOKUP($B221,'Défi-1'!$C$2:$J$200,8,FALSE),\"\")","v":""},{"$f":"IFERROR(VLOOKUP($B221,'Défi-2'!$C$2:$J$200,8,FALSE),\"\")","v":""},{"$f":"IFERROR(VLOOKUP($B221,'Défi-3'!$C$2:$J$200,8,FALSE),\"\")","v":""},{"$f":"IFERROR(VLOOKUP($B221,'Défi-4'!$C$2:$J$200,8,FALSE),\"\")","v":""},{"$f":"IFERROR(VLOOKUP($B221,'Défi-5'!$C$2:$J$200,8,FALSE),\"\")","v":24},{"$f":"IFERROR(VLOOKUP($B221,'Défi-6'!$C$2:$J$200,8,FALSE),\"\")","v":24},{"$f":"IFERROR(VLOOKUP($B221,'Défi-7'!$C$2:$J$200,8,FALSE),\"\")","v":""},48,null,"OK","OK","OK","OK","OK","OK","OK","OK","OK",null,{"$f":"'Classement auteurs'!$B221","v":131494003001},{"$f":"IF('Classement auteurs'!C221=\"\",\"\",'Classement auteurs'!C221)","v":""},{"$f":"IF('Classement auteurs'!D221=\"\",\"\",'Classement auteurs'!D221)","v":""},{"$f":"IF('Classement auteurs'!E221=\"\",\"\",'Classement auteurs'!E221)","v":""},{"$f":"IF('Classement auteurs'!F221=\"\",\"\",'Classement auteurs'!F221)","v":""},{"$f":"IF('Classement auteurs'!G221=\"\",\"\",'Classement auteurs'!G221)","v":24},{"$f":"IF('Classement auteurs'!H221=\"\",\"\",'Classement auteurs'!H221)","v":24},{"$f":"IF('Classement auteurs'!I221=\"\",\"\",'Classement auteurs'!I221)","v":""},{"$f":"IF('Classement auteurs'!J221=\"\",\"\",'Classement auteurs'!J221)","v":48}]
[null,131353002601,{"$f":"IFERROR(VLOOKUP($B222,'Défi-1'!$C$2:$J$200,8,FALSE),\"\")","v":""},{"$f":"IFERROR(VLOOKUP($B222,'Défi-2'!$C$2:$J$200,8,FALSE),\"\")","v":""},{"$f":"IFERROR(VLOOKUP($B222,'Défi-3'!$C$2:$J$200,8,FALSE),\"\")","v":""},{"$f":"IFERROR(VLOOKUP($B222,'Défi-4'!$C$2:$J$200,8,FALSE),\"\")","v":""},{"$f":"IFERROR(VLOOKUP($B222,'Défi-5'!$C$2:$J$200,8,FALSE),\"\")","v":""},{"$f":"IFERROR(VLOOKUP($B222,'Défi-6'!$C$2:$J$200,8,FALSE),\"\")","v":48},{"$f":"IFERROR(VLOOKUP($B222,'Défi-7'!$C$2:$J$200,8,FALSE),\"\")","v":""},48,null,"OK","OK","OK","OK","OK","OK","OK","OK","OK",null,{"$f":"'Classement auteurs'!$B222","v":131353002601},{"$f":"IF('Classement auteurs'!C222=\"\",\"\",'Classement auteurs'!C222)","v":""},{"$f":"IF('Classement auteurs'!D222=\"\",\"\",'Classement auteurs'!D222)","v":""},{"$f":"IF('Classement auteurs'!E222=\"\",\"\",'Classement auteurs'!E222)","v":""},{"$f":"IF('Classement auteurs'!F222=\"\",\"\",'Classement auteurs'!F222)","v":""},{"$f":"IF('Classement auteurs'!G222=\"\",\"\",'Classement auteurs'!G222)","v":""},{"$f":"IF('Classement auteurs'!H222=\"\",\"\",'Classement auteurs'!H222)","v":48},{"$f":"IF('Classement auteurs'!I222=\"\",\"\",'Classement auteurs'!I222)","v":""},{"$f":"IF('Classement auteurs'!J222=\"\",\"\",'Classement auteurs'!J222)","v":48}]
[null,132103000401,{"$f":"IFERROR(VLOOKUP($B223,'Défi-1'!$C$2:$J$200,8,FALSE),\"\")","v":""},{"$f":"IFERROR(VLOOKUP($B223,'Défi-2'!$C$2:$J$200,8,FALSE),\"\")","v":""},{"$f":"IFERROR(VLOOKUP($B223,'Défi-3'!$C$2:$J$200,8,FALSE),\"\")","v":""},{"$f":"IFERROR(VLOOKUP($B223,'Défi-4'!$C$2:$J$200,8,FALSE),\"\")","v":""},{"$f":"IFERROR(VLOOKUP($B223,'Défi-5'!$C$2:$J$200,8,FALSE),\"\")","v":""},{"$f":"IFERROR(VLOOKUP($B223,'Défi-6'!$C$2:$J$200,8,FALSE),\"\")","v":""},{"$f":"IFERROR(VLOOKUP($B223,'Défi-7'!$C$2:$J$200,8,FALSE),\"\")","v":47},47,null,"OK","OK","OK","OK","OK","OK","OK","OK","OK",null,{"$f":"'Classement auteurs'!$B223","v":132103000401},{"$f":"IF('Classement auteurs'!C223=\"\",\"\",'Classement auteurs'!C223)","v":""},{"$f":"IF('Classement auteurs'!D223=\"\",\"\",'Classement auteurs'!D223)","v":""},{"$f":"IF('Classement auteurs'!E223=\"\",\"\",'Classement auteurs'!E223)","v":""},{"$f":"IF('Classement auteurs'!F223=\"\",\"\",'Classement auteurs'!F223)","v":""},{"$f":"IF('Classement auteurs'!G223=\"\",\"\",'Classement auteurs'!G223)","v":""},{"$f":"IF('Classement auteurs'!H223=\"\",\"\",'Classement auteurs'!H223)","v":""},{"$f":"IF('Classement auteurs'!I223=\"\",\"\",'Classement auteurs'!I223)","v":47},{"$f":"IF('Classement auteurs'!J223=\"\",\"\",'Classement auteurs'!J223)","v":47}]
[null,132003002201,{"$f":"IFERROR(VLOOKUP($B224,'Défi-1'!$C$2:$J$200,8,FALSE),\"\")","v":""},{"$f":"IFERROR(VLOOKUP($B224,'Défi-2'!$C$2:$J$200,8,FALSE),\"\")","v":""},{"$f":"IFERROR(VLOOKUP($B224,'Défi-3'!$C$2:$J$200,8,FALSE),\"\")","v":""},{"$f":"IFERROR(VLOOKUP($B224,'Défi-4'!$C$2:$J$200,8,FALSE),\"\")","v":""},{"$f":"IFERROR(VLOOKUP($B224,'Défi-5'!$C$2:$J$200,8,FALSE),\"\")","v":""},{"$f":"IFERROR(VLOOKUP($B224,'Défi-6'!$C$2:$J$200,8,FALSE),\"\")","v":""},{"$f":"IFERROR(VLOOKUP($B224,'Défi-7'!$C$2:$J$200,8,FALSE),\"\")","v":47},47,null,"OK","OK","OK","OK","OK","OK","OK","OK","OK",null,{"$f":"'Classement auteurs'!$B224","v":132003002201},{"$f":"IF('Classement auteurs'!C224=\"\",\"\",'Classement auteurs'!C224)","v":""},{"$f":"IF('Classement auteurs'!D224=\"\",\"\",'Classement auteurs'!D224)","v":""},{"$f":"IF('Classement auteurs'!E224=\"\",\"\",'Classement auteurs'!E224)","v":""},{"$f":"IF('Classement auteurs'!F224=\"\",\"\",'Classement auteurs'!F224)","v":""},{"$f":"IF('Classement auteurs'!G224=\"\",\"\",'Classement auteurs'!G224)","v":""},{"$f":"IF('Classement auteurs'!H224=\"\",\"\",'Classement auteurs'!H224)","v":""},{"$f":"IF('Classement auteurs'!I224=\"\",\"\",'Classement auteurs'!I224)","v":47},{"$f":"IF('Classement auteurs'!J224=\"\",\"\",'Classement auteurs'!J224)","v":47}]
[null,131845000901,{"$f":"IFERROR(VLOOKUP($B225,'Défi-1'!$C$2:$J$200,8,FALSE),\"\")","v":""},{"$f":"IFERROR(VLOOKUP($B225,'Défi-2'!$C$2:$J$200,8,FALSE),\"\")","v":""},{"$f":"IFERROR(VLOOKUP($B225,'Défi-3'!$C$2:$J$200,8,FALSE),\"\")","v":""},{"$f":"IFERROR(VLOOKUP($B225,'Défi-4'!$C$2:$J$200,8,FALSE),\"\")","v":""},{"$f":"IFERROR(VLOOKUP($B225,'Défi-5'!$C$2:$J$200,8,FALSE),\"\")","v":""},{"$f":"IFERROR(VLOOKUP($B225,'Défi-6'!$C$2:$J$200,8,FALSE),\"\")","v":""},{"$f":"IFERROR(VLOOKUP($B225,'Défi-7'!$C$2:$J$200,8,FALSE),\"\")","v":45},45,null,"OK","OK","OK","OK","OK","OK","OK","OK","OK",null,{"$f":"'Classement auteurs'!$B225","v":131845000901},{"$f":"IF('Classement auteurs'!C225=\"\",\"\",'Classement auteurs'!C225)","v":""},{"$f":"IF('Classement auteurs'!D225=\"\",\"\",'Classement auteurs'!D225)","v":""},{"$f":"IF('Classement auteurs'!E225=\"\",\"\",'Classement auteurs'!E225)","v":""},{"$f":"IF('Classement auteurs'!F225=\"\",\"\",'Classement auteurs'!F225)","v":""},{"$f":"IF('Classement auteurs'!G225=\"\",\"\",'Classement auteurs'!G225)","v":""},{"$f":"IF('Classement auteurs'!H225=\"\",\"\",'Classement auteurs'!H225)","v":""},{"$f":"IF('Classement auteurs'!I225=\"\",\"\",'Classement auteurs'!I225)","v":45},{"$f":"IF('Classement auteurs'!J225=\"\",\"\",'Classement auteurs'!J225)","v":45}]
[null,132103000201,{"$f":"IFERROR(VLOOKUP($B226,'Défi-1'!$C$2:$J$200,8,FALSE),\"\")","v":""},{"$f":"IFERROR(VLOOKUP($B226,'Défi-2'!$C$2:$J$200,8,FALSE),\"\")","v":""},{"$f":"IFERROR(VLOOKUP($B226,'Défi-3'!$C$2:$J$200,8,FALSE),\"\")","v":44},{"$f":"IFERROR(VLOOKUP($B226,'Défi-4'!$C$2:$J$200,8,FALSE),\"\")","v":""},{"$f":"IFERROR(VLOOKUP($B226,'Défi-5'!$C$2:$J$200,8,FALSE),\"\")","v":""},{"$f":"IFERROR(VLOOKUP($B226,'Défi-6'!$C$2:$J$200,8,FALSE),\"\")","v":""},{"$f":"IFERROR(VLOOKUP($B226,'Défi-7'!$C$2:$J$200,8,FALSE),\"\")","v":""},44,null,"OK","OK","OK","OK","OK","OK","OK","OK","OK",null,{"$f":"'Classement auteurs'!$B226","v":132103000201},{"$f":"IF('Classement auteurs'!C226=\"\",\"\",'Classement auteurs'!C226)","v":""},{"$f":"IF('Classement auteurs'!D226=\"\",\"\",'Classement auteurs'!D226)","v":""},{"$f":"IF('Classement auteurs'!E226=\"\",\"\",'Classement auteurs'!E226)","v":44},{"$f":"IF('Classement auteurs'!F226=\"\",\"\",'Classement auteurs'!F226)","v":""},{"$f":"IF('Classement auteurs'!G226=\"\",\"\",'Classement auteurs'!G226)","v":""},{"$f":"IF('Classement auteurs'!H226=\"\",\"\",'Classement auteurs'!H226)","v":""},{"$f":"IF('Classement auteurs'!I226=\"\",\"\",'Classement auteurs'!I226)","v":""},{"$f":"IF('Classement auteurs'!J226=\"\",\"\",'Classement auteurs'!J226)","v":44}]
[null,132203001101,{"$f":"IFERROR(VLOOKUP($B227,'Défi-1'!$C$2:$J$200,8,FALSE),\"\")","v":""},{"$f":"IFERROR(VLOOKUP($B227,'Défi-2'!$C$2:$J$200,8,FALSE),\"\")","v":""},{"$f":"IFERROR(VLOOKUP($B227,'Défi-3'!$C$2:$J$200,8,FALSE),\"\")","v":44},{"$f":"IFERROR(VLOOKUP($B227,'Défi-4'!$C$2:$J$200,8,FALSE),\"\")","v":""},{"$f":"IFERROR(VLOOKUP($B227,'Défi-5'!$C$2:$J$200,8,FALSE),\"\")","v":""},{"$f":"IFERROR(VLOOKUP($B227,'Défi-6'!$C$2:$J$200,8,FALSE),\"\")","v":""},{"$f":"IFERROR(VLOOKUP($B227,'Défi-7'!$C$2:$J$200,8,FALSE),\"\")","v":""},44,null,"OK","OK","OK","OK","OK","OK","OK","OK","OK",null,{"$f":"'Classement auteurs'!$B227","v":132203001101},{"$f":"IF('Classement auteurs'!C227=\"\",\"\",'Classement auteurs'!C227)","v":""},{"$f":"IF('Classement auteurs'!D227=\"\",\"\",'Classement auteurs'!D227)","v":""},{"$f":"IF('Classement auteurs'!E227=\"\",\"\",'Classement auteurs'!E227)","v":44},{"$f":"IF('Classement auteurs'!F227=\"\",\"\",'Classement auteurs'!F227)","v":""},{"$f":"IF('Classement auteurs'!G227=\"\",\"\",'Classement auteurs'!G227)","v":""},{"$f":"IF('Classement auteurs'!H227=\"\",\"\",'Classement auteurs'!H227)","v":""},{"$f":"IF('Classement auteurs'!I227=\"\",\"\",'Classement auteurs'!I227)","v":""},{"$f":"IF('Classement auteurs'!J227=\"\",\"\",'Classement auteurs'!J227)","v":44}]
[null,132084004801,{"$f":"IFERROR(VLOOKUP($B228,'Défi-1'!$C$2:$J$200,8,FALSE),\"\")","v":""},{"$f":"IFERROR(VLOOKUP($B228,'Défi-2'!$C$2:$J$200,8,FALSE),\"\")","v":""},{"$f":"IFERROR(VLOOKUP($B228,'Défi-3'!$C$2:$J$200,8,FALSE),\"\")","v":""},{"$f":"IFERROR(VLOOKUP($B228,'Défi-4'!$C$2:$J$200,8,FALSE),\"\")","v":""},{"$f":"IFERROR(VLOOKUP($B228,'Défi-5'!$C$2:$J$200,8,FALSE),\"\")","v":""},{"$f":"IFERROR(VLOOKUP($B228,'Défi-6'!$C$2:$J$200,8,FALSE),\"\")","v":""},{"$f":"IFERROR(VLOOKUP($B228,'Défi-7'!$C$2:$J$200,8,FALSE),\"\")","v":44},44,null,"OK","OK","OK","OK","OK","OK","OK","OK","OK",null,{"$f":"'Classement auteurs'!$B228","v":132084004801},{"$f":"IF('Classement auteurs'!C228=\"\",\"\",'Classement auteurs'!C228)","v":""},{"$f":"IF('Classement auteurs'!D228=\"\",\"\",'Classement auteurs'!D228)","v":""},{"$f":"IF('Classement auteurs'!E228=\"\",\"\",'Classement auteurs'!E228)","v":""},{"$f":"IF('Classement auteurs'!F228=\"\",\"\",'Classement auteurs'!F228)","v":""},{"$f":"IF('Classement auteurs'!G228=\"\",\"\",'Classement auteurs'!G228)","v":""},{"$f":"IF('Classement auteurs'!H228=\"\",\"\",'Classement auteurs'!H228)","v":""},{"$f":"IF('Classement auteurs'!I228=\"\",\"\",'Classement auteurs'!I228)","v":44},{"$f":"IF('Classement auteurs'!J228=\"\",\"\",'Classement auteurs'!J228)","v":44}]
[null,131619005301,{"$f":"IFERROR(VLOOKUP($B229,'Défi-1'!$C$2:$J$200,8,FALSE),\"\")","v":""},{"$f":"IFERROR(VLOOKUP($B229,'Défi-2'!$C$2:$J$200,8,FALSE),\"\")","v":""},{"$f":"IFERROR(VLOOKUP($B229,'Défi-3'!$C$2:$J$200,8,FALSE),\"\")","v":""},{"$f":"IFERROR(VLOOKUP($B229,'Défi-4'!$C$2:$J$200,8,FALSE),\"\")","v":""},{"$f":"IFERROR(VLOOKUP($B229,'Défi-5'!$C$2:$J$200,8,FALSE),\"\")","v":43},{"$f":"IFERROR(VLOOKUP($B229,'Défi-6'!$C$2:$J$200,8,FALSE),\"\")","v":""},{"$f":"IFERROR(VLOOKUP($B229,'Défi-7'!$C$2:$J$200,8,FALSE),\"\")","v":""},43,null,"OK","OK","OK","OK","OK","OK","OK","OK","OK",null,{"$f":"'Classement auteurs'!$B229","v":131619005301},{"$f":"IF('Classement auteurs'!C229=\"\",\"\",'Classement auteurs'!C229)","v":""},{"$f":"IF('Classement auteurs'!D229=\"\",\"\",'Classement auteurs'!D229)","v":""},{"$f":"IF('Classement auteurs'!E229=\"\",\"\",'Classement auteurs'!E229)","v":""},{"$f":"IF('Classement auteurs'!F229=\"\",\"\",'Classement auteurs'!F229)","v":""},{"$f":"IF('Classement auteurs'!G229=\"\",\"\",'Classement auteurs'!G229)","v":43},{"$f":"IF('Classement auteurs'!H229=\"\",\"\",'Classement auteurs'!H229)","v":""},{"$f":"IF('Classement auteurs'!I229=\"\",\"\",'Classement auteurs'!I229)","v":""},{"$f":"IF('Classement auteurs'!J229=\"\",\"\",'Classement auteurs'!J229)","v":43}]
[null,131985003601,{"$f":"IFERROR(VLOOKUP($B230,'Défi-1'!$C$2:$J$200,8,FALSE),\"\")","v":""},{"$f":"IFERROR(VLOOKUP($B230,'Défi-2'!$C$2:$J$200,8,FALSE),\"\")","v":""},{"$f":"IFERROR(VLOOKUP($B230,'Défi-3'!$C$2:$J$200,8,FALSE),\"\")","v":""},{"$f":"IFERROR(VLOOKUP($B230,'Défi-4'!$C$2:$J$200,8,FALSE),\"\")","v":""},{"$f":"IFERROR(VLOOKUP($B230,'Défi-5'!$C$2:$J$200,8,FALSE),\"\")","v":""},{"$f":"IFERROR(VLOOKUP($B230,'Défi-6'!$C$2:$J$200,8,FALSE),\"\")","v":""},{"$f":"IFERROR(VLOOKUP($B230,'Défi-7'!$C$2:$J$200,8,FALSE),\"\")","v":43},43,null,"OK","OK","OK","OK","OK","OK","OK","OK","OK",null,{"$f":"'Classement auteurs'!$B230","v":131985003601},{"$f":"IF('Classement auteurs'!C230=\"\",\"\",'Classement auteurs'!C230)","v":""},{"$f":"IF('Classement auteurs'!D230=\"\",\"\",'Classement auteurs'!D230)","v":""},{"$f":"IF('Classement auteurs'!E230=\"\",\"\",'Classement auteurs'!E230)","v":""},{"$f":"IF('Classement auteurs'!F230=\"\",\"\",'Classement auteurs'!F230)","v":""},{"$f":"IF('Classement auteurs'!G230=\"\",\"\",'Classement auteurs'!G230)","v":""},{"$f":"IF('Classement auteurs'!H230=\"\",\"\",'Classement auteurs'!H230)","v":""},{"$f":"IF('Classement auteurs'!I230=\"\",\"\",'Classement auteurs'!I230)","v":43},{"$f":"IF('Classement auteurs'!J230=\"\",\"\",'Classement auteurs'!J230)","v":43}]
[null,131862001601,{"$f":"IFERROR(VLOOKUP($B231,'Défi-1'!$C$2:$J$200,8,FALSE),\"\")","v":""},{"$f":"IFERROR(VLOOKUP($B231,'Défi-2'!$C$2:$J$200,8,FALSE),\"\")","v":""},{"$f":"IFERROR(VLOOKUP($B231,'Défi-3'!$C$2:$J$200,8,FALSE),\"\")","v":""},{"$f":"IFERROR(VLOOKUP($B231,'Défi-4'!$C$2:$J$200,8,FALSE),\"\")","v":""},{"$f":"IFERROR(VLOOKUP($B231,'Défi-5'!$C$2:$J$200,8,FALSE),\"\")","v":""},{"$f":"IFERROR(VLOOKUP($B231,'Défi-6'!$C$2:$J$200,8,FALSE),\"\")","v":""},{"$f":"IFERROR(VLOOKUP($B231,'Défi-7'!$C$2:$J$200,8,FALSE),\"\")","v":43},43,null,"OK","OK","OK","OK","OK","OK","OK","OK","OK",null,{"$f":"'Classement auteurs'!$B231","v":131862001601},{"$f":"IF('Classement auteurs'!C231=\"\",\"\",'Classement auteurs'!C231)","v":""},{"$f":"IF('Classement auteurs'!D231=\"\",\"\",'Classement auteurs'!D231)","v":""},{"$f":"IF('Classement auteurs'!E231=\"\",\"\",'Classement auteurs'!E231)","v":""},{"$f":"IF('Classement auteurs'!F231=\"\",\"\",'Classement auteurs'!F231)","v":""},{"$f":"IF('Classement auteurs'!G231=\"\",\"\",'Classement auteurs'!G231)","v":""},{"$f":"IF('Classement auteurs'!H231=\"\",\"\",'Classement auteurs'!H231)","v":""},{"$f":"IF('Classement auteurs'!I231=\"\",\"\",'Classement auteurs'!I231)","v":43},{"$f":"IF('Classement auteurs'!J231=\"\",\"\",'Classement auteurs'!J231)","v":43}]
[null,130000021001,{"$f":"IFERROR(VLOOKUP($B232,'Défi-1'!$C$2:$J$200,8,FALSE),\"\")","v":""},{"$f":"IFERROR(VLOOKUP($B232,'Défi-2'!$C$2:$J$200,8,FALSE),\"\")","v":""},{"$f":"IFERROR(VLOOKUP($B232,'Défi-3'!$C$2:$J$200,8,FALSE),\"\")","v":21},{"$f":"IFERROR(VLOOKUP($B232,'Défi-4'!$C$2:$J$200,8,FALSE),\"\")","v":""},{"$f":"IFERROR(VLOOKUP($B232,'Défi-5'!$C$2:$J$200,8,FALSE),\"\")","v":""},{"$f":"IFERROR(VLOOKUP($B232,'Défi-6'!$C$2:$J$200,8,FALSE),\"\")","v":21},{"$f":"IFERROR(VLOOKUP($B232,'Défi-7'!$C$2:$J$200,8,FALSE),\"\")","v":""},42,null,"OK","OK","OK","OK","OK","OK","OK","OK","OK",null,{"$f":"'Classement auteurs'!$B232","v":130000021001},{"$f":"IF('Classement auteurs'!C232=\"\",\"\",'Classement auteurs'!C232)","v":""},{"$f":"IF('Classement auteurs'!D232=\"\",\"\",'Classement auteurs'!D232)","v":""},{"$f":"IF('Classement auteurs'!E232=\"\",\"\",'Classement auteurs'!E232)","v":21},{"$f":"IF('Classement auteurs'!F232=\"\",\"\",'Classement auteurs'!F232)","v":""},{"$f":"IF('Classement auteurs'!G232=\"\",\"\",'Classement auteurs'!G232)","v":""},{"$f":"IF('Classement auteurs'!H232=\"\",\"\",'Classement auteurs'!H232)","v":21},{"$f":"IF('Classement auteurs'!I232=\"\",\"\",'Classement auteurs'!I232)","v":""},{"$f":"IF('Classement auteurs'!J232=\"\",\"\",'Classement auteurs'!J232)","v":42}]
[null,130993016601,{"$f":"IFERROR(VLOOKUP($B233,'Défi-1'!$C$2:$J$200,8,FALSE),\"\")","v":""},{"$f":"IFERROR(VLOOKUP($B233,'Défi-2'!$C$2:$J$200,8,FALSE),\"\")","v":""},{"$f":"IFERROR(VLOOKUP($B233,'Défi-3'!$C$2:$J$200,8,FALSE),\"\")","v":""},{"$f":"IFERROR(VLOOKUP($B233,'Défi-4'!$C$2:$J$200,8,FALSE),\"\")","v":42},{"$f":"IFERROR(VLOOKUP($B233,'Défi-5'!$C$2:$J$200,8,FALSE),\"\")","v":""},{"$f":"IFERROR(VLOOKUP($B233,'Défi-6'!$C$2:$J$200,8,FALSE),\"\")","v":""},{"$f":"IFERROR(VLOOKUP($B233,'Défi-7'!$C$2:$J$200,8,FALSE),\"\")","v":""},42,null,"OK","OK","OK","OK","OK","OK","OK","OK","OK",null,{"$f":"'Classement auteurs'!$B233","v":130993016601},{"$f":"IF('Classement auteurs'!C233=\"\",\"\",'Classement auteurs'!C233)","v":""},{"$f":"IF('Classement auteurs'!D233=\"\",\"\",'Classement auteurs'!D233)","v":""},{"$f":"IF('Classement auteurs'!E233=\"\",\"\",'Classement auteurs'!E233)","v":""},{"$f":"IF('Classement auteurs'!F233=\"\",\"\",'Classement auteurs'!F233)","v":42},{"$f":"IF('Classement auteurs'!G233=\"\",\"\",'Classement auteurs'!G233)","v":""},{"$f":"IF('Classement auteurs'!H233=\"\",\"\",'Classement auteurs'!H233)","v":""},{"$f":"IF('Classement auteurs'!I233=\"\",\"\",'Classement auteurs'!I233)","v":""},{"$f":"IF('Classement auteurs'!J233=\"\",\"\",'Classement auteurs'!J233)","v":42}]
[null,131956006101,{"$f":"IFERROR(VLOOKUP($B234,'Défi-1'!$C$2:$J$200,8,FALSE),\"\")","v":""},{"$f":"IFERROR(VLOOKUP($B234,'Défi-2'!$C$2:$J$200,8,FALSE),\"\")","v":""},{"$f":"IFERROR(VLOOKUP($B234,'Défi-3'!$C$2:$J$200,8,FALSE),\"\")","v":""},{"$f":"IFERROR(VLOOKUP($B234,'Défi-4'!$C$2:$J$200,8,FALSE),\"\")","v":""},{"$f":"IFERROR(VLOOKUP($B234,'Défi-5'!$C$2:$J$200,8,FALSE),\"\")","v":42},{"$f":"IFERROR(VLOOKUP($B234,'Défi-6'!$C$2:$J$200,8,FALSE),\"\")","v":""},{"$f":"IFERROR(VLOOKUP($B234,'Défi-7'!$C$2:$J$200,8,FALSE),\"\")","v":""},42,null,"OK","OK","OK","OK","OK","OK","OK","OK","OK",null,{"$f":"'Classement auteurs'!$B234","v":131956006101},{"$f":"IF('Classement auteurs'!C234=\"\",\"\",'Classement auteurs'!C234)","v":""},{"$f":"IF('Classement auteurs'!D234=\"\",\"\",'Classement auteurs'!D234)","v":""},{"$f":"IF('Classement auteurs'!E234=\"\",\"\",'Classement auteurs'!E234)","v":""},{"$f":"IF('Classement auteurs'!F234=\"\",\"\",'Classement auteurs'!F234)","v":""},{"$f":"IF('Classement auteurs'!G234=\"\",\"\",'Classement auteurs'!G234)","v":42},{"$f":"IF('Classement auteurs'!H234=\"\",\"\",'Classement auteurs'!H234)","v":""},{"$f":"IF('Classement auteurs'!I234=\"\",\"\",'Classement auteurs'!I234)","v":""},{"$f":"IF('Classement auteurs'!J234=\"\",\"\",'Classement auteurs'!J234)","v":42}]
[null,130993010201,{"$f":"IFERROR(VLOOKUP($B235,'Défi-1'!$C$2:$J$200,8,FALSE),\"\")","v":""},{"$f":"IFERROR(VLOOKUP($B235,'Défi-2'!$C$2:$J$200,8,FALSE),\"\")","v":""},{"$f":"IFERROR(VLOOKUP($B235,'Défi-3'!$C$2:$J$200,8,FALSE),\"\")","v":""},{"$f":"IFERROR(VLOOKUP($B235,'Défi-4'!$C$2:$J$200,8,FALSE),\"\")","v":41},{"$f":"IFERROR(VLOOKUP($B235,'Défi-5'!$C$2:$J$200,8,FALSE),\"\")","v":""},{"$f":"IFERROR(VLOOKUP($B235,'Défi-6'!$C$2:$J$200,8,FALSE),\"\")","v":""},{"$f":"IFERROR(VLOOKUP($B235,'Défi-7'!$C$2:$J$200,8,FALSE),\"\")","v":""},41,null,"OK","OK","OK","OK","OK","OK","OK","OK","OK",null,{"$f":"'Classement auteurs'!$B235","v":130993010201},{"$f":"IF('Classement auteurs'!C235=\"\",\"\",'Classement auteurs'!C235)","v":""},{"$f":"IF('Classement auteurs'!D235=\"\",\"\",'Classement auteurs'!D235)","v":""},{"$f":"IF('Classement auteurs'!E235=\"\",\"\",'Classement auteurs'!E235)","v":""},{"$f":"IF('Classement auteurs'!F235=\"\",\"\",'Classement auteurs'!F235)","v":41},{"$f":"IF('Classement auteurs'!G235=\"\",\"\",'Classement auteurs'!G235)","v":""},{"$f":"IF('Classement auteurs'!H235=\"\",\"\",'Classement auteurs'!H235)","v":""},{"$f":"IF('Classement auteurs'!I235=\"\",\"\",'Classement auteurs'!I235)","v":""},{"$f":"IF('Classement auteurs'!J235=\"\",\"\",'Classement auteurs'!J235)","v":41}]
[null,131899000801,{"$f":"IFERROR(VLOOKUP($B236,'Défi-1'!$C$2:$J$200,8,FALSE),\"\")","v":""},{"$f":"IFERROR(VLOOKUP($B236,'Défi-2'!$C$2:$J$200,8,FALSE),\"\")","v":""},{"$f":"IFERROR(VLOOKUP($B236,'Défi-3'!$C$2:$J$200,8,FALSE),\"\")","v":""},{"$f":"IFERROR(VLOOKUP($B236,'Défi-4'!$C$2:$J$200,8,FALSE),\"\")","v":""},{"$f":"IFERROR(VLOOKUP($B236,'Défi-5'!$C$2:$J$200,8,FALSE),\"\")","v":41},{"$f":"IFERROR(VLOOKUP($B236,'Défi-6'!$C$2:$J$200,8,FALSE),\"\")","v":""},{"$f":"IFERROR(VLOOKUP($B236,'Défi-7'!$C$2:$J$200,8,FALSE),\"\")","v":""},41,null,"OK","OK","OK","OK","OK","OK","OK","OK","OK",null,{"$f":"'Classement auteurs'!$B236","v":131899000801},{"$f":"IF('Classement auteurs'!C236=\"\",\"\",'Classement auteurs'!C236)","v":""},{"$f":"IF('Classement auteurs'!D236=\"\",\"\",'Classement auteurs'!D236)","v":""},{"$f":"IF('Classement auteurs'!E236=\"\",\"\",'Classement auteurs'!E236)","v":""},{"$f":"IF('Classement auteurs'!F236=\"\",\"\",'Classement auteurs'!F236)","v":""},{"$f":"IF('Classement auteurs'!G236=\"\",\"\",'Classement auteurs'!G236)","v":41},{"$f":"IF('Classement auteurs'!H236=\"\",\"\",'Classement auteurs'!H236)","v":""},{"$f":"IF('Classement auteurs'!I236=\"\",\"\",'Classement auteurs'!I236)","v":""},{"$f":"IF('Classement auteurs'!J236=\"\",\"\",'Classement auteurs'!J236)","v":41}]
[null,130000015001,{"$f":"IFERROR(VLOOKUP($B237,'Défi-1'!$C$2:$J$200,8,FALSE),\"\")","v":""},{"$f":"IFERROR(VLOOKUP($B237,'Défi-2'!$C$2:$J$200,8,FALSE),\"\")","v":""},{"$f":"IFERROR(VLOOKUP($B237,'Défi-3'!$C$2:$J$200,8,FALSE),\"\")","v":""},{"$f":"IFERROR(VLOOKUP($B237,'Défi-4'!$C$2:$J$200,8,FALSE),\"\")","v":""},{"$f":"IFERROR(VLOOKUP($B237,'Défi-5'!$C$2:$J$200,8,FALSE),\"\")","v":""},{"$f":"IFERROR(VLOOKUP($B237,'Défi-6'!$C$2:$J$200,8,FALSE),\"\")","v":""},{"$f":"IFERROR(VLOOKUP($B237,'Défi-7'!$C$2:$J$200,8,FALSE),\"\")","v":41},41,null,"OK","OK","OK","OK","OK","OK","OK","OK","OK",null,{"$f":"'Classement auteurs'!$B237","v":130000015001},{"$f":"IF('Classement auteurs'!C237=\"\",\"\",'Classement auteurs'!C237)","v":""},{"$f":"IF('Classement auteurs'!D237=\"\",\"\",'Classement auteurs'!D237)","v":""},{"$f":"IF('Classement auteurs'!E237=\"\",\"\",'Classement auteurs'!E237)","v":""},{"$f":"IF('Classement auteurs'!F237=\"\",\"\",'Classement auteurs'!F237)","v":""},{"$f":"IF('Classement auteurs'!G237=\"\",\"\",'Classement auteurs'!G237)","v":""},{"$f":"IF('Classement auteurs'!H237=\"\",\"\",'Classement auteurs'!H237)","v":""},{"$f":"IF('Classement auteurs'!I237=\"\",\"\",'Classement auteurs'!I237)","v":41},{"$f":"IF('Classement auteurs'!J237=\"\",\"\",'Classement auteurs'!J237)","v":41}]
[null,132060002101,{"$f":"IFERROR(VLOOKUP($B238,'Défi-1'!$C$2:$J$200,8,FALSE),\"\")","v":""},{"$f":"IFERROR(VLOOKUP($B238,'Défi-2'!$C$2:$J$200,8,FALSE),\"\")","v":""},{"$f":"IFERROR(VLOOKUP($B238,'Défi-3'!$C$2:$J$200,8,FALSE),\"\")","v":""},{"$f":"IFERROR(VLOOKUP($B238,'Défi-4'!$C$2:$J$200,8,FALSE),\"\")","v":""},{"$f":"IFERROR(VLOOKUP($B238,'Défi-5'!$C$2:$J$200,8,FALSE),\"\")","v":""},{"$f":"IFERROR(VLOOKUP($B238,'Défi-6'!$C$2:$J$200,8,FALSE),\"\")","v":""},{"$f":"IFERROR(VLOOKUP($B238,'Défi-7'!$C$2:$J$200,8,FALSE),\"\")","v":41},41,null,"OK","OK","OK","OK","OK","OK","OK","OK","OK",null,{"$f":"'Classement auteurs'!$B238","v":132060002101},{"$f":"IF('Classement auteurs'!C238=\"\",\"\",'Classement auteurs'!C238)","v":""},{"$f":"IF('Classement auteurs'!D238=\"\",\"\",'Classement auteurs'!D238)","v":""},{"$f":"IF('Classement auteurs'!E238=\"\",\"\",'Classement auteurs'!E238)","v":""},{"$f":"IF('Classement auteurs'!F238=\"\",\"\",'Classement auteurs'!F238)","v":""},{"$f":"IF('Classement auteurs'!G238=\"\",\"\",'Classement auteurs'!G238)","v":""},{"$f":"IF('Classement auteurs'!H238=\"\",\"\",'Classement auteurs'!H238)","v":""},{"$f":"IF('Classement auteurs'!I238=\"\",\"\",'Classement auteurs'!I238)","v":41},{"$f":"IF('Classement auteurs'!J238=\"\",\"\",'Classement auteurs'!J238)","v":41}]
[null,130000020801,{"$f":"IFERROR(VLOOKUP($B239,'Défi-1'!$C$2:$J$200,8,FALSE),\"\")","v":40},{"$f":"IFERROR(VLOOKUP($B239,'Défi-2'!$C$2:$J$200,8,FALSE),\"\")","v":""},{"$f":"IFERROR(VLOOKUP($B239,'Défi-3'!$C$2:$J$200,8,FALSE),\"\")","v":""},{"$f":"IFERROR(VLOOKUP($B239,'Défi-4'!$C$2:$J$200,8,FALSE),\"\")","v":""},{"$f":"IFERROR(VLOOKUP($B239,'Défi-5'!$C$2:$J$200,8,FALSE),\"\")","v":""},{"$f":"IFERROR(VLOOKUP($B239,'Défi-6'!$C$2:$J$200,8,FALSE),\"\")","v":""},{"$f":"IFERROR(VLOOKUP($B239,'Défi-7'!$C$2:$J$200,8,FALSE),\"\")","v":""},40,null,"OK","OK","OK","OK","OK","OK","OK","OK","OK",null,{"$f":"'Classement auteurs'!$B239","v":130000020801},{"$f":"IF('Classement auteurs'!C239=\"\",\"\",'Classement auteurs'!C239)","v":40},{"$f":"IF('Classement auteurs'!D239=\"\",\"\",'Classement auteurs'!D239)","v":""},{"$f":"IF('Classement auteurs'!E239=\"\",\"\",'Classement auteurs'!E239)","v":""},{"$f":"IF('Classement auteurs'!F239=\"\",\"\",'Classement auteurs'!F239)","v":""},{"$f":"IF('Classement auteurs'!G239=\"\",\"\",'Classement auteurs'!G239)","v":""},{"$f":"IF('Classement auteurs'!H239=\"\",\"\",'Classement auteurs'!H239)","v":""},{"$f":"IF('Classement auteurs'!I239=\"\",\"\",'Classement auteurs'!I239)","v":""},{"$f":"IF('Classement auteurs'!J239=\"\",\"\",'Classement auteurs'!J239)","v":40}]
[null,131992000901,{"$f":"IFERROR(VLOOKUP($B240,'Défi-1'!$C$2:$J$200,8,FALSE),\"\")","v":""},{"$f":"IFERROR(VLOOKUP($B240,'Défi-2'!$C$2:$J$200,8,FALSE),\"\")","v":""},{"$f":"IFERROR(VLOOKUP($B240,'Défi-3'!$C$2:$J$200,8,FALSE),\"\")","v":""},{"$f":"IFERROR(VLOOKUP($B240,'Défi-4'!$C$2:$J$200,8,FALSE),\"\")","v":""},{"$f":"IFERROR(VLOOKUP($B240,'Défi-5'!$C$2:$J$200,8,FALSE),\"\")","v":""},{"$f":"IFERROR(VLOOKUP($B240,'Défi-6'!$C$2:$J$200,8,FALSE),\"\")","v":""},{"$f":"IFERROR(VLOOKUP($B240,'Défi-7'!$C$2:$J$200,8,FALSE),\"\")","v":40},40,null,"OK","OK","OK","OK","OK","OK","OK","OK","OK",null,{"$f":"'Classement auteurs'!$B240","v":131992000901},{"$f":"IF('Classement auteurs'!C240=\"\",\"\",'Classement auteurs'!C240)","v":""},{"$f":"IF('Classement auteurs'!D240=\"\",\"\",'Classement auteurs'!D240)","v":""},{"$f":"IF('Classement auteurs'!E240=\"\",\"\",'Classement auteurs'!E240)","v":""},{"$f":"IF('Classement auteurs'!F240=\"\",\"\",'Classement auteurs'!F240)","v":""},{"$f":"IF('Classement auteurs'!G240=\"\",\"\",'Classement auteurs'!G240)","v":""},{"$f":"IF('Classement auteurs'!H240=\"\",\"\",'Classement auteurs'!H240)","v":""},{"$f":"IF('Classement auteurs'!I240=\"\",\"\",'Classement auteurs'!I240)","v":40},{"$f":"IF('Classement auteurs'!J240=\"\",\"\",'Classement auteurs'!J240)","v":40}]
[null,132089000501,{"$f":"IFERROR(VLOOKUP($B241,'Défi-1'!$C$2:$J$200,8,FALSE),\"\")","v":""},{"$f":"IFERROR(VLOOKUP($B241,'Défi-2'!$C$2:$J$200,8,FALSE),\"\")","v":39},{"$f":"IFERROR(VLOOKUP($B241,'Défi-3'!$C$2:$J$200,8,FALSE),\"\")","v":""},{"$f":"IFERROR(VLOOKUP($B241,'Défi-4'!$C$2:$J$200,8,FALSE),\"\")","v":""},{"$f":"IFERROR(VLOOKUP($B241,'Défi-5'!$C$2:$J$200,8,FALSE),\"\")","v":""},{"$f":"IFERROR(VLOOKUP($B241,'Défi-6'!$C$2:$J$200,8,FALSE),\"\")","v":""},{"$f":"IFERROR(VLOOKUP($B241,'Défi-7'!$C$2:$J$200,8,FALSE),\"\")","v":""},39,null,"OK","OK","OK","OK","OK","OK","OK","OK","OK",null,{"$f":"'Classement auteurs'!$B241","v":132089000501},{"$f":"IF('Classement auteurs'!C241=\"\",\"\",'Classement auteurs'!C241)","v":""},{"$f":"IF('Classement auteurs'!D241=\"\",\"\",'Classement auteurs'!D241)","v":39},{"$f":"IF('Classement auteurs'!E241=\"\",\"\",'Classement auteurs'!E241)","v":""},{"$f":"IF('Classement auteurs'!F241=\"\",\"\",'Classement auteurs'!F241)","v":""},{"$f":"IF('Classement auteurs'!G241=\"\",\"\",'Classement auteurs'!G241)","v":""},{"$f":"IF('Classement auteurs'!H241=\"\",\"\",'Classement auteurs'!H241)","v":""},{"$f":"IF('Classement auteurs'!I241=\"\",\"\",'Classement auteurs'!I241)","v":""},{"$f":"IF('Classement auteurs'!J241=\"\",\"\",'Classement auteurs'!J241)","v":39}]
[null,132084005001,{"$f":"IFERROR(VLOOKUP($B242,'Défi-1'!$C$2:$J$200,8,FALSE),\"\")","v":""},{"$f":"IFERROR(VLOOKUP($B242,'Défi-2'!$C$2:$J$200,8,FALSE),\"\")","v":""},{"$f":"IFERROR(VLOOKUP($B242,'Défi-3'!$C$2:$J$200,8,FALSE),\"\")","v":39},{"$f":"IFERROR(VLOOKUP($B242,'Défi-4'!$C$2:$J$200,8,FALSE),\"\")","v":""},{"$f":"IFERROR(VLOOKUP($B242,'Défi-5'!$C$2:$J$200,8,FALSE),\"\")","v":""},{"$f":"IFERROR(VLOOKUP($B242,'Défi-6'!$C$2:$J$200,8,FALSE),\"\")","v":""},{"$f":"IFERROR(VLOOKUP($B242,'Défi-7'!$C$2:$J$200,8,FALSE),\"\")","v":""},39,null,"OK","OK","OK","OK","OK","OK","OK","OK","OK",null,{"$f":"'Classement auteurs'!$B242","v":132084005001},{"$f":"IF('Classement auteurs'!C242=\"\",\"\",'Classement auteurs'!C242)","v":""},{"$f":"IF('Classement auteurs'!D242=\"\",\"\",'Classement auteurs'!D242)","v":""},{"$f":"IF('Classement auteurs'!E242=\"\",\"\",'Classement auteurs'!E242)","v":39},{"$f":"IF('Classement auteurs'!F242=\"\",\"\",'Classement auteurs'!F242)","v":""},{"$f":"IF('Classement auteurs'!G242=\"\",\"\",'Classement auteurs'!G242)","v":""},{"$f":"IF('Classement auteurs'!H242=\"\",\"\",'Classement auteurs'!H242)","v":""},{"$f":"IF('Classement auteurs'!I242=\"\",\"\",'Classement auteurs'!I242)","v":""},{"$f":"IF('Classement auteurs'!J242=\"\",\"\",'Classement auteurs'!J242)","v":39}]
[null,132193001901,{"$f":"IFERROR(VLOOKUP($B243,'Défi-1'!$C$2:$J$200,8,FALSE),\"\")","v":""},{"$f":"IFERROR(VLOOKUP($B243,'Défi-2'!$C$2:$J$200,8,FALSE),\"\")","v":""},{"$f":"IFERROR(VLOOKUP($B243,'Défi-3'!$C$2:$J$200,8,FALSE),\"\")","v":""},{"$f":"IFERROR(VLOOKUP($B243,'Défi-4'!$C$2:$J$200,8,FALSE),\"\")","v":""},{"$f":"IFERROR(VLOOKUP($B243,'Défi-5'!$C$2:$J$200,8,FALSE),\"\")","v":39},{"$f":"IFERROR(VLOOKUP($B243,'Défi-6'!$C$2:$J$200,8,FALSE),\"\")","v":""},{"$f":"IFERROR(VLOOKUP($B243,'Défi-7'!$C$2:$J$200,8,FALSE),\"\")","v":""},39,null,"OK","OK","OK","OK","OK","OK","OK","OK","OK",null,{"$f":"'Classement auteurs'!$B243","v":132193001901},{"$f":"IF('Classement auteurs'!C243=\"\",\"\",'Classement auteurs'!C243)","v":""},{"$f":"IF('Classement auteurs'!D243=\"\",\"\",'Classement auteurs'!D243)","v":""},{"$f":"IF('Classement auteurs'!E243=\"\",\"\",'Classement auteurs'!E243)","v":""},{"$f":"IF('Classement auteurs'!F243=\"\",\"\",'Classement auteurs'!F243)","v":""},{"$f":"IF('Classement auteurs'!G243=\"\",\"\",'Classement auteurs'!G243)","v":39},{"$f":"IF('Classement auteurs'!H243=\"\",\"\",'Classement auteurs'!H243)","v":""},{"$f":"IF('Classement auteurs'!I243=\"\",\"\",'Classement auteurs'!I243)","v":""},{"$f":"IF('Classement auteurs'!J243=\"\",\"\",'Classement auteurs'!J243)","v":39}]
[null,130878015701,{"$f":"IFERROR(VLOOKUP($B244,'Défi-1'!$C$2:$J$200,8,FALSE),\"\")","v":""},{"$f":"IFERROR(VLOOKUP($B244,'Défi-2'!$C$2:$J$200,8,FALSE),\"\")","v":""},{"$f":"IFERROR(VLOOKUP($B244,'Défi-3'!$C$2:$J$200,8,FALSE),\"\")","v":""},{"$f":"IFERROR(VLOOKUP($B244,'Défi-4'!$C$2:$J$200,8,FALSE),\"\")","v":""},{"$f":"IFERROR(VLOOKUP($B244,'Défi-5'!$C$2:$J$200,8,FALSE),\"\")","v":""},{"$f":"IFERROR(VLOOKUP($B244,'Défi-6'!$C$2:$J$200,8,FALSE),\"\")","v":""},{"$f":"IFERROR(VLOOKUP($B244,'Défi-7'!$C$2:$J$200,8,FALSE),\"\")","v":39},39,null,"OK","OK","OK","OK","OK","OK","OK","OK","OK",null,{"$f":"'Classement auteurs'!$B244","v":130878015701},{"$f":"IF('Classement auteurs'!C244=\"\",\"\",'Classement auteurs'!C244)","v":""},{"$f":"IF('Classement auteurs'!D244=\"\",\"\",'Classement auteurs'!D244)","v":""},{"$f":"IF('Classement auteurs'!E244=\"\",\"\",'Classement auteurs'!E244)","v":""},{"$f":"IF('Classement auteurs'!F244=\"\",\"\",'Classement auteurs'!F244)","v":""},{"$f":"IF('Classement auteurs'!G244=\"\",\"\",'Classement auteurs'!G244)","v":""},{"$f":"IF('Classement auteurs'!H244=\"\",\"\",'Classement auteurs'!H244)","v":""},{"$f":"IF('Classement auteurs'!I244=\"\",\"\",'Classement auteurs'!I244)","v":39},{"$f":"IF('Classement auteurs'!J244=\"\",\"\",'Classement auteurs'!J244)","v":39}]
[null,132023001701,{"$f":"IFERROR(VLOOKUP($B245,'Défi-1'!$C$2:$J$200,8,FALSE),\"\")","v":""},{"$f":"IFERROR(VLOOKUP($B245,'Défi-2'!$C$2:$J$200,8,FALSE),\"\")","v":""},{"$f":"IFERROR(VLOOKUP($B245,'Défi-3'!$C$2:$J$200,8,FALSE),\"\")","v":""},{"$f":"IFERROR(VLOOKUP($B245,'Défi-4'!$C$2:$J$200,8,FALSE),\"\")","v":""},{"$f":"IFERROR(VLOOKUP($B245,'Défi-5'!$C$2:$J$200,8,FALSE),\"\")","v":38},{"$f":"IFERROR(VLOOKUP($B245,'Défi-6'!$C$2:$J$200,8,FALSE),\"\")","v":""},{"$f":"IFERROR(VLOOKUP($B245,'Défi-7'!$C$2:$J$200,8,FALSE),\"\")","v":""},38,null,"OK","OK","OK","OK","OK","OK","OK","OK","OK",null,{"$f":"'Classement auteurs'!$B245","v":132023001701},{"$f":"IF('Classement auteurs'!C245=\"\",\"\",'Classement auteurs'!C245)","v":""},{"$f":"IF('Classement auteurs'!D245=\"\",\"\",'Classement auteurs'!D245)","v":""},{"$f":"IF('Classement auteurs'!E245=\"\",\"\",'Classement auteurs'!E245)","v":""},{"$f":"IF('Classement auteurs'!F245=\"\",\"\",'Classement auteurs'!F245)","v":""},{"$f":"IF('Classement auteurs'!G245=\"\",\"\",'Classement auteurs'!G245)","v":38},{"$f":"IF('Classement auteurs'!H245=\"\",\"\",'Classement auteurs'!H245)","v":""},{"$f":"IF('Classement auteurs'!I245=\"\",\"\",'Classement auteurs'!I245)","v":""},{"$f":"IF('Classement auteurs'!J245=\"\",\"\",'Classement auteurs'!J245)","v":38}]
[null,130527012601,{"$f":"IFERROR(VLOOKUP($B246,'Défi-1'!$C$2:$J$200,8,FALSE),\"\")","v":""},{"$f":"IFERROR(VLOOKUP($B246,'Défi-2'!$C$2:$J$200,8,FALSE),\"\")","v":37},{"$f":"IFERROR(VLOOKUP($B246,'Défi-3'!$C$2:$J$200,8,FALSE),\"\")","v":""},{"$f":"IFERROR(VLOOKUP($B246,'Défi-4'!$C$2:$J$200,8,FALSE),\"\")","v":""},{"$f":"IFERROR(VLOOKUP($B246,'Défi-5'!$C$2:$J$200,8,FALSE),\"\")","v":""},{"$f":"IFERROR(VLOOKUP($B246,'Défi-6'!$C$2:$J$200,8,FALSE),\"\")","v":""},{"$f":"IFERROR(VLOOKUP($B246,'Défi-7'!$C$2:$J$200,8,FALSE),\"\")","v":""},37,null,"OK","OK","OK","OK","OK","OK","OK","OK","OK",null,{"$f":"'Classement auteurs'!$B246","v":130527012601},{"$f":"IF('Classement auteurs'!C246=\"\",\"\",'Classement auteurs'!C246)","v":""},{"$f":"IF('Classement auteurs'!D246=\"\",\"\",'Classement auteurs'!D246)","v":37},{"$f":"IF('Classement auteurs'!E246=\"\",\"\",'Classement auteurs'!E246)","v":""},{"$f":"IF('Classement auteurs'!F246=\"\",\"\",'Classement auteurs'!F246)","v":""},{"$f":"IF('Classement auteurs'!G246=\"\",\"\",'Classement auteurs'!G246)","v":""},{"$f":"IF('Classement auteurs'!H246=\"\",\"\",'Classement auteurs'!H246)","v":""},{"$f":"IF('Classement auteurs'!I246=\"\",\"\",'Classement auteurs'!I246)","v":""},{"$f":"IF('Classement auteurs'!J246=\"\",\"\",'Classement auteurs'!J246)","v":37}]
[null,132103000501,{"$f":"IFERROR(VLOOKUP($B247,'Défi-1'!$C$2:$J$200,8,FALSE),\"\")","v":""},{"$f":"IFERROR(VLOOKUP($B247,'Défi-2'!$C$2:$J$200,8,FALSE),\"\")","v":""},{"$f":"IFERROR(VLOOKUP($B247,'Défi-3'!$C$2:$J$200,8,FALSE),\"\")","v":37},{"$f":"IFERROR(VLOOKUP($B247,'Défi-4'!$C$2:$J$200,8,FALSE),\"\")","v":""},{"$f":"IFERROR(VLOOKUP($B247,'Défi-5'!$C$2:$J$200,8,FALSE),\"\")","v":""},{"$f":"IFERROR(VLOOKUP($B247,'Défi-6'!$C$2:$J$200,8,FALSE),\"\")","v":""},{"$f":"IFERROR(VLOOKUP($B247,'Défi-7'!$C$2:$J$200,8,FALSE),\"\")","v":""},37,null,"OK","OK","OK","OK","OK","OK","OK","OK","OK",null,{"$f":"'Classement auteurs'!$B247","v":132103000501},{"$f":"IF('Classement auteurs'!C247=\"\",\"\",'Classement auteurs'!C247)","v":""},{"$f":"IF('Classement auteurs'!D247=\"\",\"\",'Classement auteurs'!D247)","v":""},{"$f":"IF('Classement auteurs'!E247=\"\",\"\",'Classement auteurs'!E247)","v":37},{"$f":"IF('Classement auteurs'!F247=\"\",\"\",'Classement auteurs'!F247)","v":""},{"$f":"IF('Classement auteurs'!G247=\"\",\"\",'Classement auteurs'!G247)","v":""},{"$f":"IF('Classement auteurs'!H247=\"\",\"\",'Classement auteurs'!H247)","v":""},{"$f":"IF('Classement auteurs'!I247=\"\",\"\",'Classement auteurs'!I247)","v":""},{"$f":"IF('Classement auteurs'!J247=\"\",\"\",'Classement auteurs'!J247)","v":37}]
[null,131899003801,{"$f":"IFERROR(VLOOKUP($B248,'Défi-1'!$C$2:$J$200,8,FALSE),\"\")","v":""},{"$f":"IFERROR(VLOOKUP($B248,'Défi-2'!$C$2:$J$200,8,FALSE),\"\")","v":""},{"$f":"IFERROR(VLOOKUP($B248,'Défi-3'!$C$2:$J$200,8,FALSE),\"\")","v":""},{"$f":"IFERROR(VLOOKUP($B248,'Défi-4'!$C$2:$J$200,8,FALSE),\"\")","v":""},{"$f":"IFERROR(VLOOKUP($B248,'Défi-5'!$C$2:$J$200,8,FALSE),\"\")","v":37},{"$f":"IFERROR(VLOOKUP($B248,'Défi-6'!$C$2:$J$200,8,FALSE),\"\")","v":""},{"$f":"IFERROR(VLOOKUP($B248,'Défi-7'!$C$2:$J$200,8,FALSE),\"\")","v":""},37,null,"OK","OK","OK","OK","OK","OK","OK","OK","OK",null,{"$f":"'Classement auteurs'!$B248","v":131899003801},{"$f":"IF('Classement auteurs'!C248=\"\",\"\",'Classement auteurs'!C248)","v":""},{"$f":"IF('Classement auteurs'!D248=\"\",\"\",'Classement auteurs'!D248)","v":""},{"$f":"IF('Classement auteurs'!E248=\"\",\"\",'Classement auteurs'!E248)","v":""},{"$f":"IF('Classement auteurs'!F248=\"\",\"\",'Classement auteurs'!F248)","v":""},{"$f":"IF('Classement auteurs'!G248=\"\",\"\",'Classement auteurs'!G248)","v":37},{"$f":"IF('Classement auteurs'!H248=\"\",\"\",'Classement auteurs'!H248)","v":""},{"$f":"IF('Classement auteurs'!I248=\"\",\"\",'Classement auteurs'!I248)","v":""},{"$f":"IF('Classement auteurs'!J248=\"\",\"\",'Classement auteurs'!J248)","v":37}]
[null,131376000101,{"$f":"IFERROR(VLOOKUP($B249,'Défi-1'!$C$2:$J$200,8,FALSE),\"\")","v":""},{"$f":"IFERROR(VLOOKUP($B249,'Défi-2'!$C$2:$J$200,8,FALSE),\"\")","v":""},{"$f":"IFERROR(VLOOKUP($B249,'Défi-3'!$C$2:$J$200,8,FALSE),\"\")","v":""},{"$f":"IFERROR(VLOOKUP($B249,'Défi-4'!$C$2:$J$200,8,FALSE),\"\")","v":""},{"$f":"IFERROR(VLOOKUP($B249,'Défi-5'!$C$2:$J$200,8,FALSE),\"\")","v":37},{"$f":"IFERROR(VLOOKUP($B249,'Défi-6'!$C$2:$J$200,8,FALSE),\"\")","v":""},{"$f":"IFERROR(VLOOKUP($B249,'Défi-7'!$C$2:$J$200,8,FALSE),\"\")","v":""},37,null,"OK","OK","OK","OK","OK","OK","OK","OK","OK",null,{"$f":"'Classement auteurs'!$B249","v":131376000101},{"$f":"IF('Classement auteurs'!C249=\"\",\"\",'Classement auteurs'!C249)","v":""},{"$f":"IF('Classement auteurs'!D249=\"\",\"\",'Classement auteurs'!D249)","v":""},{"$f":"IF('Classement auteurs'!E249=\"\",\"\",'Classement auteurs'!E249)","v":""},{"$f":"IF('Classement auteurs'!F249=\"\",\"\",'Classement auteurs'!F249)","v":""},{"$f":"IF('Classement auteurs'!G249=\"\",\"\",'Classement auteurs'!G249)","v":37},{"$f":"IF('Classement auteurs'!H249=\"\",\"\",'Classement auteurs'!H249)","v":""},{"$f":"IF('Classement auteurs'!I249=\"\",\"\",'Classement auteurs'!I249)","v":""},{"$f":"IF('Classement auteurs'!J249=\"\",\"\",'Classement auteurs'!J249)","v":37}]
[null,132193000801,{"$f":"IFERROR(VLOOKUP($B250,'Défi-1'!$C$2:$J$200,8,FALSE),\"\")","v":""},{"$f":"IFERROR(VLOOKUP($B250,'Défi-2'!$C$2:$J$200,8,FALSE),\"\")","v":""},{"$f":"IFERROR(VLOOKUP($B250,'Défi-3'!$C$2:$J$200,8,FALSE),\"\")","v":""},{"$f":"IFERROR(VLOOKUP($B250,'Défi-4'!$C$2:$J$200,8,FALSE),\"\")","v":""},{"$f":"IFERROR(VLOOKUP($B250,'Défi-5'!$C$2:$J$200,8,FALSE),\"\")","v":""},{"$f":"IFERROR(VLOOKUP($B250,'Défi-6'!$C$2:$J$200,8,FALSE),\"\")","v":""},{"$f":"IFERROR(VLOOKUP($B250,'Défi-7'!$C$2:$J$200,8,FALSE),\"\")","v":37},37,null,"OK","OK","OK","OK","OK","OK","OK","OK","OK",null,{"$f":"'Classement auteurs'!$B250","v":132193000801},{"$f":"IF('Classement auteurs'!C250=\"\",\"\",'Classement auteurs'!C250)","v":""},{"$f":"IF('Classement auteurs'!D250=\"\",\"\",'Classement auteurs'!D250)","v":""},{"$f":"IF('Classement auteurs'!E250=\"\",\"\",'Classement auteurs'!E250)","v":""},{"$f":"IF('Classement auteurs'!F250=\"\",\"\",'Classement auteurs'!F250)","v":""},{"$f":"IF('Classement auteurs'!G250=\"\",\"\",'Classement auteurs'!G250)","v":""},{"$f":"IF('Classement auteurs'!H250=\"\",\"\",'Classement auteurs'!H250)","v":""},{"$f":"IF('Classement auteurs'!I250=\"\",\"\",'Classement auteurs'!I250)","v":37},{"$f":"IF('Classement auteurs'!J250=\"\",\"\",'Classement auteurs'!J250)","v":37}]
[null,131824000201,{"$f":"IFERROR(VLOOKUP($B251,'Défi-1'!$C$2:$J$200,8,FALSE),\"\")","v":""},{"$f":"IFERROR(VLOOKUP($B251,'Défi-2'!$C$2:$J$200,8,FALSE),\"\")","v":""},{"$f":"IFERROR(VLOOKUP($B251,'Défi-3'!$C$2:$J$200,8,FALSE),\"\")","v":""},{"$f":"IFERROR(VLOOKUP($B251,'Défi-4'!$C$2:$J$200,8,FALSE),\"\")","v":""},{"$f":"IFERROR(VLOOKUP($B251,'Défi-5'!$C$2:$J$200,8,FALSE),\"\")","v":""},{"$f":"IFERROR(VLOOKUP($B251,'Défi-6'!$C$2:$J$200,8,FALSE),\"\")","v":""},{"$f":"IFERROR(VLOOKUP($B251,'Défi-7'!$C$2:$J$200,8,FALSE),\"\")","v":37},37,null,"OK","OK","OK","OK","OK","OK","OK","OK","OK",null,{"$f":"'Classement auteurs'!$B251","v":131824000201},{"$f":"IF('Classement auteurs'!C251=\"\",\"\",'Classement auteurs'!C251)","v":""},{"$f":"IF('Classement auteurs'!D251=\"\",\"\",'Classement auteurs'!D251)","v":""},{"$f":"IF('Classement auteurs'!E251=\"\",\"\",'Classement auteurs'!E251)","v":""},{"$f":"IF('Classement auteurs'!F251=\"\",\"\",'Classement auteurs'!F251)","v":""},{"$f":"IF('Classement auteurs'!G251=\"\",\"\",'Classement auteurs'!G251)","v":""},{"$f":"IF('Classement auteurs'!H251=\"\",\"\",'Classement auteurs'!H251)","v":""},{"$f":"IF('Classement auteurs'!I251=\"\",\"\",'Classement auteurs'!I251)","v":37},{"$f":"IF('Classement auteurs'!J251=\"\",\"\",'Classement auteurs'!J251)","v":37}]
[null,131956005601,{"$f":"IFERROR(VLOOKUP($B252,'Défi-1'!$C$2:$J$200,8,FALSE),\"\")","v":""},{"$f":"IFERROR(VLOOKUP($B252,'Défi-2'!$C$2:$J$200,8,FALSE),\"\")","v":""},{"$f":"IFERROR(VLOOKUP($B252,'Défi-3'!$C$2:$J$200,8,FALSE),\"\")","v":""},{"$f":"IFERROR(VLOOKUP($B252,'Défi-4'!$C$2:$J$200,8,FALSE),\"\")","v":""},{"$f":"IFERROR(VLOOKUP($B252,'Défi-5'!$C$2:$J$200,8,FALSE),\"\")","v":""},{"$f":"IFERROR(VLOOKUP($B252,'Défi-6'!$C$2:$J$200,8,FALSE),\"\")","v":""},{"$f":"IFERROR(VLOOKUP($B252,'Défi-7'!$C$2:$J$200,8,FALSE),\"\")","v":37},37,null,"OK","OK","OK","OK","OK","OK","OK","OK","OK",null,{"$f":"'Classement auteurs'!$B252","v":131956005601},{"$f":"IF('Classement auteurs'!C252=\"\",\"\",'Classement auteurs'!C252)","v":""},{"$f":"IF('Classement auteurs'!D252=\"\",\"\",'Classement auteurs'!D252)","v":""},{"$f":"IF('Classement auteurs'!E252=\"\",\"\",'Classement auteurs'!E252)","v":""},{"$f":"IF('Classement auteurs'!F252=\"\",\"\",'Classement auteurs'!F252)","v":""},{"$f":"IF('Classement auteurs'!G252=\"\",\"\",'Classement auteurs'!G252)","v":""},{"$f":"IF('Classement auteurs'!H252=\"\",\"\",'Classement auteurs'!H252)","v":""},{"$f":"IF('Classement auteurs'!I252=\"\",\"\",'Classement auteurs'!I252)","v":37},{"$f":"IF('Classement auteurs'!J252=\"\",\"\",'Classement auteurs'!J252)","v":37}]
[null,130527006401,{"$f":"IFERROR(VLOOKUP($B253,'Défi-1'!$C$2:$J$200,8,FALSE),\"\")","v":36},{"$f":"IFERROR(VLOOKUP($B253,'Défi-2'!$C$2:$J$200,8,FALSE),\"\")","v":""},{"$f":"IFERROR(VLOOKUP($B253,'Défi-3'!$C$2:$J$200,8,FALSE),\"\")","v":""},{"$f":"IFERROR(VLOOKUP($B253,'Défi-4'!$C$2:$J$200,8,FALSE),\"\")","v":""},{"$f":"IFERROR(VLOOKUP($B253,'Défi-5'!$C$2:$J$200,8,FALSE),\"\")","v":""},{"$f":"IFERROR(VLOOKUP($B253,'Défi-6'!$C$2:$J$200,8,FALSE),\"\")","v":""},{"$f":"IFERROR(VLOOKUP($B253,'Défi-7'!$C$2:$J$200,8,FALSE),\"\")","v":""},36,null,"OK","OK","OK","OK","OK","OK","OK","OK","OK",null,{"$f":"'Classement auteurs'!$B253","v":130527006401},{"$f":"IF('Classement auteurs'!C253=\"\",\"\",'Classement auteurs'!C253)","v":36},{"$f":"IF('Classement auteurs'!D253=\"\",\"\",'Classement auteurs'!D253)","v":""},{"$f":"IF('Classement auteurs'!E253=\"\",\"\",'Classement auteurs'!E253)","v":""},{"$f":"IF('Classement auteurs'!F253=\"\",\"\",'Classement auteurs'!F253)","v":""},{"$f":"IF('Classement auteurs'!G253=\"\",\"\",'Classement auteurs'!G253)","v":""},{"$f":"IF('Classement auteurs'!H253=\"\",\"\",'Classement auteurs'!H253)","v":""},{"$f":"IF('Classement auteurs'!I253=\"\",\"\",'Classement auteurs'!I253)","v":""},{"$f":"IF('Classement auteurs'!J253=\"\",\"\",'Classement auteurs'!J253)","v":36}]
[null,131862001501,{"$f":"IFERROR(VLOOKUP($B254,'Défi-1'!$C$2:$J$200,8,FALSE),\"\")","v":""},{"$f":"IFERROR(VLOOKUP($B254,'Défi-2'!$C$2:$J$200,8,FALSE),\"\")","v":""},{"$f":"IFERROR(VLOOKUP($B254,'Défi-3'!$C$2:$J$200,8,FALSE),\"\")","v":""},{"$f":"IFERROR(VLOOKUP($B254,'Défi-4'!$C$2:$J$200,8,FALSE),\"\")","v":""},{"$f":"IFERROR(VLOOKUP($B254,'Défi-5'!$C$2:$J$200,8,FALSE),\"\")","v":""},{"$f":"IFERROR(VLOOKUP($B254,'Défi-6'!$C$2:$J$200,8,FALSE),\"\")","v":""},{"$f":"IFERROR(VLOOKUP($B254,'Défi-7'!$C$2:$J$200,8,FALSE),\"\")","v":36},36,null,"OK","OK","OK","OK","OK","OK","OK","OK","OK",null,{"$f":"'Classement auteurs'!$B254","v":131862001501},{"$f":"IF('Classement auteurs'!C254=\"\",\"\",'Classement auteurs'!C254)","v":""},{"$f":"IF('Classement auteurs'!D254=\"\",\"\",'Classement auteurs'!D254)","v":""},{"$f":"IF('Classement auteurs'!E254=\"\",\"\",'Classement auteurs'!E254)","v":""},{"$f":"IF('Classement auteurs'!F254=\"\",\"\",'Classement auteurs'!F254)","v":""},{"$f":"IF('Classement auteurs'!G254=\"\",\"\",'Classement auteurs'!G254)","v":""},{"$f":"IF('Classement auteurs'!H254=\"\",\"\",'Classement auteurs'!H254)","v":""},{"$f":"IF('Classement auteurs'!I254=\"\",\"\",'Classement auteurs'!I254)","v":36},{"$f":"IF('Classement auteurs'!J254=\"\",\"\",'Classement auteurs'!J254)","v":36}]
[null,131823002301,{"$f":"IFERROR(VLOOKUP($B255,'Défi-1'!$C$2:$J$200,8,FALSE),\"\")","v":""},{"$f":"IFERROR(VLOOKUP($B255,'Défi-2'!$C$2:$J$200,8,FALSE),\"\")","v":""},{"$f":"IFERROR(VLOOKUP($B255,'Défi-3'!$C$2:$J$200,8,FALSE),\"\")","v":""},{"$f":"IFERROR(VLOOKUP($B255,'Défi-4'!$C$2:$J$200,8,FALSE),\"\")","v":""},{"$f":"IFERROR(VLOOKUP($B255,'Défi-5'!$C$2:$J$200,8,FALSE),\"\")","v":""},{"$f":"IFERROR(VLOOKUP($B255,'Défi-6'!$C$2:$J$200,8,FALSE),\"\")","v":""},{"$f":"IFERROR(VLOOKUP($B255,'Défi-7'!$C$2:$J$200,8,FALSE),\"\")","v":36},36,null,"OK","OK","OK","OK","OK","OK","OK","OK","OK",null,{"$f":"'Classement auteurs'!$B255","v":131823002301},{"$f":"IF('Classement auteurs'!C255=\"\",\"\",'Classement auteurs'!C255)","v":""},{"$f":"IF('Classement auteurs'!D255=\"\",\"\",'Classement auteurs'!D255)","v":""},{"$f":"IF('Classement auteurs'!E255=\"\",\"\",'Classement auteurs'!E255)","v":""},{"$f":"IF('Classement auteurs'!F255=\"\",\"\",'Classement auteurs'!F255)","v":""},{"$f":"IF('Classement auteurs'!G255=\"\",\"\",'Classement auteurs'!G255)","v":""},{"$f":"IF('Classement auteurs'!H255=\"\",\"\",'Classement auteurs'!H255)","v":""},{"$f":"IF('Classement auteurs'!I255=\"\",\"\",'Classement auteurs'!I255)","v":36},{"$f":"IF('Classement auteurs'!J255=\"\",\"\",'Classement auteurs'!J255)","v":36}]
[null,131956004901,{"$f":"IFERROR(VLOOKUP($B256,'Défi-1'!$C$2:$J$200,8,FALSE),\"\")","v":""},{"$f":"IFERROR(VLOOKUP($B256,'Défi-2'!$C$2:$J$200,8,FALSE),\"\")","v":""},{"$f":"IFERROR(VLOOKUP($B256,'Défi-3'!$C$2:$J$200,8,FALSE),\"\")","v":""},{"$f":"IFERROR(VLOOKUP($B256,'Défi-4'!$C$2:$J$200,8,FALSE),\"\")","v":""},{"$f":"IFERROR(VLOOKUP($B256,'Défi-5'!$C$2:$J$200,8,FALSE),\"\")","v":""},{"$f":"IFERROR(VLOOKUP($B256,'Défi-6'!$C$2:$J$200,8,FALSE),\"\")","v":""},{"$f":"IFERROR(VLOOKUP($B256,'Défi-7'!$C$2:$J$200,8,FALSE),\"\")","v":36},36,null,"OK","OK","OK","OK","OK","OK","OK","OK","OK",null,{"$f":"'Classement auteurs'!$B256","v":131956004901},{"$f":"IF('Classement auteurs'!C256=\"\",\"\",'Classement auteurs'!C256)","v":""},{"$f":"IF('Classement auteurs'!D256=\"\",\"\",'Classement auteurs'!D256)","v":""},{"$f":"IF('Classement auteurs'!E256=\"\",\"\",'Classement auteurs'!E256)","v":""},{"$f":"IF('Classement auteurs'!F256=\"\",\"\",'Classement auteurs'!F256)","v":""},{"$f":"IF('Classement auteurs'!G256=\"\",\"\",'Classement auteurs'!G256)","v":""},{"$f":"IF('Classement auteurs'!H256=\"\",\"\",'Classement auteurs'!H256)","v":""},{"$f":"IF('Classement auteurs'!I256=\"\",\"\",'Classement auteurs'!I256)","v":36},{"$f":"IF('Classement auteurs'!J256=\"\",\"\",'Classement auteurs'!J256)","v":36}]
[null,132060001401,{"$f":"IFERROR(VLOOKUP($B257,'Défi-1'!$C$2:$J$200,8,FALSE),\"\")","v":""},{"$f":"IFERROR(VLOOKUP($B257,'Défi-2'!$C$2:$J$200,8,FALSE),\"\")","v":""},{"$f":"IFERROR(VLOOKUP($B257,'Défi-3'!$C$2:$J$200,8,FALSE),\"\")","v":35},{"$f":"IFERROR(VLOOKUP($B257,'Défi-4'!$C$2:$J$200,8,FALSE),\"\")","v":""},{"$f":"IFERROR(VLOOKUP($B257,'Défi-5'!$C$2:$J$200,8,FALSE),\"\")","v":""},{"$f":"IFERROR(VLOOKUP($B257,'Défi-6'!$C$2:$J$200,8,FALSE),\"\")","v":""},{"$f":"IFERROR(VLOOKUP($B257,'Défi-7'!$C$2:$J$200,8,FALSE),\"\")","v":""},35,null,"OK","OK","OK","OK","OK","OK","OK","OK","OK",null,{"$f":"'Classement auteurs'!$B257","v":132060001401},{"$f":"IF('Classement auteurs'!C257=\"\",\"\",'Classement auteurs'!C257)","v":""},{"$f":"IF('Classement auteurs'!D257=\"\",\"\",'Classement auteurs'!D257)","v":""},{"$f":"IF('Classement auteurs'!E257=\"\",\"\",'Classement auteurs'!E257)","v":35},{"$f":"IF('Classement auteurs'!F257=\"\",\"\",'Classement auteurs'!F257)","v":""},{"$f":"IF('Classement auteurs'!G257=\"\",\"\",'Classement auteurs'!G257)","v":""},{"$f":"IF('Classement auteurs'!H257=\"\",\"\",'Classement auteurs'!H257)","v":""},{"$f":"IF('Classement auteurs'!I257=\"\",\"\",'Classement auteurs'!I257)","v":""},{"$f":"IF('Classement auteurs'!J257=\"\",\"\",'Classement auteurs'!J257)","v":35}]
[null,130462009601,{"$f":"IFERROR(VLOOKUP($B258,'Défi-1'!$C$2:$J$200,8,FALSE),\"\")","v":""},{"$f":"IFERROR(VLOOKUP($B258,'Défi-2'!$C$2:$J$200,8,FALSE),\"\")","v":""},{"$f":"IFERROR(VLOOKUP($B258,'Défi-3'!$C$2:$J$200,8,FALSE),\"\")","v":""},{"$f":"IFERROR(VLOOKUP($B258,'Défi-4'!$C$2:$J$200,8,FALSE),\"\")","v":""},{"$f":"IFERROR(VLOOKUP($B258,'Défi-5'!$C$2:$J$200,8,FALSE),\"\")","v":35},{"$f":"IFERROR(VLOOKUP($B258,'Défi-6'!$C$2:$J$200,8,FALSE),\"\")","v":""},{"$f":"IFERROR(VLOOKUP($B258,'Défi-7'!$C$2:$J$200,8,FALSE),\"\")","v":""},35,null,"OK","OK","OK","OK","OK","OK","OK","OK","OK",null,{"$f":"'Classement auteurs'!$B258","v":130462009601},{"$f":"IF('Classement auteurs'!C258=\"\",\"\",'Classement auteurs'!C258)","v":""},{"$f":"IF('Classement auteurs'!D258=\"\",\"\",'Classement auteurs'!D258)","v":""},{"$f":"IF('Classement auteurs'!E258=\"\",\"\",'Classement auteurs'!E258)","v":""},{"$f":"IF('Classement auteurs'!F258=\"\",\"\",'Classement auteurs'!F258)","v":""},{"$f":"IF('Classement auteurs'!G258=\"\",\"\",'Classement auteurs'!G258)","v":35},{"$f":"IF('Classement auteurs'!H258=\"\",\"\",'Classement auteurs'!H258)","v":""},{"$f":"IF('Classement auteurs'!I258=\"\",\"\",'Classement auteurs'!I258)","v":""},{"$f":"IF('Classement auteurs'!J258=\"\",\"\",'Classement auteurs'!J258)","v":35}]
[null,132193000701,{"$f":"IFERROR(VLOOKUP($B259,'Défi-1'!$C$2:$J$200,8,FALSE),\"\")","v":""},{"$f":"IFERROR(VLOOKUP($B259,'Défi-2'!$C$2:$J$200,8,FALSE),\"\")","v":""},{"$f":"IFERROR(VLOOKUP($B259,'Défi-3'!$C$2:$J$200,8,FALSE),\"\")","v":""},{"$f":"IFERROR(VLOOKUP($B259,'Défi-4'!$C$2:$J$200,8,FALSE),\"\")","v":""},{"$f":"IFERROR(VLOOKUP($B259,'Défi-5'!$C$2:$J$200,8,FALSE),\"\")","v":""},{"$f":"IFERROR(VLOOKUP($B259,'Défi-6'!$C$2:$J$200,8,FALSE),\"\")","v":""},{"$f":"IFERROR(VLOOKUP($B259,'Défi-7'!$C$2:$J$200,8,FALSE),\"\")","v":35},35,null,"OK","OK","OK","OK","OK","OK","OK","OK","OK",null,{"$f":"'Classement auteurs'!$B259","v":132193000701},{"$f":"IF('Classement auteurs'!C259=\"\",\"\",'Classement auteurs'!C259)","v":""},{"$f":"IF('Classement auteurs'!D259=\"\",\"\",'Classement auteurs'!D259)","v":""},{"$f":"IF('Classement auteurs'!E259=\"\",\"\",'Classement auteurs'!E259)","v":""},{"$f":"IF('Classement auteurs'!F259=\"\",\"\",'Classement auteurs'!F259)","v":""},{"$f":"IF('Classement auteurs'!G259=\"\",\"\",'Classement auteurs'!G259)","v":""},{"$f":"IF('Classement auteurs'!H259=\"\",\"\",'Classement auteurs'!H259)","v":""},{"$f":"IF('Classement auteurs'!I259=\"\",\"\",'Classement auteurs'!I259)","v":35},{"$f":"IF('Classement auteurs'!J259=\"\",\"\",'Classement auteurs'!J259)","v":35}]
[null,131879001901,{"$f":"IFERROR(VLOOKUP($B260,'Défi-1'!$C$2:$J$200,8,FALSE),\"\")","v":""},{"$f":"IFERROR(VLOOKUP($B260,'Défi-2'!$C$2:$J$200,8,FALSE),\"\")","v":""},{"$f":"IFERROR(VLOOKUP($B260,'Défi-3'!$C$2:$J$200,8,FALSE),\"\")","v":""},{"$f":"IFERROR(VLOOKUP($B260,'Défi-4'!$C$2:$J$200,8,FALSE),\"\")","v":34},{"$f":"IFERROR(VLOOKUP($B260,'Défi-5'!$C$2:$J$200,8,FALSE),\"\")","v":""},{"$f":"IFERROR(VLOOKUP($B260,'Défi-6'!$C$2:$J$200,8,FALSE),\"\")","v":""},{"$f":"IFERROR(VLOOKUP($B260,'Défi-7'!$C$2:$J$200,8,FALSE),\"\")","v":""},34,null,"OK","OK","OK","OK","OK","OK","OK","OK","OK",null,{"$f":"'Classement auteurs'!$B260","v":131879001901},{"$f":"IF('Classement auteurs'!C260=\"\",\"\",'Classement auteurs'!C260)","v":""},{"$f":"IF('Classement auteurs'!D260=\"\",\"\",'Classement auteurs'!D260)","v":""},{"$f":"IF('Classement auteurs'!E260=\"\",\"\",'Classement auteurs'!E260)","v":""},{"$f":"IF('Classement auteurs'!F260=\"\",\"\",'Classement auteurs'!F260)","v":34},{"$f":"IF('Classement auteurs'!G260=\"\",\"\",'Classement auteurs'!G260)","v":""},{"$f":"IF('Classement auteurs'!H260=\"\",\"\",'Classement auteurs'!H260)","v":""},{"$f":"IF('Classement auteurs'!I260=\"\",\"\",'Classement auteurs'!I260)","v":""},{"$f":"IF('Classement auteurs'!J260=\"\",\"\",'Classement auteurs'!J260)","v":34}]
[null,130921006401,{"$f":"IFERROR(VLOOKUP($B261,'Défi-1'!$C$2:$J$200,8,FALSE),\"\")","v":""},{"$f":"IFERROR(VLOOKUP($B261,'Défi-2'!$C$2:$J$200,8,FALSE),\"\")","v":""},{"$f":"IFERROR(VLOOKUP($B261,'Défi-3'!$C$2:$J$200,8,FALSE),\"\")","v":""},{"$f":"IFERROR(VLOOKUP($B261,'Défi-4'!$C$2:$J$200,8,FALSE),\"\")","v":34},{"$f":"IFERROR(VLOOKUP($B261,'Défi-5'!$C$2:$J$200,8,FALSE),\"\")","v":""},{"$f":"IFERROR(VLOOKUP($B261,'Défi-6'!$C$2:$J$200,8,FALSE),\"\")","v":""},{"$f":"IFERROR(VLOOKUP($B261,'Défi-7'!$C$2:$J$200,8,FALSE),\"\")","v":""},34,null,"OK","OK","OK","OK","OK","OK","OK","OK","OK",null,{"$f":"'Classement auteurs'!$B261","v":130921006401},{"$f":"IF('Classement auteurs'!C261=\"\",\"\",'Classement auteurs'!C261)","v":""},{"$f":"IF('Classement auteurs'!D261=\"\",\"\",'Classement auteurs'!D261)","v":""},{"$f":"IF('Classement auteurs'!E261=\"\",\"\",'Classement auteurs'!E261)","v":""},{"$f":"IF('Classement auteurs'!F261=\"\",\"\",'Classement auteurs'!F261)","v":34},{"$f":"IF('Classement auteurs'!G261=\"\",\"\",'Classement auteurs'!G261)","v":""},{"$f":"IF('Classement auteurs'!H261=\"\",\"\",'Classement auteurs'!H261)","v":""},{"$f":"IF('Classement auteurs'!I261=\"\",\"\",'Classement auteurs'!I261)","v":""},{"$f":"IF('Classement auteurs'!J261=\"\",\"\",'Classement auteurs'!J261)","v":34}]
[null,131619004801,{"$f":"IFERROR(VLOOKUP($B262,'Défi-1'!$C$2:$J$200,8,FALSE),\"\")","v":""},{"$f":"IFERROR(VLOOKUP($B262,'Défi-2'!$C$2:$J$200,8,FALSE),\"\")","v":""},{"$f":"IFERROR(VLOOKUP($B262,'Défi-3'!$C$2:$J$200,8,FALSE),\"\")","v":""},{"$f":"IFERROR(VLOOKUP($B262,'Défi-4'!$C$2:$J$200,8,FALSE),\"\")","v":""},{"$f":"IFERROR(VLOOKUP($B262,'Défi-5'!$C$2:$J$200,8,FALSE),\"\")","v":34},{"$f":"IFERROR(VLOOKUP($B262,'Défi-6'!$C$2:$J$200,8,FALSE),\"\")","v":""},{"$f":"IFERROR(VLOOKUP($B262,'Défi-7'!$C$2:$J$200,8,FALSE),\"\")","v":""},34,null,"OK","OK","OK","OK","OK","OK","OK","OK","OK",null,{"$f":"'Classement auteurs'!$B262","v":131619004801},{"$f":"IF('Classement auteurs'!C262=\"\",\"\",'Classement auteurs'!C262)","v":""},{"$f":"IF('Classement auteurs'!D262=\"\",\"\",'Classement auteurs'!D262)","v":""},{"$f":"IF('Classement auteurs'!E262=\"\",\"\",'Classement auteurs'!E262)","v":""},{"$f":"IF('Classement auteurs'!F262=\"\",\"\",'Classement auteurs'!F262)","v":""},{"$f":"IF('Classement auteurs'!G262=\"\",\"\",'Classement auteurs'!G262)","v":34},{"$f":"IF('Classement auteurs'!H262=\"\",\"\",'Classement auteurs'!H262)","v":""},{"$f":"IF('Classement auteurs'!I262=\"\",\"\",'Classement auteurs'!I262)","v":""},{"$f":"IF('Classement auteurs'!J262=\"\",\"\",'Classement auteurs'!J262)","v":34}]
[null,131823009001,{"$f":"IFERROR(VLOOKUP($B263,'Défi-1'!$C$2:$J$200,8,FALSE),\"\")","v":""},{"$f":"IFERROR(VLOOKUP($B263,'Défi-2'!$C$2:$J$200,8,FALSE),\"\")","v":""},{"$f":"IFERROR(VLOOKUP($B263,'Défi-3'!$C$2:$J$200,8,FALSE),\"\")","v":""},{"$f":"IFERROR(VLOOKUP($B263,'Défi-4'!$C$2:$J$200,8,FALSE),\"\")","v":""},{"$f":"IFERROR(VLOOKUP($B263,'Défi-5'!$C$2:$J$200,8,FALSE),\"\")","v":""},{"$f":"IFERROR(VLOOKUP($B263,'Défi-6'!$C$2:$J$200,8,FALSE),\"\")","v":""},{"$f":"IFERROR(VLOOKUP($B263,'Défi-7'!$C$2:$J$200,8,FALSE),\"\")","v":34},34,null,"OK","OK","OK","OK","OK","OK","OK","OK","OK",null,{"$f":"'Classement auteurs'!$B263","v":131823009001},{"$f":"IF('Classement auteurs'!C263=\"\",\"\",'Classement auteurs'!C263)","v":""},{"$f":"IF('Classement auteurs'!D263=\"\",\"\",'Classement auteurs'!D263)","v":""},{"$f":"IF('Classement auteurs'!E263=\"\",\"\",'Classement auteurs'!E263)","v":""},{"$f":"IF('Classement auteurs'!F263=\"\",\"\",'Classement auteurs'!F263)","v":""},{"$f":"IF('Classement auteurs'!G263=\"\",\"\",'Classement auteurs'!G263)","v":""},{"$f":"IF('Classement auteurs'!H263=\"\",\"\",'Classement auteurs'!H263)","v":""},{"$f":"IF('Classement auteurs'!I263=\"\",\"\",'Classement auteurs'!I263)","v":34},{"$f":"IF('Classement auteurs'!J263=\"\",\"\",'Classement auteurs'!J263)","v":34}]
[null,131619002601,{"$f":"IFERROR(VLOOKUP($B264,'Défi-1'!$C$2:$J$200,8,FALSE),\"\")","v":""},{"$f":"IFERROR(VLOOKUP($B264,'Défi-2'!$C$2:$J$200,8,FALSE),\"\")","v":""},{"$f":"IFERROR(VLOOKUP($B264,'Défi-3'!$C$2:$J$200,8,FALSE),\"\")","v":""},{"$f":"IFERROR(VLOOKUP($B264,'Défi-4'!$C$2:$J$200,8,FALSE),\"\")","v":""},{"$f":"IFERROR(VLOOKUP($B264,'Défi-5'!$C$2:$J$200,8,FALSE),\"\")","v":""},{"$f":"IFERROR(VLOOKUP($B264,'Défi-6'!$C$2:$J$200,8,FALSE),\"\")","v":""},{"$f":"IFERROR(VLOOKUP($B264,'Défi-7'!$C$2:$J$200,8,FALSE),\"\")","v":34},34,null,"OK","OK","OK","OK","OK","OK","OK","OK","OK",null,{"$f":"'Classement auteurs'!$B264","v":131619002601},{"$f":"IF('Classement auteurs'!C264=\"\",\"\",'Classement auteurs'!C264)","v":""},{"$f":"IF('Classement auteurs'!D264=\"\",\"\",'Classement auteurs'!D264)","v":""},{"$f":"IF('Classement auteurs'!E264=\"\",\"\",'Classement auteurs'!E264)","v":""},{"$f":"IF('Classement auteurs'!F264=\"\",\"\",'Classement auteurs'!F264)","v":""},{"$f":"IF('Classement auteurs'!G264=\"\",\"\",'Classement auteurs'!G264)","v":""},{"$f":"IF('Classement auteurs'!H264=\"\",\"\",'Classement auteurs'!H264)","v":""},{"$f":"IF('Classement auteurs'!I264=\"\",\"\",'Classement auteurs'!I264)","v":34},{"$f":"IF('Classement auteurs'!J264=\"\",\"\",'Classement auteurs'!J264)","v":34}]
[null,131499010701,{"$f":"IFERROR(VLOOKUP($B265,'Défi-1'!$C$2:$J$200,8,FALSE),\"\")","v":""},{"$f":"IFERROR(VLOOKUP($B265,'Défi-2'!$C$2:$J$200,8,FALSE),\"\")","v":""},{"$f":"IFERROR(VLOOKUP($B265,'Défi-3'!$C$2:$J$200,8,FALSE),\"\")","v":""},{"$f":"IFERROR(VLOOKUP($B265,'Défi-4'!$C$2:$J$200,8,FALSE),\"\")","v":""},{"$f":"IFERROR(VLOOKUP($B265,'Défi-5'!$C$2:$J$200,8,FALSE),\"\")","v":33},{"$f":"IFERROR(VLOOKUP($B265,'Défi-6'!$C$2:$J$200,8,FALSE),\"\")","v":""},{"$f":"IFERROR(VLOOKUP($B265,'Défi-7'!$C$2:$J$200,8,FALSE),\"\")","v":""},33,null,"OK","OK","OK","OK","OK","OK","OK","OK","OK",null,{"$f":"'Classement auteurs'!$B265","v":131499010701},{"$f":"IF('Classement auteurs'!C265=\"\",\"\",'Classement auteurs'!C265)","v":""},{"$f":"IF('Classement auteurs'!D265=\"\",\"\",'Classement auteurs'!D265)","v":""},{"$f":"IF('Classement auteurs'!E265=\"\",\"\",'Classement auteurs'!E265)","v":""},{"$f":"IF('Classement auteurs'!F265=\"\",\"\",'Classement auteurs'!F265)","v":""},{"$f":"IF('Classement auteurs'!G265=\"\",\"\",'Classement auteurs'!G265)","v":33},{"$f":"IF('Classement auteurs'!H265=\"\",\"\",'Classement auteurs'!H265)","v":""},{"$f":"IF('Classement auteurs'!I265=\"\",\"\",'Classement auteurs'!I265)","v":""},{"$f":"IF('Classement auteurs'!J265=\"\",\"\",'Classement auteurs'!J265)","v":33}]
[null,131823007701,{"$f":"IFERROR(VLOOKUP($B266,'Défi-1'!$C$2:$J$200,8,FALSE),\"\")","v":""},{"$f":"IFERROR(VLOOKUP($B266,'Défi-2'!$C$2:$J$200,8,FALSE),\"\")","v":""},{"$f":"IFERROR(VLOOKUP($B266,'Défi-3'!$C$2:$J$200,8,FALSE),\"\")","v":""},{"$f":"IFERROR(VLOOKUP($B266,'Défi-4'!$C$2:$J$200,8,FALSE),\"\")","v":""},{"$f":"IFERROR(VLOOKUP($B266,'Défi-5'!$C$2:$J$200,8,FALSE),\"\")","v":""},{"$f":"IFERROR(VLOOKUP($B266,'Défi-6'!$C$2:$J$200,8,FALSE),\"\")","v":""},{"$f":"IFERROR(VLOOKUP($B266,'Défi-7'!$C$2:$J$200,8,FALSE),\"\")","v":33},33,null,"OK","OK","OK","OK","OK","OK","OK","OK","OK",null,{"$f":"'Classement auteurs'!$B266","v":131823007701},{"$f":"IF('Classement auteurs'!C266=\"\",\"\",'Classement auteurs'!C266)","v":""},{"$f":"IF('Classement auteurs'!D266=\"\",\"\",'Classement auteurs'!D266)","v":""},{"$f":"IF('Classement auteurs'!E266=\"\",\"\",'Classement auteurs'!E266)","v":""},{"$f":"IF('Classement auteurs'!F266=\"\",\"\",'Classement auteurs'!F266)","v":""},{"$f":"IF('Classement auteurs'!G266=\"\",\"\",'Classement auteurs'!G266)","v":""},{"$f":"IF('Classement auteurs'!H266=\"\",\"\",'Classement auteurs'!H266)","v":""},{"$f":"IF('Classement auteurs'!I266=\"\",\"\",'Classement auteurs'!I266)","v":33},{"$f":"IF('Classement auteurs'!J266=\"\",\"\",'Classement auteurs'!J266)","v":33}]
[null,131956005301,{"$f":"IFERROR(VLOOKUP($B267,'Défi-1'!$C$2:$J$200,8,FALSE),\"\")","v":""},{"$f":"IFERROR(VLOOKUP($B267,'Défi-2'!$C$2:$J$200,8,FALSE),\"\")","v":""},{"$f":"IFERROR(VLOOKUP($B267,'Défi-3'!$C$2:$J$200,8,FALSE),\"\")","v":""},{"$f":"IFERROR(VLOOKUP($B267,'Défi-4'!$C$2:$J$200,8,FALSE),\"\")","v":""},{"$f":"IFERROR(VLOOKUP($B267,'Défi-5'!$C$2:$J$200,8,FALSE),\"\")","v":32},{"$f":"IFERROR(VLOOKUP($B267,'Défi-6'!$C$2:$J$200,8,FALSE),\"\")","v":""},{"$f":"IFERROR(VLOOKUP($B267,'Défi-7'!$C$2:$J$200,8,FALSE),\"\")","v":""},32,null,"OK","OK","OK","OK","OK","OK","OK","OK","OK",null,{"$f":"'Classement auteurs'!$B267","v":131956005301},{"$f":"IF('Classement auteurs'!C267=\"\",\"\",'Classement auteurs'!C267)","v":""},{"$f":"IF('Classement auteurs'!D267=\"\",\"\",'Classement auteurs'!D267)","v":""},{"$f":"IF('Classement auteurs'!E267=\"\",\"\",'Classement auteurs'!E267)","v":""},{"$f":"IF('Classement auteurs'!F267=\"\",\"\",'Classement auteurs'!F267)","v":""},{"$f":"IF('Classement auteurs'!G267=\"\",\"\",'Classement auteurs'!G267)","v":32},{"$f":"IF('Classement auteurs'!H267=\"\",\"\",'Classement auteurs'!H267)","v":""},{"$f":"IF('Classement auteurs'!I267=\"\",\"\",'Classement auteurs'!I267)","v":""},{"$f":"IF('Classement auteurs'!J267=\"\",\"\",'Classement auteurs'!J267)","v":32}]
[null,130993014001,{"$f":"IFERROR(VLOOKUP($B268,'Défi-1'!$C$2:$J$200,8,FALSE),\"\")","v":""},{"$f":"IFERROR(VLOOKUP($B268,'Défi-2'!$C$2:$J$200,8,FALSE),\"\")","v":""},{"$f":"IFERROR(VLOOKUP($B268,'Défi-3'!$C$2:$J$200,8,FALSE),\"\")","v":""},{"$f":"IFERROR(VLOOKUP($B268,'Défi-4'!$C$2:$J$200,8,FALSE),\"\")","v":""},{"$f":"IFERROR(VLOOKUP($B268,'Défi-5'!$C$2:$J$200,8,FALSE),\"\")","v":31},{"$f":"IFERROR(VLOOKUP($B268,'Défi-6'!$C$2:$J$200,8,FALSE),\"\")","v":""},{"$f":"IFERROR(VLOOKUP($B268,'Défi-7'!$C$2:$J$200,8,FALSE),\"\")","v":""},{"$f":"SUM(C268:I268)","v":31},null,{"$f":"IF(B268=V268,\"OK\",\"KO\")","v":"OK"},{"$f":"IF(C268=W268,\"OK\",\"KO\")","v":"OK"},{"$f":"IF(D268=X268,\"OK\",\"KO\")","v":"OK"},{"$f":"IF(E268=Y268,\"OK\",\"KO\")","v":"OK"},{"$f":"IF(F268=Z268,\"OK\",\"KO\")","v":"OK"},{"$f":"IF(G268=AA268,\"OK\",\"KO\")","v":"OK"},{"$f":"IF(H268=AB268,\"OK\",\"KO\")","v":"OK"},{"$f":"IF(I268=AC268,\"OK\",\"KO\")","v":"OK"},{"$f":"IF(J268=AD268,\"OK\",\"KO\")","v":"OK"},null,{"$f":"'Classement auteurs'!$B268","v":130993014001},{"$f":"IF('Classement auteurs'!C268=\"\",\"\",'Classement auteurs'!C268)","v":""},{"$f":"IF('Classement auteurs'!D268=\"\",\"\",'Classement auteurs'!D268)","v":""},{"$f":"IF('Classement auteurs'!E268=\"\",\"\",'Classement auteurs'!E268)","v":""},{"$f":"IF('Classement auteurs'!F268=\"\",\"\",'Classement auteurs'!F268)","v":""},{"$f":"IF('Classement auteurs'!G268=\"\",\"\",'Classement auteurs'!G268)","v":31},{"$f":"IF('Classement auteurs'!H268=\"\",\"\",'Classement auteurs'!H268)","v":""},{"$f":"IF('Classement auteurs'!I268=\"\",\"\",'Classement auteurs'!I268)","v":""},{"$f":"IF('Classement auteurs'!J268=\"\",\"\",'Classement auteurs'!J268)","v":31}]
[null,131862003801,{"$f":"IFERROR(VLOOKUP($B269,'Défi-1'!$C$2:$J$200,8,FALSE),\"\")","v":""},{"$f":"IFERROR(VLOOKUP($B269,'Défi-2'!$C$2:$J$200,8,FALSE),\"\")","v":""},{"$f":"IFERROR(VLOOKUP($B269,'Défi-3'!$C$2:$J$200,8,FALSE),\"\")","v":""},{"$f":"IFERROR(VLOOKUP($B269,'Défi-4'!$C$2:$J$200,8,FALSE),\"\")","v":""},{"$f":"IFERROR(VLOOKUP($B269,'Défi-5'!$C$2:$J$200,8,FALSE),\"\")","v":""},{"$f":"IFERROR(VLOOKUP($B269,'Défi-6'!$C$2:$J$200,8,FALSE),\"\")","v":""},{"$f":"IFERROR(VLOOKUP($B269,'Défi-7'!$C$2:$J$200,8,FALSE),\"\")","v":31},31,null,"OK","OK","OK","OK","OK","OK","OK","OK","OK",null,{"$f":"'Classement auteurs'!$B269","v":131862003801},{"$f":"IF('Classement auteurs'!C269=\"\",\"\",'Classement auteurs'!C269)","v":""},{"$f":"IF('Classement auteurs'!D269=\"\",\"\",'Classement auteurs'!D269)","v":""},{"$f":"IF('Classement auteurs'!E269=\"\",\"\",'Classement auteurs'!E269)","v":""},{"$f":"IF('Classement auteurs'!F269=\"\",\"\",'Classement auteurs'!F269)","v":""},{"$f":"IF('Classement auteurs'!G269=\"\",\"\",'Classement auteurs'!G269)","v":""},{"$f":"IF('Classement auteurs'!H269=\"\",\"\",'Classement auteurs'!H269)","v":""},{"$f":"IF('Classement auteurs'!I269=\"\",\"\",'Classement auteurs'!I269)","v":31},{"$f":"IF('Classement auteurs'!J269=\"\",\"\",'Classement auteurs'!J269)","v":31}]
[null,131823007801,{"$f":"IFERROR(VLOOKUP($B270,'Défi-1'!$C$2:$J$200,8,FALSE),\"\")","v":30},{"$f":"IFERROR(VLOOKUP($B270,'Défi-2'!$C$2:$J$200,8,FALSE),\"\")","v":""},{"$f":"IFERROR(VLOOKUP($B270,'Défi-3'!$C$2:$J$200,8,FALSE),\"\")","v":""},{"$f":"IFERROR(VLOOKUP($B270,'Défi-4'!$C$2:$J$200,8,FALSE),\"\")","v":""},{"$f":"IFERROR(VLOOKUP($B270,'Défi-5'!$C$2:$J$200,8,FALSE),\"\")","v":""},{"$f":"IFERROR(VLOOKUP($B270,'Défi-6'!$C$2:$J$200,8,FALSE),\"\")","v":""},{"$f":"IFERROR(VLOOKUP($B270,'Défi-7'!$C$2:$J$200,8,FALSE),\"\")","v":""},30,null,"OK","OK","OK","OK","OK","OK","OK","OK","OK",null,{"$f":"'Classement auteurs'!$B270","v":131823007801},{"$f":"IF('Classement auteurs'!C270=\"\",\"\",'Classement auteurs'!C270)","v":30},{"$f":"IF('Classement auteurs'!D270=\"\",\"\",'Classement auteurs'!D270)","v":""},{"$f":"IF('Classement auteurs'!E270=\"\",\"\",'Classement auteurs'!E270)","v":""},{"$f":"IF('Classement auteurs'!F270=\"\",\"\",'Classement auteurs'!F270)","v":""},{"$f":"IF('Classement auteurs'!G270=\"\",\"\",'Classement auteurs'!G270)","v":""},{"$f":"IF('Classement auteurs'!H270=\"\",\"\",'Classement auteurs'!H270)","v":""},{"$f":"IF('Classement auteurs'!I270=\"\",\"\",'Classement auteurs'!I270)","v":""},{"$f":"IF('Classement auteurs'!J270=\"\",\"\",'Classement auteurs'!J270)","v":30}]
[null,131499010201,{"$f":"IFERROR(VLOOKUP($B271,'Défi-1'!$C$2:$J$200,8,FALSE),\"\")","v":""},{"$f":"IFERROR(VLOOKUP($B271,'Défi-2'!$C$2:$J$200,8,FALSE),\"\")","v":30},{"$f":"IFERROR(VLOOKUP($B271,'Défi-3'!$C$2:$J$200,8,FALSE),\"\")","v":""},{"$f":"IFERROR(VLOOKUP($B271,'Défi-4'!$C$2:$J$200,8,FALSE),\"\")","v":""},{"$f":"IFERROR(VLOOKUP($B271,'Défi-5'!$C$2:$J$200,8,FALSE),\"\")","v":""},{"$f":"IFERROR(VLOOKUP($B271,'Défi-6'!$C$2:$J$200,8,FALSE),\"\")","v":""},{"$f":"IFERROR(VLOOKUP($B271,'Défi-7'!$C$2:$J$200,8,FALSE),\"\")","v":""},30,null,"OK","OK","OK","OK","OK","OK","OK","OK","OK",null,{"$f":"'Classement auteurs'!$B271","v":131499010201},{"$f":"IF('Classement auteurs'!C271=\"\",\"\",'Classement auteurs'!C271)","v":""},{"$f":"IF('Classement auteurs'!D271=\"\",\"\",'Classement auteurs'!D271)","v":30},{"$f":"IF('Classement auteurs'!E271=\"\",\"\",'Classement auteurs'!E271)","v":""},{"$f":"IF('Classement auteurs'!F271=\"\",\"\",'Classement auteurs'!F271)","v":""},{"$f":"IF('Classement auteurs'!G271=\"\",\"\",'Classement auteurs'!G271)","v":""},{"$f":"IF('Classement auteurs'!H271=\"\",\"\",'Classement auteurs'!H271)","v":""},{"$f":"IF('Classement auteurs'!I271=\"\",\"\",'Classement auteurs'!I271)","v":""},{"$f":"IF('Classement auteurs'!J271=\"\",\"\",'Classement auteurs'!J271)","v":30}]
[null,132203000501,{"$f":"IFERROR(VLOOKUP($B272,'Défi-1'!$C$2:$J$200,8,FALSE),\"\")","v":""},{"$f":"IFERROR(VLOOKUP($B272,'Défi-2'!$C$2:$J$200,8,FALSE),\"\")","v":""},{"$f":"IFERROR(VLOOKUP($B272,'Défi-3'!$C$2:$J$200,8,FALSE),\"\")","v":30},{"$f":"IFERROR(VLOOKUP($B272,'Défi-4'!$C$2:$J$200,8,FALSE),\"\")","v":""},{"$f":"IFERROR(VLOOKUP($B272,'Défi-5'!$C$2:$J$200,8,FALSE),\"\")","v":""},{"$f":"IFERROR(VLOOKUP($B272,'Défi-6'!$C$2:$J$200,8,FALSE),\"\")","v":""},{"$f":"IFERROR(VLOOKUP($B272,'Défi-7'!$C$2:$J$200,8,FALSE),\"\")","v":""},30,null,"OK","OK","OK","OK","OK","OK","OK","OK","OK",null,{"$f":"'Classement auteurs'!$B272","v":132203000501},{"$f":"IF('Classement auteurs'!C272=\"\",\"\",'Classement auteurs'!C272)","v":""},{"$f":"IF('Classement auteurs'!D272=\"\",\"\",'Classement auteurs'!D272)","v":""},{"$f":"IF('Classement auteurs'!E272=\"\",\"\",'Classement auteurs'!E272)","v":30},{"$f":"IF('Classement auteurs'!F272=\"\",\"\",'Classement auteurs'!F272)","v":""},{"$f":"IF('Classement auteurs'!G272=\"\",\"\",'Classement auteurs'!G272)","v":""},{"$f":"IF('Classement auteurs'!H272=\"\",\"\",'Classement auteurs'!H272)","v":""},{"$f":"IF('Classement auteurs'!I272=\"\",\"\",'Classement auteurs'!I272)","v":""},{"$f":"IF('Classement auteurs'!J272=\"\",\"\",'Classement auteurs'!J272)","v":30}]
[null,132147000601,{"$f":"IFERROR(VLOOKUP($B273,'Défi-1'!$C$2:$J$200,8,FALSE),\"\")","v":""},{"$f":"IFERROR(VLOOKUP($B273,'Défi-2'!$C$2:$J$200,8,FALSE),\"\")","v":""},{"$f":"IFERROR(VLOOKUP($B273,'Défi-3'!$C$2:$J$200,8,FALSE),\"\")","v":""},{"$f":"IFERROR(VLOOKUP($B273,'Défi-4'!$C$2:$J$200,8,FALSE),\"\")","v":""},{"$f":"IFERROR(VLOOKUP($B273,'Défi-5'!$C$2:$J$200,8,FALSE),\"\")","v":""},{"$f":"IFERROR(VLOOKUP($B273,'Défi-6'!$C$2:$J$200,8,FALSE),\"\")","v":""},{"$f":"IFERROR(VLOOKUP($B273,'Défi-7'!$C$2:$J$200,8,FALSE),\"\")","v":30},30,null,"OK","OK","OK","OK","OK","OK","OK","OK","OK",null,{"$f":"'Classement auteurs'!$B273","v":132147000601},{"$f":"IF('Classement auteurs'!C273=\"\",\"\",'Classement auteurs'!C273)","v":""},{"$f":"IF('Classement auteurs'!D273=\"\",\"\",'Classement auteurs'!D273)","v":""},{"$f":"IF('Classement auteurs'!E273=\"\",\"\",'Classement auteurs'!E273)","v":""},{"$f":"IF('Classement auteurs'!F273=\"\",\"\",'Classement auteurs'!F273)","v":""},{"$f":"IF('Classement auteurs'!G273=\"\",\"\",'Classement auteurs'!G273)","v":""},{"$f":"IF('Classement auteurs'!H273=\"\",\"\",'Classement auteurs'!H273)","v":""},{"$f":"IF('Classement auteurs'!I273=\"\",\"\",'Classement auteurs'!I273)","v":30},{"$f":"IF('Classement auteurs'!J273=\"\",\"\",'Classement auteurs'!J273)","v":30}]
[null,130987023201,{"$f":"IFERROR(VLOOKUP($B274,'Défi-1'!$C$2:$J$200,8,FALSE),\"\")","v":""},{"$f":"IFERROR(VLOOKUP($B274,'Défi-2'!$C$2:$J$200,8,FALSE),\"\")","v":""},{"$f":"IFERROR(VLOOKUP($B274,'Défi-3'!$C$2:$J$200,8,FALSE),\"\")","v":""},{"$f":"IFERROR(VLOOKUP($B274,'Défi-4'!$C$2:$J$200,8,FALSE),\"\")","v":""},{"$f":"IFERROR(VLOOKUP($B274,'Défi-5'!$C$2:$J$200,8,FALSE),\"\")","v":""},{"$f":"IFERROR(VLOOKUP($B274,'Défi-6'!$C$2:$J$200,8,FALSE),\"\")","v":""},{"$f":"IFERROR(VLOOKUP($B274,'Défi-7'!$C$2:$J$200,8,FALSE),\"\")","v":30},30,null,"OK","OK","OK","OK","OK","OK","OK","OK","OK",null,{"$f":"'Classement auteurs'!$B274","v":130987023201},{"$f":"IF('Classement auteurs'!C274=\"\",\"\",'Classement auteurs'!C274)","v":""},{"$f":"IF('Classement auteurs'!D274=\"\",\"\",'Classement auteurs'!D274)","v":""},{"$f":"IF('Classement auteurs'!E274=\"\",\"\",'Classement auteurs'!E274)","v":""},{"$f":"IF('Classement auteurs'!F274=\"\",\"\",'Classement auteurs'!F274)","v":""},{"$f":"IF('Classement auteurs'!G274=\"\",\"\",'Classement auteurs'!G274)","v":""},{"$f":"IF('Classement auteurs'!H274=\"\",\"\",'Classement auteurs'!H274)","v":""},{"$f":"IF('Classement auteurs'!I274=\"\",\"\",'Classement auteurs'!I274)","v":30},{"$f":"IF('Classement auteurs'!J274=\"\",\"\",'Classement auteurs'!J274)","v":30}]
[null,131956004301,{"$f":"IFERROR(VLOOKUP($B275,'Défi-1'!$C$2:$J$200,8,FALSE),\"\")","v":""},{"$f":"IFERROR(VLOOKUP($B275,'Défi-2'!$C$2:$J$200,8,FALSE),\"\")","v":""},{"$f":"IFERROR(VLOOKUP($B275,'Défi-3'!$C$2:$J$200,8,FALSE),\"\")","v":""},{"$f":"IFERROR(VLOOKUP($B275,'Défi-4'!$C$2:$J$200,8,FALSE),\"\")","v":""},{"$f":"IFERROR(VLOOKUP($B275,'Défi-5'!$C$2:$J$200,8,FALSE),\"\")","v":""},{"$f":"IFERROR(VLOOKUP($B275,'Défi-6'!$C$2:$J$200,8,FALSE),\"\")","v":""},{"$f":"IFERROR(VLOOKUP($B275,'Défi-7'!$C$2:$J$200,8,FALSE),\"\")","v":29},29,null,"OK","OK","OK","OK","OK","OK","OK","OK","OK",null,{"$f":"'Classement auteurs'!$B275","v":131956004301},{"$f":"IF('Classement auteurs'!C275=\"\",\"\",'Classement auteurs'!C275)","v":""},{"$f":"IF('Classement auteurs'!D275=\"\",\"\",'Classement auteurs'!D275)","v":""},{"$f":"IF('Classement auteurs'!E275=\"\",\"\",'Classement auteurs'!E275)","v":""},{"$f":"IF('Classement auteurs'!F275=\"\",\"\",'Classement auteurs'!F275)","v":""},{"$f":"IF('Classement auteurs'!G275=\"\",\"\",'Classement auteurs'!G275)","v":""},{"$f":"IF('Classement auteurs'!H275=\"\",\"\",'Classement auteurs'!H275)","v":""},{"$f":"IF('Classement auteurs'!I275=\"\",\"\",'Classement auteurs'!I275)","v":29},{"$f":"IF('Classement auteurs'!J275=\"\",\"\",'Classement auteurs'!J275)","v":29}]
[null,131683007101,{"$f":"IFERROR(VLOOKUP($B276,'Défi-1'!$C$2:$J$200,8,FALSE),\"\")","v":""},{"$f":"IFERROR(VLOOKUP($B276,'Défi-2'!$C$2:$J$200,8,FALSE),\"\")","v":""},{"$f":"IFERROR(VLOOKUP($B276,'Défi-3'!$C$2:$J$200,8,FALSE),\"\")","v":""},{"$f":"IFERROR(VLOOKUP($B276,'Défi-4'!$C$2:$J$200,8,FALSE),\"\")","v":""},{"$f":"IFERROR(VLOOKUP($B276,'Défi-5'!$C$2:$J$200,8,FALSE),\"\")","v":""},{"$f":"IFERROR(VLOOKUP($B276,'Défi-6'!$C$2:$J$200,8,FALSE),\"\")","v":""},{"$f":"IFERROR(VLOOKUP($B276,'Défi-7'!$C$2:$J$200,8,FALSE),\"\")","v":29},29,null,"OK","OK","OK","OK","OK","OK","OK","OK","OK",null,{"$f":"'Classement auteurs'!$B276","v":131683007101},{"$f":"IF('Classement auteurs'!C276=\"\",\"\",'Classement auteurs'!C276)","v":""},{"$f":"IF('Classement auteurs'!D276=\"\",\"\",'Classement auteurs'!D276)","v":""},{"$f":"IF('Classement auteurs'!E276=\"\",\"\",'Classement auteurs'!E276)","v":""},{"$f":"IF('Classement auteurs'!F276=\"\",\"\",'Classement auteurs'!F276)","v":""},{"$f":"IF('Classement auteurs'!G276=\"\",\"\",'Classement auteurs'!G276)","v":""},{"$f":"IF('Classement auteurs'!H276=\"\",\"\",'Classement auteurs'!H276)","v":""},{"$f":"IF('Classement auteurs'!I276=\"\",\"\",'Classement auteurs'!I276)","v":29},{"$f":"IF('Classement auteurs'!J276=\"\",\"\",'Classement auteurs'!J276)","v":29}]
[null,132060003301,{"$f":"IFERROR(VLOOKUP($B277,'Défi-1'!$C$2:$J$200,8,FALSE),\"\")","v":28},{"$f":"IFERROR(VLOOKUP($B277,'Défi-2'!$C$2:$J$200,8,FALSE),\"\")","v":""},{"$f":"IFERROR(VLOOKUP($B277,'Défi-3'!$C$2:$J$200,8,FALSE),\"\")","v":""},{"$f":"IFERROR(VLOOKUP($B277,'Défi-4'!$C$2:$J$200,8,FALSE),\"\")","v":""},{"$f":"IFERROR(VLOOKUP($B277,'Défi-5'!$C$2:$J$200,8,FALSE),\"\")","v":""},{"$f":"IFERROR(VLOOKUP($B277,'Défi-6'!$C$2:$J$200,8,FALSE),\"\")","v":""},{"$f":"IFERROR(VLOOKUP($B277,'Défi-7'!$C$2:$J$200,8,FALSE),\"\")","v":""},28,null,"OK","OK","OK","OK","OK","OK","OK","OK","OK",null,{"$f":"'Classement auteurs'!$B277","v":132060003301},{"$f":"IF('Classement auteurs'!C277=\"\",\"\",'Classement auteurs'!C277)","v":28},{"$f":"IF('Classement auteurs'!D277=\"\",\"\",'Classement auteurs'!D277)","v":""},{"$f":"IF('Classement auteurs'!E277=\"\",\"\",'Classement auteurs'!E277)","v":""},{"$f":"IF('Classement auteurs'!F277=\"\",\"\",'Classement auteurs'!F277)","v":""},{"$f":"IF('Classement auteurs'!G277=\"\",\"\",'Classement auteurs'!G277)","v":""},{"$f":"IF('Classement auteurs'!H277=\"\",\"\",'Classement auteurs'!H277)","v":""},{"$f":"IF('Classement auteurs'!I277=\"\",\"\",'Classement auteurs'!I277)","v":""},{"$f":"IF('Classement auteurs'!J277=\"\",\"\",'Classement auteurs'!J277)","v":28}]
[null,131823008801,{"$f":"IFERROR(VLOOKUP($B278,'Défi-1'!$C$2:$J$200,8,FALSE),\"\")","v":""},{"$f":"IFERROR(VLOOKUP($B278,'Défi-2'!$C$2:$J$200,8,FALSE),\"\")","v":28},{"$f":"IFERROR(VLOOKUP($B278,'Défi-3'!$C$2:$J$200,8,FALSE),\"\")","v":""},{"$f":"IFERROR(VLOOKUP($B278,'Défi-4'!$C$2:$J$200,8,FALSE),\"\")","v":""},{"$f":"IFERROR(VLOOKUP($B278,'Défi-5'!$C$2:$J$200,8,FALSE),\"\")","v":""},{"$f":"IFERROR(VLOOKUP($B278,'Défi-6'!$C$2:$J$200,8,FALSE),\"\")","v":""},{"$f":"IFERROR(VLOOKUP($B278,'Défi-7'!$C$2:$J$200,8,FALSE),\"\")","v":""},28,null,"OK","OK","OK","OK","OK","OK","OK","OK","OK",null,{"$f":"'Classement auteurs'!$B278","v":131823008801},{"$f":"IF('Classement auteurs'!C278=\"\",\"\",'Classement auteurs'!C278)","v":""},{"$f":"IF('Classement auteurs'!D278=\"\",\"\",'Classement auteurs'!D278)","v":28},{"$f":"IF('Classement auteurs'!E278=\"\",\"\",'Classement auteurs'!E278)","v":""},{"$f":"IF('Classement auteurs'!F278=\"\",\"\",'Classement auteurs'!F278)","v":""},{"$f":"IF('Classement auteurs'!G278=\"\",\"\",'Classement auteurs'!G278)","v":""},{"$f":"IF('Classement auteurs'!H278=\"\",\"\",'Classement auteurs'!H278)","v":""},{"$f":"IF('Classement auteurs'!I278=\"\",\"\",'Classement auteurs'!I278)","v":""},{"$f":"IF('Classement auteurs'!J278=\"\",\"\",'Classement auteurs'!J278)","v":28}]
[null,131845003501,{"$f":"IFERROR(VLOOKUP($B279,'Défi-1'!$C$2:$J$200,8,FALSE),\"\")","v":""},{"$f":"IFERROR(VLOOKUP($B279,'Défi-2'!$C$2:$J$200,8,FALSE),\"\")","v":""},{"$f":"IFERROR(VLOOKUP($B279,'Défi-3'!$C$2:$J$200,8,FALSE),\"\")","v":""},{"$f":"IFERROR(VLOOKUP($B279,'Défi-4'!$C$2:$J$200,8,FALSE),\"\")","v":""},{"$f":"IFERROR(VLOOKUP($B279,'Défi-5'!$C$2:$J$200,8,FALSE),\"\")","v":""},{"$f":"IFERROR(VLOOKUP($B279,'Défi-6'!$C$2:$J$200,8,FALSE),\"\")","v":""},{"$f":"IFERROR(VLOOKUP($B279,'Défi-7'!$C$2:$J$200,8,FALSE),\"\")","v":28},28,null,"OK","OK","OK","OK","OK","OK","OK","OK","OK",null,{"$f":"'Classement auteurs'!$B279","v":131845003501},{"$f":"IF('Classement auteurs'!C279=\"\",\"\",'Classement auteurs'!C279)","v":""},{"$f":"IF('Classement auteurs'!D279=\"\",\"\",'Classement auteurs'!D279)","v":""},{"$f":"IF('Classement auteurs'!E279=\"\",\"\",'Classement auteurs'!E279)","v":""},{"$f":"IF('Classement auteurs'!F279=\"\",\"\",'Classement auteurs'!F279)","v":""},{"$f":"IF('Classement auteurs'!G279=\"\",\"\",'Classement auteurs'!G279)","v":""},{"$f":"IF('Classement auteurs'!H279=\"\",\"\",'Classement auteurs'!H279)","v":""},{"$f":"IF('Classement auteurs'!I279=\"\",\"\",'Classement auteurs'!I279)","v":28},{"$f":"IF('Classement auteurs'!J279=\"\",\"\",'Classement auteurs'!J279)","v":28}]
[null,131862001401,{"$f":"IFERROR(VLOOKUP($B280,'Défi-1'!$C$2:$J$200,8,FALSE),\"\")","v":""},{"$f":"IFERROR(VLOOKUP($B280,'Défi-2'!$C$2:$J$200,8,FALSE),\"\")","v":27},{"$f":"IFERROR(VLOOKUP($B280,'Défi-3'!$C$2:$J$200,8,FALSE),\"\")","v":""},{"$f":"IFERROR(VLOOKUP($B280,'Défi-4'!$C$2:$J$200,8,FALSE),\"\")","v":""},{"$f":"IFERROR(VLOOKUP($B280,'Défi-5'!$C$2:$J$200,8,FALSE),\"\")","v":""},{"$f":"IFERROR(VLOOKUP($B280,'Défi-6'!$C$2:$J$200,8,FALSE),\"\")","v":""},{"$f":"IFERROR(VLOOKUP($B280,'Défi-7'!$C$2:$J$200,8,FALSE),\"\")","v":""},27,null,"OK","OK","OK","OK","OK","OK","OK","OK","OK",null,{"$f":"'Classement auteurs'!$B280","v":131862001401},{"$f":"IF('Classement auteurs'!C280=\"\",\"\",'Classement auteurs'!C280)","v":""},{"$f":"IF('Classement auteurs'!D280=\"\",\"\",'Classement auteurs'!D280)","v":27},{"$f":"IF('Classement auteurs'!E280=\"\",\"\",'Classement auteurs'!E280)","v":""},{"$f":"IF('Classement auteurs'!F280=\"\",\"\",'Classement auteurs'!F280)","v":""},{"$f":"IF('Classement auteurs'!G280=\"\",\"\",'Classement auteurs'!G280)","v":""},{"$f":"IF('Classement auteurs'!H280=\"\",\"\",'Classement auteurs'!H280)","v":""},{"$f":"IF('Classement auteurs'!I280=\"\",\"\",'Classement auteurs'!I280)","v":""},{"$f":"IF('Classement auteurs'!J280=\"\",\"\",'Classement auteurs'!J280)","v":27}]
[null,132060002801,{"$f":"IFERROR(VLOOKUP($B281,'Défi-1'!$C$2:$J$200,8,FALSE),\"\")","v":""},{"$f":"IFERROR(VLOOKUP($B281,'Défi-2'!$C$2:$J$200,8,FALSE),\"\")","v":""},{"$f":"IFERROR(VLOOKUP($B281,'Défi-3'!$C$2:$J$200,8,FALSE),\"\")","v":""},{"$f":"IFERROR(VLOOKUP($B281,'Défi-4'!$C$2:$J$200,8,FALSE),\"\")","v":""},{"$f":"IFERROR(VLOOKUP($B281,'Défi-5'!$C$2:$J$200,8,FALSE),\"\")","v":""},{"$f":"IFERROR(VLOOKUP($B281,'Défi-6'!$C$2:$J$200,8,FALSE),\"\")","v":""},{"$f":"IFERROR(VLOOKUP($B281,'Défi-7'!$C$2:$J$200,8,FALSE),\"\")","v":26},26,null,"OK","OK","OK","OK","OK","OK","OK","OK","OK",null,{"$f":"'Classement auteurs'!$B281","v":132060002801},{"$f":"IF('Classement auteurs'!C281=\"\",\"\",'Classement auteurs'!C281)","v":""},{"$f":"IF('Classement auteurs'!D281=\"\",\"\",'Classement auteurs'!D281)","v":""},{"$f":"IF('Classement auteurs'!E281=\"\",\"\",'Classement auteurs'!E281)","v":""},{"$f":"IF('Classement auteurs'!F281=\"\",\"\",'Classement auteurs'!F281)","v":""},{"$f":"IF('Classement auteurs'!G281=\"\",\"\",'Classement auteurs'!G281)","v":""},{"$f":"IF('Classement auteurs'!H281=\"\",\"\",'Classement auteurs'!H281)","v":""},{"$f":"IF('Classement auteurs'!I281=\"\",\"\",'Classement auteurs'!I281)","v":26},{"$f":"IF('Classement auteurs'!J281=\"\",\"\",'Classement auteurs'!J281)","v":26}]