{"text_format":"1","workbook":"xlsx","n_sheets":12,"sheets":["Explications","Classement auteurs","Classement clubs","Défi-1","Défi-2","Défi-3","Défi-4","Défi-5","Défi-6","Défi-7","Liste des clubs","Comparaison auteurs"],"not_rendered":{"charts":0,"images":0,"macros":1,"external_links":0,"defined_names":2,"comments":0,"pivot_tables":0},"unopened":[],"bounds":{"document_bytes":16777216,"sheet_cells":100000,"rows_first":2000,"rows_last":500,"rows_between":2000,"halvings":0,"cell_chars":16384,"cell_head_chars":4096},"cells_cut":0,"cells_raw":0,"read":"whole","date_system":"1900"}

{"sheet":"Explications","index":0,"n_rows":28,"n_cols":2,"rows_kept":28,"cut":false,"hidden":false,"merged":[[15,1,21,8],[27,1,33,8],[8,1,13,8],[23,1,25,8],[1,1,2,8],[3,1,4,8],[5,1,6,8]]}
[]
[null,"Je suis le gestionnaire d'un concours photo, composé de 7 défis. Les défis s'étalent de Novembre à Mai pour une durée d'un mois."]
[]
[null,"Chaque auteur ne peut participar qu'avec une seule photo dans un même défi. Les photos sont jugées par 3 juges. Après chaque jugement je récupère un fichier de notation."]
[]
[null,"Les fichiers de notations sont insérées dans ce classeur manuellement dans des onglets nommés de Défi-1 à Défi-7."]
[]
[]
{"$rows_left_out":21}
{"sheet":"Classement auteurs","index":1,"n_rows":281,"n_cols":13,"rows_kept":281,"cut":false,"hidden":false,"merged":[[3,12,3,17],[5,12,6,17],[8,12,18,17]]}
[]
[null,"Fichier","Défi-1","Défi-2","Défi-3","Défi-4","Défi-5","Défi-6","Défi-7","Total"]
[null,131683007901,54,39,38,51,58,51,42,{"$f":"SUM(C3:I3)","v":333}]
[null,131110000901,51,45,56,43,41,43,36,{"$f":"SUM(C4:I4)","v":315},null,null,"Ce classement sera toujours maintenu dans l'ordre décroissant.."]
[null,131824001901,52,40,45,48,44,40,45,{"$f":"SUM(C5:I5)","v":314}]
[null,130987024201,46,43,48,45,39,45,43,{"$f":"SUM(C6:I6)","v":309},null,null,"Etant le premier, le Défi-1 sert de base de départ pour les 6 autres. Pour cela on utilise les 4 premières colonnes et la colonne total."]
[null,132193000301,48,37,40,45,38,38,55,{"$f":"SUM(C7:I7)","v":301}]
[null,130527009401,50,53,46,50,51,null,49,{"$f":"SUM(C8:I8)","v":299}]
{"$rows_left_out":274}
{"sheet":"Classement clubs","index":2,"n_rows":53,"n_cols":14,"rows_kept":53,"cut":false,"hidden":false,"merged":[[2,13,2,19],[4,13,12,19],[14,13,14,19]]}
[]
[null,"N° de club","Nom","Défi-1","Défi-2","Défi-3","Défi-4","Défi-5","Défi-6","Défi-7","Total"]
[1,1683,"Marius Saint-Mitre-les-Remparts",159,128,146,160,159,156,147,{"$f":"SUM(D3:J3)","v":1055},null,null,"Ce classement sera toujours maintenu dans l'ordre décroissant.."]
[2,987,"Cl. Phot’Azur Six-Fours-les-Plages",147,131,137,135,132,147,146,{"$f":"SUM(D4:J4)","v":975}]
[3,1353,"Photo Club de La Crau",138,123,125,151,139,135,135,{"$f":"SUM(D5:J5)","v":946},null,null,"Ce classement a été fait manuellement à partir de l'onglet Défi-1 et de la façon suivante :\n- un premier tri, dans l'ordre croissant, sur le N° de fichier.\n- un second tri pour classer les photos d'un même club dans l'ordre décroissant.\n- Ensuite j'ai fait le total des 3 premières photos.\n- j'ai supprimé les lignes inutiles,pour ne garder qu'une ligne par club.\n- j'ai fait un tris décroissant sur le total.\n- j'ai extrait le N° de club,\n- à partir de ce N° j'ai récupéré le nom du club dans l'onglet \"Liste des clubs\".\n"]
[4,1499,"Images Expressions – Cagnes sur Mer",135,128,144,151,151,126,111,{"$f":"SUM(D6:J6)","v":946}]
[5,527,"Photo Club de Martigues",152,132,131,141,134,119,119,{"$f":"SUM(D7:J7)","v":928}]
[6,1956,"Photo Contact Puyricard",136,138,138,118,124,129,139,{"$f":"SUM(D8:J8)","v":922}]
{"$rows_left_out":46}
{"sheet":"Défi-1","index":3,"n_rows":138,"n_cols":19,"rows_kept":138,"cut":false,"hidden":false,"merged":[[6,18,6,22],[4,18,4,22],[8,18,9,22]]}
["colis","photologic","fichier","titre","note1","note2","note3","note4","note5","total","place","passage","statut","medaille","retenue",null,"0=absent\n1=présent"]
[13,1,131845003401,"Avant la régate         ",9,7,12,0,0,{"$f":"SUM(E2:I2)","v":28},0,31,0,null,0,null,{"$f":"COUNTIF('Classement auteurs'!B:B,C2)","v":1}]
[13,4,130987015701,"Rêve de Mérous       ",14,17,17,0,0,{"$f":"SUM(E3:I3)","v":48},0,109,0,null,0,null,{"$f":"COUNTIF('Classement auteurs'!B:B,C3)","v":1}]
[13,5,131845000801,"Le soleil se lève       ",13,12,11,0,0,36,0,136,0,null,0,null,{"$f":"COUNTIF('Classement auteurs'!B:B,C4)","v":1},null,"ATTENTION :"]
[13,6,131845000101,"Skate Park               ",12,12,18,0,0,42,0,132,0,null,0,null,{"$f":"COUNTIF('Classement auteurs'!B:B,C5)","v":1},null,"Le total des notes est fait sur chaque onglet après insertion."]
[13,7,130987028201,"Water selfie             ",13,14,15,0,0,42,0,117,0,null,0,null,{"$f":"COUNTIF('Classement auteurs'!B:B,C6)","v":1}]
[13,9,130987007401,"Adrien                   ",10,11,10,0,0,31,0,79,0,null,0,null,{"$f":"COUNTIF('Classement auteurs'!B:B,C7)","v":1},null,"L'architecture du fichier notation est toujours la même."]
[13,10,131845000301,"Variation d'ocres        ",9,13,14,0,0,36,0,53,0,null,0,null,{"$f":"COUNTIF('Classement auteurs'!B:B,C8)","v":1}]
{"$rows_left_out":131}
{"sheet":"Défi-2","index":4,"n_rows":146,"n_cols":17,"rows_kept":146,"cut":false,"hidden":false,"merged":[]}
["colis","photologic","fichier","titre","note1","note2","note3","note4","note5","total","place","passage","statut","medaille","retenue",null,"0=absent\n1=présent"]
[13,1,131499010201,"Edsel 1958 Cuba          ",12,10,8,0,0,{"$f":"SUM(E2:I2)","v":30},0,132,0,null,0,null,{"$f":"COUNTIF('Classement auteurs'!B:B,C2)","v":1}]
[13,2,131862001101,"Le V                     ",11,10,9,0,0,{"$f":"SUM(E3:I3)","v":30},0,57,0,null,0,null,{"$f":"COUNTIF('Classement auteurs'!B:B,C3)","v":1}]
[13,4,131683000701,"L'ARBRE DE VIE           ",12,10,8,0,0,30,0,35,0,null,0,null,{"$f":"COUNTIF('Classement auteurs'!B:B,C4)","v":1}]
[13,5,132193000301,"Peuple Uros lac Titicaca ",12,12,13,0,0,37,0,101,7,null,0,null,{"$f":"COUNTIF('Classement auteurs'!B:B,C5)","v":1}]
[13,6,130987024201,"La nuit des Sans         ",15,12,16,0,0,43,0,141,0,null,0,null,{"$f":"COUNTIF('Classement auteurs'!B:B,C6)","v":1}]
[13,7,130987024101,"Ado Himba                ",12,12,15,0,0,39,0,87,0,null,0,null,{"$f":"COUNTIF('Classement auteurs'!B:B,C7)","v":1}]
[13,8,132203000901,"Femme Ousbèque          ",14,16,18,0,0,48,0,5,0,null,0,null,{"$f":"COUNTIF('Classement auteurs'!B:B,C8)","v":1}]
{"$rows_left_out":139}
{"sheet":"Défi-3","index":5,"n_rows":163,"n_cols":17,"rows_kept":163,"cut":false,"hidden":false,"merged":[]}
["colis","photologic","fichier","titre","note1","note2","note3","note4","note5","total","place","passage","statut","medaille","retenue",null,"0=absent\n1=présent"]
[13,1,130987024201,"Cracheur de Feu          ",17,18,13,0,0,{"$f":"SUM(E2:I2)","v":48},0,50,0,null,0,null,{"$f":"COUNTIF('Classement auteurs'!B:B,C2)","v":1}]
[13,2,130987024101,"A l'affut                ",15,11,10,0,0,{"$f":"SUM(E3:I3)","v":36},0,65,0,null,0,null,{"$f":"COUNTIF('Classement auteurs'!B:B,C3)","v":1}]
[13,4,130987012601,"Répétition.            ",14,15,13,0,0,42,0,149,0,null,0,null,{"$f":"COUNTIF('Classement auteurs'!B:B,C4)","v":1}]
[13,5,131376018301,"La poursuite             ",19,18,20,0,0,57,0,132,0,null,0,null,{"$f":"COUNTIF('Classement auteurs'!B:B,C5)","v":1}]
[13,6,132193000601,"Proue inversée          ",17,14,13,0,0,44,0,26,0,null,0,null,{"$f":"COUNTIF('Classement auteurs'!B:B,C6)","v":1}]
[13,7,131683008001,"Espiègle                ",16,19,12,0,0,47,0,153,0,null,0,null,{"$f":"COUNTIF('Classement auteurs'!B:B,C7)","v":1}]
[13,8,131823008301,"Portrait de rue          ",16,18,14,0,0,48,0,12,0,null,0,null,{"$f":"COUNTIF('Classement auteurs'!B:B,C8)","v":1}]
{"$rows_left_out":156}
{"sheet":"Défi-4","index":6,"n_rows":143,"n_cols":17,"rows_kept":143,"cut":false,"hidden":false,"merged":[]}
["colis","photologic","fichier","titre","note1","note2","note3","note4","note5","total","place","passage","statut","medaille","retenue",null,"0=absent\n1=présent"]
[13,1,130878015201,"Je m'amuse               ",6,6,6,0,0,{"$f":"SUM(E2:I2)","v":18},0,37,0,null,0,null,{"$f":"COUNTIF('Classement auteurs'!B:B,C2)","v":1}]
[13,2,130000020401,"La Goutte                ",10,13,12,0,0,{"$f":"SUM(E3:I3)","v":35},0,103,6,null,0,null,{"$f":"COUNTIF('Classement auteurs'!B:B,C3)","v":1}]
[13,3,131499008701,"Symbiose                 ",12,11,10,0,0,33,0,18,0,null,0,null,{"$f":"COUNTIF('Classement auteurs'!B:B,C4)","v":1}]
[13,4,131879000501,"Calin                    ",14,13,14,0,0,41,0,89,0,null,0,null,{"$f":"COUNTIF('Classement auteurs'!B:B,C5)","v":1}]
[13,5,131110001001,"Quietude                 ",15,14,18,0,0,47,0,71,0,null,0,null,{"$f":"COUNTIF('Classement auteurs'!B:B,C6)","v":1}]
[13,6,130878013301,"Desert                   ",11,11,14,0,0,36,0,142,0,null,0,null,{"$f":"COUNTIF('Classement auteurs'!B:B,C7)","v":1}]
[13,7,132193000301,"Survol de la mer de glace",14,15,16,0,0,45,0,140,0,null,0,null,{"$f":"COUNTIF('Classement auteurs'!B:B,C8)","v":1}]
{"$rows_left_out":136}
{"sheet":"Défi-5","index":7,"n_rows":165,"n_cols":17,"rows_kept":165,"cut":false,"hidden":false,"merged":[]}
["colis","photologic","fichier","titre","note1","note2","note3","note4","note5","total","place","passage","statut","medaille","retenue",null,"0=absent\n1=présent"]
[13,1,131494003001,"Reflet nocturne          ",10,7,7,0,0,{"$f":"SUM(E2:I2)","v":24},0,120,0,null,0,null,{"$f":"COUNTIF('Classement auteurs'!B:B,C2)","v":1}]
[13,2,131823008301,"Promenade                ",14,15,13,0,0,{"$f":"SUM(E3:I3)","v":42},0,143,0,null,0,null,{"$f":"COUNTIF('Classement auteurs'!B:B,C3)","v":1}]
[13,3,132147000101,"Reflet Vénitien         ",11,15,10,0,0,36,0,33,0,null,0,null,{"$f":"COUNTIF('Classement auteurs'!B:B,C4)","v":1}]
[13,4,130987024101,"La caravane              ",11,19,14,0,0,44,0,149,0,null,0,null,{"$f":"COUNTIF('Classement auteurs'!B:B,C5)","v":1}]
[13,6,130527002501,"Tacle                    ",7,11,14,0,0,32,0,164,0,null,0,null,{"$f":"COUNTIF('Classement auteurs'!B:B,C6)","v":1}]
[13,7,132023000101,"Cabanes de pêcheurs     ",11,10,15,0,0,36,0,4,0,null,0,null,{"$f":"COUNTIF('Classement auteurs'!B:B,C7)","v":1}]
[13,8,132084004001,"La négociation          ",11,18,13,0,0,42,0,96,0,null,0,null,{"$f":"COUNTIF('Classement auteurs'!B:B,C8)","v":1}]
{"$rows_left_out":158}
{"sheet":"Défi-6","index":8,"n_rows":202,"n_cols":17,"rows_kept":202,"cut":false,"hidden":false,"merged":[]}
["colis","photologic","fichier","titre","note1","note2","note3","note4","note5","total","place","passage","statut","medaille","retenue",null,"0=absent\n1=présent"]
[13,29,131879000801,"Harmonie                 ",19,19,20,0,0,58,0,99,0,null,0,null,{"$f":"COUNTIF('Classement auteurs'!B:B,C2)","v":1}]
[13,35,131683006301,"Avant l'orage            ",18,19,20,0,0,57,0,93,0,null,0,null,{"$f":"COUNTIF('Classement auteurs'!B:B,C3)","v":1}]
[13,5,131376018301,"La poursuite             ",19,18,20,0,0,57,0,132,0,null,0,null,{"$f":"COUNTIF('Classement auteurs'!B:B,C4)","v":1}]
[13,9,132103000101,"Prendre de le temps      ",19,19,17,0,0,55,0,152,0,null,0,null,{"$f":"COUNTIF('Classement auteurs'!B:B,C5)","v":1}]
[13,36,132084003601,"Mini la grenouille       ",17,18,20,0,0,55,0,137,0,null,0,null,{"$f":"COUNTIF('Classement auteurs'!B:B,C6)","v":1}]
[13,23,132084002301,"Les petits hommes        ",19,18,17,0,0,54,0,8,0,null,0,null,{"$f":"COUNTIF('Classement auteurs'!B:B,C7)","v":1}]
[13,41,131227008601,"Après la pluie          ",20,17,16,0,0,53,0,2,0,null,0,null,{"$f":"COUNTIF('Classement auteurs'!B:B,C8)","v":1}]
{"$rows_left_out":195}
{"sheet":"Défi-7","index":9,"n_rows":138,"n_cols":17,"rows_kept":138,"cut":false,"hidden":false,"merged":[]}
["colis","photologic","fichier","titre","note1","note2","note3","note4","note5","total","place","passage","statut","medaille","retenue",null,"0=absent\n1=présent"]
[13,122,131683008201,"Alysée                  ",19,19,19,0,0,57,0,20," ",null,null,null,{"$f":"COUNTIF('Classement auteurs'!B:B,C2)","v":1}]
[13,85,131353000101,"La chapelle              ",17,20,19,0,0,56,0,67," ",null,null,null,{"$f":"COUNTIF('Classement auteurs'!B:B,C3)","v":1}]
[13,7,132193000301,"Invitation au voyage     ",19,18,18,0,0,55,0,94," ",null,null,null,{"$f":"COUNTIF('Classement auteurs'!B:B,C4)","v":1}]
[13,11,131985003401,"Jeune fille himbas       ",20,16,18,0,0,54,0,118," ",null,null,null,{"$f":"COUNTIF('Classement auteurs'!B:B,C5)","v":1}]
[13,6,130987015701,"Orage                    ",19,16,17,0,0,52,0,23," ",null,null,null,{"$f":"COUNTIF('Classement auteurs'!B:B,C6)","v":1}]
[13,107,131956004601,"L'homme de pierre        ",17,17,18,0,0,52,0,76," ",null,null,null,{"$f":"COUNTIF('Classement auteurs'!B:B,C7)","v":1}]
[13,26,130987013801,"Championnat de France de ",18,17,16,0,0,51,0,122," ",null,null,null,{"$f":"COUNTIF('Classement auteurs'!B:B,C8)","v":1}]
{"$rows_left_out":131}
{"sheet":"Liste des clubs","index":10,"n_rows":51,"n_cols":5,"rows_kept":51,"cut":false,"hidden":false,"merged":[]}
[]
[null,"N° de club","Nom","Département","Ville"]
[1,435,"Beausoleil Ciné Photo Club",6,"Beausoleil"]
[2,462,"Image 2000",13,"Marignane"]
[3,527,"Photo Club de Martigues",13,"Lavéra"]
[4,878,"PC Antoine Santoru-Port de Bouc",13,"Port-de-Bouc"]
[5,921,"Photo Club M.P.T. Vitrolles",13,"Vitrolles"]
[6,925,"A.S.L.P.S. Photo Fos-sur-Mer",13,"Fos-Sur-Mer"]
{"$rows_left_out":44}
{"sheet":"Comparaison auteurs","index":11,"n_rows":281,"n_cols":30,"rows_kept":281,"cut":false,"hidden":false,"merged":[[0,1,0,9],[0,21,0,29],[0,11,0,19]]}
[null,"Classement Mistral",null,null,null,null,null,null,null,null,null,"Comparaison",null,null,null,null,null,null,null,null,null,"Classement Gbinforme","Classement Mistral"]
[null,"Fichier","Défi-1","Défi-2","Défi-3","Défi-4","Défi-5","Défi-6","Défi-7","Total",null,"Fichier","Défi-1","Défi-2","Défi-3","Défi-4","Défi-5","Défi-6","Défi-7","Total",null,"Fichier","Défi-1","Défi-2","Défi-3","Défi-4","Défi-5","Défi-6","Défi-7","Total"]
[null,131683007901,{"$f":"IFERROR(VLOOKUP($B3,'Défi-1'!$C$2:$J$200,8,FALSE),\"\")","v":54},{"$f":"IFERROR(VLOOKUP($B3,'Défi-2'!$C$2:$J$200,8,FALSE),\"\")","v":39},{"$f":"IFERROR(VLOOKUP($B3,'Défi-3'!$C$2:$J$200,8,FALSE),\"\")","v":38},{"$f":"IFERROR(VLOOKUP($B3,'Défi-4'!$C$2:$J$200,8,FALSE),\"\")","v":51},{"$f":"IFERROR(VLOOKUP($B3,'Défi-5'!$C$2:$J$200,8,FALSE),\"\")","v":58},{"$f":"IFERROR(VLOOKUP($B3,'Défi-6'!$C$2:$J$200,8,FALSE),\"\")","v":51},{"$f":"IFERROR(VLOOKUP($B3,'Défi-7'!$C$2:$J$200,8,FALSE),\"\")","v":42},{"$f":"SUM(C3:I3)","v":333},null,{"$f":"IF(B3=V3,\"OK\",\"KO\")","v":"OK"},{"$f":"IF(C3=W3,\"OK\",\"KO\")","v":"OK"},"OK","OK","OK","OK","OK","OK","OK",null,{"$f":"'Classement auteurs'!$B3","v":131683007901},{"$f":"IF('Classement auteurs'!C3=\"\",\"\",'Classement auteurs'!C3)","v":54},{"$f":"IF('Classement auteurs'!D3=\"\",\"\",'Classement auteurs'!D3)","v":39},{"$f":"IF('Classement auteurs'!E3=\"\",\"\",'Classement auteurs'!E3)","v":38},{"$f":"IF('Classement auteurs'!F3=\"\",\"\",'Classement auteurs'!F3)","v":51},{"$f":"IF('Classement auteurs'!G3=\"\",\"\",'Classement auteurs'!G3)","v":58},{"$f":"IF('Classement auteurs'!H3=\"\",\"\",'Classement auteurs'!H3)","v":51},{"$f":"IF('Classement auteurs'!I3=\"\",\"\",'Classement auteurs'!I3)","v":42},{"$f":"IF('Classement auteurs'!J3=\"\",\"\",'Classement auteurs'!J3)","v":333}]
[null,131110000901,{"$f":"IFERROR(VLOOKUP($B4,'Défi-1'!$C$2:$J$200,8,FALSE),\"\")","v":51},{"$f":"IFERROR(VLOOKUP($B4,'Défi-2'!$C$2:$J$200,8,FALSE),\"\")","v":45},{"$f":"IFERROR(VLOOKUP($B4,'Défi-3'!$C$2:$J$200,8,FALSE),\"\")","v":56},{"$f":"IFERROR(VLOOKUP($B4,'Défi-4'!$C$2:$J$200,8,FALSE),\"\")","v":43},{"$f":"IFERROR(VLOOKUP($B4,'Défi-5'!$C$2:$J$200,8,FALSE),\"\")","v":41},{"$f":"IFERROR(VLOOKUP($B4,'Défi-6'!$C$2:$J$200,8,FALSE),\"\")","v":43},{"$f":"IFERROR(VLOOKUP($B4,'Défi-7'!$C$2:$J$200,8,FALSE),\"\")","v":36},{"$f":"SUM(C4:I4)","v":315},null,{"$f":"IF(B4=V4,\"OK\",\"KO\")","v":"OK"},{"$f":"IF(C4=W4,\"OK\",\"KO\")","v":"OK"},{"$f":"IF(D4=X4,\"OK\",\"KO\")","v":"OK"},{"$f":"IF(E4=Y4,\"OK\",\"KO\")","v":"OK"},{"$f":"IF(F4=Z4,\"OK\",\"KO\")","v":"OK"},{"$f":"IF(G4=AA4,\"OK\",\"KO\")","v":"OK"},{"$f":"IF(H4=AB4,\"OK\",\"KO\")","v":"OK"},{"$f":"IF(I4=AC4,\"OK\",\"KO\")","v":"OK"},{"$f":"IF(J4=AD4,\"OK\",\"KO\")","v":"OK"},null,{"$f":"'Classement auteurs'!$B4","v":131110000901},{"$f":"IF('Classement auteurs'!C4=\"\",\"\",'Classement auteurs'!C4)","v":51},{"$f":"IF('Classement auteurs'!D4=\"\",\"\",'Classement auteurs'!D4)","v":45},{"$f":"IF('Classement auteurs'!E4=\"\",\"\",'Classement auteurs'!E4)","v":56},{"$f":"IF('Classement auteurs'!F4=\"\",\"\",'Classement auteurs'!F4)","v":43},{"$f":"IF('Classement auteurs'!G4=\"\",\"\",'Classement auteurs'!G4)","v":41},{"$f":"IF('Classement auteurs'!H4=\"\",\"\",'Classement auteurs'!H4)","v":43},{"$f":"IF('Classement auteurs'!I4=\"\",\"\",'Classement auteurs'!I4)","v":36},{"$f":"IF('Classement auteurs'!J4=\"\",\"\",'Classement auteurs'!J4)","v":315}]
[null,131824001901,{"$f":"IFERROR(VLOOKUP($B5,'Défi-1'!$C$2:$J$200,8,FALSE),\"\")","v":52},{"$f":"IFERROR(VLOOKUP($B5,'Défi-2'!$C$2:$J$200,8,FALSE),\"\")","v":40},{"$f":"IFERROR(VLOOKUP($B5,'Défi-3'!$C$2:$J$200,8,FALSE),\"\")","v":45},{"$f":"IFERROR(VLOOKUP($B5,'Défi-4'!$C$2:$J$200,8,FALSE),\"\")","v":48},{"$f":"IFERROR(VLOOKUP($B5,'Défi-5'!$C$2:$J$200,8,FALSE),\"\")","v":44},{"$f":"IFERROR(VLOOKUP($B5,'Défi-6'!$C$2:$J$200,8,FALSE),\"\")","v":52},{"$f":"IFERROR(VLOOKUP($B5,'Défi-7'!$C$2:$J$200,8,FALSE),\"\")","v":45},326,null,"OK","OK","OK","OK","OK","OK","KO","OK","KO",null,{"$f":"'Classement auteurs'!$B5","v":131824001901},{"$f":"IF('Classement auteurs'!C5=\"\",\"\",'Classement auteurs'!C5)","v":52},{"$f":"IF('Classement auteurs'!D5=\"\",\"\",'Classement auteurs'!D5)","v":40},{"$f":"IF('Classement auteurs'!E5=\"\",\"\",'Classement auteurs'!E5)","v":45},{"$f":"IF('Classement auteurs'!F5=\"\",\"\",'Classement auteurs'!F5)","v":48},{"$f":"IF('Classement auteurs'!G5=\"\",\"\",'Classement auteurs'!G5)","v":44},{"$f":"IF('Classement auteurs'!H5=\"\",\"\",'Classement auteurs'!H5)","v":40},{"$f":"IF('Classement auteurs'!I5=\"\",\"\",'Classement auteurs'!I5)","v":45},{"$f":"IF('Classement auteurs'!J5=\"\",\"\",'Classement auteurs'!J5)","v":314}]
[null,130987024201,{"$f":"IFERROR(VLOOKUP($B6,'Défi-1'!$C$2:$J$200,8,FALSE),\"\")","v":46},{"$f":"IFERROR(VLOOKUP($B6,'Défi-2'!$C$2:$J$200,8,FALSE),\"\")","v":43},{"$f":"IFERROR(VLOOKUP($B6,'Défi-3'!$C$2:$J$200,8,FALSE),\"\")","v":48},{"$f":"IFERROR(VLOOKUP($B6,'Défi-4'!$C$2:$J$200,8,FALSE),\"\")","v":45},{"$f":"IFERROR(VLOOKUP($B6,'Défi-5'!$C$2:$J$200,8,FALSE),\"\")","v":39},{"$f":"IFERROR(VLOOKUP($B6,'Défi-6'!$C$2:$J$200,8,FALSE),\"\")","v":48},{"$f":"IFERROR(VLOOKUP($B6,'Défi-7'!$C$2:$J$200,8,FALSE),\"\")","v":43},312,null,"OK","OK","OK","OK","OK","OK","KO","OK","KO",null,{"$f":"'Classement auteurs'!$B6","v":130987024201},{"$f":"IF('Classement auteurs'!C6=\"\",\"\",'Classement auteurs'!C6)","v":46},{"$f":"IF('Classement auteurs'!D6=\"\",\"\",'Classement auteurs'!D6)","v":43},{"$f":"IF('Classement auteurs'!E6=\"\",\"\",'Classement auteurs'!E6)","v":48},{"$f":"IF('Classement auteurs'!F6=\"\",\"\",'Classement auteurs'!F6)","v":45},{"$f":"IF('Classement auteurs'!G6=\"\",\"\",'Classement auteurs'!G6)","v":39},{"$f":"IF('Classement auteurs'!H6=\"\",\"\",'Classement auteurs'!H6)","v":45},{"$f":"IF('Classement auteurs'!I6=\"\",\"\",'Classement auteurs'!I6)","v":43},{"$f":"IF('Classement auteurs'!J6=\"\",\"\",'Classement auteurs'!J6)","v":309}]
[null,132193000301,{"$f":"IFERROR(VLOOKUP($B7,'Défi-1'!$C$2:$J$200,8,FALSE),\"\")","v":48},{"$f":"IFERROR(VLOOKUP($B7,'Défi-2'!$C$2:$J$200,8,FALSE),\"\")","v":37},{"$f":"IFERROR(VLOOKUP($B7,'Défi-3'!$C$2:$J$200,8,FALSE),\"\")","v":40},{"$f":"IFERROR(VLOOKUP($B7,'Défi-4'!$C$2:$J$200,8,FALSE),\"\")","v":45},{"$f":"IFERROR(VLOOKUP($B7,'Défi-5'!$C$2:$J$200,8,FALSE),\"\")","v":38},{"$f":"IFERROR(VLOOKUP($B7,'Défi-6'!$C$2:$J$200,8,FALSE),\"\")","v":48},{"$f":"IFERROR(VLOOKUP($B7,'Défi-7'!$C$2:$J$200,8,FALSE),\"\")","v":55},311,null,"OK","OK","OK","OK","OK","OK","KO","OK","KO",null,{"$f":"'Classement auteurs'!$B7","v":132193000301},{"$f":"IF('Classement auteurs'!C7=\"\",\"\",'Classement auteurs'!C7)","v":48},{"$f":"IF('Classement auteurs'!D7=\"\",\"\",'Classement auteurs'!D7)","v":37},{"$f":"IF('Classement auteurs'!E7=\"\",\"\",'Classement auteurs'!E7)","v":40},{"$f":"IF('Classement auteurs'!F7=\"\",\"\",'Classement auteurs'!F7)","v":45},{"$f":"IF('Classement auteurs'!G7=\"\",\"\",'Classement auteurs'!G7)","v":38},{"$f":"IF('Classement auteurs'!H7=\"\",\"\",'Classement auteurs'!H7)","v":38},{"$f":"IF('Classement auteurs'!I7=\"\",\"\",'Classement auteurs'!I7)","v":55},{"$f":"IF('Classement auteurs'!J7=\"\",\"\",'Classement auteurs'!J7)","v":301}]
[null,130527009401,{"$f":"IFERROR(VLOOKUP($B8,'Défi-1'!$C$2:$J$200,8,FALSE),\"\")","v":50},{"$f":"IFERROR(VLOOKUP($B8,'Défi-2'!$C$2:$J$200,8,FALSE),\"\")","v":53},{"$f":"IFERROR(VLOOKUP($B8,'Défi-3'!$C$2:$J$200,8,FALSE),\"\")","v":46},{"$f":"IFERROR(VLOOKUP($B8,'Défi-4'!$C$2:$J$200,8,FALSE),\"\")","v":50},{"$f":"IFERROR(VLOOKUP($B8,'Défi-5'!$C$2:$J$200,8,FALSE),\"\")","v":51},{"$f":"IFERROR(VLOOKUP($B8,'Défi-6'!$C$2:$J$200,8,FALSE),\"\")","v":""},{"$f":"IFERROR(VLOOKUP($B8,'Défi-7'!$C$2:$J$200,8,FALSE),\"\")","v":49},299,null,"OK","OK","OK","OK","OK","OK","OK","OK","OK",null,{"$f":"'Classement auteurs'!$B8","v":130527009401},{"$f":"IF('Classement auteurs'!C8=\"\",\"\",'Classement auteurs'!C8)","v":50},{"$f":"IF('Classement auteurs'!D8=\"\",\"\",'Classement auteurs'!D8)","v":53},{"$f":"IF('Classement auteurs'!E8=\"\",\"\",'Classement auteurs'!E8)","v":46},{"$f":"IF('Classement auteurs'!F8=\"\",\"\",'Classement auteurs'!F8)","v":50},{"$f":"IF('Classement auteurs'!G8=\"\",\"\",'Classement auteurs'!G8)","v":51},{"$f":"IF('Classement auteurs'!H8=\"\",\"\",'Classement auteurs'!H8)","v":""},{"$f":"IF('Classement auteurs'!I8=\"\",\"\",'Classement auteurs'!I8)","v":49},{"$f":"IF('Classement auteurs'!J8=\"\",\"\",'Classement auteurs'!J8)","v":299}]
{"$rows_left_out":273}