{"text_format":"1","workbook":"xlsx","n_sheets":6,"sheets":["inv","client","MOD FACTURE","MOD Vente Comptoir 2 et 3","FA201860001","VC2018650001"],"not_rendered":{"charts":0,"images":0,"macros":1,"external_links":0,"defined_names":8,"comments":4,"pivot_tables":0},"unopened":[],"bounds":{"document_bytes":16777216,"sheet_cells":100000,"rows_first":2000,"rows_last":500,"rows_between":2000,"halvings":0,"cell_chars":16384,"cell_head_chars":4096},"cells_cut":0,"cells_raw":0,"read":"whole","date_system":"1900"}

{"sheet":"inv","index":0,"n_rows":113,"n_cols":13,"rows_kept":113,"cut":false,"hidden":false,"merged":[]}
["Code Article","Quantité","Genre","Description","Marque","Saison","PV"]
["S800HF",15,"TOP             K9 H3 F8 F7 53","15-014                        ","GLOSS LINE                                      S8","2018E ",25]
[null,null,1,2,3,4,5,6,"UNI","---",null,"XXX","tailles"]
["DIVERS",null,4,5,2,1,3,null,null,null,null,null,"Quantités par taille"]
[]
["S800HH",3,"ROBE                     B4 07","15-018                        ","GLOSS LINE                                      S8","2018E ",35]
[null,null,1,2,3,4,5,6,"UNI","---",null,"XXX"]
["DIVERS",null,null,1,null,1,1]
[]
["S800HO",4,"ROBE                     B4 07","15-066                        ","GLOSS LINE                                      S8","2018E ",32]
[null,null,1,2,3,4,5,6,"UNI","---",null,"XXX"]
["DIVERS",null,2,1,null,null,1]
[]
["S800HP",12,"ROBE                     B4 07","15-075                        ","GLOSS LINE                                      S8","2018E ",32]
[null,null,1,2,3,4,5,6,"UNI","---",null,"XXX"]
["DIVERS",null,2,1,1,1,1]
["BLEU",null,2,3,1]
[]
["S800HQ",27,"ROBE                     B4 07","15-078                        ","GLOSS LINE                                      S8","2018E ",32]
[null,null,1,2,3,4,5,6,"UNI","---",null,"XXX"]
{"$rows_left_out":94}
{"sheet":"client","index":1,"n_rows":78,"n_cols":30,"rows_kept":78,"cut":false,"hidden":false,"merged":[]}
["Extraction du fichier client",null,"DERNIER CLIENT  17-04-2018",1100264,"L&L FASHION"]
[]
["NUM","NOM","ADRESSE","CP","LOCALITE","PAYS","TEL","FAX","EMAIL","LANGUE","TVA","INFOS BANQUE","CPT BANQUE","CATEGORIE","ADRESSE LIV","CP LIV","LOC LIV","PAYS LIV","BOUTIQUE","INTRA","REMISE","GSM","ADRESSE ENVOI","CP ENVOI","LOC ENVOI","PAYS ENVOI","CONTACT","INFO FACT","EXO","KVN NUMMER"]
[40017,"TENDANCE SARL","LE COURS",83560,"VINON SUR VERDON","France",null,null,"carlacorella@sfr.fr","FR",null,null,null,"Client Pro 1",null,null,null,"Belgique","TENDANCE BOUTIQUE","Non (Avec TVA)",0,624788602,null,null,null,"Belgique","CARLA",null,"Non"]
[1100109,"TERZI MELINA","5 IMPASSE DU SIROCCO",31140,"LAUNAGUET","France","07 77 08 89 35",null,null,null,"FR522077908",null,null,"Client Pro 1",null,null,null,"France",null,"Non (Avec TVA)",0,null,null,null,null,"France",null,null,"Non"]
[2194,"TEX SCRL","RUE DES DOMINICAINS,6",4000,"LIEGE","Belgique",42237939,null,null,"FR","BE0429519760",null,null,"Client Pro 1","IDEM",null,null,"Belgique","BOUTIQUE BIANCHI","Non (Avec TVA)",3,null,"IDEM",null,null,"Belgique",null,null,"Non"]
[2102,"THDM","CHAUSSEE DE NINOVE,555",1070,"BRUXELLES","Belgique",23515748,475478473,"helene1971@hotmail.be","FR","BE0475033546",null,null,"Client Pro 1",null,null,null,"Belgique","B52","Non (Avec TVA)",5,476021042,"PASSAGE WELLINGTON,47",1410,"WATERLOO","Belgique","NIKOLETTOS",null,"Non"]
[2051,"THE FAMOUS BVBA","DAALSTRAAT 129",3690,"ZUTENDAAL","Belgique",null,null,null,null,"BE0411976618",null,null,"Client Pro 1",null,null,null,"Belgique","GOGO CLUB","Non (Avec TVA)",0,476546776,null,null,null,"Belgique",null,null,"Non"]
[2110,"THE FAMOUS BVBA","DAALSTRAAT,129",3690,"ZUTENDAAL","Belgique",null,null,null,"NL","BE0411976618",null,null,"Client Pro 1",null,null,null,"Belgique","GOGO CLUB","Non (Avec TVA)",0,476546776,null,null,null,"Belgique",null,null,"Non"]
[1100276,"THE STYLE CLOSET","02-23 I12 KATONG MALL EAST COAST ROAD",428802,"SINGAPORE","Singapour","+65 93803376",null,null,null,null,null,null,"Client Pro 1",null,null,null,"France","THE STYLE CLOSET","Non (Avec TVA)",0,null,null,null,null,"France","PENNY LOH",null,"Non"]
[1100108,"TIEGRA LTD","18 NIKIFOROU FOKA STREET FLAT 201",2039,"NICOSIA","Chypre",45799614868,null,"photini@mavrides.info",null,"CY101462800",null,null,"Client Pro 1",null,null,null,"France","TIEGRA LTD","Oui (0% de TVA)",0,null,null,null,null,"France","FOTINI",null,"Non"]
[1100094,"TIGER ROSE","15 HIGH ST PETERSPEILD","GU323JT","HAMPSHIRE","Royaume-Uni",null,null,null,null,874501421,null,null,"Client Pro 1",null,null,null,"France","IDEM","Oui (0% de TVA)",0,null,null,null,null,"France","VOSIEOGRAM",null,"Non"]
[1100164,"TILIA","4 BOULEVARD EDOUARD BAUDOUIN",6160,"JUAN LES PINS","France",492940836,null,null,null,null,null,null,"Client Pro 1",null,null,null,"France","TILIA","Non (Avec TVA)",0,null,null,null,null,"France","CAVALIER BABETTE",null,"Non"]
[1100137,"TIN TINO FASHION AB","KORSGATAN 3","SE-411 16","GOTHENBURG","Suede","+4631446320",null,"ingela@tintino.se",null,"SE 556649532001",null,null,"Client Pro 1",null,null,null,"France","TIN TINO","Oui (0% de TVA)",0,"+46705755813",null,null,null,"France","INGELA",null,"Non"]
[1100117,"TMI DISCONAILS","PARNUNKATU 5G26",980,"HELSINKI","France",null,null,null,null,"FL 1849904-9",null,null,"Client Pro 1",null,null,null,"France",null,"Oui (0% de TVA)",0,null,null,null,null,"France","KRISTIIN",null,"Non"]
[2237,"TO HAVE SUN SPRL","ROUTE DE PHILIPPEVILLE,3",6120,"NALINNES","Belgique",71228669,null,"laeti@pardelaleshaies.be",null,"BE0500540190",null,363112105061,"Client Pro 1","ROUTE DE PHILIPPEVILLE,3",null,null,"Belgique","X-TEN","Non (Avec TVA)",0,477642072,"ROUTE DE PHILIPPEVILLE,3",null,null,"Belgique","LAETITIA PUPPIN",null,"Non"]
[2275,"TOMBER DANS LES POMMES","RUE DES ECOLES,2",5620,"FLORENNES","Belgique",71614807,71614582,"tomberdanslespommes @hotmail.com","FR","BE0889 929 270",null,null,"Client Pro 1","IDEM",null,null,"Belgique","TOMBER DANS LES POMMES","Non (Avec TVA)",0,478209916,"IDEM",null,null,"Belgique","DENEUMOUSTIER SYLVIE",null,"Non"]
[400003,"TOP MODELE","2 RUE ST VINCENT",30100,"ALES","France",null,null,null,"FR",null,null,null,"Client Pro 1",null,null,null,"Belgique","TOP MODELE","Non (Avec TVA)",0,null,null,null,null,"Belgique",null,null,"Non"]
[2184,"TRADO","RUE ADOLPHE BUYL 14",8400,"OOSTENDE","Belgique",59803791,null,"trado.nv.@telenet.be",null,"BE0426148813",null,null,"Client Pro 1",null,null,null,"Belgique","SAIL & COUNTRY","Non (Avec TVA)",0,498310395,null,null,null,"Belgique","ROETS MARINA",null,"Non"]
[200071,"TRES CHOUETTE FASHION BVBA","SINT IGNATUSSTRAAT 55",9120,"KALLO","Belgique",null,null,"vickydeckx@gmail.com","NL","BE0817 353 078",null,null,"Client Pro 1",null,null,null,"Belgique",null,"Non (Avec TVA)",0,477555890,null,null,null,"Belgique","VICKY DECKX",null,"Non"]
{"$rows_left_out":59}
{"sheet":"MOD FACTURE","index":2,"n_rows":60,"n_cols":24,"rows_kept":60,"cut":false,"hidden":false,"merged":[[23,17,23,26],[24,17,24,26],[25,17,25,26],[26,17,26,26],[1,0,1,15],[3,12,3,14],[4,9,4,10],[5,9,5,15],[5,17,5,23],[7,9,7,10],[7,11,7,15],[7,17,7,18],[8,9,8,10],[6,9,6,15],[9,9,9,15],[9,17,9,20],[16,0,17,3],[10,9,10,15],[10,17,10,20],[11,9,11,15],[11,17,11,20],[12,9,12,15],[12,17,12,20],[14,4,15,11],[14,13,15,13],[14,14,15,16],[16,5,16,9],[17,10,18,10],[19,16,20,16],[19,1,20,1],[19,11,20,11],[19,12,20,12],[19,13,20,13],[19,14,20,14],[19,15,20,15],[48,10,49,12],[48,13,49,16],[50,0,50,1],[50,4,50,5],[50,6,50,7],[50,10,50,12],[50,13,50,16],[53,0,53,2],[53,13,53,16],[54,10,54,12],[54,13,54,16],[51,0,51,1],[51,4,51,5],[51,6,51,7],[51,10,51,12],[51,13,51,16],[52,0,52,1],[52,4,52,5],[52,6,52,7],[52,10,52,12],[52,13,52,16],[53,4,56,9]]}
[]
[]
[]
[null,null,null,null,null,null,null,null,null,null,"Date:"]
[null,null,null,null,null,null,null,"Numéro: "]
[null,null,null,null,null,null,null,"Nom: ",null,{"$f":"IF($J$5=0,\" \",R6)","v":" "},null,null,null,null,null,null,null,{"$f":"IF(J5=0,\" \",VLOOKUP(J5,client!$A$4:$AD$79309,2,FALSE))","v":" "}]
[null,null,null,null,null,null,null,"Adresse: ",null,{"$f":"IF($J$5=0,\" \",R7)","v":" "},null,null,null,null,null,null,null,{"$f":"IF($J$5=0,\" \",VLOOKUP($J$5,client!$A$4:$AD$79309,3,FALSE))","v":" "}]
[null,null,null,null,null,null,null,null,null,{"$f":"IF($J$5=0,\"\",R8)","v":""},null,{"$f":"IF($J$5=0,\" \",VLOOKUP($J$5,client!$A$4:$AD$79309,5,FALSE))","v":" "},null,null,null,null,null,{"$f":"IF($J$5=0,\" \",VLOOKUP($J$5,client!$A$4:$AD$79309,4,FALSE))","v":" "},null,{"$f":"IF($J$5=0,\" \",VLOOKUP($J$5,client!$A$4:$AD$79309,5,FALSE))","v":" "}]
[null,null,null,null,null,null,null,null,null,{"$f":"IF($J$5=0,\"\",R9)","v":""},null,null,null,null,null,null,null,{"$f":"IF($J$5=0,\" \",VLOOKUP($J$5,client!$A$4:$AD$79309,6,FALSE))","v":" "}]
[null,null,null,null,null,null,null,"T.V.A: ",null,{"$f":"IF($J$5=0,\" \",R10)","v":" "},{"$f":"IF(K6=0,\" \",VLOOKUP(K6,client!$A$4:$AD$79309,6,FALSE))","v":" "},{"$f":"IF(L6=0,\" \",VLOOKUP(L6,client!$A$4:$AD$79309,6,FALSE))","v":" "},{"$f":"IF(M6=0,\" \",VLOOKUP(M6,client!$A$4:$AD$79309,6,FALSE))","v":" "},{"$f":"IF(N6=0,\" \",VLOOKUP(N6,client!$A$4:$AD$79309,6,FALSE))","v":" "},{"$f":"IF(O6=0,\" \",VLOOKUP(O6,client!$A$4:$AD$79309,6,FALSE))","v":" "},{"$f":"IF(P6=0,\" \",VLOOKUP(P6,client!$A$4:$AD$79309,6,FALSE))","v":" "},null,{"$f":"IF($J$5=0,\" \",VLOOKUP($J$5,client!$A$4:$AD$79309,11,FALSE))","v":" "},null,null,null,{"$f":"IF(V6=0,\" \",VLOOKUP(V6,client!$A$4:$AD$79309,6,FALSE))","v":" "},{"$f":"IF(W6=0,\" \",VLOOKUP(W6,client!$A$4:$AD$79309,6,FALSE))","v":" "},{"$f":"IF(X6=0,\" \",VLOOKUP(X6,client!$A$4:$AD$79309,6,FALSE))","v":" "}]
[null,null,null,null,null,null,null,"Tél: ",null,{"$f":"IF(J5=0,\" \",R11)","v":" "},{"$f":"IF(K7=0,\" \",VLOOKUP(K7,client!$A$4:$AD$79309,6,FALSE))","v":" "},{"$f":"IF(L7=0,\" \",VLOOKUP(L7,client!$A$4:$AD$79309,6,FALSE))","v":" "},{"$f":"IF(M7=0,\" \",VLOOKUP(M7,client!$A$4:$AD$79309,6,FALSE))","v":" "},{"$f":"IF(N7=0,\" \",VLOOKUP(N7,client!$A$4:$AD$79309,6,FALSE))","v":" "},{"$f":"IF(O7=0,\" \",VLOOKUP(O7,client!$A$4:$AD$79309,6,FALSE))","v":" "},{"$f":"IF(P7=0,\" \",VLOOKUP(P7,client!$A$4:$AD$79309,6,FALSE))","v":" "},null,{"$f":"IF($J$5=0,\" \",VLOOKUP($J$5,client!$A$4:$AD$79309,7,FALSE))","v":" "}]
[null,null,null,null,null,null,null,"Mob: ",null,{"$f":"IF(J5=0,\" \",R12)","v":" "},{"$f":"IF(K8=0,\" \",VLOOKUP(K8,client!$A$4:$AD$79309,6,FALSE))","v":" "},{"$f":"IF(L8=0,\" \",VLOOKUP(L8,client!$A$4:$AD$79309,6,FALSE))","v":{"$error":"#N/A"}},{"$f":"IF(M8=0,\" \",VLOOKUP(M8,client!$A$4:$AD$79309,6,FALSE))","v":" "},{"$f":"IF(N8=0,\" \",VLOOKUP(N8,client!$A$4:$AD$79309,6,FALSE))","v":" "},{"$f":"IF(O8=0,\" \",VLOOKUP(O8,client!$A$4:$AD$79309,6,FALSE))","v":" "},{"$f":"IF(P8=0,\" \",VLOOKUP(P8,client!$A$4:$AD$79309,6,FALSE))","v":" "},null,{"$f":"IF($J$5=0,\" \",VLOOKUP($J$5,client!$A$4:$AD$79309,22,FALSE))","v":" "}]
[null,null,null,null,null,null,null,"Mail: ",null,{"$f":"IF(J5=0,\" \",R13)","v":" "},{"$f":"IF(K9=0,\" \",VLOOKUP(K9,client!$A$4:$AD$79309,6,FALSE))","v":" "},{"$f":"IF(L9=0,\" \",VLOOKUP(L9,client!$A$4:$AD$79309,6,FALSE))","v":" "},{"$f":"IF(M9=0,\" \",VLOOKUP(M9,client!$A$4:$AD$79309,6,FALSE))","v":" "},{"$f":"IF(N9=0,\" \",VLOOKUP(N9,client!$A$4:$AD$79309,6,FALSE))","v":" "},{"$f":"IF(O9=0,\" \",VLOOKUP(O9,client!$A$4:$AD$79309,6,FALSE))","v":" "},{"$f":"IF(P9=0,\" \",VLOOKUP(P9,client!$A$4:$AD$79309,6,FALSE))","v":" "},null,{"$f":"IF($J$5=0,\" \",VLOOKUP($J$5,client!$A$4:$AD$79309,9,FALSE))","v":" "}]
[]
[null,null,null,null,"F A C T U R E",null,null,null,null,null,null,null,null," N°","FA201860000"]
[]
[null,null,null,null,null,"Tailles"]
[null,null,null,null,null,"S","M","L","XL","XXL"]
[null,null,null,null,null,"SM","ML","LX",null,"U"]
["Code","Descrip.","GENRE","COMP","coul",36,38,40,42,44,"Qté","Prix Unit","Rem %","Rem *","Rem","Prix Unit","TOT Prix"]
{"$rows_left_out":41}
{"sheet":"MOD Vente Comptoir 2 et 3","index":3,"n_rows":54,"n_cols":18,"rows_kept":54,"cut":false,"hidden":false,"merged":[[22,17,22,26],[23,17,23,26],[24,17,24,26],[25,17,25,26],[52,0,52,2],[52,9,52,11],[52,12,52,16],[53,9,53,11],[53,12,53,16],[50,0,50,1],[50,5,50,6],[50,9,50,11],[50,12,50,16],[51,0,51,1],[51,5,51,6],[51,9,51,11],[51,12,51,16],[18,15,19,15],[18,16,19,16],[47,9,48,11],[47,12,48,16],[49,0,49,1],[49,5,49,6],[49,9,49,11],[49,12,49,16],[18,1,19,1],[18,11,19,11],[18,12,19,12],[18,13,19,13],[18,14,19,14],[15,5,15,9],[15,15,16,16],[16,0,17,0],[16,1,17,2],[16,10,17,10],[8,9,8,16],[9,9,9,16],[10,9,10,16],[11,9,11,16],[13,3,14,11],[13,14,14,14],[13,15,14,16],[7,9,7,16],[0,0,0,16],[3,12,3,15],[4,9,4,16],[5,9,5,16],[6,9,6,16]]}
[]
[]
[]
[null,null,null,null,null,null,null,null,null,null,"Date:"]
[]
[]
[]
[]
[]
[]
[]
[]
[]
[null,null,null,"VENTE COMPTOIR",null,null,null,null,null,null,null,null,null,null," N°","VC201865000"]
[]
[null,null,null,null,null,"Tailles"]
[null,null,null,null,null,"S","M","L","XL","XXL"]
[null,null,null,null,null,"SM","ML","LX",null,"U"]
["Code","Descrip.","GENRE","COMP","coul",36,38,40,42,44,"Qté","Prix Unit","Rem %","Rem *","Rem","Prix Unit","TOT Prix"]
["CO",null,null,null,null,1,2,3,4,5]
{"$rows_left_out":35}
{"sheet":"FA201860001","index":4,"n_rows":60,"n_cols":24,"rows_kept":60,"cut":false,"hidden":false,"merged":[[6,9,6,15],[1,0,1,15],[3,12,3,14],[4,9,4,10],[5,9,5,15],[5,17,5,23],[7,9,7,10],[7,11,7,15],[7,17,7,18],[8,9,8,10],[9,9,9,15],[9,17,9,20],[10,9,10,15],[10,17,10,20],[11,9,11,15],[11,17,11,20],[12,9,12,15],[12,17,12,20],[14,4,15,11],[14,13,15,13],[14,14,15,16],[16,0,17,3],[16,5,16,9],[17,10,18,10],[48,10,49,12],[48,13,49,16],[19,1,20,1],[19,11,20,11],[19,12,20,12],[19,13,20,13],[19,14,20,14],[19,15,20,15],[19,16,20,16],[23,17,23,26],[24,17,24,26],[25,17,25,26],[26,17,26,26],[51,0,51,1],[51,4,51,5],[51,6,51,7],[51,10,51,12],[51,13,51,16],[50,0,50,1],[50,4,50,5],[50,6,50,7],[50,10,50,12],[50,13,50,16],[53,0,53,2],[53,4,56,9],[53,13,53,16],[54,10,54,12],[54,13,54,16],[52,0,52,1],[52,4,52,5],[52,6,52,7],[52,10,52,12],[52,13,52,16]]}
[]
[]
[]
[null,null,null,null,null,null,null,null,null,null,"Date:"]
[null,null,null,null,null,null,null,"Numéro: "]
[null,null,null,null,null,null,null,"Nom: ",null,{"$f":"IF($J$5=0,\" \",R6)","v":" "},null,null,null,null,null,null,null,{"$f":"IF(J5=0,\" \",VLOOKUP(J5,client!$A$4:$AD$79309,2,FALSE))","v":" "}]
[null,null,null,null,null,null,null,"Adresse: ",null,{"$f":"IF($J$5=0,\" \",R7)","v":" "},null,null,null,null,null,null,null,{"$f":"IF($J$5=0,\" \",VLOOKUP($J$5,client!$A$4:$AD$79309,3,FALSE))","v":" "}]
[null,null,null,null,null,null,null,null,null,{"$f":"IF($J$5=0,\"\",R8)","v":""},null,{"$f":"IF($J$5=0,\" \",VLOOKUP($J$5,client!$A$4:$AD$79309,5,FALSE))","v":" "},null,null,null,null,null,{"$f":"IF($J$5=0,\" \",VLOOKUP($J$5,client!$A$4:$AD$79309,4,FALSE))","v":" "},null,{"$f":"IF($J$5=0,\" \",VLOOKUP($J$5,client!$A$4:$AD$79309,5,FALSE))","v":" "}]
[null,null,null,null,null,null,null,null,null,{"$f":"IF($J$5=0,\"\",R9)","v":""},null,null,null,null,null,null,null,{"$f":"IF($J$5=0,\" \",VLOOKUP($J$5,client!$A$4:$AD$79309,6,FALSE))","v":" "}]
[null,null,null,null,null,null,null,"T.V.A: ",null,{"$f":"IF($J$5=0,\" \",R10)","v":" "},{"$f":"IF(K6=0,\" \",VLOOKUP(K6,client!$A$4:$AD$79309,6,FALSE))","v":" "},{"$f":"IF(L6=0,\" \",VLOOKUP(L6,client!$A$4:$AD$79309,6,FALSE))","v":" "},{"$f":"IF(M6=0,\" \",VLOOKUP(M6,client!$A$4:$AD$79309,6,FALSE))","v":" "},{"$f":"IF(N6=0,\" \",VLOOKUP(N6,client!$A$4:$AD$79309,6,FALSE))","v":" "},{"$f":"IF(O6=0,\" \",VLOOKUP(O6,client!$A$4:$AD$79309,6,FALSE))","v":" "},{"$f":"IF(P6=0,\" \",VLOOKUP(P6,client!$A$4:$AD$79309,6,FALSE))","v":" "},null,{"$f":"IF($J$5=0,\" \",VLOOKUP($J$5,client!$A$4:$AD$79309,11,FALSE))","v":" "},null,null,null,{"$f":"IF(V6=0,\" \",VLOOKUP(V6,client!$A$4:$AD$79309,6,FALSE))","v":" "},{"$f":"IF(W6=0,\" \",VLOOKUP(W6,client!$A$4:$AD$79309,6,FALSE))","v":" "},{"$f":"IF(X6=0,\" \",VLOOKUP(X6,client!$A$4:$AD$79309,6,FALSE))","v":" "}]
[null,null,null,null,null,null,null,"Tél: ",null,{"$f":"IF(J5=0,\" \",R11)","v":" "},{"$f":"IF(K7=0,\" \",VLOOKUP(K7,client!$A$4:$AD$79309,6,FALSE))","v":" "},{"$f":"IF(L7=0,\" \",VLOOKUP(L7,client!$A$4:$AD$79309,6,FALSE))","v":" "},{"$f":"IF(M7=0,\" \",VLOOKUP(M7,client!$A$4:$AD$79309,6,FALSE))","v":" "},{"$f":"IF(N7=0,\" \",VLOOKUP(N7,client!$A$4:$AD$79309,6,FALSE))","v":" "},{"$f":"IF(O7=0,\" \",VLOOKUP(O7,client!$A$4:$AD$79309,6,FALSE))","v":" "},{"$f":"IF(P7=0,\" \",VLOOKUP(P7,client!$A$4:$AD$79309,6,FALSE))","v":" "},null,{"$f":"IF($J$5=0,\" \",VLOOKUP($J$5,client!$A$4:$AD$79309,7,FALSE))","v":" "}]
[null,null,null,null,null,null,null,"Mob: ",null,{"$f":"IF(J5=0,\" \",R12)","v":" "},{"$f":"IF(K8=0,\" \",VLOOKUP(K8,client!$A$4:$AD$79309,6,FALSE))","v":" "},{"$f":"IF(L8=0,\" \",VLOOKUP(L8,client!$A$4:$AD$79309,6,FALSE))","v":{"$error":"#N/A"}},{"$f":"IF(M8=0,\" \",VLOOKUP(M8,client!$A$4:$AD$79309,6,FALSE))","v":" "},{"$f":"IF(N8=0,\" \",VLOOKUP(N8,client!$A$4:$AD$79309,6,FALSE))","v":" "},{"$f":"IF(O8=0,\" \",VLOOKUP(O8,client!$A$4:$AD$79309,6,FALSE))","v":" "},{"$f":"IF(P8=0,\" \",VLOOKUP(P8,client!$A$4:$AD$79309,6,FALSE))","v":" "},null,{"$f":"IF($J$5=0,\" \",VLOOKUP($J$5,client!$A$4:$AD$79309,22,FALSE))","v":" "}]
[null,null,null,null,null,null,null,"Mail: ",null,{"$f":"IF(J5=0,\" \",R13)","v":" "},{"$f":"IF(K9=0,\" \",VLOOKUP(K9,client!$A$4:$AD$79309,6,FALSE))","v":" "},{"$f":"IF(L9=0,\" \",VLOOKUP(L9,client!$A$4:$AD$79309,6,FALSE))","v":" "},{"$f":"IF(M9=0,\" \",VLOOKUP(M9,client!$A$4:$AD$79309,6,FALSE))","v":" "},{"$f":"IF(N9=0,\" \",VLOOKUP(N9,client!$A$4:$AD$79309,6,FALSE))","v":" "},{"$f":"IF(O9=0,\" \",VLOOKUP(O9,client!$A$4:$AD$79309,6,FALSE))","v":" "},{"$f":"IF(P9=0,\" \",VLOOKUP(P9,client!$A$4:$AD$79309,6,FALSE))","v":" "},null,{"$f":"IF($J$5=0,\" \",VLOOKUP($J$5,client!$A$4:$AD$79309,9,FALSE))","v":" "}]
[]
[null,null,null,null,"F A C T U R E",null,null,null,null,null,null,null,null," N°","FA201860001"]
[]
[null,null,null,null,null,"Tailles"]
[null,null,null,null,null,"S","M","L","XL","XXL"]
[null,null,null,null,null,"SM","ML","LX",null,"U"]
["Code","Descrip.","GENRE","COMP","coul",36,38,40,42,44,"Qté","Prix Unit","Rem %","Rem *","Rem","Prix Unit","TOT Prix"]
{"$rows_left_out":41}
{"sheet":"VC2018650001","index":5,"n_rows":54,"n_cols":18,"rows_kept":54,"cut":false,"hidden":false,"merged":[[7,9,7,16],[0,0,0,16],[3,12,3,15],[4,9,4,16],[5,9,5,16],[6,9,6,16],[8,9,8,16],[9,9,9,16],[10,9,10,16],[11,9,11,16],[13,3,14,11],[13,14,14,14],[13,15,14,16],[25,17,25,26],[15,5,15,9],[15,15,16,16],[16,0,17,0],[16,1,17,2],[16,10,17,10],[18,1,19,1],[18,11,19,11],[18,12,19,12],[18,13,19,13],[18,14,19,14],[18,15,19,15],[18,16,19,16],[22,17,22,26],[23,17,23,26],[24,17,24,26],[47,9,48,11],[47,12,48,16],[49,0,49,1],[49,5,49,6],[49,9,49,11],[49,12,49,16],[50,0,50,1],[50,5,50,6],[50,9,50,11],[50,12,50,16],[51,0,51,1],[51,5,51,6],[51,9,51,11],[51,12,51,16],[52,0,52,2],[52,9,52,11],[52,12,52,16],[53,9,53,11],[53,12,53,16]]}
[]
[]
[]
[null,null,null,null,null,null,null,null,null,null,"Date:"]
[]
[]
[]
[]
[]
[]
[]
[]
[]
[null,null,null,"VENTE COMPTOIR",null,null,null,null,null,null,null,null,null,null," N°","VC2018650001"]
[]
[null,null,null,null,null,"Tailles"]
[null,null,null,null,null,"S","M","L","XL","XXL"]
[null,null,null,null,null,"SM","ML","LX",null,"U"]
["Code","Descrip.","GENRE","COMP","coul",36,38,40,42,44,"Qté","Prix Unit","Rem %","Rem *","Rem","Prix Unit","TOT Prix"]
["CO",null,null,null,null,1,2,3,4,5]
{"$rows_left_out":34}