{"text_format":"1","workbook":"xlsx","n_sheets":5,"sheets":["chene","Fréquence des chene","BDDG","Feuil2","Listesdéroulante"],"not_rendered":{"charts":0,"images":0,"macros":1,"external_links":0,"defined_names":7,"comments":0,"pivot_tables":0},"unopened":[],"bounds":{"document_bytes":16777216,"sheet_cells":100000,"rows_first":2000,"rows_last":500,"rows_between":2000,"halvings":0,"cell_chars":16384,"cell_head_chars":4096},"cells_cut":0,"cells_raw":0,"read":"whole","date_system":"1900"}

{"sheet":"chene","index":0,"n_rows":19,"n_cols":32,"rows_kept":19,"cut":false,"hidden":false,"merged":[]}
["Date","Météo","Code","Chou","Asperge","Courge","Artichaut","Aubergine","Brocoli","Celeri","Truc1","Vitre1","Route1","Cresson","Truc2","Vitre2","Route2","Endive","Truc3","Vitre3","Route3","Fenouil","Truc4","Vitre4","Route4","Total général ","Mois","Année","Différence entre 2 saisies ","Observations"]
["2018-01-03","Soleil",120,{"$f":"IF(ISNA(VLOOKUP(C2,BDDG!$A$1:$F$39,2,FALSE)),\"\",VLOOKUP(C2,BDDG!$A$1:$F$39,2,FALSE))","v":0},{"$f":"IF(ISNA(VLOOKUP(C2,BDDG!$A$2:$N$39,3,FALSE)),\"\",VLOOKUP(C2,BDDG!$A$2:$N$39,3,FALSE))","v":"Litchi"},{"$f":"IF(ISNA(VLOOKUP(C2,BDDG!$A$2:$N$39,4,FALSE)),\"\",VLOOKUP(C2,BDDG!$A$2:$N$39,4,FALSE))","v":"Poire"},{"$f":"IF(ISNA(VLOOKUP(C2,BDDG!$A$1:$F$39,5,FALSE)),\"\",VLOOKUP(C2,BDDG!$A$1:$F$39,5,FALSE))","v":"Prune"},{"$f":"IF(ISNA(VLOOKUP(C2,BDDG!$A$1:$F$39,6,FALSE)),\"\",VLOOKUP(C2,BDDG!$A$1:$F$39,6,FALSE))","v":"Quetsche"},{"$f":"IF(ISERROR(VLOOKUP(C2,BDDG!$A$1:$G$39,7,FALSE)),\"\",VLOOKUP(C2,BDDG!$A$1:$G$39,7,FALSE))","v":1},{"$f":"IF(ISERROR(VLOOKUP(C2,BDDG!$A$1:$T$39,8,FALSE)),\"\",VLOOKUP(C2,BDDG!$A$1:$T$39,8,FALSE))","v":"Tomate charnue"},10,23.47,{"$f":" IF(ISERROR(K2/L2*86.4),\"xxxxx\",K2/L2*86.4)","v":36.812952705581601},{"$f":"IF(ISERROR(VLOOKUP(C2,BDDG!$A$1:$T$39,11,FALSE)),\"\",VLOOKUP(C2,BDDG!$A$1:$T$39,11,FALSE))","v":"xxxxxxxxxxxxxxx"},"xxxx","xxxx",{"$f":" IF(ISERROR(O2/P2*86.4),\"xxxxx\",O2/P2*86.4)","v":"xxxxx"},{"$f":"IF(ISERROR(VLOOKUP(C2,BDDG!$A$1:$T$39,14,FALSE)),\"\",VLOOKUP(C2,BDDG!$A$1:$T$39,14,FALSE))","v":"xxxxxxxxxxxxxxx"},"xxxx","xxxx",{"$f":" IF(ISERROR(S2/T2*86.4),\"xxxxx\",S2/T2*86.4)","v":"xxxxx"},{"$f":"IF(ISERROR(VLOOKUP(C2,BDDG!$A$1:$T$39,17,FALSE)),\"\",VLOOKUP(C2,BDDG!$A$1:$T$39,17,FALSE))","v":"xxxxxxxxxxxxxxx"},"xxxx","xxxx",{"$f":" IF(ISERROR(W2/X2*86.4),\"xxxxx\",W2/X2*86.4)","v":"xxxxx"},{"$f":"IF(ISERROR(SUM(M2,Q2,U2,Y2)),\"\",SUM(M2,Q2,U2,Y2))","v":36.812952705581601},{"$f":"PROPER(TEXT(A2,\"mmmm\"))","v":"Janvier"},{"$f":"YEAR(A:A)","v":2018},{"$f":"IFERROR((INDEX($Z$2:Z19,MATCH(H2&MAX(IF($H$1:H1=H2,$A$1:A1)),$H$2:H19&$A$2:A19,0))-Z2)*-1,\"\")","v":""},"dsqd",null,{"$f":"MAX(IF((TblJaugeage[Observations]<>0)*(Ail=120),TblJaugeage[Date]))","v":"2018-02-11"}]
["2018-01-03","Froid",120,{"$f":"IF(ISNA(VLOOKUP(C3,BDDG!$A$1:$F$39,2,FALSE)),\"\",VLOOKUP(C3,BDDG!$A$1:$F$39,2,FALSE))","v":0},{"$f":"IF(ISNA(VLOOKUP(C3,BDDG!$A$2:$N$39,3,FALSE)),\"\",VLOOKUP(C3,BDDG!$A$2:$N$39,3,FALSE))","v":"Litchi"},{"$f":"IF(ISNA(VLOOKUP(C3,BDDG!$A$2:$N$39,4,FALSE)),\"\",VLOOKUP(C3,BDDG!$A$2:$N$39,4,FALSE))","v":"Poire"},{"$f":"IF(ISNA(VLOOKUP(C3,BDDG!$A$1:$F$39,5,FALSE)),\"\",VLOOKUP(C3,BDDG!$A$1:$F$39,5,FALSE))","v":"Prune"},{"$f":"IF(ISNA(VLOOKUP(C3,BDDG!$A$1:$F$39,6,FALSE)),\"\",VLOOKUP(C3,BDDG!$A$1:$F$39,6,FALSE))","v":"Quetsche"},{"$f":"IF(ISERROR(VLOOKUP(C3,BDDG!$A$1:$G$39,7,FALSE)),\"\",VLOOKUP(C3,BDDG!$A$1:$G$39,7,FALSE))","v":1},{"$f":"IF(ISERROR(VLOOKUP(C3,BDDG!$A$1:$T$39,8,FALSE)),\"\",VLOOKUP(C3,BDDG!$A$1:$T$39,8,FALSE))","v":"Tomate charnue"},10,26.58,32.505643340857787,{"$f":"IF(ISERROR(VLOOKUP(C3,BDDG!$A$1:$T$39,11,FALSE)),\"\",VLOOKUP(C3,BDDG!$A$1:$T$39,11,FALSE))","v":"xxxxxxxxxxxxxxx"},"xxxx","xxxx","xxxxx",{"$f":"IF(ISERROR(VLOOKUP(C3,BDDG!$A$1:$T$39,14,FALSE)),\"\",VLOOKUP(C3,BDDG!$A$1:$T$39,14,FALSE))","v":"xxxxxxxxxxxxxxx"},"xxxx","xxxx","xxxxx",{"$f":"IF(ISERROR(VLOOKUP(C3,BDDG!$A$1:$T$39,17,FALSE)),\"\",VLOOKUP(C3,BDDG!$A$1:$T$39,17,FALSE))","v":"xxxxxxxxxxxxxxx"},"xxxx","xxxx","xxxxx",32.505643340857787,"Janvier",2018,{"$f":"IFERROR((INDEX($Z$2:Z19,MATCH(H3&MAX(IF($H$1:H2=H3,$A$1:A2)),$H$2:H19&$A$2:A19,0))-Z3)*-1,\"\")","v":-4.3073093647238139},"zazera",null,{"$f":"_xlfn.MAXIFS(TblJaugeage[Date],Ail,120,TblJaugeage[Observations],\"<>0\")","v":"2018-02-11"}]
["2017-02-03","Froid",160,{"$f":"IF(ISNA(VLOOKUP(C4,BDDG!$A$1:$F$39,2,FALSE)),\"\",VLOOKUP(C4,BDDG!$A$1:$F$39,2,FALSE))","v":0},{"$f":"IF(ISNA(VLOOKUP(C4,BDDG!$A$2:$N$39,3,FALSE)),\"\",VLOOKUP(C4,BDDG!$A$2:$N$39,3,FALSE))","v":"Litchi"},{"$f":"IF(ISNA(VLOOKUP(C4,BDDG!$A$2:$N$39,4,FALSE)),\"\",VLOOKUP(C4,BDDG!$A$2:$N$39,4,FALSE))","v":"Poire"},{"$f":"IF(ISNA(VLOOKUP(C4,BDDG!$A$1:$F$39,5,FALSE)),\"\",VLOOKUP(C4,BDDG!$A$1:$F$39,5,FALSE))","v":"Abricotier"},{"$f":"IF(ISNA(VLOOKUP(C4,BDDG!$A$1:$F$39,6,FALSE)),\"\",VLOOKUP(C4,BDDG!$A$1:$F$39,6,FALSE))","v":"Acacia"},{"$f":"IF(ISERROR(VLOOKUP(C4,BDDG!$A$1:$G$39,7,FALSE)),\"\",VLOOKUP(C4,BDDG!$A$1:$G$39,7,FALSE))","v":2},{"$f":"IF(ISERROR(VLOOKUP(C4,BDDG!$A$1:$T$39,8,FALSE)),\"\",VLOOKUP(C4,BDDG!$A$1:$T$39,8,FALSE))","v":"Ademia"},10,48.98,17.639853001224992,{"$f":"IF(ISERROR(VLOOKUP(C4,BDDG!$A$1:$T$39,11,FALSE)),\"\",VLOOKUP(C4,BDDG!$A$1:$T$39,11,FALSE))","v":"Amandier"},6,78.099999999999994,6.637644046094751,{"$f":"IF(ISERROR(VLOOKUP(C4,BDDG!$A$1:$T$39,14,FALSE)),\"\",VLOOKUP(C4,BDDG!$A$1:$T$39,14,FALSE))","v":"xxxxxxxxxxxxxxx"},"xxxx","xxxx","xxxxx",{"$f":"IF(ISERROR(VLOOKUP(C4,BDDG!$A$1:$T$39,17,FALSE)),\"\",VLOOKUP(C4,BDDG!$A$1:$T$39,17,FALSE))","v":"xxxxxxxxxxxxxxx"},"xxxx","xxxx","xxxxx",24.277497047319741,"Février",2017,{"$f":"IFERROR((INDEX($Z$2:Z19,MATCH(H4&MAX(IF($H$1:H3=H4,$A$1:A3)),$H$2:H19&$A$2:A19,0))-Z4)*-1,\"\")","v":""},"dqsdaze"]
["2018-02-07","Vent chaud",110,{"$f":"IF(ISNA(VLOOKUP(C5,BDDG!$A$1:$F$39,2,FALSE)),\"\",VLOOKUP(C5,BDDG!$A$1:$F$39,2,FALSE))","v":0},{"$f":"IF(ISNA(VLOOKUP(C5,BDDG!$A$2:$N$39,3,FALSE)),\"\",VLOOKUP(C5,BDDG!$A$2:$N$39,3,FALSE))","v":"Kiwi"},{"$f":"IF(ISNA(VLOOKUP(C5,BDDG!$A$2:$N$39,4,FALSE)),\"\",VLOOKUP(C5,BDDG!$A$2:$N$39,4,FALSE))","v":"Prune"},{"$f":"IF(ISNA(VLOOKUP(C5,BDDG!$A$1:$F$39,5,FALSE)),\"\",VLOOKUP(C5,BDDG!$A$1:$F$39,5,FALSE))","v":"Raisin"},{"$f":"IF(ISNA(VLOOKUP(C5,BDDG!$A$1:$F$39,6,FALSE)),\"\",VLOOKUP(C5,BDDG!$A$1:$F$39,6,FALSE))","v":"Tomate"},{"$f":"IF(ISERROR(VLOOKUP(C5,BDDG!$A$1:$G$39,7,FALSE)),\"\",VLOOKUP(C5,BDDG!$A$1:$G$39,7,FALSE))","v":2},{"$f":"IF(ISERROR(VLOOKUP(C5,BDDG!$A$1:$T$39,8,FALSE)),\"\",VLOOKUP(C5,BDDG!$A$1:$T$39,8,FALSE))","v":"Pamplemousse"},10,59.87,14.431267746784702,{"$f":"IF(ISERROR(VLOOKUP(C5,BDDG!$A$1:$T$39,11,FALSE)),\"\",VLOOKUP(C5,BDDG!$A$1:$T$39,11,FALSE))","v":"Kaki"},10,69.41,12.447774095951592,{"$f":"IF(ISERROR(VLOOKUP(C5,BDDG!$A$1:$T$39,14,FALSE)),\"\",VLOOKUP(C5,BDDG!$A$1:$T$39,14,FALSE))","v":"xxxxxxxxxxxxxxx"},"xxxx","xxxx","xxxxx",{"$f":"IF(ISERROR(VLOOKUP(C5,BDDG!$A$1:$T$39,17,FALSE)),\"\",VLOOKUP(C5,BDDG!$A$1:$T$39,17,FALSE))","v":"xxxxxxxxxxxxxxx"},"xxxx","xxxx","xxxxx",26.879041842736292,"Février",2018,{"$f":"IFERROR((INDEX($Z$2:Z19,MATCH(H5&MAX(IF($H$1:H4=H5,$A$1:A4)),$H$2:H19&$A$2:A19,0))-Z5)*-1,\"\")","v":""},{"$f":"IF(ISERROR(VLOOKUP(C5,BDDG!$A$1:$T$39,20,FALSE)),\"\",VLOOKUP(C5,BDDG!$A$1:$T$39,20,FALSE))","v":0}]
["2018-02-11","Soleil",120,{"$f":"IF(ISNA(VLOOKUP(C6,BDDG!$A$1:$F$39,2,FALSE)),\"\",VLOOKUP(C6,BDDG!$A$1:$F$39,2,FALSE))","v":0},{"$f":"IF(ISNA(VLOOKUP(C6,BDDG!$A$2:$N$39,3,FALSE)),\"\",VLOOKUP(C6,BDDG!$A$2:$N$39,3,FALSE))","v":"Litchi"},{"$f":"IF(ISNA(VLOOKUP(C6,BDDG!$A$2:$N$39,4,FALSE)),\"\",VLOOKUP(C6,BDDG!$A$2:$N$39,4,FALSE))","v":"Poire"},{"$f":"IF(ISNA(VLOOKUP(C6,BDDG!$A$1:$F$39,5,FALSE)),\"\",VLOOKUP(C6,BDDG!$A$1:$F$39,5,FALSE))","v":"Prune"},{"$f":"IF(ISNA(VLOOKUP(C6,BDDG!$A$1:$F$39,6,FALSE)),\"\",VLOOKUP(C6,BDDG!$A$1:$F$39,6,FALSE))","v":"Quetsche"},{"$f":"IF(ISERROR(VLOOKUP(C6,BDDG!$A$1:$G$39,7,FALSE)),\"\",VLOOKUP(C6,BDDG!$A$1:$G$39,7,FALSE))","v":1},{"$f":"IF(ISERROR(VLOOKUP(C6,BDDG!$A$1:$T$39,8,FALSE)),\"\",VLOOKUP(C6,BDDG!$A$1:$T$39,8,FALSE))","v":"Tomate charnue"},12,68,15.247058823529414,{"$f":"IF(ISERROR(VLOOKUP(C6,BDDG!$A$1:$T$39,11,FALSE)),\"\",VLOOKUP(C6,BDDG!$A$1:$T$39,11,FALSE))","v":"xxxxxxxxxxxxxxx"},"xxxx","xxxx","xxxxx",{"$f":"IF(ISERROR(VLOOKUP(C6,BDDG!$A$1:$T$39,14,FALSE)),\"\",VLOOKUP(C6,BDDG!$A$1:$T$39,14,FALSE))","v":"xxxxxxxxxxxxxxx"},"xxxx","xxxx","xxxxx",{"$f":"IF(ISERROR(VLOOKUP(C6,BDDG!$A$1:$T$39,17,FALSE)),\"\",VLOOKUP(C6,BDDG!$A$1:$T$39,17,FALSE))","v":"xxxxxxxxxxxxxxx"},"xxxx","xxxx","xxxxx",15.247058823529414,"Février",2018,{"$f":"IFERROR((INDEX($Z$2:Z19,MATCH(H6&MAX(IF($H$1:H5=H6,$A$1:A5)),$H$2:H19&$A$2:A19,0))-Z6)*-1,\"\")","v":-21.565893882052187},"hhhhh"]
["2018-01-22","Soleil",120,{"$f":"IF(ISNA(VLOOKUP(C7,BDDG!$A$1:$F$39,2,FALSE)),\"\",VLOOKUP(C7,BDDG!$A$1:$F$39,2,FALSE))","v":0},{"$f":"IF(ISNA(VLOOKUP(C7,BDDG!$A$2:$N$39,3,FALSE)),\"\",VLOOKUP(C7,BDDG!$A$2:$N$39,3,FALSE))","v":"Litchi"},{"$f":"IF(ISNA(VLOOKUP(C7,BDDG!$A$2:$N$39,4,FALSE)),\"\",VLOOKUP(C7,BDDG!$A$2:$N$39,4,FALSE))","v":"Poire"},{"$f":"IF(ISNA(VLOOKUP(C7,BDDG!$A$1:$F$39,5,FALSE)),\"\",VLOOKUP(C7,BDDG!$A$1:$F$39,5,FALSE))","v":"Prune"},{"$f":"IF(ISNA(VLOOKUP(C7,BDDG!$A$1:$F$39,6,FALSE)),\"\",VLOOKUP(C7,BDDG!$A$1:$F$39,6,FALSE))","v":"Quetsche"},{"$f":"IF(ISERROR(VLOOKUP(C7,BDDG!$A$1:$G$39,7,FALSE)),\"\",VLOOKUP(C7,BDDG!$A$1:$G$39,7,FALSE))","v":1},{"$f":"IF(ISERROR(VLOOKUP(C7,BDDG!$A$1:$T$39,8,FALSE)),\"\",VLOOKUP(C7,BDDG!$A$1:$T$39,8,FALSE))","v":"Tomate charnue"},5,23.12,18.685121107266436,{"$f":"IF(ISERROR(VLOOKUP(C7,BDDG!$A$1:$T$39,11,FALSE)),\"\",VLOOKUP(C7,BDDG!$A$1:$T$39,11,FALSE))","v":"xxxxxxxxxxxxxxx"},"xxxx","xxxx","xxxxx",{"$f":"IF(ISERROR(VLOOKUP(C7,BDDG!$A$1:$T$39,14,FALSE)),\"\",VLOOKUP(C7,BDDG!$A$1:$T$39,14,FALSE))","v":"xxxxxxxxxxxxxxx"},"xxxx","xxxx","xxxxx",{"$f":"IF(ISERROR(VLOOKUP(C7,BDDG!$A$1:$T$39,17,FALSE)),\"\",VLOOKUP(C7,BDDG!$A$1:$T$39,17,FALSE))","v":"xxxxxxxxxxxxxxx"},"xxxx","xxxx","xxxxx",18.685121107266436,"Janvier",2018,{"$f":"IFERROR((INDEX($Z$2:Z19,MATCH(H7&MAX(IF($H$1:H6=H7,$A$1:A6)),$H$2:H19&$A$2:A19,0))-Z7)*-1,\"\")","v":3.4380622837370218},"bgb"]
["2017-12-31","Pluie",130,{"$f":"IF(ISNA(VLOOKUP(C8,BDDG!$A$1:$F$39,2,FALSE)),\"\",VLOOKUP(C8,BDDG!$A$1:$F$39,2,FALSE))","v":0},{"$f":"IF(ISNA(VLOOKUP(C8,BDDG!$A$2:$N$39,3,FALSE)),\"\",VLOOKUP(C8,BDDG!$A$2:$N$39,3,FALSE))","v":"Mûre"},{"$f":"IF(ISNA(VLOOKUP(C8,BDDG!$A$2:$N$39,4,FALSE)),\"\",VLOOKUP(C8,BDDG!$A$2:$N$39,4,FALSE))","v":"Melon"},{"$f":"IF(ISNA(VLOOKUP(C8,BDDG!$A$1:$F$39,5,FALSE)),\"\",VLOOKUP(C8,BDDG!$A$1:$F$39,5,FALSE))","v":"Papaye"},{"$f":"IF(ISNA(VLOOKUP(C8,BDDG!$A$1:$F$39,6,FALSE)),\"\",VLOOKUP(C8,BDDG!$A$1:$F$39,6,FALSE))","v":"Pastéque"},{"$f":"IF(ISERROR(VLOOKUP(C8,BDDG!$A$1:$G$39,7,FALSE)),\"\",VLOOKUP(C8,BDDG!$A$1:$G$39,7,FALSE))","v":1},{"$f":"IF(ISERROR(VLOOKUP(C8,BDDG!$A$1:$T$39,8,FALSE)),\"\",VLOOKUP(C8,BDDG!$A$1:$T$39,8,FALSE))","v":"Orange sanguine"},11,47.85,19.862068965517242,{"$f":"IF(ISERROR(VLOOKUP(C8,BDDG!$A$1:$T$39,11,FALSE)),\"\",VLOOKUP(C8,BDDG!$A$1:$T$39,11,FALSE))","v":"xxxxxxxxxxxxxxx"},"xxxx","xxxx","xxxxx",{"$f":"IF(ISERROR(VLOOKUP(C8,BDDG!$A$1:$T$39,14,FALSE)),\"\",VLOOKUP(C8,BDDG!$A$1:$T$39,14,FALSE))","v":"xxxxxxxxxxxxxxx"},"xxxx","xxxx","xxxxx",{"$f":"IF(ISERROR(VLOOKUP(C8,BDDG!$A$1:$T$39,17,FALSE)),\"\",VLOOKUP(C8,BDDG!$A$1:$T$39,17,FALSE))","v":"xxxxxxxxxxxxxxx"},"xxxx","xxxx","xxxxx",19.862068965517242,"Décembre",2017,{"$f":"IFERROR((INDEX($Z$2:Z19,MATCH(H8&MAX(IF($H$1:H7=H8,$A$1:A7)),$H$2:H19&$A$2:A19,0))-Z8)*-1,\"\")","v":""},{"$f":"IF(ISERROR(VLOOKUP(C8,BDDG!$A$1:$T$39,20,FALSE)),\"\",VLOOKUP(C8,BDDG!$A$1:$T$39,20,FALSE))","v":0}]
["2016-06-24","Pluie",140,{"$f":"IF(ISNA(VLOOKUP(C9,BDDG!$A$1:$F$39,2,FALSE)),\"\",VLOOKUP(C9,BDDG!$A$1:$F$39,2,FALSE))","v":0},{"$f":"IF(ISNA(VLOOKUP(C9,BDDG!$A$2:$N$39,3,FALSE)),\"\",VLOOKUP(C9,BDDG!$A$2:$N$39,3,FALSE))","v":"Noix"},{"$f":"IF(ISNA(VLOOKUP(C9,BDDG!$A$2:$N$39,4,FALSE)),\"\",VLOOKUP(C9,BDDG!$A$2:$N$39,4,FALSE))","v":"Marron"},{"$f":"IF(ISNA(VLOOKUP(C9,BDDG!$A$1:$F$39,5,FALSE)),\"\",VLOOKUP(C9,BDDG!$A$1:$F$39,5,FALSE))","v":"Noisette"},{"$f":"IF(ISNA(VLOOKUP(C9,BDDG!$A$1:$F$39,6,FALSE)),\"\",VLOOKUP(C9,BDDG!$A$1:$F$39,6,FALSE))","v":"Figue"},{"$f":"IF(ISERROR(VLOOKUP(C9,BDDG!$A$1:$G$39,7,FALSE)),\"\",VLOOKUP(C9,BDDG!$A$1:$G$39,7,FALSE))","v":1},{"$f":"IF(ISERROR(VLOOKUP(C9,BDDG!$A$1:$T$39,8,FALSE)),\"\",VLOOKUP(C9,BDDG!$A$1:$T$39,8,FALSE))","v":"xxxxxxxxxxxxxxx"},"xxxx","xxxx","xxxxx",{"$f":"IF(ISERROR(VLOOKUP(C9,BDDG!$A$1:$T$39,11,FALSE)),\"\",VLOOKUP(C9,BDDG!$A$1:$T$39,11,FALSE))","v":"Kumquat"},12,59,17.572881355932207,{"$f":"IF(ISERROR(VLOOKUP(C9,BDDG!$A$1:$T$39,14,FALSE)),\"\",VLOOKUP(C9,BDDG!$A$1:$T$39,14,FALSE))","v":"xxxxxxxxxxxxxxx"},"xxxx","xxxx","xxxxx",{"$f":"IF(ISERROR(VLOOKUP(C9,BDDG!$A$1:$T$39,17,FALSE)),\"\",VLOOKUP(C9,BDDG!$A$1:$T$39,17,FALSE))","v":"xxxxxxxxxxxxxxx"},"xxxx","xxxx","xxxxx",17.572881355932207,"Juin",2016,{"$f":"IFERROR((INDEX($Z$2:Z19,MATCH(H9&MAX(IF($H$1:H8=H9,$A$1:A8)),$H$2:H19&$A$2:A19,0))-Z9)*-1,\"\")","v":""},"erery"]
["2017-08-17","Vent chaud",150,{"$f":"IF(ISNA(VLOOKUP(C10,BDDG!$A$1:$F$39,2,FALSE)),\"\",VLOOKUP(C10,BDDG!$A$1:$F$39,2,FALSE))","v":0},{"$f":"IF(ISNA(VLOOKUP(C10,BDDG!$A$2:$N$39,3,FALSE)),\"\",VLOOKUP(C10,BDDG!$A$2:$N$39,3,FALSE))","v":"Pêche"},{"$f":"IF(ISNA(VLOOKUP(C10,BDDG!$A$2:$N$39,4,FALSE)),\"\",VLOOKUP(C10,BDDG!$A$2:$N$39,4,FALSE))","v":"orange"},{"$f":"IF(ISNA(VLOOKUP(C10,BDDG!$A$1:$F$39,5,FALSE)),\"\",VLOOKUP(C10,BDDG!$A$1:$F$39,5,FALSE))","v":"Groseille"},{"$f":"IF(ISNA(VLOOKUP(C10,BDDG!$A$1:$F$39,6,FALSE)),\"\",VLOOKUP(C10,BDDG!$A$1:$F$39,6,FALSE))","v":"Nectarine"},{"$f":"IF(ISERROR(VLOOKUP(C10,BDDG!$A$1:$G$39,7,FALSE)),\"\",VLOOKUP(C10,BDDG!$A$1:$G$39,7,FALSE))","v":1},{"$f":"IF(ISERROR(VLOOKUP(C10,BDDG!$A$1:$T$39,8,FALSE)),\"\",VLOOKUP(C10,BDDG!$A$1:$T$39,8,FALSE))","v":"Myrtille"},12,45.32,22.877316857899384,{"$f":"IF(ISERROR(VLOOKUP(C10,BDDG!$A$1:$T$39,11,FALSE)),\"\",VLOOKUP(C10,BDDG!$A$1:$T$39,11,FALSE))","v":"xxxxxxxxxxxxxxx"},"xxxx","xxxx","xxxxx",{"$f":"IF(ISERROR(VLOOKUP(C10,BDDG!$A$1:$T$39,14,FALSE)),\"\",VLOOKUP(C10,BDDG!$A$1:$T$39,14,FALSE))","v":"xxxxxxxxxxxxxxx"},"xxxx","xxxx","xxxxx",{"$f":"IF(ISERROR(VLOOKUP(C10,BDDG!$A$1:$T$39,17,FALSE)),\"\",VLOOKUP(C10,BDDG!$A$1:$T$39,17,FALSE))","v":"xxxxxxxxxxxxxxx"},"xxxx","xxxx","xxxxx",22.877316857899384,"Août",2017,{"$f":"IFERROR((INDEX($Z$2:Z19,MATCH(H10&MAX(IF($H$1:H9=H10,$A$1:A9)),$H$2:H19&$A$2:A19,0))-Z10)*-1,\"\")","v":""},"yuuy"]
{"$rows_left_out":10}
{"sheet":"Fréquence des chene","index":1,"n_rows":9,"n_cols":17,"rows_kept":9,"cut":false,"hidden":false,"merged":[]}
["Code","Asperge","Courge","Artichaut","Aubergine","Janvier","Février","Mars","Avril","Mai","Juin","Juillet","Août","Septembre","Octobre","Novembre","Décembre"]
[110,"Kiwi","Prune","Raisin","Tomate",{"$f":"COUNTIFS(Ail,$A2,Mois,F$1)","v":2},{"$f":"COUNTIFS(Ail,$A2,Mois,G$1)","v":1},0,0,0,0,0,0,1,0,0,0]
[120,"Litchi","Poire","Prune","Quetsche",3,1,0,1,0,0,0,0,0,0,0,0]
[130,"Mûre","Melon","Papaye","Pastéque",0,0,0,0,0,0,0,0,0,0,0,1]
[140,"Noix","Marron","Noisette","Figue",0,0,0,0,0,1,0,0,0,0,0,0]
[150,"Pêche","orange","Groseille","Nectarine",0,0,0,0,0,0,0,1,0,0,0,0]
[160,"Litchi","Poire","Abricotier","Acacia",0,1,0,0,0,1,0,0,0,1,0,0]
[170,"Arbousier","Aulme","Cactus","Buis",0,0,1,0,0,0,0,1,0,0,0,0]
[180,"Cerisier","Cèdre","Cocotier","Citronnier",0,0,0,1,0,0,0,0,0,0,0,0]

{"sheet":"BDDG","index":2,"n_rows":1601,"n_cols":21,"rows_kept":1601,"cut":false,"hidden":false,"merged":[]}
["Code","Chou","Asperge","Courge","Artichaut","Aubergine","Brocoli","Celeri","Truc1","Vitre1","Cresson","Truc2","Vitre2","Endive","Truc3","Vitre3","Fenouil","truc4","Vitre4","Observation(s) "]
[110,0,"Kiwi","Prune","Raisin","Tomate",2,"Pamplemousse",null,null,"Kaki",null,null,"xxxxxxxxxxxxxxx","xxxx","xxxx","xxxxxxxxxxxxxxx","xxxx","xxxx"]
[120,0,"Litchi","Poire","Prune","Quetsche",1,"Tomate charnue",null,null,"xxxxxxxxxxxxxxx","xxxx","xxxx","xxxxxxxxxxxxxxx","xxxx","xxxx","xxxxxxxxxxxxxxx","xxxx","xxxx"]
[130,0,"Mûre","Melon","Papaye","Pastéque",1,"Orange sanguine",null,null,"xxxxxxxxxxxxxxx","xxxx","xxxx","xxxxxxxxxxxxxxx","xxxx","xxxx","xxxxxxxxxxxxxxx","xxxx","xxxx"]
[140,0,"Noix","Marron","Noisette","Figue",1,"xxxxxxxxxxxxxxx","xxxx","xxxx","Kumquat",null,null,"xxxxxxxxxxxxxxx","xxxx","xxxx","xxxxxxxxxxxxxxx","xxxx","xxxx"]
[150,0,"Pêche","orange","Groseille","Nectarine",1,"Myrtille",null,null,"xxxxxxxxxxxxxxx","xxxx","xxxx","xxxxxxxxxxxxxxx","xxxx","xxxx","xxxxxxxxxxxxxxx","xxxx","xxxx"]
[160,0,"Litchi","Poire","Abricotier","Acacia",2,"Ademia",null,null,"Amandier",null,null,"xxxxxxxxxxxxxxx","xxxx","xxxx","xxxxxxxxxxxxxxx","xxxx","xxxx"]
[170,0,"Arbousier","Aulme","Cactus","Buis",1,"xxxxxxxxxxxxxxx","xxxx","xxxx","Cafetier",null,null,"xxxxxxxxxxxxxxx","xxxx","xxxx","xxxxxxxxxxxxxxx","xxxx","xxxx"]
[180,0,"Cerisier","Cèdre","Cocotier","Citronnier",1,"Cyprés",null,null,"xxxxxxxxxxxxxxx","xxxx","xxxx","xxxxxxxxxxxxxxx","xxxx","xxxx","xxxxxxxxxxxxxxx","xxxx","xxxx"]
[]
{"$rows_left_out":1592}
{"sheet":"Feuil2","index":3,"n_rows":9,"n_cols":21,"rows_kept":9,"cut":false,"hidden":false,"merged":[]}
["Date","Code","Chou","Asperge","Courge","Artichaut","Aubergine","Brocoli","Celeri","Truc1","Vitre1","Cresson","Truc2","Vitre2","Endive","Truc3","Vitre3","Fenouil","truc4","Vitre4","Observation(s) "]
[{"$f":"_xlfn.AGGREGATE(14,6,(chene!$A$2:$A$19/(chene!$C$2:$C$19=B2)),1)","v":"2020-01-09"},110,0,"Kiwi","Prune","Raisin","Tomate",2,"Pamplemousse",null,null,"Kaki",null,null,"xxxxxxxxxxxxxxx","xxxx","xxxx","xxxxxxxxxxxxxxx","xxxx","xxxx",{"$f":"IFERROR(INDEX(TblJaugeage[Observations],MATCH(1,((Ail=$B2)*(TblJaugeage[Date]=_xlfn.MAXIFS(TblJaugeage[Date],Ail,$B2,TblJaugeage[Observations],\"<>0\"))),0)),\"Aucunes\")","v":"fhdy"}]
[{"$f":"_xlfn.AGGREGATE(14,6,(chene!$A$2:$A$19/(chene!$C$2:$C$19=B3)),1)","v":"2018-04-15"},120,0,"Litchi","Poire","Prune","Quetsche",1,"Tomate charnue",null,null,"xxxxxxxxxxxxxxx","xxxx","xxxx","xxxxxxxxxxxxxxx","xxxx","xxxx","xxxxxxxxxxxxxxx","xxxx","xxxx",{"$f":"IFERROR(INDEX(TblJaugeage[Observations],MATCH(1,((Ail=$B3)*(TblJaugeage[Date]=_xlfn.MAXIFS(TblJaugeage[Date],Ail,$B3,TblJaugeage[Observations],\"<>0\"))),0)),\"Aucunes\")","v":"hhhhh"}]
[{"$f":"_xlfn.AGGREGATE(14,6,(chene!$A$2:$A$19/(chene!$C$2:$C$19=B4)),1)","v":"2017-12-31"},130,0,"Mûre","Melon","Papaye","Pastéque",1,"Orange sanguine",null,null,"xxxxxxxxxxxxxxx","xxxx","xxxx","xxxxxxxxxxxxxxx","xxxx","xxxx","xxxxxxxxxxxxxxx","xxxx","xxxx",{"$f":"IFERROR(INDEX(TblJaugeage[Observations],MATCH(1,((Ail=$B4)*(TblJaugeage[Date]=_xlfn.MAXIFS(TblJaugeage[Date],Ail,$B4,TblJaugeage[Observations],\"<>0\"))),0)),\"Aucunes\")","v":"Aucunes"}]
[{"$f":"_xlfn.AGGREGATE(14,6,(chene!$A$2:$A$19/(chene!$C$2:$C$19=B5)),1)","v":"2016-06-24"},140,0,"Noix","Marron","Noisette","Figue",1,"xxxxxxxxxxxxxxx","xxxx","xxxx","Kumquat",null,null,"xxxxxxxxxxxxxxx","xxxx","xxxx","xxxxxxxxxxxxxxx","xxxx","xxxx",{"$f":"IFERROR(INDEX(TblJaugeage[Observations],MATCH(1,((Ail=$B5)*(TblJaugeage[Date]=_xlfn.MAXIFS(TblJaugeage[Date],Ail,$B5,TblJaugeage[Observations],\"<>0\"))),0)),\"Aucunes\")","v":"erery"}]
[{"$f":"_xlfn.AGGREGATE(14,6,(chene!$A$2:$A$19/(chene!$C$2:$C$19=B6)),1)","v":"2017-08-17"},150,0,"Pêche","orange","Groseille","Nectarine",1,"Myrtille",null,null,"xxxxxxxxxxxxxxx","xxxx","xxxx","xxxxxxxxxxxxxxx","xxxx","xxxx","xxxxxxxxxxxxxxx","xxxx","xxxx",{"$f":"IFERROR(INDEX(TblJaugeage[Observations],MATCH(1,((Ail=$B6)*(TblJaugeage[Date]=_xlfn.MAXIFS(TblJaugeage[Date],Ail,$B6,TblJaugeage[Observations],\"<>0\"))),0)),\"Aucunes\")","v":"yuuy"}]
[{"$f":"_xlfn.AGGREGATE(14,6,(chene!$A$2:$A$19/(chene!$C$2:$C$19=B7)),1)","v":"2017-02-03"},160,0,"Litchi","Poire","Abricotier","Acacia",2,"Ademia",null,null,"Amandier",null,null,"xxxxxxxxxxxxxxx","xxxx","xxxx","xxxxxxxxxxxxxxx","xxxx","xxxx",{"$f":"IFERROR(INDEX(TblJaugeage[Observations],MATCH(1,((Ail=$B7)*(TblJaugeage[Date]=_xlfn.MAXIFS(TblJaugeage[Date],Ail,$B7,TblJaugeage[Observations],\"<>0\"))),0)),\"Aucunes\")","v":"dqsdaze"}]
[{"$f":"_xlfn.AGGREGATE(14,6,(chene!$A$2:$A$19/(chene!$C$2:$C$19=B8)),1)","v":"2018-03-01"},170,0,"Arbousier","Aulme","Cactus","Buis",1,"xxxxxxxxxxxxxxx","xxxx","xxxx","Cafetier",null,null,"xxxxxxxxxxxxxxx","xxxx","xxxx","xxxxxxxxxxxxxxx","xxxx","xxxx",{"$f":"IFERROR(INDEX(TblJaugeage[Observations],MATCH(1,((Ail=$B8)*(TblJaugeage[Date]=_xlfn.MAXIFS(TblJaugeage[Date],Ail,$B8,TblJaugeage[Observations],\"<>0\"))),0)),\"Aucunes\")","v":"kkkk"}]
[{"$f":"_xlfn.AGGREGATE(14,6,(chene!$A$2:$A$19/(chene!$C$2:$C$19=B9)),1)","v":"2018-04-03"},180,0,"Cerisier","Cèdre","Cocotier","Citronnier",1,"Cyprés",null,null,"xxxxxxxxxxxxxxx","xxxx","xxxx","xxxxxxxxxxxxxxx","xxxx","xxxx","xxxxxxxxxxxxxxx","xxxx","xxxx",{"$f":"IFERROR(INDEX(TblJaugeage[Observations],MATCH(1,((Ail=$B9)*(TblJaugeage[Date]=_xlfn.MAXIFS(TblJaugeage[Date],Ail,$B9,TblJaugeage[Observations],\"<>0\"))),0)),\"Aucunes\")","v":"Aucunes"}]

{"sheet":"Listesdéroulante","index":4,"n_rows":9,"n_cols":3,"rows_kept":9,"cut":false,"hidden":true,"merged":[]}
["Météo",null,"Secteurs"]
["Couvert",null,411]
["Froid",null,412]
["Grêle",null,421]
["Neige"]
["Pluie"]
["Sécheresse"]
["Soleil"]
["Vent chaud"]