{"text_format":"1","workbook":"xlsx","n_sheets":15,"sheets":["List","Relevé du jour","Feuille Max Mini","Feuille Tri des relevés","Relevés","Récape annuelle","Juillet 17","Aout 17","Septembre 17","Octobre 17","Novembre 17","Décembre 17","Janvier 18","Février 18","Mars 18"],"not_rendered":{"charts":0,"images":32,"macros":1,"external_links":0,"defined_names":1,"comments":10,"pivot_tables":0},"unopened":[],"bounds":{"document_bytes":16777216,"sheet_cells":100000,"rows_first":2000,"rows_last":500,"rows_between":2000,"halvings":0,"cell_chars":16384,"cell_head_chars":4096},"cells_cut":0,"cells_raw":0,"read":"whole","date_system":"1900"}

{"sheet":"List","index":0,"n_rows":29,"n_cols":5,"rows_kept":29,"cut":false,"hidden":false,"merged":[]}
[]
[]
[null,1,{"$f":"\"List!\"&ADDRESS(ROW(C3),COLUMN(D3))","v":"List!$D$3"},null,"Ciel dégagé"]
[null,2,{"$f":"\"List!\"&ADDRESS(ROW(C4),COLUMN(D4))","v":"List!$D$4"},null,"Ciel voilé"]
[null,3,"List!$D$5",null,"Rares éclaircies"]
[null,4,"List!$D$6",null,"Soleil nuageux et averses"]
[null,5,"List!$D$7",null,"Variable"]
[null,6,"List!$D$8",null,"Nuageux avec éclaircies"]
[null,7,"List!$D$9",null,"Brouillard dense"]
[null,8,"List!$D$10",null,"Brume ou brouillard légé"]
[null,9,"List!$D$11",null,"Brume ou léger brouillard givrant"]
[null,10,"List!$D$12",null,"Nuageux"]
[null,11,"List!$D$13",null,"Couvert"]
[null,12,"List!$D$14",null,"Couvert rares averses"]
[null,13,"List!$D$15",null,"Pluies et éclaircies"]
[null,14,"List!$D$16",null,"Pluies éparses"]
[null,15,"List!$D$17",null,"Bruines"]
[null,16,"List!$D$18",null,"Averses ou fortes pluies"]
[null,17,"List!$D$19",null,"Pluies mêlées de neiges"]
[null,18,"List!$D$20",null,"Soleil , orage"]
[null,19,"List!$D$21",null,"Soleil averses orageuses"]
[null,20,"List!$D$22",null,"Pluies orageuses"]
[null,21,"List!$D$23",null,"Orages"]
[null,22,"List!$D$24",null,"Orages et grèles"]
[null,23,"List!$D$25",null,"Orages violents"]
[null,24,"List!$D$26",null,"Giboulées"]
[null,25,"List!$D$27",null,"Grèles"]
[null,26,"List!$D$28",null,"Neiges"]
[null,27,"List!$D$29",null,"Fortes neiges"]

{"sheet":"Relevé du jour","index":1,"n_rows":429,"n_cols":23,"rows_kept":429,"cut":false,"hidden":false,"merged":[[3,11,3,12]]}
[]
[]
[]
["NO,","Heure","Intervalle","T° int.    (°C)","Hum int.  (%)","T° ext.    (°C)","Hum ext.  (%)","Press. rel.  (hpa)","Press. abs.  (hpa)","Vit. du vent(km/h)","Rafale          (km/h)","Direction du vent",null,"Pt. de rosée(°C)","Facteur vent(°C)","Précipi. dern. 24 h(mm)","Précipi.s de la sem.   (mm)","Précipi. du mois     (mm)","Précipi. An     (mm)","Précipi. totale      (mm)","Lumière (W/M2)","UV     (uW/m2)","UVI"]
[{"$f":"IF(B5=\"\",\"\",1)","v":1}," 06/04/2018 00:01:29"," 5 M"," 22.5",49," 4.8",82," 1011.3"," 1024.9"," 1.1"," 1.1",45," 2.0"," 4.8"," 0.0"," 29.7"," 29.7"," 274.8"," 694.8"," 0.09",0,0]
[{"$f":"IF(B6=\"\",\"\",1)","v":1}," 06/04/2018 00:06:29"," 5 M"," 22.5",49," 4.6",81," 1011.2"," 1024.8"," 0.0"," 0.0",45," 1.6"," 4.6"," 0.0"," 29.7"," 29.7"," 274.8"," 694.8"," 0.09",0,0]
[1," 06/04/2018 00:11:29"," 5 M"," 22.4",49," 4.4",81," 1011.3"," 1024.9"," 0.0"," 0.0",45," 1.4"," 4.4"," 0.0"," 29.7"," 29.7"," 274.8"," 694.8"," 0.00",0,0]
[1," 06/04/2018 00:16:29"," 5 M"," 22.4",49," 4.4",82," 1011.4"," 1025.0"," 0.0"," 0.0",90," 1.6"," 4.4"," 0.0"," 29.7"," 29.7"," 274.8"," 694.8"," 0.09",0,0]
[1," 06/04/2018 00:21:29"," 5 M"," 22.3",49," 4.4",82," 1011.5"," 1025.1"," 0.0"," 0.0",90," 1.6"," 4.4"," 0.0"," 29.7"," 29.7"," 274.8"," 694.8"," 0.00",0,0]
[1," 06/04/2018 00:26:29"," 5 M"," 22.3",49," 4.3",82," 1011.3"," 1024.9"," 0.0"," 0.0",45," 1.5"," 4.3"," 0.0"," 29.7"," 29.7"," 274.8"," 694.8"," 0.09",0,0]
[1," 06/04/2018 00:31:29"," 5 M"," 22.3",49," 4.1",82," 1011.3"," 1024.9"," 0.0"," 0.0",45," 1.3"," 4.1"," 0.0"," 29.7"," 29.7"," 274.8"," 694.8"," 0.00",0,0]
[1," 06/04/2018 00:36:29"," 5 M"," 22.3",49," 4.0",82," 1011.2"," 1024.8"," 0.0"," 0.0",45," 1.2"," 4.0"," 0.0"," 29.7"," 29.7"," 274.8"," 694.8"," 0.09",0,0]
[1," 06/04/2018 00:41:29"," 5 M"," 22.3",49," 3.9",82," 1011.3"," 1024.9"," 0.0"," 0.0",90," 1.1"," 3.9"," 0.0"," 29.7"," 29.7"," 274.8"," 694.8"," 0.00",0,0]
[1," 06/04/2018 00:46:29"," 5 M"," 22.3",49," 3.8",82," 1011.2"," 1024.8"," 0.0"," 0.0",90," 1.0"," 3.8"," 0.0"," 29.7"," 29.7"," 274.8"," 694.8"," 0.09",0,0]
[1," 06/04/2018 00:51:29"," 5 M"," 22.2",49," 3.9",82," 1011.2"," 1024.8"," 0.0"," 1.1",90," 1.1"," 3.9"," 0.0"," 29.7"," 29.7"," 274.8"," 694.8"," 0.00",0,0]
[1," 06/04/2018 00:56:29"," 5 M"," 22.2",49," 3.9",82," 1011.1"," 1024.7"," 0.0"," 0.0",45," 1.1"," 3.9"," 0.0"," 29.7"," 29.7"," 274.8"," 694.8"," 0.09",0,0]
[1," 06/04/2018 01:01:29"," 5 M"," 22.2",49," 3.9",82," 1011.2"," 1024.8"," 0.0"," 0.0",45," 1.1"," 3.9"," 0.0"," 29.7"," 29.7"," 274.8"," 694.8"," 0.00",0,0]
[1," 06/04/2018 01:06:29"," 5 M"," 22.2",49," 3.9",83," 1011.0"," 1024.6"," 0.0"," 0.0",90," 1.3"," 3.9"," 0.0"," 29.7"," 29.7"," 274.8"," 694.8"," 0.09",0,0]
[1," 06/04/2018 01:11:29"," 5 M"," 22.2",49," 4.0",83," 1010.9"," 1024.5"," 0.0"," 0.0",90," 1.4"," 4.0"," 0.0"," 29.7"," 29.7"," 274.8"," 694.8"," 0.00",0,0]
[1," 06/04/2018 01:16:29"," 5 M"," 22.2",49," 4.4",84," 1010.5"," 1024.1"," 0.0"," 0.0",90," 1.9"," 4.4"," 0.0"," 29.7"," 29.7"," 274.8"," 694.8"," 0.00",0,0]
[1," 06/04/2018 01:21:29"," 5 M"," 22.2",49," 4.7",84," 1010.6"," 1024.2"," 0.0"," 0.0",45," 2.2"," 4.7"," 0.0"," 29.7"," 29.7"," 274.8"," 694.8"," 0.09",0,0]
[1," 06/04/2018 01:26:29"," 5 M"," 22.2",49," 4.8",85," 1010.6"," 1024.2"," 0.0"," 1.1",90," 2.5"," 4.8"," 0.0"," 29.7"," 29.7"," 274.8"," 694.8"," 0.00",0,0]
[1," 06/04/2018 01:31:29"," 5 M"," 22.1",49," 4.7",85," 1010.6"," 1024.2"," 0.0"," 1.1",90," 2.4"," 4.7"," 0.0"," 29.7"," 29.7"," 274.8"," 694.8"," 0.09",0,0]
[1," 06/04/2018 01:36:29"," 5 M"," 22.1",49," 4.7",85," 1010.6"," 1024.2"," 0.0"," 1.1",45," 2.4"," 4.7"," 0.0"," 29.7"," 29.7"," 274.8"," 694.8"," 0.00",0,0]
[1," 06/04/2018 01:41:29"," 5 M"," 22.1",49," 4.8",85," 1010.4"," 1024.0"," 0.0"," 0.0",90," 2.5"," 4.8"," 0.0"," 29.7"," 29.7"," 274.8"," 694.8"," 0.05",0,0]
[1," 06/04/2018 01:46:29"," 5 M"," 22.1",49," 4.6",84," 1010.5"," 1024.1"," 0.0"," 1.1",90," 2.1"," 4.6"," 0.0"," 29.7"," 29.7"," 274.8"," 694.8"," 0.00",0,0]
[1," 06/04/2018 01:51:29"," 5 M"," 22.0",49," 4.3",84," 1010.3"," 1023.9"," 0.0"," 1.1",90," 1.8"," 4.3"," 0.0"," 29.7"," 29.7"," 274.8"," 694.8"," 0.00",0,0]
[1," 06/04/2018 01:56:29"," 5 M"," 22.0",49," 4.2",84," 1010.2"," 1023.8"," 0.0"," 1.1",90," 1.7"," 4.2"," 0.0"," 29.7"," 29.7"," 274.8"," 694.8"," 0.09",0,0]
[1," 06/04/2018 02:01:29"," 5 M"," 22.0",49," 4.1",84," 1010.0"," 1023.6"," 0.0"," 1.1",90," 1.6"," 4.1"," 0.0"," 29.7"," 29.7"," 274.8"," 694.8"," 0.00",0,0]
[1," 06/04/2018 02:06:29"," 5 M"," 22.0",49," 4.0",83," 1010.1"," 1023.7"," 0.0"," 1.1",90," 1.4"," 4.0"," 0.0"," 29.7"," 29.7"," 274.8"," 694.8"," 0.05",0,0]
[1," 06/04/2018 02:11:29"," 5 M"," 22.0",49," 4.2",84," 1009.9"," 1023.5"," 0.0"," 0.0",90," 1.7"," 4.2"," 0.0"," 29.7"," 29.7"," 274.8"," 694.8"," 0.00",0,0]
[1," 06/04/2018 02:16:29"," 5 M"," 22.0",49," 4.2",84," 1010.0"," 1023.6"," 0.0"," 0.0",90," 1.7"," 4.2"," 0.0"," 29.7"," 29.7"," 274.8"," 694.8"," 0.00",0,0]
[1," 06/04/2018 02:21:29"," 5 M"," 22.0",49," 4.2",84," 1009.9"," 1023.5"," 0.0"," 0.0",90," 1.7"," 4.2"," 0.0"," 29.7"," 29.7"," 274.8"," 694.8"," 0.00",0,0]
[1," 06/04/2018 02:26:29"," 5 M"," 21.9",50," 3.7",83," 1009.7"," 1023.3"," 0.0"," 0.0",90," 1.1"," 3.7"," 0.0"," 29.7"," 29.7"," 274.8"," 694.8"," 0.05",0,0]
[1," 06/04/2018 02:31:29"," 5 M"," 21.9",50," 3.5",83," 1009.8"," 1023.4"," 0.0"," 0.0",90," 0.9"," 3.5"," 0.0"," 29.7"," 29.7"," 274.8"," 694.8"," 0.05",0,0]
[1," 06/04/2018 02:36:29"," 5 M"," 21.8",50," 3.2",82," 1009.6"," 1023.2"," 0.0"," 0.0",90," 0.4"," 3.2"," 0.0"," 29.7"," 29.7"," 274.8"," 694.8"," 0.09",0,0]
[1," 06/04/2018 02:41:29"," 5 M"," 21.8",50," 3.1",82," 1009.5"," 1023.1"," 0.0"," 0.0",90," 0.3"," 3.1"," 0.0"," 29.7"," 29.7"," 274.8"," 694.8"," 0.05",0,0]
[1," 06/04/2018 02:46:29"," 5 M"," 21.8",50," 3.1",82," 1009.4"," 1023.0"," 0.0"," 1.1",90," 0.3"," 3.1"," 0.0"," 29.7"," 29.7"," 274.8"," 694.8"," 0.09",0,0]
[1," 06/04/2018 02:51:29"," 5 M"," 21.8",50," 3.1",83," 1009.6"," 1023.2"," 0.0"," 1.1",90," 0.5"," 3.1"," 0.0"," 29.7"," 29.7"," 274.8"," 694.8"," 0.05",0,0]
[1," 06/04/2018 02:56:29"," 5 M"," 21.8",50," 3.7",83," 1009.3"," 1022.9"," 2.5"," 5.0",90," 1.1"," 3.7"," 0.0"," 29.7"," 29.7"," 274.8"," 694.8"," 0.00",0,0]
[1," 06/04/2018 03:01:29"," 5 M"," 21.8",50," 4.1",84," 1009.0"," 1022.6"," 0.0"," 1.1",90," 1.6"," 4.1"," 0.0"," 29.7"," 29.7"," 274.8"," 694.8"," 0.00",0,0]
[1," 06/04/2018 03:06:29"," 5 M"," 21.8",50," 4.3",84," 1009.1"," 1022.7"," 1.1"," 1.1",45," 1.8"," 4.3"," 0.0"," 29.7"," 29.7"," 274.8"," 694.8"," 0.00",0,0]
[1," 06/04/2018 03:11:29"," 5 M"," 21.8",50," 4.4",84," 1009.1"," 1022.7"," 0.0"," 1.1",90," 1.9"," 4.4"," 0.0"," 29.7"," 29.7"," 274.8"," 694.8"," 0.05",0,0]
[1," 06/04/2018 03:16:29"," 5 M"," 21.7",50," 4.9",85," 1008.8"," 1022.4"," 3.6"," 7.2",90," 2.6"," 4.9"," 0.0"," 29.7"," 29.7"," 274.8"," 694.8"," 0.00",0,0]
[1," 06/04/2018 03:21:29"," 5 M"," 21.7",50," 5.2",85," 1008.8"," 1022.4"," 7.2"," 9.7",135," 2.9"," 3.8"," 0.0"," 29.7"," 29.7"," 274.8"," 694.8"," 0.09",0,0]
[1," 06/04/2018 03:26:29"," 5 M"," 21.7",50," 5.3",85," 1008.6"," 1022.2"," 2.5"," 3.6",135," 3.0"," 5.3"," 0.0"," 29.7"," 29.7"," 274.8"," 694.8"," 0.00",0,0]
[1," 06/04/2018 03:31:29"," 5 M"," 21.7",50," 5.5",85," 1008.7"," 1022.3"," 0.0"," 1.1",90," 3.2"," 5.5"," 0.0"," 29.7"," 29.7"," 274.8"," 694.8"," 0.09",0,0]
[1," 06/04/2018 03:36:29"," 5 M"," 21.7",50," 5.5",85," 1008.6"," 1022.2"," 0.0"," 1.1",90," 3.2"," 5.5"," 0.0"," 29.7"," 29.7"," 274.8"," 694.8"," 0.00",0,0]
[1," 06/04/2018 03:41:29"," 5 M"," 21.7",50," 5.4",84," 1008.7"," 1022.3"," 0.0"," 1.1",45," 2.9"," 5.4"," 0.0"," 29.7"," 29.7"," 274.8"," 694.8"," 0.09",0,0]
[1," 06/04/2018 03:46:29"," 5 M"," 21.6",50," 5.5",83," 1008.4"," 1022.0"," 0.0"," 1.1",90," 2.9"," 5.5"," 0.0"," 29.7"," 29.7"," 274.8"," 694.8"," 0.00",0,0]
[1," 06/04/2018 03:51:29"," 5 M"," 21.6",50," 5.5",83," 1008.6"," 1022.2"," 0.0"," 1.1",90," 2.9"," 5.5"," 0.0"," 29.7"," 29.7"," 274.8"," 694.8"," 0.09",0,0]
[1," 06/04/2018 03:56:29"," 5 M"," 21.6",50," 5.7",82," 1008.7"," 1022.3"," 3.6"," 5.0",135," 2.9"," 5.7"," 0.0"," 29.7"," 29.7"," 274.8"," 694.8"," 0.00",0,0]
[1," 06/04/2018 04:01:29"," 5 M"," 21.6",50," 6.0",82," 1008.4"," 1022.0"," 2.5"," 3.6",135," 3.2"," 6.0"," 0.0"," 29.7"," 29.7"," 274.8"," 694.8"," 0.09",0,0]
[1," 06/04/2018 04:06:29"," 5 M"," 21.6",50," 6.1",82," 1008.4"," 1022.0"," 2.5"," 5.0",135," 3.3"," 6.1"," 0.0"," 29.7"," 29.7"," 274.8"," 694.8"," 0.00",0,0]
[1," 06/04/2018 04:11:29"," 5 M"," 21.6",50," 6.3",81," 1008.3"," 1021.9"," 3.6"," 5.0",180," 3.3"," 6.3"," 0.0"," 29.7"," 29.7"," 274.8"," 694.8"," 0.09",0,0]
[1," 06/04/2018 04:16:29"," 5 M"," 21.6",50," 6.4",80," 1008.4"," 1022.0"," 2.5"," 6.1",180," 3.2"," 6.4"," 0.0"," 29.7"," 29.7"," 274.8"," 694.8"," 0.00",0,0]
[1," 06/04/2018 04:21:29"," 5 M"," 21.6",50," 6.3",80," 1008.2"," 1021.8"," 3.6"," 5.0",23," 3.1"," 6.3"," 0.0"," 29.7"," 29.7"," 274.8"," 694.8"," 0.05",0,0]
[1," 06/04/2018 04:26:29"," 5 M"," 21.5",50," 6.4",80," 1008.3"," 1021.9"," 3.6"," 5.0",90," 3.2"," 6.4"," 0.0"," 29.7"," 29.7"," 274.8"," 694.8"," 0.00",0,0]
[1," 06/04/2018 04:31:29"," 5 M"," 21.5",50," 6.4",80," 1008.2"," 1021.8"," 2.5"," 3.6",135," 3.2"," 6.4"," 0.0"," 29.7"," 29.7"," 274.8"," 694.8"," 0.09",0,0]
[1," 06/04/2018 04:36:29"," 5 M"," 21.5",50," 6.3",80," 1008.1"," 1021.7"," 1.1"," 2.5",135," 3.1"," 6.3"," 0.0"," 29.7"," 29.7"," 274.8"," 694.8"," 0.00",0,0]
[1," 06/04/2018 04:41:29"," 5 M"," 21.5",50," 6.1",80," 1008.3"," 1021.9"," 2.5"," 3.6",45," 2.9"," 6.1"," 0.0"," 29.7"," 29.7"," 274.8"," 694.8"," 0.09",0,0]
[1," 06/04/2018 04:46:29"," 5 M"," 21.5",50," 6.0",80," 1008.0"," 1021.6"," 1.1"," 2.5",90," 2.8"," 6.0"," 0.0"," 29.7"," 29.7"," 274.8"," 694.8"," 0.00",0,0]
[1," 06/04/2018 04:51:29"," 5 M"," 21.5",50," 5.9",80," 1007.9"," 1021.5"," 1.1"," 2.5",90," 2.7"," 5.9"," 0.0"," 29.7"," 29.7"," 274.8"," 694.8"," 0.09",0,0]
[1," 06/04/2018 04:56:29"," 5 M"," 21.4",50," 5.8",80," 1008.1"," 1021.7"," 2.5"," 3.6",135," 2.6"," 5.8"," 0.0"," 29.7"," 29.7"," 274.8"," 694.8"," 0.00",0,0]
[1," 06/04/2018 05:01:29"," 5 M"," 21.3",50," 5.7",80," 1008.2"," 1021.8"," 1.1"," 2.5",90," 2.5"," 5.7"," 0.0"," 29.7"," 29.7"," 274.8"," 694.8"," 0.09",0,0]
[1," 06/04/2018 05:06:29"," 5 M"," 21.4",50," 5.6",80," 1007.9"," 1021.5"," 0.0"," 1.1",90," 2.4"," 5.6"," 0.0"," 29.7"," 29.7"," 274.8"," 694.8"," 0.00",0,0]
[1," 06/04/2018 05:11:29"," 5 M"," 21.3",50," 5.5",80," 1007.8"," 1021.4"," 5.0"," 6.1",90," 2.3"," 5.5"," 0.0"," 29.7"," 29.7"," 274.8"," 694.8"," 0.09",0,0]
[1," 06/04/2018 05:16:29"," 5 M"," 21.3",50," 5.6",80," 1007.7"," 1021.3"," 1.1"," 2.5",90," 2.4"," 5.6"," 0.0"," 29.7"," 29.7"," 274.8"," 694.8"," 0.00",0,0]
[1," 06/04/2018 05:21:29"," 5 M"," 21.4",50," 5.6",80," 1007.6"," 1021.2"," 1.1"," 2.5",45," 2.4"," 5.6"," 0.0"," 29.7"," 29.7"," 274.8"," 694.8"," 0.05",0,0]
[{"$f":"IF(B70=\"\",\"\",1)","v":1}," 06/04/2018 05:26:29"," 5 M"," 21.3",50," 5.6",80," 1007.6"," 1021.2"," 1.1"," 3.6",90," 2.4"," 5.6"," 0.0"," 29.7"," 29.7"," 274.8"," 694.8"," 0.00",0,0]
[1," 06/04/2018 05:31:29"," 5 M"," 21.4",50," 5.6",80," 1007.5"," 1021.1"," 0.0"," 1.1",90," 2.4"," 5.6"," 0.0"," 29.7"," 29.7"," 274.8"," 694.8"," 0.09",0,0]
[1," 06/04/2018 05:36:29"," 5 M"," 21.2",50," 5.4",80," 1007.6"," 1021.2"," 1.1"," 2.5",45," 2.2"," 5.4"," 0.0"," 29.7"," 29.7"," 274.8"," 694.8"," 0.00",0,0]
[1," 06/04/2018 05:41:29"," 5 M"," 21.2",50," 5.4",80," 1007.4"," 1021.0"," 0.0"," 1.1",90," 2.2"," 5.4"," 0.0"," 29.7"," 29.7"," 274.8"," 694.8"," 0.05",0,0]
[1," 06/04/2018 05:46:29"," 5 M"," 21.2",50," 5.3",80," 1007.6"," 1021.2"," 1.1"," 2.5",270," 2.1"," 5.3"," 0.0"," 29.7"," 29.7"," 274.8"," 694.8"," 0.00",0,0]
[1," 06/04/2018 05:51:29"," 5 M"," 21.2",50," 5.3",80," 1007.3"," 1020.9"," 1.1"," 2.5",90," 2.1"," 5.3"," 0.0"," 29.7"," 29.7"," 274.8"," 694.8"," 0.09",0,0]
[1," 06/04/2018 05:56:29"," 5 M"," 21.2",50," 5.3",80," 1007.5"," 1021.1"," 1.1"," 2.5",90," 2.1"," 5.3"," 0.0"," 29.7"," 29.7"," 274.8"," 694.8"," 0.00",0,0]
[1," 06/04/2018 06:01:29"," 5 M"," 21.2",50," 5.2",80," 1007.2"," 1020.8"," 1.1"," 2.5",90," 2.0"," 5.2"," 0.0"," 29.7"," 29.7"," 274.8"," 694.8"," 0.09",0,0]
[1," 06/04/2018 06:06:29"," 5 M"," 21.2",50," 5.2",80," 1007.0"," 1020.6"," 2.5"," 3.6",135," 2.0"," 5.2"," 0.0"," 29.7"," 29.7"," 274.8"," 694.8"," 0.00",0,0]
[1," 06/04/2018 06:11:29"," 5 M"," 21.2",50," 5.4",80," 1007.0"," 1020.6"," 2.5"," 3.6",135," 2.2"," 5.4"," 0.0"," 29.7"," 29.7"," 274.8"," 694.8"," 0.09",0,0]
[1," 06/04/2018 06:16:29"," 5 M"," 21.2",50," 5.4",81," 1006.9"," 1020.5"," 1.1"," 2.5",90," 2.4"," 5.4"," 0.0"," 29.7"," 29.7"," 274.8"," 694.8"," 0.00",0,0]
[1," 06/04/2018 06:21:29"," 5 M"," 21.1",50," 5.5",80," 1006.8"," 1020.4"," 3.6"," 5.0",135," 2.3"," 5.5"," 0.0"," 29.7"," 29.7"," 274.8"," 694.8"," 0.09",0,0]
[1," 06/04/2018 06:26:29"," 5 M"," 21.1",50," 5.6",80," 1006.8"," 1020.4"," 1.1"," 3.6",68," 2.4"," 5.6"," 0.0"," 29.7"," 29.7"," 274.8"," 694.8"," 0.00",0,0]
[1," 06/04/2018 06:31:29"," 5 M"," 21.0",50," 5.6",80," 1006.7"," 1020.3"," 5.0"," 7.2",90," 2.4"," 5.6"," 0.0"," 29.7"," 29.7"," 274.8"," 694.8"," 0.05",0,0]
[1," 06/04/2018 06:36:29"," 5 M"," 21.0",50," 5.7",80," 1006.7"," 1020.3"," 1.1"," 3.6",45," 2.5"," 5.7"," 0.0"," 29.7"," 29.7"," 274.8"," 694.8"," 0.00",0,0]
[1," 06/04/2018 06:41:29"," 5 M"," 21.0",50," 5.7",80," 1006.6"," 1020.2"," 3.6"," 5.0",45," 2.5"," 5.7"," 0.0"," 29.7"," 29.7"," 274.8"," 694.8"," 0.05",0,0]
[1," 06/04/2018 06:46:29"," 5 M"," 21.0",50," 5.7",80," 1006.5"," 1020.1"," 1.1"," 2.5",90," 2.5"," 5.7"," 0.0"," 29.7"," 29.7"," 274.8"," 694.8"," 0.00",0,0]
[1," 06/04/2018 06:51:29"," 5 M"," 21.0",50," 5.7",80," 1006.4"," 1020.0"," 1.1"," 2.5",90," 2.5"," 5.7"," 0.0"," 29.7"," 29.7"," 274.8"," 694.8"," 0.09",0,0]
[1," 06/04/2018 06:56:29"," 5 M"," 21.0",50," 5.7",80," 1006.4"," 1020.0"," 2.5"," 3.6",135," 2.5"," 5.7"," 0.0"," 29.7"," 29.7"," 274.8"," 694.8"," 0.00",0,0]
[1," 06/04/2018 07:01:29"," 5 M"," 21.0",50," 5.7",80," 1006.5"," 1020.1"," 0.0"," 1.1",90," 2.5"," 5.7"," 0.0"," 29.7"," 29.7"," 274.8"," 694.8"," 0.05",0,0]
[1," 06/04/2018 07:06:29"," 5 M"," 21.0",50," 5.6",80," 1006.4"," 1020.0"," 1.1"," 2.5",180," 2.4"," 5.6"," 0.0"," 29.7"," 29.7"," 274.8"," 694.8"," 0.00",0,0]
[1," 06/04/2018 07:11:29"," 5 M"," 21.0",50," 5.6",80," 1006.4"," 1020.0"," 0.0"," 1.1",90," 2.4"," 5.6"," 0.0"," 29.7"," 29.7"," 274.8"," 694.8"," 0.00",0,0]
[1," 06/04/2018 07:16:29"," 5 M"," 21.0",50," 5.5",80," 1006.3"," 1019.9"," 1.1"," 2.5",90," 2.3"," 5.5"," 0.0"," 29.7"," 29.7"," 274.8"," 694.8"," 0.09",0,0]
[1," 06/04/2018 07:21:29"," 5 M"," 20.9",51," 5.4",80," 1006.3"," 1019.9"," 1.1"," 3.6",90," 2.2"," 5.4"," 0.0"," 29.7"," 29.7"," 274.8"," 694.8"," 0.24",0,0]
[1," 06/04/2018 07:26:29"," 5 M"," 20.9",51," 5.5",80," 1006.1"," 1019.7"," 0.0"," 1.1",90," 2.3"," 5.5"," 0.0"," 29.7"," 29.7"," 274.8"," 694.8"," 0.47",0,0]
[1," 06/04/2018 07:31:29"," 5 M"," 20.9",51," 5.5",80," 1006.2"," 1019.8"," 2.5"," 3.6",90," 2.3"," 5.5"," 0.0"," 29.7"," 29.7"," 274.8"," 694.8"," 0.81",0,0]
[1," 06/04/2018 07:36:29"," 5 M"," 20.9",51," 5.4",80," 1006.1"," 1019.7"," 1.1"," 2.5",90," 2.2"," 5.4"," 0.0"," 29.7"," 29.7"," 274.8"," 694.8"," 1.18",0,0]
[1," 06/04/2018 07:41:29"," 5 M"," 20.9",51," 5.5",80," 1006.0"," 1019.6"," 2.5"," 5.0",90," 2.3"," 5.5"," 0.0"," 29.7"," 29.7"," 274.8"," 694.8"," 2.04",0,0]
[1," 06/04/2018 07:46:29"," 5 M"," 20.9",51," 5.5",80," 1005.9"," 1019.5"," 2.5"," 5.0",45," 2.3"," 5.5"," 0.0"," 29.7"," 29.7"," 274.8"," 694.8"," 3.55",0,0]
[1," 06/04/2018 07:51:29"," 5 M"," 20.9",51," 5.6",80," 1006.0"," 1019.6"," 5.0"," 7.2",45," 2.4"," 5.6"," 0.0"," 29.7"," 29.7"," 274.8"," 694.8"," 5.11",0,0]
[1," 06/04/2018 07:56:29"," 5 M"," 20.9",51," 5.8",80," 1006.0"," 1019.6"," 2.5"," 5.0",135," 2.6"," 5.8"," 0.0"," 29.7"," 29.7"," 274.8"," 694.8"," 7.25",0,0]
[1," 06/04/2018 08:01:29"," 5 M"," 20.9",51," 5.9",80," 1005.8"," 1019.4"," 3.6"," 5.0",90," 2.7"," 5.9"," 0.0"," 29.7"," 29.7"," 274.8"," 694.8"," 10.36",0,0]
[1," 06/04/2018 08:06:29"," 5 M"," 20.8",51," 6.0",80," 1005.9"," 1019.5"," 3.6"," 5.0",90," 2.8"," 6.0"," 0.0"," 29.7"," 29.7"," 274.8"," 694.8"," 14.11",99,1]
[1," 06/04/2018 08:11:29"," 5 M"," 20.8",51," 6.0",80," 1005.7"," 1019.3"," 1.1"," 2.5",68," 2.8"," 6.0"," 0.0"," 29.7"," 29.7"," 274.8"," 694.8"," 17.72",99,1]
[1," 06/04/2018 08:16:29"," 5 M"," 20.8",51," 6.2",80," 1005.7"," 1019.3"," 1.1"," 2.5",135," 3.0"," 6.2"," 0.0"," 29.7"," 29.7"," 274.8"," 694.8"," 22.38",99,1]
[1," 06/04/2018 08:21:29"," 5 M"," 20.8",51," 6.3",79," 1005.7"," 1019.3"," 3.6"," 6.1",90," 2.9"," 6.3"," 0.0"," 29.7"," 29.7"," 274.8"," 694.8"," 27.34",99,1]
[1," 06/04/2018 08:26:29"," 5 M"," 20.8",51," 6.4",79," 1005.7"," 1019.3"," 2.5"," 3.6",135," 3.0"," 6.4"," 0.0"," 29.7"," 29.7"," 274.8"," 694.8"," 33.74",99,1]
[1," 06/04/2018 08:31:29"," 5 M"," 20.8",51," 6.6",79," 1005.8"," 1019.4"," 2.5"," 5.0",180," 3.2"," 6.6"," 0.0"," 29.7"," 29.7"," 274.8"," 694.8"," 36.55",99,1]
[1," 06/04/2018 08:36:29"," 5 M"," 20.8",51," 6.8",78," 1005.7"," 1019.3"," 2.5"," 6.1",90," 3.2"," 6.8"," 0.0"," 29.7"," 29.7"," 274.8"," 694.8"," 43.44",99,1]
[1," 06/04/2018 08:41:29"," 5 M"," 20.8",51," 7.0",78," 1005.6"," 1019.2"," 3.6"," 5.0",90," 3.4"," 7.0"," 0.0"," 29.7"," 29.7"," 274.8"," 694.8"," 46.85",99,1]
[1," 06/04/2018 08:46:29"," 5 M"," 20.8",50," 7.1",78," 1005.5"," 1019.1"," 5.0"," 7.2",135," 3.5"," 7.1"," 0.0"," 29.7"," 29.7"," 274.8"," 694.8"," 49.01",99,1]
[1," 06/04/2018 08:51:29"," 5 M"," 20.8",50," 7.3",76," 1005.6"," 1019.2"," 9.7"," 15.8",180," 3.4"," 4.4"," 0.0"," 29.7"," 29.7"," 274.8"," 694.8"," 51.97",99,1]
[1," 06/04/2018 08:56:29"," 5 M"," 20.7",51," 7.4",76," 1005.9"," 1019.5"," 5.0"," 6.1",90," 3.5"," 7.4"," 0.0"," 29.7"," 29.7"," 274.8"," 694.8"," 58.52",99,1]
[1," 06/04/2018 09:01:29"," 5 M"," 20.7",50," 7.5",71," 1005.8"," 1019.4"," 3.6"," 5.0",180," 2.6"," 7.5"," 0.0"," 29.7"," 29.7"," 274.8"," 694.8"," 63.44",99,1]
[1," 06/04/2018 09:06:29"," 5 M"," 20.7",50," 7.6",70," 1006.2"," 1019.8"," 7.2"," 8.6",90," 2.5"," 6.4"," 0.0"," 29.7"," 29.7"," 274.8"," 694.8"," 68.60",99,1]
[1," 06/04/2018 09:11:29"," 5 M"," 20.7",50," 7.7",70," 1006.3"," 1019.9"," 6.1"," 9.7",180," 2.6"," 7.7"," 0.0"," 29.7"," 29.7"," 274.8"," 694.8"," 72.57",99,1]
[1," 06/04/2018 09:16:29"," 5 M"," 20.7",50," 7.9",70," 1006.4"," 1020.0"," 3.6"," 5.0",90," 2.8"," 7.9"," 0.0"," 29.7"," 29.7"," 274.8"," 694.8"," 74.58",540,2]
[1," 06/04/2018 09:21:29"," 5 M"," 20.7",50," 7.9",70," 1006.3"," 1019.9"," 5.0"," 7.2",45," 2.8"," 7.9"," 0.0"," 29.7"," 29.7"," 274.8"," 694.8"," 76.44",540,2]
[1," 06/04/2018 09:26:29"," 5 M"," 20.7",50," 8.0",70," 1006.3"," 1019.9"," 8.6"," 11.2",180," 2.9"," 5.8"," 0.0"," 29.7"," 29.7"," 274.8"," 694.8"," 89.33",540,2]
[1," 06/04/2018 09:31:29"," 5 M"," 20.7",50," 8.1",70," 1006.3"," 1019.9"," 1.1"," 2.5",315," 3.0"," 8.1"," 0.0"," 29.7"," 29.7"," 274.8"," 694.8"," 100.04",540,2]
[1," 06/04/2018 09:36:29"," 5 M"," 20.7",51," 8.3",70," 1006.1"," 1019.7"," 5.0"," 8.6",68," 3.2"," 8.3"," 0.0"," 29.7"," 29.7"," 274.8"," 694.8"," 98.88",540,2]
[1," 06/04/2018 09:41:29"," 5 M"," 20.6",51," 8.4",69," 1006.2"," 1019.8"," 3.6"," 5.0",90," 3.1"," 8.4"," 0.0"," 29.7"," 29.7"," 274.8"," 694.8"," 88.56",540,2]
[1," 06/04/2018 09:46:29"," 5 M"," 20.8",51," 8.4",69," 1006.2"," 1019.8"," 5.0"," 6.1",135," 3.1"," 8.4"," 0.0"," 29.7"," 29.7"," 274.8"," 694.8"," 92.46",540,2]
[1," 06/04/2018 09:51:29"," 5 M"," 20.9",51," 8.5",69," 1006.5"," 1020.1"," 7.2"," 9.7",180," 3.1"," 7.3"," 0.0"," 29.7"," 29.7"," 274.8"," 694.8"," 101.71",540,2]
[1," 06/04/2018 09:56:29"," 5 M"," 21.0",50," 8.5",68," 1006.2"," 1019.8"," 3.6"," 6.1",90," 2.9"," 8.5"," 0.0"," 29.7"," 29.7"," 274.8"," 694.8"," 108.55",540,2]
[1," 06/04/2018 10:01:29"," 5 M"," 20.9",51," 8.8",68," 1006.3"," 1019.9"," 5.0"," 7.2",135," 3.2"," 8.8"," 0.0"," 29.7"," 29.7"," 274.8"," 694.8"," 119.73",540,2]
[1," 06/04/2018 10:06:29"," 5 M"," 20.9",51," 8.9",67," 1006.2"," 1019.8"," 2.5"," 5.0",135," 3.1"," 8.9"," 0.0"," 29.7"," 29.7"," 274.8"," 694.8"," 108.78",540,2]
[1," 06/04/2018 10:11:29"," 5 M"," 20.9",51," 8.9",67," 1006.0"," 1019.6"," 5.0"," 9.7",23," 3.1"," 8.9"," 0.0"," 29.7"," 29.7"," 274.8"," 694.8"," 107.58",540,2]
[1," 06/04/2018 10:16:30"," 5 M"," 20.9",51," 9.0",67," 1006.2"," 1019.8"," 5.0"," 7.2",135," 3.2"," 9.0"," 0.0"," 29.7"," 29.7"," 274.8"," 694.8"," 96.95",540,2]
[1," 06/04/2018 10:21:30"," 5 M"," 20.9",51," 9.2",67," 1006.0"," 1019.6"," 1.1"," 2.5",45," 3.4"," 9.2"," 0.0"," 29.7"," 29.7"," 274.8"," 694.8"," 160.68",1000,3]
[1," 06/04/2018 10:26:30"," 5 M"," 20.9",51," 9.7",67," 1005.9"," 1019.5"," 1.1"," 2.5",135," 3.9"," 9.7"," 0.0"," 29.7"," 29.7"," 274.8"," 694.8"," 159.33",1000,3]
[1," 06/04/2018 10:31:30"," 5 M"," 20.9",51," 10.2",66," 1006.0"," 1019.6"," 5.0"," 7.2",180," 4.1"," 10.2"," 0.0"," 29.7"," 29.7"," 274.8"," 694.8"," 271.64",1000,3]
[1," 06/04/2018 10:36:30"," 5 M"," 20.8",51," 10.8",63," 1005.8"," 1019.4"," 3.6"," 6.1",90," 4.1"," 10.8"," 0.0"," 29.7"," 29.7"," 274.8"," 694.8"," 299.64",1400,4]
[1," 06/04/2018 10:41:30"," 5 M"," 20.8",51," 11.1",62," 1005.8"," 1019.4"," 6.1"," 8.6",135," 4.1"," 11.1"," 0.0"," 29.7"," 29.7"," 274.8"," 694.8"," 324.55",1400,4]
[{"$f":"IF(B134=\"\",\"\",1)","v":1}," 06/04/2018 10:46:30"," 5 M"," 20.8",51," 11.4",62," 1005.8"," 1019.4"," 7.2"," 12.2",135," 4.4"," 10.3"," 0.0"," 29.7"," 29.7"," 274.8"," 694.8"," 371.92",1400,4]
[1," 06/04/2018 10:51:30"," 5 M"," 20.8",51," 11.5",61," 1005.9"," 1019.5"," 3.6"," 6.1",45," 4.3"," 11.5"," 0.0"," 29.7"," 29.7"," 274.8"," 694.8"," 379.46",1400,4]
[1," 06/04/2018 10:56:30"," 5 M"," 20.8",51," 12.0",62," 1005.7"," 1019.3"," 3.6"," 7.2",180," 5.0"," 12.0"," 0.0"," 29.7"," 29.7"," 274.8"," 694.8"," 394.51",1400,4]
[1," 06/04/2018 11:01:30"," 5 M"," 20.8",51," 12.5",59," 1005.8"," 1019.4"," 7.2"," 11.2",90," 4.7"," 11.5"," 0.0"," 29.7"," 29.7"," 274.8"," 694.8"," 424.32",1400,4]
[1," 06/04/2018 11:06:30"," 5 M"," 20.8",51," 12.9",57," 1005.8"," 1019.4"," 5.0"," 6.1",158," 4.6"," 12.9"," 0.0"," 29.7"," 29.7"," 274.8"," 694.8"," 449.39",1400,4]
[1," 06/04/2018 11:11:30"," 5 M"," 20.8",51," 13.0",56," 1005.7"," 1019.3"," 7.2"," 14.8",135," 4.4"," 12.0"," 0.0"," 29.7"," 29.7"," 274.8"," 694.8"," 433.72",1400,4]
[1," 06/04/2018 11:16:30"," 5 M"," 20.8",51," 13.0",55," 1005.7"," 1019.3"," 7.2"," 11.2",135," 4.2"," 12.0"," 0.0"," 29.7"," 29.7"," 274.8"," 694.8"," 478.78",1400,4]
[1," 06/04/2018 11:21:30"," 5 M"," 20.8",51," 13.0",56," 1005.6"," 1019.2"," 9.7"," 12.2",225," 4.4"," 10.7"," 0.0"," 29.7"," 29.7"," 274.8"," 694.8"," 382.87",1400,4]
[1," 06/04/2018 11:26:30"," 5 M"," 20.8",50," 13.4",56," 1005.6"," 1019.2"," 6.1"," 8.6",135," 4.8"," 13.4"," 0.0"," 29.7"," 29.7"," 274.8"," 694.8"," 495.14",1843,5]
[1," 06/04/2018 11:31:30"," 5 M"," 20.8",50," 13.4",54," 1005.4"," 1019.0"," 7.2"," 9.7",180," 4.3"," 12.4"," 0.0"," 29.7"," 29.7"," 274.8"," 694.8"," 431.48",1400,4]
[1," 06/04/2018 11:36:30"," 5 M"," 20.8",50," 13.9",56," 1005.4"," 1019.0"," 6.1"," 7.2",135," 5.3"," 13.9"," 0.0"," 29.7"," 29.7"," 274.8"," 694.8"," 451.98",1400,4]
[1," 06/04/2018 11:41:30"," 5 M"," 20.8",50," 14.2",54," 1005.6"," 1019.2"," 8.6"," 12.2",135," 5.0"," 12.6"," 0.0"," 29.7"," 29.7"," 274.8"," 694.8"," 246.73",1400,4]
[1," 06/04/2018 11:46:30"," 5 M"," 20.8",50," 14.2",54," 1005.6"," 1019.2"," 11.2"," 14.8",158," 5.0"," 11.5"," 0.0"," 29.7"," 29.7"," 274.8"," 694.8"," 275.97",1400,4]
[1," 06/04/2018 11:51:30"," 5 M"," 20.8",50," 14.3",54," 1005.6"," 1019.2"," 12.2"," 15.8",180," 5.1"," 11.2"," 0.0"," 29.7"," 29.7"," 274.8"," 694.8"," 598.82",1843,5]
[1," 06/04/2018 11:56:30"," 5 M"," 20.9",50," 15.1",54," 1005.6"," 1019.2"," 5.0"," 8.6",180," 5.9"," 15.1"," 0.0"," 29.7"," 29.7"," 274.8"," 694.8"," 499.04",1843,5]
[1," 06/04/2018 12:01:30"," 5 M"," 21.0",49," 15.5",53," 1005.5"," 1019.1"," 9.7"," 12.2",135," 6.0"," 13.5"," 0.0"," 29.7"," 29.7"," 274.8"," 694.8"," 560.57",1843,5]
[1," 06/04/2018 12:06:30"," 5 M"," 21.0",49," 15.5",52," 1005.5"," 1019.1"," 18.4"," 23.4",180," 5.7"," 10.9"," 0.0"," 29.7"," 29.7"," 274.8"," 694.8"," 537.64",1843,5]
[1," 06/04/2018 12:11:30"," 5 M"," 21.1",49," 15.2",53," 1005.4"," 1019.0"," 11.2"," 15.8",180," 5.7"," 12.6"," 0.0"," 29.7"," 29.7"," 274.8"," 694.8"," 476.26",1843,5]
[1," 06/04/2018 12:16:30"," 5 M"," 21.0",49," 15.4",53," 1005.3"," 1018.9"," 12.2"," 14.8",180," 5.9"," 12.5"," 0.0"," 29.7"," 29.7"," 274.8"," 694.8"," 470.89",1843,5]
[1," 06/04/2018 12:21:30"," 5 M"," 21.0",49," 15.3",53," 1005.2"," 1018.8"," 13.3"," 17.3",180," 5.8"," 12.0"," 0.0"," 29.7"," 29.7"," 274.8"," 694.8"," 519.66",1843,5]
[1," 06/04/2018 12:26:30"," 5 M"," 21.0",49," 15.7",54," 1005.1"," 1018.7"," 13.3"," 18.4",180," 6.4"," 12.5"," 0.0"," 29.7"," 29.7"," 274.8"," 694.8"," 640.28",2292,6]
[1," 06/04/2018 12:31:30"," 5 M"," 21.0",49," 15.8",54," 1005.1"," 1018.7"," 12.2"," 15.8",180," 6.5"," 13.0"," 0.0"," 29.7"," 29.7"," 274.8"," 694.8"," 648.52",2292,6]
[1," 06/04/2018 12:36:30"," 5 M"," 21.0",50," 16.1",54," 1004.9"," 1018.5"," 17.3"," 20.9",135," 6.8"," 11.9"," 0.0"," 29.7"," 29.7"," 274.8"," 694.8"," 555.78",2292,6]
[1," 06/04/2018 12:41:30"," 5 M"," 21.0",50," 15.9",53," 1004.8"," 1018.4"," 13.3"," 17.3",180," 6.4"," 12.8"," 0.0"," 29.7"," 29.7"," 274.8"," 694.8"," 529.13",2292,6]
[1," 06/04/2018 12:46:30"," 5 M"," 21.0",50," 16.2",55," 1004.5"," 1018.1"," 11.2"," 14.8",180," 7.2"," 13.8"," 0.0"," 29.7"," 29.7"," 274.8"," 694.8"," 584.16",2292,6]
[1," 06/04/2018 12:51:30"," 5 M"," 21.1",50," 16.1",54," 1004.4"," 1018.0"," 12.2"," 17.3",135," 6.8"," 13.3"," 0.0"," 29.7"," 29.7"," 274.8"," 694.8"," 488.02",2292,6]
[1," 06/04/2018 12:56:30"," 5 M"," 21.1",50," 16.4",54," 1004.4"," 1018.0"," 8.6"," 13.3",180," 7.1"," 15.0"," 0.0"," 29.7"," 29.7"," 274.8"," 694.8"," 648.79",2292,6]
[1," 06/04/2018 13:01:30"," 5 M"," 21.1",50," 16.6",54," 1004.4"," 1018.0"," 15.8"," 18.4",90," 7.3"," 12.9"," 0.0"," 29.7"," 29.7"," 274.8"," 694.8"," 678.10",2734,7]
[1," 06/04/2018 13:06:30"," 5 M"," 21.1",50," 16.3",54," 1004.4"," 1018.0"," 12.2"," 17.3",180," 7.0"," 13.6"," 0.0"," 29.7"," 29.7"," 274.8"," 694.8"," 676.60",2734,7]
[1," 06/04/2018 13:11:30"," 5 M"," 21.1",50," 16.5",54," 1004.4"," 1018.0"," 14.8"," 18.4",180," 7.2"," 13.1"," 0.0"," 29.7"," 29.7"," 274.8"," 694.8"," 306.21",1843,5]
[1," 06/04/2018 13:16:30"," 5 M"," 21.1",50," 17.0",57," 1004.3"," 1017.9"," 13.3"," 18.4",180," 8.4"," 14.1"," 0.0"," 29.7"," 29.7"," 274.8"," 694.8"," 714.42",2734,7]
[1," 06/04/2018 13:21:30"," 5 M"," 21.3",50," 17.1",53," 1004.2"," 1017.8"," 9.7"," 14.8",180," 7.5"," 15.3"," 0.0"," 29.7"," 29.7"," 274.8"," 694.8"," 361.52",1843,5]
[1," 06/04/2018 13:26:30"," 5 M"," 21.4",50," 17.5",51," 1004.1"," 1017.7"," 11.2"," 13.3",180," 7.3"," 15.3"," 0.0"," 29.7"," 29.7"," 274.8"," 694.8"," 696.74",2734,7]
[1," 06/04/2018 13:31:30"," 5 M"," 21.5",50," 17.8",50," 1004.2"," 1017.8"," 11.2"," 14.8",158," 7.3"," 15.6"," 0.0"," 29.7"," 29.7"," 274.8"," 694.8"," 725.40",2734,7]
[1," 06/04/2018 13:36:30"," 5 M"," 21.6",51," 17.8",50," 1004.2"," 1017.8"," 8.6"," 12.2",180," 7.3"," 16.5"," 0.0"," 29.7"," 29.7"," 274.8"," 694.8"," 577.09",2292,6]
[1," 06/04/2018 13:41:30"," 5 M"," 21.6",51," 18.0",50," 1004.0"," 1017.6"," 12.2"," 14.8",158," 7.4"," 15.5"," 0.0"," 29.7"," 29.7"," 274.8"," 694.8"," 712.72",2734,7]
[1," 06/04/2018 13:46:30"," 5 M"," 21.7",51," 18.1",50," 1004.1"," 1017.7"," 18.4"," 22.0",180," 7.5"," 14.2"," 0.0"," 29.7"," 29.7"," 274.8"," 694.8"," 639.43",2734,7]
[1," 06/04/2018 13:51:30"," 5 M"," 21.8",51," 18.0",50," 1004.0"," 1017.6"," 12.2"," 15.8",180," 7.4"," 15.5"," 0.0"," 29.7"," 29.7"," 274.8"," 694.8"," 567.61",2292,6]
[1," 06/04/2018 13:56:30"," 5 M"," 21.9",51," 18.0",50," 1003.9"," 1017.5"," 12.2"," 15.8",180," 7.4"," 15.5"," 0.0"," 29.7"," 29.7"," 274.8"," 694.8"," 457.97",2292,6]
[1," 06/04/2018 14:01:30"," 5 M"," 21.8",51," 17.5",51," 1004.0"," 1017.6"," 13.3"," 22.0",158," 7.3"," 14.6"," 0.0"," 29.7"," 29.7"," 274.8"," 694.8"," 632.35",2734,7]
[1," 06/04/2018 14:06:30"," 5 M"," 22.0",50," 17.6",50," 1003.8"," 1017.4"," 12.2"," 17.3",180," 7.1"," 15.1"," 0.0"," 29.7"," 29.7"," 274.8"," 694.8"," 305.98",1400,4]
[1," 06/04/2018 14:11:30"," 5 M"," 22.0",50," 17.7",52," 1003.8"," 1017.4"," 11.2"," 13.3",180," 7.7"," 15.5"," 0.0"," 29.7"," 29.7"," 274.8"," 694.8"," 610.46",2734,7]
[1," 06/04/2018 14:16:30"," 5 M"," 21.8",50," 18.2",51," 1003.8"," 1017.4"," 9.7"," 12.2",135," 7.9"," 16.5"," 0.0"," 29.7"," 29.7"," 274.8"," 694.8"," 640.74",2734,7]
[1," 06/04/2018 14:21:30"," 5 M"," 21.7",50," 18.4",50," 1003.8"," 1017.4"," 6.1"," 8.6",180," 7.8"," 18.4"," 0.0"," 29.7"," 29.7"," 274.8"," 694.8"," 640.82",2734,7]
[1," 06/04/2018 14:26:30"," 5 M"," 21.6",50," 18.3",50," 1003.8"," 1017.4"," 12.2"," 13.3",270," 7.7"," 15.9"," 0.0"," 29.7"," 29.7"," 274.8"," 694.8"," 213.28",1400,4]
[1," 06/04/2018 14:31:30"," 5 M"," 21.6",50," 18.2",51," 1003.7"," 1017.3"," 9.7"," 12.2",158," 7.9"," 16.5"," 0.0"," 29.7"," 29.7"," 274.8"," 694.8"," 588.50",2292,6]
[1," 06/04/2018 14:36:30"," 5 M"," 21.5",50," 18.6",52," 1003.7"," 1017.3"," 11.2"," 14.8",180," 8.6"," 16.5"," 0.0"," 29.7"," 29.7"," 274.8"," 694.8"," 509.56",2292,6]
[1," 06/04/2018 14:41:30"," 5 M"," 21.5",50," 18.6",50," 1003.7"," 1017.3"," 8.6"," 11.2",180," 8.0"," 17.3"," 0.0"," 29.7"," 29.7"," 274.8"," 694.8"," 485.39",2292,6]
[1," 06/04/2018 14:46:30"," 5 M"," 21.4",50," 18.8",50," 1003.5"," 1017.1"," 9.7"," 13.3",225," 8.2"," 17.2"," 0.0"," 29.7"," 29.7"," 274.8"," 694.8"," 577.98",2292,6]
[1," 06/04/2018 14:51:30"," 5 M"," 21.4",50," 19.2",49," 1003.4"," 1017.0"," 7.2"," 9.7",68," 8.3"," 18.5"," 0.0"," 29.7"," 29.7"," 274.8"," 694.8"," 607.21",2292,6]
[1," 06/04/2018 14:56:30"," 5 M"," 21.4",50," 19.7",49," 1003.5"," 1017.1"," 12.2"," 15.8",158," 8.7"," 17.5"," 0.0"," 29.7"," 29.7"," 274.8"," 694.8"," 656.64",2734,7]
[1," 06/04/2018 15:01:30"," 5 M"," 21.4",50," 19.7",47," 1003.3"," 1016.9"," 2.5"," 3.6",90," 8.1"," 19.7"," 0.0"," 29.7"," 29.7"," 274.8"," 694.8"," 601.45",2292,6]
[1," 06/04/2018 15:06:30"," 5 M"," 21.4",49," 19.6",49," 1003.4"," 1017.0"," 9.7"," 12.2",158," 8.6"," 18.1"," 0.0"," 29.7"," 29.7"," 274.8"," 694.8"," 611.24",2292,6]
[1," 06/04/2018 15:11:30"," 5 M"," 21.4",49," 20.0",47," 1003.4"," 1017.0"," 7.2"," 9.7",135," 8.4"," 19.4"," 0.0"," 29.7"," 29.7"," 274.8"," 694.8"," 627.17",2292,6]
[1," 06/04/2018 15:16:30"," 5 M"," 21.3",49," 20.3",47," 1003.2"," 1016.8"," 8.6"," 14.8",180," 8.6"," 19.2"," 0.0"," 29.7"," 29.7"," 274.8"," 694.8"," 591.13",2292,6]
[1," 06/04/2018 15:21:30"," 5 M"," 21.4",49," 20.1",45," 1003.3"," 1016.9"," 9.7"," 12.2",158," 7.8"," 18.6"," 0.0"," 29.7"," 29.7"," 274.8"," 694.8"," 572.64",2292,6]
[1," 06/04/2018 15:26:30"," 5 M"," 21.5",50," 20.1",47," 1003.2"," 1016.8"," 11.2"," 14.8",203," 8.5"," 18.2"," 0.0"," 29.7"," 29.7"," 274.8"," 694.8"," 497.81",1843,5]
[1," 06/04/2018 15:31:30"," 5 M"," 21.6",50," 19.9",47," 1003.1"," 1016.7"," 7.2"," 8.6",180," 8.3"," 19.3"," 0.0"," 29.7"," 29.7"," 274.8"," 694.8"," 501.29",1843,5]
[1," 06/04/2018 15:36:30"," 5 M"," 21.6",50," 20.2",47," 1003.0"," 1016.6"," 11.2"," 13.3",135," 8.6"," 18.4"," 0.0"," 29.7"," 29.7"," 274.8"," 694.8"," 543.02",1843,5]
[1," 06/04/2018 15:41:30"," 5 M"," 21.7",50," 20.0",46," 1003.0"," 1016.6"," 8.6"," 11.2",180," 8.1"," 18.9"," 0.0"," 29.7"," 29.7"," 274.8"," 694.8"," 483.92",1843,5]
[1," 06/04/2018 15:46:30"," 5 M"," 21.8",50," 20.2",47," 1002.9"," 1016.5"," 3.6"," 5.0",180," 8.6"," 20.2"," 0.0"," 29.7"," 29.7"," 274.8"," 694.8"," 213.43",1400,4]
[1," 06/04/2018 15:51:30"," 5 M"," 21.9",50," 20.1",46," 1002.9"," 1016.5"," 5.0"," 6.1",180," 8.1"," 20.1"," 0.0"," 29.7"," 29.7"," 274.8"," 694.8"," 586.79",2292,6]
[1," 06/04/2018 15:56:30"," 5 M"," 21.9",50," 20.2",47," 1002.7"," 1016.3"," 9.7"," 12.2",180," 8.6"," 18.8"," 0.0"," 29.7"," 29.7"," 274.8"," 694.8"," 432.83",1843,5]
[1," 06/04/2018 16:01:30"," 5 M"," 21.8",50," 20.7",47," 1002.7"," 1016.3"," 5.0"," 9.7",135," 9.0"," 20.7"," 0.0"," 29.7"," 29.7"," 274.8"," 694.8"," 525.84",1843,5]
[{"$f":"IF(B198=\"\",\"\",1)","v":1}," 06/04/2018 16:06:30"," 5 M"," 21.8",50," 20.5",47," 1002.7"," 1016.3"," 9.7"," 13.3",180," 8.8"," 19.1"," 0.0"," 29.7"," 29.7"," 274.8"," 694.8"," 471.62",1843,5]
[1," 06/04/2018 16:11:30"," 5 M"," 21.8",50," 20.4",48," 1002.8"," 1016.4"," 11.2"," 14.8",135," 9.0"," 18.6"," 0.0"," 29.7"," 29.7"," 274.8"," 694.8"," 442.93",1843,5]
[1," 06/04/2018 16:16:30"," 5 M"," 21.7",50," 20.3",48," 1002.6"," 1016.2"," 12.2"," 14.8",68," 9.0"," 18.2"," 0.0"," 29.7"," 29.7"," 274.8"," 694.8"," 399.88",1400,4]
[1," 06/04/2018 16:21:30"," 5 M"," 21.7",50," 20.1",49," 1002.6"," 1016.2"," 6.1"," 8.6",135," 9.1"," 20.1"," 0.0"," 29.7"," 29.7"," 274.8"," 694.8"," 395.86",1400,4]
[1," 06/04/2018 16:26:30"," 5 M"," 21.7",50," 19.9",49," 1002.5"," 1016.1"," 7.2"," 8.6",180," 8.9"," 19.3"," 0.0"," 29.7"," 29.7"," 274.8"," 694.8"," 324.82",1400,4]
[1," 06/04/2018 16:31:30"," 5 M"," 21.7",50," 19.5",49," 1002.6"," 1016.2"," 8.6"," 11.2",180," 8.5"," 18.3"," 0.0"," 29.7"," 29.7"," 274.8"," 694.8"," 223.34",1400,4]
[1," 06/04/2018 16:36:30"," 5 M"," 21.6",50," 19.7",50," 1002.4"," 1016.0"," 2.5"," 3.6",45," 9.0"," 19.7"," 0.0"," 29.7"," 29.7"," 274.8"," 694.8"," 320.18",1400,4]
[1," 06/04/2018 16:41:30"," 5 M"," 21.6",50," 20.2",50," 1002.4"," 1016.0"," 5.0"," 6.1",135," 9.5"," 20.2"," 0.0"," 29.7"," 29.7"," 274.8"," 694.8"," 448.19",1843,5]
[1," 06/04/2018 16:46:30"," 5 M"," 21.6",50," 19.8",50," 1002.3"," 1015.9"," 11.2"," 13.3",180," 9.1"," 17.9"," 0.0"," 29.7"," 29.7"," 274.8"," 694.8"," 338.35",1400,4]
[1," 06/04/2018 16:51:30"," 5 M"," 21.6",50," 19.7",50," 1002.3"," 1015.9"," 8.6"," 12.2",180," 9.0"," 18.5"," 0.0"," 29.7"," 29.7"," 274.8"," 694.8"," 287.73",1400,4]
[1," 06/04/2018 16:56:30"," 5 M"," 21.6",50," 19.8",50," 1002.3"," 1015.9"," 7.2"," 11.2",135," 9.1"," 19.2"," 0.0"," 29.7"," 29.7"," 274.8"," 694.8"," 310.85",1400,4]
[1," 06/04/2018 17:01:30"," 5 M"," 21.6",50," 19.9",48," 1002.2"," 1015.8"," 8.6"," 12.2",225," 8.6"," 18.8"," 0.0"," 29.7"," 29.7"," 274.8"," 694.8"," 304.59",1400,4]
[1," 06/04/2018 17:06:30"," 5 M"," 21.5",50," 19.9",50," 1002.2"," 1015.8"," 8.6"," 11.2",180," 9.2"," 18.8"," 0.0"," 29.7"," 29.7"," 274.8"," 694.8"," 276.67",1400,4]
[1," 06/04/2018 17:11:30"," 5 M"," 21.5",50," 20.1",50," 1002.0"," 1015.6"," 3.6"," 6.1",68," 9.4"," 20.1"," 0.0"," 29.7"," 29.7"," 274.8"," 694.8"," 287.88",1400,4]
[1," 06/04/2018 17:16:30"," 5 M"," 21.5",50," 20.3",50," 1002.0"," 1015.6"," 5.0"," 6.1",225," 9.6"," 20.3"," 0.0"," 29.7"," 29.7"," 274.8"," 694.8"," 272.41",1000,3]
[1," 06/04/2018 17:21:30"," 5 M"," 21.5",50," 20.3",48," 1002.0"," 1015.6"," 8.6"," 11.2",180," 9.0"," 19.2"," 0.0"," 29.7"," 29.7"," 274.8"," 694.8"," 337.11",1400,4]
[1," 06/04/2018 17:26:30"," 5 M"," 21.5",50," 20.2",48," 1001.9"," 1015.5"," 11.2"," 12.2",180," 8.9"," 18.4"," 0.0"," 29.7"," 29.7"," 274.8"," 694.8"," 240.24",1000,3]
[1," 06/04/2018 17:31:30"," 5 M"," 21.5",50," 20.1",46," 1001.7"," 1015.3"," 6.1"," 7.2",180," 8.1"," 20.1"," 0.0"," 29.7"," 29.7"," 274.8"," 694.8"," 256.36",1000,3]
[1," 06/04/2018 17:36:30"," 5 M"," 21.5",50," 20.0",49," 1001.8"," 1015.4"," 5.0"," 6.1",135," 9.0"," 20.0"," 0.0"," 29.7"," 29.7"," 274.8"," 694.8"," 197.42",1000,3]
[1," 06/04/2018 17:41:30"," 5 M"," 21.5",50," 19.9",48," 1001.7"," 1015.3"," 6.1"," 8.6",180," 8.6"," 19.9"," 0.0"," 29.7"," 29.7"," 274.8"," 694.8"," 140.30",540,2]
[1," 06/04/2018 17:46:30"," 5 M"," 21.5",50," 19.7",49," 1001.8"," 1015.4"," 11.2"," 14.8",225," 8.7"," 17.8"," 0.0"," 29.7"," 29.7"," 274.8"," 694.8"," 165.01",540,2]
[1," 06/04/2018 17:51:30"," 5 M"," 21.5",50," 19.6",49," 1001.6"," 1015.2"," 2.5"," 3.6",180," 8.6"," 19.6"," 0.0"," 29.7"," 29.7"," 274.8"," 694.8"," 136.82",540,2]
[1," 06/04/2018 17:56:30"," 5 M"," 21.6",50," 19.6",48," 1001.7"," 1015.3"," 6.1"," 7.2",68," 8.3"," 19.6"," 0.0"," 29.7"," 29.7"," 274.8"," 694.8"," 148.42",540,2]
[1," 06/04/2018 18:01:30"," 5 M"," 21.6",51," 19.6",49," 1001.7"," 1015.3"," 6.1"," 7.2",158," 8.6"," 19.6"," 0.0"," 29.7"," 29.7"," 274.8"," 694.8"," 195.99",1000,3]
[1," 06/04/2018 18:06:30"," 5 M"," 21.7",51," 19.6",49," 1001.6"," 1015.2"," 3.6"," 6.1",180," 8.6"," 19.6"," 0.0"," 29.7"," 29.7"," 274.8"," 694.8"," 186.98",1000,3]
[1," 06/04/2018 18:11:30"," 5 M"," 21.9",51," 19.7",49," 1001.8"," 1015.4"," 7.2"," 11.2",158," 8.7"," 19.0"," 0.0"," 29.7"," 29.7"," 274.8"," 694.8"," 186.71",1000,3]
[1," 06/04/2018 18:16:30"," 5 M"," 22.1",50," 19.6",48," 1001.6"," 1015.2"," 3.6"," 6.1",180," 8.3"," 19.6"," 0.0"," 29.7"," 29.7"," 274.8"," 694.8"," 133.46",540,2]
[1," 06/04/2018 18:21:30"," 5 M"," 22.2",50," 19.5",47," 1001.7"," 1015.3"," 3.6"," 5.0",135," 7.9"," 19.5"," 0.0"," 29.7"," 29.7"," 274.8"," 694.8"," 120.77",540,2]
[1," 06/04/2018 18:26:30"," 5 M"," 22.3",50," 19.4",49," 1001.5"," 1015.1"," 2.5"," 5.0",180," 8.4"," 19.4"," 0.0"," 29.7"," 29.7"," 274.8"," 694.8"," 126.65",540,2]
[1," 06/04/2018 18:31:30"," 5 M"," 22.5",50," 19.5",50," 1001.6"," 1015.2"," 3.6"," 6.1",180," 8.8"," 19.5"," 0.0"," 29.7"," 29.7"," 274.8"," 694.8"," 159.10",540,2]
[1," 06/04/2018 18:36:30"," 5 M"," 22.6",50," 19.6",50," 1001.6"," 1015.2"," 3.6"," 5.0",135," 8.9"," 19.6"," 0.0"," 29.7"," 29.7"," 274.8"," 694.8"," 124.06",540,2]
[1," 06/04/2018 18:41:30"," 5 M"," 22.7",50," 19.5",50," 1001.5"," 1015.1"," 2.5"," 3.6",270," 8.8"," 19.5"," 0.0"," 29.7"," 29.7"," 274.8"," 694.8"," 110.76",540,2]
[1," 06/04/2018 18:46:30"," 5 M"," 23.0",52," 19.4",50," 1001.6"," 1015.2"," 5.0"," 7.2",180," 8.7"," 19.4"," 0.0"," 29.7"," 29.7"," 274.8"," 694.8"," 135.93",540,2]
[1," 06/04/2018 18:51:30"," 5 M"," 23.0",52," 19.2",51," 1001.5"," 1015.1"," 5.0"," 6.1",180," 8.8"," 19.2"," 0.0"," 29.7"," 29.7"," 274.8"," 694.8"," 122.09",540,2]
[1," 06/04/2018 18:56:30"," 5 M"," 23.2",52," 19.1",51," 1001.6"," 1015.2"," 5.0"," 6.1",135," 8.8"," 19.1"," 0.0"," 29.7"," 29.7"," 274.8"," 694.8"," 108.20",540,2]
[1," 06/04/2018 19:01:30"," 5 M"," 23.3",51," 19.1",51," 1001.6"," 1015.2"," 2.5"," 3.6",135," 8.8"," 19.1"," 0.0"," 29.7"," 29.7"," 274.8"," 694.8"," 97.26",540,2]
[1," 06/04/2018 19:06:30"," 5 M"," 23.5",51," 19.0",52," 1001.6"," 1015.2"," 5.0"," 6.1",180," 8.9"," 19.0"," 0.0"," 29.7"," 29.7"," 274.8"," 694.8"," 77.23",99,1]
[1," 06/04/2018 19:11:30"," 5 M"," 23.5",51," 18.8",52," 1001.5"," 1015.1"," 2.5"," 5.0",180," 8.8"," 18.8"," 0.0"," 29.7"," 29.7"," 274.8"," 694.8"," 81.32",99,1]
[1," 06/04/2018 19:16:30"," 5 M"," 23.6",51," 18.6",52," 1001.5"," 1015.1"," 5.0"," 6.1",203," 8.6"," 18.6"," 0.0"," 29.7"," 29.7"," 274.8"," 694.8"," 76.51",99,1]
[1," 06/04/2018 19:21:30"," 5 M"," 23.6",51," 18.5",53," 1001.6"," 1015.2"," 2.5"," 3.6",135," 8.8"," 18.5"," 0.0"," 29.7"," 29.7"," 274.8"," 694.8"," 71.93",99,1]
[1," 06/04/2018 19:26:30"," 5 M"," 23.7",51," 18.4",54," 1001.5"," 1015.1"," 2.5"," 3.6",180," 8.9"," 18.4"," 0.0"," 29.7"," 29.7"," 274.8"," 694.8"," 58.78",99,1]
[1," 06/04/2018 19:31:30"," 5 M"," 23.7",51," 18.2",54," 1001.5"," 1015.1"," 1.1"," 2.5",135," 8.8"," 18.2"," 0.0"," 29.7"," 29.7"," 274.8"," 694.8"," 53.48",99,1]
[1," 06/04/2018 19:36:30"," 5 M"," 23.8",52," 18.0",56," 1001.5"," 1015.1"," 2.5"," 3.6",135," 9.1"," 18.0"," 0.0"," 29.7"," 29.7"," 274.8"," 694.8"," 42.87",99,1]
[1," 06/04/2018 19:41:30"," 5 M"," 23.8",52," 17.8",56," 1001.6"," 1015.2"," 1.1"," 2.5",135," 8.9"," 17.8"," 0.0"," 29.7"," 29.7"," 274.8"," 694.8"," 57.72",99,1]
[1," 06/04/2018 19:46:30"," 5 M"," 23.9",52," 17.7",56," 1001.6"," 1015.2"," 1.1"," 1.1",135," 8.8"," 17.7"," 0.0"," 29.7"," 29.7"," 274.8"," 694.8"," 38.55",99,1]
[1," 06/04/2018 19:51:30"," 5 M"," 24.0",51," 17.6",56," 1001.8"," 1015.4"," 0.0"," 1.1",90," 8.7"," 17.6"," 0.0"," 29.7"," 29.7"," 274.8"," 694.8"," 28.70",99,1]
[1," 06/04/2018 19:56:30"," 5 M"," 24.0",51," 17.3",61," 1001.7"," 1015.3"," 0.0"," 1.1",135," 9.7"," 17.3"," 0.0"," 29.7"," 29.7"," 274.8"," 694.8"," 24.61",99,1]
[1," 06/04/2018 20:01:30"," 5 M"," 24.1",51," 17.1",61," 1001.7"," 1015.3"," 1.1"," 2.5",90," 9.5"," 17.1"," 0.0"," 29.7"," 29.7"," 274.8"," 694.8"," 25.94",99,1]
[1," 06/04/2018 20:06:30"," 5 M"," 24.1",51," 16.8",62," 1001.6"," 1015.2"," 0.0"," 1.1",90," 9.5"," 16.8"," 0.0"," 29.7"," 29.7"," 274.8"," 694.8"," 25.71",99,1]
[1," 06/04/2018 20:11:30"," 5 M"," 24.1",51," 16.5",63," 1001.5"," 1015.1"," 0.0"," 1.1",90," 9.5"," 16.5"," 0.0"," 29.7"," 29.7"," 274.8"," 694.8"," 20.94",99,1]
[1," 06/04/2018 20:16:30"," 5 M"," 24.2",51," 16.1",63," 1001.7"," 1015.3"," 1.1"," 2.5",135," 9.1"," 16.1"," 0.0"," 29.7"," 29.7"," 274.8"," 694.8"," 20.03",99,1]
[1," 06/04/2018 20:21:30"," 5 M"," 24.3",51," 15.8",64," 1001.5"," 1015.1"," 0.0"," 1.1",90," 9.0"," 15.8"," 0.0"," 29.7"," 29.7"," 274.8"," 694.8"," 18.82",99,1]
[1," 06/04/2018 20:26:30"," 5 M"," 24.3",51," 15.5",65," 1001.4"," 1015.0"," 0.0"," 1.1",90," 9.0"," 15.5"," 0.0"," 29.7"," 29.7"," 274.8"," 694.8"," 12.83",0,0]
[1," 06/04/2018 20:31:30"," 5 M"," 24.3",51," 15.2",65," 1001.3"," 1014.9"," 0.0"," 0.0",90," 8.7"," 15.2"," 0.0"," 29.7"," 29.7"," 274.8"," 694.8"," 9.16",0,0]
[1," 06/04/2018 20:36:30"," 5 M"," 24.3",51," 14.7",67," 1001.3"," 1014.9"," 0.0"," 0.0",90," 8.7"," 14.7"," 0.0"," 29.7"," 29.7"," 274.8"," 694.8"," 6.56",0,0]
[1," 06/04/2018 20:41:30"," 5 M"," 24.3",51," 14.4",68," 1001.3"," 1014.9"," 0.0"," 0.0",90," 8.6"," 14.4"," 0.0"," 29.7"," 29.7"," 274.8"," 694.8"," 3.98",0,0]
[1," 06/04/2018 20:46:30"," 5 M"," 24.3",51," 14.1",69," 1001.4"," 1015.0"," 0.0"," 0.0",90," 8.5"," 14.1"," 0.0"," 29.7"," 29.7"," 274.8"," 694.8"," 1.85",0,0]
[1," 06/04/2018 20:51:30"," 5 M"," 24.4",51," 13.8",70," 1001.6"," 1015.2"," 0.0"," 0.0",90," 8.4"," 13.8"," 0.0"," 29.7"," 29.7"," 274.8"," 694.8"," 0.90",0,0]
[1," 06/04/2018 20:56:30"," 5 M"," 24.5",51," 13.4",70," 1001.5"," 1015.1"," 0.0"," 0.0",90," 8.1"," 13.4"," 0.0"," 29.7"," 29.7"," 274.8"," 694.8"," 0.76",0,0]
[1," 06/04/2018 21:01:30"," 5 M"," 24.7",51," 13.1",70," 1001.7"," 1015.3"," 0.0"," 0.0",90," 7.8"," 13.1"," 0.0"," 29.7"," 29.7"," 274.8"," 694.8"," 0.52",0,0]
[1," 06/04/2018 21:06:30"," 5 M"," 24.7",52," 12.8",70," 1001.7"," 1015.3"," 0.0"," 0.0",90," 7.5"," 12.8"," 0.0"," 29.7"," 29.7"," 274.8"," 694.8"," 0.24",0,0]
[1," 06/04/2018 21:11:30"," 5 M"," 24.9",52," 12.6",71," 1001.6"," 1015.2"," 0.0"," 0.0",90," 7.5"," 12.6"," 0.0"," 29.7"," 29.7"," 274.8"," 694.8"," 0.14",0,0]
[1," 06/04/2018 21:16:30"," 5 M"," 24.9",52," 12.3",73," 1001.9"," 1015.5"," 0.0"," 0.0",90," 7.6"," 12.3"," 0.0"," 29.7"," 29.7"," 274.8"," 694.8"," 0.09",0,0]
[1," 06/04/2018 21:21:30"," 5 M"," 25.0",51," 12.0",73," 1001.9"," 1015.5"," 0.0"," 0.0",90," 7.3"," 12.0"," 0.0"," 29.7"," 29.7"," 274.8"," 694.8"," 0.19",0,0]
[{"$f":"IF(B262=\"\",\"\",1)","v":1}," 06/04/2018 21:26:30"," 5 M"," 25.0",51," 11.7",73," 1001.8"," 1015.4"," 0.0"," 0.0",90," 7.0"," 11.7"," 0.0"," 29.7"," 29.7"," 274.8"," 694.8"," 0.09",0,0]
[1," 06/04/2018 21:31:30"," 5 M"," 25.0",51," 11.3",74," 1001.8"," 1015.4"," 0.0"," 0.0",90," 6.8"," 11.3"," 0.0"," 29.7"," 29.7"," 274.8"," 694.8"," 0.14",0,0]
[1," 06/04/2018 21:36:30"," 5 M"," 25.0",51," 11.1",75," 1001.9"," 1015.5"," 1.1"," 2.5",135," 6.9"," 11.1"," 0.0"," 29.7"," 29.7"," 274.8"," 694.8"," 0.09",0,0]
[1," 06/04/2018 21:41:30"," 5 M"," 25.0",51," 10.9",76," 1002.0"," 1015.6"," 0.0"," 1.1",90," 6.9"," 10.9"," 0.0"," 29.7"," 29.7"," 274.8"," 694.8"," 0.14",0,0]
[1," 06/04/2018 21:46:30"," 5 M"," 25.0",51," 10.8",76," 1002.0"," 1015.6"," 0.0"," 0.0",90," 6.8"," 10.8"," 0.0"," 29.7"," 29.7"," 274.8"," 694.8"," 0.09",0,0]
[1," 06/04/2018 21:51:30"," 5 M"," 25.0",51," 10.5",76," 1001.9"," 1015.5"," 0.0"," 0.0",90," 6.5"," 10.5"," 0.0"," 29.7"," 29.7"," 274.8"," 694.8"," 0.14",0,0]
[1," 06/04/2018 21:56:30"," 5 M"," 24.9",52," 10.3",76," 1001.8"," 1015.4"," 1.1"," 2.5",315," 6.3"," 10.3"," 0.0"," 29.7"," 29.7"," 274.8"," 694.8"," 0.05",0,0]
[1," 06/04/2018 22:01:30"," 5 M"," 24.7",52," 10.1",77," 1001.8"," 1015.4"," 0.0"," 0.0",315," 6.3"," 10.1"," 0.0"," 29.7"," 29.7"," 274.8"," 694.8"," 0.14",0,0]
[1," 06/04/2018 22:06:30"," 5 M"," 24.7",51," 10.0",77," 1001.6"," 1015.2"," 0.0"," 0.0",315," 6.2"," 10.0"," 0.0"," 29.7"," 29.7"," 274.8"," 694.8"," 0.05",0,0]
[1," 06/04/2018 22:11:30"," 5 M"," 24.5",51," 9.9",77," 1001.6"," 1015.2"," 0.0"," 0.0",225," 6.1"," 9.9"," 0.0"," 29.7"," 29.7"," 274.8"," 694.8"," 0.05",0,0]
[1," 06/04/2018 22:16:30"," 5 M"," 24.5",51," 9.9",78," 1001.4"," 1015.0"," 0.0"," 0.0",225," 6.3"," 9.9"," 0.0"," 29.7"," 29.7"," 274.8"," 694.8"," 0.09",0,0]
[1," 06/04/2018 22:21:30"," 5 M"," 24.3",51," 9.8",78," 1001.4"," 1015.0"," 0.0"," 0.0",225," 6.2"," 9.8"," 0.0"," 29.7"," 29.7"," 274.8"," 694.8"," 0.05",0,0]
[1," 06/04/2018 22:26:30"," 5 M"," 24.3",51," 9.6",78," 1001.4"," 1015.0"," 0.0"," 0.0",225," 6.0"," 9.6"," 0.0"," 29.7"," 29.7"," 274.8"," 694.8"," 0.14",0,0]
[1," 06/04/2018 22:31:30"," 5 M"," 24.2",51," 9.5",78," 1001.6"," 1015.2"," 0.0"," 0.0",225," 5.9"," 9.5"," 0.0"," 29.7"," 29.7"," 274.8"," 694.8"," 0.14",0,0]
[1," 06/04/2018 22:36:30"," 5 M"," 24.1",51," 9.3",79," 1001.4"," 1015.0"," 0.0"," 0.0",90," 5.9"," 9.3"," 0.0"," 29.7"," 29.7"," 274.8"," 694.8"," 0.05",0,0]
[1," 06/04/2018 22:41:30"," 5 M"," 24.1",51," 9.2",79," 1001.3"," 1014.9"," 0.0"," 0.0",45," 5.8"," 9.2"," 0.0"," 29.7"," 29.7"," 274.8"," 694.8"," 0.05",0,0]
[1," 06/04/2018 22:46:30"," 5 M"," 24.1",51," 9.1",79," 1001.4"," 1015.0"," 0.0"," 0.0",135," 5.7"," 9.1"," 0.0"," 29.7"," 29.7"," 274.8"," 694.8"," 0.05",0,0]
[1," 06/04/2018 22:51:30"," 5 M"," 24.0",51," 9.1",80," 1001.4"," 1015.0"," 0.0"," 0.0",90," 5.8"," 9.1"," 0.0"," 29.7"," 29.7"," 274.8"," 694.8"," 0.09",0,0]
[1," 06/04/2018 22:56:30"," 5 M"," 24.0",51," 9.1",80," 1001.3"," 1014.9"," 0.0"," 0.0",90," 5.8"," 9.1"," 0.0"," 29.7"," 29.7"," 274.8"," 694.8"," 0.14",0,0]
[1," 06/04/2018 23:01:30"," 5 M"," 23.9",52," 9.0",80," 1001.4"," 1015.0"," 0.0"," 0.0",90," 5.7"," 9.0"," 0.0"," 29.7"," 29.7"," 274.8"," 694.8"," 0.05",0,0]
[1," 06/04/2018 23:06:30"," 5 M"," 23.8",52," 8.8",80," 1001.3"," 1014.9"," 0.0"," 0.0",90," 5.6"," 8.8"," 0.0"," 29.7"," 29.7"," 274.8"," 694.8"," 0.09",0,0]
[1," 06/04/2018 23:11:30"," 5 M"," 23.8",52," 8.8",80," 1001.4"," 1015.0"," 0.0"," 0.0",90," 5.6"," 8.8"," 0.0"," 29.7"," 29.7"," 274.8"," 694.8"," 0.05",0,0]
[1," 06/04/2018 23:16:30"," 5 M"," 23.8",52," 8.7",80," 1001.3"," 1014.9"," 0.0"," 0.0",90," 5.5"," 8.7"," 0.0"," 29.7"," 29.7"," 274.8"," 694.8"," 0.14",0,0]
[1," 06/04/2018 23:21:30"," 5 M"," 23.7",52," 8.6",80," 1001.3"," 1014.9"," 0.0"," 0.0",90," 5.4"," 8.6"," 0.0"," 29.7"," 29.7"," 274.8"," 694.8"," 0.00",0,0]
[1," 06/04/2018 23:26:30"," 5 M"," 23.7",52," 8.6",81," 1001.1"," 1014.7"," 0.0"," 0.0",90," 5.5"," 8.6"," 0.0"," 29.7"," 29.7"," 274.8"," 694.8"," 0.09",0,0]
[1," 06/04/2018 23:31:30"," 5 M"," 23.7",52," 8.6",81," 1001.1"," 1014.7"," 0.0"," 0.0",45," 5.5"," 8.6"," 0.0"," 29.7"," 29.7"," 274.8"," 694.8"," 0.00",0,0]
[1," 06/04/2018 23:36:30"," 5 M"," 23.6",52," 8.5",81," 1001.1"," 1014.7"," 0.0"," 0.0",90," 5.4"," 8.5"," 0.0"," 29.7"," 29.7"," 274.8"," 694.8"," 0.09",0,0]
[1," 06/04/2018 23:41:30"," 5 M"," 23.5",52," 8.4",81," 1001.1"," 1014.7"," 2.5"," 3.6",135," 5.3"," 8.4"," 0.0"," 29.7"," 29.7"," 274.8"," 694.8"," 0.05",0,0]
[1," 06/04/2018 23:46:30"," 5 M"," 23.5",52," 8.5",81," 1001.0"," 1014.6"," 1.1"," 2.5",45," 5.4"," 8.5"," 0.0"," 29.7"," 29.7"," 274.8"," 694.8"," 0.14",0,0]
[1," 06/04/2018 23:51:30"," 5 M"," 23.5",52," 8.4",81," 1001.0"," 1014.6"," 0.0"," 0.0",90," 5.3"," 8.4"," 0.0"," 29.7"," 29.7"," 274.8"," 694.8"," 0.05",0,0]
[1," 06/04/2018 23:56:30"," 5 M"," 23.4",52," 8.4",81," 1000.9"," 1014.5"," 1.1"," 1.1",90," 5.3"," 8.4"," 0.0"," 29.7"," 29.7"," 274.8"," 694.8"," 0.05",0,0]
[""]
[""]
[""]
[""]
[""]
[""]
[""]
[""]
[""]
[""]
[""]
[""]
[""]
[""]
[""]
[""]
[""]
[""]
[""]
[""]
[""]
[""]
[""]
[""]
[""]
[""]
[""]
[""]
[""]
[""]
[""]
[""]
[""]
[{"$f":"IF(B326=\"\",\"\",1)","v":""}]
[""]
[""]
[""]
[""]
[""]
[""]
[""]
[""]
[""]
[""]
[""]
[""]
[""]
[""]
[""]
[""]
[""]
[""]
[""]
[""]
[""]
[""]
[""]
[""]
[""]
[""]
[""]
[""]
[""]
[""]
[""]
[""]
[""]
[""]
[""]
[""]
[""]
[""]
[""]
[""]
[""]
[""]
[""]
[""]
[""]
[""]
[""]
[""]
[""]
[""]
[""]
[""]
[""]
[""]
[""]
[""]
[""]
[""]
[""]
[""]
[""]
[""]
[""]
[{"$f":"IF(B390=\"\",\"\",1)","v":""}]
[""]
[""]
[""]
[""]
[""]
[""]
[""]
[""]
[""]
[""]
[""]
[""]
[""]
[""]
[""]
[""]
[""]
[""]
[""]
[""]
[""]
[""]
[""]
[""]
[""]
[""]
[""]
[""]
[""]
[""]
[""]
[""]
[""]
[""]
[""]
[""]
[""]
[""]
[""]

{"sheet":"Feuille Max Mini","index":2,"n_rows":310,"n_cols":35,"rows_kept":310,"cut":false,"hidden":false,"merged":[[21,13,21,14],[0,18,0,19],[18,30,19,30],[16,3,17,4]]}
[null,null,null,null,null,null,null,null,null,null,null,null,null,0,{"$f":"COUNTIF($O$23:$O$310,\"N\")","v":0},"N",{"$f":"MAX(N23:N310)","v":0},{"$f":"IF(N23=\"\",\"\",VLOOKUP(Q1,N1:P16,3,FALSE))","v":""},"Maxi des vents"]
[null,null,null,null,null,null,null,null,null,null,null,null,null,23,{"$f":"COUNTIF($O$23:$O$310,\"NNE\")","v":0},"NNE",{"$f":"MIN(N23:N310)","v":0},{"$f":"IF(N23=\"\",\"\",VLOOKUP(Q2,N1:P16,3,FALSE))","v":""},"Mini des vents"]
[null,null,null,null,null,null,null,null,null,null,null,null,null,45,{"$f":"COUNTIF($O$23:$O$310,\"NE\")","v":0},"NE"]
[null,null,null,null,null,null,null,null,null,null,null,null,null,68,{"$f":"COUNTIF($O$23:$O$310,\"ENE\")","v":0},"ENE"]
[null,null,null,null,null,null,null,null,null,null,null,null,null,90,{"$f":"COUNTIF($O$23:$O$310,\"EST\")","v":0},"EST"]
[null,null,null,null,null,null,null,null,null,null,null,null,null,113,{"$f":"COUNTIF($O$23:$O$310,\"ESE\")","v":0},"ESE"]
[null,null,null,null,null,null,null,null,null,null,null,null,null,135,{"$f":"COUNTIF($O$23:$O$310,\"SE\")","v":0},"SE"]
[null,null,null,null,null,null,null,null,null,null,null,null,null,158,{"$f":"COUNTIF($O$23:$O$310,\"SSE\")","v":0},"SSE"]
[null,null,null,null,null,null,null,null,null,null,null,null,null,180,{"$f":"COUNTIF($O$23:$O$310,\"S\")","v":0},"S"]
[null,null,null,null,null,null,null,null,null,null,null,null,null,203,{"$f":"COUNTIF($O$23:$O$310,\"SSO\")","v":0},"SSO"]
[null,null,null,null,null,null,null,null,null,null,null,null,null,225,{"$f":"COUNTIF($O$23:$O$310,\"SO\")","v":0},"SO"]
[null,null,null,null,null,null,null,null,null,null,null,null,null,248,{"$f":"COUNTIF($O$23:$O$310,\"OSO\")","v":0},"OSO"]
[null,null,null,null,null,null,null,null,null,null,null,null,null,270,{"$f":"COUNTIF($O$23:$O$310,\"O\")","v":0},"O"]
[null,null,null,null,null,null,null,null,null,null,null,null,null,293,{"$f":"COUNTIF($O$23:$O$310,\"ONO\")","v":0},"ONO"]
[null,null,null,null,null,null,null,null,null,null,null,null,null,315,{"$f":"COUNTIF($O$23:$O$310,\"NO\")","v":0},"NO"]
[null,null,null,null,null,null,null,null,null,null,null,null,null,338,{"$f":"COUNTIF($O$23:$O$310,\"NNO\")","v":0},"NNO"]
[null,null,null,"NE RIEN INSCRIRE DANS CES CASES",null,1,1,1,1,1,1,1,1,1,1,1,1,1,1,1,1,1,1,1,1]
[null,null,{"$f":"LARGE(H23:H5418,H18)","v":{"$error":"#NUM!"}},null,null,1,1,1,1,1,1,1,1,1,1,1,1,1,1,1,1,1,1,1,1,null,0,{"$f":"COUNTIF($N$23:$N$118,AA18)","v":0},"N"]
[null,null,null,null,"Moyenne",{"$f":"AVERAGE(F23:F30)","v":{"$error":"#DIV/0!"}},{"$f":"AVERAGE(G23:G30)","v":{"$error":"#DIV/0!"}},{"$error":"#DIV/0!"},{"$error":"#DIV/0!"},{"$f":"AVERAGE(J23:J29)","v":{"$error":"#DIV/0!"}},{"$error":"#DIV/0!"},{"$error":"#DIV/0!"},{"$error":"#DIV/0!"},null,null,{"$error":"#DIV/0!"},{"$error":"#DIV/0!"},{"$error":"#DIV/0!"},{"$error":"#DIV/0!"},{"$error":"#DIV/0!"},{"$error":"#DIV/0!"},{"$error":"#DIV/0!"},{"$error":"#DIV/0!"},{"$error":"#DIV/0!"},{"$error":"#DIV/0!"},null,0,0,"N"]
[null,null,null,null,"Minimum",{"$f":"IF(F23=\"\",\"\",SMALL(F23:F5418,F17))","v":""},{"$f":"IF(G23=\"\",\"\",SMALL(G23:G5418,G17))","v":""},{"$f":"IF(H23=\"\",\"\",SMALL(H23:H5418,H17))","v":""},"","","","","","",{"$f":"AC36","v":"N"},{"$f":"IF(P23=\"\",\"\",SMALL(P23:P5418,P17))","v":""},"","","","","","","","","",null,23,0,"NNE"]
[null,null,null,null," - -",{"$f":"IF(F23=\"\",\"\",LARGE(F23:F5418,F18))","v":""},{"$f":"IF(G24=\"\",\"\",LARGE(G24:G5419,G18))","v":""},{"$f":"IF(H23=\"\",\"\",LARGE(H23:H5418,H18))","v":""},{"$f":"IF(I24=\"\",\"\",LARGE(I24:I5419,I18))","v":""},{"$f":"IF(J23=\"\",\"\",LARGE(J23:J5418,J18))","v":""},"","","","",{"$f":"AC38","v":"N"},{"$f":"IF(P23=\"\",\"\",LARGE(P23:P5418,P18))","v":""},"","","","","","","","","",null,45,0,"NE"]
["NO.",null,"Date","Heure",{"$f":"'Relevé du jour'!C4","v":"Intervalle"},{"$f":"'Relevé du jour'!D4","v":"T° int.    (°C)"},{"$f":"'Relevé du jour'!E4","v":"Hum int.  (%)"},{"$f":"'Relevé du jour'!F4","v":"T° ext.    (°C)"},{"$f":"'Relevé du jour'!G4","v":"Hum ext.  (%)"},{"$f":"'Relevé du jour'!H4","v":"Press. rel.  (hpa)"},{"$f":"'Relevé du jour'!I4","v":"Press. abs.  (hpa)"},{"$f":"'Relevé du jour'!J4","v":"Vit. du vent(km/h)"},{"$f":"'Relevé du jour'!K4","v":"Rafale          (km/h)"},"Direction du vent",null,null,"Pt. de rosée(°C)","Facteur vent(°C)","Précipi. dern. 24 h(mm)","Précipi.s de la sem.   (mm)","Précipi. du mois     (mm)","Précipi. An     (mm)","Précipi. totale      (mm)","Lumière (W/M2)","UV     (uW/m2)","UVI",68,0,"ENE"]
[null,null,null,null,null,null,null,null,null,null,null,null,null,null,null,null,null,null,null,null,null,null,null,null,null,null,90,0,"EST",null,null,null,null,82,{"$f":"AH23/100","v":0.82}]
[null,null,null,null,null,null,null,null,null,null,null,null,null,null,null,null,null,null,null,null,null,null,null,null,null,null,113,0,"ESE",null,null,null,null,81,{"$f":"AH24/100","v":0.81}]
[null,null,null,null,null,null,null,null,null,null,null,null,null,null,null,null,null,null,null,null,null,null,null,null,null,null,135,0,"SE",null,null,null,null,81,0.81]
[null,null,null,null,null,null,null,null,null,null,null,null,null,null,null,null,null,null,null,null,null,null,null,null,null,null,158,0,"SSE",null,null,null,null,82,0.82]
[null,null,null,null,null,null,null,null,null,null,null,null,null,null,null,null,null,null,null,null,null,null,null,null,null,null,180,0,"S",null,null,null,null,82,0.82]
[null,null,null,null,null,null,null,null,null,null,null,null,null,null,null,null,null,null,null,null,null,null,null,null,null,null,203,0,"SSO",null,null,null,null,82,0.82]
[null,null,null,null,null,null,null,null,null,null,null,null,null,null,null,null,null,null,null,null,null,null,null,null,null,null,225,0,"SO",null,null,null,null,82,0.82]
[null,null,null,null,null,null,null,null,null,null,null,null,null,null,null,null,null,null,null,null,null,null,null,null,null,null,248,0,"OSO",null,null,null,null,82,0.82]
[null,null,null,null,null,null,null,null,null,null,null,null,null,null,null,null,null,null,null,null,null,null,null,null,null,null,270,0,"O",null,null,null,null,82,0.82]
[null,null,null,null,null,null,null,null,null,null,null,null,null,null,null,null,null,null,null,null,null,null,null,null,null,null,293,0,"ONO",null,null,null,null,82,0.82]
[null,null,null,null,null,null,null,null,null,null,null,null,null,null,null,null,null,null,null,null,null,null,null,null,null,null,315,0,"NO",null,null,null,null,82,0.82]
[null,null,null,null,null,null,null,null,null,null,null,null,null,null,null,null,null,null,null,null,null,null,null,null,null,null,338,0,"NNO",null,null,null,null,82,0.82]
[null,null,null,null,null,null,null,null,null,null,null,null,null,null,null,null,null,null,null,null,null,null,null,null,null,null,"Min",null,null,null,null,null,null,82,0.82]
[null,null,null,null,null,null,null,null,null,null,null,null,null,null,null,null,null,null,null,null,null,null,null,null,null,null,null,{"$f":"MIN(IF(AB19:AB34>0,AB19:AB34))","v":0},{"$f":"IF(AB36=\"\",\"\",VLOOKUP(AB36,$AB$19:$AC$34,2,FALSE))","v":"N"},null,null,null,null,83,0.83]
[null,null,null,null,null,null,null,null,null,null,null,null,null,null,null,null,null,null,null,null,null,null,null,null,null,null,"Max",null,null,null,null,null,null,83,0.83]
[null,null,null,null,null,null,null,null,null,null,null,null,null,null,null,null,null,null,null,null,null,null,null,null,null,null,null,{"$f":"MAX(IF(AB19:AB34>0,AB19:AB34))","v":0},{"$f":"IF(AB38=\"\",\"\",VLOOKUP(AB38,$AB$19:$AC$34,2,FALSE))","v":"N"},null,null,null,null,84,0.84]
[null,null,null,null,null,null,null,null,null,null,null,null,null,null,null,null,null,null,null,null,null,null,null,null,null,null,null,null,null,null,null,null,null,84,0.84]
[null,null,null,null,null,null,null,null,null,null,null,null,null,null,null,null,null,null,null,null,null,null,null,null,null,null,null,null,null,null,null,null,null,85,0.85]
[null,null,null,null,null,null,null,null,null,null,null,null,null,null,null,null,null,null,null,null,null,null,null,null,null,null,null,null,null,null,null,null,null,85,0.85]
[null,null,null,null,null,null,null,null,null,null,null,null,null,null,null,null,null,null,null,null,null,null,null,null,null,null,null,null,null,null,null,null,null,85,0.85]
[null,null,null,null,null,null,null,null,null,null,null,null,null,null,null,null,null,null,null,null,null,null,null,null,null,null,null,null,null,null,null,null,null,85,0.85]
[null,null,null,null,null,null,null,null,null,null,null,null,null,null,null,null,null,null,null,null,null,null,null,null,null,null,null,null,null,null,null,null,null,84,0.84]
[null,null,null,null,null,null,null,null,null,null,null,null,null,null,null,null,null,null,null,null,null,null,null,null,null,null,null,null,null,null,null,null,null,84,0.84]
[null,null,null,null,null,null,null,null,null,null,null,null,null,null,null,null,null,null,null,null,null,null,null,null,null,null,null,null,null,null,null,null,null,84,0.84]
[null,null,null,null,null,null,null,null,null,null,null,null,null,null,null,null,null,null,null,null,null,null,null,null,null,null,null,null,null,null,null,null,null,84,0.84]
[null,null,null,null,null,null,null,null,null,null,null,null,null,null,null,null,null,null,null,null,null,null,null,null,null,null,null,null,null,null,null,null,null,83,0.83]
[null,null,null,null,null,null,null,null,null,null,null,null,null,null,null,null,null,null,null,null,null,null,null,null,null,null,null,null,null,null,null,null,null,84,0.84]
[null,null,null,null,null,null,null,null,null,null,null,null,null,null,null,null,null,null,null,null,null,null,null,null,null,null,null,null,null,null,null,null,null,84,0.84]
[null,null,null,null,null,null,null,null,null,null,null,null,null,null,null,null,null,null,null,null,null,null,null,null,null,null,null,null,null,null,null,null,null,84,0.84]
[null,null,null,null,null,null,null,null,null,null,null,null,null,null,null,null,null,null,null,null,null,null,null,null,null,null,null,null,null,null,null,null,null,83,0.83]
[null,null,null,null,null,null,null,null,null,null,null,null,null,null,null,null,null,null,null,null,null,null,null,null,null,null,null,null,null,null,null,null,null,83,0.83]
[null,null,null,null,null,null,null,null,null,null,null,null,null,null,null,null,null,null,null,null,null,null,null,null,null,null,null,null,null,null,null,null,null,82,0.82]
[null,null,null,null,null,null,null,null,null,null,null,null,null,null,null,null,null,null,null,null,null,null,null,null,null,null,null,null,null,null,null,null,null,82,0.82]
[null,null,null,null,null,null,null,null,null,null,null,null,null,null,null,null,null,null,null,null,null,null,null,null,null,null,null,null,null,null,null,null,null,82,0.82]
[null,null,null,null,null,null,null,null,null,null,null,null,null,null,null,null,null,null,null,null,null,null,null,null,null,null,null,null,null,null,null,null,null,83,0.83]
[null,null,null,null,null,null,null,null,null,null,null,null,null,null,null,null,null,null,null,null,null,null,null,null,null,null,null,null,null,null,null,null,null,83,0.83]
[null,null,null,null,null,null,null,null,null,null,null,null,null,null,null,null,null,null,null,null,null,null,null,null,null,null,null,null,null,null,null,null,null,84,0.84]
[null,null,null,null,null,null,null,null,null,null,null,null,null,null,null,null,null,null,null,null,null,null,null,null,null,null,null,null,null,null,null,null,null,84,0.84]
[null,null,null,null,null,null,null,null,null,null,null,null,null,null,null,null,null,null,null,null,null,null,null,null,null,null,null,null,null,null,null,null,null,84,0.84]
[null,null,null,null,null,null,null,null,null,null,null,null,null,null,null,null,null,null,null,null,null,null,null,null,null,null,null,null,null,null,null,null,null,85,0.85]
[null,null,null,null,null,null,null,null,null,null,null,null,null,null,null,null,null,null,null,null,null,null,null,null,null,null,null,null,null,null,null,null,null,85,0.85]
[null,null,null,null,null,null,null,null,null,null,null,null,null,null,null,null,null,null,null,null,null,null,null,null,null,null,null,null,null,null,null,null,null,85,0.85]
[null,null,null,null,null,null,null,null,null,null,null,null,null,null,null,null,null,null,null,null,null,null,null,null,null,null,null,null,null,null,null,null,null,85,0.85]
[null,null,null,null,null,null,null,null,null,null,null,null,null,null,null,null,null,null,null,null,null,null,null,null,null,null,null,null,null,null,null,null,null,85,0.85]
[null,null,null,null,null,null,null,null,null,null,null,null,null,null,null,null,null,null,null,null,null,null,null,null,null,null,null,null,null,null,null,null,null,84,0.84]
[null,null,null,null,null,null,null,null,null,null,null,null,null,null,null,null,null,null,null,null,null,null,null,null,null,null,null,null,null,null,null,null,null,83,0.83]
[null,null,null,null,null,null,null,null,null,null,null,null,null,null,null,null,null,null,null,null,null,null,null,null,null,null,null,null,null,null,null,null,null,83,0.83]
[null,null,null,null,null,null,null,null,null,null,null,null,null,null,null,null,null,null,null,null,null,null,null,null,null,null,null,null,null,null,null,null,null,82,0.82]
[null,null,null,null,null,null,null,null,null,null,null,null,null,null,null,null,null,null,null,null,null,null,null,null,null,null,null,null,null,null,null,null,null,82,0.82]
[null,null,null,null,null,null,null,null,null,null,null,null,null,null,null,null,null,null,null,null,null,null,null,null,null,null,null,null,null,null,null,null,null,82,0.82]
[null,null,null,null,null,null,null,null,null,null,null,null,null,null,null,null,null,null,null,null,null,null,null,null,null,null,null,null,null,null,null,null,null,81,0.81]
[null,null,null,null,null,null,null,null,null,null,null,null,null,null,null,null,null,null,null,null,null,null,null,null,null,null,null,null,null,null,null,null,null,80,0.8]
[null,null,null,null,null,null,null,null,null,null,null,null,null,null,null,null,null,null,null,null,null,null,null,null,null,null,null,null,null,null,null,null,null,80,0.8]
[null,null,null,null,null,null,null,null,null,null,null,null,null,null,null,null,null,null,null,null,null,null,null,null,null,null,null,null,null,null,null,null,null,80,0.8]
[null,null,null,null,null,null,null,null,null,null,null,null,null,null,null,null,null,null,null,null,null,null,null,null,null,null,null,null,null,null,null,null,null,80,0.8]
[null,null,null,null,null,null,null,null,null,null,null,null,null,null,null,null,null,null,null,null,null,null,null,null,null,null,null,null,null,null,null,null,null,80,0.8]
[null,null,null,null,null,null,null,null,null,null,null,null,null,null,null,null,null,null,null,null,null,null,null,null,null,null,null,null,null,null,null,null,null,80,0.8]
[null,null,null,null,null,null,null,null,null,null,null,null,null,null,null,null,null,null,null,null,null,null,null,null,null,null,null,null,null,null,null,null,null,80,0.8]
[null,null,null,null,null,null,null,null,null,null,null,null,null,null,null,null,null,null,null,null,null,null,null,null,null,null,null,null,null,null,null,null,null,80,0.8]
[null,null,null,null,null,null,null,null,null,null,null,null,null,null,null,null,null,null,null,null,null,null,null,null,null,null,null,null,null,null,null,null,null,80,0.8]
[null,null,null,null,null,null,null,null,null,null,null,null,null,null,null,null,null,null,null,null,null,null,null,null,null,null,null,null,null,null,null,null,null,80,0.8]
[null,null,null,null,null,null,null,null,null,null,null,null,null,null,null,null,null,null,null,null,null,null,null,null,null,null,null,null,null,null,null,null,null,80,0.8]
[null,null,null,null,null,null,null,null,null,null,null,null,null,null,null,null,null,null,null,null,null,null,null,null,null,null,null,null,null,null,null,null,null,80,0.8]
[null,null,null,null,null,null,null,null,null,null,null,null,null,null,null,null,null,null,null,null,null,null,null,null,null,null,null,null,null,null,null,null,null,80,0.8]
[null,null,null,null,null,null,null,null,null,null,null,null,null,null,null,null,null,null,null,null,null,null,null,null,null,null,null,null,null,null,null,null,null,80,0.8]
[null,null,null,null,null,null,null,null,null,null,null,null,null,null,null,null,null,null,null,null,null,null,null,null,null,null,null,null,null,null,null,null,null,80,{"$f":"AH88/100","v":0.8}]
[null,null,null,null,null,null,null,null,null,null,null,null,null,null,null,null,null,null,null,null,null,null,null,null,null,null,null,null,null,null,null,null,null,80,0.8]
[null,null,null,null,null,null,null,null,null,null,null,null,null,null,null,null,null,null,null,null,null,null,null,null,null,null,null,null,null,null,null,null,null,80,0.8]
[null,null,null,null,null,null,null,null,null,null,null,null,null,null,null,null,null,null,null,null,null,null,null,null,null,null,null,null,null,null,null,null,null,80,0.8]
[null,null,null,null,null,null,null,null,null,null,null,null,null,null,null,null,null,null,null,null,null,null,null,null,null,null,null,null,null,null,null,null,null,80,0.8]
[null,null,null,null,null,null,null,null,null,null,null,null,null,null,null,null,null,null,null,null,null,null,null,null,null,null,null,null,null,null,null,null,null,80,0.8]
[null,null,null,null,null,null,null,null,null,null,null,null,null,null,null,null,null,null,null,null,null,null,null,null,null,null,null,null,null,null,null,null,null,80,0.8]
[null,null,null,null,null,null,null,null,null,null,null,null,null,null,null,null,null,null,null,null,null,null,null,null,null,null,null,null,null,null,null,null,null,80,0.8]
[null,null,null,null,null,null,null,null,null,null,null,null,null,null,null,null,null,null,null,null,null,null,null,null,null,null,null,null,null,null,null,null,null,80,0.8]
[null,null,null,null,null,null,null,null,null,null,null,null,null,null,null,null,null,null,null,null,null,null,null,null,null,null,null,null,null,null,null,null,null,80,0.8]
[null,null,null,null,null,null,null,null,null,null,null,null,null,null,null,null,null,null,null,null,null,null,null,null,null,null,null,null,null,null,null,null,null,81,0.81]
[null,null,null,null,null,null,null,null,null,null,null,null,null,null,null,null,null,null,null,null,null,null,null,null,null,null,null,null,null,null,null,null,null,80,0.8]
[null,null,null,null,null,null,null,null,null,null,null,null,null,null,null,null,null,null,null,null,null,null,null,null,null,null,null,null,null,null,null,null,null,80,0.8]
[null,null,null,null,null,null,null,null,null,null,null,null,null,null,null,null,null,null,null,null,null,null,null,null,null,null,null,null,null,null,null,null,null,80,0.8]
[null,null,null,null,null,null,null,null,null,null,null,null,null,null,null,null,null,null,null,null,null,null,null,null,null,null,null,null,null,null,null,null,null,80,0.8]
[null,null,null,null,null,null,null,null,null,null,null,null,null,null,null,null,null,null,null,null,null,null,null,null,null,null,null,null,null,null,null,null,null,80,0.8]
[null,null,null,null,null,null,null,null,null,null,null,null,null,null,null,null,null,null,null,null,null,null,null,null,null,null,null,null,null,null,null,null,null,80,0.8]
[null,null,null,null,null,null,null,null,null,null,null,null,null,null,null,null,null,null,null,null,null,null,null,null,null,null,null,null,null,null,null,null,null,80,0.8]
[null,null,null,null,null,null,null,null,null,null,null,null,null,null,null,null,null,null,null,null,null,null,null,null,null,null,null,null,null,null,null,null,null,80,0.8]
[null,null,null,null,null,null,null,null,null,null,null,null,null,null,null,null,null,null,null,null,null,null,null,null,null,null,null,null,null,null,null,null,null,80,0.8]
[null,null,null,null,null,null,null,null,null,null,null,null,null,null,null,null,null,null,null,null,null,null,null,null,null,null,null,null,null,null,null,null,null,80,0.8]
[null,null,null,null,null,null,null,null,null,null,null,null,null,null,null,null,null,null,null,null,null,null,null,null,null,null,null,null,null,null,null,null,null,80,0.8]
[null,null,null,null,null,null,null,null,null,null,null,null,null,null,null,null,null,null,null,null,null,null,null,null,null,null,null,null,null,null,null,null,null,80,0.8]
[null,null,null,null,null,null,null,null,null,null,null,null,null,null,null,null,null,null,null,null,null,null,null,null,null,null,null,null,null,null,null,null,null,80,0.8]
[null,null,null,null,null,null,null,null,null,null,null,null,null,null,null,null,null,null,null,null,null,null,null,null,null,null,null,null,null,null,null,null,null,80,0.8]
[null,null,null,null,null,null,null,null,null,null,null,null,null,null,null,null,null,null,null,null,null,null,null,null,null,null,null,null,null,null,null,null,null,80,0.8]
[null,null,null,null,null,null,null,null,null,null,null,null,null,null,null,null,null,null,null,null,null,null,null,null,null,null,null,null,null,null,null,null,null,80,0.8]
[null,null,null,null,null,null,null,null,null,null,null,null,null,null,null,null,null,null,null,null,null,null,null,null,null,null,null,null,null,null,null,null,null,80,0.8]
[null,null,null,null,null,null,null,null,null,null,null,null,null,null,null,null,null,null,null,null,null,null,null,null,null,null,null,null,null,null,null,null,null,80,0.8]
[null,null,null,null,null,null,null,null,null,null,null,null,null,null,null,null,null,null,null,null,null,null,null,null,null,null,null,null,null,null,null,null,null,80,0.8]
[null,null,null,null,null,null,null,null,null,null,null,null,null,null,null,null,null,null,null,null,null,null,null,null,null,null,null,null,null,null,null,null,null,80,0.8]
[null,null,null,null,null,null,null,null,null,null,null,null,null,null,null,null,null,null,null,null,null,null,null,null,null,null,null,null,null,null,null,null,null,80,0.8]
[null,null,null,null,null,null,null,null,null,null,null,null,null,null,null,null,null,null,null,null,null,null,null,null,null,null,null,null,null,null,null,null,null,80,0.8]
[null,null,null,null,null,null,null,null,null,null,null,null,null,null,null,null,null,null,null,null,null,null,null,null,null,null,null,null,null,null,null,null,null,80,0.8]
[null,null,null,null,null,null,null,null,null,null,null,null,null,null,null,null,null,null,null,null,null,null,null,null,null,null,null,null,null,null,null,null,null,80,0.8]
[null,null,null,null,null,null,null,null,null,null,null,null,null,null,null,null,null,null,null,null,null,null,null,null,null,null,null,null,null,null,null,null,null,79,0.79]
[null,null,null,null,null,null,null,null,null,null,null,null,null,null,null,null,null,null,null,null,null,null,null,null,null,null,null,null,null,null,null,null,null,79,0.79]
[null,null,null,null,null,null,null,null,null,null,null,null,null,null,null,null,null,null,null,null,null,null,null,null,null,null,null,null,null,null,null,null,null,79,0.79]
[null,null,null,null,null,null,null,null,null,null,null,null,null,null,null,null,null,null,null,null,null,null,null,null,null,null,null,null,null,null,null,null,null,78,0.78]
[null,null,null,null,null,null,null,null,null,null,null,null,null,null,null,null,null,null,null,null,null,null,null,null,null,null,null,null,null,null,null,null,null,78,0.78]
[null,null,null,null,null,null,null,null,null,null,null,null,null,null,null,null,null,null,null,null,null,null,null,null,null,null,null,null,null,null,null,null,null,78,0.78]
[null,null,null,null,null,null,null,null,null,null,null,null,null,null,null,null,null,null,null,null,null,null,null,null,null,null,null,null,null,null,null,null,null,76,0.76]
[null,null,null,null,null,null,null,null,null,null,null,null,null,null,null,null,null,null,null,null,null,null,null,null,null,null,null,null,null,null,null,null,null,76,0.76]
[null,null,null,null,null,null,null,null,null,null,null,null,null,null,null,null,null,null,null,null,null,null,null,null,null,null,null,null,null,null,null,null,null,71,0.71]
[null,null,null,null,null,null,null,null,null,null,null,null,null,null,null,null,null,null,null,null,null,null,null,null,null,null,null,null,null,null,null,null,null,70,0.7]
[null,null,null,null,null,null,null,null,null,null,null,null,null,null,null,null,null,null,null,null,null,null,null,null,null,null,null,null,null,null,null,null,null,70,0.7]
[null,null,null,null,null,null,null,null,null,null,null,null,null,null,null,null,null,null,null,null,null,null,null,null,null,null,null,null,null,null,null,null,null,70,0.7]
[null,null,null,null,null,null,null,null,null,null,null,null,null,null,null,null,null,null,null,null,null,null,null,null,null,null,null,null,null,null,null,null,null,70,0.7]
[null,null,null,null,null,null,null,null,null,null,null,null,null,null,null,null,null,null,null,null,null,null,null,null,null,null,null,null,null,null,null,null,null,70,0.7]
[null,null,null,null,null,null,null,null,null,null,null,null,null,null,null,null,null,null,null,null,null,null,null,null,null,null,null,null,null,null,null,null,null,70,0.7]
[null,null,null,null,null,null,null,null,null,null,null,null,null,null,null,null,null,null,null,null,null,null,null,null,null,null,null,null,null,null,null,null,null,70,0.7]
[null,null,null,null,null,null,null,null,null,null,null,null,null,null,null,null,null,null,null,null,null,null,null,null,null,null,null,null,null,null,null,null,null,69,0.69]
[null,null,null,null,null,null,null,null,null,null,null,null,null,null,null,null,null,null,null,null,null,null,null,null,null,null,null,null,null,null,null,null,null,69,0.69]
[null,null,null,null,null,null,null,null,null,null,null,null,null,null,null,null,null,null,null,null,null,null,null,null,null,null,null,null,null,null,null,null,null,69,0.69]
[null,null,null,null,null,null,null,null,null,null,null,null,null,null,null,null,null,null,null,null,null,null,null,null,null,null,null,null,null,null,null,null,null,68,0.68]
[null,null,null,null,null,null,null,null,null,null,null,null,null,null,null,null,null,null,null,null,null,null,null,null,null,null,null,null,null,null,null,null,null,68,0.68]
[null,null,null,null,null,null,null,null,null,null,null,null,null,null,null,null,null,null,null,null,null,null,null,null,null,null,null,null,null,null,null,null,null,67,0.67]
[null,null,null,null,null,null,null,null,null,null,null,null,null,null,null,null,null,null,null,null,null,null,null,null,null,null,null,null,null,null,null,null,null,67,0.67]
[null,null,null,null,null,null,null,null,null,null,null,null,null,null,null,null,null,null,null,null,null,null,null,null,null,null,null,null,null,null,null,null,null,67,0.67]
[null,null,null,null,null,null,null,null,null,null,null,null,null,null,null,null,null,null,null,null,null,null,null,null,null,null,null,null,null,null,null,null,null,67,0.67]
[null,null,null,null,null,null,null,null,null,null,null,null,null,null,null,null,null,null,null,null,null,null,null,null,null,null,null,null,null,null,null,null,null,67,0.67]
[null,null,null,null,null,null,null,null,null,null,null,null,null,null,null,null,null,null,null,null,null,null,null,null,null,null,null,null,null,null,null,null,null,66,0.66]
[null,null,null,null,null,null,null,null,null,null,null,null,null,null,null,null,null,null,null,null,null,null,null,null,null,null,null,null,null,null,null,null,null,63,0.63]
[null,null,null,null,null,null,null,null,null,null,null,null,null,null,null,null,null,null,null,null,null,null,null,null,null,null,null,null,null,null,null,null,null,62,0.62]
[null,null,null,null,null,null,null,null,null,null,null,null,null,null,null,null,null,null,null,null,null,null,null,null,null,null,null,null,null,null,null,null,null,62,{"$f":"AH152/100","v":0.62}]
[null,null,null,null,null,null,null,null,null,null,null,null,null,null,null,null,null,null,null,null,null,null,null,null,null,null,null,null,null,null,null,null,null,61,0.61]
[null,null,null,null,null,null,null,null,null,null,null,null,null,null,null,null,null,null,null,null,null,null,null,null,null,null,null,null,null,null,null,null,null,62,0.62]
[null,null,null,null,null,null,null,null,null,null,null,null,null,null,null,null,null,null,null,null,null,null,null,null,null,null,null,null,null,null,null,null,null,59,0.59]
[null,null,null,null,null,null,null,null,null,null,null,null,null,null,null,null,null,null,null,null,null,null,null,null,null,null,null,null,null,null,null,null,null,57,0.56999999999999995]
[null,null,null,null,null,null,null,null,null,null,null,null,null,null,null,null,null,null,null,null,null,null,null,null,null,null,null,null,null,null,null,null,null,56,0.56000000000000005]
[null,null,null,null,null,null,null,null,null,null,null,null,null,null,null,null,null,null,null,null,null,null,null,null,null,null,null,null,null,null,null,null,null,55,0.55000000000000004]
[null,null,null,null,null,null,null,null,null,null,null,null,null,null,null,null,null,null,null,null,null,null,null,null,null,null,null,null,null,null,null,null,null,56,0.56000000000000005]
[null,null,null,null,null,null,null,null,null,null,null,null,null,null,null,null,null,null,null,null,null,null,null,null,null,null,null,null,null,null,null,null,null,56,0.56000000000000005]
[null,null,null,null,null,null,null,null,null,null,null,null,null,null,null,null,null,null,null,null,null,null,null,null,null,null,null,null,null,null,null,null,null,54,0.54]
[null,null,null,null,null,null,null,null,null,null,null,null,null,null,null,null,null,null,null,null,null,null,null,null,null,null,null,null,null,null,null,null,null,56,0.56000000000000005]
[null,null,null,null,null,null,null,null,null,null,null,null,null,null,null,null,null,null,null,null,null,null,null,null,null,null,null,null,null,null,null,null,null,54,0.54]
[null,null,null,null,null,null,null,null,null,null,null,null,null,null,null,null,null,null,null,null,null,null,null,null,null,null,null,null,null,null,null,null,null,54,0.54]
[null,null,null,null,null,null,null,null,null,null,null,null,null,null,null,null,null,null,null,null,null,null,null,null,null,null,null,null,null,null,null,null,null,54,0.54]
[null,null,null,null,null,null,null,null,null,null,null,null,null,null,null,null,null,null,null,null,null,null,null,null,null,null,null,null,null,null,null,null,null,54,0.54]
[null,null,null,null,null,null,null,null,null,null,null,null,null,null,null,null,null,null,null,null,null,null,null,null,null,null,null,null,null,null,null,null,null,53,0.53]
[null,null,null,null,null,null,null,null,null,null,null,null,null,null,null,null,null,null,null,null,null,null,null,null,null,null,null,null,null,null,null,null,null,52,0.52]
[null,null,null,null,null,null,null,null,null,null,null,null,null,null,null,null,null,null,null,null,null,null,null,null,null,null,null,null,null,null,null,null,null,53,0.53]
[null,null,null,null,null,null,null,null,null,null,null,null,null,null,null,null,null,null,null,null,null,null,null,null,null,null,null,null,null,null,null,null,null,53,0.53]
[null,null,null,null,null,null,null,null,null,null,null,null,null,null,null,null,null,null,null,null,null,null,null,null,null,null,null,null,null,null,null,null,null,53,0.53]
[null,null,null,null,null,null,null,null,null,null,null,null,null,null,null,null,null,null,null,null,null,null,null,null,null,null,null,null,null,null,null,null,null,54,0.54]
[null,null,null,null,null,null,null,null,null,null,null,null,null,null,null,null,null,null,null,null,null,null,null,null,null,null,null,null,null,null,null,null,null,54,0.54]
[null,null,null,null,null,null,null,null,null,null,null,null,null,null,null,null,null,null,null,null,null,null,null,null,null,null,null,null,null,null,null,null,null,54,0.54]
[null,null,null,null,null,null,null,null,null,null,null,null,null,null,null,null,null,null,null,null,null,null,null,null,null,null,null,null,null,null,null,null,null,53,0.53]
[null,null,null,null,null,null,null,null,null,null,null,null,null,null,null,null,null,null,null,null,null,null,null,null,null,null,null,null,null,null,null,null,null,55,0.55000000000000004]
[null,null,null,null,null,null,null,null,null,null,null,null,null,null,null,null,null,null,null,null,null,null,null,null,null,null,null,null,null,null,null,null,null,54,0.54]
[null,null,null,null,null,null,null,null,null,null,null,null,null,null,null,null,null,null,null,null,null,null,null,null,null,null,null,null,null,null,null,null,null,54,0.54]
[null,null,null,null,null,null,null,null,null,null,null,null,null,null,null,null,null,null,null,null,null,null,null,null,null,null,null,null,null,null,null,null,null,54,0.54]
[null,null,null,null,null,null,null,null,null,null,null,null,null,null,null,null,null,null,null,null,null,null,null,null,null,null,null,null,null,null,null,null,null,54,0.54]
[null,null,null,null,null,null,null,null,null,null,null,null,null,null,null,null,null,null,null,null,null,null,null,null,null,null,null,null,null,null,null,null,null,54,0.54]
[null,null,null,null,null,null,null,null,null,null,null,null,null,null,null,null,null,null,null,null,null,null,null,null,null,null,null,null,null,null,null,null,null,57,0.56999999999999995]
[null,null,null,null,null,null,null,null,null,null,null,null,null,null,null,null,null,null,null,null,null,null,null,null,null,null,null,null,null,null,null,null,null,53,0.53]
[null,null,null,null,null,null,null,null,null,null,null,null,null,null,null,null,null,null,null,null,null,null,null,null,null,null,null,null,null,null,null,null,null,51,0.51]
[null,null,null,null,null,null,null,null,null,null,null,null,null,null,null,null,null,null,null,null,null,null,null,null,null,null,null,null,null,null,null,null,null,50,0.5]
[null,null,null,null,null,null,null,null,null,null,null,null,null,null,null,null,null,null,null,null,null,null,null,null,null,null,null,null,null,null,null,null,null,50,0.5]
[null,null,null,null,null,null,null,null,null,null,null,null,null,null,null,null,null,null,null,null,null,null,null,null,null,null,null,null,null,null,null,null,null,50,0.5]
[null,null,null,null,null,null,null,null,null,null,null,null,null,null,null,null,null,null,null,null,null,null,null,null,null,null,null,null,null,null,null,null,null,50,0.5]
[null,null,null,null,null,null,null,null,null,null,null,null,null,null,null,null,null,null,null,null,null,null,null,null,null,null,null,null,null,null,null,null,null,50,0.5]
[null,null,null,null,null,null,null,null,null,null,null,null,null,null,null,null,null,null,null,null,null,null,null,null,null,null,null,null,null,null,null,null,null,50,0.5]
[null,null,null,null,null,null,null,null,null,null,null,null,null,null,null,null,null,null,null,null,null,null,null,null,null,null,null,null,null,null,null,null,null,51,0.51]
[null,null,null,null,null,null,null,null,null,null,null,null,null,null,null,null,null,null,null,null,null,null,null,null,null,null,null,null,null,null,null,null,null,50,0.5]
[null,null,null,null,null,null,null,null,null,null,null,null,null,null,null,null,null,null,null,null,null,null,null,null,null,null,null,null,null,null,null,null,null,52,0.52]
[null,null,null,null,null,null,null,null,null,null,null,null,null,null,null,null,null,null,null,null,null,null,null,null,null,null,null,null,null,null,null,null,null,51,0.51]
[null,null,null,null,null,null,null,null,null,null,null,null,null,null,null,null,null,null,null,null,null,null,null,null,null,null,null,null,null,null,null,null,null,50,0.5]
[null,null,null,null,null,null,null,null,null,null,null,null,null,null,null,null,null,null,null,null,null,null,null,null,null,null,null,null,null,null,null,null,null,50,0.5]
[null,null,null,null,null,null,null,null,null,null,null,null,null,null,null,null,null,null,null,null,null,null,null,null,null,null,null,null,null,null,null,null,null,51,0.51]
[null,null,null,null,null,null,null,null,null,null,null,null,null,null,null,null,null,null,null,null,null,null,null,null,null,null,null,null,null,null,null,null,null,52,0.52]
[null,null,null,null,null,null,null,null,null,null,null,null,null,null,null,null,null,null,null,null,null,null,null,null,null,null,null,null,null,null,null,null,null,50,0.5]
[null,null,null,null,null,null,null,null,null,null,null,null,null,null,null,null,null,null,null,null,null,null,null,null,null,null,null,null,null,null,null,null,null,50,0.5]
[null,null,null,null,null,null,null,null,null,null,null,null,null,null,null,null,null,null,null,null,null,null,null,null,null,null,null,null,null,null,null,null,null,49,0.49]
[null,null,null,null,null,null,null,null,null,null,null,null,null,null,null,null,null,null,null,null,null,null,null,null,null,null,null,null,null,null,null,null,null,49,0.49]
[null,null,null,null,null,null,null,null,null,null,null,null,null,null,null,null,null,null,null,null,null,null,null,null,null,null,null,null,null,null,null,null,null,47,0.47]
[null,null,null,null,null,null,null,null,null,null,null,null,null,null,null,null,null,null,null,null,null,null,null,null,null,null,null,null,null,null,null,null,null,49,0.49]
[null,null,null,null,null,null,null,null,null,null,null,null,null,null,null,null,null,null,null,null,null,null,null,null,null,null,null,null,null,null,null,null,null,47,0.47]
[null,null,null,null,null,null,null,null,null,null,null,null,null,null,null,null,null,null,null,null,null,null,null,null,null,null,null,null,null,null,null,null,null,47,0.47]
[null,null,null,null,null,null,null,null,null,null,null,null,null,null,null,null,null,null,null,null,null,null,null,null,null,null,null,null,null,null,null,null,null,45,0.45]
[null,null,null,null,null,null,null,null,null,null,null,null,null,null,null,null,null,null,null,null,null,null,null,null,null,null,null,null,null,null,null,null,null,47,0.47]
[null,null,null,null,null,null,null,null,null,null,null,null,null,null,null,null,null,null,null,null,null,null,null,null,null,null,null,null,null,null,null,null,null,47,0.47]
[null,null,null,null,null,null,null,null,null,null,null,null,null,null,null,null,null,null,null,null,null,null,null,null,null,null,null,null,null,null,null,null,null,47,0.47]
[null,null,null,null,null,null,null,null,null,null,null,null,null,null,null,null,null,null,null,null,null,null,null,null,null,null,null,null,null,null,null,null,null,46,0.46]
[null,null,null,null,null,null,null,null,null,null,null,null,null,null,null,null,null,null,null,null,null,null,null,null,null,null,null,null,null,null,null,null,null,47,0.47]
[null,null,null,null,null,null,null,null,null,null,null,null,null,null,null,null,null,null,null,null,null,null,null,null,null,null,null,null,null,null,null,null,null,46,0.46]
[null,null,null,null,null,null,null,null,null,null,null,null,null,null,null,null,null,null,null,null,null,null,null,null,null,null,null,null,null,null,null,null,null,47,0.47]
[null,null,null,null,null,null,null,null,null,null,null,null,null,null,null,null,null,null,null,null,null,null,null,null,null,null,null,null,null,null,null,null,null,47,0.47]
[null,null,null,null,null,null,null,null,null,null,null,null,null,null,null,null,null,null,null,null,null,null,null,null,null,null,null,null,null,null,null,null,null,47,{"$f":"AH216/100","v":0.47}]
[null,null,null,null,null,null,null,null,null,null,null,null,null,null,null,null,null,null,null,null,null,null,null,null,null,null,null,null,null,null,null,null,null,48,0.48]
[null,null,null,null,null,null,null,null,null,null,null,null,null,null,null,null,null,null,null,null,null,null,null,null,null,null,null,null,null,null,null,null,null,48,0.48]
[null,null,null,null,null,null,null,null,null,null,null,null,null,null,null,null,null,null,null,null,null,null,null,null,null,null,null,null,null,null,null,null,null,49,0.49]
[null,null,null,null,null,null,null,null,null,null,null,null,null,null,null,null,null,null,null,null,null,null,null,null,null,null,null,null,null,null,null,null,null,49,0.49]
[null,null,null,null,null,null,null,null,null,null,null,null,null,null,null,null,null,null,null,null,null,null,null,null,null,null,null,null,null,null,null,null,null,49,0.49]
[null,null,null,null,null,null,null,null,null,null,null,null,null,null,null,null,null,null,null,null,null,null,null,null,null,null,null,null,null,null,null,null,null,50,0.5]
[null,null,null,null,null,null,null,null,null,null,null,null,null,null,null,null,null,null,null,null,null,null,null,null,null,null,null,null,null,null,null,null,null,50,0.5]
[null,null,null,null,null,null,null,null,null,null,null,null,null,null,null,null,null,null,null,null,null,null,null,null,null,null,null,null,null,null,null,null,null,50,0.5]
[null,null,null,null,null,null,null,null,null,null,null,null,null,null,null,null,null,null,null,null,null,null,null,null,null,null,null,null,null,null,null,null,null,50,0.5]
[null,null,null,null,null,null,null,null,null,null,null,null,null,null,null,null,null,null,null,null,null,null,null,null,null,null,null,null,null,null,null,null,null,50,0.5]
[null,null,null,null,null,null,null,null,null,null,null,null,null,null,null,null,null,null,null,null,null,null,null,null,null,null,null,null,null,null,null,null,null,48,0.48]
[null,null,null,null,null,null,null,null,null,null,null,null,null,null,null,null,null,null,null,null,null,null,null,null,null,null,null,null,null,null,null,null,null,50,0.5]
[null,null,null,null,null,null,null,null,null,null,null,null,null,null,null,null,null,null,null,null,null,null,null,null,null,null,null,null,null,null,null,null,null,50,0.5]
[null,null,null,null,null,null,null,null,null,null,null,null,null,null,null,null,null,null,null,null,null,null,null,null,null,null,null,null,null,null,null,null,null,50,0.5]
[null,null,null,null,null,null,null,null,null,null,null,null,null,null,null,null,null,null,null,null,null,null,null,null,null,null,null,null,null,null,null,null,null,48,0.48]
[null,null,null,null,null,null,null,null,null,null,null,null,null,null,null,null,null,null,null,null,null,null,null,null,null,null,null,null,null,null,null,null,null,48,0.48]
[null,null,null,null,null,null,null,null,null,null,null,null,null,null,null,null,null,null,null,null,null,null,null,null,null,null,null,null,null,null,null,null,null,46,0.46]
[null,null,null,null,null,null,null,null,null,null,null,null,null,null,null,null,null,null,null,null,null,null,null,null,null,null,null,null,null,null,null,null,null,49,0.49]
[null,null,null,null,null,null,null,null,null,null,null,null,null,null,null,null,null,null,null,null,null,null,null,null,null,null,null,null,null,null,null,null,null,48,0.48]
[null,null,null,null,null,null,null,null,null,null,null,null,null,null,null,null,null,null,null,null,null,null,null,null,null,null,null,null,null,null,null,null,null,49,0.49]
[null,null,null,null,null,null,null,null,null,null,null,null,null,null,null,null,null,null,null,null,null,null,null,null,null,null,null,null,null,null,null,null,null,49,0.49]
[null,null,null,null,null,null,null,null,null,null,null,null,null,null,null,null,null,null,null,null,null,null,null,null,null,null,null,null,null,null,null,null,null,48,0.48]
[null,null,null,null,null,null,null,null,null,null,null,null,null,null,null,null,null,null,null,null,null,null,null,null,null,null,null,null,null,null,null,null,null,49,0.49]
[null,null,null,null,null,null,null,null,null,null,null,null,null,null,null,null,null,null,null,null,null,null,null,null,null,null,null,null,null,null,null,null,null,49,0.49]
[null,null,null,null,null,null,null,null,null,null,null,null,null,null,null,null,null,null,null,null,null,null,null,null,null,null,null,null,null,null,null,null,null,49,0.49]
[null,null,null,null,null,null,null,null,null,null,null,null,null,null,null,null,null,null,null,null,null,null,null,null,null,null,null,null,null,null,null,null,null,48,0.48]
[null,null,null,null,null,null,null,null,null,null,null,null,null,null,null,null,null,null,null,null,null,null,null,null,null,null,null,null,null,null,null,null,null,47,0.47]
[null,null,null,null,null,null,null,null,null,null,null,null,null,null,null,null,null,null,null,null,null,null,null,null,null,null,null,null,null,null,null,null,null,49,0.49]
[null,null,null,null,null,null,null,null,null,null,null,null,null,null,null,null,null,null,null,null,null,null,null,null,null,null,null,null,null,null,null,null,null,50,0.5]
[null,null,null,null,null,null,null,null,null,null,null,null,null,null,null,null,null,null,null,null,null,null,null,null,null,null,null,null,null,null,null,null,null,50,0.5]
[null,null,null,null,null,null,null,null,null,null,null,null,null,null,null,null,null,null,null,null,null,null,null,null,null,null,null,null,null,null,null,null,null,50,0.5]
[null,null,null,null,null,null,null,null,null,null,null,null,null,null,null,null,null,null,null,null,null,null,null,null,null,null,null,null,null,null,null,null,null,50,0.5]
[null,null,null,null,null,null,null,null,null,null,null,null,null,null,null,null,null,null,null,null,null,null,null,null,null,null,null,null,null,null,null,null,null,51,0.51]
[null,null,null,null,null,null,null,null,null,null,null,null,null,null,null,null,null,null,null,null,null,null,null,null,null,null,null,null,null,null,null,null,null,51,0.51]
[null,null,null,null,null,null,null,null,null,null,null,null,null,null,null,null,null,null,null,null,null,null,null,null,null,null,null,null,null,null,null,null,null,51,0.51]
[null,null,null,null,null,null,null,null,null,null,null,null,null,null,null,null,null,null,null,null,null,null,null,null,null,null,null,null,null,null,null,null,null,52,0.52]
[null,null,null,null,null,null,null,null,null,null,null,null,null,null,null,null,null,null,null,null,null,null,null,null,null,null,null,null,null,null,null,null,null,52,0.52]
[null,null,null,null,null,null,null,null,null,null,null,null,null,null,null,null,null,null,null,null,null,null,null,null,null,null,null,null,null,null,null,null,null,52,0.52]
[null,null,null,null,null,null,null,null,null,null,null,null,null,null,null,null,null,null,null,null,null,null,null,null,null,null,null,null,null,null,null,null,null,53,0.53]
[null,null,null,null,null,null,null,null,null,null,null,null,null,null,null,null,null,null,null,null,null,null,null,null,null,null,null,null,null,null,null,null,null,54,0.54]
[null,null,null,null,null,null,null,null,null,null,null,null,null,null,null,null,null,null,null,null,null,null,null,null,null,null,null,null,null,null,null,null,null,54,0.54]
[null,null,null,null,null,null,null,null,null,null,null,null,null,null,null,null,null,null,null,null,null,null,null,null,null,null,null,null,null,null,null,null,null,56,0.56000000000000005]
[null,null,null,null,null,null,null,null,null,null,null,null,null,null,null,null,null,null,null,null,null,null,null,null,null,null,null,null,null,null,null,null,null,56,0.56000000000000005]
[null,null,null,null,null,null,null,null,null,null,null,null,null,null,null,null,null,null,null,null,null,null,null,null,null,null,null,null,null,null,null,null,null,56,0.56000000000000005]
[null,null,null,null,null,null,null,null,null,null,null,null,null,null,null,null,null,null,null,null,null,null,null,null,null,null,null,null,null,null,null,null,null,56,0.56000000000000005]
[null,null,null,null,null,null,null,null,null,null,null,null,null,null,null,null,null,null,null,null,null,null,null,null,null,null,null,null,null,null,null,null,null,61,0.61]
[null,null,null,null,null,null,null,null,null,null,null,null,null,null,null,null,null,null,null,null,null,null,null,null,null,null,null,null,null,null,null,null,null,61,0.61]
[null,null,null,null,null,null,null,null,null,null,null,null,null,null,null,null,null,null,null,null,null,null,null,null,null,null,null,null,null,null,null,null,null,62,0.62]
[null,null,null,null,null,null,null,null,null,null,null,null,null,null,null,null,null,null,null,null,null,null,null,null,null,null,null,null,null,null,null,null,null,63,0.63]
[null,null,null,null,null,null,null,null,null,null,null,null,null,null,null,null,null,null,null,null,null,null,null,null,null,null,null,null,null,null,null,null,null,63,0.63]
[null,null,null,null,null,null,null,null,null,null,null,null,null,null,null,null,null,null,null,null,null,null,null,null,null,null,null,null,null,null,null,null,null,64,0.64]
[null,null,null,null,null,null,null,null,null,null,null,null,null,null,null,null,null,null,null,null,null,null,null,null,null,null,null,null,null,null,null,null,null,65,0.65]
[null,null,null,null,null,null,null,null,null,null,null,null,null,null,null,null,null,null,null,null,null,null,null,null,null,null,null,null,null,null,null,null,null,65,0.65]
[null,null,null,null,null,null,null,null,null,null,null,null,null,null,null,null,null,null,null,null,null,null,null,null,null,null,null,null,null,null,null,null,null,67,0.67]
[null,null,null,null,null,null,null,null,null,null,null,null,null,null,null,null,null,null,null,null,null,null,null,null,null,null,null,null,null,null,null,null,null,68,0.68]
[null,null,null,null,null,null,null,null,null,null,null,null,null,null,null,null,null,null,null,null,null,null,null,null,null,null,null,null,null,null,null,null,null,69,0.69]
[null,null,null,null,null,null,null,null,null,null,null,null,null,null,null,null,null,null,null,null,null,null,null,null,null,null,null,null,null,null,null,null,null,70,0.7]
[null,null,null,null,null,null,null,null,null,null,null,null,null,null,null,null,null,null,null,null,null,null,null,null,null,null,null,null,null,null,null,null,null,70,0.7]
[null,null,null,null,null,null,null,null,null,null,null,null,null,null,null,null,null,null,null,null,null,null,null,null,null,null,null,null,null,null,null,null,null,70,0.7]
[null,null,null,null,null,null,null,null,null,null,null,null,null,null,null,null,null,null,null,null,null,null,null,null,null,null,null,null,null,null,null,null,null,70,0.7]
[null,null,null,null,null,null,null,null,null,null,null,null,null,null,null,null,null,null,null,null,null,null,null,null,null,null,null,null,null,null,null,null,null,71,0.71]
[null,null,null,null,null,null,null,null,null,null,null,null,null,null,null,null,null,null,null,null,null,null,null,null,null,null,null,null,null,null,null,null,null,73,0.73]
[null,null,null,null,null,null,null,null,null,null,null,null,null,null,null,null,null,null,null,null,null,null,null,null,null,null,null,null,null,null,null,null,null,73,0.73]
[null,null,null,null,null,null,null,null,null,null,null,null,null,null,null,null,null,null,null,null,null,null,null,null,null,null,null,null,null,null,null,null,null,73,{"$f":"AH280/100","v":0.73}]
[null,null,null,null,null,null,null,null,null,null,null,null,null,null,null,null,null,null,null,null,null,null,null,null,null,null,null,null,null,null,null,null,null,74,0.74]
[null,null,null,null,null,null,null,null,null,null,null,null,null,null,null,null,null,null,null,null,null,null,null,null,null,null,null,null,null,null,null,null,null,75,0.75]
[null,null,null,null,null,null,null,null,null,null,null,null,null,null,null,null,null,null,null,null,null,null,null,null,null,null,null,null,null,null,null,null,null,76,0.76]
[null,null,null,null,null,null,null,null,null,null,null,null,null,null,null,null,null,null,null,null,null,null,null,null,null,null,null,null,null,null,null,null,null,76,0.76]
[null,null,null,null,null,null,null,null,null,null,null,null,null,null,null,null,null,null,null,null,null,null,null,null,null,null,null,null,null,null,null,null,null,76,0.76]
[null,null,null,null,null,null,null,null,null,null,null,null,null,null,null,null,null,null,null,null,null,null,null,null,null,null,null,null,null,null,null,null,null,76,0.76]
[null,null,null,null,null,null,null,null,null,null,null,null,null,null,null,null,null,null,null,null,null,null,null,null,null,null,null,null,null,null,null,null,null,77,0.77]
[null,null,null,null,null,null,null,null,null,null,null,null,null,null,null,null,null,null,null,null,null,null,null,null,null,null,null,null,null,null,null,null,null,77,0.77]
[null,null,null,null,null,null,null,null,null,null,null,null,null,null,null,null,null,null,null,null,null,null,null,null,null,null,null,null,null,null,null,null,null,77,0.77]
[null,null,null,null,null,null,null,null,null,null,null,null,null,null,null,null,null,null,null,null,null,null,null,null,null,null,null,null,null,null,null,null,null,78,0.78]
[null,null,null,null,null,null,null,null,null,null,null,null,null,null,null,null,null,null,null,null,null,null,null,null,null,null,null,null,null,null,null,null,null,78,0.78]
[null,null,null,null,null,null,null,null,null,null,null,null,null,null,null,null,null,null,null,null,null,null,null,null,null,null,null,null,null,null,null,null,null,78,0.78]
[null,null,null,null,null,null,null,null,null,null,null,null,null,null,null,null,null,null,null,null,null,null,null,null,null,null,null,null,null,null,null,null,null,78,0.78]
[null,null,null,null,null,null,null,null,null,null,null,null,null,null,null,null,null,null,null,null,null,null,null,null,null,null,null,null,null,null,null,null,null,79,0.79]
[null,null,null,null,null,null,null,null,null,null,null,null,null,null,null,null,null,null,null,null,null,null,null,null,null,null,null,null,null,null,null,null,null,79,0.79]
[null,null,null,null,null,null,null,null,null,null,null,null,null,null,null,null,null,null,null,null,null,null,null,null,null,null,null,null,null,null,null,null,null,79,0.79]
[null,null,null,null,null,null,null,null,null,null,null,null,null,null,null,null,null,null,null,null,null,null,null,null,null,null,null,null,null,null,null,null,null,80,0.8]
[null,null,null,null,null,null,null,null,null,null,null,null,null,null,null,null,null,null,null,null,null,null,null,null,null,null,null,null,null,null,null,null,null,80,0.8]
[null,null,null,null,null,null,null,null,null,null,null,null,null,null,null,null,null,null,null,null,null,null,null,null,null,null,null,null,null,null,null,null,null,80,0.8]
[null,null,null,null,null,null,null,null,null,null,null,null,null,null,null,null,null,null,null,null,null,null,null,null,null,null,null,null,null,null,null,null,null,80,0.8]
[null,null,null,null,null,null,null,null,null,null,null,null,null,null,null,null,null,null,null,null,null,null,null,null,null,null,null,null,null,null,null,null,null,80,0.8]
[null,null,null,null,null,null,null,null,null,null,null,null,null,null,null,null,null,null,null,null,null,null,null,null,null,null,null,null,null,null,null,null,null,80,0.8]
[null,null,null,null,null,null,null,null,null,null,null,null,null,null,null,null,null,null,null,null,null,null,null,null,null,null,null,null,null,null,null,null,null,80,0.8]
[null,null,null,null,null,null,null,null,null,null,null,null,null,null,null,null,null,null,null,null,null,null,null,null,null,null,null,null,null,null,null,null,null,81,0.81]
[null,null,null,null,null,null,null,null,null,null,null,null,null,null,null,null,null,null,null,null,null,null,null,null,null,null,null,null,null,null,null,null,null,81,0.81]
[null,null,null,null,null,null,null,null,null,null,null,null,null,null,null,null,null,null,null,null,null,null,null,null,null,null,null,null,null,null,null,null,null,81,0.81]
[null,null,null,null,null,null,null,null,null,null,null,null,null,null,null,null,null,null,null,null,null,null,null,null,null,null,null,null,null,null,null,null,null,81,0.81]
[null,null,null,null,null,null,null,null,null,null,null,null,null,null,null,null,null,null,null,null,null,null,null,null,null,null,null,null,null,null,null,null,null,81,0.81]
[null,null,null,null,null,null,null,null,null,null,null,null,null,null,null,null,null,null,null,null,null,null,null,null,null,null,null,null,null,null,null,null,null,81,0.81]
[null,null,null,null,null,null,null,null,null,null,null,null,null,null,null,null,null,null,null,null,null,null,null,null,null,null,null,null,null,null,null,null,null,72,0.72]

{"sheet":"Feuille Tri des relevés","index":3,"n_rows":6,"n_cols":31,"rows_kept":6,"cut":false,"hidden":false,"merged":[[4,21,4,22]]}
[]
[]
[]
[null,null,null,null,null,"*",null,"*",null,"*",null,"*"]
["Jour","T°               int.    (°C)","Heure","Hum              int.       (%)","Heure","T°                  ext.     Mini   (°C)","Heure","T°                 ext.               Maxi    (°C)","Heure","Hum           ext.      (%)","Heure","Press.         rel.        (hpa)","Heure","Vit. Min du vent    (km/h)","Heure","Vit.Max  du vent    (km/h)","Heure","Rafale Min (km/h)","Heure","Rafale Max (km/h)","Heure","Direction           du                        vent",null,"Heure","Précipi. dern. 24 h        (mm)","Précipi. Totale Mois (mm)","Précipi. Totale An (mm)","Lumière (W/M2)",null,"UVI","Heure"]
[{"$f":"'Feuille Max Mini'!C23","v":"00:00:00"},{"$f":"'Feuille Max Mini'!F21","v":""},{"$f":"IF(B6=\"\",\"\",INDEX('Feuille Max Mini'!D23:D5418,MATCH(B6,'Feuille Max Mini'!F23:F5418,0)))","v":""},{"$f":"IF('Feuille Max Mini'!G21=\"\",\"\",'Feuille Max Mini'!G21)","v":""},{"$f":"IF(D6=\"\",\"\",INDEX('Feuille Max Mini'!$D$23:$D$5418,MATCH(D6,'Feuille Max Mini'!G23:G5418,0)))","v":""},{"$f":"'Feuille Max Mini'!H20","v":""},{"$f":"IF(F6=\"\",\"\",INDEX('Feuille Max Mini'!$D$23:$D$5418,MATCH(F6,'Feuille Max Mini'!H23:H5418,0)))","v":""},{"$f":"'Feuille Max Mini'!H21","v":""},{"$f":"IF(H6=\"\",\"\",INDEX('Feuille Max Mini'!$D$23:$D$5418,MATCH(H6,'Feuille Max Mini'!H23:H5418,0)))","v":""},{"$f":"IF('Feuille Max Mini'!I21=\"\",\"\",'Feuille Max Mini'!I21)","v":""},{"$f":"IF(J6=\"\",\"\",INDEX('Feuille Max Mini'!$D$23:$D$5418,MATCH(J6,'Feuille Max Mini'!I23:I5418,0)))","v":""},{"$f":"'Feuille Max Mini'!J21","v":""},{"$f":"IF(L6=\"\",\"\",INDEX('Feuille Max Mini'!$D$23:$D$5418,MATCH(L6,'Feuille Max Mini'!J23:J5418,0)))","v":""},{"$f":"'Feuille Max Mini'!L20","v":""},{"$f":"IF(N6=\"\",\"\",INDEX('Feuille Max Mini'!$D$23:$D$5418,MATCH(N6,'Feuille Max Mini'!L23:L5418,0)))","v":""},{"$f":"'Feuille Max Mini'!L21","v":""},{"$f":"IF(P6=\"\",\"\",INDEX('Feuille Max Mini'!$D$23:$D$5418,MATCH(P6,'Feuille Max Mini'!L23:L5418,0)))","v":""},{"$f":"'Feuille Max Mini'!M20","v":""},{"$f":"IF(R6=\"\",\"\",INDEX('Feuille Max Mini'!$D$23:$D$5418,MATCH(R6,'Feuille Max Mini'!M23:M5418,0)))","v":""},{"$f":"'Feuille Max Mini'!M21","v":""},{"$f":"IF(T6=\"\",\"\",INDEX('Feuille Max Mini'!$D$23:$D$5418,MATCH(T6,'Feuille Max Mini'!M23:M5418,0)))","v":""},{"$f":"IF(W6=\"\",\"\",'Feuille Max Mini'!N21)","v":""},{"$f":"'Feuille Max Mini'!O21","v":"N"},{"$f":"IF(W6=\"\",\"\",INDEX('Feuille Max Mini'!$D$23:$D$5418,MATCH(V6,'Feuille Max Mini'!N23:N5418,0)))","v":{"$error":"#N/A"}},{"$f":"'Feuille Max Mini'!R21","v":""},{"$f":"IF(V6=\"\",\"\",'Feuille Max Mini'!T23)","v":""},{"$f":"IF(W6=\"\",\"\",'Feuille Max Mini'!U21)","v":""},{"$f":"'Feuille Max Mini'!W21","v":""},null,{"$f":"'Feuille Max Mini'!Y21","v":""},{"$f":"IF(AD6=\"\",\"\",INDEX('Feuille Max Mini'!$D$23:$D$5418,MATCH(AD6,'Feuille Max Mini'!Y23:Y5418,0)))","v":""}]

{"sheet":"Relevés","index":4,"n_rows":46,"n_cols":53,"rows_kept":46,"cut":false,"hidden":false,"merged":[[12,35,12,38]]}
["Soleil","C","Ciel voilé","Rares éclaircies","Soleil Fortes averses","Variable",null,null,null,"Orageux","Soleil orage","Soleil averses orageuses","Pluies orageuses","Orage","Orage et grêles","Orage violent",null,null,null,null,null,null,null,null,null,null,null,null,null,null,null,null,null,null,null,null,null,null,null,null,null,null,30,51,299,700]
[null,1,2,3,4,5,null,null,null,null,18,19,20,21,22,23,null,null,null,null,null,null,null,null,null,null,null,null,null,null,null,null,null,null,null,null,null,null,null,null,null,null,null,null,null,null,null,null,null,null,{"$f":"COUNTIF($W$14:$W$46,AZ2)","v":0},"N",0]
["Nuageux & Brumeux","C","Brouillard dense","Brume ou Brouillard légé","Brume ou léger brouillard givrant","Nuageux","Couvert","Couvert rares averses",null,"Grèle & Neige","Giboulées","Grèles","Neiges","Fortes neiges",null,null,null,null,null,null,null,null,null,null,null,null,null,null,null,null,null,null,null,null,null,null,null,null,null,null,null,null,null,null,null,null,null,null,null,null,{"$f":"COUNTIF($W$14:$W$46,AZ3)","v":0},"NNE",23]
[null,6,7,8,9,10,11,12,null,null,24,25,26,27,null,null,null,null,null,null,null,null,null,null,null,null,null,null,null,null,null,null,null,null,null,null,null,null,null,null,null,null,null,null,null,null,null,null,null,null,1,"NE",45]
["Pluvieux","Pluies et éclaircies","Pluies éparses","Bruines","Averses ou fortes pluies","Pluies mélées de neige",null,null,null,null,null,null,null,null,null,null,null,null,null,null,null,null,null,null,null,null,null,null,null,null,null,null,null,null,null,null,null,null,null,null,null,null,null,null,null,null,null,null,null,null,0,"ENE",68]
[null,13,14,15,16,17,null,null,null,null,null,null,null,null,null,null,null,null,null,null,null,null,null,null,null,null,null,null,null,null,null,null,null,null,null,null,null,null,null,null,null,null,null,null,null,null,null,null,null,null,2,"EST",90]
[null,null,null,null,null,{"$f":"IF(F14=\"\",\"\",MIN(F14:F46))","v":0.5},null,{"$f":"IF(H14=\"\",\"\",MIN(H14:H46))","v":11.3},null,0.84,null,994.3,null,0,null,13.3,null,0,null,18.399999999999999,null,{"$f":"VLOOKUP(W7,$AZ$2:$BA$17,2,FALSE)","v":0},{"$f":"W10","v":"N"},null,{"$f":"MIN(Y14:Y46)","v":0},null,null,155.11000000000001,null,null,null,null,2,null,null,null,null,null,null,null,null,null,null,null,null,null,null,null,null,null,0,"ESE",113]
[null,null,null,null,null,{"$f":"IF(F15=\"\",\"\",MAX(F14:F46))","v":8.8000000000000007},null,{"$f":"IF(H15=\"\",\"\",MAX(H14:H46))","v":20.7},null,84,null,1016.3,null,2.5,null,24.5,null,3.6,null,34.200000000000003,null,{"$f":"VLOOKUP(W8,$AZ$2:$BA$17,2,FALSE)","v":90},{"$f":"W11","v":"EST"},null,{"$f":"MAX(Y14:Y46)","v":12.9},26.700000000000003,274.8,829.29,null,null,null,null,8,null,null,null,null,null,null,null,null,null,null,null,null,null,null,null,null,null,1,"SE",135]
[null,null,null,null,null,null,null,null,null,null,null,null,null,null,null,null,null,null,null,null,null,null,null,null,null,null,null,null,null,null,null,null,null,null,null,null,null,null,null,null,null,null,null,null,null,null,null,null,null,null,0,"SSE",158]
[null,null,null,null,null,null,null,null,null,null,null,null,null,null,null,null,null,null,null,null,null,{"$f":"SMALL($AY$2:$AY$17,1)","v":0},{"$f":"VLOOKUP(V10,$AY$2:$AZ$17,2,FALSE)","v":"N"},null,null,{"$f":"MAX(Z14:Z46)","v":26.700000000000003},null,null,null,null,null,null,null,null,null,null,null,null,null,null,null,31,99,300,null,null,null,null,null,null,1,"S",180]
[null,null,null,null,null,{"$f":"IF(F14=\"\",\"\",MIN(F14:F46))","v":0.5},{"$f":"VLOOKUP(F11,F14:G46,2,FALSE)","v":"07:25:33"},{"$f":"IF(H14=\"\",\"\",MAX(H14:H46))","v":20.7},{"$f":"VLOOKUP(H11,H14:I46,2,FALSE)","v":"16:01:30"},null,null,null,null,null,null,null,null,null,null,null,null,{"$f":"LARGE($AY$2:$AY$17,1)","v":2},{"$f":"VLOOKUP(V11,$AY$2:$AZ$17,2,FALSE)","v":"EST"},null,null,null,null,null,null,null,null,null,null,null,null,null,null,null,null,null,null,49,100,301,null,null,null,null,null,null,0,"SSO",203]
["Moyenne Mensuelle",{"$f":"AVERAGE(B14:B46)","v":19.033333333333335},null,{"$f":"AVERAGE(D14:D46)","v":41.756666666666668},null,{"$f":"AVERAGE(F14:F46)","v":5.4333333333333336},null,{"$f":"AVERAGE(H14:H46)","v":15.033333333333333},null,{"$f":"AVERAGE(J14:J46)","v":67.973333333333343},null,{"$f":"AVERAGE(L14:L46)","v":1007.2833333333333},null,{"$f":"AVERAGE(N14:N46)","v":0.41666666666666669},null,null,null,{"$f":"AVERAGE(R14:R46)","v":0.78333333333333333},null,null,null,null,"SE","09:30:45",{"$f":"AVERAGE(Y14:Y44)","v":4.45},{"$f":"AVERAGE(Z14:Z46)","v":16.3},null,{"$f":"AVERAGE(AB14:AB46)","v":511.26333333333332},null,null,null,null,{"$f":"AVERAGE(AG14:AG46)","v":5.5},null,null,null,null,null,null,null,null,50,101,699,null,null,null,null,null,null,0,"SO",225]
["Jour","T°               int.    (°C)","Heure","Hum              int.       (%)","Heure","T°              Mini                 ext.    (°C)","Heure","T°               Maxi                     ext.    (°C)","Heure","Hum           ext.      (%)","Heure","Press.         rel.        (hpa)","Heure","Vit. du vent    (km/h)","Heure","Vit. du vent    (km/h)","Heure","Rafale  Min        (km/h)","Heure","Rafale    Max      (km/h)","Heure","Direction                      du vent"," -","Heure","Précipi. dern. 24 h        (mm)","Précipi. Tot. mois          (mm)","Précipi. Tot. An        (mm)","Lumière (W/M2)",null,null,null,null,"UVI","Heure",null,"Intensité des UV",null,null,null,null,null,null,null,null,null,null,null,null,null,null,0,"OSO",248]
["2018-04-01",24.3,"19:10:33",48,"23:55:33",0.5,"07:25:33",11.3,"13:50:33",80,"23:55:33",1011.9,"10:25:33",0,"00:05:33",15.8,"17:45:33",0,"00:30:33",19.399999999999999,"17:45:33",{"$f":"IF(W14=\"N\",0,IF(W14=\"NNE\",23,IF(W14=\"NE\",45,IF(W14=\"ENE\",68,IF(W14=\"EST\",90,IF(W14=\"ESE\",113,IF(W14=\"SE\",135,IF(W14=\"SSE\",158,IF(W14=\"S\",180,IF(W14=\"SSO\",203,IF(W14=\"SO\",225,IF(W14=\"OSO\",248,IF(W14=\"O\",270,IF(W14=\"ONO\",293,IF(W14=\"NO\",315,IF(W14=\"NNO\",338,\"\"))))))))))))))))","v":45},"NE","00:25:33",1.2,{"$f":"Y14","v":1.2},246.3,347.98,{"$f":"IF(Y14=\"\",\"\",IF(AND(Y14=0,AB14<400),5,IF(AND(Y14=0,AB14>400),1,IF(AND(Y14>0,Y14<3),4,16))))","v":4},null,{"$f":"IF(AC14=\"\",\"\",VLOOKUP(AC14,List!$B$2:$E$29,4,FALSE))","v":"Soleil nuageux et averses"},null,5,"12:40:33",null,"FAIBLE","<2",null,null,null,"Soleil","C","Ciel voilé","Rares éclaircies","Soleil Fortes averses","Variable",0,0,null,null,1,"O",270]
[{"$f":"IF(B15=\"\",\"\",A14+1)","v":"2018-04-02"},1.5,"15:10:34",51,"23:55:34",7,"06:15:33",11.9,"21:20:34",84,"23:55:34",1004.8,"00:00:33",0,"00:05:33",13.3,"10:25:33",0,"00:10:33",18.399999999999999,"10:25:33",{"$f":"IF(W15=\"N\",0,IF(W15=\"NNE\",23,IF(W15=\"NE\",45,IF(W15=\"ENE\",68,IF(W15=\"EST\",90,IF(W15=\"ESE\",113,IF(W15=\"SE\",135,IF(W15=\"SSE\",158,IF(W15=\"S\",180,IF(W15=\"SSO\",203,IF(W15=\"SO\",225,IF(W15=\"OSO\",248,IF(W15=\"O\",270,IF(W15=\"ONO\",293,IF(W15=\"NO\",315,IF(W15=\"NNO\",338,\"\"))))))))))))))))","v":90},"EST","00:25:33",1.5,{"$f":"IF(Y15=\"\",\"\",Y15+Z14)","v":2.7},247.8,238.07,{"$f":"IF(Y15=\"\",\"\",IF(AND(Y15=0,AB15<400),5,IF(AND(Y15=0,AB15>400),1,IF(AND(Y15>0,Y15<3),4,16))))","v":4},null,{"$f":"IF(AC15=\"\",\"\",VLOOKUP(AC15,List!$B$2:$E$29,4,FALSE))","v":"Soleil nuageux et averses"},{"$f":"IF(AC15=\"\",\"\",)","v":0},3,"10:35:33",null,"MODEREE",3,"à",5,null,null,null,null,null,null,null,null,null,null,null,0,"ONO",293]
[{"$f":"IF(B16=\"\",\"\",A15+1)","v":"2018-04-03"},25.4,"22:16:30",0.54,"12:35:34",8.8000000000000007,"22:21:30",13.9,"18:31:30",0.84,"00:00:34",994.3,"11:45:34",0,"21:21:30",15.8,"18:16:30",1.1000000000000001,"21:21:30",23.4,"18:16:30",{"$f":"IF(W16=\"N\",0,IF(W16=\"NNE\",23,IF(W16=\"NE\",45,IF(W16=\"ENE\",68,IF(W16=\"EST\",90,IF(W16=\"ESE\",113,IF(W16=\"SE\",135,IF(W16=\"SSE\",158,IF(W16=\"S\",180,IF(W16=\"SSO\",203,IF(W16=\"SO\",225,IF(W16=\"OSO\",248,IF(W16=\"O\",270,IF(W16=\"ONO\",293,IF(W16=\"NO\",315,IF(W16=\"NNO\",338,\"\"))))))))))))))))","v":135},"SE","22:56:30",11.1,{"$f":"IF(Y16=\"\",\"\",Y16+Z15)","v":13.8},258.89999999999998,155.11000000000001,16,null,{"$f":"IF(AC16=\"\",\"\",VLOOKUP(AC16,List!$B$2:$E$29,4,FALSE))","v":"Averses ou fortes pluies"},"Averses ou fortes pluies",2,"18:16:30",null,"FORTE",6,"à",7,null,"Nuageux & Brumeux","C","Brouillard dense","Brume ou Brouillard légé","Brume ou léger brouillard givrant","Nuageux","Couvert","Couvert rares averses",null,null,0,"NO",315]
["2018-04-04",12.9,"19:11:31",50,"23:56:31",8.1999999999999993,"12:41:31",15.4,"16:41:31",80,"23:56:31",1004.9,"23:56:31",2.5,"14:51:31",24.5,"04:11:30",3.6,"14:56:31",34.200000000000003,"04:11:30",180,"S","14:36:31",12.9,26.700000000000003,271.8,829.29,16,null,{"$f":"IF(AC17=\"\",\"\",VLOOKUP(AC17,List!$B$2:$E$29,4,FALSE))","v":"Averses ou fortes pluies"},"Pluies et éclaircies",8,"13:21:31",null,"TRES FORTE",8,"à",10,null,null,null,null,null,null,null,null,null,null,null,0,"NNO",338]
["2018-04-05",25.1,"16:56:29",49,"23:56:29",5,"23:41:29",17,"12:01:29",82,"23:56:29",1016.3,"11:31:29",0,"06:36:31",14.8,"16:41:29",0,"08:01:31",19.399999999999999,"16:41:29",270,"O","01:16:31",0,26.700000000000003,274.8,771.73,1,null,{"$f":"IF(AC18=\"\",\"\",VLOOKUP(AC18,List!$B$2:$E$29,4,FALSE))","v":"Ciel dégagé"},"C",8,"14:46:29",null,"EXTREME","11+",null,null,null,"Pluvieux","Pluies et éclaircies","Pluies éparses","Bruines","Averses ou fortes pluies","Pluies mélées de neige"]
["2018-04-06",25,"21:21:30",52,"23:56:30",3.1,"02:41:29",20.7,"16:01:30",81,"23:56:30",1011.5,"00:21:29",0,"00:06:29",18.399999999999999,"12:06:30",0,"00:06:29",23.4,"12:06:30",90,"EST","09:31:29",0,26.700000000000003,274.8,725.4,1,null,{"$f":"IF(AC19=\"\",\"\",VLOOKUP(AC19,List!$B$2:$E$29,4,FALSE))","v":"Ciel dégagé"},"C",7,"13:01:30"]
["",null,null,null,null,null,null,null,null,null,null,null,null,null,null,null,null,null,null,null,null,"",null,null,null,"",null,null,"",null,{"$f":"IF(AC20=\"\",\"\",VLOOKUP(AC20,List!$B$2:$E$29,4,FALSE))","v":""},"C",null,null,null,null,null,null,null,null,"Orageux","Soleil orage","Soleil averses orageuses","Pluies orageuses","Orage","Orage et grêles","Orage violent"]
["",null,null,null,null,null,null,null,null,null,null,null,null,null,null,null,null,null,null,null,null,{"$f":"IF(W21=\"N\",0,IF(W21=\"NNE\",23,IF(W21=\"NE\",45,IF(W21=\"ENE\",68,IF(W21=\"EST\",90,IF(W21=\"ESE\",113,IF(W21=\"SE\",135,IF(W21=\"SSE\",158,IF(W21=\"S\",180,IF(W21=\"SSO\",203,IF(W21=\"SO\",225,IF(W21=\"OSO\",248,IF(W21=\"O\",270,IF(W21=\"ONO\",293,IF(W21=\"NO\",315,IF(W21=\"NNO\",338,\"\"))))))))))))))))","v":""},null,null,null,{"$f":"IF(Y21=\"\",\"\",Y21+Z20)","v":""},null,null,"",null,{"$f":"IF(AC21=\"\",\"\",VLOOKUP(AC21,List!$B$2:$E$29,4,FALSE))","v":""},"Averses ou fortes pluies"]
["",null,null,null,null,null,null,null,null,null,null,null,null,null,null,null,null,null,null,null,null,"",null,null,null,"",null,null,"",null,{"$f":"IF(AC22=\"\",\"\",VLOOKUP(AC22,List!$B$2:$E$29,4,FALSE))","v":""},"Pluies et éclaircies",null,null,null,null,null,null,null,null,"Grèle & Neige","Giboulées","Grèles","Neiges","Fortes neiges",0,0]
["",null,null,null,null,null,null,null,null,null,null,null,null,null,null,null,null,null,null,null,null,"",null,null,null,"",null,null,"",null,{"$f":"IF(AC23=\"\",\"\",VLOOKUP(AC23,List!$B$2:$E$29,4,FALSE))","v":""},"Pluies éparses"]
["",null,null,null,null,null,null,null,null,null,null,null,null,null,null,null,null,null,null,null,null,"",null,null,null,"",null,null,"",null,{"$f":"IF(AC24=\"\",\"\",VLOOKUP(AC24,List!$B$2:$E$29,4,FALSE))","v":""},"Pluies et éclaircies",null,null,null,null,null,null,null,null,"Temps de nuit","Ciel dégagé de nuit","Ciel voilé de nuit","Brume ou brouillard léger de nuit","Brume ou léger brouillard givrant de nuit ","Brouillard dense de nuit","Ciel nuageux avec éclaircies de nuit"]
["",null,null,null,null,null,null,null,null,null,null,null,null,null,null,null,null,null,null,null,null,"",null,null,null,"",null,null,"",null,{"$f":"IF(AC25=\"\",\"\",VLOOKUP(AC25,List!$B$2:$E$29,4,FALSE))","v":""},"C"]
["",null,null,null,null,null,null,null,null,null,null,null,null,null,null,null,null,null,null,null,null,"",null,null,null,"",null,null,"",null,{"$f":"IF(AC26=\"\",\"\",VLOOKUP(AC26,List!$B$2:$E$29,4,FALSE))","v":""}]
["",null,null,null,null,null,null,null,null,null,null,null,null,null,null,null,null,null,null,null,null,"",null,null,null,"",null,null,"",null,{"$f":"IF(AC27=\"\",\"\",VLOOKUP(AC27,List!$B$2:$E$29,4,FALSE))","v":""}]
["",null,null,null,null,null,null,null,null,null,null,null,null,null,null,null,null,null,null,null,null,"",null,null,null,"",null,null,"",null,{"$f":"IF(AC28=\"\",\"\",VLOOKUP(AC28,List!$B$2:$E$29,4,FALSE))","v":""}]
["",null,null,null,null,null,null,null,null,null,null,null,null,null,null,null,null,null,null,null,null,"",null,null,null,"",null,null,"",null,{"$f":"IF(AC29=\"\",\"\",VLOOKUP(AC29,List!$B$2:$E$29,4,FALSE))","v":""}]
["",null,null,null,null,null,null,null,null,null,null,null,null,null,null,null,null,null,null,null,null,"",null,null,null,"",null,null,"",null,{"$f":"IF(AC30=\"\",\"\",VLOOKUP(AC30,List!$B$2:$E$29,4,FALSE))","v":""}]
["",null,null,null,null,null,null,null,null,null,null,null,null,null,null,null,null,null,null,null,null,"",null,null,null,"",null,null,"",null,{"$f":"IF(AC31=\"\",\"\",VLOOKUP(AC31,List!$B$2:$E$29,4,FALSE))","v":""}]
["",null,null,null,null,null,null,null,null,null,null,null,null,null,null,null,null,null,null,null,null,"",null,null,null,"",null,null,"",null,{"$f":"IF(AC32=\"\",\"\",VLOOKUP(AC32,List!$B$2:$E$29,4,FALSE))","v":""}]
["",null,null,null,null,null,null,null,null,null,null,null,null,null,null,null,null,null,null,null,null,"",null,null,null,"",null,null,"",null,{"$f":"IF(AC33=\"\",\"\",VLOOKUP(AC33,List!$B$2:$E$29,4,FALSE))","v":""}]
["",null,null,null,null,null,null,null,null,null,null,null,null,null,null,null,null,null,null,null,null,"",null,null,null,"",null,null,"",null,{"$f":"IF(AC34=\"\",\"\",VLOOKUP(AC34,List!$B$2:$E$29,4,FALSE))","v":""}]
["",null,null,null,null,null,null,null,null,null,null,null,null,null,null,null,null,null,null,null,null,"",null,null,null,"",null,null,"",null,{"$f":"IF(AC35=\"\",\"\",VLOOKUP(AC35,List!$B$2:$E$29,4,FALSE))","v":""}]
["",null,null,null,null,null,null,null,null,null,null,null,null,null,null,null,null,null,null,null,null,"",null,null,null,"",null,null,"",null,{"$f":"IF(AC36=\"\",\"\",VLOOKUP(AC36,List!$B$2:$E$29,4,FALSE))","v":""}]
["",null,null,null,null,null,null,null,null,null,null,null,null,null,null,null,null,null,null,null,null,"",null,null,null,"",null,null,"",null,{"$f":"IF(AC37=\"\",\"\",VLOOKUP(AC37,List!$B$2:$E$29,4,FALSE))","v":""}]
["",null,null,null,null,null,null,null,null,null,null,null,null,null,null,null,null,null,null,null,null,"",null,null,null,"",null,null,"",null,{"$f":"IF(AC38=\"\",\"\",VLOOKUP(AC38,List!$B$2:$E$29,4,FALSE))","v":""}]
["",null,null,null,null,null,null,null,null,null,null,null,null,null,null,null,null,null,null,null,null,"",null,null,null,"",null,null,"",null,{"$f":"IF(AC39=\"\",\"\",VLOOKUP(AC39,List!$B$2:$E$29,4,FALSE))","v":""}]
["",null,null,null,null,null,null,null,null,null,null,null,null,null,null,null,null,null,null,null,null,"",null,null,null,"",null,null,"",null,{"$f":"IF(AC40=\"\",\"\",VLOOKUP(AC40,List!$B$2:$E$29,4,FALSE))","v":""}]
["",null,null,null,null,null,null,null,null,null,null,null,null,null,null,null,null,null,null,null,null,"",null,null,null,"",null,null,"",null,{"$f":"IF(AC41=\"\",\"\",VLOOKUP(AC41,List!$B$2:$E$29,4,FALSE))","v":""}]
["",null,null,null,null,null,null,null,null,null,null,null,null,null,null,null,null,null,null,null,null,"",null,null,null,"",null,null,"",null,{"$f":"IF(AC42=\"\",\"\",VLOOKUP(AC42,List!$B$2:$E$29,4,FALSE))","v":""}]
["",null,null,null,null,null,null,null,null,null,null,null,null,null,null,null,null,null,null,null,null,"",null,null,null,"",null,null,"",null,{"$f":"IF(AC43=\"\",\"\",VLOOKUP(AC43,List!$B$2:$E$29,4,FALSE))","v":""}]
["",null,null,null,null,null,null,null,null,null,null,null,null,null,null,null,null,null,null,null,null,"",null,null,null,"",null,null,"",null,{"$f":"IF(AC44=\"\",\"\",VLOOKUP(AC44,List!$B$2:$E$29,4,FALSE))","v":""}]
["",null,null,null,null,null,null,null,null,null,null,null,null,null,null,null,null,null,null,null,null,"",null,null,null,"",null,null,"",null,{"$f":"IF(AC45=\"\",\"\",VLOOKUP(AC45,List!$B$2:$E$29,4,FALSE))","v":""}]
["",null,null,null,null,null,null,null,null,null,null,null,null,null,null,null,null,null,null,null,null,"",null,null,null,"",null,null,"",null,{"$f":"IF(AC46=\"\",\"\",VLOOKUP(AC46,List!$B$2:$E$29,4,FALSE))","v":""}]

{"sheet":"Récape annuelle","index":5,"n_rows":25,"n_cols":19,"rows_kept":25,"cut":false,"hidden":false,"merged":[]}
[null,"Mois"]
[null,"2017-07-01","2017-08-01","2017-09-01","2017-10-01","2017-11-01","2017-12-01","2018-01-01","2018-02-01","2018-03-01","2018-04-01","2018-05-01","2018-06-01","2018-07-01","2018-08-01","2018-09-01","2018-10-01","2018-11-01","2018-12-01"]
[]
["Humidité   ext. Mini (%)",{"$f":"'Juillet 17'!J7","v":0.5},{"$f":"'Aout 17'!J7","v":0.83},{"$f":"'Septembre 17'!J7","v":0.77},{"$f":"'Octobre 17'!J7","v":0.76},{"$f":"'Novembre 17'!J7","v":0.98},{"$f":"'Décembre 17'!J7","v":0.63},{"$f":"'Janvier 18'!$J$7","v":0.86},{"$f":"'Février 18'!$J$7","v":42},{"$f":"'Mars 18'!$J$7","v":0.92}]
["Humidité   ext. Maxi(%)",{"$f":"'Juillet 17'!J8","v":0.99},{"$f":"'Aout 17'!J8","v":0.97},{"$f":"'Septembre 17'!J8","v":0.99},{"$f":"'Octobre 17'!J8","v":0.99},{"$f":"'Novembre 17'!J8","v":0.96},{"$f":"'Décembre 17'!J8","v":0.91},{"$f":"'Janvier 18'!$J$8","v":0.89},{"$f":"'Février 18'!$J$8","v":90},{"$f":"'Mars 18'!$J$8","v":89}]
["T°   Mini  ext. (°C)",{"$f":"'Juillet 17'!$H$7","v":19.3},{"$f":"'Aout 17'!$H$7","v":15.8},{"$f":"'Septembre 17'!$H$7","v":16.8},{"$f":"'Octobre 17'!$H$7","v":15.8},{"$f":"'Novembre 17'!$H$7","v":9.6},{"$f":"'Décembre 17'!$H$7","v":6.9},{"$f":"'Janvier 18'!$H$7","v":6.5},{"$f":"'Février 18'!$H$7","v":3.4},{"$f":"'Mars 18'!$H$7","v":4.0999999999999996}]
["T°  Maxi  ext.  (°C)",{"$f":"'Juillet 17'!$H$8","v":39.5},{"$f":"'Aout 17'!$H$8","v":33.4},{"$f":"'Septembre 17'!$H$8","v":26},{"$f":"'Octobre 17'!$H$8","v":26},{"$f":"'Novembre 17'!$H$8","v":20.399999999999999},{"$f":"'Décembre 17'!$H$8","v":17.600000000000001},{"$f":"'Janvier 18'!$H$8","v":15.3},{"$f":"'Février 18'!$H$8","v":15},{"$f":"'Mars 18'!$H$8","v":18.8}]
["Press. relative Mini (hpa)",{"$f":"'Juillet 17'!$L$7","v":1010.4},{"$f":"'Aout 17'!$L$7","v":1012.6},{"$f":"'Septembre 17'!$L$7","v":1002.9},{"$f":"'Octobre 17'!$L$7","v":1006.3},{"$f":"'Novembre 17'!$L$7","v":1006},{"$f":"'Décembre 17'!$L$7","v":999.6},{"$f":"'Janvier 18'!$L$7","v":999.4},{"$f":"'Février 18'!$L$7","v":1007.8},{"$f":"'Mars 18'!$L$7","v":985.1}]
["Press. relative Maxi (hpa)",{"$f":"'Juillet 17'!$L$8","v":1039.2},{"$f":"'Aout 17'!$L$8","v":1024.2},{"$f":"'Septembre 17'!$L$8","v":1023.7},{"$f":"'Octobre 17'!$L$8","v":1032.8},{"$f":"'Novembre 17'!$L$8","v":1028.4000000000001},{"$f":"'Décembre 17'!$L$8","v":1038.5},{"$f":"'Janvier 18'!$L$8","v":1036.2},{"$f":"'Février 18'!$L$8","v":1025.3},{"$f":"'Mars 18'!$L$8","v":1031.4000000000001}]
["Vit. Min. du vent  (km/h)",{"$f":"'Juillet 17'!$N$7","v":0},{"$f":"'Aout 17'!$N$7","v":0},{"$f":"'Septembre 17'!$N$7","v":0},{"$f":"'Octobre 17'!$N$7","v":0},{"$f":"'Novembre 17'!$N$7","v":0},{"$f":"'Décembre 17'!$N$7","v":0},{"$f":"'Janvier 18'!$N$7","v":0},{"$f":"'Février 18'!$N$7","v":0},{"$f":"'Mars 18'!$N$7","v":0}]
["Vit. Max. du vent  (km/h)",{"$f":"'Juillet 17'!$N$8","v":3.6},{"$f":"'Aout 17'!$N$8","v":2.5},{"$f":"'Septembre 17'!$N$8","v":1.1000000000000001},{"$f":"'Octobre 17'!$N$8","v":2.5},{"$f":"'Novembre 17'!$N$8","v":1.1000000000000001},{"$f":"'Décembre 17'!$N$8","v":6.1},{"$f":"'Janvier 18'!$N$8","v":5},{"$f":"'Février 18'!$N$8","v":3.6},{"$f":"'Mars 18'!$N$8","v":2.5}]
["Rafale  Mini (km/h)",{"$f":"'Juillet 17'!$R$7","v":0},{"$f":"'Aout 17'!$R$7","v":0},{"$f":"'Septembre 17'!$R$7","v":0},{"$f":"'Octobre 17'!$R$7","v":0},{"$f":"'Novembre 17'!$R$7","v":0},{"$f":"'Décembre 17'!$R$7","v":0},{"$f":"'Janvier 18'!$R$7","v":0},{"$f":"'Février 18'!$R$7","v":0},{"$f":"'Mars 18'!$R$7","v":0}]
["Rafale  Maxi   (km/h)",{"$f":"'Juillet 17'!$R$8","v":5},{"$f":"'Aout 17'!$R$8","v":3.6},{"$f":"'Septembre 17'!$R$8","v":2.5},{"$f":"'Octobre 17'!$R$8","v":3.6},{"$f":"'Novembre 17'!$R$8","v":3.6},{"$f":"'Décembre 17'!$R$8","v":9.6999999999999993},{"$f":"'Janvier 18'!$R$8","v":7.2},{"$f":"'Février 18'!$R$8","v":5},{"$f":"'Mars 18'!$R$8","v":2.5}]
["Direction   Mini du vent",{"$f":"'Juillet 17'!$W$7","v":"NNE"},{"$f":"'Aout 17'!$W$7","v":"NNE"},{"$f":"'Septembre 17'!$W$7","v":"NNE"},{"$f":"'Octobre 17'!$W$7","v":"NNE"},{"$f":"'Novembre 17'!$W$7","v":"NNE"},{"$f":"'Décembre 17'!$W$7","v":"ENE"},{"$f":"'Janvier 18'!$W$7","v":"N"},{"$f":"'Février 18'!$W$7","v":"NNE"},{"$f":"'Mars 18'!$W$7","v":"NNE"}]
["Direction   Maxi du vent",{"$f":"'Juillet 17'!$W$8","v":"NO"},{"$f":"'Aout 17'!$W$8","v":"N"},{"$f":"'Septembre 17'!$W$8","v":"EST"},{"$f":"'Octobre 17'!$W$8","v":"EST"},{"$f":"'Novembre 17'!$W$8","v":"NO"},{"$f":"'Décembre 17'!$W$8","v":"EST"},{"$f":"'Janvier 18'!$W$8","v":"EST"},{"$f":"'Février 18'!$W$8","v":"NO"},{"$f":"'Mars 18'!$W$8","v":"NO"}]
["Précipi. Mini dern. 24 h  (mm)",{"$f":"'Juillet 17'!$Y$7","v":0},{"$f":"'Aout 17'!$Y$7","v":0},{"$f":"'Septembre 17'!$Y$7","v":0},{"$f":"'Octobre 17'!$Y$7","v":0},{"$f":"'Novembre 17'!$Y$7","v":0},{"$f":"'Décembre 17'!$Y$7","v":0},{"$f":"'Janvier 18'!$Y$7","v":0},{"$f":"'Février 18'!$Y$7","v":0},{"$f":"'Mars 18'!$Y$7","v":0}]
["Précipi. Maxi dern. 24 h  (mm)",{"$f":"'Juillet 17'!$Y$8","v":12.3},{"$f":"'Aout 17'!$Y$8","v":18.3},{"$f":"'Septembre 17'!$Y$8","v":13.8},{"$f":"'Octobre 17'!$Y$8","v":10.8},{"$f":"'Novembre 17'!$Y$8","v":13.5},{"$f":"'Décembre 17'!$Y$8","v":29.4},{"$f":"'Janvier 18'!$Y$8","v":21},{"$f":"'Février 18'!$Y$8","v":15},{"$f":"'Mars 18'!$Y$8","v":11.4}]
["Précipi. Tot. mois (mm)",{"$f":"'Juillet 17'!$Z$8","v":52.79999999999999},{"$f":"'Aout 17'!$Z$8","v":53.4},{"$f":"'Septembre 17'!$Z$8","v":74.999999999999986},{"$f":"'Octobre 17'!$Z$8","v":22.200000000000003},{"$f":"'Novembre 17'!$Z$8","v":66.600000000000009},{"$f":"'Décembre 17'!$Z$8","v":128.1},{"$f":"'Janvier 18'!$Z$8","v":70.19999999999996},{"$f":"'Février 18'!$Z$8","v":76.8},{"$f":"'Mars 18'!$Z$8","v":86.699999999999989}]
["Moyenne journalière des précipitations",{"$f":"'Juillet 17'!$Y$12","v":2.0307692307692302},{"$f":"'Aout 17'!$Y$12","v":2.8105263157894735},{"$f":"'Septembre 17'!$Y$12","v":2.5099999999999993},{"$f":"'Octobre 17'!$Y$12","v":0.74516129032258072},{"$f":"'Novembre 17'!$Y$12","v":2.2200000000000002},{"$f":"'Décembre 17'!$Y$12","v":3.3},{"$f":"'Janvier 18'!$Y$12","v":2.2645161290322569},{"$f":"'Février 18'!$Y$12","v":2.7428571428571429},{"$f":"'Mars 18'!$Y$12","v":3.1645161290322572}]
["Précipi. Tot. An (mm)",{"$f":"'Juillet 17'!$AA$8","v":52.8},{"$f":"'Aout 17'!$AA$8","v":154.19999999999999},{"$f":"'Septembre 17'!$AA$8","v":187.2},{"$f":"'Octobre 17'!$AA$8","v":210.3},{"$f":"'Novembre 17'!$AA$8","v":290.7},{"$f":"'Décembre 17'!$AA$8","v":418.8},{"$f":"'Janvier 18'!$AA$8","v":70.2},{"$f":"'Février 18'!$AA$8","v":147},{"$f":"'Mars 18'!$AA$8","v":245.1}]
["Lumière Mini(W/M2)",{"$f":"'Juillet 17'!$AB$7","v":0},{"$f":"'Aout 17'!$AB$7","v":0.43},{"$f":"'Septembre 17'!$AB$7","v":162.85},{"$f":"'Octobre 17'!$AB$7","v":59.58},{"$f":"'Novembre 17'!$AB$7","v":138.72},{"$f":"'Décembre 17'!$AB$7","v":62.38},{"$f":"'Janvier 18'!$AB$7","v":28.29},{"$f":"'Février 18'!$AB$7","v":66.849999999999994},{"$f":"'Mars 18'!$AB$7","v":71.55}]
["Lumière Maxi(W/M2)",{"$f":"'Juillet 17'!$AB$8","v":1086.75},{"$f":"'Aout 17'!$AB$8","v":1048.73},{"$f":"'Septembre 17'!$AB$8","v":853.43},{"$f":"'Octobre 17'!$AB$8","v":603.15},{"$f":"'Novembre 17'!$AB$8","v":457.89},{"$f":"'Décembre 17'!$AB$8","v":378.84},{"$f":"'Janvier 18'!$AB$8","v":435.46},{"$f":"'Février 18'!$AB$8","v":434.42},{"$f":"'Mars 18'!$AB$8","v":684.52}]
["Moyenne lumière",{"$f":"'Juillet 17'!$AB$12","v":785.56884615384604},{"$f":"'Aout 17'!$AB$12","v":717.25473684210533},{"$f":"'Septembre 17'!$AB$12","v":567.81000000000006},{"$f":"'Octobre 17'!$AB$12","v":379.21064516129036},{"$f":"'Novembre 17'!$AB$12","v":314.71466666666669},{"$f":"'Décembre 17'!$AB$12","v":203.67483870967746},{"$f":"'Janvier 18'!$AB$12","v":236.13935483870966},{"$f":"'Février 18'!$AB$12","v":311.29249999999996},{"$f":"'Mars 18'!$AB$12","v":469.65096774193546}]
["UVI Mini",{"$f":"'Juillet 17'!$AG$7","v":0},{"$f":"'Aout 17'!$AG$7","v":0},{"$f":"'Septembre 17'!$AG$7","v":3},{"$f":"'Octobre 17'!$AG$7","v":1},{"$f":"'Novembre 17'!$AG$7","v":2},{"$f":"'Décembre 17'!$AG$7","v":1},{"$f":"'Janvier 18'!$AG$7","v":1},{"$f":"'Février 18'!$AG$7","v":1},{"$f":"'Mars 18'!$AG$7","v":1}]
["UVI Maxi",{"$f":"'Juillet 17'!$AG$8","v":10},{"$f":"'Aout 17'!$AG$8","v":9},{"$f":"'Septembre 17'!$AG$8","v":8},{"$f":"'Octobre 17'!$AG$8","v":5},{"$f":"'Novembre 17'!$AG$8","v":3},{"$f":"'Décembre 17'!$AG$8","v":3},{"$f":"'Janvier 18'!$AG$8","v":3},{"$f":"'Février 18'!$AG$8","v":4},{"$f":"'Mars 18'!$AG$8","v":7}]

{"sheet":"Juillet 17","index":6,"n_rows":46,"n_cols":53,"rows_kept":46,"cut":false,"hidden":true,"merged":[[12,21,12,22],[12,35,12,38]]}
["Soleil","C","Ciel voilé","Rares éclaircies","Soleil Fortes averses","Variable",null,null,null,"Orageux","Soleil orage","Soleil averses orageuses","Pluies orageuses","Orage","Orage et grêles","Orage violent",null,null,null,null,null,null,null,null,null,null,null,null,null,null,null,null,null,null,null,null,null,null,null,null,null,null,30,51,299,700]
[null,1,2,0.03,4,5,null,null,null,null,18,19,20,21,22,23,null,null,null,null,null,null,null,null,null,null,null,null,null,null,null,null,null,null,null,null,null,null,null,null,null,null,null,null,null,null,null,null,null,null,{"$f":"COUNTIF($W$14:$W$46,AZ2)","v":6},"N",0]
["Nuageux & Brumeux","C","Brouillard dense","Brume ou Brouillard légé","Brume ou léger brouillard givrant","Nuageux","Couvert","Couvert rares averses",null,"Grèle & Neige","Giboulées","Grèles","Neiges","Fortes neiges",null,null,null,null,null,null,null,null,null,null,null,null,null,null,null,null,null,null,null,null,null,null,null,null,null,null,null,null,null,null,null,null,null,null,null,null,{"$f":"COUNTIF($W$14:$W$46,AZ3)","v":0},"NNE",23]
[null,6,7,0.08,9,10,11,12,null,null,24,25,26,27,null,null,null,null,null,null,null,null,null,null,null,null,null,null,null,null,null,null,null,null,null,null,null,null,null,null,null,null,null,null,null,null,null,null,null,null,1,"NE",45]
["Pluvieux","Pluies et éclaircies","Pluies éparses","Bruines","Averses ou fortes pluies","Pluies mélées de neige",null,null,null,null,null,null,null,null,null,null,null,null,null,null,null,null,null,null,null,null,null,null,null,null,null,null,null,null,null,null,null,null,null,null,null,null,null,null,null,null,null,null,null,null,0,"ENE",68]
[null,13,14,0.15,16,17,null,null,null,null,null,null,null,null,null,null,null,null,null,null,null,null,null,null,null,null,null,null,null,null,null,null,null,null,null,null,null,null,null,null,null,null,null,null,null,null,null,null,null,null,5,"EST",90]
[null,null,null,null,null,{"$f":"IF(F14=\"\",\"\",MIN(F14:F46))","v":9.6},null,{"$f":"IF(H14=\"\",\"\",MIN(H14:H46))","v":19.3},null,0.5,null,1010.4,null,0,null,8.6,null,0,null,12.2,null,{"$f":"VLOOKUP(W7,$AZ$2:$BA$17,2,FALSE)","v":23},{"$f":"W10","v":"NNE"},null,{"$f":"MIN(Y14:Y46)","v":0},null,null,0,null,null,null,null,0,null,null,null,null,null,null,null,null,null,null,null,null,null,null,null,null,null,0,"ESE",113]
[null,null,null,null,null,{"$f":"IF(F15=\"\",\"\",MAX(F14:F46))","v":22.4},null,{"$f":"IF(H15=\"\",\"\",MAX(H14:H46))","v":39.5},null,0.99,null,1039.2,null,3.6,null,20.9,null,5,null,30.6,null,{"$f":"VLOOKUP(W8,$AZ$2:$BA$17,2,FALSE)","v":315},{"$f":"W11","v":"NO"},null,{"$f":"MAX(Y14:Y46)","v":12.3},52.79999999999999,52.8,1086.75,null,null,null,null,10,null,null,null,null,null,null,null,null,null,null,null,null,null,null,null,null,null,6,"SE",135]
[null,null,null,null,null,null,null,null,null,null,null,null,null,null,null,null,null,null,null,null,null,null,null,null,null,null,null,null,null,null,null,null,null,null,null,null,null,null,null,null,null,null,null,null,null,null,null,null,null,null,0,"SSE",158]
[null,null,null,null,null,null,null,null,null,null,null,null,null,null,null,null,null,null,null,null,null,{"$f":"SMALL($AY$2:$AY$17,1)","v":0},{"$f":"VLOOKUP(V10,$AY$2:$AZ$17,2,FALSE)","v":"NNE"},null,null,{"$f":"MAX(Z14:Z46)","v":52.79999999999999},null,null,null,null,null,null,null,null,null,null,null,null,null,null,null,31,99,300,null,null,null,null,null,null,1,"S",180]
[null,null,null,null,null,{"$f":"IF(F14=\"\",\"\",MIN(F14:F46))","v":9.6},{"$f":"VLOOKUP(F11,F14:G46,2,FALSE)","v":"02:48:33"},{"$f":"IF(H14=\"\",\"\",MAX(H14:H46))","v":39.5},{"$f":"VLOOKUP(H11,H14:I46,2,FALSE)","v":"16:34:24"},null,null,null,null,null,null,null,null,null,null,null,null,{"$f":"LARGE($AY$2:$AY$17,1)","v":7},{"$f":"VLOOKUP(V11,$AY$2:$AZ$17,2,FALSE)","v":"NO"},null,null,null,null,null,null,null,null,null,null,null,null,null,null,null,null,null,null,49,100,301,null,null,null,null,null,null,0,"SSO",203]
["Moyenne Mensuelle",{"$f":"AVERAGE(B14:B46)","v":25.746153846153849},null,{"$f":"AVERAGE(D14:D46)","v":0.66769230769230781},null,{"$f":"AVERAGE(F14:F46)","v":13.873076923076923},null,{"$f":"AVERAGE(H14:H46)","v":26.261538461538464},null,{"$f":"AVERAGE(J14:J46)","v":0.89576923076923065},null,{"$f":"AVERAGE(L14:L46)","v":1025.2769230769231},null,{"$f":"AVERAGE(N14:N46)","v":0.27692307692307694},null,null,null,{"$f":"AVERAGE(R14:R46)","v":0.46923076923076923},null,null,null,null,"SE","09:30:45",{"$f":"AVERAGE(Y14:Y44)","v":2.0307692307692302},{"$f":"AVERAGE(Z14:Z46)","v":25.073076923076922},null,{"$f":"AVERAGE(AB14:AB46)","v":785.56884615384604},null,null,null,null,{"$f":"AVERAGE(AG14:AG46)","v":7.884615384615385},null,null,null,null,null,null,null,null,50,101,699,null,null,null,null,null,null,0,"SO",225]
["Jour","T°               int.    (°C)","Heure","Hum              int.       (%)","Heure","T°              Mini                 ext.    (°C)","Heure","T°               Maxi                     ext.    (°C)","Heure","Hum           ext.      (%)","Heure","Press.         rel.        (hpa)","Heure","Vit. du vent    (km/h)","Heure","Vit. du vent    (km/h)","Heure","Rafale  Min        (km/h)","Heure","Rafale    Max      (km/h)","Heure","Direction                      du vent",null,"Heure","Précipi. dern. 24 h        (mm)","Précipi. Tot. mois          (mm)","Précipi. Tot. An        (mm)","Lumière (W/M2)",null,null,null,null,"UVI","Heure",null,"Intensité des UV",null,null,null,null,null,null,null,null,null,null,null,null,null,null,0,"OSO",248]
["2017-07-06",27.7,"16:26:24",0.69,"23:43:23",22.4,"09:39:33",39.5,"16:34:24",0.5,"18:48:24",1028.5999999999999,"23:29:23",1.1000000000000001,"11:26:23",9.6999999999999993,"12:06:23",2.5,"11:26:23",13.3,"09:41:09",{"$f":"IF(W14=\"N\",0,IF(W14=\"NNE\",23,IF(W14=\"NE\",45,IF(W14=\"ENE\",68,IF(W14=\"EST\",90,IF(W14=\"ESE\",113,IF(W14=\"SE\",135,IF(W14=\"SSE\",158,IF(W14=\"S\",180,IF(W14=\"SSO\",203,IF(W14=\"SO\",225,IF(W14=\"OSO\",248,IF(W14=\"O\",270,IF(W14=\"ONO\",293,IF(W14=\"NO\",315,IF(W14=\"NNO\",338,\"\"))))))))))))))))","v":135},"SE","14:22:24",3.6,{"$f":"Y14","v":3.6},{"$f":"IF(W14=\"\",\"\",'Feuille Max Mini'!U29)","v":0},{"$f":"'Feuille Max Mini'!W29","v":0},13,null,{"$f":"IF(AC14=\"\",\"\",VLOOKUP(AC14,List!$B$2:$E$29,4,FALSE))","v":"Pluies et éclaircies"},null,{"$f":"'Feuille Max Mini'!AB29","v":0},{"$f":"IF(AG14=\"\",\"\",INDEX('Feuille Max Mini'!$D$23:$D$5418,MATCH(AG14,'Feuille Max Mini'!AB31:AB5426,0)))","v":"00:00:00"},null,"FAIBLE","<2",null,null,null,"Soleil","C","Ciel voilé","Rares éclaircies","Soleil Fortes averses","Variable",0,0,null,null,0,"O",270]
[{"$f":"IF(B15=\"\",\"\",A14+1)","v":"2017-07-07"},27.9,"15:13:34",0.68,"09:37:23",15.3,"23:56:15",30.7,"15:51:27",0.8,"23:52:15",1032.3,"15:11:34",0,"20:57:03",15.8,"15:57:51",0,"23:29:03",19.399999999999999,"15:57:51",315,"NO","15:19:43",0,{"$f":"IF(Y15=\"\",\"\",Y15+Z14)","v":3.6},3.6,886.84,1,null,{"$f":"IF(AC15=\"\",\"\",VLOOKUP(AC15,List!$B$2:$E$29,4,FALSE))","v":"Ciel dégagé"},{"$f":"IF(AC15=\"\",\"\",)","v":0},9,"00:03:23",null,"MODEREE",3,"à",5,null,null,null,null,null,null,null,null,null,null,null,0,"ONO",293]
[{"$f":"IF(B16=\"\",\"\",A15+1)","v":"2017-07-08"},31.8,"15:14:23",0.63,"08:48:15",12.9,"02:21:51",30.5,"14:50:39",0.99,"06:35:27",1034.4000000000001,"09:45:19",0,"00:00:31",17.3,"16:53:51",0,"00:00:31",20.9,"15:18:39",0,"N","08:25:03",2.7,6.3000000000000007,6.3,1027.46,4,null,{"$f":"IF(AC16=\"\",\"\",VLOOKUP(AC16,List!$B$2:$E$29,4,FALSE))","v":"Soleil nuageux et averses"},"Averses ou fortes pluies",10,"13:02:23",null,"FORTE",6,"à",7,null,"Nuageux & Brumeux","C","Brouillard dense","Brume ou Brouillard légé","Brume ou léger brouillard givrant","Nuageux","Couvert","Couvert rares averses",null,null,7,"NO",315]
["2017-07-09",26.4,"15:03:12",0.64,"02:05:19",14.1,"06:19:27",30.6,"16:10:40",0.99,"06:52:15",1029.3,"00:03:27",0,"00:00:31",15.8,"14:11:28",0,"00:00:31",22,"14:10:40",0,"N","02:59:27",0,6.3000000000000007,6.3,1071.47,1,null,{"$f":"IF(AC17=\"\",\"\",VLOOKUP(AC17,List!$B$2:$E$29,4,FALSE))","v":"Ciel dégagé"},"Pluies et éclaircies",10,"13:43:12",null,"TRES FORTE",8,"à",10,null,null,null,null,null,null,null,null,null,null,null,0,"NNO",338]
["2017-07-10",27.9,"15:33:20",0.64,"01:16:49",14.6,"07:27:29",28.3,"15:23:28",0.92,"05:54:41",1026.7,"08:48:17",0,"00:00:17",14.8,"15:39:28",0,"00:02:41",19.399999999999999,"15:38:40",315,"NO","00:14:41",0.6,6.9,6.9,1051.79,4,null,{"$f":"IF(AC18=\"\",\"\",VLOOKUP(AC18,List!$B$2:$E$29,4,FALSE))","v":"Soleil nuageux et averses"},"C",10,"12:23:11",null,"EXTREME","11+",null,null,null,"Pluvieux","Pluies et éclaircies","Pluies éparses","Bruines","Averses ou fortes pluies","Pluies mélées de neige"]
["2017-07-11",25.1,"12:03:30",0.63,"08:33:30",12.3,"06:33:30",21.2,"13:03:30",0.95,"22:33:31",1026.5999999999999,"08:48:30",0,"00:48:30",15.8,"17:03:31",0,"01:18:30",19.399999999999999,"17:03:31",135,"SE","19:03:31",0.3,7.2,7.2,348.64,4,null,{"$f":"IF(AC19=\"\",\"\",VLOOKUP(AC19,List!$B$2:$E$29,4,FALSE))","v":"Soleil nuageux et averses"},"C",5,"12:03:30"]
["2017-07-12",26.1,"15:33:31",0.66,"20:48:31",16.5,"06:33:31",24,"15:18:31",0.94,"04:03:31",1032.7,"23:48:31",0,"22:33:31",9.6999999999999993,"14:33:31",0,"22:33:31",13.3,"14:33:31",315,"NO","16:33:31",0.3,7.5,7.5,566.67999999999995,13,null,{"$f":"IF(AC20=\"\",\"\",VLOOKUP(AC20,List!$B$2:$E$29,4,FALSE))","v":"Pluies et éclaircies"},"C",8,"14:33:31",null,null,null,null,null,null,"Orageux","Soleil orage","Soleil averses orageuses","Pluies orageuses","Orage","Orage et grêles","Orage violent"]
["2017-07-13",26.3,"15:33:31",0.68,"01:48:31",12.5,"00:00:00",27.1,"14:03:31",0.99,"05:48:31",1034.0999999999999,"09:03:31",0,"00:18:31",14.8,"15:48:31",0,"00:18:31",19.399999999999999,"18:33:31",315,"NO","11:03:31",0,7.5,7.5,954.91,1,null,{"$f":"IF(AC21=\"\",\"\",VLOOKUP(AC21,List!$B$2:$E$29,4,FALSE))","v":"Ciel dégagé"},"Averses ou fortes pluies",9,"13:33:31"]
["2017-07-14",23.5,"11:03:31",0.66,"03:18:31",11.4,"00:48:31",24.9,"16:18:31",0.94,"01:18:31",1036.8,"00:00:00",0,"00:18:31",17.3,"17:18:31",0,"00:18:31",22,"17:18:31",315,"NO","13:18:31",0,7.5,7.5,942.61,1,null,{"$f":"IF(AC22=\"\",\"\",VLOOKUP(AC22,List!$B$2:$E$29,4,FALSE))","v":"Ciel dégagé"},"Pluies et éclaircies",9,"15:48:31",null,null,null,null,null,null,"Grèle & Neige","Giboulées","Grèles","Neiges","Fortes neiges",0,0]
["2017-07-15",23.2,"16:18:31",0.67,"07:48:31",10.7,"02:48:31",29.6,"15:03:31",0.95,"05:48:31",1038.5,"09:48:31",0,"00:18:31",12.2,"15:48:31",0,"00:18:31",15.8,"15:48:31",0,"N","11:03:31",0,7.5,7.5,898.17,1,null,{"$f":"IF(AC23=\"\",\"\",VLOOKUP(AC23,List!$B$2:$E$29,4,FALSE))","v":"Ciel dégagé"},"Pluies éparses",9,"13:03:31"]
["2017-07-16",23.7,"19:33:31",0.68,"21:33:37",10.6,"04:33:31",26.7,"16:48:31",0.99,"07:48:31",1039.2,"10:03:31",0,"00:18:31",14.8,"20:33:31",0,"00:18:31",20.9,"19:48:31",0,"N","14:03:31",0,7.5,7.5,436.55,5,null,{"$f":"IF(AC24=\"\",\"\",VLOOKUP(AC24,List!$B$2:$E$29,4,FALSE))","v":"Variable"},"Pluies et éclaircies",5,"15:33:31",null,null,null,null,null,null,"Temps de nuit","Ciel dégagé de nuit","Ciel voilé de nuit","Brume ou brouillard léger de nuit","Brume ou léger brouillard givrant de nuit ","Brouillard dense de nuit","Ciel nuageux avec éclaircies de nuit"]
["2017-07-17",25.8,"22:18:32",0.7,"10:18:37",15.3,"00:18:37",29.7,"16:48:32",0.99,"04:33:37",1036.2,"00:18:37",0,"02:18:37",14.8,"18:33:32",0,"23:18:32",18.399999999999999,"18:03:32",0,"N","03:03:37",0,7.5,7.5,993.66,1,null,{"$f":"IF(AC25=\"\",\"\",VLOOKUP(AC25,List!$B$2:$E$29,4,FALSE))","v":"Ciel dégagé"},"C",10,"14:03:32"]
["2017-07-18",27.6,"17:03:34",0.7,"14:03:34",14.4,"06:18:32",30.7,"11:48:32",0.99,"08:18:32",1028.7,"00:18:32",0,"00:18:32",11.2,"13:48:34",0,"00:18:32",15.8,"13:48:34",45,"NE","19:33:34",11.7,19.2,19.2,545.88,16,null,{"$f":"IF(AC26=\"\",\"\",VLOOKUP(AC26,List!$B$2:$E$29,4,FALSE))","v":"Averses ou fortes pluies"},null,5,"11:03:32"]
["2017-07-19",27.2,"12:48:34",0.69,"00:18:34",18.3,"00:00:00",23.2,"17:48:34",0.91,"00:33:34",1021.1,"12:18:34",3.6,"00:18:34",9.6999999999999993,"00:48:34",5,"05:18:34",15.8,"09:48:34",135,"SE","07:18:34",0,19.2,19.2,377.41,5,null,{"$f":"IF(AC27=\"\",\"\",VLOOKUP(AC27,List!$B$2:$E$29,4,FALSE))","v":"Variable"},null,4,"12:18:34"]
["2017-07-20",25.4,"15:33:33",0.68,"01:33:34",12.7,"00:00:00",23.5,"14:48:33",0.91,"03:03:34",1026.7,"14:03:33",0,"21:33:33",9.6999999999999993,"01:33:34",0,"22:03:33",13.3,"01:33:34",90,"EST","18:18:33",0,19.2,19.2,954.29,1,null,{"$f":"IF(AC28=\"\",\"\",VLOOKUP(AC28,List!$B$2:$E$29,4,FALSE))","v":"Ciel dégagé"},null,10,"14:03:33"]
["2017-07-21",25.7,"15:18:32",0.64,"07:48:33",9.6,"02:48:33",22.6,"15:18:32",0.95,"22:03:32",1025.5999999999999,"00:18:33",0,"00:18:33",20.9,"15:03:32",0,"00:18:33",30.6,"15:33:32",180,"S","01:48:33",12.3,31.5,31.5,869.01,16,null,{"$f":"IF(AC29=\"\",\"\",VLOOKUP(AC29,List!$B$2:$E$29,4,FALSE))","v":"Averses ou fortes pluies"},null,9,"14:33:32"]
["2017-07-22",24.5,"14:48:33",0.65,"03:48:32",10.7,"02:33:32",19.3,"18:03:33",0.99,"01:03:32",1024.9000000000001,"00:00:00",0,"00:18:32",14.8,"16:33:33",0,"00:18:32",18.399999999999999,"16:33:33",90,"EST","16:33:33",4.8,36.299999999999997,36.299999999999997,929.38,5,null,{"$f":"IF(AC30=\"\",\"\",VLOOKUP(AC30,List!$B$2:$E$29,4,FALSE))","v":"Variable"},null,9,"14:33:33"]
["2017-07-23",22.1,"11:03:34",0.7,"20:58:54",11.8,"06:18:34",20,"11:03:34",0.99,"00:00:00",1029.4000000000001,"09:33:34",0,"15:08:54",8.6,"09:48:34",0,"19:13:54",12.2,"12:23:54",90,"EST","17:58:54",7.5,43.8,43.8,411.72,16,null,{"$f":"IF(AC31=\"\",\"\",VLOOKUP(AC31,List!$B$2:$E$29,4,FALSE))","v":"Averses ou fortes pluies"},null,5,"11:03:34"]
["2017-07-24",23.3,"15:58:54",0.67,"00:00:00",11.8,"02:38:54",25.7,"16:08:54",0.84,"00:00:00",1017.3,"23:43:54",0,"00:08:54",20.9,"17:53:54",0,"00:08:54",27,"17:53:54",315,"NO","10:13:54",0.3,44.099999999999994,44.1,969.8,5,null,{"$f":"IF(AC32=\"\",\"\",VLOOKUP(AC32,List!$B$2:$E$29,4,FALSE))","v":"Variable"},null,9,"13:23:53"]
["2017-07-25",25.8,"16:13:55",0.69,"00:00:00",14.5,"03:38:54",28.8,"16:48:55",0.82,"00:00:00",1017.5,"09:18:54",0,"00:13:54",14.8,"14:28:55",0,"00:18:54",19.399999999999999,"14:28:55",315,"NO","05:23:54",0,44.099999999999994,44.1,979.23,1,null,{"$f":"IF(AC33=\"\",\"\",VLOOKUP(AC33,List!$B$2:$E$29,4,FALSE))","v":"Ciel dégagé"},null,9,"13:23:54"]
["2017-07-26",25.5,"16:18:57",0.72,"00:00:00",16.5,"05:08:55",22.1,"16:23:57",0.91,"00:00:00",1012.6,"00:13:55",0,"00:08:55",12.2,"17:58:57",0,"00:13:55",15.8,"15:28:57",135,"SE","13:28:57",8.4,52.499999999999993,52.5,389.56,16,null,{"$f":"IF(AC34=\"\",\"\",VLOOKUP(AC34,List!$B$2:$E$29,4,FALSE))","v":"Averses ou fortes pluies"},null,6,"12:33:57"]
["2017-07-27",25.5,"15:03:55",0.63,"00:00:00",13.8,"04:43:57",24.5,"15:03:55",0.74,"00:00:00",1010.5,"10:03:57",0,"00:08:57",12.2,"17:03:55",0,"01:33:57",17.3,"16:48:55",135,"SE","00:18:57",0,52.499999999999993,52.5,1086.75,1,null,{"$f":"IF(AC35=\"\",\"\",VLOOKUP(AC35,List!$B$2:$E$29,4,FALSE))","v":"Ciel dégagé"},null,9,"15:03:55"]
["2017-07-28",24.1,"14:38:56",0.64,"00:00:00",15.2,"01:43:55",22.5,"14:38:56",0.79,"00:00:00",1013.2,"09:28:56",0,"01:23:55",17.3,"18:13:56",1.1000000000000001,"01:23:55",23.4,"17:33:56",90,"EST","21:58:56",0,52.499999999999993,52.5,635.02,1,null,{"$f":"IF(AC36=\"\",\"\",VLOOKUP(AC36,List!$B$2:$E$29,4,FALSE))","v":"Ciel dégagé"},null,8,"13:48:56"]
["2017-07-29",28.7,"15:18:56",0.67,"00:00:00",18,"03:23:56",26.1,"13:38:56",0.82,"00:00:00",1010.8,"08:53:56",2.5,"02:33:56",17.3,"15:03:56",3.6,"22:13:56",25.6,"15:03:56",135,"SE","01:08:56",0,52.499999999999993,52.5,1039.8,1,null,{"$f":"IF(AC37=\"\",\"\",VLOOKUP(AC37,List!$B$2:$E$29,4,FALSE))","v":"Ciel dégagé"},null,9,"14:08:56"]
["2017-07-30",23.9,"18:58:56",0.63,"00:00:00",14.5,"07:48:56",24.2,"13:13:56",0.81,"00:00:00",1010.4,"00:00:00",0,"07:28:56",15.8,"02:38:56",0,"00:00:00",23.4,"00:18:56",90,"EST","06:18:56",0.3,52.79999999999999,52.8,1049.5,1,null,{"$f":"IF(AC38=\"\",\"\",VLOOKUP(AC38,List!$B$2:$E$29,4,FALSE))","v":"Ciel dégagé"},null,10,"13:28:56"]
["2017-07-31",24.7,"14:48:57",0.69,"00:00:00",10.3,"05:28:57",26.8,"15:38:57",0.87,"00:00:00",1013.1,"10:28:57",0,"00:08:57",12.2,"18:08:57",0,"00:08:57",14.8,"17:43:57",0,"N","14:33:57",0,52.79999999999999,52.8,1008.66,1,null,{"$f":"IF(AC39=\"\",\"\",VLOOKUP(AC39,List!$B$2:$E$29,4,FALSE))","v":"Ciel dégagé"},null,9,"13:13:57"]
["",null,null,null,null,null,null,null,null,null,null,null,null,null,null,null,null,null,null,null,null,"",null,null,null,"",null,null,null,null,{"$f":"IF(AC40=\"\",\"\",VLOOKUP(AC40,List!$B$2:$E$29,4,FALSE))","v":""}]
["",null,null,null,null,null,null,null,null,null,null,null,null,null,null,null,null,null,null,null,null,"",null,null,null,"",null,null,null,null,{"$f":"IF(AC41=\"\",\"\",VLOOKUP(AC41,List!$B$2:$E$29,4,FALSE))","v":""}]
["",null,null,null,null,null,null,null,null,null,null,null,null,null,null,null,null,null,null,null,null,"",null,null,null,"",null,null,null,null,{"$f":"IF(AC42=\"\",\"\",VLOOKUP(AC42,List!$B$2:$E$29,4,FALSE))","v":""}]
["",null,null,null,null,null,null,null,null,null,null,null,null,null,null,null,null,null,null,null,null,"",null,null,null,"",null,null,null,null,{"$f":"IF(AC43=\"\",\"\",VLOOKUP(AC43,List!$B$2:$E$29,4,FALSE))","v":""}]
["",null,null,null,null,null,null,null,null,null,null,null,null,null,null,null,null,null,null,null,null,"",null,null,null,"",null,null,null,null,{"$f":"IF(AC44=\"\",\"\",VLOOKUP(AC44,List!$B$2:$E$29,4,FALSE))","v":""}]
["",null,null,null,null,null,null,null,null,null,null,null,null,null,null,null,null,null,null,null,null,"",null,null,null,"",null,null,null,null,{"$f":"IF(AC45=\"\",\"\",VLOOKUP(AC45,List!$B$2:$E$29,4,FALSE))","v":""}]
["",null,null,null,null,null,null,null,null,null,null,null,null,null,null,null,null,null,null,null,null,"",null,null,null,"",null,null,null,null,{"$f":"IF(AC46=\"\",\"\",VLOOKUP(AC46,List!$B$2:$E$29,4,FALSE))","v":""}]

{"sheet":"Aout 17","index":7,"n_rows":46,"n_cols":53,"rows_kept":46,"cut":false,"hidden":true,"merged":[[12,21,12,22],[12,35,12,38]]}
["Soleil","C","Ciel voilé","Rares éclaircies","Soleil Fortes averses","Variable",null,null,null,"Orageux","Soleil orage","Soleil averses orageuses","Pluies orageuses","Orage","Orage et grêles","Orage violent",null,null,null,null,null,null,null,null,null,null,null,null,null,null,null,null,null,null,null,null,null,null,null,null,null,null,30,51,299,700]
[null,1,2,0.03,4,5,null,null,null,null,18,19,20,21,22,23,null,null,null,null,null,null,null,null,null,null,null,null,null,null,null,null,null,null,null,null,null,null,null,null,null,null,null,null,null,null,null,null,null,null,{"$f":"COUNTIF($W$14:$W$46,AZ2)","v":5},"N",0]
["Nuageux & Brumeux","C","Brouillard dense","Brume ou Brouillard légé","Brume ou léger brouillard givrant","Nuageux","Couvert","Couvert rares averses",null,"Grèle & Neige","Giboulées","Grèles","Neiges","Fortes neiges",null,null,null,null,null,null,null,null,null,null,null,null,null,null,null,null,null,null,null,null,null,null,null,null,null,null,null,null,null,null,null,null,null,null,null,null,{"$f":"COUNTIF($W$14:$W$46,AZ3)","v":0},"NNE",23]
[null,6,7,0.08,9,10,11,12,null,null,24,25,26,27,null,null,null,null,null,null,null,null,null,null,null,null,null,null,null,null,null,null,null,null,null,null,null,null,null,null,null,null,null,null,null,null,null,null,null,null,1,"NE",45]
["Pluvieux","Pluies et éclaircies","Pluies éparses","Bruines","Averses ou fortes pluies","Pluies mélées de neige",null,null,null,null,null,null,null,null,null,null,null,null,null,null,null,null,null,null,null,null,null,null,null,null,null,null,null,null,null,null,null,null,null,null,null,null,null,null,null,null,null,null,null,null,0,"ENE",68]
[null,13,14,0.15,16,17,null,null,null,null,null,null,null,null,null,null,null,null,null,null,null,null,null,null,null,null,null,null,null,null,null,null,null,null,null,null,null,null,null,null,null,null,null,null,null,null,null,null,null,null,5,"EST",90]
[null,null,null,{"$f":"IF(D14=\"\",\"\",MIN(D14:D46))","v":0.63},null,{"$f":"IF(F14=\"\",\"\",MIN(F14:F46))","v":5.5},null,{"$f":"IF(H14=\"\",\"\",MIN(H14:H46))","v":15.8},null,0.83,null,1012.6,null,0,null,5,null,0,null,9.6999999999999993,null,{"$f":"VLOOKUP(W7,$AZ$2:$BA$17,2,FALSE)","v":23},{"$f":"W10","v":"NNE"},null,{"$f":"MIN(Y14:Y46)","v":0},null,null,0.43,null,null,null,null,0,null,null,null,null,null,null,null,null,null,null,null,null,null,null,null,null,null,0,"ESE",113]
[null,null,null,{"$f":"IF(D15=\"\",\"\",MAX(D14:D46))","v":0.71},null,{"$f":"IF(F15=\"\",\"\",MAX(F14:F46))","v":16.8},null,{"$f":"IF(H15=\"\",\"\",MAX(H14:H46))","v":33.4},null,0.97,null,1024.2,null,2.5,null,22,null,3.6,null,33.1,null,{"$f":"VLOOKUP(W8,$AZ$2:$BA$17,2,FALSE)","v":0},{"$f":"W11","v":"N"},null,{"$f":"MAX(Y14:Y46)","v":18.3},53.4,154.19999999999999,1048.73,null,null,null,null,9,null,null,null,null,null,null,null,null,null,null,null,null,null,null,null,null,null,4,"SE",135]
[null,null,null,null,null,null,null,null,null,null,null,null,null,null,null,null,null,null,null,null,null,null,null,null,null,null,null,null,null,null,null,null,null,null,null,null,null,null,null,null,null,null,null,null,null,null,null,null,null,null,0,"SSE",158]
[null,null,null,null,null,null,null,null,null,null,null,null,null,null,null,null,null,null,null,null,null,{"$f":"SMALL($AY$2:$AY$17,1)","v":0},{"$f":"VLOOKUP(V10,$AY$2:$AZ$17,2,FALSE)","v":"NNE"},null,null,{"$f":"MAX(Z14:Z46)","v":53.4},null,null,null,null,null,null,null,null,null,null,null,null,null,null,null,31,99,300,null,null,null,null,null,null,0,"S",180]
[null,null,null,null,null,{"$f":"IF(F14=\"\",\"\",MIN(F14:F46))","v":5.5},{"$f":"VLOOKUP(F11,F14:G46,2,FALSE)","v":"06:39:06"},{"$f":"IF(H14=\"\",\"\",MAX(H14:H46))","v":33.4},{"$f":"VLOOKUP(H11,H14:I46,2,FALSE)","v":"16:59:12"},null,null,null,null,null,null,null,null,null,null,null,null,{"$f":"LARGE($AY$2:$AY$17,1)","v":5},{"$f":"VLOOKUP(V11,$AY$2:$AZ$17,2,FALSE)","v":"N"},null,null,null,null,null,null,null,null,null,null,null,null,null,null,null,null,null,null,49,100,301,null,null,null,null,null,null,0,"SSO",203]
["Moyenne Mensuelle",{"$f":"AVERAGE(B14:B46)","v":26.410526315789472},null,{"$f":"AVERAGE(D14:D46)","v":0.67631578947368409},null,{"$f":"AVERAGE(F14:F46)","v":12.221052631578948},null,{"$f":"AVERAGE(H14:H46)","v":25.010526315789473},null,{"$f":"AVERAGE(J14:J46)","v":77.721578947368428},null,{"$f":"AVERAGE(L14:L46)","v":1017.094736842105},null,{"$f":"AVERAGE(N14:N46)","v":0.18947368421052632},null,null,null,{"$f":"AVERAGE(R14:R46)","v":0.32105263157894737},null,null,null,null,"SE","09:30:45",{"$f":"AVERAGE(Y14:Y44)","v":2.8105263157894735},{"$f":"AVERAGE(Z14:Z46)","v":24.315789473684209},null,{"$f":"AVERAGE(AB14:AB46)","v":717.25473684210533},null,null,null,null,{"$f":"AVERAGE(AG14:AG46)","v":6.6315789473684212},null,null,null,null,null,null,null,null,50,101,699,null,null,null,null,null,null,0,"SO",225]
["Jour","T°               int.    (°C)","Heure","Hum              int.       (%)","Heure","T°              Mini                 ext.    (°C)","Heure","T°               Maxi                     ext.    (°C)","Heure","Hum           ext.      (%)","Heure","Press.         rel.        (hpa)","Heure","Vit. du vent    (km/h)","Heure","Vit. du vent    (km/h)","Heure","Rafale  Min        (km/h)","Heure","Rafale    Max      (km/h)","Heure","Direction                      du vent",null,"Heure","Précipi. dern. 24 h        (mm)","Précipi. Tot. mois          (mm)","Précipi. Tot. An        (mm)","Lumière (W/M2)",null,null,null,null,"UVI","Heure",null,"Intensité des UV",null,null,null,null,null,null,null,null,null,null,null,null,null,null,0,"OSO",248]
["2017-08-01",24.7,"15:38:58",0.65,"00:00:00",9.5,"04:53:57",28.2,"13:18:57",76,"00:00:00",1014.8,"23:18:58",0,"00:08:57",7.2,"18:48:58",0,"00:08:57",11.2,"19:18:58",{"$f":"IF(W14=\"N\",0,IF(W14=\"NNE\",23,IF(W14=\"NE\",45,IF(W14=\"ENE\",68,IF(W14=\"EST\",90,IF(W14=\"ESE\",113,IF(W14=\"SE\",135,IF(W14=\"SSE\",158,IF(W14=\"S\",180,IF(W14=\"SSO\",203,IF(W14=\"SO\",225,IF(W14=\"OSO\",248,IF(W14=\"O\",270,IF(W14=\"ONO\",293,IF(W14=\"NO\",315,IF(W14=\"NNO\",338,\"\"))))))))))))))))","v":315},"NO","01:08:57",0,0,52.8,1039.53,1,null,{"$f":"IF(AC14=\"\",\"\",VLOOKUP(AC14,List!$B$2:$E$29,4,FALSE))","v":"Ciel dégagé"},null,9,"13:28:57",null,"FAIBLE","<2",null,null,null,"Soleil","C","Ciel voilé","Rares éclaircies","Soleil Fortes averses","Variable",0,0,null,null,0,"O",270]
[{"$f":"IF(B15=\"\",\"\",A14+1)","v":"2017-08-02"},25.4,"16:03:59",0.68,"00:00:00",14.4,"02:28:58",22.5,"15:53:59",94,"00:00:00",1015.1,"00:28:58",0,"00:33:58",22,"13:43:59",0,"00:43:58",33.1,"13:43:59",135,"SE","18:24:00",0.9,{"$f":"IF(Y15=\"\",\"\",Y15+Z14)","v":0.9},53.7,350.96,1,null,{"$f":"IF(AC15=\"\",\"\",VLOOKUP(AC15,List!$B$2:$E$29,4,FALSE))","v":"Ciel dégagé"},{"$f":"IF(AC15=\"\",\"\",)","v":0},4,"11:08:58",null,"MODEREE",3,"à",5,null,null,null,null,null,null,null,null,null,null,null,0,"ONO",293]
[{"$f":"IF(B16=\"\",\"\",A15+1)","v":"2017-08-03"},25.5,"15:34:02",0.67,"00:00:00",15.5,"06:59:00",23.2,"15:34:02",78,"00:00:00",1012.9,"10:09:00",2.5,"02:04:00",17.3,"15:54:02",3.6,"04:24:00",23.4,"15:54:02",135,"SE","06:54:00",1.2,2.1,54.9,611,5,null,{"$f":"IF(AC16=\"\",\"\",VLOOKUP(AC16,List!$B$2:$E$29,4,FALSE))","v":"Variable"},"Averses ou fortes pluies",7,"14:09:00",null,"FORTE",6,"à",7,null,"Nuageux & Brumeux","C","Brouillard dense","Brume ou Brouillard légé","Brume ou léger brouillard givrant","Nuageux","Couvert","Couvert rares averses",null,null,4,"NO",315]
["2017-08-04",24.5,"12:19:02",0.69,"00:00:00",16.100000000000001,"06:29:02",21.5,"14:49:04",86,"00:00:00",1014,"11:54:02",0,"06:09:02",7.2,"05:59:02",0,"18:44:04",9.6999999999999993,"05:59:02",135,"SE","03:29:02",0.3,2.4,55.2,464.7,5,null,{"$f":"IF(AC17=\"\",\"\",VLOOKUP(AC17,List!$B$2:$E$29,4,FALSE))","v":"Variable"},"Pluies et éclaircies",6,"14:34:04",null,"TRES FORTE",8,"à",10,null,null,null,null,null,null,null,null,null,null,null,0,"NNO",338]
["2017-08-05",22.4,"00:09:04",0.69,"00:00:00",10.6,"00:00:00",25.1,"14:44:06",90,"00:00:00",1021.8,"23:59:06",0,"00:09:04",17.3,"16:44:06",0,"00:09:04",20.9,"14:14:06",0,"N","03:59:04",0,2.4,55.2,1048.73,1,null,{"$f":"IF(AC18=\"\",\"\",VLOOKUP(AC18,List!$B$2:$E$29,4,FALSE))","v":"Ciel dégagé"},"C",9,"13:44:06",null,"EXTREME","11+",null,null,null,"Pluvieux","Pluies et éclaircies","Pluies éparses","Bruines","Averses ou fortes pluies","Pluies mélées de neige"]
["2017-08-06",21.6,"16:19:06",0.68,"00:00:00",6.4,"07:19:06",26,"14:54:06",89,"00:00:00",1024.2,"10:29:06",0,"00:09:06",11.2,"18:59:06",0,"00:09:06",14.8,"18:14:06",315,"NO","10:49:06",0,2.4,55.2,994.7,1,null,{"$f":"IF(AC19=\"\",\"\",VLOOKUP(AC19,List!$B$2:$E$29,4,FALSE))","v":"Ciel dégagé"},"C",9,"13:24:06"]
["2017-08-07",24.4,"16:29:03",0.63,"00:00:00",5.5,"06:39:06",26.7,"15:49:03",81,"00:00:00",1020.5,"00:09:06",0,"00:09:06",14.8,"17:34:03",0,"00:09:06",19.399999999999999,"17:34:03",0,"N","13:44:03",0,2.4,55.2,1038.95,1,null,{"$f":"IF(AC20=\"\",\"\",VLOOKUP(AC20,List!$B$2:$E$29,4,FALSE))","v":"Ciel dégagé"},"C",9,"14:14:03",null,null,null,null,null,null,"Orageux","Soleil orage","Soleil averses orageuses","Pluies orageuses","Orage","Orage et grêles","Orage violent"]
["2017-08-08",24.3,"15:49:02",0.67,"00:00:00",12.7,"00:00:00",21.7,"16:44:02",92,"00:00:00",1012.6,"10:49:03",0,"00:09:03",5,"11:54:02",0,"00:09:03",9.6999999999999993,"12:04:02",315,"NO","09:44:03",18.3,20.7,73.5,841.13,16,null,{"$f":"IF(AC21=\"\",\"\",VLOOKUP(AC21,List!$B$2:$E$29,4,FALSE))","v":"Averses ou fortes pluies"},"Averses ou fortes pluies",7,"11:39:03"]
["2017-08-09",23.6,"12:44:05",0.7,"00:00:00",8.5,"07:19:02",22.7,"11:29:05",97,"00:00:00",1018.2,"23:59:01",0,"00:09:02",11.2,"19:24:01",0,"00:19:02",15.8,"12:19:05",135,"SE","12:19:05",16.2,36.9,89.7,702.55,16,null,{"$f":"IF(AC22=\"\",\"\",VLOOKUP(AC22,List!$B$2:$E$29,4,FALSE))","v":"Averses ou fortes pluies"},"Pluies et éclaircies",7,"11:54:05",null,null,null,null,null,null,"Grèle & Neige","Giboulées","Grèles","Neiges","Fortes neiges",0,0]
["2017-08-10",25.3,"14:59:04",0.68,"00:00:00",12.2,"23:24:04",22.3,"16:59:04",93,"00:00:00",1022.3,"11:29:01",0,"02:19:01",19.399999999999999,"11:14:01",0,"02:34:01",28.1,"16:34:04",315,"NO","00:54:01",0.3,37.199999999999996,90,901.61,5,null,{"$f":"IF(AC23=\"\",\"\",VLOOKUP(AC23,List!$B$2:$E$29,4,FALSE))","v":"Variable"},"Pluies éparses",9,"13:49:04"]
["2017-08-11",27.3,"15:19:06",0.68,"00:00:00",10,"06:19:04",23.4,"16:04:06",77,"00:00:00",1022.1,"01:09:04",0,"00:19:04",9.6999999999999993,"12:29:06",0,"05:04:04",13.3,"12:29:06",0,"N","01:44:04",0,37.199999999999996,90,988.82,1,null,{"$f":"IF(AC24=\"\",\"\",VLOOKUP(AC24,List!$B$2:$E$29,4,FALSE))","v":"Ciel dégagé"},"Pluies et éclaircies",9,"13:09:06",null,null,null,null,null,null,"Temps de nuit","Ciel dégagé de nuit","Ciel voilé de nuit","Brume ou brouillard léger de nuit","Brume ou léger brouillard givrant de nuit ","Brouillard dense de nuit","Ciel nuageux avec éclaircies de nuit"]
["2017-08-12",21.1,"00:09:06",0.68,"00:09:06",15.5,"03:14:06",15.8,"01:29:06",0.83,"03:34:06",1018.6,"00:24:06",1.1000000000000001,"00:14:06",6.1,"03:34:06",2.5,"00:14:06",9.6999999999999993,"03:34:06",90,"EST","00:00:00",0,37.199999999999996,90,0.43,5,null,{"$f":"IF(AC25=\"\",\"\",VLOOKUP(AC25,List!$B$2:$E$29,4,FALSE))","v":"Variable"},"C",0,"00:09:06"]
["2017-08-24",23.3,"16:54:05",0.71,"11:59:05",13.5,"23:59:05",27.5,"15:14:05",0.88,"23:29:05",1016.8,"11:59:05",0,"12:14:05",13.3,"17:49:05",0,"21:34:05",14.8,"17:09:05",0,"N","15:19:05",0.6,37.799999999999997,90.6,855.01,13,null,{"$f":"IF(AC26=\"\",\"\",VLOOKUP(AC26,List!$B$2:$E$29,4,FALSE))","v":"Pluies et éclaircies"},null,8,"15:04:05"]
["2017-08-25",32.200000000000003,"12:59:05",0.7,"00:00:00",11.9,"05:34:05",28,"15:24:09",92,"00:00:00",1015.6,"10:24:05",0,"00:09:05",12.2,"18:14:09",0,"00:09:05",18.399999999999999,"18:14:09",90,"EST","00:09:05",0,37.799999999999997,90.6,730.7,5,null,{"$f":"IF(AC27=\"\",\"\",VLOOKUP(AC27,List!$B$2:$E$29,4,FALSE))","v":"Variable"},null,6,"12:44:05"]
["2017-08-26",27.9,"16:04:09",0.66,"00:00:00",12.1,"05:29:09",29.1,"15:44:09",82,"00:00:00",1014.9,"09:54:09",0,"00:09:09",12.2,"16:34:09",0,"00:14:09",15.8,"16:09:09",90,"EST","10:44:09",0,37.799999999999997,90.6,642.17999999999995,6,null,{"$f":"IF(AC28=\"\",\"\",VLOOKUP(AC28,List!$B$2:$E$29,4,FALSE))","v":"Nuageux avec éclaircies"},null,6,"13:34:09"]
["2017-08-27",38.9,"15:39:10",0.65,"00:00:00",15.5,"07:19:09",31.1,"14:29:10",82,"00:00:00",1016.2,"12:29:10",0,"00:09:09",12.2,"16:09:10",0,"00:24:09",15.8,"16:29:10",90,"EST","10:19:09",0,37.799999999999997,154.19999999999999,686.19,6,null,{"$f":"IF(AC29=\"\",\"\",VLOOKUP(AC29,List!$B$2:$E$29,4,FALSE))","v":"Nuageux avec éclaircies"},null,6,"13:09:10"]
["2017-08-28",30.4,"12:24:10",0.69,"00:00:00",15.3,"06:39:10",33.4,"16:59:12",86,"00:00:00",1016,"10:09:10",0,"00:09:10",13.3,"19:09:12",0,"00:24:10",17.3,"19:09:12",45,"NE","10:54:10",0,37.799999999999997,154.19999999999999,826.39,1,null,{"$f":"IF(AC30=\"\",\"\",VLOOKUP(AC30,List!$B$2:$E$29,4,FALSE))","v":"Ciel dégagé"},null,7,"13:49:10"]
["2017-08-29",33.1,"12:44:13",0.66,"00:00:00",16.8,"23:24:13",30,"13:59:13",83,"00:00:00",1013.1,"09:29:12",0,"00:09:12",15.8,"18:19:13",0,"00:14:12",22,"18:04:13",90,"EST","06:09:12",0,37.799999999999997,154.19999999999999,745.43,1,null,{"$f":"IF(AC31=\"\",\"\",VLOOKUP(AC31,List!$B$2:$E$29,4,FALSE))","v":"Ciel dégagé"},null,6,"13:04:13"]
["2017-08-30",25.9,"00:09:13",0.68,"00:00:00",10.199999999999999,"23:49:11",17,"00:09:13",97,"00:00:00",1015.1,"00:00:00",0,"02:59:13",12.2,"16:54:11",0,"04:39:13",14.8,"15:09:11",0,"N","01:34:13",15.6,53.4,106.2,158.83000000000001,16,null,{"$f":"IF(AC32=\"\",\"\",VLOOKUP(AC32,List!$B$2:$E$29,4,FALSE))","v":"Averses ou fortes pluies"},null,2,"11:49:11"]
["",null,null,null,null,null,null,null,null,null,null,null,null,null,null,null,null,null,null,null,null,"",null,null,null,"",null,null,null,null,{"$f":"IF(AC33=\"\",\"\",VLOOKUP(AC33,List!$B$2:$E$29,4,FALSE))","v":""}]
["",null,null,null,null,null,null,null,null,null,null,null,null,null,null,null,null,null,null,null,null,"",null,null,null,"",null,null,null,null,{"$f":"IF(AC34=\"\",\"\",VLOOKUP(AC34,List!$B$2:$E$29,4,FALSE))","v":""}]
["",null,null,null,null,null,null,null,null,null,null,null,null,null,null,null,null,null,null,null,null,"",null,null,null,"",null,null,null,null,{"$f":"IF(AC35=\"\",\"\",VLOOKUP(AC35,List!$B$2:$E$29,4,FALSE))","v":""}]
["",null,null,null,null,null,null,null,null,null,null,null,null,null,null,null,null,null,null,null,null,"",null,null,null,"",null,null,null,null,{"$f":"IF(AC36=\"\",\"\",VLOOKUP(AC36,List!$B$2:$E$29,4,FALSE))","v":""}]
["",null,null,null,null,null,null,null,null,null,null,null,null,null,null,null,null,null,null,null,null,"",null,null,null,"",null,null,null,null,{"$f":"IF(AC37=\"\",\"\",VLOOKUP(AC37,List!$B$2:$E$29,4,FALSE))","v":""}]
["",null,null,null,null,null,null,null,null,null,null,null,null,null,null,null,null,null,null,null,null,"",null,null,null,"",null,null,null,null,{"$f":"IF(AC38=\"\",\"\",VLOOKUP(AC38,List!$B$2:$E$29,4,FALSE))","v":""}]
["",null,null,null,null,null,null,null,null,null,null,null,null,null,null,null,null,null,null,null,null,"",null,null,null,"",null,null,null,null,{"$f":"IF(AC39=\"\",\"\",VLOOKUP(AC39,List!$B$2:$E$29,4,FALSE))","v":""}]
["",null,null,null,null,null,null,null,null,null,null,null,null,null,null,null,null,null,null,null,null,"",null,null,null,"",null,null,null,null,{"$f":"IF(AC40=\"\",\"\",VLOOKUP(AC40,List!$B$2:$E$29,4,FALSE))","v":""}]
["",null,null,null,null,null,null,null,null,null,null,null,null,null,null,null,null,null,null,null,null,"",null,null,null,"",null,null,null,null,{"$f":"IF(AC41=\"\",\"\",VLOOKUP(AC41,List!$B$2:$E$29,4,FALSE))","v":""}]
["",null,null,null,null,null,null,null,null,null,null,null,null,null,null,null,null,null,null,null,null,"",null,null,null,"",null,null,null,null,{"$f":"IF(AC42=\"\",\"\",VLOOKUP(AC42,List!$B$2:$E$29,4,FALSE))","v":""}]
["",null,null,null,null,null,null,null,null,null,null,null,null,null,null,null,null,null,null,null,null,"",null,null,null,"",null,null,null,null,{"$f":"IF(AC43=\"\",\"\",VLOOKUP(AC43,List!$B$2:$E$29,4,FALSE))","v":""}]
["",null,null,null,null,null,null,null,null,null,null,null,null,null,null,null,null,null,null,null,null,"",null,null,null,"",null,null,null,null,{"$f":"IF(AC44=\"\",\"\",VLOOKUP(AC44,List!$B$2:$E$29,4,FALSE))","v":""}]
["",null,null,null,null,null,null,null,null,null,null,null,null,null,null,null,null,null,null,null,null,"",null,null,null,"",null,null,null,null,{"$f":"IF(AC45=\"\",\"\",VLOOKUP(AC45,List!$B$2:$E$29,4,FALSE))","v":""}]
["",null,null,null,null,null,null,null,null,null,null,null,null,null,null,null,null,null,null,null,null,"",null,null,null,"",null,null,null,null,{"$f":"IF(AC46=\"\",\"\",VLOOKUP(AC46,List!$B$2:$E$29,4,FALSE))","v":""}]

{"sheet":"Septembre 17","index":8,"n_rows":46,"n_cols":53,"rows_kept":46,"cut":false,"hidden":true,"merged":[[12,35,12,38]]}
["Soleil","C","Ciel voilé","Rares éclaircies","Soleil Fortes averses","Variable",null,null,null,"Orageux","Soleil orage","Soleil averses orageuses","Pluies orageuses","Orage","Orage et grêles","Orage violent",null,null,null,null,null,null,null,null,null,null,null,null,null,null,null,null,null,null,null,null,null,null,null,null,null,null,30,51,299,700]
[null,1,2,0.03,4,5,null,null,null,null,18,19,20,21,22,23,null,null,null,null,null,null,null,null,null,null,null,null,null,null,null,null,null,null,null,null,null,null,null,null,null,null,null,null,null,null,null,null,null,null,{"$f":"COUNTIF($W$14:$W$46,AZ2)","v":1},"N",0]
["Nuageux & Brumeux","C","Brouillard dense","Brume ou Brouillard légé","Brume ou léger brouillard givrant","Nuageux","Couvert","Couvert rares averses",null,"Grèle & Neige","Giboulées","Grèles","Neiges","Fortes neiges",null,null,null,null,null,null,null,null,null,null,null,null,null,null,null,null,null,null,null,null,null,null,null,null,null,null,null,null,null,null,null,null,null,null,null,null,{"$f":"COUNTIF($W$14:$W$46,AZ3)","v":0},"NNE",23]
[null,6,7,0.08,9,10,11,12,null,null,24,25,26,27,null,null,null,null,null,null,null,null,null,null,null,null,null,null,null,null,null,null,null,null,null,null,null,null,null,null,null,null,null,null,null,null,null,null,null,null,2,"NE",45]
["Pluvieux","Pluies et éclaircies","Pluies éparses","Bruines","Averses ou fortes pluies","Pluies mélées de neige",null,null,null,null,null,null,null,null,null,null,null,null,null,null,null,null,null,null,null,null,null,null,null,null,null,null,null,null,null,null,null,null,null,null,null,null,null,null,null,null,null,null,null,null,0,"ENE",68]
[null,13,14,0.15,16,17,null,null,null,null,null,null,null,null,null,null,null,null,null,null,null,null,null,null,null,null,null,null,null,null,null,null,null,null,null,null,null,null,null,null,null,null,null,null,null,null,null,null,null,null,20,"EST",90]
[null,null,null,null,null,{"$f":"IF(F14=\"\",\"\",MIN(F14:F46))","v":3.3},null,{"$f":"IF(H14=\"\",\"\",MIN(H14:H46))","v":16.8},null,0.77,null,1002.9,null,0,null,6.1,null,0,null,7.2,null,{"$f":"VLOOKUP(W7,$AZ$2:$BA$17,2,FALSE)","v":23},{"$f":"W10","v":"NNE"},null,{"$f":"MIN(Y14:Y46)","v":0},null,null,162.85,null,null,null,null,3,null,null,null,null,null,null,null,null,null,null,null,null,null,null,null,null,null,0,"ESE",113]
[null,null,null,null,null,{"$f":"IF(F15=\"\",\"\",MAX(F14:F46))","v":15.5},null,{"$f":"IF(H15=\"\",\"\",MAX(H14:H46))","v":26},null,0.99,null,1023.7,null,1.1000000000000001,null,18.399999999999999,null,2.5,null,28.1,null,{"$f":"VLOOKUP(W8,$AZ$2:$BA$17,2,FALSE)","v":90},{"$f":"W11","v":"EST"},null,{"$f":"MAX(Y14:Y46)","v":13.8},74.999999999999986,187.2,853.43,null,null,null,null,8,null,null,null,null,null,null,null,null,null,null,null,null,null,null,null,null,null,2,"SE",135]
[null,null,null,null,null,null,null,null,null,null,null,null,null,null,null,null,null,null,null,null,null,null,null,null,null,null,null,null,null,null,null,null,null,null,null,null,null,null,null,null,null,null,null,null,null,null,null,null,null,null,0,"SSE",158]
[null,null,null,null,null,null,null,null,null,null,null,null,null,null,null,null,null,null,null,null,null,{"$f":"SMALL($AY$2:$AY$17,1)","v":0},{"$f":"VLOOKUP(V10,$AY$2:$AZ$17,2,FALSE)","v":"NNE"},null,null,{"$f":"MAX(Z14:Z46)","v":74.999999999999986},null,null,null,null,null,null,null,null,null,null,null,null,null,null,null,31,99,300,null,null,null,null,null,null,0,"S",180]
[null,null,null,null,null,{"$f":"IF(F14=\"\",\"\",MIN(F14:F46))","v":3.3},{"$f":"VLOOKUP(F11,F14:G46,2,FALSE)","v":"07:39:18"},{"$f":"IF(H14=\"\",\"\",MAX(H14:H46))","v":26},{"$f":"VLOOKUP(H11,H14:I46,2,FALSE)","v":"14:54:11"},null,null,null,null,null,null,null,null,null,null,null,null,{"$f":"LARGE($AY$2:$AY$17,1)","v":20},{"$f":"VLOOKUP(V11,$AY$2:$AZ$17,2,FALSE)","v":"EST"},null,null,null,null,null,null,null,null,null,null,null,null,null,null,null,null,null,null,49,100,301,null,null,null,null,null,null,0,"SSO",203]
["Moyenne Mensuelle",{"$f":"AVERAGE(B14:B46)","v":29.11},null,{"$f":"AVERAGE(D14:D46)","v":65.733333333333334},null,{"$f":"AVERAGE(F14:F46)","v":10.140000000000004},null,{"$f":"AVERAGE(H14:H46)","v":21.666666666666664},null,{"$f":"AVERAGE(J14:J46)","v":92.566666666666663},null,{"$f":"AVERAGE(L14:L46)","v":1016.6366666666665},null,{"$f":"AVERAGE(N14:N46)","v":7.3333333333333334E-2},null,null,null,{"$f":"AVERAGE(R14:R46)","v":0.24000000000000002},null,null,null,null,"SE","09:30:45",{"$f":"AVERAGE(Y14:Y44)","v":2.5099999999999993},{"$f":"AVERAGE(Z14:Z46)","v":42.13000000000001},null,{"$f":"AVERAGE(AB14:AB46)","v":567.81000000000006},null,null,null,null,{"$f":"AVERAGE(AG14:AG46)","v":5.3666666666666663},null,null,null,null,null,null,null,null,50,101,699,null,null,null,null,null,null,0,"SO",225]
["Jour","T°               int.    (°C)","Heure","Hum              int.       (%)","Heure","T°              Mini                 ext.    (°C)","Heure","T°               Maxi                     ext.    (°C)","Heure","Hum           ext.      (%)","Heure","Press.         rel.        (hpa)","Heure","Vit. du vent    (km/h)","Heure","Vit. du vent    (km/h)","Heure","Rafale  Min        (km/h)","Heure","Rafale    Max      (km/h)","Heure","Direction                      du vent"," -","Heure","Précipi. dern. 24 h        (mm)","Précipi. Tot. mois          (mm)","Précipi. Tot. An        (mm)","Lumière (W/M2)",null,null,null,null,"UVI","Heure",null,"Intensité des UV",null,null,null,null,null,null,null,null,null,null,null,null,null,null,0,"OSO",248]
["2017-09-01",25.8,"16:09:11",69,"00:00:00",10.7,"04:49:11",21.3,"15:34:11",93,"00:00:00",1021.3,"23:54:11",0,"00:09:11",15.8,"14:14:11",0,"00:14:11",23.4,"14:44:11",{"$f":"IF(W14=\"N\",0,IF(W14=\"NNE\",23,IF(W14=\"NE\",45,IF(W14=\"ENE\",68,IF(W14=\"EST\",90,IF(W14=\"ESE\",113,IF(W14=\"SE\",135,IF(W14=\"SSE\",158,IF(W14=\"S\",180,IF(W14=\"SSO\",203,IF(W14=\"SO\",225,IF(W14=\"OSO\",248,IF(W14=\"O\",270,IF(W14=\"ONO\",293,IF(W14=\"NO\",315,IF(W14=\"NNO\",338,\"\"))))))))))))))))","v":90},"EST","12:29:11",0.3,0,112.2,853.43,5,null,{"$f":"IF(AC14=\"\",\"\",VLOOKUP(AC14,List!$B$2:$E$29,4,FALSE))","v":"Variable"},null,8,"14:04:11",null,"FAIBLE","<2",null,null,null,"Soleil","C","Ciel voilé","Rares éclaircies","Soleil Fortes averses","Variable",0,0,null,null,0,"O",270]
[{"$f":"IF(B15=\"\",\"\",A14+1)","v":"2017-09-02"},27.3,"13:44:11",69,"00:00:00",10,"07:54:11",26,"14:54:11",91,"00:00:00",1023,"09:39:11",0,"00:09:11",9.6999999999999993,"14:04:11",0,"02:29:11",12.2,"12:24:11",90,"EST","00:44:11",0,{"$f":"IF(Y15=\"\",\"\",Y15+Z14)","v":0},112.2,783.37,3,null,{"$f":"IF(AC15=\"\",\"\",VLOOKUP(AC15,List!$B$2:$E$29,4,FALSE))","v":"Rares éclaircies"},{"$f":"IF(AC15=\"\",\"\",)","v":0},6,"12:24:11",null,"MODEREE",3,"à",5,null,null,null,null,null,null,null,null,null,null,null,0,"ONO",293]
[{"$f":"IF(B16=\"\",\"\",A15+1)","v":"2017-09-03"},23.9,"17:49:14",69,"00:00:00",12.6,"00:24:11",16.8,"17:39:14",99,"00:00:00",1017.4,"00:09:11",0,"00:09:11",15.8,"15:49:11",0,"00:09:11",23.4,"15:39:11",90,"EST","03:04:11",13.8,13.8,126,225.81,16,null,{"$f":"IF(AC16=\"\",\"\",VLOOKUP(AC16,List!$B$2:$E$29,4,FALSE))","v":"Averses ou fortes pluies"},"Averses ou fortes pluies",4,"15:34:11",null,"FORTE",6,"à",7,null,"Nuageux & Brumeux","C","Brouillard dense","Brume ou Brouillard légé","Brume ou léger brouillard givrant","Nuageux","Couvert","Couvert rares averses",null,null,5,"NO",315]
["2017-09-04",23.7,"15:39:14",71,"00:00:00",15.5,"00:09:14",23.9,"14:59:14",89,"00:00:00",1014.6,"23:49:15",0,"00:19:14",7.2,"19:04:15",0,"00:34:14",9.6999999999999993,"19:04:15",0,"N","19:04:15",0.3,14.100000000000001,126.3,353.98,12,null,{"$f":"IF(AC17=\"\",\"\",VLOOKUP(AC17,List!$B$2:$E$29,4,FALSE))","v":"Couvert rares averses"},"Pluies et éclaircies",5,"14:39:14",null,"TRES FORTE",8,"à",10,null,null,null,null,null,null,null,null,null,null,null,0,"NNO",338]
["2017-09-05",26.1,"15:34:16",71,"00:00:00",15,"04:29:15",23.9,"15:24:16",80,"00:00:00",1019.8,"23:59:16",0,"04:24:15",14.8,"13:19:16",1.1000000000000001,"04:24:15",22,"13:19:16",90,"EST","07:54:15",0,14.100000000000001,126.3,723.31,3,null,{"$f":"IF(AC18=\"\",\"\",VLOOKUP(AC18,List!$B$2:$E$29,4,FALSE))","v":"Rares éclaircies"},"C",6,"15:14:16",null,"EXTREME","11+",null,null,null,"Pluvieux","Pluies et éclaircies","Pluies éparses","Bruines","Averses ou fortes pluies","Pluies mélées de neige"]
["2017-09-06",24,"15:29:16",69,"00:00:00",10.199999999999999,"04:34:16",24.9,"15:24:16",93,"00:00:00",1023.7,"10:49:16",0,"01:44:16",9.6999999999999993,"17:24:16",0,"02:49:16",12.2,"17:24:16",45,"NE","09:24:16",0,14.100000000000001,126.3,735.77,5,null,{"$f":"IF(AC19=\"\",\"\",VLOOKUP(AC19,List!$B$2:$E$29,4,FALSE))","v":"Variable"},"C",7,"13:49:16"]
["2017-09-07",25.5,"14:14:14",68,"00:00:00",11.6,"00:09:16",20.399999999999999,"14:09:14",84,"00:00:00",1020.5,"00:34:16",0,"00:09:16",7.2,"11:19:16",0,"00:09:16",11.2,"14:14:14",90,"EST","04:04:16",0,14.100000000000001,126.3,573.41,5,null,{"$f":"IF(AC20=\"\",\"\",VLOOKUP(AC20,List!$B$2:$E$29,4,FALSE))","v":"Variable"},"C",6,"14:04:14",null,null,null,null,null,null,"Orageux","Soleil orage","Soleil averses orageuses","Pluies orageuses","Orage","Orage et grêles","Orage violent"]
["2017-09-08",22.1,"00:09:14",71,"00:00:00",13.7,"00:00:00",18.600000000000001,"14:09:16",90,"00:00:00",1012,"00:14:14",0,"22:24:16",13.3,"16:34:16",0,"22:24:16",19.399999999999999,"16:34:16",90,"EST","02:49:14",8.1,22.200000000000003,134.4,260.35000000000002,16,null,{"$f":"IF(AC21=\"\",\"\",VLOOKUP(AC21,List!$B$2:$E$29,4,FALSE))","v":"Averses ou fortes pluies"},"Averses ou fortes pluies",4,"13:24:16"]
["2017-09-09",33.299999999999997,"16:29:18",68,"00:00:00",12,"05:29:16",21.5,"16:14:18",89,"00:00:00",1002.9,"23:59:18",0,"14:54:18",11.2,"14:29:18",1.1000000000000001,"11:39:18",19.399999999999999,"14:29:18",90,"EST","02:34:16",3.3,25.500000000000004,137.69999999999999,686.34,13,null,{"$f":"IF(AC22=\"\",\"\",VLOOKUP(AC22,List!$B$2:$E$29,4,FALSE))","v":"Pluies et éclaircies"},"Pluies et éclaircies",6,"14:14:18",null,null,null,null,null,null,"Grèle & Neige","Giboulées","Grèles","Neiges","Fortes neiges",0,0]
["2017-09-10",23.7,"16:44:18",68,"00:00:00",11.6,"08:24:18",19.7,"11:04:18",77,"00:00:00",1006.7,"10:59:18",0,"03:44:18",18.399999999999999,"16:49:15",0,"08:04:18",24.5,"15:39:18",90,"EST","00:24:18",0.6,26.100000000000005,138.30000000000001,391.1,12,null,{"$f":"IF(AC23=\"\",\"\",VLOOKUP(AC23,List!$B$2:$E$29,4,FALSE))","v":"Couvert rares averses"},"Pluies éparses",5,"13:19:18"]
["2017-09-11",32.200000000000003,"15:34:17",71,"00:00:00",11.9,"07:34:15",20.100000000000001,"14:44:17",86,"00:00:00",1005.2,"23:49:17",1.1000000000000001,"18:24:17",15.8,"10:49:15",2.5,"18:49:17",19.399999999999999,"10:24:15",90,"EST","03:04:15",1.2,27.300000000000004,139.5,782.1,5,null,{"$f":"IF(AC24=\"\",\"\",VLOOKUP(AC24,List!$B$2:$E$29,4,FALSE))","v":"Variable"},"Pluies et éclaircies",7,"13:19:17",null,null,null,null,null,null,"Temps de nuit","Ciel dégagé de nuit","Ciel voilé de nuit","Brume ou brouillard léger de nuit","Brume ou léger brouillard givrant de nuit ","Brouillard dense de nuit","Ciel nuageux avec éclaircies de nuit"]
["2017-09-12",27.6,"13:39:19",59,"00:00:00",10.8,"06:44:17",21.5,"13:34:19",95,"00:00:00",1011.5,"10:59:17",1.1000000000000001,"00:19:17",17.3,"21:34:19",2.5,"05:04:17",28.1,"21:34:19",90,"EST","03:59:17",0,27.300000000000004,139.5,704.25,5,null,{"$f":"IF(AC25=\"\",\"\",VLOOKUP(AC25,List!$B$2:$E$29,4,FALSE))","v":"Variable"},"C",6,"13:19:19"]
["2017-09-13",25.4,"20:59:19",63,"00:00:00",12.3,"23:59:19",17.7,"01:19:19",92,"00:00:00",1009,"10:59:19",0,"11:29:19",13.3,"02:24:19",0,"11:59:19",18.399999999999999,"02:24:19",90,"EST","11:39:19",8.4,35.700000000000003,147.9,162.85,16,null,{"$f":"IF(AC26=\"\",\"\",VLOOKUP(AC26,List!$B$2:$E$29,4,FALSE))","v":"Averses ou fortes pluies"},null,3,"11:14:19"]
["2017-09-14",37.299999999999997,"15:19:18",57,"00:00:00",9.4,"22:24:18",23.2,"15:34:18",92,"00:00:00",1015.5,"22:04:18",0,"19:19:18",8.6,"05:04:19",0,"20:29:18",13.3,"17:44:18",90,"EST","07:04:19",0,35.700000000000003,147.9,703.13,5,null,{"$f":"IF(AC27=\"\",\"\",VLOOKUP(AC27,List!$B$2:$E$29,4,FALSE))","v":"Variable"},null,6,"12:19:18"]
["2017-09-15",24.3,"00:09:18",63,"00:00:00",7.9,"08:39:18",21.7,"12:09:18",99,"00:00:00",1015.1,"00:19:18",0,"00:09:18",15.8,"12:59:18",0,"00:09:18",19.399999999999999,"12:59:18",315,"NO","00:39:18",12.9,48.6,160.80000000000001,801.33,16,null,{"$f":"IF(AC28=\"\",\"\",VLOOKUP(AC28,List!$B$2:$E$29,4,FALSE))","v":"Averses ou fortes pluies"},null,7,"13:34:18"]
["2017-09-16",31.7,"13:54:18",62,"23:59:18",9,"07:54:18",23.3,"12:54:18",95,"23:59:18",1012,"10:34:18",0,"00:04:18",9.6999999999999993,"13:54:18",0,"00:39:18",12.2,"13:54:18",315,"NO","02:24:18",4.2,52.800000000000004,165,746.25,16,null,{"$f":"IF(AC29=\"\",\"\",VLOOKUP(AC29,List!$B$2:$E$29,4,FALSE))","v":"Averses ou fortes pluies"},null,6,"12:44:18"]
["2017-09-17",32.799999999999997,"14:04:19",61,"23:59:19",6.3,"23:54:19",22.4,"13:24:19",99,"23:59:19",1014.3,"23:54:19",0,"00:04:18",11.2,"15:09:19",0,"00:04:18",14.8,"15:09:19",90,"EST","09:39:19",0,52.800000000000004,165,737.74,3,null,{"$f":"IF(AC30=\"\",\"\",VLOOKUP(AC30,List!$B$2:$E$29,4,FALSE))","v":"Rares éclaircies"},null,6,"13:54:19"]
["2017-09-18",32.4,"14:34:19",61,"23:59:19",5.3,"07:54:19",22.4,"13:54:19",92,"23:59:19",1019.2,"23:59:19",0,"00:04:19",14.8,"17:49:19",0,"00:09:19",19.399999999999999,"17:44:19",90,"EST","10:34:19",0,52.800000000000004,165,628.6,5,null,{"$f":"IF(AC31=\"\",\"\",VLOOKUP(AC31,List!$B$2:$E$29,4,FALSE))","v":"Variable"},null,6,"13:49:19"]
["2017-09-19",34.1,"16:34:18",61,"23:59:18",10.8,"03:04:19",24.9,"14:29:18",91,"23:59:18",1022.1,"12:19:18",0,"00:49:19",11.2,"16:54:18",0,"20:04:18",13.3,"12:04:18",315,"NO","10:29:19",0,52.800000000000004,165,614.17999999999995,5,null,{"$f":"IF(AC32=\"\",\"\",VLOOKUP(AC32,List!$B$2:$E$29,4,FALSE))","v":"Variable"},null,5,"11:59:18"]
["2017-09-20",26.4,"12:04:18",68,"23:59:18",6.6,"02:59:18",19.100000000000001,"11:39:18",99,"02:04:18",1021.4,"00:04:18",0,"00:04:18",9.6999999999999993,"12:04:18",0,"00:04:18",13.3,"11:59:18",90,"EST","07:19:18",0,52.800000000000004,165,488.6,11,null,{"$f":"IF(AC33=\"\",\"\",VLOOKUP(AC33,List!$B$2:$E$29,4,FALSE))","v":"Couvert"},null,5,"12:44:18"]
["2017-09-21",25.8,"19:34:18",64,"23:59:18",6.6,"02:59:18",18.399999999999999,"10:14:18",99,"23:59:18",1018.1,"23:59:18",0,"00:04:18",9.6999999999999993,"12:09:18",0,"00:04:18",15.8,"12:09:18",90,"EST","10:24:18",7.8,60.6,172.8,293.57,16,null,{"$f":"IF(AC34=\"\",\"\",VLOOKUP(AC34,List!$B$2:$E$29,4,FALSE))","v":"Averses ou fortes pluies"},null,3,"10:09:18"]
["2017-09-22",41.2,"14:24:19",62,"23:59:19",3.3,"07:39:18",23.5,"15:14:19",98,"23:59:19",1021.7,"10:59:19",0,"00:04:18",7.2,"13:44:19",0,"00:09:18",9.6999999999999993,"13:44:19",90,"EST","14:44:19",0,60.6,172.8,523.72,5,null,{"$f":"IF(AC35=\"\",\"\",VLOOKUP(AC35,List!$B$2:$E$29,4,FALSE))","v":"Variable"},null,5,"13:24:19"]
["2017-09-23",31.6,"16:39:19",62,"23:59:19",3.9,"08:04:19",23.3,"14:44:19",96,"23:59:19",1020.3,"01:44:19",0,"00:04:19",11.2,"12:49:19",0,"00:04:19",17.3,"13:14:19",90,"EST","10:09:19",0,60.6,172.8,511.57,11,null,{"$f":"IF(AC36=\"\",\"\",VLOOKUP(AC36,List!$B$2:$E$29,4,FALSE))","v":"Couvert"},null,5,"13:34:19"]
["2017-09-24",24.7,"14:39:20",66,"23:59:20",8.9,"04:44:19",18.899999999999999,"15:14:20",99,"23:59:20",1016.6,"10:14:19",0,"00:04:19",6.1,"13:59:20",0,"00:19:19",8.6,"13:59:20",45,"NE","06:04:19",4.8,65.400000000000006,177.6,186.67,16,null,{"$f":"IF(AC37=\"\",\"\",VLOOKUP(AC37,List!$B$2:$E$29,4,FALSE))","v":"Averses ou fortes pluies"},null,3,"10:49:19"]
["2017-09-25",26.4,"13:24:22",65,"23:59:22",12.3,"23:59:22",19.899999999999999,"13:09:22",96,"23:59:22",1019.3,"22:29:22",0,"00:04:20",9.6999999999999993,"15:29:22",0,"00:04:20",15.8,"17:29:22",315,"NO","03:04:20",4.8,70.2,182.4,587.05999999999995,16,null,{"$f":"IF(AC38=\"\",\"\",VLOOKUP(AC38,List!$B$2:$E$29,4,FALSE))","v":"Averses ou fortes pluies"},null,5,"12:59:22"]
["2017-09-26",30,"16:29:22",66,"23:59:22",10.199999999999999,"23:59:22",25.1,"15:04:22",98,"23:59:22",1021.1,"09:49:22",0,"01:09:22",6.1,"11:29:22",0,"01:09:22",7.2,"11:29:22",90,"EST","09:49:22",0,70.2,182.4,604.35,5,null,{"$f":"IF(AC39=\"\",\"\",VLOOKUP(AC39,List!$B$2:$E$29,4,FALSE))","v":"Variable"},null,6,"14:44:22"]
["2017-09-27",30.2,"14:19:21",63,"23:59:21",9.1999999999999993,"03:14:22",21.3,"13:49:21",97,"23:59:21",1018.6,"00:14:22",0,"00:04:22",14.8,"13:14:21",0,"00:04:22",20.9,"13:14:21",315,"NO","00:04:22",1.8,72,184.2,562,13,null,{"$f":"IF(AC40=\"\",\"\",VLOOKUP(AC40,List!$B$2:$E$29,4,FALSE))","v":"Pluies et éclaircies"},null,5,"12:14:21"]
["2017-09-28",36,"14:04:22",66,"23:59:22",14.6,"07:44:21",23.3,"13:59:22",96,"23:59:22",1019.2,"10:24:21",0,"04:19:21",11.2,"14:49:22",0,"04:19:21",13.3,"14:49:22",135,"SE","06:14:21",0.3,72.3,184.5,586.95000000000005,13,null,{"$f":"IF(AC41=\"\",\"\",VLOOKUP(AC41,List!$B$2:$E$29,4,FALSE))","v":"Pluies et éclaircies"},null,5,"13:24:22"]
["2017-09-29",30.8,"12:04:22",73,"23:59:22",12.8,"23:49:22",22.4,"11:54:22",88,"23:59:22",1017.8,"23:54:22",0,"01:49:22",9.6999999999999993,"11:24:22",0,"17:14:22",14.8,"10:29:22",135,"SE","10:34:22",2.1,74.399999999999991,186.6,625.16,13,null,{"$f":"IF(AC42=\"\",\"\",VLOOKUP(AC42,List!$B$2:$E$29,4,FALSE))","v":"Pluies et éclaircies"},null,5,"11:54:22"]
["2017-09-30",37,"15:44:22",66,"23:59:22",9.1999999999999993,"07:44:22",20.6,"13:24:22",85,"23:59:22",1019.2,"10:14:22",0,"00:04:22",12.2,"12:59:22",0,"00:09:22",18.399999999999999,"22:14:22",90,"EST","00:04:22",0.6,74.999999999999986,187.2,597.35,13,null,{"$f":"IF(AC43=\"\",\"\",VLOOKUP(AC43,List!$B$2:$E$29,4,FALSE))","v":"Pluies et éclaircies"},null,5,"13:19:22"]
["",null,null,null,null,null,null,null,null,null,null,null,null,null,null,null,null,null,null,null,null,"",null,null,null,"",null,null,null,null,{"$f":"IF(AC44=\"\",\"\",VLOOKUP(AC44,List!$B$2:$E$29,4,FALSE))","v":""}]
["",null,null,null,null,null,null,null,null,null,null,null,null,null,null,null,null,null,null,null,null,"",null,null,null,"",null,null,null,null,{"$f":"IF(AC45=\"\",\"\",VLOOKUP(AC45,List!$B$2:$E$29,4,FALSE))","v":""}]
["",null,null,null,null,null,null,null,null,null,null,null,null,null,null,null,null,null,null,null,null,"",null,null,null,"",null,null,null,null,{"$f":"IF(AC46=\"\",\"\",VLOOKUP(AC46,List!$B$2:$E$29,4,FALSE))","v":""}]

{"sheet":"Octobre 17","index":9,"n_rows":46,"n_cols":53,"rows_kept":46,"cut":false,"hidden":true,"merged":[[12,35,12,38]]}
["Soleil","C","Ciel voilé","Rares éclaircies","Soleil Fortes averses","Variable",null,null,null,"Orageux","Soleil orage","Soleil averses orageuses","Pluies orageuses","Orage","Orage et grêles","Orage violent",null,null,null,null,null,null,null,null,null,null,null,null,null,null,null,null,null,null,null,null,null,null,null,null,null,null,30,51,299,700]
[null,1,2,0.03,4,5,null,null,null,null,18,19,20,21,22,23,null,null,null,null,null,null,null,null,null,null,null,null,null,null,null,null,null,null,null,null,null,null,null,null,null,null,null,null,null,null,null,null,null,null,{"$f":"COUNTIF($W$14:$W$46,AZ2)","v":2},"N",0]
["Nuageux & Brumeux","C","Brouillard dense","Brume ou Brouillard légé","Brume ou léger brouillard givrant","Nuageux","Couvert","Couvert rares averses",null,"Grèle & Neige","Giboulées","Grèles","Neiges","Fortes neiges",null,null,null,null,null,null,null,null,null,null,null,null,null,null,null,null,null,null,null,null,null,null,null,null,null,null,null,null,null,null,null,null,null,null,null,null,{"$f":"COUNTIF($W$14:$W$46,AZ3)","v":0},"NNE",23]
[null,6,7,0.08,9,10,11,12,null,null,24,25,26,27,null,null,null,null,null,null,null,null,null,null,null,null,null,null,null,null,null,null,null,null,null,null,null,null,null,null,null,null,null,null,null,null,null,null,null,null,1,"NE",45]
["Pluvieux","Pluies et éclaircies","Pluies éparses","Bruines","Averses ou fortes pluies","Pluies mélées de neige",null,null,null,null,null,null,null,null,null,null,null,null,null,null,null,null,null,null,null,null,null,null,null,null,null,null,null,null,null,null,null,null,null,null,null,null,null,null,null,null,null,null,null,null,0,"ENE",68]
[null,13,14,0.15,16,17,null,null,null,null,null,null,null,null,null,null,null,null,null,null,null,null,null,null,null,null,null,null,null,null,null,null,null,null,null,null,null,null,null,null,null,null,null,null,null,null,null,null,null,null,18,"EST",90]
[null,null,null,null,null,{"$f":"IF(F14=\"\",\"\",MIN(F14:F46))","v":-0.3},null,{"$f":"IF(H14=\"\",\"\",MIN(H14:H46))","v":15.8},null,0.76,null,1006.3,null,0,null,3.6,null,0,null,5,null,{"$f":"VLOOKUP(W7,$AZ$2:$BA$17,2,FALSE)","v":23},{"$f":"W10","v":"NNE"},null,{"$f":"MIN(Y14:Y46)","v":0},null,null,59.58,null,null,null,null,1,null,null,null,null,null,null,null,null,null,null,null,null,null,null,null,null,null,0,"ESE",113]
[null,null,null,null,null,{"$f":"IF(F15=\"\",\"\",MAX(F14:F46))","v":14.4},null,{"$f":"IF(H15=\"\",\"\",MAX(H14:H46))","v":26},null,0.99,null,1032.8,null,2.5,null,19.399999999999999,null,3.6,null,27,null,{"$f":"VLOOKUP(W8,$AZ$2:$BA$17,2,FALSE)","v":90},{"$f":"W11","v":"EST"},null,{"$f":"MAX(Y14:Y46)","v":10.8},22.200000000000003,210.3,603.15,null,null,null,null,5,null,null,null,null,null,null,null,null,null,null,null,null,null,null,null,null,null,4,"SE",135]
[null,null,null,null,null,null,null,null,null,null,null,null,null,null,null,null,null,null,null,null,null,null,null,null,null,null,null,null,null,null,null,null,null,null,null,null,null,null,null,null,null,null,null,null,null,null,null,null,null,null,0,"SSE",158]
[null,null,null,null,null,null,null,null,null,null,null,null,null,null,null,null,null,null,null,null,null,{"$f":"SMALL($AY$2:$AY$17,1)","v":0},{"$f":"VLOOKUP(V10,$AY$2:$AZ$17,2,FALSE)","v":"NNE"},null,null,{"$f":"MAX(Z14:Z46)","v":22.200000000000003},null,null,null,null,null,null,null,null,null,null,null,null,null,null,null,31,99,300,null,null,null,null,null,null,1,"S",180]
[null,null,null,null,null,{"$f":"IF(F14=\"\",\"\",MIN(F14:F46))","v":-0.3},{"$f":"VLOOKUP(F11,F14:G46,2,FALSE)","v":"06:39:32"},{"$f":"IF(H14=\"\",\"\",MAX(H14:H46))","v":26},{"$f":"VLOOKUP(H11,H14:I46,2,FALSE)","v":"12:54:33"},null,null,null,null,null,null,null,null,null,null,null,null,{"$f":"LARGE($AY$2:$AY$17,1)","v":18},{"$f":"VLOOKUP(V11,$AY$2:$AZ$17,2,FALSE)","v":"EST"},null,null,null,null,null,null,null,null,null,null,null,null,null,null,null,null,null,null,49,100,301,null,null,null,null,null,null,0,"SSO",203]
["Moyenne Mensuelle",{"$f":"AVERAGE(B14:B46)","v":27.625806451612902},null,{"$f":"AVERAGE(D14:D46)","v":62.903225806451616},null,{"$f":"AVERAGE(F14:F46)","v":9.1161290322580637},null,{"$f":"AVERAGE(H14:H46)","v":20.458064516129031},null,{"$f":"AVERAGE(J14:J46)","v":90.935483870967744},null,{"$f":"AVERAGE(L14:L46)","v":1021.5129032258063},null,{"$f":"AVERAGE(N14:N46)","v":0.11612903225806452},null,null,null,{"$f":"AVERAGE(R14:R46)","v":0.22258064516129034},null,null,null,null,"SE","09:30:45",{"$f":"AVERAGE(Y14:Y44)","v":0.74516129032258072},{"$f":"AVERAGE(Z14:Z46)","v":10.954838709677418},null,{"$f":"AVERAGE(AB14:AB46)","v":379.21064516129036},null,null,null,null,{"$f":"AVERAGE(AG14:AG46)","v":3.5806451612903225},null,null,null,null,null,null,null,null,50,101,699,null,null,null,null,null,null,0,"SO",225]
["Jour","T°               int.    (°C)","Heure","Hum              int.       (%)","Heure","T°              Mini                 ext.    (°C)","Heure","T°               Maxi                     ext.    (°C)","Heure","Hum           ext.      (%)","Heure","Press.         rel.        (hpa)","Heure","Vit. du vent    (km/h)","Heure","Vit. du vent    (km/h)","Heure","Rafale  Min        (km/h)","Heure","Rafale    Max      (km/h)","Heure","Direction                      du vent"," -","Heure","Précipi. dern. 24 h        (mm)","Précipi. Tot. mois          (mm)","Précipi. Tot. An        (mm)","Lumière (W/M2)",null,null,null,null,"UVI","Heure",null,"Intensité des UV",null,null,null,null,null,null,null,null,null,null,null,null,null,null,0,"OSO",248]
["2017-10-01",22.5,"13:09:21",74,"23:59:21",14.4,"08:39:22",19.3,"16:54:21",92,"23:59:21",1015,"10:34:22",0,"06:44:22",9.6999999999999993,"00:34:22",0,"07:14:22",12.2,"00:09:22",{"$f":"IF(W14=\"N\",0,IF(W14=\"NNE\",23,IF(W14=\"NE\",45,IF(W14=\"ENE\",68,IF(W14=\"EST\",90,IF(W14=\"ESE\",113,IF(W14=\"SE\",135,IF(W14=\"SSE\",158,IF(W14=\"S\",180,IF(W14=\"SSO\",203,IF(W14=\"SO\",225,IF(W14=\"OSO\",248,IF(W14=\"O\",270,IF(W14=\"ONO\",293,IF(W14=\"NO\",315,IF(W14=\"NNO\",338,\"\"))))))))))))))))","v":90},"EST","09:54:22",0.9,0,188.1,185.78,13,null,{"$f":"IF(AC14=\"\",\"\",VLOOKUP(AC14,List!$B$2:$E$29,4,FALSE))","v":"Pluies et éclaircies"},null,3,"12:49:21",null,"FAIBLE","<2",null,null,null,"Soleil","C","Ciel voilé","Rares éclaircies","Soleil Fortes averses","Variable",0,0,null,null,0,"O",270]
[{"$f":"IF(B15=\"\",\"\",A14+1)","v":"2017-10-02"},39.9,"15:09:21",72,"23:59:21",13.6,"04:14:21",25.7,"14:59:21",94,"23:59:21",1018.6,"11:29:21",0,"00:29:21",19.399999999999999,"23:09:21",0,"00:39:21",25.6,"23:09:21",90,"EST","22:24:21",0.6,{"$f":"IF(Y15=\"\",\"\",Y15+Z14)","v":0.6},188.7,576.35,13,null,{"$f":"IF(AC15=\"\",\"\",VLOOKUP(AC15,List!$B$2:$E$29,4,FALSE))","v":"Pluies et éclaircies"},{"$f":"IF(AC15=\"\",\"\",)","v":0},5,"12:34:21",null,"MODEREE",3,"à",5,null,null,null,null,null,null,null,null,null,null,null,0,"ONO",293]
[{"$f":"IF(B16=\"\",\"\",A15+1)","v":"2017-10-03"},37,"14:09:22",69,"23:59:22",6.2,"23:54:22",22,"16:19:22",99,"23:59:22",1025,"23:04:22",0,"00:54:21",13.3,"15:19:22",0,"00:54:21",15.8,"12:39:22",315,"NO","02:04:21",2.1,2.7,190.8,603.15,13,null,{"$f":"IF(AC16=\"\",\"\",VLOOKUP(AC16,List!$B$2:$E$29,4,FALSE))","v":"Pluies et éclaircies"},"Averses ou fortes pluies",5,"12:34:22",null,"FORTE",6,"à",7,null,"Nuageux & Brumeux","C","Brouillard dense","Brume ou Brouillard légé","Brume ou léger brouillard givrant","Nuageux","Couvert","Couvert rares averses",null,null,5,"NO",315]
["2017-10-04",41.4,"15:29:23",67,"23:59:23",3.7,"08:14:22",24.3,"15:34:23",98,"23:59:23",1025.9000000000001,"10:34:22",0,"00:04:22",5,"12:54:23",0,"00:04:22",6.1,"12:54:23",90,"EST","15:19:23",0,2.7,190.8,533.58000000000004,1,null,{"$f":"IF(AC17=\"\",\"\",VLOOKUP(AC17,List!$B$2:$E$29,4,FALSE))","v":"Ciel dégagé"},"Pluies et éclaircies",5,"12:44:23",null,"TRES FORTE",8,"à",10,null,null,null,null,null,null,null,null,null,null,null,0,"NNO",338]
["2017-10-05",25.5,"14:39:24",65,"23:59:24",3.6,"02:49:23",18.899999999999999,"13:59:24",98,"23:59:24",1022.6,"23:59:24",0,"00:04:23",9.6999999999999993,"17:59:24",0,"00:04:23",15.8,"19:14:24",90,"EST","12:04:24",0,2.7,190.8,200.75,1,null,{"$f":"IF(AC18=\"\",\"\",VLOOKUP(AC18,List!$B$2:$E$29,4,FALSE))","v":"Ciel dégagé"},"C",3,"11:54:24",null,"EXTREME","11+",null,null,null,"Pluvieux","Pluies et éclaircies","Pluies éparses","Bruines","Averses ou fortes pluies","Pluies mélées de neige"]
["2017-10-06",34.200000000000003,"16:19:24",61,"23:59:24",5.9,"23:59:24",21.5,"16:14:24",98,"23:59:24",1026.7,"11:09:24",0,"00:04:24",12.2,"10:44:24",0,"00:34:24",18.399999999999999,"12:54:24",0,"N","02:29:24",0,2.7,190.8,520.92999999999995,1,null,{"$f":"IF(AC19=\"\",\"\",VLOOKUP(AC19,List!$B$2:$E$29,4,FALSE))","v":"Ciel dégagé"},"C",5,"12:49:24"]
["2017-10-07",28.1,"16:49:24",59,"23:59:24",1.9,"07:04:24",23.2,"15:49:24",85,"23:59:24",1026.3,"00:34:24",0,"00:04:24",12.2,"12:44:24",0,"00:04:24",17.3,"12:44:24",90,"EST","23:49:24",0,2.7,190.8,524.05999999999995,1,null,{"$f":"IF(AC20=\"\",\"\",VLOOKUP(AC20,List!$B$2:$E$29,4,FALSE))","v":"Ciel dégagé"},"C",4,"12:34:24",null,null,null,null,null,null,"Orageux","Soleil orage","Soleil averses orageuses","Pluies orageuses","Orage","Orage et grêles","Orage violent"]
["2017-10-08",24.6,"11:44:27",66,"23:59:27",14,"01:09:24",19.100000000000001,"15:54:27",99,"23:59:27",1020.5,"10:49:24",0,"00:14:24",7.2,"17:19:27",0,"03:29:24",8.6,"15:09:27",315,"NO","00:54:24",0.3,3,191.1,186.9,13,null,{"$f":"IF(AC21=\"\",\"\",VLOOKUP(AC21,List!$B$2:$E$29,4,FALSE))","v":"Pluies et éclaircies"},"Averses ou fortes pluies",3,"12:49:27"]
["2017-10-09",32.200000000000003,"15:44:24",63,"23:59:24",14.3,"00:04:27",22.5,"15:29:24",91,"23:59:24",1021,"10:39:27",0,"00:04:27",7.2,"16:34:24",0,"00:04:27",8.6,"16:34:24",90,"EST","10:49:27",0.3,3.3,191.4,535.28,13,null,{"$f":"IF(AC22=\"\",\"\",VLOOKUP(AC22,List!$B$2:$E$29,4,FALSE))","v":"Pluies et éclaircies"},"Pluies et éclaircies",4,"12:09:24",null,null,null,null,null,null,"Grèle & Neige","Giboulées","Grèles","Neiges","Fortes neiges",0,0]
["2017-10-10",25.4,"21:34:25",63,"23:59:25",13.7,"07:34:24",16.8,"13:34:25",85,"23:59:25",1018.9,"10:29:25",0,"01:39:24",8.6,"13:49:25",0,"05:24:24",12.2,"13:49:25",90,"EST","09:54:25",0,3.3,191.4,213.09,1,null,{"$f":"IF(AC23=\"\",\"\",VLOOKUP(AC23,List!$B$2:$E$29,4,FALSE))","v":"Ciel dégagé"},"Pluies éparses",2,"10:49:25"]
["2017-10-11",41,"15:54:27",60,"23:59:27",13,"06:34:25",21.2,"16:04:27",90,"23:59:27",1016.8,"00:04:25",0,"00:14:25",13.3,"15:54:27",0,"00:24:25",19.399999999999999,"15:44:27",135,"SE","08:59:27",0.6,3.9,192,414.77,13,null,{"$f":"IF(AC24=\"\",\"\",VLOOKUP(AC24,List!$B$2:$E$29,4,FALSE))","v":"Pluies et éclaircies"},"Pluies et éclaircies",4,"11:34:27",null,null,null,null,null,null,"Temps de nuit","Ciel dégagé de nuit","Ciel voilé de nuit","Brume ou brouillard léger de nuit","Brume ou léger brouillard givrant de nuit ","Brouillard dense de nuit","Ciel nuageux avec éclaircies de nuit"]
["2017-10-12",26.3,"21:19:26",62,"23:59:26",14.1,"08:39:27",21.6,"13:09:26",93,"23:59:26",1022.1,"11:54:26",0,"00:14:27",8.6,"12:34:26",0,"08:39:27",13.3,"15:29:26",90,"EST","08:34:27",0.6,4.5,192.6,556.47,16,null,{"$f":"IF(AC25=\"\",\"\",VLOOKUP(AC25,List!$B$2:$E$29,4,FALSE))","v":"Averses ou fortes pluies"},"C",5,"13:09:26"]
["2017-10-13",26.3,"20:49:26",62,"23:59:26",8.8000000000000007,"23:59:26",21,"16:14:26",97,"23:59:26",1024.0999999999999,"10:39:26",0,"02:49:26",7.2,"14:39:26",0,"02:59:26",12.2,"14:39:26",90,"EST","01:44:26",0.6,5.0999999999999996,193.2,475.92,13,null,{"$f":"IF(AC26=\"\",\"\",VLOOKUP(AC26,List!$B$2:$E$29,4,FALSE))","v":"Pluies et éclaircies"},null,4,"14:34:26"]
["2017-10-14",25.8,"00:04:26",64,"23:59:27",6.5,"06:39:26",25.4,"15:39:27",96,"23:59:27",1024.4000000000001,"10:19:26",0,"00:04:26",6.1,"14:49:27",0,"00:04:26",8.6,"16:54:27",90,"EST","13:59:27",0.3,5.3999999999999995,193.5,381.98,13,null,{"$f":"IF(AC27=\"\",\"\",VLOOKUP(AC27,List!$B$2:$E$29,4,FALSE))","v":"Pluies et éclaircies"},null,4,"13:34:27"]
["2017-10-15",25,"21:59:28",64,"23:59:28",9.4,"00:49:27",23.5,"16:14:28",76,"23:59:28",1018.3,"00:39:27",0,"00:04:27",13.3,"16:09:28",0,"00:14:27",19.399999999999999,"18:39:28",135,"SE","09:09:27",0,5.3999999999999995,193.5,418.64,10,null,{"$f":"IF(AC28=\"\",\"\",VLOOKUP(AC28,List!$B$2:$E$29,4,FALSE))","v":"Nuageux"},null,4,"13:49:28"]
["2017-10-16",26.1,"21:29:29",62,"23:59:29",10.5,"22:59:29",19.5,"11:29:29",97,"23:59:29",1020.2,"23:24:29",0,"01:44:28",14.8,"11:09:28",0,"01:44:28",19.399999999999999,"11:09:28",180,"S","00:49:28",0,5.3999999999999995,193.5,59.58,10,null,{"$f":"IF(AC29=\"\",\"\",VLOOKUP(AC29,List!$B$2:$E$29,4,FALSE))","v":"Nuageux"},null,1,"10:14:28"]
["2017-10-17",26.3,"21:19:29",62,"23:59:29",9.9,"00:49:29",20.2,"14:19:29",92,"23:59:29",1020.5,"00:39:29",0,"00:04:29",12.2,"16:34:29",0,"00:04:29",14.8,"16:14:29",90,"EST","10:54:29",0.3,5.6999999999999993,193.8,421.42,13,null,{"$f":"IF(AC30=\"\",\"\",VLOOKUP(AC30,List!$B$2:$E$29,4,FALSE))","v":"Pluies et éclaircies"},null,4,"15:09:29"]
["2017-10-18",25.8,"00:04:29",67,"23:59:30",13.4,"02:19:29",20.5,"15:04:30",99,"23:59:30",1009.7,"00:09:29",0,"00:04:29",6.1,"19:39:30",0,"00:04:29",8.6,"19:39:30",90,"EST","15:29:30",0.6,6.2999999999999989,194.4,312.70999999999998,13,null,{"$f":"IF(AC31=\"\",\"\",VLOOKUP(AC31,List!$B$2:$E$29,4,FALSE))","v":"Pluies et éclaircies"},null,4,"13:04:30"]
["2017-10-19",24.4,"21:54:29",64,"23:59:29",12.2,"23:34:29",18.100000000000001,"12:59:29",86,"23:59:29",1006.3,"00:04:30",0,"00:34:30",17.3,"17:34:29",0,"01:29:30",27,"17:34:29",0,"N","00:09:30",10.8,17.100000000000001,205.2,243.83,16,null,{"$f":"IF(AC32=\"\",\"\",VLOOKUP(AC32,List!$B$2:$E$29,4,FALSE))","v":"Averses ou fortes pluies"},null,3,"11:29:29"]
["2017-10-20",24.6,"21:49:30",60,"23:59:30",7.2,"09:04:29",18.7,"16:09:30",90,"23:59:30",1012.1,"11:14:29",0,"08:44:29",15.8,"22:14:30",0,"08:49:29",23.4,"14:54:30",90,"EST","21:59:30",0.3,17.400000000000002,205.5,453.83,13,null,{"$f":"IF(AC33=\"\",\"\",VLOOKUP(AC33,List!$B$2:$E$29,4,FALSE))","v":"Pluies et éclaircies"},null,4,"12:44:30"]
["2017-10-21",24.6,"22:44:31",53,"23:59:31",9.8000000000000007,"23:49:31",17.600000000000001,"00:04:30",77,"23:59:31",1014.7,"23:59:31",2.5,"14:54:31",19.399999999999999,"16:04:31",3.6,"14:59:31",27,"11:39:31",135,"SE","12:24:31",3,20.400000000000002,208.5,382.21,13,null,{"$f":"IF(AC34=\"\",\"\",VLOOKUP(AC34,List!$B$2:$E$29,4,FALSE))","v":"Pluies et éclaircies"},null,4,"14:24:31"]
["2017-10-22",24.9,"22:39:31",58,"23:59:31",9,"07:09:31",18.5,"15:04:31",80,"23:59:31",1021.4,"23:14:31",1.1000000000000001,"06:59:31",11.2,"00:14:31",1.1000000000000001,"23:34:31",18.399999999999999,"13:19:31",90,"EST","05:49:31",0,20.400000000000002,208.5,464.55,1,null,{"$f":"IF(AC35=\"\",\"\",VLOOKUP(AC35,List!$B$2:$E$29,4,FALSE))","v":"Ciel dégagé"},null,4,"12:49:31"]
["2017-10-23",25.4,"21:34:32",60,"23:59:32",10.6,"03:04:31",16.399999999999999,"17:39:32",88,"23:59:32",1021.5,"00:39:31",0,"02:34:31",15.8,"12:19:32",0,"02:34:31",20.9,"12:19:32",90,"EST","15:44:32",1.5,21.900000000000002,210,184.97,13,null,{"$f":"IF(AC36=\"\",\"\",VLOOKUP(AC36,List!$B$2:$E$29,4,FALSE))","v":"Pluies et éclaircies"},null,3,"13:44:32"]
["2017-10-24",24.7,"21:14:33",63,"23:59:33",13.1,"23:49:33",18.8,"15:29:33",89,"23:59:33",1022.2,"10:34:32",0,"01:34:32",11.2,"15:54:33",1.1000000000000001,"01:34:32",14.8,"13:39:33",135,"SE","01:34:32",0,21.900000000000002,210,407.11,1,null,{"$f":"IF(AC37=\"\",\"\",VLOOKUP(AC37,List!$B$2:$E$29,4,FALSE))","v":"Ciel dégagé"},null,3,"12:44:33"]
["2017-10-25",25.6,"12:04:33",61,"23:59:33",8.1999999999999993,"08:14:33",26,"12:54:33",95,"23:59:33",1021.5,"10:29:33",0,"00:14:33",9.6999999999999993,"00:49:33",0,"00:14:33",12.2,"00:49:33",90,"EST","07:29:33",0,21.900000000000002,210,493.86,1,null,{"$f":"IF(AC38=\"\",\"\",VLOOKUP(AC38,List!$B$2:$E$29,4,FALSE))","v":"Ciel dégagé"},null,3,"11:29:33"]
["2017-10-26",25.8,"21:19:33",61,"23:59:33",7.4,"08:44:33",25.7,"15:54:33",97,"23:59:33",1024.3,"23:54:33",0,"00:04:33",3.6,"13:54:33",0,"00:04:33",5,"13:54:33",90,"EST","11:24:33",0.3,22.200000000000003,210.3,431.17,13,null,{"$f":"IF(AC39=\"\",\"\",VLOOKUP(AC39,List!$B$2:$E$29,4,FALSE))","v":"Pluies et éclaircies"},null,3,"12:14:33"]
["2017-10-27",24.8,"14:09:33",62,"23:59:33",11.6,"23:59:33",16.600000000000001,"13:34:33",91,"23:59:33",1032.8,"23:29:33",0,"00:09:33",8.6,"15:19:33",0,"02:49:33",11.2,"15:19:33",315,"NO","01:19:33",0,22.200000000000003,210.3,102.44,10,null,{"$f":"IF(AC40=\"\",\"\",VLOOKUP(AC40,List!$B$2:$E$29,4,FALSE))","v":"Nuageux"},null,2,"11:39:33"]
["2017-10-28",24.6,"11:24:33",62,"23:59:31",3.7,"08:14:33",21.8,"14:29:31",82,"23:59:31",1032.5999999999999,"00:09:33",0,"00:04:33",9.6999999999999993,"13:59:31",0,"00:04:33",12.2,"13:59:31",45,"NE","09:29:33",0,22.200000000000003,210.3,511.53,1,null,{"$f":"IF(AC41=\"\",\"\",VLOOKUP(AC41,List!$B$2:$E$29,4,FALSE))","v":"Ciel dégagé"},null,4,"13:29:31"]
["2017-10-29",25.2,"16:39:32",65,"22:59:32",11.8,"01:24:31",15.8,"13:44:32",85,"23:49:32",1025,"00:04:31",0,"02:39:31",13.3,"16:59:32",1.1000000000000001,"02:39:31",18.399999999999999,"16:59:32",315,"NO","09:49:31",0,22.200000000000003,210.3,145.25,10,null,{"$f":"IF(AC42=\"\",\"\",VLOOKUP(AC42,List!$B$2:$E$29,4,FALSE))","v":"Nuageux"},null,3,"13:24:32"]
["2017-10-30",24.1,"21:54:32",62,"23:59:32",1.4,"23:54:32",17.7,"12:39:32",90,"23:59:32",1028.3,"09:54:32",0,"02:04:32",13.3,"13:49:32",0,"03:04:32",17.3,"14:09:32",315,"NO","00:44:32",0,22.200000000000003,210.3,458.94,1,null,{"$f":"IF(AC43=\"\",\"\",VLOOKUP(AC43,List!$B$2:$E$29,4,FALSE))","v":"Ciel dégagé"},null,3,"10:59:32"]
["2017-10-31",24.3,"20:14:33",57,"23:59:33",-0.3,"06:39:32",16.3,"14:19:33",90,"23:59:33",1027.5999999999999,"00:54:32",0,"00:04:32",6.1,"11:49:33",0,"00:04:32",8.6,"12:19:33",90,"EST","15:34:33",0,22.200000000000003,210.3,354.48,1,null,{"$f":"IF(AC44=\"\",\"\",VLOOKUP(AC44,List!$B$2:$E$29,4,FALSE))","v":"Ciel dégagé"},null,3,"11:29:33"]
["",null,null,null,null,null,null,null,null,null,null,null,null,null,null,null,null,null,null,null,null,"",null,null,null,"",null,null,null,null,{"$f":"IF(AC45=\"\",\"\",VLOOKUP(AC45,List!$B$2:$E$29,4,FALSE))","v":""}]
["",null,null,null,null,null,null,null,null,null,null,null,null,null,null,null,null,null,null,null,null,"",null,null,null,"",null,null,null,null,{"$f":"IF(AC46=\"\",\"\",VLOOKUP(AC46,List!$B$2:$E$29,4,FALSE))","v":""}]

{"sheet":"Novembre 17","index":10,"n_rows":46,"n_cols":53,"rows_kept":46,"cut":false,"hidden":true,"merged":[[12,35,12,38]]}
["Soleil","C","Ciel voilé","Rares éclaircies","Soleil Fortes averses","Variable",null,null,null,"Orageux","Soleil orage","Soleil averses orageuses","Pluies orageuses","Orage","Orage et grêles","Orage violent",null,null,null,null,null,null,null,null,null,null,null,null,null,null,null,null,null,null,null,null,null,null,null,null,null,null,30,51,299,700]
[null,1,2,0.03,4,5,null,null,null,null,18,19,20,21,22,23,null,null,null,null,null,null,null,null,null,null,null,null,null,null,null,null,null,null,null,null,null,null,null,null,null,null,null,null,null,null,null,null,null,null,{"$f":"COUNTIF($W$14:$W$46,AZ2)","v":2},"N",0]
["Nuageux & Brumeux","C","Brouillard dense","Brume ou Brouillard légé","Brume ou léger brouillard givrant","Nuageux","Couvert","Couvert rares averses",null,"Grèle & Neige","Giboulées","Grèles","Neiges","Fortes neiges",null,null,null,null,null,null,null,null,null,null,null,null,null,null,null,null,null,null,null,null,null,null,null,null,null,null,null,null,null,null,null,null,null,null,null,null,{"$f":"COUNTIF($W$14:$W$46,AZ3)","v":0},"NNE",23]
[null,6,7,0.08,9,10,11,12,null,null,24,25,26,27,null,null,null,null,null,null,null,null,null,null,null,null,null,null,null,null,null,null,null,null,null,null,null,null,null,null,null,null,null,null,null,null,null,null,null,null,1,"NE",45]
["Pluvieux","Pluies et éclaircies","Pluies éparses","Bruines","Averses ou fortes pluies","Pluies mélées de neige",null,null,null,null,null,null,null,null,null,null,null,null,null,null,null,null,null,null,null,null,null,null,null,null,null,null,null,null,null,null,null,null,null,null,null,null,null,null,null,null,null,null,null,null,0,"ENE",68]
[null,13,14,0.15,16,17,null,null,null,null,null,null,null,null,null,null,null,null,null,null,null,null,null,null,null,null,null,null,null,null,null,null,null,null,null,null,null,null,null,null,null,null,null,null,null,null,null,null,null,null,12,"EST",90]
[null,null,null,null,null,{"$f":"IF(F14=\"\",\"\",MIN(F14:F46))","v":0.4},null,{"$f":"IF(H14=\"\",\"\",MIN(H14:H46))","v":9.6},null,0.98,null,1006,null,0,null,2.5,null,0,null,3.6,null,{"$f":"VLOOKUP(W7,$AZ$2:$BA$17,2,FALSE)","v":23},{"$f":"W10","v":"NNE"},null,{"$f":"MIN(Y14:Y46)","v":0},null,null,138.72,null,null,null,null,2,null,null,null,null,null,null,null,null,null,null,null,null,null,null,null,null,null,0,"ESE",113]
[null,null,null,null,null,{"$f":"IF(F15=\"\",\"\",MAX(F14:F46))","v":11.5},null,{"$f":"IF(H15=\"\",\"\",MAX(H14:H46))","v":20.399999999999999},null,0.96,null,1028.4000000000001,null,1.1000000000000001,null,28.1,null,3.6,null,34.200000000000003,null,{"$f":"VLOOKUP(W8,$AZ$2:$BA$17,2,FALSE)","v":315},{"$f":"W11","v":"NO"},null,{"$f":"MAX(Y14:Y46)","v":13.5},66.600000000000009,290.7,457.89,null,null,null,null,3,null,null,null,null,null,null,null,null,null,null,null,null,null,null,null,null,null,2,"SE",135]
[null,null,null,null,null,null,null,null,null,null,null,null,null,null,null,null,null,null,null,null,null,null,null,null,null,null,null,null,null,null,null,null,null,null,null,null,null,null,null,null,null,null,null,null,null,null,null,null,null,null,0,"SSE",158]
[null,null,null,null,null,null,null,null,null,null,null,null,null,null,null,null,null,null,null,null,null,{"$f":"SMALL($AY$2:$AY$17,1)","v":0},{"$f":"VLOOKUP(V10,$AY$2:$AZ$17,2,FALSE)","v":"NNE"},null,null,{"$f":"MAX(Z14:Z46)","v":66.600000000000009},null,null,null,null,null,null,null,null,null,null,null,null,null,null,null,31,99,300,null,null,null,null,null,null,0,"S",180]
[null,null,null,null,null,{"$f":"IF(F14=\"\",\"\",MIN(F14:F46))","v":0.4},{"$f":"VLOOKUP(F11,F14:G46,2,FALSE)","v":"08:19:45"},{"$f":"IF(H14=\"\",\"\",MAX(H14:H46))","v":20.399999999999999},{"$f":"VLOOKUP(H11,H14:I46,2,FALSE)","v":"13:44:37"},null,null,null,null,null,null,null,null,null,null,null,null,{"$f":"LARGE($AY$2:$AY$17,1)","v":13},{"$f":"VLOOKUP(V11,$AY$2:$AZ$17,2,FALSE)","v":"NO"},null,null,null,null,null,null,null,null,null,null,null,null,null,null,null,null,null,null,49,100,301,null,null,null,null,null,null,0,"SSO",203]
["Moyenne Mensuelle",{"$f":"AVERAGE(B14:B46)","v":22.933333333333337},null,{"$f":"AVERAGE(D14:D46)","v":54.29},null,{"$f":"AVERAGE(F14:F46)","v":4.1966666666666672},null,{"$f":"AVERAGE(H14:H46)","v":14.55},null,{"$f":"AVERAGE(J14:J46)","v":82.199333333333328},null,{"$f":"AVERAGE(L14:L46)","v":1020.1099999999999},null,{"$f":"AVERAGE(N14:N46)","v":7.3333333333333334E-2},null,null,null,{"$f":"AVERAGE(R14:R46)","v":0.3133333333333333},null,null,null,null,"SE","09:30:45",{"$f":"AVERAGE(Y14:Y44)","v":2.2200000000000002},{"$f":"AVERAGE(Z14:Z46)","v":24.610000000000003},null,{"$f":"AVERAGE(AB14:AB46)","v":314.71466666666669},null,null,null,null,{"$f":"AVERAGE(AG14:AG46)","v":2.5},null,null,null,null,null,null,null,null,50,101,699,null,null,null,null,null,null,0,"SO",225]
["Jour","T°               int.    (°C)","Heure","Hum              int.       (%)","Heure","T°              Mini                 ext.    (°C)","Heure","T°               Maxi                     ext.    (°C)","Heure","Hum           ext.      (%)","Heure","Press.         rel.        (hpa)","Heure","Vit. du vent    (km/h)","Heure","Vit. du vent    (km/h)","Heure","Rafale  Min        (km/h)","Heure","Rafale    Max      (km/h)","Heure","Direction                      du vent"," -","Heure","Précipi. dern. 24 h        (mm)","Précipi. Tot. mois          (mm)","Précipi. Tot. An        (mm)","Lumière (W/M2)",null,null,null,null,"UVI","Heure",null,"Intensité des UV",null,null,null,null,null,null,null,null,null,null,null,null,null,null,0,"OSO",248]
["2017-11-01",24,"14:49:34",60,"23:59:34",1.5,"03:39:33",16.2,"14:39:34",91,"23:59:34",1020.2,"00:04:33",0,"00:04:33",6.1,"10:09:33",0,"00:04:33",8.6,"10:09:33",{"$f":"IF(W14=\"N\",0,IF(W14=\"NNE\",23,IF(W14=\"NE\",45,IF(W14=\"ENE\",68,IF(W14=\"EST\",90,IF(W14=\"ESE\",113,IF(W14=\"SE\",135,IF(W14=\"SSE\",158,IF(W14=\"S\",180,IF(W14=\"SSO\",203,IF(W14=\"SO\",225,IF(W14=\"OSO\",248,IF(W14=\"O\",270,IF(W14=\"ONO\",293,IF(W14=\"NO\",315,IF(W14=\"NNO\",338,\"\"))))))))))))))))","v":90},"EST","07:44:33",0,0,210.3,313.72000000000003,1,null,{"$f":"IF(AC14=\"\",\"\",VLOOKUP(AC14,List!$B$2:$E$29,4,FALSE))","v":"Ciel dégagé"},null,3,"11:24:34",null,"FAIBLE","<2",null,null,null,"Soleil","C","Ciel voilé","Rares éclaircies","Soleil Fortes averses","Variable",0,0,null,null,0,"O",270]
[{"$f":"IF(B15=\"\",\"\",A14+1)","v":"2017-11-02"},26.3,"20:09:37",59,"23:59:37",3.6,"03:09:34",20.399999999999999,"13:44:37",96,"23:49:37",1015.2,"10:09:37",0,"00:04:34",6.1,"11:19:37",0,"00:04:34",8.6,"11:19:37",90,"EST","04:24:34",0,{"$f":"IF(Y15=\"\",\"\",Y15+Z14)","v":0},210.3,328.14,1,null,{"$f":"IF(AC15=\"\",\"\",VLOOKUP(AC15,List!$B$2:$E$29,4,FALSE))","v":"Ciel dégagé"},{"$f":"IF(AC15=\"\",\"\",)","v":0},3,"10:49:37",null,"MODEREE",3,"à",5,null,null,null,null,null,null,null,null,null,null,null,0,"ONO",293]
[{"$f":"IF(B16=\"\",\"\",A15+1)","v":"2017-11-03"},25.1,"21:39:36",0.7,"14:29:35",10.1,"03:54:37",16,"13:59:35",0.98,"10:54:35",1013.1,"00:09:37",0,"00:04:37",6.1,"11:04:35",0,"00:34:37",9.6999999999999993,"15:24:35",90,"EST","02:04:37",3,3,213.3,201.95,13,null,{"$f":"IF(AC16=\"\",\"\",VLOOKUP(AC16,List!$B$2:$E$29,4,FALSE))","v":"Pluies et éclaircies"},"Averses ou fortes pluies",2,"10:49:35",null,"FORTE",6,"à",7,null,"Nuageux & Brumeux","C","Brouillard dense","Brume ou Brouillard légé","Brume ou léger brouillard givrant","Nuageux","Couvert","Couvert rares averses",null,null,13,"NO",315]
["2017-11-04",23.8,"00:04:36",61,"23:59:37",6.9,"23:34:37",15.6,"13:19:37",87,"23:59:37",1011.7,"23:59:37",0,"02:14:36",8.6,"15:44:37",0,"02:29:36",9.6999999999999993,"11:49:37",315,"NO","10:24:37",3.6,6.6,216.9,164.43,13,null,{"$f":"IF(AC17=\"\",\"\",VLOOKUP(AC17,List!$B$2:$E$29,4,FALSE))","v":"Pluies et éclaircies"},"Pluies et éclaircies",3,"12:14:37",null,"TRES FORTE",8,"à",10,null,null,null,null,null,null,null,null,null,null,null,0,"NNO",338]
["2017-11-05",20,"00:09:37",60,"23:59:37",6,"23:29:37",12.6,"14:29:37",87,"23:59:37",1021.7,"23:44:37",0,"09:49:37",13.3,"18:29:37",0,"15:09:37",15.8,"07:19:37",315,"NO","01:54:37",0,6.6,0,407.69,1,null,{"$f":"IF(AC18=\"\",\"\",VLOOKUP(AC18,List!$B$2:$E$29,4,FALSE))","v":"Ciel dégagé"},"C",3,"14:19:37",null,"EXTREME","11+",null,null,null,"Pluvieux","Pluies et éclaircies","Pluies éparses","Bruines","Averses ou fortes pluies","Pluies mélées de neige"]
["2017-11-06",17.5,"00:04:37",61,"23:59:37",1.6,"23:44:37",18.600000000000001,"14:59:37",90,"23:59:37",1025.4000000000001,"09:24:37",0,"00:09:37",5,"14:54:37",0,"03:29:37",6.1,"10:14:37",315,"NO","05:44:37",0.9,7.5,231.6,416.59,13,null,{"$f":"IF(AC19=\"\",\"\",VLOOKUP(AC19,List!$B$2:$E$29,4,FALSE))","v":"Pluies et éclaircies"},"C",3,"12:09:37"]
["2017-11-07",16.7,"00:04:37",62,"23:59:37",1.8,"00:14:37",12.6,"12:24:37",75,"23:59:37",1021.4,"00:14:37",0,"00:14:37",13.3,"11:09:37",0,"00:14:37",19.399999999999999,"10:54:37",90,"EST","19:09:37",7.8,15.3,239.4,372.73,16,null,{"$f":"IF(AC20=\"\",\"\",VLOOKUP(AC20,List!$B$2:$E$29,4,FALSE))","v":"Averses ou fortes pluies"},"C",3,"11:54:37",null,null,null,null,null,null,"Orageux","Soleil orage","Soleil averses orageuses","Pluies orageuses","Orage","Orage et grêles","Orage violent"]
["2017-11-08",16.2,"12:29:37",62,"23:59:37",1.4,"21:29:37",14.7,"13:39:37",90,"23:59:37",1024.2,"23:24:37",0,"02:49:37",18.399999999999999,"13:44:37",0,"03:04:37",24.5,"13:44:37",315,"NO","03:59:37",2.7,18,242.1,457.89,13,null,{"$f":"IF(AC21=\"\",\"\",VLOOKUP(AC21,List!$B$2:$E$29,4,FALSE))","v":"Pluies et éclaircies"},"Averses ou fortes pluies",3,"12:09:37"]
["2017-11-09",15.9,"00:04:37",64,"23:59:37",1,"07:34:37",12.5,"15:59:37",91,"23:59:37",1025.3,"09:54:37",0,"00:04:37",7.2,"12:19:37",0,"00:04:37",9.6999999999999993,"12:29:37",90,"EST","10:19:37",0.6,18.600000000000001,242.7,220.09,13,null,{"$f":"IF(AC22=\"\",\"\",VLOOKUP(AC22,List!$B$2:$E$29,4,FALSE))","v":"Pluies et éclaircies"},"Pluies et éclaircies",3,"11:34:37",null,null,null,null,null,null,"Grèle & Neige","Giboulées","Grèles","Neiges","Fortes neiges",0,0]
["2017-11-10",16,"22:29:37",65,"23:59:37",8.6,"00:34:37",15.3,"14:34:37",82,"23:59:37",1024.3,"01:04:37",0,"00:04:37",8.6,"14:49:37",0,"00:04:37",12.2,"23:24:37",315,"NO","09:39:37",0.3,18.900000000000002,243,319.56,13,null,{"$f":"IF(AC23=\"\",\"\",VLOOKUP(AC23,List!$B$2:$E$29,4,FALSE))","v":"Pluies et éclaircies"},"Pluies éparses",3,"12:59:37"]
["2017-11-11",16.7,"19:44:37",68,"23:59:37",11,"00:04:37",14.9,"14:14:37",83,"23:59:37",1022.3,"00:04:37",1.1000000000000001,"00:29:37",12.2,"11:59:37",2.5,"00:29:37",18.399999999999999,"11:59:37",90,"EST","04:04:37",0.3,19.200000000000003,243.3,144.13,4,null,{"$f":"IF(AC24=\"\",\"\",VLOOKUP(AC24,List!$B$2:$E$29,4,FALSE))","v":"Soleil nuageux et averses"},"Pluies et éclaircies",2,"11:39:37",null,null,null,null,null,null,"Temps de nuit","Ciel dégagé de nuit","Ciel voilé de nuit","Brume ou brouillard léger de nuit","Brume ou léger brouillard givrant de nuit ","Brouillard dense de nuit","Ciel nuageux avec éclaircies de nuit"]
["2017-11-12",17.2,"13:09:37",65,"23:59:37",7.4,"21:29:37",14.1,"12:59:37",62,"23:59:37",1020.3,"23:54:37",1.1000000000000001,"05:49:37",23.4,"16:54:37",3.6,"00:59:37",31.7,"13:29:37",90,"EST","07:04:37",1.2,20.400000000000002,244.5,380.43,13,null,{"$f":"IF(AC25=\"\",\"\",VLOOKUP(AC25,List!$B$2:$E$29,4,FALSE))","v":"Pluies et éclaircies"},"C",3,"11:59:37"]
["2017-11-13",20.9,"21:04:45",61,"23:59:45",2.2000000000000002,"07:34:37",15.2,"13:29:37",85,"23:59:45",1025.5999999999999,"22:54:45",0,"01:44:37",13.3,"14:19:37",0,"01:54:37",18.399999999999999,"14:24:37",0,"N","00:04:37",0,20.400000000000002,244.5,452.83,1,null,{"$f":"IF(AC26=\"\",\"\",VLOOKUP(AC26,List!$B$2:$E$29,4,FALSE))","v":"Ciel dégagé"},null,3,"11:49:37"]
["2017-11-14",25.1,"21:54:45",55,"23:59:45",0.4,"08:19:45",16.8,"13:09:45",88,"23:59:45",1026.5,"10:39:45",0,"00:04:45",6.1,"14:34:45",0,"00:09:45",9.6999999999999993,"14:44:45",90,"EST","11:19:45",0,20.400000000000002,244.5,392.19,1,null,{"$f":"IF(AC27=\"\",\"\",VLOOKUP(AC27,List!$B$2:$E$29,4,FALSE))","v":"Ciel dégagé"},null,3,"12:14:45"]
["2017-11-15",25.8,"16:14:46",56,"23:59:41",2.1,"00:44:45",18.100000000000001,"14:14:46",91,"23:59:41",1025.2,"09:34:45",0,"00:04:45",6.1,"12:34:45",0,"00:04:45",8.6,"12:44:45",45,"NE","02:19:45",0,20.400000000000002,244.5,391.49,1,null,{"$f":"IF(AC28=\"\",\"\",VLOOKUP(AC28,List!$B$2:$E$29,4,FALSE))","v":"Ciel dégagé"},null,3,"11:59:45"]
["2017-11-16",26.3,"20:49:41",53,"23:59:41",2.4,"23:59:41",12.8,"13:29:41",90,"23:59:41",1023.6,"23:44:41",0,"00:09:41",2.5,"12:39:41",0,"00:09:41",3.6,"05:19:41",90,"EST","01:59:41",0,20.400000000000002,244.5,264.60000000000002,1,null,{"$f":"IF(AC29=\"\",\"\",VLOOKUP(AC29,List!$B$2:$E$29,4,FALSE))","v":"Ciel dégagé"},null,2,"10:34:41"]
["2017-11-17",25.1,"19:19:43",53,"23:59:43",0.6,"02:49:41",13.2,"12:14:41",92,"23:59:43",1026.4000000000001,"10:09:41",0,"00:04:41",6.1,"12:24:41",0,"00:09:41",7.2,"12:24:41",90,"EST","05:04:41",0,20.400000000000002,244.5,288.62,1,null,{"$f":"IF(AC30=\"\",\"\",VLOOKUP(AC30,List!$B$2:$E$29,4,FALSE))","v":"Ciel dégagé"},null,3,"12:04:41"]
["2017-11-18",24.8,"19:24:43",54,"23:59:43",1.7,"02:49:43",14.8,"12:54:43",86,"23:59:43",1026.0999999999999,"11:44:43",0,"00:04:43",3.6,"14:14:43",0,"00:09:43",6.1,"14:14:43",315,"NO","02:39:43",0.3,20.700000000000003,244.8,263.29000000000002,13,null,{"$f":"IF(AC31=\"\",\"\",VLOOKUP(AC31,List!$B$2:$E$29,4,FALSE))","v":"Pluies et éclaircies"},null,2,"10:39:43"]
["2017-11-19",24.8,"16:29:44",56,"23:59:44",7.4,"03:19:43",13.7,"13:29:44",91,"23:59:44",1022.7,"20:29:44",0,"00:14:43",5,"05:49:43",0,"00:49:43",6.1,"05:49:43",315,"NO","04:34:43",1.2,21.900000000000002,246,138.72,13,null,{"$f":"IF(AC32=\"\",\"\",VLOOKUP(AC32,List!$B$2:$E$29,4,FALSE))","v":"Pluies et éclaircies"},null,2,"11:54:44"]
["2017-11-20",26.2,"18:59:44",53,"23:59:44",2.2999999999999998,"06:14:44",14.4,"13:44:44",80,"23:59:44",1022.5,"00:09:44",0,"00:04:44",11.2,"11:24:44",0,"00:14:44",19.399999999999999,"11:24:44",0,"N","08:59:44",0,21.900000000000002,246,313.20999999999998,1,null,{"$f":"IF(AC33=\"\",\"\",VLOOKUP(AC33,List!$B$2:$E$29,4,FALSE))","v":"Ciel dégagé"},null,2,"10:29:44"]
["2017-11-21",26.1,"19:09:44",56,"23:59:44",11.5,"20:59:44",15.2,"14:44:44",79,"23:59:44",1016.2,"01:19:44",0,"05:09:44",11.2,"14:34:44",0,"09:14:44",15.8,"14:34:44",90,"EST","17:54:44",0,21.900000000000002,246,166.91,1,null,{"$f":"IF(AC34=\"\",\"\",VLOOKUP(AC34,List!$B$2:$E$29,4,FALSE))","v":"Ciel dégagé"},null,2,"12:09:44"]
["2017-11-22",26.1,"21:24:44",52,"23:59:44",9.3000000000000007,"05:49:44",16.5,"14:44:44",70,"23:59:44",1008.8,"00:04:44",0,"07:14:44",20.9,"23:44:44",1.1000000000000001,"07:14:44",30.6,"17:14:44",135,"SE","00:19:44",2.7,24.6,248.7,320.06,13,null,{"$f":"IF(AC35=\"\",\"\",VLOOKUP(AC35,List!$B$2:$E$29,4,FALSE))","v":"Pluies et éclaircies"},null,2,"10:49:44"]
["2017-11-23",24.9,"14:09:42",55,"23:59:42",10.4,"23:59:42",15.7,"14:24:42",86,"23:59:42",1006,"18:39:42",0,"21:04:42",28.1,"00:44:44",1.1000000000000001,"21:04:42",34.200000000000003,"00:34:44",135,"SE","10:29:42",13.5,38.1,262.2,312.79000000000002,16,null,{"$f":"IF(AC36=\"\",\"\",VLOOKUP(AC36,List!$B$2:$E$29,4,FALSE))","v":"Averses ou fortes pluies"},null,2,"10:34:42"]
["2017-11-24",24.9,"13:54:43",53,"23:59:43",2.6,"23:49:43",15.4,"13:29:43",90,"23:59:43",1011.6,"10:44:43",0,"00:49:42",13.3,"00:04:42",0,"00:49:42",17.3,"00:04:42",315,"NO","00:14:42",0.3,38.4,262.5,398.84,1,null,{"$f":"IF(AC37=\"\",\"\",VLOOKUP(AC37,List!$B$2:$E$29,4,FALSE))","v":"Ciel dégagé"},null,3,"11:49:43"]
["2017-11-25",25.7,"18:54:44",49,"23:59:44",1.8,"23:04:44",13,"13:59:44",82,"23:59:44",1023.8,"23:54:44",0,"00:04:43",11.2,"07:59:43",0,"00:04:43",17.3,"15:24:44",315,"NO","01:59:43",2.7,41.1,265.2,371.11,13,null,{"$f":"IF(AC38=\"\",\"\",VLOOKUP(AC38,List!$B$2:$E$29,4,FALSE))","v":"Pluies et éclaircies"},null,2,"11:04:44"]
["2017-11-26",25.7,"21:59:44",47,"23:59:44",0.9,"00:54:44",9.6,"13:54:44",84,"23:59:44",1028.4000000000001,"10:54:44",0,"00:49:44",12.2,"12:54:44",0,"02:04:44",17.3,"12:54:44",315,"NO","00:29:44",0,41.1,265.2,206.24,1,null,{"$f":"IF(AC39=\"\",\"\",VLOOKUP(AC39,List!$B$2:$E$29,4,FALSE))","v":"Ciel dégagé"},null,2,"10:49:44"]
["2017-11-27",25.5,"20:54:45",45,"23:59:45",5.5,"07:19:44",12.6,"14:19:45",87,"23:59:45",1027,"00:19:44",0,"06:39:44",15.8,"12:29:45",1.1000000000000001,"06:39:44",23.4,"13:39:45",90,"EST","23:49:45",8.1,49.2,273.3,286.26,16,null,{"$f":"IF(AC40=\"\",\"\",VLOOKUP(AC40,List!$B$2:$E$29,4,FALSE))","v":"Averses ou fortes pluies"},null,2,"11:34:45"]
["2017-11-28",25.5,"20:54:45",48,"23:59:45",2.2999999999999998,"23:29:45",13,"12:24:45",88,"23:59:45",1012,"00:44:45",0,"05:14:45",9.6999999999999993,"16:19:45",0,"17:39:45",14.8,"14:14:45",315,"NO","00:34:45",6.3,55.5,279.60000000000002,415,16,null,{"$f":"IF(AC41=\"\",\"\",VLOOKUP(AC41,List!$B$2:$E$29,4,FALSE))","v":"Averses ou fortes pluies"},null,2,"10:49:45"]
["2017-11-29",24.9,"21:14:46",47,"23:59:46",1.1000000000000001,"09:09:45",11.2,"14:19:45",90,"23:59:46",1012.3,"23:54:46",0,"00:14:45",19.399999999999999,"14:59:45",0,"00:29:45",30.6,"14:59:45",315,"NO","01:19:45",5.7,61.2,285.3,355.14,16,null,{"$f":"IF(AC42=\"\",\"\",VLOOKUP(AC42,List!$B$2:$E$29,4,FALSE))","v":"Averses ou fortes pluies"},null,2,"11:04:45"]
["2017-11-30",24.3,"20:49:47",48,"23:59:47",0.5,"01:34:46",11.8,"14:14:47",72,"23:59:47",1013.5,"09:59:46",0,"00:19:46",19.399999999999999,"14:54:47",0,"00:24:46",24.5,"14:54:47",315,"NO","03:54:46",5.4,66.600000000000009,290.7,376.79,16,null,{"$f":"IF(AC43=\"\",\"\",VLOOKUP(AC43,List!$B$2:$E$29,4,FALSE))","v":"Averses ou fortes pluies"},null,2,"10:49:47"]
["",null,null,null,null,null,null,null,null,null,null,null,null,null,null,null,null,null,null,null,null,"",null,null,null,"",null,null,null,null,{"$f":"IF(AC44=\"\",\"\",VLOOKUP(AC44,List!$B$2:$E$29,4,FALSE))","v":""}]
["",null,null,null,null,null,null,null,null,null,null,null,null,null,null,null,null,null,null,null,null,"",null,null,null,"",null,null,null,null,{"$f":"IF(AC45=\"\",\"\",VLOOKUP(AC45,List!$B$2:$E$29,4,FALSE))","v":""}]
["",null,null,null,null,null,null,null,null,null,null,null,null,null,null,null,null,null,null,null,null,"",null,null,null,"",null,null,null,null,{"$f":"IF(AC46=\"\",\"\",VLOOKUP(AC46,List!$B$2:$E$29,4,FALSE))","v":""}]

{"sheet":"Décembre 17","index":11,"n_rows":46,"n_cols":53,"rows_kept":46,"cut":false,"hidden":true,"merged":[[12,35,12,38]]}
["Soleil","C","Ciel voilé","Rares éclaircies","Soleil Fortes averses","Variable",null,null,null,"Orageux","Soleil orage","Soleil averses orageuses","Pluies orageuses","Orage","Orage et grêles","Orage violent",null,null,null,null,null,null,null,null,null,null,null,null,null,null,null,null,null,null,null,null,null,null,null,null,null,null,30,51,299,700]
[null,1,2,3,4,5,null,null,null,null,18,19,20,21,22,23,null,null,null,null,null,null,null,null,null,null,null,null,null,null,null,null,null,null,null,null,null,null,null,null,null,null,null,null,null,null,null,null,null,null,{"$f":"COUNTIF($W$14:$W$46,AZ2)","v":5},"N",0]
["Nuageux & Brumeux","C","Brouillard dense","Brume ou Brouillard légé","Brume ou léger brouillard givrant","Nuageux","Couvert","Couvert rares averses",null,"Grèle & Neige","Giboulées","Grèles","Neiges","Fortes neiges",null,null,null,null,null,null,null,null,null,null,null,null,null,null,null,null,null,null,null,null,null,null,null,null,null,null,null,null,null,null,null,null,null,null,null,null,{"$f":"COUNTIF($W$14:$W$46,AZ3)","v":1},"NNE",23]
[null,6,7,8,9,10,11,12,null,null,24,25,26,27,null,null,null,null,null,null,null,null,null,null,null,null,null,null,null,null,null,null,null,null,null,null,null,null,null,null,null,null,null,null,null,null,null,null,null,null,2,"NE",45]
["Pluvieux","Pluies et éclaircies","Pluies éparses","Bruines","Averses ou fortes pluies","Pluies mélées de neige",null,null,null,null,null,null,null,null,null,null,null,null,null,null,null,null,null,null,null,null,null,null,null,null,null,null,null,null,null,null,null,null,null,null,null,null,null,null,null,null,null,null,null,null,0,"ENE",68]
[null,13,14,15,16,17,null,null,null,null,null,null,null,null,null,null,null,null,null,null,null,null,null,null,null,null,null,null,null,null,null,null,null,null,null,null,null,null,null,null,null,null,null,null,null,null,null,null,null,null,8,"EST",90]
[null,null,null,null,null,{"$f":"IF(F14=\"\",\"\",MIN(F14:F46))","v":-2.2000000000000002},null,{"$f":"IF(H14=\"\",\"\",MIN(H14:H46))","v":6.9},null,0.63,null,999.6,null,0,null,2.5,null,0,null,3.6,null,{"$f":"VLOOKUP(W7,$AZ$2:$BA$17,2,FALSE)","v":68},{"$f":"W10","v":"ENE"},null,{"$f":"MIN(Y14:Y46)","v":0},null,null,62.38,null,null,null,null,1,null,null,null,null,null,null,null,null,null,null,null,null,null,null,null,null,null,0,"ESE",113]
[null,null,null,null,null,{"$f":"IF(F15=\"\",\"\",MAX(F14:F46))","v":10.8},null,{"$f":"IF(H15=\"\",\"\",MAX(H14:H46))","v":17.600000000000001},null,0.91,null,1038.5,null,6.1,null,33.1,null,9.6999999999999993,null,45.4,null,{"$f":"VLOOKUP(W8,$AZ$2:$BA$17,2,FALSE)","v":90},{"$f":"W11","v":"EST"},null,{"$f":"MAX(Y14:Y46)","v":29.4},128.1,418.8,378.84,null,null,null,null,3,null,null,null,null,null,null,null,null,null,null,null,null,null,null,null,null,null,6,"SE",135]
[null,null,null,null,null,null,null,null,null,null,null,null,null,null,null,null,null,null,null,null,null,null,null,null,null,null,null,null,null,null,null,null,null,null,null,null,null,null,null,null,null,null,null,null,null,null,null,null,null,null,0,"SSE",158]
[null,null,null,null,null,null,null,null,null,null,null,null,null,null,null,null,null,null,null,null,null,{"$f":"SMALL($AY$2:$AY$17,1)","v":0},{"$f":"VLOOKUP(V10,$AY$2:$AZ$17,2,FALSE)","v":"ENE"},null,null,{"$f":"MAX(Z14:Z46)","v":128.1},null,null,null,null,null,null,null,null,null,null,null,null,null,null,null,31,99,300,null,null,null,null,null,null,1,"S",180]
[null,null,null,null,null,{"$f":"IF(F14=\"\",\"\",MIN(F14:F46))","v":-2.2000000000000002},{"$f":"VLOOKUP(F11,F14:G46,2,FALSE)","v":"08:39:55"},{"$f":"IF(H14=\"\",\"\",MAX(H14:H46))","v":17.600000000000001},{"$f":"VLOOKUP(H11,H14:I46,2,FALSE)","v":"13:49:48"},null,null,null,null,null,null,null,null,null,null,null,null,{"$f":"LARGE($AY$2:$AY$17,1)","v":8},{"$f":"VLOOKUP(V11,$AY$2:$AZ$17,2,FALSE)","v":"EST"},null,null,null,null,null,null,null,null,null,null,null,null,null,null,null,null,null,null,49,100,301,null,null,null,null,null,null,0,"SSO",203]
["Moyenne Mensuelle",{"$f":"AVERAGE(B14:B46)","v":24.193548387096772},null,{"$f":"AVERAGE(D14:D46)","v":49.096774193548384},null,{"$f":"AVERAGE(F14:F46)","v":4.1516129032258071},null,{"$f":"AVERAGE(H14:H46)","v":11.503225806451615},null,{"$f":"AVERAGE(J14:J46)","v":82.645161290322577},null,{"$f":"AVERAGE(L14:L46)","v":1020.358064516129},null,{"$f":"AVERAGE(N14:N46)","v":0.50967741935483868},null,null,null,{"$f":"AVERAGE(R14:R46)","v":0.91935483870967727},null,null,null,null,"SE","09:30:45",3.3,{"$f":"AVERAGE(Z14:Z46)","v":58.848387096774189},null,{"$f":"AVERAGE(AB14:AB46)","v":203.67483870967746},null,null,null,null,{"$f":"AVERAGE(AG14:AG46)","v":1.935483870967742},null,null,null,null,null,null,null,null,50,101,699,null,null,null,null,null,null,0,"SO",225]
["Jour","T°               int.    (°C)","Heure","Hum              int.       (%)","Heure","T°              Mini                 ext.    (°C)","Heure","T°               Maxi                     ext.    (°C)","Heure","Hum           ext.      (%)","Heure","Press.         rel.        (hpa)","Heure","Vit. du vent    (km/h)","Heure","Vit. du vent    (km/h)","Heure","Rafale  Min        (km/h)","Heure","Rafale    Max      (km/h)","Heure","Direction                      du vent"," -","Heure","Précipi. dern. 24 h        (mm)","Précipi. Tot. mois          (mm)","Précipi. Tot. An        (mm)","Lumière (W/M2)",null,null,null,null,"UVI","Heure",null,"Intensité des UV",null,null,null,null,null,null,null,null,null,null,null,null,null,null,0,"OSO",248]
["2017-12-01",23.8,"19:49:47",49,"23:59:47",2.2000000000000002,"01:19:47",9.3000000000000007,"12:44:47",81,"23:59:47",1022.9,"23:29:47",0,"01:04:47",23.4,"10:04:47",1.1000000000000001,"01:04:47",28.1,"10:04:47",{"$f":"IF(W14=\"N\",0,IF(W14=\"NNE\",23,IF(W14=\"NE\",45,IF(W14=\"ENE\",68,IF(W14=\"EST\",90,IF(W14=\"ESE\",113,IF(W14=\"SE\",135,IF(W14=\"SSE\",158,IF(W14=\"S\",180,IF(W14=\"SSO\",203,IF(W14=\"SO\",225,IF(W14=\"OSO\",248,IF(W14=\"O\",270,IF(W14=\"ONO\",293,IF(W14=\"NO\",315,IF(W14=\"NNO\",338,\"\"))))))))))))))))","v":315},"NO","01:09:47",6,{"$f":"Y14","v":6},296.7,309.73,16,null,{"$f":"IF(AC14=\"\",\"\",VLOOKUP(AC14,List!$B$2:$E$29,4,FALSE))","v":"Averses ou fortes pluies"},null,2,"11:24:47",null,"FAIBLE","<2",null,null,null,"Soleil","C","Ciel voilé","Rares éclaircies","Soleil Fortes averses","Variable",0,0,null,null,0,"O",270]
[{"$f":"IF(B15=\"\",\"\",A14+1)","v":"2017-12-02"},24.5,"18:24:48",51,"23:59:48",0,"08:24:47",12.1,"12:49:48",87,"23:59:48",1026.4000000000001,"10:34:48",0,"00:34:47",13.3,"05:09:47",0,"00:34:47",17.3,"05:09:47",0,"N","01:29:47",0.3,{"$f":"IF(Y15=\"\",\"\",Y15+Z14)","v":6.3},297,332.9,13,null,{"$f":"IF(AC15=\"\",\"\",VLOOKUP(AC15,List!$B$2:$E$29,4,FALSE))","v":"Pluies et éclaircies"},{"$f":"IF(AC15=\"\",\"\",)","v":0},2,"10:44:48",null,"MODEREE",3,"à",5,null,null,null,null,null,null,null,null,null,null,null,0,"ONO",293]
[{"$f":"IF(B16=\"\",\"\",A15+1)","v":"2017-12-03"},24.3,"19:14:49",50,"23:59:49",5.0999999999999996,"00:14:48",11.5,"14:39:49",91,"23:59:49",1029.2,"23:54:49",0,"00:04:48",7.2,"15:44:49",0,"00:09:48",8.6,"15:44:49",90,"EST","10:29:49",3.3,9.6,300.3,111.53,14,null,{"$f":"IF(AC16=\"\",\"\",VLOOKUP(AC16,List!$B$2:$E$29,4,FALSE))","v":"Pluies éparses"},"Averses ou fortes pluies",2,"11:09:49",null,"FORTE",6,"à",7,null,"Nuageux & Brumeux","C","Brouillard dense","Brume ou Brouillard légé","Brume ou léger brouillard givrant","Nuageux","Couvert","Couvert rares averses",null,null,8,"NO",315]
["2017-12-04",24.6,"21:24:48",52,"23:59:48",3.8,"09:09:49",17.600000000000001,"13:49:48",88,"23:59:48",1034.9000000000001,"21:09:48",0,"00:09:49",8.6,"13:59:48",0,"00:09:49",11.2,"13:59:48",315,"NO","02:19:49",0.3,9.9,300.60000000000002,378.84,13,null,{"$f":"IF(AC17=\"\",\"\",VLOOKUP(AC17,List!$B$2:$E$29,4,FALSE))","v":"Pluies et éclaircies"},"Pluies et éclaircies",2,"11:14:48",null,"TRES FORTE",8,"à",10,null,null,null,null,null,null,null,null,null,null,null,0,"NNO",338]
["2017-12-05",24.4,"18:59:49",52,"23:59:49",7.1,"08:44:48",11.1,"15:09:49",83,"23:59:49",1036.5,"11:34:49",0,"00:09:48",6.1,"14:39:49",0,"00:09:48",9.6999999999999993,"14:39:49",45,"NE","00:04:48",0.3,10.200000000000001,300.89999999999998,63.41,14,null,{"$f":"IF(AC18=\"\",\"\",VLOOKUP(AC18,List!$B$2:$E$29,4,FALSE))","v":"Pluies éparses"},"C",1,"09:44:48",null,"EXTREME","11+",null,null,null,"Pluvieux","Pluies et éclaircies","Pluies éparses","Bruines","Averses ou fortes pluies","Pluies mélées de neige"]
["2017-12-06",24.4,"16:44:50",53,"23:59:50",6.4,"22:09:50",8.9,"12:29:50",81,"23:59:50",1033.3,"00:04:49",0,"00:04:49",12.2,"22:59:50",0,"00:04:49",14.8,"22:49:50",135,"SE","00:04:49",0,10.200000000000001,300.89999999999998,62.38,10,null,{"$f":"IF(AC19=\"\",\"\",VLOOKUP(AC19,List!$B$2:$E$29,4,FALSE))","v":"Nuageux"},"C",1,"09:44:49"]
["2017-12-07",24.7,"19:29:51",53,"23:59:51",6.5,"23:49:51",14.7,"13:34:51",80,"23:59:51",1021.1,"00:04:50",0,"21:14:51",14.8,"06:44:50",1.1000000000000001,"21:14:51",23.4,"11:29:51",135,"SE","14:09:51",3.3,13.5,304.2,156.47,14,null,{"$f":"IF(AC20=\"\",\"\",VLOOKUP(AC20,List!$B$2:$E$29,4,FALSE))","v":"Pluies éparses"},"C",2,"12:59:51",null,null,null,null,null,null,"Orageux","Soleil orage","Soleil averses orageuses","Pluies orageuses","Orage","Orage et grêles","Orage violent"]
["2017-12-08",23.6,"14:59:52",48,"23:59:52",3.2,"23:29:52",10.6,"14:14:52",78,"23:59:52",1022,"19:04:52",0,"00:29:51",13.3,"19:04:52",1.1000000000000001,"00:29:51",19.399999999999999,"19:04:52",315,"NO","01:24:51",1.5,15,305.7,324.74,14,null,{"$f":"IF(AC21=\"\",\"\",VLOOKUP(AC21,List!$B$2:$E$29,4,FALSE))","v":"Pluies éparses"},"Averses ou fortes pluies",2,"11:19:52"]
["2017-12-09",24.1,"18:29:52",50,"23:59:52",2.2000000000000002,"00:54:52",7.1,"12:34:52",91,"23:59:52",1021.4,"00:44:52",0,"00:34:52",11.2,"23:04:52",0,"05:19:52",15.8,"23:14:52",315,"NO","00:49:52",8.6999999999999993,23.7,314.39999999999998,132.26,16,null,{"$f":"IF(AC22=\"\",\"\",VLOOKUP(AC22,List!$B$2:$E$29,4,FALSE))","v":"Averses ou fortes pluies"},"Pluies et éclaircies",2,"11:39:52",null,null,null,null,null,null,"Grèle & Neige","Giboulées","Grèles","Neiges","Fortes neiges",0,0]
["2017-12-10",23.9,"22:09:52",50,"23:59:52",5.6,"00:04:52",13.7,"06:14:52",89,"23:59:52",1000.3,"00:04:52",0,"03:44:52",19.399999999999999,"06:09:52",0,"04:04:52",24.5,"06:04:52",135,"SE","17:09:52",7.8,31.5,322.2,238.07,16,null,{"$f":"IF(AC23=\"\",\"\",VLOOKUP(AC23,List!$B$2:$E$29,4,FALSE))","v":"Averses ou fortes pluies"},"Pluies éparses",2,"11:34:52"]
["2017-12-11",23.7,"16:24:52",48,"23:59:53",0.4,"23:59:53",6.9,"01:44:52",82,"23:59:53",999.6,"23:54:53",0,"00:09:52",33.1,"05:59:52",0,"00:09:52",45.4,"05:59:52",315,"NO","02:34:52",29.4,60.9,351.6,75.23,16,null,{"$f":"IF(AC24=\"\",\"\",VLOOKUP(AC24,List!$B$2:$E$29,4,FALSE))","v":"Averses ou fortes pluies"},"Pluies et éclaircies",2,"12:19:52",null,null,null,null,null,null,"Temps de nuit","Ciel dégagé de nuit","Ciel voilé de nuit","Brume ou brouillard léger de nuit","Brume ou léger brouillard givrant de nuit ","Brouillard dense de nuit","Ciel nuageux avec éclaircies de nuit"]
["2017-12-12",24.4,"19:24:54",49,"23:59:54",-0.3,"00:39:53",12,"13:04:54",74,"23:59:54",1011.5,"19:24:54",0,"00:04:53",14.8,"23:34:54",0,"00:09:53",20.9,"23:34:54",90,"EST","01:44:53",0,60.9,351.6,306.52,1,null,{"$f":"IF(AC25=\"\",\"\",VLOOKUP(AC25,List!$B$2:$E$29,4,FALSE))","v":"Ciel dégagé"},"C",2,"11:04:54"]
["2017-12-13",24.9,"18:59:54",43,"23:59:54",8,"23:59:54",10.9,"14:29:54",63,"23:59:54",1007.7,"00:04:54",0,"15:24:54",19.399999999999999,"01:04:54",0,"15:24:54",25.6,"11:04:54",135,"SE","05:24:54",0,60.9,351.6,115.98,3,null,{"$f":"IF(AC26=\"\",\"\",VLOOKUP(AC26,List!$B$2:$E$29,4,FALSE))","v":"Rares éclaircies"},null,2,"11:49:54"]
["2017-12-14",24.4,"20:59:55",40,"23:59:55",4.8,"15:44:55",10.6,"12:39:55",80,"23:59:55",1003.7,"03:14:54",2.5,"01:19:54",22,"21:49:55",3.6,"01:19:54",27,"21:49:55",90,"EST","00:19:54",1.2,62.1,352.8,356.41,14,null,{"$f":"IF(AC27=\"\",\"\",VLOOKUP(AC27,List!$B$2:$E$29,4,FALSE))","v":"Pluies éparses"},null,3,"12:29:55"]
["2017-12-15",24.4,"22:34:56",44,"23:59:56",0.7,"23:04:56",11.8,"13:54:56",90,"23:59:56",1009.7,"23:44:56",0,"20:24:56",24.5,"12:29:55",0,"20:24:56",35.6,"12:29:55",90,"EST","01:29:55",1.8,63.9,354.6,296.62,13,null,{"$f":"IF(AC28=\"\",\"\",VLOOKUP(AC28,List!$B$2:$E$29,4,FALSE))","v":"Pluies et éclaircies"},null,2,"11:49:55"]
["2017-12-16",24.9,"19:04:53",46,"23:59:53",0.6,"08:09:56",12.1,"13:09:53",82,"23:59:53",1022.6,"23:49:53",0,"03:14:56",13.3,"01:59:56",0,"03:34:56",18.399999999999999,"01:59:56",315,"NO","00:29:56",1.2,65.099999999999994,355.8,292.14,14,null,{"$f":"IF(AC29=\"\",\"\",VLOOKUP(AC29,List!$B$2:$E$29,4,FALSE))","v":"Pluies éparses"},null,2,"11:29:53"]
["2017-12-17",24.4,"16:44:54",48,"23:59:54",6.6,"00:29:53",11.9,"12:34:54",82,"23:59:54",1026.4000000000001,"11:04:54",0,"03:34:53",7.2,"20:29:54",0,"03:59:53",9.6999999999999993,"20:29:54",315,"NO","00:54:53",9,74.099999999999994,364.8,297.94,16,null,{"$f":"IF(AC30=\"\",\"\",VLOOKUP(AC30,List!$B$2:$E$29,4,FALSE))","v":"Averses ou fortes pluies"},null,2,"11:24:54"]
["2017-12-18",24.7,"17:09:55",47,"23:59:55",-0.2,"23:54:55",13.1,"14:49:55",87,"23:59:55",1031.2,"23:54:55",0,"17:44:55",13.3,"01:14:54",0,"17:49:55",17.3,"01:14:54",315,"NO","07:34:54",0,74.099999999999994,364.8,283.82,3,null,{"$f":"IF(AC31=\"\",\"\",VLOOKUP(AC31,List!$B$2:$E$29,4,FALSE))","v":"Rares éclaircies"},null,2,"11:19:55"]
["2017-12-19",23.5,"21:49:56",46,"23:59:56",-2.2000000000000002,"08:39:55",11.2,"13:54:56",86,"23:59:56",1036.7,"11:24:56",0,"00:04:55",5,"14:09:56",0,"00:04:55",7.2,"14:19:56",0,"N","00:19:55",0.3,74.399999999999991,365.1,294.61,14,null,{"$f":"IF(AC32=\"\",\"\",VLOOKUP(AC32,List!$B$2:$E$29,4,FALSE))","v":"Pluies éparses"},null,2,"11:39:56"]
["2017-12-20",24.6,"22:49:56",50,"23:59:56",-1.1000000000000001,"02:24:56",10.9,"15:24:56",90,"23:59:56",1036.4000000000001,"11:14:56",0,"00:04:56",2.5,"00:14:56",0,"00:04:56",3.6,"00:14:56",0,"N","03:39:56",0.3,74.699999999999989,365.4,69.430000000000007,14,null,{"$f":"IF(AC33=\"\",\"\",VLOOKUP(AC33,List!$B$2:$E$29,4,FALSE))","v":"Pluies éparses"},null,1,"09:29:56"]
["2017-12-21",25,"21:24:57",51,"23:59:57",8.9,"00:04:56",11.7,"12:59:57",82,"23:59:57",1038.5,"11:49:57",0,"00:04:56",3.6,"09:24:56",0,"00:09:56",6.1,"14:54:57",45,"NE","13:29:57",0,74.699999999999989,365.4,86.89,10,null,{"$f":"IF(AC34=\"\",\"\",VLOOKUP(AC34,List!$B$2:$E$29,4,FALSE))","v":"Nuageux"},null,2,"12:19:57"]
["2017-12-22",25.4,"18:44:57",50,"23:59:57",7.9,"03:49:57",11.4,"13:24:57",91,"23:59:57",1036.8,"00:19:57",0,"01:24:57",6.1,"12:24:57",0,"03:04:57",7.2,"12:24:57",90,"EST","00:29:57",1.2,75.899999999999991,366.6,122.82,14,null,{"$f":"IF(AC35=\"\",\"\",VLOOKUP(AC35,List!$B$2:$E$29,4,FALSE))","v":"Pluies éparses"},null,2,"11:19:57"]
["2017-12-23",25.7,"19:19:57",51,"23:59:57",8.4,"00:34:57",11.7,"12:49:57",86,"23:59:57",1036.0999999999999,"11:04:57",0,"00:04:57",6.1,"12:54:57",0,"00:09:57",8.6,"12:54:57",23,"NNE","04:39:57",0,75.899999999999991,366.6,106.81,10,null,{"$f":"IF(AC36=\"\",\"\",VLOOKUP(AC36,List!$B$2:$E$29,4,FALSE))","v":"Nuageux"},null,2,"11:24:57"]
["2017-12-24",25.8,"21:54:58",51,"23:59:58",9,"22:39:58",11.1,"12:09:57",81,"23:59:58",1031.8,"00:04:57",0,"04:54:57",9.6999999999999993,"01:24:57",1.1000000000000001,"03:54:57",14.8,"13:59:58",90,"EST","14:49:58",0.3,76.199999999999989,366.9,102.56,13,null,{"$f":"IF(AC37=\"\",\"\",VLOOKUP(AC37,List!$B$2:$E$29,4,FALSE))","v":"Pluies et éclaircies"},null,2,"11:54:57"]
["2017-12-25",25.7,"00:04:58",50,"23:59:58",5.0999999999999996,"22:54:58",12.3,"14:14:58",91,"23:59:58",1021,"00:04:58",1.1000000000000001,"04:34:58",24.5,"20:49:58",2.5,"04:34:58",31.7,"19:29:58",135,"SE","22:29:58",12,88.199999999999989,378.9,145.87,16,null,{"$f":"IF(AC38=\"\",\"\",VLOOKUP(AC38,List!$B$2:$E$29,4,FALSE))","v":"Averses ou fortes pluies"},null,2,"12:14:58"]
["2017-12-26",25.3,"21:19:58",47,"23:59:58",4.7,"06:54:58",9.5,"13:59:58",81,"23:59:58",1004.6,"10:34:58",0,"00:19:58",23.4,"18:14:58",0,"00:34:58",35.6,"18:04:58",0,"N","00:04:58",5.7,93.899999999999991,384.6,224.46,16,null,{"$f":"IF(AC39=\"\",\"\",VLOOKUP(AC39,List!$B$2:$E$29,4,FALSE))","v":"Averses ou fortes pluies"},null,2,"11:19:58"]
["2017-12-27",25,"17:59:56",45,"23:59:56",1.6,"23:59:56",9.6,"14:19:56",81,"23:59:56",1002.4,"22:24:56",0,"23:09:56",30.6,"06:59:58",0,"23:14:56",42.8,"06:59:58",90,"EST","03:49:58",4.2,98.1,388.8,300.41000000000003,16,null,{"$f":"IF(AC40=\"\",\"\",VLOOKUP(AC40,List!$B$2:$E$29,4,FALSE))","v":"Averses ou fortes pluies"},null,2,"11:24:56"]
["2017-12-28",24.3,"19:49:56",45,"23:59:56",0.2,"03:34:56",9.1999999999999993,"14:09:56",81,"23:59:56",1006.7,"22:04:56",0,"00:04:56",9.6999999999999993,"23:14:56",0,"00:04:56",14.8,"23:29:56",0,"N","01:59:56",0,98.1,388.8,312.08999999999997,1,null,{"$f":"IF(AC41=\"\",\"\",VLOOKUP(AC41,List!$B$2:$E$29,4,FALSE))","v":"Ciel dégagé"},null,2,"11:24:56"]
["2017-12-29",23.4,"00:04:56",54,"23:59:56",5.0999999999999996,"00:54:56",12.8,"11:49:56",82,"23:59:56",1006,"00:14:56",0,"05:24:56",22,"23:29:56",1.1000000000000001,"05:24:56",29.5,"23:19:56",180,"S","05:24:56",3.6,101.69999999999999,392.4,221.56,13,null,{"$f":"IF(AC42=\"\",\"\",VLOOKUP(AC42,List!$B$2:$E$29,4,FALSE))","v":"Pluies et éclaircies"},null,2,"11:39:56"]
["2017-12-30",19.100000000000001,"18:39:58",59,"23:59:58",10.8,"00:44:56",15,"09:04:56",73,"23:59:58",1007.4,"19:19:58",6.1,"08:19:56",23.4,"21:49:58",9.6999999999999993,"05:44:56",30.6,"23:54:58",90,"EST","07:19:56",4.8,106.49999999999999,397.2,108.78,16,null,{"$f":"IF(AC43=\"\",\"\",VLOOKUP(AC43,List!$B$2:$E$29,4,FALSE))","v":"Averses ou fortes pluies"},null,2,"11:34:56"]
["2017-12-31",19.100000000000001,"02:24:58",50,"23:59:59",7.6,"20:24:59",14.3,"00:39:58",68,"23:59:59",1006.3,"00:19:58",6.1,"13:19:59",33.1,"07:19:58",7.2,"20:14:59",43.9,"06:39:58",135,"SE","05:54:58",21.6,128.1,418.8,82.64,16,null,{"$f":"IF(AC44=\"\",\"\",VLOOKUP(AC44,List!$B$2:$E$29,4,FALSE))","v":"Averses ou fortes pluies"},null,2,"13:19:59"]
["",null,null,null,null,null,null,null,null,null,null,null,null,null,null,null,null,null,null,null,null,"",null,null,null,"",null,null,null,null,{"$f":"IF(AC45=\"\",\"\",VLOOKUP(AC45,List!$B$2:$E$29,4,FALSE))","v":""}]
["",null,null,null,null,null,null,null,null,null,null,null,null,null,null,null,null,null,null,null,null,"",null,null,null,"",null,null,null,null,{"$f":"IF(AC46=\"\",\"\",VLOOKUP(AC46,List!$B$2:$E$29,4,FALSE))","v":""}]

{"sheet":"Janvier 18","index":12,"n_rows":46,"n_cols":53,"rows_kept":46,"cut":false,"hidden":true,"merged":[[12,35,12,38]]}
["Soleil","C","Ciel voilé","Rares éclaircies","Soleil Fortes averses","Variable",null,null,null,"Orageux","Soleil orage","Soleil averses orageuses","Pluies orageuses","Orage","Orage et grêles","Orage violent",null,null,null,null,null,null,null,null,null,null,null,null,null,null,null,null,null,null,null,null,null,null,null,null,null,null,30,51,299,700]
[null,1,2,3,4,5,null,null,null,null,18,19,20,21,22,23,null,null,null,null,null,null,null,null,null,null,null,null,null,null,null,null,null,null,null,null,null,null,null,null,null,null,null,null,null,null,null,null,null,null,{"$f":"COUNTIF($W$14:$W$46,AZ2)","v":0},"N",0]
["Nuageux & Brumeux","C","Brouillard dense","Brume ou Brouillard légé","Brume ou léger brouillard givrant","Nuageux","Couvert","Couvert rares averses",null,"Grèle & Neige","Giboulées","Grèles","Neiges","Fortes neiges",null,null,null,null,null,null,null,null,null,null,null,null,null,null,null,null,null,null,null,null,null,null,null,null,null,null,null,null,null,null,null,null,null,null,null,null,{"$f":"COUNTIF($W$14:$W$46,AZ3)","v":0},"NNE",23]
[null,6,7,8,9,10,11,12,null,null,24,25,26,27,null,null,null,null,null,null,null,null,null,null,null,null,null,null,null,null,null,null,null,null,null,null,null,null,null,null,null,null,null,null,null,null,null,null,null,null,5,"NE",45]
["Pluvieux","Pluies et éclaircies","Pluies éparses","Bruines","Averses ou fortes pluies","Pluies mélées de neige",null,null,null,null,null,null,null,null,null,null,null,null,null,null,null,null,null,null,null,null,null,null,null,null,null,null,null,null,null,null,null,null,null,null,null,null,null,null,null,null,null,null,null,null,0,"ENE",68]
[null,13,14,15,16,17,null,null,null,null,null,null,null,null,null,null,null,null,null,null,null,null,null,null,null,null,null,null,null,null,null,null,null,null,null,null,null,null,null,null,null,null,null,null,null,null,null,null,null,null,10,"EST",90]
[null,null,null,null,null,{"$f":"IF(F14=\"\",\"\",MIN(F14:F46))","v":-1.3},null,{"$f":"IF(H14=\"\",\"\",MIN(H14:H46))","v":6.5},null,0.86,null,999.4,null,0,null,7.2,null,0,null,9.6999999999999993,null,{"$f":"VLOOKUP(W7,$AZ$2:$BA$17,2,FALSE)","v":0},{"$f":"W10","v":"N"},null,{"$f":"MIN(Y14:Y46)","v":0},null,null,28.29,null,null,null,null,1,null,null,null,null,null,null,null,null,null,null,null,null,null,null,null,null,null,0,"ESE",113]
[null,null,null,null,null,{"$f":"IF(F15=\"\",\"\",MAX(F14:F46))","v":10.8},null,{"$f":"IF(H15=\"\",\"\",MAX(H14:H46))","v":15.3},null,0.89,null,1036.2,null,5,null,30.6,null,7.2,null,36.700000000000003,null,{"$f":"VLOOKUP(W8,$AZ$2:$BA$17,2,FALSE)","v":90},{"$f":"W11","v":"EST"},null,{"$f":"MAX(Y14:Y46)","v":21},70.19999999999996,70.2,435.46,null,null,null,null,3,null,null,null,null,null,null,null,null,null,null,null,null,null,null,null,null,null,7,"SE",135]
[null,null,null,null,null,null,null,null,null,null,null,null,null,null,null,null,null,null,null,null,null,null,null,null,null,null,null,null,null,null,null,null,null,null,null,null,null,null,null,null,null,null,null,null,null,null,null,null,null,null,0,"SSE",158]
[null,null,null,null,null,null,null,null,null,null,null,null,null,null,null,null,null,null,null,null,null,{"$f":"SMALL($AY$2:$AY$17,1)","v":0},{"$f":"VLOOKUP(V10,$AY$2:$AZ$17,2,FALSE)","v":"N"},null,null,{"$f":"MAX(Z14:Z46)","v":70.19999999999996},null,null,null,null,null,null,null,null,null,null,null,null,null,null,null,31,99,300,null,null,null,null,null,null,1,"S",180]
[null,null,null,null,null,{"$f":"IF(F14=\"\",\"\",MIN(F14:F46))","v":-1.3},{"$f":"VLOOKUP(F11,F14:G46,2,FALSE)","v":"09:00:03"},{"$f":"IF(H14=\"\",\"\",MAX(H14:H46))","v":15.3},{"$f":"VLOOKUP(H11,H14:I46,2,FALSE)","v":"14:25:05"},null,null,null,null,null,null,null,null,null,null,null,null,{"$f":"LARGE($AY$2:$AY$17,1)","v":10},{"$f":"VLOOKUP(V11,$AY$2:$AZ$17,2,FALSE)","v":"EST"},null,null,null,null,null,null,null,null,null,null,null,null,null,null,null,null,null,null,49,100,301,null,null,null,null,null,null,0,"SSO",203]
["Moyenne Mensuelle",{"$f":"AVERAGE(B14:B46)","v":24.332258064516129},null,{"$f":"AVERAGE(D14:D46)","v":44.069354838709678},null,{"$f":"AVERAGE(F14:F46)","v":5.3322580645161288},null,{"$f":"AVERAGE(H14:H46)","v":12.377419354838711},null,{"$f":"AVERAGE(J14:J46)","v":77.153870967741938},null,{"$f":"AVERAGE(L14:L46)","v":1016.7967741935483},null,{"$f":"AVERAGE(N14:N46)","v":0.58064516129032262},null,null,null,{"$f":"AVERAGE(R14:R46)","v":1.2322580645161292},null,null,null,null,"SE","09:30:45",{"$f":"AVERAGE(Y14:Y44)","v":2.2645161290322569},{"$f":"AVERAGE(Z14:Z46)","v":47.864516129032239},null,{"$f":"AVERAGE(AB14:AB46)","v":236.13935483870966},null,null,null,null,{"$f":"AVERAGE(AG14:AG46)","v":2.032258064516129},null,null,null,null,null,null,null,null,50,101,699,null,null,null,null,null,null,0,"SO",225]
["Jour","T°               int.    (°C)","Heure","Hum              int.       (%)","Heure","T°              Mini                 ext.    (°C)","Heure","T°               Maxi                     ext.    (°C)","Heure","Hum           ext.      (%)","Heure","Press.         rel.        (hpa)","Heure","Vit. du vent    (km/h)","Heure","Vit. du vent    (km/h)","Heure","Rafale  Min        (km/h)","Heure","Rafale    Max      (km/h)","Heure","Direction                      du vent"," -","Heure","Précipi. dern. 24 h        (mm)","Précipi. Tot. mois          (mm)","Précipi. Tot. An        (mm)","Lumière (W/M2)",null,null,null,null,"UVI","Heure",null,"Intensité des UV",null,null,null,null,null,null,null,null,null,null,null,null,null,null,0,"OSO",248]
["2018-01-01",17.899999999999999,"00:04:59",0.52,"07:59:59",7.1,"09:04:59",11.8,"14:05:00",0.91,"09:14:59",1014.5,"23:50:00",0,"06:34:59",24.5,"07:19:59",1.1000000000000001,"06:34:59",34.200000000000003,"12:24:59",{"$f":"IF(W14=\"N\",0,IF(W14=\"NNE\",23,IF(W14=\"NE\",45,IF(W14=\"ENE\",68,IF(W14=\"EST\",90,IF(W14=\"ESE\",113,IF(W14=\"SE\",135,IF(W14=\"SSE\",158,IF(W14=\"S\",180,IF(W14=\"SSO\",203,IF(W14=\"SO\",225,IF(W14=\"OSO\",248,IF(W14=\"O\",270,IF(W14=\"ONO\",293,IF(W14=\"NO\",315,IF(W14=\"NNO\",338,\"\"))))))))))))))))","v":90},"EST","12:14:59",21,{"$f":"Y14","v":21},21,314.3,16,null,{"$f":"IF(AC14=\"\",\"\",VLOOKUP(AC14,List!$B$2:$E$29,4,FALSE))","v":"Averses ou fortes pluies"},null,2,"11:49:59",null,"FAIBLE","<2",null,null,null,"Soleil","C","Ciel voilé","Rares éclaircies","Soleil Fortes averses","Variable",0,0,null,null,0,"O",270]
[{"$f":"IF(B15=\"\",\"\",A14+1)","v":"2018-01-02"},17.600000000000001,"23:15:01",0.63,"23:50:01",5.7,"01:55:00",14.6,"23:30:01",0.86,"07:30:00",1015.2,"01:35:00",0,"01:50:00",23.4,"22:00:01",1.1000000000000001,"01:50:00",33.1,"22:05:01",135,"SE","07:15:00",0.3,{"$f":"IF(Y15=\"\",\"\",Y15+Z14)","v":21.3},21.3,112.69,14,null,{"$f":"IF(AC15=\"\",\"\",VLOOKUP(AC15,List!$B$2:$E$29,4,FALSE))","v":"Pluies éparses"},{"$f":"IF(AC15=\"\",\"\",)","v":0},2,"12:25:01",null,"MODEREE",3,"à",5,null,null,null,null,null,null,null,null,null,null,null,0,"ONO",293]
[{"$f":"IF(B16=\"\",\"\",A15+1)","v":"2018-01-03"},17.8,"02:10:01",57,"23:55:02",8.1999999999999993,"08:40:01",14.7,"00:55:01",89,"23:55:02",1011.2,"12:35:02",0,"21:40:02",25.6,"00:30:01",0,"22:55:02",31.7,"00:30:01",45,"NE","06:05:01",9,30.3,30.3,193.25,16,null,{"$f":"IF(AC16=\"\",\"\",VLOOKUP(AC16,List!$B$2:$E$29,4,FALSE))","v":"Averses ou fortes pluies"},"Averses ou fortes pluies",2,"11:25:02",null,"FORTE",6,"à",7,null,"Nuageux & Brumeux","C","Brouillard dense","Brume ou Brouillard légé","Brume ou léger brouillard givrant","Nuageux","Couvert","Couvert rares averses",null,null,8,"NO",315]
["2018-01-04",22.9,"23:15:01",53,"23:55:01",10.8,"23:50:01",14.7,"03:55:02",84,"23:55:01",1003.9,"00:40:02",5,"14:45:02",19.399999999999999,"03:40:02",7.2,"18:10:02",31.7,"03:25:02",90,"EST","00:15:02",3.3,33.6,33.6,100.08,16,null,{"$f":"IF(AC17=\"\",\"\",VLOOKUP(AC17,List!$B$2:$E$29,4,FALSE))","v":"Averses ou fortes pluies"},"Pluies et éclaircies",2,"13:00:02",null,"TRES FORTE",8,"à",10,null,null,null,null,null,null,null,null,null,null,null,0,"NNO",338]
["2018-01-05",24.8,"18:30:01",50,"23:55:01",3.4,"23:05:01",12.3,"14:05:01",88,"23:55:01",999.4,"00:20:01",0,"18:45:01",17.3,"14:20:01",0,"19:15:01",23.4,"15:00:01",90,"EST","11:40:01",0.3,33.9,33.9,294.07,14,null,{"$f":"IF(AC18=\"\",\"\",VLOOKUP(AC18,List!$B$2:$E$29,4,FALSE))","v":"Pluies éparses"},"C",2,"12:30:01",null,"EXTREME","11+",null,null,null,"Pluvieux","Pluies et éclaircies","Pluies éparses","Bruines","Averses ou fortes pluies","Pluies mélées de neige"]
["2018-01-06",24.9,"18:20:01",52,"23:55:01",-0.1,"08:15:01",11.7,"14:05:01",86,"23:55:01",1009.4,"23:30:01",0,"00:00:01",8.6,"21:10:01",0,"00:00:01",11.2,"21:10:01",315,"NO","00:25:01",0.3,34.199999999999996,34.200000000000003,186.94,14,null,{"$f":"IF(AC19=\"\",\"\",VLOOKUP(AC19,List!$B$2:$E$29,4,FALSE))","v":"Pluies éparses"},"C",2,"11:20:01"]
["2018-01-07",23.6,"22:15:02",51,"23:55:02",2.4,"00:00:01",7.1,"06:20:01",84,"23:55:02",1014.5,"21:10:02",2.5,"00:00:01",25.6,"06:35:01",3.6,"00:05:01",29.5,"06:35:01",315,"NO","00:45:01",1.8,35.999999999999993,36,28.29,14,null,{"$f":"IF(AC20=\"\",\"\",VLOOKUP(AC20,List!$B$2:$E$29,4,FALSE))","v":"Pluies éparses"},"C",1,"10:35:02",null,null,null,null,null,null,"Orageux","Soleil orage","Soleil averses orageuses","Pluies orageuses","Orage","Orage et grêles","Orage violent"]
["2018-01-08",23.6,"19:20:02",50,"23:55:02",5.3,"23:00:02",6.5,"14:50:02",89,"23:55:02",1014.6,"10:30:02",0,"17:50:02",9.6999999999999993,"02:50:02",1.1000000000000001,"17:40:02",12.2,"02:50:02",315,"NO","02:30:02",0,35.999999999999993,36,80.78,3,null,{"$f":"IF(AC21=\"\",\"\",VLOOKUP(AC21,List!$B$2:$E$29,4,FALSE))","v":"Rares éclaircies"},"Averses ou fortes pluies",1,"10:35:02"]
["2018-01-09",25,"21:20:02",49,"23:55:02",5.4,"00:00:02",10.4,"18:45:02",84,"23:55:02",1008.7,"00:00:02",0,"00:55:02",12.2,"20:45:02",1.1000000000000001,"00:55:02",17.3,"20:45:02",180,"S","11:10:02",0.9,36.899999999999991,36.9,76.099999999999994,15,null,{"$f":"IF(AC22=\"\",\"\",VLOOKUP(AC22,List!$B$2:$E$29,4,FALSE))","v":"Bruines"},"Pluies et éclaircies",1,"10:00:02",null,null,null,null,null,null,"Grèle & Neige","Giboulées","Grèles","Neiges","Fortes neiges",0,0]
["2018-01-10",25.5,"21:35:02",48,"23:55:02",1.6,"07:05:02",13.9,"13:00:02",80,"23:55:02",1006.4,"10:30:02",0,"00:35:02",9.6999999999999993,"14:15:02",0,"01:50:02",14.8,"22:15:02",90,"EST","04:35:02",0,36.899999999999991,36.9,366.39,1,null,{"$f":"IF(AC23=\"\",\"\",VLOOKUP(AC23,List!$B$2:$E$29,4,FALSE))","v":"Ciel dégagé"},"Pluies éparses",2,"11:25:02"]
["2018-01-11",25.8,"21:05:03",50,"23:55:03",4.3,"18:30:03",13,"14:20:03",87,"23:55:03",1022.1,"23:45:03",0,"00:05:02",14.8,"14:00:03",0,"17:10:03",18.399999999999999,"14:00:03",315,"NO","02:35:02",0.6,37.499999999999993,37.5,278.48,14,null,{"$f":"IF(AC24=\"\",\"\",VLOOKUP(AC24,List!$B$2:$E$29,4,FALSE))","v":"Pluies éparses"},"Pluies et éclaircies",2,"11:40:03",null,null,null,null,null,null,"Temps de nuit","Ciel dégagé de nuit","Ciel voilé de nuit","Brume ou brouillard léger de nuit","Brume ou léger brouillard givrant de nuit ","Brouillard dense de nuit","Ciel nuageux avec éclaircies de nuit"]
["2018-01-12",24.8,"19:10:04",44,"23:55:04",-1.3,"09:00:03",8.6,"13:25:04",81,"23:55:04",1024.5,"10:55:04",0,"00:05:03",12.2,"19:35:04",0,"00:20:03",15.8,"19:35:04",90,"EST","00:10:03",0.3,37.79999999999999,37.799999999999997,305.13,13,null,{"$f":"IF(AC25=\"\",\"\",VLOOKUP(AC25,List!$B$2:$E$29,4,FALSE))","v":"Pluies et éclaircies"},"C",2,"11:20:04"]
["2018-01-13",23.7,"15:00:04",45,"23:55:04",4.5999999999999996,"08:05:04",7.1,"13:20:04",83,"23:55:04",1018.3,"00:15:04",1.1000000000000001,"06:20:04",9.6999999999999993,"11:25:04",2.5,"06:20:04",13.3,"21:40:04",315,"NO","01:00:04",0,37.79999999999999,37.799999999999997,136.94,3,null,{"$f":"IF(AC26=\"\",\"\",VLOOKUP(AC26,List!$B$2:$E$29,4,FALSE))","v":"Rares éclaircies"},null,2,"12:35:04"]
["2018-01-14",24.9,"21:35:05",48,"23:55:05",4.2,"09:05:04",9,"14:45:05",85,"23:55:05",1016.7,"21:15:05",0,"00:10:04",7.2,"11:10:05",0,"00:20:04",9.6999999999999993,"11:10:05",315,"NO","02:40:04",0,37.79999999999999,37.799999999999997,161.77000000000001,3,null,{"$f":"IF(AC27=\"\",\"\",VLOOKUP(AC27,List!$B$2:$E$29,4,FALSE))","v":"Rares éclaircies"},null,2,"11:55:05"]
["2018-01-15",25.4,"22:10:05",43,"23:55:05",3.5,"00:15:05",15.3,"14:25:05",73,"23:55:05",1015.9,"00:00:05",0,"00:00:05",24.5,"10:25:05",0,"00:05:05",30.6,"09:30:05",135,"SE","15:20:05",2.1,39.899999999999991,39.9,379.08,13,null,{"$f":"IF(AC28=\"\",\"\",VLOOKUP(AC28,List!$B$2:$E$29,4,FALSE))","v":"Pluies et éclaircies"},null,3,"14:15:05"]
["2018-01-16",25.1,"21:25:04",40,"23:55:04",5.4,"23:55:04",14.2,"14:20:04",79,"23:55:04",1006.3,"11:40:04",3.6,"04:25:05",15.8,"23:30:04",5,"04:25:05",25.6,"17:45:04",45,"NE","04:25:05",1.8,41.699999999999989,41.7,364.11,13,null,{"$f":"IF(AC29=\"\",\"\",VLOOKUP(AC29,List!$B$2:$E$29,4,FALSE))","v":"Pluies et éclaircies"},null,2,"11:15:04"]
["2018-01-17",25,"21:40:04",39,"23:55:04",4.2,"06:45:04",11.5,"14:15:04",77,"23:55:04",1016.8,"11:40:04",1.1000000000000001,"03:40:04",19.399999999999999,"23:20:04",2.5,"03:40:04",27,"23:20:04",315,"NO","01:30:04",3.9,45.599999999999987,45.6,341.99,13,null,{"$f":"IF(AC30=\"\",\"\",VLOOKUP(AC30,List!$B$2:$E$29,4,FALSE))","v":"Pluies et éclaircies"},null,2,"11:10:04"]
["2018-01-18",25.5,"21:05:05",43,"23:55:05",6.3,"23:55:05",15.2,"12:10:05",81,"23:55:05",1011.1,"23:35:05",1.1000000000000001,"23:50:05",20.9,"03:00:04",3.6,"23:00:05",27,"01:25:04",45,"NE","04:30:04",3.3,48.899999999999984,48.9,352.43,13,null,{"$f":"IF(AC31=\"\",\"\",VLOOKUP(AC31,List!$B$2:$E$29,4,FALSE))","v":"Pluies et éclaircies"},null,2,"11:05:05"]
["2018-01-19",25.3,"21:25:06",40,"23:55:06",4.8,"05:00:05",13.2,"14:10:06",81,"23:55:06",1014.7,"12:10:06",0,"04:50:05",11.2,"19:55:06",1.1000000000000001,"04:50:05",14.8,"19:55:06",90,"EST","03:35:05",1.2,50.099999999999987,50.1,335.18,4,null,{"$f":"IF(AC32=\"\",\"\",VLOOKUP(AC32,List!$B$2:$E$29,4,FALSE))","v":"Soleil nuageux et averses"},null,2,"11:20:06"]
["2018-01-20",25.3,"18:10:06",45,"23:55:06",6.9,"00:00:06",13.7,"13:25:06",76,"23:55:06",1012.5,"00:00:06",2.5,"03:00:06",15.8,"05:55:06",3.6,"03:15:06",19.399999999999999,"05:25:06",135,"SE","17:00:06",8.6999999999999993,58.799999999999983,58.8,121.24,16,null,{"$f":"IF(AC33=\"\",\"\",VLOOKUP(AC33,List!$B$2:$E$29,4,FALSE))","v":"Averses ou fortes pluies"},null,2,"12:00:06"]
["2018-01-21",24.2,"21:25:06",48,"23:55:06",9.3000000000000007,"05:55:06",14.7,"14:00:06",79,"23:55:06",1015.4,"11:25:06",0,"04:50:06",14.8,"14:30:06",0,"05:05:06",20.9,"20:55:06",315,"NO","00:40:06",2.1,60.899999999999984,60.9,253,4,null,{"$f":"IF(AC34=\"\",\"\",VLOOKUP(AC34,List!$B$2:$E$29,4,FALSE))","v":"Soleil nuageux et averses"},null,2,"11:10:06"]
["2018-01-22",26.2,"20:30:06",47,"23:55:06",6.4,"23:55:06",14.2,"15:35:06",83,"23:55:06",1021.1,"21:05:06",0,"18:10:06",30.6,"10:55:06",0,"18:30:06",36.700000000000003,"10:55:06",90,"EST","08:55:06",0.3,61.199999999999982,61.2,406.03,13,null,{"$f":"IF(AC35=\"\",\"\",VLOOKUP(AC35,List!$B$2:$E$29,4,FALSE))","v":"Pluies et éclaircies"},null,2,"11:15:06"]
["2018-01-23",26,"21:25:06",49,"23:55:06",5.7,"00:20:06",15.1,"12:55:06",83,"23:55:06",1020.9,"00:00:06",0,"00:00:06",17.3,"13:00:06",0,"00:05:06",23.4,"13:15:06",135,"SE","00:15:06",1.2,62.399999999999984,62.4,435.46,13,null,{"$f":"IF(AC36=\"\",\"\",VLOOKUP(AC36,List!$B$2:$E$29,4,FALSE))","v":"Pluies et éclaircies"},null,3,"12:50:06"]
["2018-01-24",25.8,"21:20:06",47,"23:55:06",8.6999999999999993,"23:40:06",13.6,"05:25:06",82,"23:55:06",1017.3,"00:00:06",0,"18:35:06",23.4,"15:10:06",1.1000000000000001,"18:35:06",33.1,"17:20:06",135,"SE","18:35:06",4.2,66.59999999999998,66.599999999999994,103.41,16,null,{"$f":"IF(AC37=\"\",\"\",VLOOKUP(AC37,List!$B$2:$E$29,4,FALSE))","v":"Averses ou fortes pluies"},null,2,"10:55:06"]
["2018-01-25",25.5,"21:10:06",45,"23:55:06",5.7,"07:40:06",12.9,"14:50:06",81,"23:55:06",1011.3,"01:45:06",0,"04:10:06",12.2,"02:00:06",0,"04:20:06",18.399999999999999,"02:00:06",135,"SE","04:15:06",0.3,66.899999999999977,66.900000000000006,326.60000000000002,4,null,{"$f":"IF(AC38=\"\",\"\",VLOOKUP(AC38,List!$B$2:$E$29,4,FALSE))","v":"Soleil nuageux et averses"},null,2,"11:15:06"]
["2018-01-26",25.1,"21:20:10",48,"23:55:10",4.2,"05:45:06",12.2,"15:05:10",85,"23:55:10",1026.0999999999999,"23:45:10",0,"05:30:06",15.8,"13:55:10",0,"20:20:10",23.4,"14:45:10",45,"NE","00:25:06",0.6,67.499999999999972,67.5,430.82,4,null,{"$f":"IF(AC39=\"\",\"\",VLOOKUP(AC39,List!$B$2:$E$29,4,FALSE))","v":"Soleil nuageux et averses"},null,3,"12:40:10"]
["2018-01-27",24.9,"18:00:10",45,"23:55:10",-0.8,"07:25:10",11.6,"23:50:10",89,"23:55:10",1030.5999999999999,"23:40:10",0,"00:00:10",13.3,"13:00:10",0,"00:10:10",19.399999999999999,"20:20:10",90,"EST","00:15:10",0.3,67.799999999999969,67.8,166.14,4,null,{"$f":"IF(AC40=\"\",\"\",VLOOKUP(AC40,List!$B$2:$E$29,4,FALSE))","v":"Soleil nuageux et averses"},null,2,"11:20:10"]
["2018-01-28",25.8,"21:15:06",49,"23:55:06",9.3000000000000007,"07:30:10",13.6,"13:30:06",81,"23:55:06",1036.2,"11:15:06",0,"01:00:10",7.2,"13:50:06",0,"06:45:10",11.2,"14:30:06",90,"EST","17:10:06",0.3,68.099999999999966,68.099999999999994,153.34,13,null,{"$f":"IF(AC41=\"\",\"\",VLOOKUP(AC41,List!$B$2:$E$29,4,FALSE))","v":"Pluies et éclaircies"},null,2,"10:40:06"]
["2018-01-29",26.1,"21:10:06",47,"23:55:06",9.5,"06:55:06",12.6,"15:15:06",81,"23:55:06",1034.2,"00:10:06",0,"00:30:06",8.6,"12:55:06",0,"06:25:06",11.2,"02:00:06",45,"NE","04:10:06",0,68.099999999999966,68.099999999999994,142.12,1,null,{"$f":"IF(AC42=\"\",\"\",VLOOKUP(AC42,List!$B$2:$E$29,4,FALSE))","v":"Ciel dégagé"},null,2,"12:20:06"]
["2018-01-30",25.1,"21:10:06",48,"23:55:06",9.6,"03:15:06",12.6,"14:10:06",82,"23:55:06",1030.4000000000001,"00:40:06",0,"04:25:06",14.8,"14:00:06",1.1000000000000001,"04:25:06",19.399999999999999,"14:00:06",90,"EST","01:00:06",0,68.099999999999966,68.099999999999994,265.45,1,null,{"$f":"IF(AC43=\"\",\"\",VLOOKUP(AC43,List!$B$2:$E$29,4,FALSE))","v":"Ciel dégagé"},null,3,"14:00:06"]
["2018-01-31",25.2,"21:25:06",45,"23:55:06",5,"23:00:06",12.1,"11:40:06",77,"23:55:06",1020.5,"00:00:06",1.1000000000000001,"17:45:06",19.399999999999999,"05:30:06",2.5,"17:55:06",25.6,"05:30:06",135,"SE","06:50:06",2.1,70.19999999999996,70.2,108.71,13,null,{"$f":"IF(AC44=\"\",\"\",VLOOKUP(AC44,List!$B$2:$E$29,4,FALSE))","v":"Pluies et éclaircies"},null,2,"11:40:06"]
["",null,null,null,null,null,null,null,null,null,null,null,null,null,null,null,null,null,null,null,null,"",null,null,null,"",null,null,null,null,{"$f":"IF(AC45=\"\",\"\",VLOOKUP(AC45,List!$B$2:$E$29,4,FALSE))","v":""}]
["",null,null,null,null,null,null,null,null,null,null,null,null,null,null,null,null,null,null,null,null,"",null,null,null,"",null,null,null,null,{"$f":"IF(AC46=\"\",\"\",VLOOKUP(AC46,List!$B$2:$E$29,4,FALSE))","v":""}]

{"sheet":"Février 18","index":13,"n_rows":46,"n_cols":53,"rows_kept":46,"cut":false,"hidden":true,"merged":[[12,35,12,38]]}
["Soleil","C","Ciel voilé","Rares éclaircies","Soleil Fortes averses","Variable",null,null,null,"Orageux","Soleil orage","Soleil averses orageuses","Pluies orageuses","Orage","Orage et grêles","Orage violent",null,null,null,null,null,null,null,null,null,null,null,null,null,null,null,null,null,null,null,null,null,null,null,null,null,null,30,51,299,700]
[null,1,2,3,4,5,null,null,null,null,18,19,20,21,22,23,null,null,null,null,null,null,null,null,null,null,null,null,null,null,null,null,null,null,null,null,null,null,null,null,null,null,null,null,null,null,null,null,null,null,{"$f":"COUNTIF($W$14:$W$46,AZ2)","v":4},"N",0]
["Nuageux & Brumeux","C","Brouillard dense","Brume ou Brouillard légé","Brume ou léger brouillard givrant","Nuageux","Couvert","Couvert rares averses",null,"Grèle & Neige","Giboulées","Grèles","Neiges","Fortes neiges",null,null,null,null,null,null,null,null,null,null,null,null,null,null,null,null,null,null,null,null,null,null,null,null,null,null,null,null,null,null,null,null,null,null,null,null,{"$f":"COUNTIF($W$14:$W$46,AZ3)","v":0},"NNE",23]
[null,6,7,8,9,10,11,12,null,null,24,25,26,27,null,null,null,null,null,null,null,null,null,null,null,null,null,null,null,null,null,null,null,null,null,null,null,null,null,null,null,null,null,null,null,null,null,null,null,null,1,"NE",45]
["Pluvieux","Pluies et éclaircies","Pluies éparses","Bruines","Averses ou fortes pluies","Pluies mélées de neige",null,null,null,null,null,null,null,null,null,null,null,null,null,null,null,null,null,null,null,null,null,null,null,null,null,null,null,null,null,null,null,null,null,null,null,null,null,null,null,null,null,null,null,null,0,"ENE",68]
[null,13,14,15,16,17,null,null,null,null,null,null,null,null,null,null,null,null,null,null,null,null,null,null,null,null,null,null,null,null,null,null,null,null,null,null,null,null,null,null,null,null,null,null,null,null,null,null,null,null,4,"EST",90]
[null,null,null,null,null,{"$f":"IF(F14=\"\",\"\",MIN(F14:F46))","v":-7.6},null,{"$f":"IF(H14=\"\",\"\",MIN(H14:H46))","v":3.4},null,42,null,1007.8,null,0,null,8.6,null,0,null,11.2,null,{"$f":"VLOOKUP(W7,$AZ$2:$BA$17,2,FALSE)","v":23},{"$f":"W10","v":"NNE"},null,{"$f":"MIN(Y14:Y46)","v":0},null,null,66.849999999999994,null,null,null,null,1,null,null,null,null,null,null,null,null,null,null,null,null,null,null,null,null,null,0,"ESE",113]
[null,null,null,null,null,{"$f":"IF(F15=\"\",\"\",MAX(F14:F46))","v":9.3000000000000007},null,{"$f":"IF(H15=\"\",\"\",MAX(H14:H46))","v":15},null,90,null,1025.3,null,3.6,null,24.5,null,5,null,86,null,{"$f":"VLOOKUP(W8,$AZ$2:$BA$17,2,FALSE)","v":315},{"$f":"W11","v":"NO"},null,{"$f":"MAX(Y14:Y46)","v":15},76.8,147,434.42,null,null,null,null,4,null,null,null,null,null,null,null,null,null,null,null,null,null,null,null,null,null,3,"SE",135]
[null,null,null,null,null,null,null,null,null,null,null,null,null,null,null,null,null,null,null,null,null,null,null,null,null,null,null,null,null,null,null,null,null,null,null,null,null,null,null,null,null,null,null,null,null,null,null,null,null,null,0,"SSE",158]
[null,null,null,null,null,null,null,null,null,null,null,null,null,null,null,null,null,null,null,null,null,{"$f":"SMALL($AY$2:$AY$17,1)","v":0},{"$f":"VLOOKUP(V10,$AY$2:$AZ$17,2,FALSE)","v":"NNE"},null,null,{"$f":"MAX(Z14:Z46)","v":76.8},null,null,null,null,null,null,null,null,null,null,null,null,null,null,null,31,99,300,null,null,null,null,null,null,0,"S",180]
[null,null,null,null,null,{"$f":"IF(F14=\"\",\"\",MIN(F14:F46))","v":-7.6},{"$f":"VLOOKUP(F11,F14:G46,2,FALSE)","v":"06:35:21"},{"$f":"IF(H14=\"\",\"\",MAX(H14:H46))","v":15},{"$f":"VLOOKUP(H11,H14:I46,2,FALSE)","v":"13:00:14"},null,null,null,null,null,null,null,null,null,null,null,null,{"$f":"LARGE($AY$2:$AY$17,1)","v":16},{"$f":"VLOOKUP(V11,$AY$2:$AZ$17,2,FALSE)","v":"NO"},null,null,null,null,null,null,null,null,null,null,null,null,null,null,null,null,null,null,49,100,301,null,null,null,null,null,null,0,"SSO",203]
["Moyenne Mensuelle",{"$f":"AVERAGE(B14:B46)","v":24.500000000000004},null,{"$f":"AVERAGE(D14:D46)","v":44.642857142857146},null,{"$f":"AVERAGE(F14:F46)","v":-0.12499999999999988},null,{"$f":"AVERAGE(H14:H46)","v":9.8571428571428577},null,{"$f":"AVERAGE(J14:J46)","v":76.178571428571431},null,{"$f":"AVERAGE(L14:L46)","v":1017.8464285714286},null,{"$f":"AVERAGE(N14:N46)","v":0.16785714285714287},null,null,null,{"$f":"AVERAGE(R14:R46)","v":0.33571428571428574},null,null,null,null,"SE","09:30:45",{"$f":"AVERAGE(Y14:Y44)","v":2.7428571428571429},{"$f":"AVERAGE(Z14:Z46)","v":53.657142857142851},null,{"$f":"AVERAGE(AB14:AB46)","v":311.29249999999996},null,null,null,null,{"$f":"AVERAGE(AG14:AG46)","v":3.2142857142857144},null,null,null,null,null,null,null,null,50,101,699,null,null,null,null,null,null,0,"SO",225]
["Jour","T°               int.    (°C)","Heure","Hum              int.       (%)","Heure","T°              Mini                 ext.    (°C)","Heure","T°               Maxi                     ext.    (°C)","Heure","Hum           ext.      (%)","Heure","Press.         rel.        (hpa)","Heure","Vit. du vent    (km/h)","Heure","Vit. du vent    (km/h)","Heure","Rafale  Min        (km/h)","Heure","Rafale    Max      (km/h)","Heure","Direction                      du vent"," -","Heure","Précipi. dern. 24 h        (mm)","Précipi. Tot. mois          (mm)","Précipi. Tot. An        (mm)","Lumière (W/M2)",null,null,null,null,"UVI","Heure",null,"Intensité des UV",null,null,null,null,null,null,null,null,null,null,null,null,null,null,0,"OSO",248]
["2018-02-01",23.9,"21:00:06",49,"23:55:06",4,"10:15:06",9.9,"14:15:06",80,"23:55:06",1009.3,"23:50:06",0,"06:35:06",15.8,"02:15:06",1.1000000000000001,"19:20:06",27,"14:25:06",{"$f":"IF(W14=\"N\",0,IF(W14=\"NNE\",23,IF(W14=\"NE\",45,IF(W14=\"ENE\",68,IF(W14=\"EST\",90,IF(W14=\"ESE\",113,IF(W14=\"SE\",135,IF(W14=\"SSE\",158,IF(W14=\"S\",180,IF(W14=\"SSO\",203,IF(W14=\"SO\",225,IF(W14=\"OSO\",248,IF(W14=\"O\",270,IF(W14=\"ONO\",293,IF(W14=\"NO\",315,IF(W14=\"NNO\",338,\"\"))))))))))))))))","v":45},"NE","10:10:06",14.4,{"$f":"Y14","v":14.4},84.6,273.64999999999998,16,null,{"$f":"IF(AC14=\"\",\"\",VLOOKUP(AC14,List!$B$2:$E$29,4,FALSE))","v":"Averses ou fortes pluies"},null,3,"13:45:06",null,"FAIBLE","<2",null,null,null,"Soleil","C","Ciel voilé","Rares éclaircies","Soleil Fortes averses","Variable",0,0,null,null,0,"O",270]
[{"$f":"IF(B15=\"\",\"\",A14+1)","v":"2018-02-02"},24.2,"21:05:07",48,"23:55:07",2.8,"03:50:06",12.3,"14:10:07",84,"23:55:07",1013.2,"10:40:07",0,"00:20:06",18.399999999999999,"04:15:06",0,"00:20:06",25.6,"16:15:07",315,"NO","02:40:06",3.6,{"$f":"IF(Y15=\"\",\"\",Y15+Z14)","v":18},88.2,414.23,14,null,{"$f":"IF(AC15=\"\",\"\",VLOOKUP(AC15,List!$B$2:$E$29,4,FALSE))","v":"Pluies éparses"},{"$f":"IF(AC15=\"\",\"\",)","v":0},3,"11:40:07",null,"MODEREE",3,"à",5,null,null,null,null,null,null,null,null,null,null,null,0,"ONO",293]
[{"$f":"IF(B16=\"\",\"\",A15+1)","v":"2018-02-03"},23.8,"18:45:08",48,"23:55:08",4.5999999999999996,"02:45:07",10.8,"14:35:08",87,"23:55:08",1011.8,"00:05:07",0,"00:00:07",18.399999999999999,"15:50:08",0,"00:00:07",23.4,"12:20:08",315,"NO","00:50:07",7.8,25.8,96,363.92,16,null,{"$f":"IF(AC16=\"\",\"\",VLOOKUP(AC16,List!$B$2:$E$29,4,FALSE))","v":"Averses ou fortes pluies"},"Averses ou fortes pluies",3,"12:50:08",null,"FORTE",6,"à",7,null,"Nuageux & Brumeux","C","Brouillard dense","Brume ou Brouillard légé","Brume ou léger brouillard givrant","Nuageux","Couvert","Couvert rares averses",null,null,16,"NO",315]
["2018-02-04",24.2,"19:30:09",48,"23:55:09",2.4,"20:35:09",7.8,"13:45:09",80,"23:55:09",1021.3,"23:35:09",0,"20:05:09",23.4,"14:10:09",1.1000000000000001,"20:05:09",30.6,"14:30:09",315,"NO","01:55:08",2.1,27.900000000000002,98.1,381.74,14,null,{"$f":"IF(AC17=\"\",\"\",VLOOKUP(AC17,List!$B$2:$E$29,4,FALSE))","v":"Pluies éparses"},"Pluies et éclaircies",3,"11:40:09",null,"TRES FORTE",8,"à",10,null,null,null,null,null,null,null,null,null,null,null,0,"NNO",338]
["2018-02-05",22.4,"13:55:09",51,"23:55:09",-1.1000000000000001,"08:10:09",7.7,"14:55:09",80,"23:55:09",1021.6,"10:05:09",0,"05:45:09",24.5,"16:05:09",0,"19:25:09",31.7,"16:05:09",0,"N","00:05:09",0,27.900000000000002,98.1,355.21,1,null,{"$f":"IF(AC18=\"\",\"\",VLOOKUP(AC18,List!$B$2:$E$29,4,FALSE))","v":"Ciel dégagé"},"C",3,"11:30:09",null,"EXTREME","11+",null,null,null,"Pluvieux","Pluies et éclaircies","Pluies éparses","Bruines","Averses ou fortes pluies","Pluies mélées de neige"]
["2018-02-06",23,"19:05:10",48,"23:55:10",-1.7,"03:45:09",4.3,"13:45:10",72,"23:55:10",1015.2,"00:05:09",0,"00:05:09",17.3,"08:15:09",0,"00:05:09",23.4,"08:15:09",315,"NO","07:10:09",6.6,34.5,104.7,69.430000000000007,26,null,{"$f":"IF(AC19=\"\",\"\",VLOOKUP(AC19,List!$B$2:$E$29,4,FALSE))","v":"Neiges"},"C",2,"11:20:10"]
["2018-02-07",23.2,"19:55:11",49,"23:55:11",-0.4,"23:15:11",8.1,"13:00:11",81,"23:55:11",1019.7,"23:05:11",0,"03:10:10",24.5,"13:10:11",0,"03:10:10",30.6,"11:40:11",0,"N","00:45:10",2.7,37.200000000000003,107.4,384.41,13,null,{"$f":"IF(AC20=\"\",\"\",VLOOKUP(AC20,List!$B$2:$E$29,4,FALSE))","v":"Pluies et éclaircies"},"C",4,"13:05:11",null,null,null,null,null,null,"Orageux","Soleil orage","Soleil averses orageuses","Pluies orageuses","Orage","Orage et grêles","Orage violent"]
["2018-02-08",24.6,"21:20:14",42,"23:55:14",-3.5,"08:20:11",9.5,"15:25:14",71,"23:55:14",1020.6,"09:55:11",0,"00:00:11",11.2,"21:10:14",0,"00:00:11",18.399999999999999,"22:50:14",90,"EST","10:10:11",0,37.200000000000003,107.4,337.77,1,null,{"$f":"IF(AC21=\"\",\"\",VLOOKUP(AC21,List!$B$2:$E$29,4,FALSE))","v":"Ciel dégagé"},"Averses ou fortes pluies",3,"11:25:14"]
["2018-02-09",23.7,"22:00:14",44,"23:55:14",2.4,"23:55:14",10.8,"15:20:14",72,"23:55:14",1019.2,"23:30:14",0,"06:45:14",20.9,"17:25:14",0,"06:50:14",28.1,"15:10:14",135,"SE","09:15:14",1.2,38.400000000000006,108.6,422.97,13,null,{"$f":"IF(AC22=\"\",\"\",VLOOKUP(AC22,List!$B$2:$E$29,4,FALSE))","v":"Pluies et éclaircies"},"Pluies et éclaircies",4,"13:20:14",null,null,null,null,null,null,"Grèle & Neige","Giboulées","Grèles","Neiges","Fortes neiges",0,0]
["2018-02-10",23.5,"21:20:12",43,"23:55:12",-1.2,"06:55:14",11.4,"23:55:12",85,"23:55:12",1019.5,"01:50:14",0,"00:05:14",17.3,"18:05:12",0,"00:10:14",24.5,"19:40:12",90,"EST","00:00:14",0,38.400000000000006,108.6,270.20999999999998,1,null,{"$f":"IF(AC23=\"\",\"\",VLOOKUP(AC23,List!$B$2:$E$29,4,FALSE))","v":"Ciel dégagé"},"Pluies éparses",3,"12:35:12"]
["2018-02-11",24.7,"16:05:12",49,"23:55:12",1.3,"23:50:12",11.7,"15:15:12",78,"23:55:12",1014.6,"23:45:12",0,"06:30:12",12.2,"03:00:12",0,"20:30:12",15.8,"14:20:12",315,"NO","07:55:12",0.9,39.300000000000004,109.5,411.99,13,null,{"$f":"IF(AC24=\"\",\"\",VLOOKUP(AC24,List!$B$2:$E$29,4,FALSE))","v":"Pluies et éclaircies"},"Pluies et éclaircies",3,"11:55:12",null,null,null,null,null,null,"Temps de nuit","Ciel dégagé de nuit","Ciel voilé de nuit","Brume ou brouillard léger de nuit","Brume ou léger brouillard givrant de nuit ","Brouillard dense de nuit","Ciel nuageux avec éclaircies de nuit"]
["2018-02-12",25.1,"21:40:17",42,"23:55:17",-0.7,"08:50:12",12.2,"14:35:17",79,"23:55:17",1019.1,"10:05:12",0,"00:00:12",11.2,"16:30:17",0,"03:45:12",13.3,"16:25:17",315,"NO","11:55:17",0,39.300000000000004,109.5,409.78,1,null,{"$f":"IF(AC25=\"\",\"\",VLOOKUP(AC25,List!$B$2:$E$29,4,FALSE))","v":"Ciel dégagé"},"C",3,"11:20:17"]
["2018-02-13",25,"21:10:13",42,"23:55:13",1.1000000000000001,"23:55:13",11.3,"14:45:13",80,"23:55:13",1010.7,"00:00:17",0,"20:30:13",24.5,"07:10:17",1.1000000000000001,"20:30:13",35.6,"07:40:17",135,"SE","18:35:13",15,54.300000000000004,124.5,387.97,24,null,{"$f":"IF(AC26=\"\",\"\",VLOOKUP(AC26,List!$B$2:$E$29,4,FALSE))","v":"Giboulées"},null,3,"13:10:13"]
["2018-02-14",24.7,"21:05:14",46,"23:55:14",-1.1000000000000001,"01:35:13",12.3,"22:15:14",88,"23:55:14",1007.8,"02:55:13",0,"00:00:13",18.399999999999999,"09:40:13",0,"00:00:13",23.4,"08:20:13",90,"EST","01:05:13",5.0999999999999996,59.400000000000006,129.6,66.849999999999994,14,null,{"$f":"IF(AC27=\"\",\"\",VLOOKUP(AC27,List!$B$2:$E$29,4,FALSE))","v":"Pluies éparses"},null,1,"09:25:13"]
["2018-02-15",25.5,"18:40:13",47,"23:55:13",0.5,"23:05:13",12.5,"11:55:13",87,"23:55:13",1020.7,"23:40:13",0,"07:10:14",12.2,"12:20:13",0,"08:20:14",15.8,"01:30:14",90,"EST","04:25:14",2.1,61.500000000000007,131.69999999999999,168.73,4,null,{"$f":"IF(AC28=\"\",\"\",VLOOKUP(AC28,List!$B$2:$E$29,4,FALSE))","v":"Soleil nuageux et averses"},null,3,"11:40:13"]
["2018-02-16",25.1,"19:00:14",45,"23:55:14",-2.4,"07:35:13",12.1,"15:05:14",82,"23:55:14",1025.3,"10:30:14",0,"00:00:13",11.2,"13:40:14",0,"00:00:13",14.8,"13:40:14",0,"N","11:10:14",0,61.500000000000007,131.69999999999999,373.24,1,null,{"$f":"IF(AC29=\"\",\"\",VLOOKUP(AC29,List!$B$2:$E$29,4,FALSE))","v":"Ciel dégagé"},null,3,"10:50:14"]
["2018-02-17",25.6,"19:15:15",44,"23:55:15",2.5,"08:45:14",15,"13:00:14",86,"23:55:15",1021.8,"23:10:15",0,"00:00:14",11.2,"13:40:14",0,"00:00:14",13.3,"13:40:14",315,"NO","12:00:14",0.9,62.400000000000006,132.6,434.42,1,null,{"$f":"IF(AC30=\"\",\"\",VLOOKUP(AC30,List!$B$2:$E$29,4,FALSE))","v":"Ciel dégagé"},null,4,"13:35:14"]
["2018-02-18",26.2,"21:05:16",46,"23:55:16",6.4,"00:45:15",11.1,"15:25:16",90,"23:55:16",1021.6,"00:00:15",0,"06:35:15",8.6,"01:20:15",0,"16:55:16",11.2,"01:20:15",135,"SE","04:05:15",9,71.400000000000006,141.6,114.12,16,null,{"$f":"IF(AC31=\"\",\"\",VLOOKUP(AC31,List!$B$2:$E$29,4,FALSE))","v":"Averses ou fortes pluies"},null,2,"10:45:16"]
["2018-02-19",25.8,"21:00:17",49,"23:55:17",9.3000000000000007,"00:00:16",12,"15:40:17",84,"23:55:17",1017.5,"10:50:17",0,"00:00:16",12.2,"22:25:17",0,"00:00:16",86,"18:20:17",315,"NO","03:25:16",1.8,73.2,143.4,121.85,4,null,{"$f":"IF(AC32=\"\",\"\",VLOOKUP(AC32,List!$B$2:$E$29,4,FALSE))","v":"Soleil nuageux et averses"},null,2,"10:50:17"]
["2018-02-20",25.4,"21:00:19",47,"23:55:19",5.8,"22:05:19",10.4,"10:50:19",76,"23:55:19",1020.1,"20:35:19",3.6,"21:00:19",22,"14:30:19",5,"21:00:19",29.5,"14:30:19",315,"NO","00:10:17",0,73.2,143.4,171.32,1,null,{"$f":"IF(AC33=\"\",\"\",VLOOKUP(AC33,List!$B$2:$E$29,4,FALSE))","v":"Ciel dégagé"},null,3,"00:55:17"]
["2018-02-21",25.7,"14:15:19",45,"23:55:19",2.2999999999999998,"21:50:19",11.5,"14:35:19",79,"23:55:19",1022.7,"10:15:19",1.1000000000000001,"19:45:19",20.9,"15:50:19",1.1000000000000001,"20:10:19",24.5,"15:35:19",315,"NO","02:50:19",0,73.2,143.4,345.66,1,null,{"$f":"IF(AC34=\"\",\"\",VLOOKUP(AC34,List!$B$2:$E$29,4,FALSE))","v":"Ciel dégagé"},null,4,"12:30:19"]
["2018-02-22",25.1,"16:10:19",43,"23:55:19",-3.3,"08:00:19",10.199999999999999,"14:55:19",78,"23:55:19",1019,"01:50:19",0,"01:25:19",17.3,"15:45:19",0,"01:25:19",22,"15:45:19",315,"NO","00:05:19",0,73.2,143.4,344.66,1,null,{"$f":"IF(AC35=\"\",\"\",VLOOKUP(AC35,List!$B$2:$E$29,4,FALSE))","v":"Ciel dégagé"},null,4,"12:25:19"]
["2018-02-23",25.1,"18:30:19",41,"23:55:19",-5.5,"07:35:19",9.1,"14:10:19",73,"23:55:19",1015.5,"00:10:19",0,"00:05:19",13.3,"14:55:19",0,"00:30:19",18.399999999999999,"14:55:19",315,"NO","10:40:19",3.6,76.8,147,338.35,1,null,{"$f":"IF(AC36=\"\",\"\",VLOOKUP(AC36,List!$B$2:$E$29,4,FALSE))","v":"Ciel dégagé"},null,4,"11:50:19"]
["2018-02-24",24.6,"18:10:19",40,"23:55:19",-5.5,"07:45:19",9.3000000000000007,"14:35:19",75,"23:55:19",1014.4,"23:50:19",0,"00:00:19",14.8,"15:15:19",0,"00:00:19",18.399999999999999,"15:35:19",315,"NO","14:50:19",0,76.8,147,334.6,1,null,{"$f":"IF(AC37=\"\",\"\",VLOOKUP(AC37,List!$B$2:$E$29,4,FALSE))","v":"Ciel dégagé"},null,4,"12:10:19"]
["2018-02-25",24.4,"19:35:19",42,"23:55:19",-5.3,"07:05:19",9.3000000000000007,"15:10:19",65,"23:55:19",1020.3,"23:40:19",0,"00:00:19",17.3,"16:25:19",0,"00:00:19",22,"13:40:19",0,"N","11:25:19",0,76.8,147,347.17,1,null,{"$f":"IF(AC38=\"\",\"\",VLOOKUP(AC38,List!$B$2:$E$29,4,FALSE))","v":"Ciel dégagé"},null,4,"12:05:19"]
["2018-02-26",24.1,"00:00:19",38,"23:55:20",-3,"03:40:19",5.3,"14:45:20",52,"23:55:20",1023.3,"11:00:20",0,"02:25:19",20.9,"17:30:20",0,"02:25:19",29.5,"17:30:20",315,"NO","05:20:19",0,76.8,147,333.67,1,null,{"$f":"IF(AC39=\"\",\"\",VLOOKUP(AC39,List!$B$2:$E$29,4,FALSE))","v":"Ciel dégagé"},null,4,"12:05:20"]
["2018-02-27",24,"18:50:21",39,"23:55:21",-6.6,"03:50:20",4.7,"12:55:21",47,"23:55:21",1021.4,"00:40:20",0,"02:00:20",18.399999999999999,"16:05:21",0,"02:10:20",22,"16:05:21",315,"NO","04:20:20",0,76.8,147,337.46,1,null,{"$f":"IF(AC40=\"\",\"\",VLOOKUP(AC40,List!$B$2:$E$29,4,FALSE))","v":"Ciel dégagé"},null,4,"12:05:21"]
["2018-02-28",23.4,"15:50:21",35,"23:55:21",-7.6,"06:35:21",3.4,"14:55:21",42,"23:55:21",1012.5,"00:10:21",0,"00:30:21",14.8,"15:20:21",0,"03:20:21",20.9,"11:45:21",315,"NO","00:25:21",0,76.8,147,400.81,1,null,{"$f":"IF(AC41=\"\",\"\",VLOOKUP(AC41,List!$B$2:$E$29,4,FALSE))","v":"Ciel dégagé"},null,4,"11:35:21"]
["",null,null,null,null,null,null,null,null,null,null,null,null,null,null,null,null,null,null,null,null,"",null,null,null,"",null,null,null,null,{"$f":"IF(AC42=\"\",\"\",VLOOKUP(AC42,List!$B$2:$E$29,4,FALSE))","v":""}]
["",null,null,null,null,null,null,null,null,null,null,null,null,null,null,null,null,null,null,null,null,"",null,null,null,"",null,null,null,null,{"$f":"IF(AC43=\"\",\"\",VLOOKUP(AC43,List!$B$2:$E$29,4,FALSE))","v":""}]
["",null,null,null,null,null,null,null,null,null,null,null,null,null,null,null,null,null,null,null,null,"",null,null,null,"",null,null,null,null,{"$f":"IF(AC44=\"\",\"\",VLOOKUP(AC44,List!$B$2:$E$29,4,FALSE))","v":""}]
["",null,null,null,null,null,null,null,null,null,null,null,null,null,null,null,null,null,null,null,null,"",null,null,null,"",null,null,null,null,{"$f":"IF(AC45=\"\",\"\",VLOOKUP(AC45,List!$B$2:$E$29,4,FALSE))","v":""}]
["",null,null,null,null,null,null,null,null,null,null,null,null,null,null,null,null,null,null,null,null,"",null,null,null,"",null,null,null,null,{"$f":"IF(AC46=\"\",\"\",VLOOKUP(AC46,List!$B$2:$E$29,4,FALSE))","v":""}]

{"sheet":"Mars 18","index":14,"n_rows":46,"n_cols":53,"rows_kept":46,"cut":false,"hidden":true,"merged":[[12,35,12,38]]}
["Soleil","C","Ciel voilé","Rares éclaircies","Soleil Fortes averses","Variable",null,null,null,"Orageux","Soleil orage","Soleil averses orageuses","Pluies orageuses","Orage","Orage et grêles","Orage violent",null,null,null,null,null,null,null,null,null,null,null,null,null,null,null,null,null,null,null,null,null,null,null,null,null,null,30,51,299,700]
[null,1,2,3,4,5,null,null,null,null,18,19,20,21,22,23,null,null,null,null,null,null,null,null,null,null,null,null,null,null,null,null,null,null,null,null,null,null,null,null,null,null,null,null,null,null,null,null,null,null,{"$f":"COUNTIF($W$14:$W$46,AZ2)","v":1},"N",0]
["Nuageux & Brumeux","C","Brouillard dense","Brume ou Brouillard légé","Brume ou léger brouillard givrant","Nuageux","Couvert","Couvert rares averses",null,"Grèle & Neige","Giboulées","Grèles","Neiges","Fortes neiges",null,null,null,null,null,null,null,null,null,null,null,null,null,null,null,null,null,null,null,null,null,null,null,null,null,null,null,null,null,null,null,null,null,null,null,null,{"$f":"COUNTIF($W$14:$W$46,AZ3)","v":0},"NNE",23]
[null,6,7,8,9,10,11,12,null,null,24,25,26,27,null,null,null,null,null,null,null,null,null,null,null,null,null,null,null,null,null,null,null,null,null,null,null,null,null,null,null,null,null,null,null,null,null,null,null,null,0,"NE",45]
["Pluvieux","Pluies et éclaircies","Pluies éparses","Bruines","Averses ou fortes pluies","Pluies mélées de neige",null,null,null,null,null,null,null,null,null,null,null,null,null,null,null,null,null,null,null,null,null,null,null,null,null,null,null,null,null,null,null,null,null,null,null,null,null,null,null,null,null,null,null,null,0,"ENE",68]
[null,13,14,15,16,17,null,null,null,null,null,null,null,null,null,null,null,null,null,null,null,null,null,null,null,null,null,null,null,null,null,null,null,null,null,null,null,null,null,null,null,null,null,null,null,null,null,null,null,null,7,"EST",90]
[null,null,null,null,null,{"$f":"IF(F14=\"\",\"\",MIN(F14:F46))","v":-3.2},null,{"$f":"IF(H14=\"\",\"\",MIN(H14:H46))","v":4.0999999999999996},null,0.92,null,985.1,null,0,null,6.1,null,0,null,8.6,null,{"$f":"VLOOKUP(W7,$AZ$2:$BA$17,2,FALSE)","v":23},{"$f":"W10","v":"NNE"},null,{"$f":"MIN(Y14:Y46)","v":0},null,null,71.55,null,null,null,null,1,null,null,null,null,null,null,null,null,null,null,null,null,null,null,null,null,null,0,"ESE",113]
[null,null,null,null,null,{"$f":"IF(F15=\"\",\"\",MAX(F14:F46))","v":10.6},null,{"$f":"IF(H15=\"\",\"\",MAX(H14:H46))","v":18.8},null,89,null,1031.4000000000001,null,2.5,null,28.1,null,2.5,null,39.200000000000003,null,{"$f":"VLOOKUP(W8,$AZ$2:$BA$17,2,FALSE)","v":315},{"$f":"W11","v":"NO"},null,{"$f":"MAX(Y14:Y46)","v":11.4},86.699999999999989,245.1,684.52,null,null,null,null,7,null,null,null,null,null,null,null,null,null,null,null,null,null,null,null,null,null,10,"SE",135]
[null,null,null,null,null,null,null,null,null,null,null,null,null,null,null,null,null,null,null,null,null,null,null,null,null,null,null,null,null,null,null,null,null,null,null,null,null,null,null,null,null,null,null,null,null,null,null,null,null,null,0,"SSE",158]
[null,null,null,null,null,null,null,null,null,null,null,null,null,null,null,null,null,null,null,null,null,{"$f":"SMALL($AY$2:$AY$17,1)","v":0},{"$f":"VLOOKUP(V10,$AY$2:$AZ$17,2,FALSE)","v":"NNE"},null,null,{"$f":"MAX(Z14:Z46)","v":86.699999999999989},null,null,null,null,null,null,null,null,null,null,null,null,null,null,null,31,99,300,null,null,null,null,null,null,0,"S",180]
[null,null,null,null,null,{"$f":"IF(F14=\"\",\"\",MIN(F14:F46))","v":-3.2},{"$f":"VLOOKUP(F11,F14:G46,2,FALSE)","v":"06:15:26"},{"$f":"IF(H14=\"\",\"\",MAX(H14:H46))","v":18.8},{"$f":"VLOOKUP(H11,H14:I46,2,FALSE)","v":"15:40:23"},null,null,null,null,null,null,null,null,null,null,null,null,{"$f":"LARGE($AY$2:$AY$17,1)","v":13},{"$f":"VLOOKUP(V11,$AY$2:$AZ$17,2,FALSE)","v":"NO"},null,null,null,null,null,null,null,null,null,null,null,null,null,null,null,null,null,null,49,100,301,null,null,null,null,null,null,0,"SSO",203]
["Moyenne Mensuelle",{"$f":"AVERAGE(B14:B46)","v":22.264516129032256},null,{"$f":"AVERAGE(D14:D46)","v":46.115806451612897},null,{"$f":"AVERAGE(F14:F46)","v":3.4000000000000004},null,{"$f":"AVERAGE(H14:H46)","v":12.716129032258063},null,{"$f":"AVERAGE(J14:J46)","v":78.255483870967751},null,{"$f":"AVERAGE(L14:L46)","v":1003.6129032258066},null,{"$f":"AVERAGE(N14:N46)","v":0.18709677419354842},null,null,null,{"$f":"AVERAGE(R14:R46)","v":0.39354838709677414},null,null,null,null,"SE","09:30:45",{"$f":"AVERAGE(Y14:Y44)","v":3.1645161290322572},{"$f":"AVERAGE(Z14:Z46)","v":41.099999999999994},null,{"$f":"AVERAGE(AB14:AB46)","v":469.65096774193546},null,null,null,null,{"$f":"AVERAGE(AG14:AG46)","v":5.225806451612903},null,null,null,null,null,null,null,null,50,101,699,null,null,null,null,null,null,0,"SO",225]
["Jour","T°               int.    (°C)","Heure","Hum              int.       (%)","Heure","T°              Mini                 ext.    (°C)","Heure","T°               Maxi                     ext.    (°C)","Heure","Hum           ext.      (%)","Heure","Press.         rel.        (hpa)","Heure","Vit. du vent    (km/h)","Heure","Vit. du vent    (km/h)","Heure","Rafale  Min        (km/h)","Heure","Rafale    Max      (km/h)","Heure","Direction                      du vent"," -","Heure","Précipi. dern. 24 h        (mm)","Précipi. Tot. mois          (mm)","Précipi. Tot. An        (mm)","Lumière (W/M2)",null,null,null,null,"UVI","Heure",null,"Intensité des UV",null,null,null,null,null,null,null,null,null,null,null,null,null,null,0,"OSO",248]
["2018-03-01",22.5,"00:00:21",40,"23:55:24",-2.9,"02:55:21",4.2,"23:50:24",89,"23:55:24",996,"00:05:21",1.1000000000000001,"14:20:24",13.3,"03:00:21",2.5,"14:20:24",18.399999999999999,"03:00:21",{"$f":"IF(W14=\"N\",0,IF(W14=\"NNE\",23,IF(W14=\"NE\",45,IF(W14=\"ENE\",68,IF(W14=\"EST\",90,IF(W14=\"ESE\",113,IF(W14=\"SE\",135,IF(W14=\"SSE\",158,IF(W14=\"S\",180,IF(W14=\"SSO\",203,IF(W14=\"SO\",225,IF(W14=\"OSO\",248,IF(W14=\"O\",270,IF(W14=\"ONO\",293,IF(W14=\"NO\",315,IF(W14=\"NNO\",338,\"\"))))))))))))))))","v":315},"NO","01:05:21",11.4,0,158.4,71.55,16,null,{"$f":"IF(AC14=\"\",\"\",VLOOKUP(AC14,List!$B$2:$E$29,4,FALSE))","v":"Averses ou fortes pluies"},null,1,"08:55:21",null,"FAIBLE","<2",null,null,null,"Soleil","C","Ciel voilé","Rares éclaircies","Soleil Fortes averses","Variable",0,0,null,null,0,"O",270]
[{"$f":"IF(B15=\"\",\"\",A14+1)","v":"2018-03-02"},22.8,"21:20:19",38,"23:55:19",4.2,"00:00:24",9.1,"13:25:19",75,"23:55:19",985.1,"21:10:19",1.1000000000000001,"01:25:24",28.1,"14:40:19",2.5,"01:25:24",39.200000000000003,"14:40:19",90,"EST","02:05:24",6,{"$f":"IF(Y15=\"\",\"\",Y15+Z14)","v":6},164.4,486.86,16,null,{"$f":"IF(AC15=\"\",\"\",VLOOKUP(AC15,List!$B$2:$E$29,4,FALSE))","v":"Averses ou fortes pluies"},{"$f":"IF(AC15=\"\",\"\",)","v":0},5,"13:20:19",null,"MODEREE",3,"à",5,null,null,null,null,null,null,null,null,null,null,null,0,"ONO",293]
[{"$f":"IF(B16=\"\",\"\",A15+1)","v":"2018-03-03"},23.8,"18:50:20",42,"23:55:20",3.9,"03:40:19",12.9,"14:55:20",81,"23:55:20",987.9,"23:45:20",0,"00:00:19",22,"14:45:20",0,"00:00:19",28.1,"13:05:20",90,"EST","02:15:19",3.6,9.6,168,503.06,4,null,{"$f":"IF(AC16=\"\",\"\",VLOOKUP(AC16,List!$B$2:$E$29,4,FALSE))","v":"Soleil nuageux et averses"},"Averses ou fortes pluies",5,"13:25:20",null,"FORTE",6,"à",7,null,"Nuageux & Brumeux","C","Brouillard dense","Brume ou Brouillard légé","Brume ou léger brouillard givrant","Nuageux","Couvert","Couvert rares averses",null,null,13,"NO",315]
["2018-03-04",25.1,"19:20:21",40,"23:55:21",3.7,"23:55:21",13.3,"14:30:21",81,"23:55:21",989.1,"22:40:21",0,"03:00:20",17.3,"11:40:21",0,"03:35:20",24.5,"11:40:21",135,"SE","09:30:20",0.6,10.199999999999999,168.6,521.16,5,null,{"$f":"IF(AC17=\"\",\"\",VLOOKUP(AC17,List!$B$2:$E$29,4,FALSE))","v":"Variable"},"Pluies et éclaircies",6,"12:40:21",null,"TRES FORTE",8,"à",10,null,null,null,null,null,null,null,null,null,null,null,0,"NNO",338]
["2018-03-05",25,"15:50:21",42,"23:55:21",2,"02:05:21",13.7,"14:30:21",84,"23:55:21",988.9,"00:05:21",0,"00:00:21",20.9,"15:00:21",0,"00:00:21",24.5,"15:00:21",315,"NO","06:30:21",2.4,12.6,171,462.19,4,null,{"$f":"IF(AC18=\"\",\"\",VLOOKUP(AC18,List!$B$2:$E$29,4,FALSE))","v":"Soleil nuageux et averses"},"C",5,"12:40:21",null,"EXTREME","11+",null,null,null,"Pluvieux","Pluies et éclaircies","Pluies éparses","Bruines","Averses ou fortes pluies","Pluies mélées de neige"]
["2018-03-06",24.7,"19:10:22",45,"23:55:22",1.6,"06:40:21",9.8000000000000007,"12:40:22",87,"23:55:22",988.4,"23:40:22",0,"00:00:21",6.1,"01:00:21",0,"00:00:21",8.6,"12:50:22",315,"NO","09:50:21",5.4,18,176.4,252.61,16,null,{"$f":"IF(AC19=\"\",\"\",VLOOKUP(AC19,List!$B$2:$E$29,4,FALSE))","v":"Averses ou fortes pluies"},"C",4,"11:15:21"]
["2018-03-07",24.6,"21:05:22",42,"23:55:22",0.9,"04:05:22",14,"14:30:22",84,"23:55:22",998.7,"20:55:22",0,"00:00:22",18.399999999999999,"17:30:22",0,"00:00:22",22,"17:30:22",90,"EST","15:15:22",1.2,19.2,177.6,522.79,4,null,{"$f":"IF(AC20=\"\",\"\",VLOOKUP(AC20,List!$B$2:$E$29,4,FALSE))","v":"Soleil nuageux et averses"},"C",5,"11:50:22",null,null,null,null,null,null,"Orageux","Soleil orage","Soleil averses orageuses","Pluies orageuses","Orage","Orage et grêles","Orage violent"]
["2018-03-08",24.6,"21:20:22",44,"23:55:22",5.7,"00:00:22",10.199999999999999,"12:20:22",86,"23:55:22",1001.6,"23:30:22",0,"17:45:22",15.8,"06:30:22",0,"17:45:22",20.9,"04:30:22",135,"SE","14:55:22",4.5,23.7,182.1,236.87,16,null,{"$f":"IF(AC21=\"\",\"\",VLOOKUP(AC21,List!$B$2:$E$29,4,FALSE))","v":"Averses ou fortes pluies"},"Averses ou fortes pluies",4,"11:50:22"]
["2018-03-09",25.1,"21:20:22",48,"23:55:22",8,"00:05:22",14.9,"15:00:22",82,"23:55:22",1001.4,"00:00:22",0,"00:00:22",17.3,"15:05:22",0,"00:10:22",22,"14:50:22",135,"SE","06:05:22",0.9,24.599999999999998,183,406.07,4,null,{"$f":"IF(AC22=\"\",\"\",VLOOKUP(AC22,List!$B$2:$E$29,4,FALSE))","v":"Soleil nuageux et averses"},"Pluies et éclaircies",5,"14:40:22",null,null,null,null,null,null,"Grèle & Neige","Giboulées","Grèles","Neiges","Fortes neiges",0,0]
["2018-03-10",25,"21:35:23",47,"23:55:23",10.6,"22:30:23",18.8,"15:40:23",80,"23:55:23",994.4,"12:55:23",0,"00:05:22",17.3,"12:55:23",0,"02:30:22",25.6,"12:55:23",135,"SE","00:10:22",0.6,25.2,183.6,577.74,5,null,{"$f":"IF(AC23=\"\",\"\",VLOOKUP(AC23,List!$B$2:$E$29,4,FALSE))","v":"Variable"},"Pluies éparses",6,"13:30:23"]
["2018-03-11",24.1,"00:00:23",48,"23:55:23",6,"03:05:23",14.4,"11:05:23",78,"23:55:23",991.7,"00:00:23",0,"00:20:23",24.5,"14:50:23",0,"02:20:23",39.200000000000003,"14:50:23",315,"NO","07:05:23",3.3,28.5,186.9,461.37,5,null,{"$f":"IF(AC24=\"\",\"\",VLOOKUP(AC24,List!$B$2:$E$29,4,FALSE))","v":"Variable"},"Pluies et éclaircies",5,"14:25:23",null,null,null,null,null,null,"Temps de nuit","Ciel dégagé de nuit","Ciel voilé de nuit","Brume ou brouillard léger de nuit","Brume ou léger brouillard givrant de nuit ","Brouillard dense de nuit","Ciel nuageux avec éclaircies de nuit"]
["2018-03-12",24.9,"18:40:23",45,"23:55:25",9,"23:30:25",13.6,"14:20:23",84,"23:55:25",1002.2,"23:50:25",2.5,"20:00:23",19.399999999999999,"15:15:23",2.5,"22:55:25",25.6,"15:15:23",90,"EST","08:05:23",3,31.5,189.9,472.32,5,null,{"$f":"IF(AC25=\"\",\"\",VLOOKUP(AC25,List!$B$2:$E$29,4,FALSE))","v":"Variable"},"C",5,"14:15:23"]
["2018-03-13",24.6,"21:15:25",47,"23:55:25",4.5,"21:20:25",16,"13:15:25",84,"23:55:25",1010,"12:10:25",0,"04:35:25",12.2,"15:00:25",0,"07:20:25",17.3,"16:55:25",0,"N","04:45:25",2.1,33.6,192,604.39,5,null,{"$f":"IF(AC26=\"\",\"\",VLOOKUP(AC26,List!$B$2:$E$29,4,FALSE))","v":"Variable"},null,6,"13:20:25"]
["2018-03-14",24.8,"17:20:23",50,"23:55:23",6.1,"00:25:25",14.8,"15:05:23",85,"23:55:23",1007.6,"00:05:25",0,"01:05:25",24.5,"16:20:23",1.1000000000000001,"01:05:25",31.7,"16:20:23",135,"SE","09:55:25",7.5,41.1,199.5,437.86,16,null,{"$f":"IF(AC27=\"\",\"\",VLOOKUP(AC27,List!$B$2:$E$29,4,FALSE))","v":"Averses ou fortes pluies"},null,5,"13:20:23"]
["2018-03-15",23.7,"20:35:24",48,"23:55:24",6.7,"21:40:24",13.5,"14:30:23",80,"23:55:24",991.8,"23:40:24",0,"21:20:24",22,"13:40:23",0,"21:25:24",27,"13:40:23",135,"SE","19:20:24",2.7,43.800000000000004,202.2,468.3,4,null,{"$f":"IF(AC28=\"\",\"\",VLOOKUP(AC28,List!$B$2:$E$29,4,FALSE))","v":"Soleil nuageux et averses"},null,5,"12:05:23"]
["2018-03-16",22.3,"00:00:24",52,"23:55:24",2.2999999999999998,"06:40:24",13,"15:00:24",84,"23:55:24",997.3,"23:15:24",0,"02:15:24",19.399999999999999,"16:25:24",0,"02:15:24",24.5,"16:25:24",315,"NO","02:20:24",0.3,44.1,202.5,547.11,4,null,{"$f":"IF(AC29=\"\",\"\",VLOOKUP(AC29,List!$B$2:$E$29,4,FALSE))","v":"Soleil nuageux et averses"},null,6,"11:35:24"]
["2018-03-17",19.8,"00:00:24",52,"23:55:26",0.5,"02:35:24",13.3,"12:35:24",80,"23:55:26",997.7,"02:45:24",0,"00:00:24",19.399999999999999,"16:05:24",0,"00:00:24",27,"16:05:24",315,"NO","09:00:24",0,44.1,202.5,495.76,5,null,{"$f":"IF(AC30=\"\",\"\",VLOOKUP(AC30,List!$B$2:$E$29,4,FALSE))","v":"Variable"},null,6,"12:25:24"]
["2018-03-18",17.899999999999999,"00:00:26",50,"23:55:26",-0.6,"23:45:26",11.6,"13:35:26",80,"23:55:26",1002.8,"22:50:26",0,"06:15:26",12.2,"00:25:26",0,"06:55:26",15.8,"12:35:26",315,"NO","01:40:26",0,44.1,202.5,607.02,1,null,{"$f":"IF(AC31=\"\",\"\",VLOOKUP(AC31,List!$B$2:$E$29,4,FALSE))","v":"Ciel dégagé"},null,6,"12:25:26"]
["2018-03-19",16.8,"00:00:26",52,"23:55:28",-3.2,"06:15:26",4.0999999999999996,"11:20:26",70,"23:55:28",1013.8,"23:55:28",0,"00:00:26",19.399999999999999,"19:10:26",0,"00:00:26",25.6,"19:10:26",90,"EST","00:55:26",0.9,45,203.4,177,5,null,{"$f":"IF(AC32=\"\",\"\",VLOOKUP(AC32,List!$B$2:$E$29,4,FALSE))","v":"Variable"},null,3,"11:10:26"]
["2018-03-20",15,"00:00:28",53,"23:55:28",0.1,"23:35:28",9.3000000000000007,"13:05:28",78,"23:55:28",1029.4000000000001,"23:50:28",0,"22:00:28",28.1,"14:10:28",0,"22:40:28",34.200000000000003,"14:10:28",315,"NO","00:10:28",0.3,45.3,203.7,596.73,4,null,{"$f":"IF(AC33=\"\",\"\",VLOOKUP(AC33,List!$B$2:$E$29,4,FALSE))","v":"Soleil nuageux et averses"},null,6,"11:40:28"]
["2018-03-21",15.7,"15:45:29",52,"23:55:29",-1.5,"03:25:28",14.2,"15:40:29",82,"23:55:29",1031.4000000000001,"09:40:28",0,"00:00:28",18.399999999999999,"11:15:28",0,"00:10:28",23.4,"11:15:28",315,"NO","07:10:28",0,45.3,203.7,575.27,1,null,{"$f":"IF(AC34=\"\",\"\",VLOOKUP(AC34,List!$B$2:$E$29,4,FALSE))","v":"Ciel dégagé"},null,6,"12:00:29"]
["2018-03-22",15.2,"00:00:29",50,"23:55:30",0.9,"00:00:29",9.9,"13:25:30",64,"23:55:30",1027.4000000000001,"00:05:29",0,"00:00:29",12.2,"17:10:30",0,"00:10:29",15.8,"17:10:30",315,"NO","12:35:30",0,45.3,203.7,225.27,5,null,{"$f":"IF(AC35=\"\",\"\",VLOOKUP(AC35,List!$B$2:$E$29,4,FALSE))","v":"Variable"},null,4,"11:55:30"]
["2018-03-23",15.7,"13:55:30",55,"23:55:30",6,"01:30:30",12.6,"11:15:30",83,"23:55:30",1011.5,"00:00:30",1.1000000000000001,"00:40:30",19.399999999999999,"05:55:30",2.5,"01:10:30",23.4,"05:55:30",135,"SE","08:00:30",9,54.3,212.7,337.46,16,null,{"$f":"IF(AC36=\"\",\"\",VLOOKUP(AC36,List!$B$2:$E$29,4,FALSE))","v":"Averses ou fortes pluies"},null,4,"10:25:30"]
["2018-03-24",16.3,"22:05:31",55,"23:55:31",2,"06:50:30",13.2,"13:00:31",86,"23:55:31",999.8,"23:10:31",0,"03:15:30",14.8,"00:50:30",0,"03:55:30",19.399999999999999,"00:50:30",90,"EST","11:30:31",4.2,58.5,216.9,318.55,16,null,{"$f":"IF(AC37=\"\",\"\",VLOOKUP(AC37,List!$B$2:$E$29,4,FALSE))","v":"Averses ou fortes pluies"},null,5,"12:45:31"]
["2018-03-25",20.100000000000001,"21:05:32",0.59,"18:50:32",7.4,"07:35:31",11.5,"15:25:32",0.92,"07:35:31",1013.3,"23:55:32",0,"01:35:31",14.8,"06:15:31",0,"01:35:31",18.399999999999999,"14:10:32",315,"NO","01:15:31",7.2,65.7,224.1,283.24,16,null,{"$f":"IF(AC38=\"\",\"\",VLOOKUP(AC38,List!$B$2:$E$29,4,FALSE))","v":"Averses ou fortes pluies"},null,5,"12:40:32"]
["2018-03-26",24,"21:25:30",50,"23:55:30",5,"08:35:32",17.2,"13:35:30",78,"23:55:30",1019,"12:00:32",0,"02:20:32",12.2,"11:15:32",0,"02:20:32",15.8,"11:15:32",315,"NO","03:35:32",0.3,66,224.4,611.58000000000004,4,null,{"$f":"IF(AC39=\"\",\"\",VLOOKUP(AC39,List!$B$2:$E$29,4,FALSE))","v":"Soleil nuageux et averses"},null,6,"13:30:30"]
["2018-03-27",24.7,"21:25:31",52,"23:55:31",7.7,"01:25:30",17.2,"15:05:31",76,"23:55:31",1014.2,"00:00:30",0,"21:25:31",11.2,"00:25:30",1.1000000000000001,"21:25:31",15.8,"02:50:30",135,"SE","02:35:30",2.1,68.099999999999994,226.5,684.52,4,null,{"$f":"IF(AC40=\"\",\"\",VLOOKUP(AC40,List!$B$2:$E$29,4,FALSE))","v":"Soleil nuageux et averses"},null,6,"14:55:31"]
["2018-03-28",26.1,"17:15:32",52,"23:55:32",1.7,"23:50:32",14.9,"14:00:32",81,"23:55:32",1009.8,"00:00:31",0,"21:15:32",19.399999999999999,"11:05:31",0,"21:45:32",34.200000000000003,"11:05:31",135,"SE","16:00:32",0.6,68.699999999999989,227.1,668.32,4,null,{"$f":"IF(AC41=\"\",\"\",VLOOKUP(AC41,List!$B$2:$E$29,4,FALSE))","v":"Soleil nuageux et averses"},null,7,"13:25:32"]
["2018-03-29",25.3,"15:40:32",47,"23:55:32",1.1000000000000001,"03:45:32",12.8,"16:05:32",81,"23:55:32",1006.4,"00:20:32",0,"00:00:32",22,"16:35:32",0,"00:00:32",30.6,"17:20:32",135,"SE","04:15:32",11.4,80.099999999999994,238.5,620.52,16,null,{"$f":"IF(AC42=\"\",\"\",VLOOKUP(AC42,List!$B$2:$E$29,4,FALSE))","v":"Averses ou fortes pluies"},null,6,"13:05:32"]
["2018-03-30",25.3,"18:50:32",47,"23:55:32",5.0999999999999996,"00:55:32",14.8,"16:20:32",82,"23:55:32",995.9,"00:00:32",0,"00:15:32",14.8,"14:25:32",0,"00:15:32",19.399999999999999,"14:25:32",90,"EST","12:00:32",5.0999999999999996,85.199999999999989,243.6,684.06,16,null,{"$f":"IF(AC43=\"\",\"\",VLOOKUP(AC43,List!$B$2:$E$29,4,FALSE))","v":"Averses ou fortes pluies"},null,7,"14:00:32"]
["2018-03-31",24.7,"22:00:33",44,"23:55:33",0.9,"04:40:32",11.4,"13:55:33",80,"23:55:30",1007.5,"23:45:33",0,"00:00:32",15.8,"15:30:33",0,"00:05:32",22,"15:30:33",315,"NO","11:20:32",1.5,86.699999999999989,245.1,641.63,4,null,{"$f":"IF(AC44=\"\",\"\",VLOOKUP(AC44,List!$B$2:$E$29,4,FALSE))","v":"Soleil nuageux et averses"},null,7,"13:50:33"]
["",null,null,null,null,null,null,null,null,null,null,null,null,null,null,null,null,null,null,null,null,"",null,null,null,"",null,null,null,null,{"$f":"IF(AC45=\"\",\"\",VLOOKUP(AC45,List!$B$2:$E$29,4,FALSE))","v":""}]
["",null,null,null,null,null,null,null,null,null,null,null,null,null,null,null,null,null,null,null,null,"",null,null,null,"",null,null,null,null,{"$f":"IF(AC46=\"\",\"\",VLOOKUP(AC46,List!$B$2:$E$29,4,FALSE))","v":""}]