{"text_format":"1","workbook":"xlsx","n_sheets":4,"sheets":["chene","Fréquence des chene","BDDG","Listesdéroulante"],"not_rendered":{"charts":0,"images":0,"macros":1,"external_links":0,"defined_names":12,"comments":0,"pivot_tables":0},"unopened":[],"bounds":{"document_bytes":16777216,"sheet_cells":100000,"rows_first":2000,"rows_last":500,"rows_between":2000,"halvings":0,"cell_chars":16384,"cell_head_chars":4096},"cells_cut":0,"cells_raw":0,"read":"whole","date_system":"1900"}

{"sheet":"chene","index":0,"n_rows":13,"n_cols":30,"rows_kept":13,"cut":false,"hidden":false,"merged":[]}
["Date","Météo","Ail","Chou","Asperge","Courge","Artichaut","Aubergine","Brocoli","Celeri","Truc1","Vitre1","Route1","Cresson","Truc2","Vitre2","Route2","Endive","Truc3","Vitre3","Route3","Fenouil","Truc4","Vitre4","Route4","Total général ","Mois","Année","Différence entre 2 saisies ","Observations"]
["2018-01-03","Soleil",150,{"$f":"IF(ISNA(VLOOKUP(C2,BDDG!$A$1:$F$39,2,FALSE)),\"\",VLOOKUP(C2,BDDG!$A$1:$F$39,2,FALSE))","v":0},{"$f":"IF(ISNA(VLOOKUP(C2,BDDG!$A$2:$N$39,3,FALSE)),\"\",VLOOKUP(C2,BDDG!$A$2:$N$39,3,FALSE))","v":"Pêche"},{"$f":"IF(ISNA(VLOOKUP(C2,BDDG!$A$2:$N$39,4,FALSE)),\"\",VLOOKUP(C2,BDDG!$A$2:$N$39,4,FALSE))","v":"orange"},{"$f":"IF(ISNA(VLOOKUP(C2,BDDG!$A$1:$F$39,5,FALSE)),\"\",VLOOKUP(C2,BDDG!$A$1:$F$39,5,FALSE))","v":"Groseille"},{"$f":"IF(ISNA(VLOOKUP(C2,BDDG!$A$1:$F$39,6,FALSE)),\"\",VLOOKUP(C2,BDDG!$A$1:$F$39,6,FALSE))","v":"Nectarine"},{"$f":"IF(ISERROR(VLOOKUP(C2,BDDG!$A$1:$G$39,7,FALSE)),\"\",VLOOKUP(C2,BDDG!$A$1:$G$39,7,FALSE))","v":1},{"$f":"IF(ISERROR(VLOOKUP(C2,BDDG!$A$1:$T$39,8,FALSE)),\"\",VLOOKUP(C2,BDDG!$A$1:$T$39,8,FALSE))","v":"Myrtille"},10,23.47,{"$f":" IF(ISERROR(K2/L2*86.4),\"xxxxx\",K2/L2*86.4)","v":36.812952705581601},{"$f":"IF(ISERROR(VLOOKUP(C2,BDDG!$A$1:$T$39,11,FALSE)),\"\",VLOOKUP(C2,BDDG!$A$1:$T$39,11,FALSE))","v":"xxxxxxxxxxxxxxx"},"xxxx","xxxx",{"$f":" IF(ISERROR(O2/P2*86.4),\"xxxxx\",O2/P2*86.4)","v":"xxxxx"},{"$f":"IF(ISERROR(VLOOKUP(C2,BDDG!$A$1:$T$39,14,FALSE)),\"\",VLOOKUP(C2,BDDG!$A$1:$T$39,14,FALSE))","v":"xxxxxxxxxxxxxxx"},"xxxx","xxxx",{"$f":" IF(ISERROR(S2/T2*86.4),\"xxxxx\",S2/T2*86.4)","v":"xxxxx"},{"$f":"IF(ISERROR(VLOOKUP(C2,BDDG!$A$1:$T$39,17,FALSE)),\"\",VLOOKUP(C2,BDDG!$A$1:$T$39,17,FALSE))","v":"xxxxxxxxxxxxxxx"},"xxxx","xxxx",{"$f":" IF(ISERROR(W2/X2*86.4),\"xxxxx\",W2/X2*86.4)","v":"xxxxx"},{"$f":"IF(ISERROR(SUM(M2,Q2,U2,Y2)),\"\",SUM(M2,Q2,U2,Y2))","v":36.812952705581601},{"$f":"PROPER(TEXT(A2,\"mmmm\"))","v":"Janvier"},{"$f":"YEAR(A:A)","v":2018},{"$f":"IFERROR((INDEX($Z$2:Z13,MATCH(H2&MAX(IF($H$1:H1=H2,$A$1:A1)),$H$2:H13&$A$2:A13,0))-Z2)*-1,\"\")","v":""},{"$f":"IF(ISERROR(VLOOKUP(C2,BDDG!$A$1:$T$39,20,FALSE)),\"\",VLOOKUP(C2,BDDG!$A$1:$T$39,20,FALSE))","v":0}]
["2018-01-03","Froid",120,{"$f":"IF(ISNA(VLOOKUP(C3,BDDG!$A$1:$F$39,2,FALSE)),\"\",VLOOKUP(C3,BDDG!$A$1:$F$39,2,FALSE))","v":0},{"$f":"IF(ISNA(VLOOKUP(C3,BDDG!$A$2:$N$39,3,FALSE)),\"\",VLOOKUP(C3,BDDG!$A$2:$N$39,3,FALSE))","v":"Litchi"},{"$f":"IF(ISNA(VLOOKUP(C3,BDDG!$A$2:$N$39,4,FALSE)),\"\",VLOOKUP(C3,BDDG!$A$2:$N$39,4,FALSE))","v":"Poire"},{"$f":"IF(ISNA(VLOOKUP(C3,BDDG!$A$1:$F$39,5,FALSE)),\"\",VLOOKUP(C3,BDDG!$A$1:$F$39,5,FALSE))","v":"Prune"},{"$f":"IF(ISNA(VLOOKUP(C3,BDDG!$A$1:$F$39,6,FALSE)),\"\",VLOOKUP(C3,BDDG!$A$1:$F$39,6,FALSE))","v":"Quetsche"},{"$f":"IF(ISERROR(VLOOKUP(C3,BDDG!$A$1:$G$39,7,FALSE)),\"\",VLOOKUP(C3,BDDG!$A$1:$G$39,7,FALSE))","v":1},{"$f":"IF(ISERROR(VLOOKUP(C3,BDDG!$A$1:$T$39,8,FALSE)),\"\",VLOOKUP(C3,BDDG!$A$1:$T$39,8,FALSE))","v":"Tomate charnue"},10,26.58,32.505643340857787,{"$f":"IF(ISERROR(VLOOKUP(C3,BDDG!$A$1:$T$39,11,FALSE)),\"\",VLOOKUP(C3,BDDG!$A$1:$T$39,11,FALSE))","v":"xxxxxxxxxxxxxxx"},"xxxx","xxxx","xxxxx",{"$f":"IF(ISERROR(VLOOKUP(C3,BDDG!$A$1:$T$39,14,FALSE)),\"\",VLOOKUP(C3,BDDG!$A$1:$T$39,14,FALSE))","v":"xxxxxxxxxxxxxxx"},"xxxx","xxxx","xxxxx",{"$f":"IF(ISERROR(VLOOKUP(C3,BDDG!$A$1:$T$39,17,FALSE)),\"\",VLOOKUP(C3,BDDG!$A$1:$T$39,17,FALSE))","v":"xxxxxxxxxxxxxxx"},"xxxx","xxxx","xxxxx",32.505643340857787,"Janvier",2018,{"$f":"IFERROR((INDEX($Z$2:Z13,MATCH(H3&MAX(IF($H$1:H2=H3,$A$1:A2)),$H$2:H13&$A$2:A13,0))-Z3)*-1,\"\")","v":""},{"$f":"IF(ISERROR(VLOOKUP(C3,BDDG!$A$1:$T$39,20,FALSE)),\"\",VLOOKUP(C3,BDDG!$A$1:$T$39,20,FALSE))","v":0}]
["2017-02-03","Froid",160,{"$f":"IF(ISNA(VLOOKUP(C4,BDDG!$A$1:$F$39,2,FALSE)),\"\",VLOOKUP(C4,BDDG!$A$1:$F$39,2,FALSE))","v":0},{"$f":"IF(ISNA(VLOOKUP(C4,BDDG!$A$2:$N$39,3,FALSE)),\"\",VLOOKUP(C4,BDDG!$A$2:$N$39,3,FALSE))","v":"Litchi"},{"$f":"IF(ISNA(VLOOKUP(C4,BDDG!$A$2:$N$39,4,FALSE)),\"\",VLOOKUP(C4,BDDG!$A$2:$N$39,4,FALSE))","v":"Poire"},{"$f":"IF(ISNA(VLOOKUP(C4,BDDG!$A$1:$F$39,5,FALSE)),\"\",VLOOKUP(C4,BDDG!$A$1:$F$39,5,FALSE))","v":"Abricotier"},{"$f":"IF(ISNA(VLOOKUP(C4,BDDG!$A$1:$F$39,6,FALSE)),\"\",VLOOKUP(C4,BDDG!$A$1:$F$39,6,FALSE))","v":"Acacia"},{"$f":"IF(ISERROR(VLOOKUP(C4,BDDG!$A$1:$G$39,7,FALSE)),\"\",VLOOKUP(C4,BDDG!$A$1:$G$39,7,FALSE))","v":2},{"$f":"IF(ISERROR(VLOOKUP(C4,BDDG!$A$1:$T$39,8,FALSE)),\"\",VLOOKUP(C4,BDDG!$A$1:$T$39,8,FALSE))","v":"Ademia"},10,48.98,17.639853001224992,{"$f":"IF(ISERROR(VLOOKUP(C4,BDDG!$A$1:$T$39,11,FALSE)),\"\",VLOOKUP(C4,BDDG!$A$1:$T$39,11,FALSE))","v":"Amandier"},6,78.099999999999994,6.637644046094751,{"$f":"IF(ISERROR(VLOOKUP(C4,BDDG!$A$1:$T$39,14,FALSE)),\"\",VLOOKUP(C4,BDDG!$A$1:$T$39,14,FALSE))","v":"xxxxxxxxxxxxxxx"},"xxxx","xxxx","xxxxx",{"$f":"IF(ISERROR(VLOOKUP(C4,BDDG!$A$1:$T$39,17,FALSE)),\"\",VLOOKUP(C4,BDDG!$A$1:$T$39,17,FALSE))","v":"xxxxxxxxxxxxxxx"},"xxxx","xxxx","xxxxx",24.277497047319741,"Février",2017,{"$f":"IFERROR((INDEX($Z$2:Z13,MATCH(H4&MAX(IF($H$1:H3=H4,$A$1:A3)),$H$2:H13&$A$2:A13,0))-Z4)*-1,\"\")","v":""},{"$f":"IF(ISERROR(VLOOKUP(C4,BDDG!$A$1:$T$39,20,FALSE)),\"\",VLOOKUP(C4,BDDG!$A$1:$T$39,20,FALSE))","v":0}]
["2018-02-07","Vent chaud",110,{"$f":"IF(ISNA(VLOOKUP(C5,BDDG!$A$1:$F$39,2,FALSE)),\"\",VLOOKUP(C5,BDDG!$A$1:$F$39,2,FALSE))","v":0},{"$f":"IF(ISNA(VLOOKUP(C5,BDDG!$A$2:$N$39,3,FALSE)),\"\",VLOOKUP(C5,BDDG!$A$2:$N$39,3,FALSE))","v":"Kiwi"},{"$f":"IF(ISNA(VLOOKUP(C5,BDDG!$A$2:$N$39,4,FALSE)),\"\",VLOOKUP(C5,BDDG!$A$2:$N$39,4,FALSE))","v":"Prune"},{"$f":"IF(ISNA(VLOOKUP(C5,BDDG!$A$1:$F$39,5,FALSE)),\"\",VLOOKUP(C5,BDDG!$A$1:$F$39,5,FALSE))","v":"Raisin"},{"$f":"IF(ISNA(VLOOKUP(C5,BDDG!$A$1:$F$39,6,FALSE)),\"\",VLOOKUP(C5,BDDG!$A$1:$F$39,6,FALSE))","v":"Tomate"},{"$f":"IF(ISERROR(VLOOKUP(C5,BDDG!$A$1:$G$39,7,FALSE)),\"\",VLOOKUP(C5,BDDG!$A$1:$G$39,7,FALSE))","v":2},{"$f":"IF(ISERROR(VLOOKUP(C5,BDDG!$A$1:$T$39,8,FALSE)),\"\",VLOOKUP(C5,BDDG!$A$1:$T$39,8,FALSE))","v":"Pamplemousse"},10,59.87,14.431267746784702,{"$f":"IF(ISERROR(VLOOKUP(C5,BDDG!$A$1:$T$39,11,FALSE)),\"\",VLOOKUP(C5,BDDG!$A$1:$T$39,11,FALSE))","v":"Kaki"},10,69.41,12.447774095951592,{"$f":"IF(ISERROR(VLOOKUP(C5,BDDG!$A$1:$T$39,14,FALSE)),\"\",VLOOKUP(C5,BDDG!$A$1:$T$39,14,FALSE))","v":"xxxxxxxxxxxxxxx"},"xxxx","xxxx","xxxxx",{"$f":"IF(ISERROR(VLOOKUP(C5,BDDG!$A$1:$T$39,17,FALSE)),\"\",VLOOKUP(C5,BDDG!$A$1:$T$39,17,FALSE))","v":"xxxxxxxxxxxxxxx"},"xxxx","xxxx","xxxxx",26.879041842736292,"Février",2018,{"$f":"IFERROR((INDEX($Z$2:Z13,MATCH(H5&MAX(IF($H$1:H4=H5,$A$1:A4)),$H$2:H13&$A$2:A13,0))-Z5)*-1,\"\")","v":""},{"$f":"IF(ISERROR(VLOOKUP(C5,BDDG!$A$1:$T$39,20,FALSE)),\"\",VLOOKUP(C5,BDDG!$A$1:$T$39,20,FALSE))","v":0}]
["2018-02-11","Soleil",120,{"$f":"IF(ISNA(VLOOKUP(C6,BDDG!$A$1:$F$39,2,FALSE)),\"\",VLOOKUP(C6,BDDG!$A$1:$F$39,2,FALSE))","v":0},{"$f":"IF(ISNA(VLOOKUP(C6,BDDG!$A$2:$N$39,3,FALSE)),\"\",VLOOKUP(C6,BDDG!$A$2:$N$39,3,FALSE))","v":"Litchi"},{"$f":"IF(ISNA(VLOOKUP(C6,BDDG!$A$2:$N$39,4,FALSE)),\"\",VLOOKUP(C6,BDDG!$A$2:$N$39,4,FALSE))","v":"Poire"},{"$f":"IF(ISNA(VLOOKUP(C6,BDDG!$A$1:$F$39,5,FALSE)),\"\",VLOOKUP(C6,BDDG!$A$1:$F$39,5,FALSE))","v":"Prune"},{"$f":"IF(ISNA(VLOOKUP(C6,BDDG!$A$1:$F$39,6,FALSE)),\"\",VLOOKUP(C6,BDDG!$A$1:$F$39,6,FALSE))","v":"Quetsche"},{"$f":"IF(ISERROR(VLOOKUP(C6,BDDG!$A$1:$G$39,7,FALSE)),\"\",VLOOKUP(C6,BDDG!$A$1:$G$39,7,FALSE))","v":1},{"$f":"IF(ISERROR(VLOOKUP(C6,BDDG!$A$1:$T$39,8,FALSE)),\"\",VLOOKUP(C6,BDDG!$A$1:$T$39,8,FALSE))","v":"Tomate charnue"},12,68,15.247058823529414,{"$f":"IF(ISERROR(VLOOKUP(C6,BDDG!$A$1:$T$39,11,FALSE)),\"\",VLOOKUP(C6,BDDG!$A$1:$T$39,11,FALSE))","v":"xxxxxxxxxxxxxxx"},"xxxx","xxxx","xxxxx",{"$f":"IF(ISERROR(VLOOKUP(C6,BDDG!$A$1:$T$39,14,FALSE)),\"\",VLOOKUP(C6,BDDG!$A$1:$T$39,14,FALSE))","v":"xxxxxxxxxxxxxxx"},"xxxx","xxxx","xxxxx",{"$f":"IF(ISERROR(VLOOKUP(C6,BDDG!$A$1:$T$39,17,FALSE)),\"\",VLOOKUP(C6,BDDG!$A$1:$T$39,17,FALSE))","v":"xxxxxxxxxxxxxxx"},"xxxx","xxxx","xxxxx",15.247058823529414,"Février",2018,{"$f":"IFERROR((INDEX($Z$2:Z13,MATCH(H6&MAX(IF($H$1:H5=H6,$A$1:A5)),$H$2:H13&$A$2:A13,0))-Z6)*-1,\"\")","v":-17.258584517328373},{"$f":"IF(ISERROR(VLOOKUP(C6,BDDG!$A$1:$T$39,20,FALSE)),\"\",VLOOKUP(C6,BDDG!$A$1:$T$39,20,FALSE))","v":0}]
["2018-01-22","Soleil",120,{"$f":"IF(ISNA(VLOOKUP(C7,BDDG!$A$1:$F$39,2,FALSE)),\"\",VLOOKUP(C7,BDDG!$A$1:$F$39,2,FALSE))","v":0},{"$f":"IF(ISNA(VLOOKUP(C7,BDDG!$A$2:$N$39,3,FALSE)),\"\",VLOOKUP(C7,BDDG!$A$2:$N$39,3,FALSE))","v":"Litchi"},{"$f":"IF(ISNA(VLOOKUP(C7,BDDG!$A$2:$N$39,4,FALSE)),\"\",VLOOKUP(C7,BDDG!$A$2:$N$39,4,FALSE))","v":"Poire"},{"$f":"IF(ISNA(VLOOKUP(C7,BDDG!$A$1:$F$39,5,FALSE)),\"\",VLOOKUP(C7,BDDG!$A$1:$F$39,5,FALSE))","v":"Prune"},{"$f":"IF(ISNA(VLOOKUP(C7,BDDG!$A$1:$F$39,6,FALSE)),\"\",VLOOKUP(C7,BDDG!$A$1:$F$39,6,FALSE))","v":"Quetsche"},{"$f":"IF(ISERROR(VLOOKUP(C7,BDDG!$A$1:$G$39,7,FALSE)),\"\",VLOOKUP(C7,BDDG!$A$1:$G$39,7,FALSE))","v":1},{"$f":"IF(ISERROR(VLOOKUP(C7,BDDG!$A$1:$T$39,8,FALSE)),\"\",VLOOKUP(C7,BDDG!$A$1:$T$39,8,FALSE))","v":"Tomate charnue"},5,23.12,18.685121107266436,{"$f":"IF(ISERROR(VLOOKUP(C7,BDDG!$A$1:$T$39,11,FALSE)),\"\",VLOOKUP(C7,BDDG!$A$1:$T$39,11,FALSE))","v":"xxxxxxxxxxxxxxx"},"xxxx","xxxx","xxxxx",{"$f":"IF(ISERROR(VLOOKUP(C7,BDDG!$A$1:$T$39,14,FALSE)),\"\",VLOOKUP(C7,BDDG!$A$1:$T$39,14,FALSE))","v":"xxxxxxxxxxxxxxx"},"xxxx","xxxx","xxxxx",{"$f":"IF(ISERROR(VLOOKUP(C7,BDDG!$A$1:$T$39,17,FALSE)),\"\",VLOOKUP(C7,BDDG!$A$1:$T$39,17,FALSE))","v":"xxxxxxxxxxxxxxx"},"xxxx","xxxx","xxxxx",18.685121107266436,"Janvier",2018,{"$f":"IFERROR((INDEX($Z$2:Z13,MATCH(H7&MAX(IF($H$1:H6=H7,$A$1:A6)),$H$2:H13&$A$2:A13,0))-Z7)*-1,\"\")","v":3.4380622837370218},{"$f":"IF(ISERROR(VLOOKUP(C7,BDDG!$A$1:$T$39,20,FALSE)),\"\",VLOOKUP(C7,BDDG!$A$1:$T$39,20,FALSE))","v":0}]
["2017-12-31","Pluie",130,{"$f":"IF(ISNA(VLOOKUP(C8,BDDG!$A$1:$F$39,2,FALSE)),\"\",VLOOKUP(C8,BDDG!$A$1:$F$39,2,FALSE))","v":0},{"$f":"IF(ISNA(VLOOKUP(C8,BDDG!$A$2:$N$39,3,FALSE)),\"\",VLOOKUP(C8,BDDG!$A$2:$N$39,3,FALSE))","v":"Mûre"},{"$f":"IF(ISNA(VLOOKUP(C8,BDDG!$A$2:$N$39,4,FALSE)),\"\",VLOOKUP(C8,BDDG!$A$2:$N$39,4,FALSE))","v":"Melon"},{"$f":"IF(ISNA(VLOOKUP(C8,BDDG!$A$1:$F$39,5,FALSE)),\"\",VLOOKUP(C8,BDDG!$A$1:$F$39,5,FALSE))","v":"Papaye"},{"$f":"IF(ISNA(VLOOKUP(C8,BDDG!$A$1:$F$39,6,FALSE)),\"\",VLOOKUP(C8,BDDG!$A$1:$F$39,6,FALSE))","v":"Pastéque"},{"$f":"IF(ISERROR(VLOOKUP(C8,BDDG!$A$1:$G$39,7,FALSE)),\"\",VLOOKUP(C8,BDDG!$A$1:$G$39,7,FALSE))","v":1},{"$f":"IF(ISERROR(VLOOKUP(C8,BDDG!$A$1:$T$39,8,FALSE)),\"\",VLOOKUP(C8,BDDG!$A$1:$T$39,8,FALSE))","v":"Orange sanguine"},11,47.85,19.862068965517242,{"$f":"IF(ISERROR(VLOOKUP(C8,BDDG!$A$1:$T$39,11,FALSE)),\"\",VLOOKUP(C8,BDDG!$A$1:$T$39,11,FALSE))","v":"xxxxxxxxxxxxxxx"},"xxxx","xxxx","xxxxx",{"$f":"IF(ISERROR(VLOOKUP(C8,BDDG!$A$1:$T$39,14,FALSE)),\"\",VLOOKUP(C8,BDDG!$A$1:$T$39,14,FALSE))","v":"xxxxxxxxxxxxxxx"},"xxxx","xxxx","xxxxx",{"$f":"IF(ISERROR(VLOOKUP(C8,BDDG!$A$1:$T$39,17,FALSE)),\"\",VLOOKUP(C8,BDDG!$A$1:$T$39,17,FALSE))","v":"xxxxxxxxxxxxxxx"},"xxxx","xxxx","xxxxx",19.862068965517242,"Décembre",2017,{"$f":"IFERROR((INDEX($Z$2:Z14,MATCH(H8&MAX(IF($H$1:H7=H8,$A$1:A7)),$H$2:H14&$A$2:A14,0))-Z8)*-1,\"\")","v":""},{"$f":"IF(ISERROR(VLOOKUP(C8,BDDG!$A$1:$T$39,20,FALSE)),\"\",VLOOKUP(C8,BDDG!$A$1:$T$39,20,FALSE))","v":0}]
["2016-06-24","Pluie",140,{"$f":"IF(ISNA(VLOOKUP(C9,BDDG!$A$1:$F$39,2,FALSE)),\"\",VLOOKUP(C9,BDDG!$A$1:$F$39,2,FALSE))","v":0},{"$f":"IF(ISNA(VLOOKUP(C9,BDDG!$A$2:$N$39,3,FALSE)),\"\",VLOOKUP(C9,BDDG!$A$2:$N$39,3,FALSE))","v":"Noix"},{"$f":"IF(ISNA(VLOOKUP(C9,BDDG!$A$2:$N$39,4,FALSE)),\"\",VLOOKUP(C9,BDDG!$A$2:$N$39,4,FALSE))","v":"Marron"},{"$f":"IF(ISNA(VLOOKUP(C9,BDDG!$A$1:$F$39,5,FALSE)),\"\",VLOOKUP(C9,BDDG!$A$1:$F$39,5,FALSE))","v":"Noisette"},{"$f":"IF(ISNA(VLOOKUP(C9,BDDG!$A$1:$F$39,6,FALSE)),\"\",VLOOKUP(C9,BDDG!$A$1:$F$39,6,FALSE))","v":"Figue"},{"$f":"IF(ISERROR(VLOOKUP(C9,BDDG!$A$1:$G$39,7,FALSE)),\"\",VLOOKUP(C9,BDDG!$A$1:$G$39,7,FALSE))","v":1},{"$f":"IF(ISERROR(VLOOKUP(C9,BDDG!$A$1:$T$39,8,FALSE)),\"\",VLOOKUP(C9,BDDG!$A$1:$T$39,8,FALSE))","v":"xxxxxxxxxxxxxxx"},"xxxx","xxxx","xxxxx",{"$f":"IF(ISERROR(VLOOKUP(C9,BDDG!$A$1:$T$39,11,FALSE)),\"\",VLOOKUP(C9,BDDG!$A$1:$T$39,11,FALSE))","v":"Kumquat"},12,59,17.572881355932207,{"$f":"IF(ISERROR(VLOOKUP(C9,BDDG!$A$1:$T$39,14,FALSE)),\"\",VLOOKUP(C9,BDDG!$A$1:$T$39,14,FALSE))","v":"xxxxxxxxxxxxxxx"},"xxxx","xxxx","xxxxx",{"$f":"IF(ISERROR(VLOOKUP(C9,BDDG!$A$1:$T$39,17,FALSE)),\"\",VLOOKUP(C9,BDDG!$A$1:$T$39,17,FALSE))","v":"xxxxxxxxxxxxxxx"},"xxxx","xxxx","xxxxx",17.572881355932207,"Juin",2016,{"$f":"IFERROR((INDEX($Z$2:Z16,MATCH(H9&MAX(IF($H$1:H8=H9,$A$1:A8)),$H$2:H16&$A$2:A16,0))-Z9)*-1,\"\")","v":""},{"$f":"IF(ISERROR(VLOOKUP(C9,BDDG!$A$1:$T$39,20,FALSE)),\"\",VLOOKUP(C9,BDDG!$A$1:$T$39,20,FALSE))","v":0}]
["2017-08-17","Vent chaud",150,{"$f":"IF(ISNA(VLOOKUP(C10,BDDG!$A$1:$F$39,2,FALSE)),\"\",VLOOKUP(C10,BDDG!$A$1:$F$39,2,FALSE))","v":0},{"$f":"IF(ISNA(VLOOKUP(C10,BDDG!$A$2:$N$39,3,FALSE)),\"\",VLOOKUP(C10,BDDG!$A$2:$N$39,3,FALSE))","v":"Pêche"},{"$f":"IF(ISNA(VLOOKUP(C10,BDDG!$A$2:$N$39,4,FALSE)),\"\",VLOOKUP(C10,BDDG!$A$2:$N$39,4,FALSE))","v":"orange"},{"$f":"IF(ISNA(VLOOKUP(C10,BDDG!$A$1:$F$39,5,FALSE)),\"\",VLOOKUP(C10,BDDG!$A$1:$F$39,5,FALSE))","v":"Groseille"},{"$f":"IF(ISNA(VLOOKUP(C10,BDDG!$A$1:$F$39,6,FALSE)),\"\",VLOOKUP(C10,BDDG!$A$1:$F$39,6,FALSE))","v":"Nectarine"},{"$f":"IF(ISERROR(VLOOKUP(C10,BDDG!$A$1:$G$39,7,FALSE)),\"\",VLOOKUP(C10,BDDG!$A$1:$G$39,7,FALSE))","v":1},{"$f":"IF(ISERROR(VLOOKUP(C10,BDDG!$A$1:$T$39,8,FALSE)),\"\",VLOOKUP(C10,BDDG!$A$1:$T$39,8,FALSE))","v":"Myrtille"},12,45.32,22.877316857899384,{"$f":"IF(ISERROR(VLOOKUP(C10,BDDG!$A$1:$T$39,11,FALSE)),\"\",VLOOKUP(C10,BDDG!$A$1:$T$39,11,FALSE))","v":"xxxxxxxxxxxxxxx"},"xxxx","xxxx","xxxxx",{"$f":"IF(ISERROR(VLOOKUP(C10,BDDG!$A$1:$T$39,14,FALSE)),\"\",VLOOKUP(C10,BDDG!$A$1:$T$39,14,FALSE))","v":"xxxxxxxxxxxxxxx"},"xxxx","xxxx","xxxxx",{"$f":"IF(ISERROR(VLOOKUP(C10,BDDG!$A$1:$T$39,17,FALSE)),\"\",VLOOKUP(C10,BDDG!$A$1:$T$39,17,FALSE))","v":"xxxxxxxxxxxxxxx"},"xxxx","xxxx","xxxxx",22.877316857899384,"Août",2017,{"$f":"IFERROR((INDEX($Z$2:Z18,MATCH(H10&MAX(IF($H$1:H9=H10,$A$1:A9)),$H$2:H18&$A$2:A18,0))-Z10)*-1,\"\")","v":-13.935635847682217},{"$f":"IF(ISERROR(VLOOKUP(C10,BDDG!$A$1:$T$39,20,FALSE)),\"\",VLOOKUP(C10,BDDG!$A$1:$T$39,20,FALSE))","v":0}]
["2016-06-06","Couvert",160,{"$f":"IF(ISNA(VLOOKUP(C11,BDDG!$A$1:$F$39,2,FALSE)),\"\",VLOOKUP(C11,BDDG!$A$1:$F$39,2,FALSE))","v":0},{"$f":"IF(ISNA(VLOOKUP(C11,BDDG!$A$2:$N$39,3,FALSE)),\"\",VLOOKUP(C11,BDDG!$A$2:$N$39,3,FALSE))","v":"Litchi"},{"$f":"IF(ISNA(VLOOKUP(C11,BDDG!$A$2:$N$39,4,FALSE)),\"\",VLOOKUP(C11,BDDG!$A$2:$N$39,4,FALSE))","v":"Poire"},{"$f":"IF(ISNA(VLOOKUP(C11,BDDG!$A$1:$F$39,5,FALSE)),\"\",VLOOKUP(C11,BDDG!$A$1:$F$39,5,FALSE))","v":"Abricotier"},{"$f":"IF(ISNA(VLOOKUP(C11,BDDG!$A$1:$F$39,6,FALSE)),\"\",VLOOKUP(C11,BDDG!$A$1:$F$39,6,FALSE))","v":"Acacia"},{"$f":"IF(ISERROR(VLOOKUP(C11,BDDG!$A$1:$G$39,7,FALSE)),\"\",VLOOKUP(C11,BDDG!$A$1:$G$39,7,FALSE))","v":2},{"$f":"IF(ISERROR(VLOOKUP(C11,BDDG!$A$1:$T$39,8,FALSE)),\"\",VLOOKUP(C11,BDDG!$A$1:$T$39,8,FALSE))","v":"Ademia"},5,32.15,13.437013996889581,{"$f":"IF(ISERROR(VLOOKUP(C11,BDDG!$A$1:$T$39,11,FALSE)),\"\",VLOOKUP(C11,BDDG!$A$1:$T$39,11,FALSE))","v":"Amandier"},5,69.47,6.2185115877357138,{"$f":"IF(ISERROR(VLOOKUP(C11,BDDG!$A$1:$T$39,14,FALSE)),\"\",VLOOKUP(C11,BDDG!$A$1:$T$39,14,FALSE))","v":"xxxxxxxxxxxxxxx"},"xxxx","xxxx","xxxxx",{"$f":"IF(ISERROR(VLOOKUP(C11,BDDG!$A$1:$T$39,17,FALSE)),\"\",VLOOKUP(C11,BDDG!$A$1:$T$39,17,FALSE))","v":"xxxxxxxxxxxxxxx"},"xxxx","xxxx","xxxxx",19.655525584625295,"Juin",2016,{"$f":"IFERROR((INDEX($Z$2:Z20,MATCH(H11&MAX(IF($H$1:H10=H11,$A$1:A10)),$H$2:H20&$A$2:A20,0))-Z11)*-1,\"\")","v":-4.6219714626944466},{"$f":"IF(ISERROR(VLOOKUP(C11,BDDG!$A$1:$T$39,20,FALSE)),\"\",VLOOKUP(C11,BDDG!$A$1:$T$39,20,FALSE))","v":0}]
["2018-03-01","Grêle",170,{"$f":"IF(ISNA(VLOOKUP(C12,BDDG!$A$1:$F$39,2,FALSE)),\"\",VLOOKUP(C12,BDDG!$A$1:$F$39,2,FALSE))","v":0},{"$f":"IF(ISNA(VLOOKUP(C12,BDDG!$A$2:$N$39,3,FALSE)),\"\",VLOOKUP(C12,BDDG!$A$2:$N$39,3,FALSE))","v":"Arbousier"},{"$f":"IF(ISNA(VLOOKUP(C12,BDDG!$A$2:$N$39,4,FALSE)),\"\",VLOOKUP(C12,BDDG!$A$2:$N$39,4,FALSE))","v":"Aulme"},{"$f":"IF(ISNA(VLOOKUP(C12,BDDG!$A$1:$F$39,5,FALSE)),\"\",VLOOKUP(C12,BDDG!$A$1:$F$39,5,FALSE))","v":"Cactus"},{"$f":"IF(ISNA(VLOOKUP(C12,BDDG!$A$1:$F$39,6,FALSE)),\"\",VLOOKUP(C12,BDDG!$A$1:$F$39,6,FALSE))","v":"Buis"},{"$f":"IF(ISERROR(VLOOKUP(C12,BDDG!$A$1:$G$39,7,FALSE)),\"\",VLOOKUP(C12,BDDG!$A$1:$G$39,7,FALSE))","v":1},{"$f":"IF(ISERROR(VLOOKUP(C12,BDDG!$A$1:$T$39,8,FALSE)),\"\",VLOOKUP(C12,BDDG!$A$1:$T$39,8,FALSE))","v":"xxxxxxxxxxxxxxx"},"xxxx","xxxx","xxxxx",{"$f":"IF(ISERROR(VLOOKUP(C12,BDDG!$A$1:$T$39,11,FALSE)),\"\",VLOOKUP(C12,BDDG!$A$1:$T$39,11,FALSE))","v":"Cafetier"},11,47,20.221276595744683,{"$f":"IF(ISERROR(VLOOKUP(C12,BDDG!$A$1:$T$39,14,FALSE)),\"\",VLOOKUP(C12,BDDG!$A$1:$T$39,14,FALSE))","v":"xxxxxxxxxxxxxxx"},"xxxx","xxxx","xxxxx",{"$f":"IF(ISERROR(VLOOKUP(C12,BDDG!$A$1:$T$39,17,FALSE)),\"\",VLOOKUP(C12,BDDG!$A$1:$T$39,17,FALSE))","v":"xxxxxxxxxxxxxxx"},"xxxx","xxxx","xxxxx",20.221276595744683,"Mars",2018,{"$f":"IFERROR((INDEX($Z$2:Z22,MATCH(H12&MAX(IF($H$1:H11=H12,$A$1:A11)),$H$2:H22&$A$2:A22,0))-Z12)*-1,\"\")","v":""},{"$f":"IF(ISERROR(VLOOKUP(C12,BDDG!$A$1:$T$39,20,FALSE)),\"\",VLOOKUP(C12,BDDG!$A$1:$T$39,20,FALSE))","v":0}]
["2018-04-03","Sécheresse",180,{"$f":"IF(ISNA(VLOOKUP(C13,BDDG!$A$1:$F$39,2,FALSE)),\"\",VLOOKUP(C13,BDDG!$A$1:$F$39,2,FALSE))","v":0},{"$f":"IF(ISNA(VLOOKUP(C13,BDDG!$A$2:$N$39,3,FALSE)),\"\",VLOOKUP(C13,BDDG!$A$2:$N$39,3,FALSE))","v":"Cerisier"},{"$f":"IF(ISNA(VLOOKUP(C13,BDDG!$A$2:$N$39,4,FALSE)),\"\",VLOOKUP(C13,BDDG!$A$2:$N$39,4,FALSE))","v":"Cèdre"},{"$f":"IF(ISNA(VLOOKUP(C13,BDDG!$A$1:$F$39,5,FALSE)),\"\",VLOOKUP(C13,BDDG!$A$1:$F$39,5,FALSE))","v":"Cocotier"},{"$f":"IF(ISNA(VLOOKUP(C13,BDDG!$A$1:$F$39,6,FALSE)),\"\",VLOOKUP(C13,BDDG!$A$1:$F$39,6,FALSE))","v":"Citronnier"},{"$f":"IF(ISERROR(VLOOKUP(C13,BDDG!$A$1:$G$39,7,FALSE)),\"\",VLOOKUP(C13,BDDG!$A$1:$G$39,7,FALSE))","v":1},{"$f":"IF(ISERROR(VLOOKUP(C13,BDDG!$A$1:$T$39,8,FALSE)),\"\",VLOOKUP(C13,BDDG!$A$1:$T$39,8,FALSE))","v":"Cyprés"},12,57.98,17.882028285615732,{"$f":"IF(ISERROR(VLOOKUP(C13,BDDG!$A$1:$T$39,11,FALSE)),\"\",VLOOKUP(C13,BDDG!$A$1:$T$39,11,FALSE))","v":"xxxxxxxxxxxxxxx"},"xxxx","xxxx","xxxxx",{"$f":"IF(ISERROR(VLOOKUP(C13,BDDG!$A$1:$T$39,14,FALSE)),\"\",VLOOKUP(C13,BDDG!$A$1:$T$39,14,FALSE))","v":"xxxxxxxxxxxxxxx"},"xxxx","xxxx","xxxxx",{"$f":"IF(ISERROR(VLOOKUP(C13,BDDG!$A$1:$T$39,17,FALSE)),\"\",VLOOKUP(C13,BDDG!$A$1:$T$39,17,FALSE))","v":"xxxxxxxxxxxxxxx"},"xxxx","xxxx","xxxxx",17.882028285615732,"Avril",2018,{"$f":"IFERROR((INDEX($Z$2:Z24,MATCH(H13&MAX(IF($H$1:H12=H13,$A$1:A12)),$H$2:H24&$A$2:A24,0))-Z13)*-1,\"\")","v":""},{"$f":"IF(ISERROR(VLOOKUP(C13,BDDG!$A$1:$T$39,20,FALSE)),\"\",VLOOKUP(C13,BDDG!$A$1:$T$39,20,FALSE))","v":0}]

{"sheet":"Fréquence des chene","index":1,"n_rows":1603,"n_cols":18,"rows_kept":1603,"cut":false,"hidden":false,"merged":[[1,17,2,17],[3,17,4,17],[5,17,6,17],[7,17,8,17]]}
["Ail","Asperge","Courge","Artichaut","Aubergine","Janvier","Février","Mars","Avril","Mai","Juin","Juillet","Août","Septembre","Octobre","Novembre","Décembre"]
[110,"Kiwi","Prune","Raisin","Tomate",null,1,null,null,null,null,null,null,null,null,null,null,"Egal à 0"]
[120,"Litchi","Poire","Prune","Quetsche",1,2]
[130,"Mûre","Melon","Papaye","Pastéque",1,null,null,null,null,null,null,null,null,null,null,null,"Entre 1 & 2"]
[140,"Noix","Marron","Noisette","Figue",null,null,null,null,null,null,null,null,null,null,null,1]
[150,"Pêche","orange","Groseille","Nectarine",1,null,null,null,null,1,null,null,null,null,null,null,"Entre 3 & 4"]
[160,"Litchi","Poire","Abricotier","Acacia",null,1,null,null,null,null,null,1]
[170,"Arbousier","Aulme","Cactus","Buis",null,null,null,null,null,1,null,null,null,null,null,null,"Supérieur à 4"]
[180,"Cerisier","Cèdre","Cocotier","Citronnier",null,null,null,1]
[]
[]
[]
[]
[]
[]
[]
[]
[]
[]
[]
[]
[]
[]
[]
[]
[]
[]
[]
[]
[]
[]
[]
[]
[]
[]
[]
[]
[]
[]
[]
[]
[]
[]
[]
[]
[]
[]
[]
[]
[]
[]
[]
[]
[]
[]
[]
[]
[]
[]
[]
[]
[]
[]
[]
[]
[]
[]
[]
[]
[]
[]
[]
[]
[]
[]
[]
[]
[]
[]
[]
[]
[]
[]
[]
[]
[]
[]
[]
[]
[]
[]
[]
[]
[]
[]
[]
[]
[]
[]
[]
[]
[]
[]
[]
[]
[]
[]
[]
[]
[]
[]
[]
[]
[]
[]
[]
[]
[]
[]
[]
[]
[]
[]
[]
[]
[]
[]
[]
[]
[]
[]
[]
[]
[]
[]
[]
[]
[]
[]
[]
[]
[]
[]
[]
[]
[]
[]
[]
[]
[]
[]
[]
[]
[]
[]
[]
[]
[]
[]
[]
[]
[]
[]
[]
[]
[]
[]
[]
[]
[]
[]
[]
[]
[]
[]
[]
[]
[]
[]
[]
[]
[]
[]
[]
[]
[]
[]
[]
[]
[]
[]
[]
[]
[]
[]
[]
[]
[]
[]
[]
[]
[]
[]
[]
[]
[]
[]
[]
[]
[]
[]
[]
[]
[]
[]
[]
[]
[]
[]
[]
[]
[]
[]
[]
[]
[]
[]
[]
[]
[]
[]
[]
[]
[]
[]
[]
[]
[]
[]
[]
[]
[]
[]
[]
[]
[]
[]
[]
[]
[]
[]
[]
[]
[]
[]
[]
[]
[]
[]
[]
[]
[]
[]
[]
[]
[]
[]
[]
[]
[]
[]
[]
[]
[]
[]
[]
[]
[]
[]
[]
[]
[]
[]
[]
[]
[]
[]
[]
[]
[]
[]
[]
[]
[]
[]
[]
[]
[]
[]
[]
[]
[]
[]
[]
[]
[]
[]
[]
[]
[]
[]
[]
[]
[]
[]
[]
[]
[]
[]
[]
[]
[]
[]
[]
[]
[]
[]
[]
[]
[]
[]
[]
[]
[]
[]
[]
[]
[]
[]
[]
[]
[]
[]
[]
[]
[]
[]
[]
[]
[]
[]
[]
[]
[]
[]
[]
[]
[]
[]
[]
[]
[]
[]
[]
[]
[]
[]
[]
[]
[]
[]
[]
[]
[]
[]
[]
[]
[]
[]
[]
[]
[]
[]
[]
[]
[]
[]
[]
[]
[]
[]
[]
[]
[]
[]
[]
[]
[]
[]
[]
{"$rows_left_out":1204}
{"sheet":"BDDG","index":2,"n_rows":1601,"n_cols":21,"rows_kept":1601,"cut":false,"hidden":false,"merged":[]}
["Ail","Chou","Asperge","Courge","Artichaut","Aubergine","Brocoli","Celeri","Truc1","Vitre1","Cresson","Truc2","Vitre2","Endive","Truc3","Vitre3","Fenouil","truc4","Vitre4","Observation(s) "]
[110,0,"Kiwi","Prune","Raisin","Tomate",2,"Pamplemousse",null,null,"Kaki",null,null,"xxxxxxxxxxxxxxx","xxxx","xxxx","xxxxxxxxxxxxxxx","xxxx","xxxx"]
[120,0,"Litchi","Poire","Prune","Quetsche",1,"Tomate charnue",null,null,"xxxxxxxxxxxxxxx","xxxx","xxxx","xxxxxxxxxxxxxxx","xxxx","xxxx","xxxxxxxxxxxxxxx","xxxx","xxxx"]
[130,0,"Mûre","Melon","Papaye","Pastéque",1,"Orange sanguine",null,null,"xxxxxxxxxxxxxxx","xxxx","xxxx","xxxxxxxxxxxxxxx","xxxx","xxxx","xxxxxxxxxxxxxxx","xxxx","xxxx"]
[140,0,"Noix","Marron","Noisette","Figue",1,"xxxxxxxxxxxxxxx","xxxx","xxxx","Kumquat",null,null,"xxxxxxxxxxxxxxx","xxxx","xxxx","xxxxxxxxxxxxxxx","xxxx","xxxx"]
[150,0,"Pêche","orange","Groseille","Nectarine",1,"Myrtille",null,null,"xxxxxxxxxxxxxxx","xxxx","xxxx","xxxxxxxxxxxxxxx","xxxx","xxxx","xxxxxxxxxxxxxxx","xxxx","xxxx"]
[160,0,"Litchi","Poire","Abricotier","Acacia",2,"Ademia",null,null,"Amandier",null,null,"xxxxxxxxxxxxxxx","xxxx","xxxx","xxxxxxxxxxxxxxx","xxxx","xxxx"]
[170,0,"Arbousier","Aulme","Cactus","Buis",1,"xxxxxxxxxxxxxxx","xxxx","xxxx","Cafetier",null,null,"xxxxxxxxxxxxxxx","xxxx","xxxx","xxxxxxxxxxxxxxx","xxxx","xxxx"]
[180,0,"Cerisier","Cèdre","Cocotier","Citronnier",1,"Cyprés",null,null,"xxxxxxxxxxxxxxx","xxxx","xxxx","xxxxxxxxxxxxxxx","xxxx","xxxx","xxxxxxxxxxxxxxx","xxxx","xxxx"]
[]
[]
[]
[]
[]
[]
[]
[]
[]
[]
[]
[]
[]
[]
[]
[]
[]
[]
[]
[]
[]
[]
[]
[]
[]
[]
[]
[]
[]
[]
[]
[]
[]
[]
[]
[]
[]
[]
[]
[]
[]
[]
[]
[]
[]
[]
[]
[]
[]
[]
[]
[]
[]
[]
[]
[]
[]
[]
[]
[]
[]
[]
[]
[]
[]
[]
[]
[]
[]
[]
[]
[]
[]
[]
[]
[]
[]
[]
[]
[]
[]
[]
[]
[]
[]
[]
[]
[]
[]
[]
[]
[]
[]
[]
[]
[]
[]
[]
[]
[]
[]
[]
[]
[]
[]
[]
[]
[]
[]
[]
[]
[]
[]
[]
[]
[]
[]
[]
[]
[]
[]
[]
[]
[]
[]
[]
[]
[]
[]
[]
[]
[]
[]
[]
[]
[]
[]
[]
[]
[]
[]
[]
[]
[]
[]
[]
[]
[]
[]
[]
[]
[]
[]
[]
[]
[]
[]
[]
[]
[]
[]
[]
[]
[]
[]
[]
[]
[]
[]
[]
[]
[]
[]
[]
[]
[]
[]
[]
[]
[]
[]
[]
[]
[]
[]
[]
[]
[]
[]
[]
[]
[]
[]
[]
[]
[]
[]
[]
[]
[]
[]
[]
[]
[]
[]
[]
[]
[]
[]
[]
[]
[]
[]
[]
[]
[]
[]
[]
[]
[]
[]
[]
[]
[]
[]
[]
[]
[]
[]
[]
[]
[]
[]
[]
[]
[]
[]
[]
[]
[]
[]
[]
[]
[]
[]
[]
[]
[]
[]
[]
[]
[]
[]
[]
[]
[]
[]
[]
[]
[]
[]
[]
[]
[]
[]
[]
[]
[]
[]
[]
[]
[]
[]
[]
[]
[]
[]
[]
[]
[]
[]
[]
[]
[]
[]
[]
[]
[]
[]
[]
[]
[]
[]
[]
[]
[]
[]
[]
[]
[]
[]
[]
[]
[]
[]
[]
[]
[]
[]
[]
[]
[]
[]
[]
[]
[]
[]
[]
[]
[]
[]
[]
[]
[]
[]
[]
[]
[]
[]
[]
[]
[]
[]
[]
[]
[]
[]
[]
[]
[]
[]
[]
[]
[]
[]
[]
[]
[]
[]
[]
[]
[]
[]
[]
[]
[]
[]
[]
[]
[]
[]
[]
[]
[]
[]
[]
[]
[]
[]
[]
[]
[]
[]
[]
[]
[]
[]
[]
[]
[]
[]
[]
[]
[]
[]
[]
[]
[]
[]
[]
[]
{"$rows_left_out":1202}
{"sheet":"Listesdéroulante","index":3,"n_rows":9,"n_cols":3,"rows_kept":9,"cut":false,"hidden":true,"merged":[]}
["Météo",null,"Secteurs"]
["Couvert",null,411]
["Froid",null,412]
["Grêle",null,421]
["Neige"]
["Pluie"]
["Sécheresse"]
["Soleil"]
["Vent chaud"]