{"text_format":"1","workbook":"xlsx","n_sheets":4,"sheets":["D_JOUR","TABLES","Mode d'emploi","Modifications"],"not_rendered":{"charts":0,"images":1,"macros":1,"external_links":0,"defined_names":8,"comments":0,"pivot_tables":0},"unopened":[],"bounds":{"document_bytes":16777216,"sheet_cells":100000,"rows_first":2000,"rows_last":500,"rows_between":2000,"halvings":0,"cell_chars":16384,"cell_head_chars":4096},"cells_cut":0,"cells_raw":0,"read":"whole","date_system":"1900"}

{"sheet":"D_JOUR","index":0,"n_rows":121,"n_cols":53,"rows_kept":121,"cut":false,"hidden":false,"merged":[[0,0,3,1],[4,2,4,3],[4,4,4,5],[4,1,5,1],[0,43,1,44],[2,43,3,44],[4,0,5,0],[0,2,2,42],[3,2,3,6]]}
[null,null,"DONNEES ",null,null,null,null,null,null,null,null,null,null,null,null,null,null,null,null,null,null,null,null,null,null,null,null,null,null,null,null,null,null,null,null,null,null,null,null,null,null,null,null,{"$f":"PROPER(TEXT(AR3,\"jjjj\"))","v":"Dimanche"}]
[]
[null,null,null,null,null,null,null,null,null,null,null,null,null,null,null,null,null,null,null,null,null,null,null,null,null,null,null,null,null,null,null,null,null,null,null,null,null,null,null,null,null,null,null,"2018-04-01"]
[null,null,null,null,null,null,null,{"$f":"SUM(H7:H121)","v":0},{"$f":"SUM(I7:I121)","v":2},0,0,0,2,0,0,0,2,0,0,0,2,0,0,0,0,null,null,null,null,null,0,0,0,0,0,0,0,0,0,0,0,0]
["N","NOM DE L'EMPLOYÉ","HEURE A.M.",null,"HEURE P.M.",null,"H","000","001","003","500","011","304","051","055","052","153","066","101","100","106","211","201","251","201",null,null,null,null,null,"251","300","301","301","313","503","505","507","508","013","510","655","T.V.H","CHANTIERS","N°","DATE"]
[null,null,"DE","À","DE","À","PR.",null,null,null,null,null,null,"DR",null,"PL","CO",null,null,null,null,"CO","DR","CO","CO",null,null,null,null,null,"DR",null,"DR","CO","MU",null,null,null,null,null,null,null,{"$f":"SUM(AQ7:AQ121)","v":8},null,null,"CLOTURE"]
[1,"MARTIN DESGAGNÉ",7,12,12.5,15.5,{"$f":"IF(B7=\"\",\"\",D7-C7+F7-E7)","v":8},null,2,null,null,null,2,null,null,null,2,null,null,null,2,null,null,null,null,null,null,null,null,null,null,null,null,null,null,null,null,null,null,null,null,null,{"$f":"SUM(H7:AP7)","v":8},null,{"$f":"IFERROR(INDEX(TABLES!$I$2:$J$50,MATCH($AR7,TABLES!$I$2:$I$50,0),2),\"\")","v":""},{"$f":"IFERROR(INDEX(TABLES!$I$2:$K$50,MATCH($AR7,TABLES!$I$2:$I$50,0),3),\"\")","v":""}]
[2,null,7,12,12.5,15.5,"",null,null,null,null,null,null,null,null,null,null,null,null,null,null,null,null,null,null,null,null,null,null,null,null,null,null,null,null,null,null,null,null,null,null,null,{"$f":"SUM(H8:AP8)","v":0},null,{"$f":"IFERROR(INDEX(TABLES!$I$2:$J$50,MATCH(AR8,TABLES!$I$2:$I$50,0),2),\"\")","v":""},{"$f":"IFERROR(INDEX(TABLES!$I$2:$K$50,MATCH($AR8,TABLES!$I$2:$I$50,0),3),\"\")","v":""}]
[3,null,7,12,12.5,15.5,"",null,null,null,null,null,null,null,null,null,null,null,null,null,null,null,null,null,null,null,null,null,null,null,null,null,null,null,null,null,null,null,null,null,null,null,0,null,{"$f":"IFERROR(INDEX(TABLES!$I$2:$J$50,MATCH(AR9,TABLES!$I$2:$I$50,0),2),\"\")","v":""},{"$f":"IFERROR(INDEX(TABLES!$I$2:$K$50,MATCH($AR9,TABLES!$I$2:$I$50,0),3),\"\")","v":""}]
[4,null,7,12,12.5,15.5,"",null,null,null,null,null,null,null,null,null,null,null,null,null,null,null,null,null,null,null,null,null,null,null,null,null,null,null,null,null,null,null,null,null,null,null,0,null,{"$f":"IFERROR(INDEX(TABLES!$I$2:$J$50,MATCH(AR10,TABLES!$I$2:$I$50,0),2),\"\")","v":""},{"$f":"IFERROR(INDEX(TABLES!$I$2:$K$50,MATCH($AR10,TABLES!$I$2:$I$50,0),3),\"\")","v":""}]
[5,null,7,12,12.5,15.5,"",null,null,null,null,null,null,null,null,null,null,null,null,null,null,null,null,null,null,null,null,null,null,null,null,null,null,null,null,null,null,null,null,null,null,null,0,null,{"$f":"IFERROR(INDEX(TABLES!$I$2:$J$50,MATCH(AR11,TABLES!$I$2:$I$50,0),2),\"\")","v":""},{"$f":"IFERROR(INDEX(TABLES!$I$2:$K$50,MATCH($AR11,TABLES!$I$2:$I$50,0),3),\"\")","v":""}," "]
[6,null,7,12,12.5,15.5,"",null,null,null,null,null,null,null,null,null,null,null,null,null,null,null,null,null,null,null,null,null,null,null,null,null,null,null,null,null,null,null,null,null,null,null,0,null,{"$f":"IFERROR(INDEX(TABLES!$I$2:$J$50,MATCH(AR12,TABLES!$I$2:$I$50,0),2),\"\")","v":""},{"$f":"IFERROR(INDEX(TABLES!$I$2:$K$50,MATCH($AR12,TABLES!$I$2:$I$50,0),3),\"\")","v":""},null,null,null," "]
[7,null,7,12,12.5,15.5,"",null,null,null,null,null,null,null,null,null,null,null,null,null,null,null,null,null,null,null,null,null,null,null,null,null,null,null,null,null,null,null,null,null,null,null,0,null,{"$f":"IFERROR(INDEX(TABLES!$I$2:$J$50,MATCH(AR13,TABLES!$I$2:$I$50,0),2),\"\")","v":""},{"$f":"IFERROR(INDEX(TABLES!$I$2:$K$50,MATCH($AR13,TABLES!$I$2:$I$50,0),3),\"\")","v":""},null,null,null,null," "]
[8,null,7,12,12.5,15.5,"",null,null,null,null,null,null,null,null,null,null,null,null,null,null,null,null,null,null,null,null,null,null,null,null,null,null,null,null,null,null,null,null,null,null,null,0,null,{"$f":"IFERROR(INDEX(TABLES!$I$2:$J$50,MATCH(AR14,TABLES!$I$2:$I$50,0),2),\"\")","v":""},{"$f":"IFERROR(INDEX(TABLES!$I$2:$K$50,MATCH($AR14,TABLES!$I$2:$I$50,0),3),\"\")","v":""}]
[9,null,7,12,12.5,15.5,"",null,null,null,null,null,null,null,null,null,null,null,null,null,null,null,null,null,null,null,null,null,null,null,null,null,null,null,null,null,null,null,null,null,null,null,0,null,{"$f":"IFERROR(INDEX(TABLES!$I$2:$J$50,MATCH(AR15,TABLES!$I$2:$I$50,0),2),\"\")","v":""},{"$f":"IFERROR(INDEX(TABLES!$I$2:$K$50,MATCH($AR15,TABLES!$I$2:$I$50,0),3),\"\")","v":""}]
{"$rows_left_out":107}
{"sheet":"TABLES","index":1,"n_rows":121,"n_cols":15,"rows_kept":121,"cut":false,"hidden":false,"merged":[]}
["CODES","TACHES",null,null,"TYPES","TYPES D'INTERVENTION","EMPLOYÉS","SOUS TRAITANTS","CHANTIERS","N°","DATE CLOTURE"]
[null,null,null,null,null,null,null,null," "]
["000","Organisation De Chantier",null,null,"AP","Appareil D'Appui","CHRISTIAN CADRIN","Acier E.B.","2175 CHAPDELEINE  (18-5542)","18-5542","2018-12-31"]
["001","Mobilisation/Démobilisation",null,null,"BAL","Base De Lampadaire","DANIEL ASSELIN","Acier Écan","435 CSF  (18-5546)","18-5546","2018-06-30"]
["002","Mur De Protection",null,null,"BPO","Bout De Poutre","DANIEL D'AMOURS","Armatech","846 CSF  (18-5552)","18-5552","2018-05-31"]
["003","Protection Générale",null,null,"CA","Canniveau","DANIEL GAUDREAULT","Art-Dem","ADM  (18-ADM)","18-ADM","2018-12-31"]
["004","Échafaudage",null,null,"CE","Céramique","DOMINIC FRANCIS","Béton Provinciale","BONENFANT  (16-5248)","16-5248","2018-06-30"]
["005","Étaiement",null,null,"CH","Chape","ÉRIC PICARD","Blastrac Pierre-Luc Veilleux","CASERNES  (18-5554)","18-5554","2019-06-30"]
["006","Accès Et Entretien",null,null,"CO","Colonnes","GUILLAUME BLOUIN","Cimota","CENTRE DES CONGRES  (16-5406)","16-5406","2018-01-15"]
["007","Protection Temporaire",null,null,"CR","Chasses-Roues","GUY RACINE","Construction Carrier","CHU  (17-5506)","17-5506","2018-01-30"]
["008","Chute À Déchets",null,null,"CU","Culée","GUY SAMSON","Diamantex","D'YOUVILLE  (18-5556)","18-5566","2018-06-30"]
["009","Encapsulation",null,null,"DA","Dalle","HUGHES TURCOTTE","Excavations AGCC","ÉDIFICE H  (18-5551)","18-5551","2018-04-30"]
["010","Protection Pour Chauffage",null,null,"DD","Dessus Dalle","IAN CORRIVEAU","Excavations Desgagné","FORESTERIE  (18-5560)","18-5560","2018-12-31"]
["011","Main D'œuvre",null,null,"DIA","Diaphragme","JACQUES DURET","Gicleurs Québécois","GARNISON ST-JEAN  (16-5185)","16-5185","2018-06-30"]
["012","Formation",null,null,"DR","Drain","JASON BROOKS","Imperméabilisation Eric Lessard","HOPITAL LAVAL  (16-5307)","16-5307","2018-06-30"]
{"$rows_left_out":107}
{"sheet":"Mode d'emploi","index":2,"n_rows":12,"n_cols":2,"rows_kept":12,"cut":false,"hidden":true,"merged":[]}
["Mode d'emploi"]
[0,"Objectif de l'application :\n- Permettre la saisie journalière des heures prestées par personne/chantier/code/sous code.\n- Permettre le stockage de ces informations journalières dans une base de données afin de pouvoir en retirer diverses statistiques.\n- Permettre la saisie de la date de clôture des chantiers\n- Permettre la gestion des fichiers et la suppression des lignes concernant les chantiers terminés"]
[null,"Philosophie de l'application :\nLe projet est composé de 2 classeurs Excel.\nLe premier classeur est nommé \"DONNEES JOUR\".  Il est un outil d'encodage  journalier des heures prestées sur divers chantiers ainsi que leur ventilation par code de tâches et sous tâches (onglet D_JOUR).  \nPour soutenir l'encodage, diverses informations sont stockées dans des tables et permettent leur introduction dans le tableau d'encodage via des listes déroulantes (onglet TABLES). \nLe deuxième classeur nommé \"SUIVI CHANTIERS aaaa\" va recueillir dans un onglet (DONNEES)  toutes les données journalières et leur ventilation.\nSur base de ces données, différents onglets contiendront des Tableaux croisés dynamiques permettant toutes les analyses statistiques nécessaires"]
[null,"De préférence, le gestionnaire aura à installer ces 2 classeurs dans un répertoire isolé car l'application va générer au fur et à mesure des encodages et des MAJ des fichiers de sauvegarde (un par jour).  Le programme détectera automatiquement l'endoit où sont installés les classeurs.\nIl serait prudent de créer un sous répertoire \"Back up\" contenant ces deux classeurs vierges afin de pouvoir les récupérer si incidents grâves. \nLes noms de ces 2 fichiers seront  \"DONNEES JOUR_source.xlsm\" et \"SUIVI CHANTIERS aaaa\".  Ces fichiers ne doivent jamais être utilisés avec ces noms : ils doivent être installés dans le répertoire de travail en adaptant  leur nom à savoir enlever _source dans l'un et mettre l'année à la place de aaaa dans l'autre.\nAdapter la cellule A1 avec le nom de l'entreprise (ou autre chose...)\nL'onglet Modifications contient quelques réflexions supplémentaires et questions.  Après réflexion il pourra être supprimé"]
["1\n1.1","Gestion du classeur \"DONNEES_JOUR\"\nOnglet \"TABLES\"\nCet onglet doit être impérativement mis à jour avant de commencer un nouvel encodage journalier.  En effet, il faut que le tableau d'encodage puisse disposer des informations nécessaires dans ses différentes listes déroulantes.\nEn plus des informations de base, la table des chantiers contient également l'information qui détermine la date de clôture d'un chantier.  Cette date peut être soit annulée soit modifiée en fonction des évènements.  Elle permet d'effectuer des sélections lors des diverses statistiques et, surtout, de permettre ultérieurement (une fois par an par exemple) d'éliminer les informations concernant les chantiers terminés (VBA encore à réaliser).  \nLa date de clôture doit IMPERATIVEMENT être encodée dans ce classeur (ET PAS DANS LE CLASSEUR SUIVI CHANTIERSaaaa où le VBA va la transmettre dans l'onglet TABLE)\n  \nColonnes A et B contiennent les codes tâches et leurs descriptions. Un potentiel de 115 codes est prévu dont une ligne blanche en début pour gestion de la liste déroulante.\n\nColonnes C et D contiennent des titres de rubriques de tâches (inutilisée pour l'instant)\n\nColonnes E et F contiennent les types d'interventions et leurs descriptions.  Un potentiel de 52 Types est prévu dont une ligne blanche en début pour gestion de la liste déroulante.\n\n"]
[null,"Colonne G contient les noms du personnel.  Un potentiel de 100 noms est prévu dont une ligne blanche en début pour gestion de la liste déroulante.\n\nColonne H contient la liste des sous traitants (inutilisée pour l'instant)\n\nColonnes I  J et K  contiennent les informations des chantiers. (Noms, Numéros et Dates de clôture). \n\n"]
[1.2,"Onglet D_JOUR\nCet onglet est l'outil d'encodage des données journalières. Comme les informations de codes et sous codes sont nombreuses et variables, il a été décidé que les combinaisons de codes/sous codes informations de ventilation ne pouvaient pas dépasser 30 possiblités par jour.  Il appartient donc à l'encodeur de compléter les titres des colonnes H à AK.  Pour ce faire, il dispose des listes déroulantes lui permettant de choisir les combinaisons utilisées lors de la journée de travail à encoder. \nL'encodeur aura ensuite à vérifier la date du jour des prestations.  Le programme de transfert présentera chaque jour, après la mise à jour, un tableau vierge dont la date aura été adaptée en ajoutant 1 ou 2 ou 3 (en fonction du jour de la semaine) pour être prêt à l'encodage du jour travaillé suivant. Toutefois, des circonstances particulières pourraient présenter une situation différente de la routine habituelle (congés, grèves, rattrapages d'encodage, travail du WE...).  Il faudra alors adapter la date manuellement.  Le bouton donnant la date du jour a été maintenu malgré son peu d'utilité.\nIl aura ensuite, ligne à ligne à :\n- adapter l'horaire en fonction de la réalité (l'application lui présentant l'horaire normale - colonnes C à F). En fonction de l'horaire, un nombre d'heures total travaillées sera calculé en colonne G.\n- encoder la ventilation des heures prestées par Codes/Sous Codes dans les colonnes H à AK.  Un total des heures ventilées sera calculé en colonne AL.  Cette colonne se mettra en surbrillance rouge si ce total ne correspond pas au total des heures travaillées (colonne G).  Il appartiendra à l'encodeur de corriger l'erreur."]
[2,"Lancement du programme VBA.\nEn cliquant sur le bouon MAJ, l'opérateur lancera le programme de MAJ càd :\n- contrôle de l'égalité entre le total des heures travailées et total des heures ventilées. Si discordance, il y aura un message d'erreur et le progamme s'arrêtera SANS AVOIR FAIT LA MAJ. L'opérateur aura alors à corriger la discordance et relancer la MAJ.\n- le transfert ligne à ligne des informations contenues dans l'onglet D_JOUR vers le classeur SUIVI CHANTIER aaaa.XLSM.\n- Transfert des informations de la table des chantiers afin de connaître les chantiers terminés dans le classeur  \"SUIVI CHANTIERS aaaa\" (onglet \"TABLE\")\n- enregistrement et fermeture du classeur \"SUIVI CHANTIERS aaaa\"\n- le sauvetage du classeur 'DONNEES JOUR\" sous le nom : \n'DONNEES JOUR aaammjj\"\n- remise à \"blanc\" de l'onglet \"D_JOUR\" et mise à jour de la date qui augmentera de 1 ou de 2 ou de 3 en fonction du jour de la semaine de façon à présenter un tableau vierge prêt à encoder la journée suivante de travail.\n"]
[3,"L'analyse des statistiques désirées n'étant pas encore effectuée, quelques tableaux croisés dynamiques ont été développés à titre  d'exemples.  \nAprès analyse, il conviendra soit de les adapter en fonction des besoins soit de développer des tableaux statistiques \"sur mesure\"\nA noter que tous les tableaux sont dotés de filtres afin de présenter les statistiques désirées (en individualisant un chantier par exemple ou une plage de date)\nAttention : les tableaux croisés dynamiques doivent impérativement être \"Actualiser\" à chaque mise à jour pour qu'ils puissent prendre connaissance des nouvelles informations.  Pour faire cela, placer le curseur dans n'importe quelle cellule du tableau, ensuite cliquer droit et choisir \"Actualiser\" dans le menu."]
[4,"Il faudra encore développer un VBA permettant d'expurger les chantiers terminés et de repartir avec un classeur différents pour l'année suivante.  C'est pourquoi le classeur  \"SUIVI CHANTIERS aaaa\" a été créé avec l'extension \".XLSM\" alors que, pour l'instant, il ne contient pas encore de VBA."]
[]
[null," "]

{"sheet":"Modifications","index":3,"n_rows":35,"n_cols":6,"rows_kept":35,"cut":false,"hidden":true,"merged":[[0,0,0,1],[25,2,28,2]]}
["MODIFICATIONS"]
[1,"changer onglet DATA en TABLES (les datas sont les données)"]
[2,"Onglet Tables : transformé colonne A en colonne texte pour pouvoir mettre la codification  avec 0 devant","ok"]
[3,"Onglet Tables :manque le code 318 --> normal ??","Oui c'est normal. Ce code a déjà existé et il a été abandonné"]
[4,"Onglet Tables :que veux dire le code 6-- ?  Comment cela fonctionne t il ??","J'ai arrangé les codes avec un 6___,  je viens de les ciblés en VERT,   ils sont tres peu souvent utilisés, mais sont nécessaires   C'EST CODES peuvent avoir aussi des sous codes","Bon dieu pourquoi faut il utiliser 4 caractères cette fois ???  Restons à 3 STP. Sinon je vais en mettre 4 pour tous les autres !!!","J'ai modifié les codes pour qu'ils aient 3 chiffres"]
[5,"les heures sont en centièmes d'heures je suppose ??","Les heures sont comme  par tranches de 15 minutes donc   ,0   ,25    ,5    ,75","Donc il faut 2 décimales à la place de 1 --> je change","ok"]
[6,"Onglet d'encodage journalier : insertion d'une colonne H pour calcul des heures prestées suivant les heures déclarées.","ok   mais est-ce la meme fonction que la colonne AB","Bien évidemment que non : regarde dans les cellules STP ! La colonne H fait le calcul des heures prestées sur base de l'horaire et la colonne AB fait la somme des heures ventilées.  Exactement ce que tu demandais dans ton autre poste.","Ok  alors on garde la colonne H"]
[7,"Onglet d'encodage journalier : MEFC pour la colonne Z si discordance avec colonne H (rouge)","parfait"]
[8,"Onglet d'encodage journalier : Il y a 17 codes possibles sur une feuille d'encodage journalier : c'est le maximum par jour ?? Par sécurité, j'en ai ajouté 3 pour faire un total de 20","ca peut arriver qu'on depasse 20 codes par jour , pourrait tu aller jusqu’à 30 sinon 25    merci","Je peux aller jusqu'à la capacité d'Excel mais ce n'est pas confortable de dépasser la largeur de l'écran.  Je porte à 30","ok a 30 c'est parfait"]
[9,"Onglet d'encodage journalier : Quand il y a un sous code : c'est toujours valable pour toute la colonne ??  Il n'arrive pas que deux personnes travaillent pour le même code mais pour des sous codes différents (ou pas de sous code) ??","quand il y a un sous codes, c'est toujours valable pour toute la colonne et oui , il peut arriver que plusieurs personnes travaillent pour le meme code mais des SC différents    LES CODES pouvant avoir des sous codes sont  jaunes sur la feuille TABLE donc il y en a beaucoup"]
[10,"Onglet Tables :La table des noms a été transformée en \"TABLEAU EXCEL\" et ce tableau s'appelle EMPLOYES.  Les cellules contenant les noms ont été nommées EMPLOYE (sert dans la liste déroulante)","ok","Comprends tu ce que veux dire mettre sous la forme d'un \"TABLEAU EXCEL\" ? Cela offre une toute autre manière de travailler avec Excel","Oui je comprends, On peut voir tout ca dans le gestionnaire de noms"]
[11,"Onglet Tables : La table des chantiers a été transformée en \"TABLEAU EXCEL\" et ce tableau s'appelle CHANTIERS (contient 2 colonnes).  Les cellules contenant les noms de chantiers ont été nommées CHANTIER (sert dans la liste déroulante)","ok    Il sera important de toujours voir le numéro de chantier attaché a chaque chantier car souvent un nom de chantier peut se repeté, mais avec un autre numéro","Ceci implique que :\n- dans le tableau d'encodage journalier il faut inverser la donne à savoir faire le choix du numéro de chantier et rechercher le nom dans la table et pas comme maintenant où tu encodais le nom et tu recherchais le numéro !!!!  Très important es tu certain de vouloir travailler ainsi ??  Pour moi, c'est en effet plus logique mais c'est plus inconfortable pour l'encodeur (toi) qui devra choisir un numéro à la palce de choisir un nom.  Ne vaudrait il pas mieux différencier légèrement les noms identiques (HOTEL CLASSIQUE 01 - HOTEL CLASSIQUE 02...- \n- dans les choix pour les tableaux ultérieurs, il faut impérativement se baser sur les numéros et non sur les noms.","C'est difficile de retenir tout les numéros attchachés pour chaque chantier   C'est la raison pour laquelle qu'il est facile que le numéro aparaisse. Si c'est possible je préfere laisser comme suit ** Nom du chantier et Numéro de Job** HOTEL CLASSIQUE  17-5501. Pour différer les noms identiques, les renommer ___2  et ___3  etc c'est essentiel."]
[12,"Onglet Tables : La table des codes tâches a été transformée en \"TABLEAU EXCEL\" et ce tableau s'appelle TACHES (contient 2 colonnes).  Les cellules contenant les codes ont été nommées CODE (sert dans la liste déroulante)"]
[13,"Onglet Tables : La table des codes interventions a été transformée en \"TABLEAU EXCEL\" et ce tableau s'appelle INTERVENTIONS (contient 2 colonnes).  Les cellules contenant les types ont été nommées TYPE (sert dans la liste déroulante)","la colonne D   (type D'intervention) est seulement a titre d'informations pour les sous codes en C, ils ne doivent pas apparaitre ailleurs"]
[14,"Le tableau d'encodage journalier a été doté des différentes listes déroulantes","ok"]
{"$rows_left_out":20}