{"text_format":"1","workbook":"xlsx","n_sheets":2,"sheets":["recherchev","Feuil1"],"not_rendered":{"charts":0,"images":0,"macros":1,"external_links":1,"defined_names":0,"comments":0,"pivot_tables":0},"unopened":[],"bounds":{"document_bytes":16777216,"sheet_cells":100000,"rows_first":2000,"rows_last":500,"rows_between":2000,"halvings":0,"cell_chars":16384,"cell_head_chars":4096},"cells_cut":0,"cells_raw":0,"read":"whole","date_system":"1900"}

{"sheet":"recherchev","index":0,"n_rows":6,"n_cols":3,"rows_kept":6,"cut":false,"hidden":false,"merged":[]}
["ref","CODEINTE","EXERSINI"]
["01902-406-19",{"$f":"IFERROR(IF((VLOOKUP($A2,'[1]Base 2'!$A$2:$AQ$18021,COLUMN(),0))=0,\"\",(VLOOKUP($A2,'[1]Base 2'!$A$2:$AQ$18021,COLUMN(),0))),\"\")","v":51214},{"$f":"IFERROR(IF((VLOOKUP($A2,'[1]Base 2'!$A$2:$AQ$18021,COLUMN(),0))=0,\"\",(VLOOKUP($A2,'[1]Base 2'!$A$2:$AQ$18021,COLUMN(),0))),\"\")","v":2014}]
["368-112-41",{"$f":"IFERROR(IF((VLOOKUP($A3,'[1]Base 2'!$A$2:$AQ$18021,COLUMN(),0))=0,\"\",(VLOOKUP($A3,'[1]Base 2'!$A$2:$AQ$18021,COLUMN(),0))),\"\")","v":176},{"$f":"IFERROR(IF((VLOOKUP($A3,'[1]Base 2'!$A$2:$AQ$18021,COLUMN(),0))=0,\"\",(VLOOKUP($A3,'[1]Base 2'!$A$2:$AQ$18021,COLUMN(),0))),\"\")","v":2014}]
["06116310-16",{"$f":"IFERROR(IF((VLOOKUP($A4,'[1]Base 2'!$A$2:$AQ$18021,COLUMN(),0))=0,\"\",(VLOOKUP($A4,'[1]Base 2'!$A$2:$AQ$18021,COLUMN(),0))),\"\")","v":""},{"$f":"IFERROR(IF((VLOOKUP($A4,'[1]Base 2'!$A$2:$AQ$18021,COLUMN(),0))=0,\"\",(VLOOKUP($A4,'[1]Base 2'!$A$2:$AQ$18021,COLUMN(),0))),\"\")","v":""}]
["00110208-22",{"$f":"IFERROR(IF((VLOOKUP($A5,'[1]Base 2'!$A$2:$AQ$18021,COLUMN(),0))=0,\"\",(VLOOKUP($A5,'[1]Base 2'!$A$2:$AQ$18021,COLUMN(),0))),\"\")","v":""},{"$f":"IFERROR(IF((VLOOKUP($A5,'[1]Base 2'!$A$2:$AQ$18021,COLUMN(),0))=0,\"\",(VLOOKUP($A5,'[1]Base 2'!$A$2:$AQ$18021,COLUMN(),0))),\"\")","v":""}]
["01387-197-07",{"$f":"IFERROR(IF((VLOOKUP($A6,'[1]Base 2'!$A$2:$AQ$18021,COLUMN(),0))=0,\"\",(VLOOKUP($A6,'[1]Base 2'!$A$2:$AQ$18021,COLUMN(),0))),\"\")","v":6290},{"$f":"IFERROR(IF((VLOOKUP($A6,'[1]Base 2'!$A$2:$AQ$18021,COLUMN(),0))=0,\"\",(VLOOKUP($A6,'[1]Base 2'!$A$2:$AQ$18021,COLUMN(),0))),\"\")","v":2014}]

{"sheet":"Feuil1","index":1,"n_rows":6,"n_cols":3,"rows_kept":6,"cut":false,"hidden":false,"merged":[]}
["ref","CODEINTE","EXERSINI"]
["01902-406-19",{"$f":"IFERROR(IF((VLOOKUP($A2,'[1]Base 2'!$A$2:$AQ$18021,COLUMN(),0))=0,\"\",(VLOOKUP($A2,'[1]Base 2'!$A$2:$AQ$18021,COLUMN(),0))),\"\")","v":51214},{"$f":"IFERROR(IF((VLOOKUP($A2,'[1]Base 2'!$A$2:$AQ$18021,COLUMN(),0))=0,\"\",(VLOOKUP($A2,'[1]Base 2'!$A$2:$AQ$18021,COLUMN(),0))),\"\")","v":2014}]
["368-112-41",{"$f":"IFERROR(IF((VLOOKUP($A3,'[1]Base 2'!$A$2:$AQ$18021,COLUMN(),0))=0,\"\",(VLOOKUP($A3,'[1]Base 2'!$A$2:$AQ$18021,COLUMN(),0))),\"\")","v":176},{"$f":"IFERROR(IF((VLOOKUP($A3,'[1]Base 2'!$A$2:$AQ$18021,COLUMN(),0))=0,\"\",(VLOOKUP($A3,'[1]Base 2'!$A$2:$AQ$18021,COLUMN(),0))),\"\")","v":2014}]
["06116310-16",{"$f":"IFERROR(IF((VLOOKUP($A4,'[1]Base 2'!$A$2:$AQ$18021,COLUMN(),0))=0,\"\",(VLOOKUP($A4,'[1]Base 2'!$A$2:$AQ$18021,COLUMN(),0))),\"\")","v":""},{"$f":"IFERROR(IF((VLOOKUP($A4,'[1]Base 2'!$A$2:$AQ$18021,COLUMN(),0))=0,\"\",(VLOOKUP($A4,'[1]Base 2'!$A$2:$AQ$18021,COLUMN(),0))),\"\")","v":""}]
["00110208-22",{"$f":"IFERROR(IF((VLOOKUP($A5,'[1]Base 2'!$A$2:$AQ$18021,COLUMN(),0))=0,\"\",(VLOOKUP($A5,'[1]Base 2'!$A$2:$AQ$18021,COLUMN(),0))),\"\")","v":""},{"$f":"IFERROR(IF((VLOOKUP($A5,'[1]Base 2'!$A$2:$AQ$18021,COLUMN(),0))=0,\"\",(VLOOKUP($A5,'[1]Base 2'!$A$2:$AQ$18021,COLUMN(),0))),\"\")","v":""}]
["01387-197-07",{"$f":"IFERROR(IF((VLOOKUP($A6,'[1]Base 2'!$A$2:$AQ$18021,COLUMN(),0))=0,\"\",(VLOOKUP($A6,'[1]Base 2'!$A$2:$AQ$18021,COLUMN(),0))),\"\")","v":6290},{"$f":"IFERROR(IF((VLOOKUP($A6,'[1]Base 2'!$A$2:$AQ$18021,COLUMN(),0))=0,\"\",(VLOOKUP($A6,'[1]Base 2'!$A$2:$AQ$18021,COLUMN(),0))),\"\")","v":2014}]