{"text_format":"1","workbook":"xlsx","n_sheets":2,"sheets":["Productivité","Feuil1"],"not_rendered":{"charts":0,"images":0,"macros":1,"external_links":0,"defined_names":4,"comments":0,"pivot_tables":0},"unopened":[],"bounds":{"document_bytes":16777216,"sheet_cells":100000,"rows_first":2000,"rows_last":500,"rows_between":2000,"halvings":0,"cell_chars":16384,"cell_head_chars":4096},"cells_cut":0,"cells_raw":0,"read":"whole","date_system":"1900"}

{"sheet":"Productivité","index":0,"n_rows":55,"n_cols":35,"rows_kept":55,"cut":false,"hidden":false,"merged":[[54,23,55,23],[52,23,53,23],[50,23,51,23],[48,23,49,23],[46,23,47,23],[44,23,45,23],[42,23,43,23],[40,23,41,23],[34,23,35,23],[54,29,55,29],[52,29,53,29],[50,29,51,29],[48,29,49,29],[46,29,47,29],[44,29,45,29],[42,29,43,29],[40,29,41,29],[34,29,35,29],[22,2,23,2],[44,2,45,2],[46,2,47,2],[28,2,29,2],[30,2,31,2],[32,2,33,2],[3,33,3,34],[8,33,8,34],[13,33,13,34],[12,23,13,23],[14,23,15,23],[16,23,17,23],[44,27,45,27],[46,27,47,27],[44,26,45,26],[46,26,47,26],[44,25,45,25],[46,25,47,25],[18,33,18,34],[19,33,19,34],[12,29,13,29],[8,29,9,29],[10,29,11,29],[22,29,23,29],[12,1,13,1],[14,1,15,1],[16,1,17,1],[18,1,19,1],[20,1,21,1],[12,2,13,2],[14,2,15,2],[16,2,17,2],[18,2,19,2],[20,2,21,2],[14,29,15,29],[16,29,17,29],[18,29,19,29],[20,29,21,29],[44,28,45,28],[26,29,27,29],[26,27,27,27],[8,30,9,30],[10,30,11,30],[12,30,13,30],[14,30,15,30],[16,30,17,30],[18,30,19,30],[40,30,41,30],[42,30,43,30],[44,30,45,30],[16,28,17,28],[14,28,15,28],[12,28,13,28],[20,28,21,28],[18,28,19,28],[22,28,23,28],[10,28,11,28],[8,28,9,28],[20,26,21,26],[48,27,49,27],[50,27,51,27],[48,26,49,26],[50,26,51,26],[52,26,53,26],[26,26,27,26],[4,27,5,27],[6,27,7,27],[8,27,9,27],[10,27,11,27],[22,27,23,27],[12,27,13,27],[14,27,15,27],[16,27,17,27],[18,27,19,27],[20,27,21,27],[8,26,9,26],[10,26,11,26],[22,26,23,26],[12,26,13,26],[14,26,15,26],[16,26,17,26],[18,26,19,26],[1,1,1,2],[1,3,1,30],[3,3,3,22],[4,23,5,23],[6,23,7,23],[6,1,7,1],[4,2,5,2],[4,26,5,26],[6,26,7,26],[4,29,5,29],[6,29,7,29],[4,25,5,25],[6,25,7,25],[4,28,5,28],[6,28,7,28],[6,2,7,2],[4,1,5,1],[4,30,5,30],[6,30,7,30],[4,24,5,24],[6,24,7,24],[2,12,2,13],[2,14,2,18],[2,2,2,11],[52,1,53,1],[52,2,53,2],[50,1,51,1],[48,1,49,1],[46,1,47,1],[8,1,9,1],[10,1,11,1],[22,1,23,1],[44,1,45,1],[8,2,9,2],[10,2,11,2],[48,2,49,2],[50,2,51,2],[24,1,25,1],[26,1,27,1],[28,1,29,1],[30,1,31,1],[32,1,33,1],[34,1,35,1],[36,1,37,1],[40,1,41,1],[42,1,43,1],[24,2,25,2],[26,2,27,2],[20,23,21,23],[12,25,13,25],[14,25,15,25],[16,25,17,25],[18,25,19,25],[20,25,21,25],[8,23,9,23],[10,23,11,23],[22,23,23,23],[18,23,19,23],[8,24,9,24],[10,24,11,24],[12,24,13,24],[14,24,15,24],[16,24,17,24],[18,24,19,24],[20,24,21,24],[8,25,9,25],[10,25,11,25],[22,25,23,25],[36,23,37,23],[36,28,37,28],[36,29,37,29],[36,25,37,25],[36,26,37,26],[34,26,35,26],[34,27,35,27],[24,27,25,27],[26,23,27,23],[26,28,27,28],[26,25,27,25],[32,29,33,29],[28,29,29,29],[32,23,33,23],[24,23,25,23],[24,28,25,28],[24,29,25,29],[24,25,25,25],[24,26,25,26],[30,23,31,23],[30,28,31,28],[30,29,31,29],[30,25,31,25],[30,26,31,26],[54,25,55,27],[36,27,37,27],[40,28,41,28],[40,25,41,25],[40,26,41,26],[40,27,41,27],[42,28,43,28],[42,25,43,25],[42,26,43,26],[42,27,43,27],[54,28,55,28],[48,28,49,28],[50,28,51,28],[34,2,35,2],[36,2,37,2],[52,28,53,28],[28,23,29,23],[28,28,29,28],[28,25,29,25],[28,26,29,26],[28,27,29,27],[48,25,49,25],[50,25,51,25],[52,25,53,25],[46,28,47,28],[50,24,51,24],[52,24,53,24],[52,27,53,27],[44,24,45,24],[46,24,47,24],[48,24,49,24],[30,27,31,27],[32,28,33,28],[32,25,33,25],[32,26,33,26],[32,27,33,27],[34,28,35,28],[34,25,35,25],[46,30,47,30],[48,30,49,30],[38,1,39,1],[38,2,39,2],[38,23,39,23],[38,28,39,28],[38,29,39,29],[38,25,39,25],[38,26,39,26],[38,27,39,27],[40,2,41,2],[42,2,43,2],[22,30,23,30],[24,30,25,30],[26,30,27,30],[28,30,29,30],[30,30,31,30],[32,30,33,30],[34,30,35,30],[36,30,37,30],[38,30,39,30],[2,19,2,21],[2,22,2,28],[54,24,55,24],[54,18,55,22],[24,32,25,37],[26,32,27,37],[28,32,29,37],[30,32,31,37],[23,32,23,37],[54,30,55,30],[22,24,23,24],[24,24,25,24],[26,24,27,24],[28,24,29,24],[30,24,31,24],[32,24,33,24],[34,24,35,24],[36,24,37,24],[38,24,39,24],[40,24,41,24],[42,24,43,24],[50,30,51,30],[52,30,53,30],[20,30,21,30]]}
[]
[null,{"$f":"IF(D2=\"nuit\",TODAY()-1,TODAY())","v":"2018-02-13"},null,"Matin"]
[null,"RDQ 1 : ",{"$f":"IFERROR(VLOOKUP(O3,Feuil1!B:C,2,FALSE),0)","v":"RAPHAEL"},null,null,null,null,null,null,null,null,null,"N° :",null,1,null,null,null,null,"RDQ 2 : ",null,null,{"$f":"IFERROR(VLOOKUP(AE3,Feuil1!B:C,2,FALSE),0)","v":"SAMUEL"},null,null,null,null,null,null,"N°:",2]
[null,"Chargeurs","N° ","Numéros de courses - Nombres de pièces",null,null,null,null,null,null,null,null,null,null,null,null,null,null,null,null,null,null,null,"Rem","Pièces","Début","Fin","Arrêt","Heures","Prod rem","Prod pièces",null,null,"A charger"]
[null,{"$f":"IFERROR(VLOOKUP(C5,Feuil1!B:C,2,FALSE),0)","v":"ENZO"},3,"ft789","ft456","ft123","ft321","ft654","ft987","ft147","ft258","ft369","ft741","ft852","ft963","ft159","ft753",null,null,null,null,null,null,{"$f":"COUNTA(D5:W5)","v":14},{"$f":"A6","v":339},"06:15:00","14:00:00","00:45:00",{"$f":"IF(Z5>AA5,AA5-Z5+IF(Z5>AA5,1),AA5-Z5)-(AB5)","v":"07:00:00"},{"$f":"IFERROR(X5/(AC5*24),0)","v":2},{"$f":"IFERROR(Y5/(AC5*24),0)","v":48.428571428571431},{"$f":"SUM(LEN(D6:W6))-SUM(LEN(SUBSTITUTE(SUBSTITUTE(D6:W6,\"\",\"\"),\"e\",\"\")))","v":0},null,"Remorques",135]
[{"$f":"SUM(IF(ISBLANK(D6:W6),0,SUBSTITUTE(SUBSTITUTE(SUBSTITUTE(SUBSTITUTE(D6:W6,\"b\",\"\"),\"B\",\"\"),\"e\",\"\"),\"E\",\"\")*1))","v":339},null,null,28,29,28,27,30,31,"14b","15b",24,10,26,28,"18b",31,null,null,null,null,null,null,null,null,null,null,null,null,null,null,{"$f":"SUM(LEN(D6:W6))-SUM(LEN(SUBSTITUTE(SUBSTITUTE(D6:W6,\"B\",\"\"),\"b\",\"\")))","v":3},null,"Bus",34]
[null,{"$f":"IFERROR(VLOOKUP(C7,Feuil1!B:C,2,FALSE),0)","v":"NICOLAS"},4,"po789","op456","op123","op321","op654","op987","op741","op852","op963","op321","op654","op987","po159","po147","op155",null,null,null,null,null,{"$f":"COUNTA(D7:W7)","v":15},{"$f":"A8","v":381},"06:15:00","14:00:00","00:45:00",{"$f":"IF(Z7>AA7,AA7-Z7+IF(Z7>AA7,1),AA7-Z7)-(AB7)","v":"07:00:00"},{"$f":"IFERROR(X7/(AC7*24),0)","v":2.1428571428571428},{"$f":"IFERROR(Y7/(AC7*24),0)","v":54.428571428571431},{"$f":"SUM(LEN(D8:W8))-SUM(LEN(SUBSTITUTE(SUBSTITUTE(D8:W8,\"\",\"\"),\"e\",\"\")))","v":0}]
[{"$f":"SUM(IF(ISBLANK(D8:W8),0,SUBSTITUTE(SUBSTITUTE(SUBSTITUTE(SUBSTITUTE(D8:W8,\"b\",\"\"),\"B\",\"\"),\"e\",\"\"),\"E\",\"\")*1))","v":381},null,null,28,29,30,31,31,"10b",28,"9b",14,28,29,31,32,25,26,null,null,null,null,null,null,null,null,null,null,null,null,null,{"$f":"SUM(LEN(D8:W8))-SUM(LEN(SUBSTITUTE(SUBSTITUTE(D8:W8,\"B\",\"\"),\"b\",\"\")))","v":2}]
[null,{"$f":"IFERROR(VLOOKUP(C9,Feuil1!B:C,2,FALSE),0)","v":"HUGO"},5,"gj89","gj456","gj123","gj741","gj852","gj963","gj258","gj147","gj369","gj159","gj753","gj951","gj225",null,null,null,null,null,null,null,{"$f":"COUNTA(D9:W9)","v":13},{"$f":"A10","v":342},"06:15:00","14:00:00","01:00:00",{"$f":"IF(Z9>AA9,AA9-Z9+IF(Z9>AA9,1),AA9-Z9)-(AB9)","v":"06:45:00"},{"$f":"IFERROR(X9/(AC9*24),0)","v":1.9259259259259258},{"$f":"IFERROR(Y9/(AC9*24),0)","v":50.666666666666664},{"$f":"SUM(LEN(D10:W10))-SUM(LEN(SUBSTITUTE(SUBSTITUTE(D10:W10,\"\",\"\"),\"e\",\"\")))","v":0},null,"Chargé"]
[{"$f":"SUM(IF(ISBLANK(D10:W10),0,SUBSTITUTE(SUBSTITUTE(SUBSTITUTE(SUBSTITUTE(D10:W10,\"b\",\"\"),\"B\",\"\"),\"e\",\"\"),\"E\",\"\")*1))","v":342},null,null,28,29,27,30,32,31,"14b","17b","20b",28,29,30,27,null,null,null,null,null,null,null,null,null,null,null,null,null,null,null,{"$f":"SUM(LEN(D10:W10))-SUM(LEN(SUBSTITUTE(SUBSTITUTE(D10:W10,\"B\",\"\"),\"b\",\"\")))","v":3},null,"Remorques",{"$f":"X55-AI11-(AH20*2)","v":57}]
[null,{"$f":"IFERROR(VLOOKUP(C11,Feuil1!B:C,2,FALSE),0)","v":"ANTOINE"},6,"vn789","bn456","bn123","bn321","nb654","bn987","bn222","bn555","bn478","nb367","bn985","bn632","bn258","bn244",null,null,null,null,null,null,{"$f":"COUNTA(D11:W11)","v":14},{"$f":"A12","v":366},"06:30:00","14:00:00","00:45:00",{"$f":"IF(Z11>AA11,AA11-Z11+IF(Z11>AA11,1),AA11-Z11)-(AB11)","v":"06:45:00"},{"$f":"IFERROR(X11/(AC11*24),0)","v":2.0740740740740735},{"$f":"IFERROR(Y11/(AC11*24),0)","v":54.222222222222207},{"$f":"SUM(LEN(D12:W12))-SUM(LEN(SUBSTITUTE(SUBSTITUTE(D12:W12,\"\",\"\"),\"e\",\"\")))","v":0},null,"Bus",{"$f":"SUM(AF6,AF8,AF10,AF12,AF14,AF16,AF18,AF20,AF22,AF24,AF26,AF28,AF30,AF32,AF34,AF36,AF38,AF40,AF42,AF44,AF46,AF48,AF50,AF52,AF54)","v":14}]
[{"$f":"SUM(IF(ISBLANK(D12:W12),0,SUBSTITUTE(SUBSTITUTE(SUBSTITUTE(SUBSTITUTE(D12:W12,\"b\",\"\"),\"B\",\"\"),\"e\",\"\"),\"E\",\"\")*1))","v":366},null,null,30,31,28,29,"10b","18b",28,29,30,31,"15b",28,29,30,null,null,null,null,null,null,null,null,null,null,null,null,null,null,{"$f":"SUM(LEN(D12:W12))-SUM(LEN(SUBSTITUTE(SUBSTITUTE(D12:W12,\"B\",\"\"),\"b\",\"\")))","v":3}]
[null,{"$f":"IFERROR(VLOOKUP(C13,Feuil1!B:C,2,FALSE),0)","v":"FREDERIC"},7,"cy789","cy456","cy123","cy741","cy852","cy963","cy654","cy987","cy321","cy258","cy299","cy466","cy311","cy977","vy624",null,null,null,null,null,{"$f":"COUNTA(D13:W13)","v":15},{"$f":"A14","v":373},"06:15:00","14:00:00","00:45:00",{"$f":"IF(Z13>AA13,AA13-Z13+IF(Z13>AA13,1),AA13-Z13)-(AB13)","v":"07:00:00"},{"$f":"IFERROR(X13/(AC13*24),0)","v":2.1428571428571428},{"$f":"IFERROR(Y13/(AC13*24),0)","v":53.285714285714285},{"$f":"SUM(LEN(D14:W14))-SUM(LEN(SUBSTITUTE(SUBSTITUTE(D14:W14,\"\",\"\"),\"e\",\"\")))","v":0}]
[{"$f":"SUM(IF(ISBLANK(D14:W14),0,SUBSTITUTE(SUBSTITUTE(SUBSTITUTE(SUBSTITUTE(D14:W14,\"b\",\"\"),\"B\",\"\"),\"e\",\"\"),\"E\",\"\")*1))","v":373},null,null,28,29,29,29,28,"14b","17b","20b",28,30,28,29,27,14,23,null,null,null,null,null,null,null,null,null,null,null,null,null,{"$f":"SUM(LEN(D14:W14))-SUM(LEN(SUBSTITUTE(SUBSTITUTE(D14:W14,\"B\",\"\"),\"b\",\"\")))","v":3},null,"Reste"]
[null,{"$f":"IFERROR(VLOOKUP(C15,Feuil1!B:C,2,FALSE),0)","v":0},null,null,null,null,null,null,null,null,null,null,null,null,null,null,null,null,null,null,null,null,null,{"$f":"COUNTA(D15:W15)","v":0},{"$f":"A16","v":0},null,null,null,{"$f":"IF(Z15>AA15,AA15-Z15+IF(Z15>AA15,1),AA15-Z15)-(AB15)","v":"00:00:00"},{"$f":"IFERROR(X15/(AC15*24),0)","v":0},{"$f":"IFERROR(Y15/(AC15*24),0)","v":0},{"$f":"SUM(LEN(D16:W16))-SUM(LEN(SUBSTITUTE(SUBSTITUTE(D16:W16,\"\",\"\"),\"e\",\"\")))","v":0},null,"Remorques",{"$f":"AI5-AI10","v":78}]
[{"$f":"SUM(IF(ISBLANK(D16:W16),0,SUBSTITUTE(SUBSTITUTE(SUBSTITUTE(SUBSTITUTE(D16:W16,\"b\",\"\"),\"B\",\"\"),\"e\",\"\"),\"E\",\"\")*1))","v":0},null,null,null,null,null,null,null,null,null,null,null,null,null,null,null,null,null,null,null,null,null,null,null,null,null,null,null,null,null,null,{"$f":"SUM(LEN(D16:W16))-SUM(LEN(SUBSTITUTE(SUBSTITUTE(D16:W16,\"B\",\"\"),\"b\",\"\")))","v":0},null,"Bus",{"$f":"AI6-AI11","v":20}]
[null,{"$f":"IFERROR(VLOOKUP(C17,Feuil1!B:C,2,FALSE),0)","v":0},null,null,null,null,null,null,null,null,null,null,null,null,null,null,null,null,null,null,null,null,null,{"$f":"COUNTA(D17:W17)","v":0},{"$f":"A18","v":0},null,null,null,{"$f":"IF(Z17>AA17,AA17-Z17+IF(Z17>AA17,1),AA17-Z17)-(AB17)","v":"00:00:00"},{"$f":"IFERROR(X17/(AC17*24),0)","v":0},{"$f":"IFERROR(Y17/(AC17*24),0)","v":0},{"$f":"SUM(LEN(D18:W18))-SUM(LEN(SUBSTITUTE(SUBSTITUTE(D18:W18,\"\",\"\"),\"e\",\"\")))","v":0}]
[{"$f":"SUM(IF(ISBLANK(D18:W18),0,SUBSTITUTE(SUBSTITUTE(SUBSTITUTE(SUBSTITUTE(D18:W18,\"b\",\"\"),\"B\",\"\"),\"e\",\"\"),\"E\",\"\")*1))","v":0},null,null,null,null,null,null,null,null,null,null,null,null,null,null,null,null,null,null,null,null,null,null,null,null,null,null,null,null,null,null,{"$f":"SUM(LEN(D18:W18))-SUM(LEN(SUBSTITUTE(SUBSTITUTE(D18:W18,\"B\",\"\"),\"b\",\"\")))","v":0}]
[null,{"$f":"IFERROR(VLOOKUP(C19,Feuil1!B:C,2,FALSE),0)","v":0},null,null,null,null,null,null,null,null,null,null,null,null,null,null,null,null,null,null,null,null,null,{"$f":"COUNTA(D19:W19)","v":0},{"$f":"A20","v":0},null,null,null,{"$f":"IF(Z19>AA19,AA19-Z19+IF(Z19>AA19,1),AA19-Z19)-(AB19)","v":"00:00:00"},{"$f":"IFERROR(X19/(AC19*24),0)","v":0},{"$f":"IFERROR(Y19/(AC19*24),0)","v":0},{"$f":"SUM(LEN(D20:W20))-SUM(LEN(SUBSTITUTE(SUBSTITUTE(D20:W20,\"\",\"\"),\"e\",\"\")))","v":0},null,"Rechargées "]
[{"$f":"SUM(IF(ISBLANK(D20:W20),0,SUBSTITUTE(SUBSTITUTE(SUBSTITUTE(SUBSTITUTE(D20:W20,\"b\",\"\"),\"B\",\"\"),\"e\",\"\"),\"E\",\"\")*1))","v":0},null,null,null,null,null,null,null,null,null,null,null,null,null,null,null,null,null,null,null,null,null,null,null,null,null,null,null,null,null,null,{"$f":"SUM(LEN(D20:W20))-SUM(LEN(SUBSTITUTE(SUBSTITUTE(D20:W20,\"B\",\"\"),\"b\",\"\")))","v":0},null,{"$f":"SUM(AF5,AF7,AF9,AF11,AF13,AF15,AF17,AF19,AF21,AF23,AF25,AF27,AF29,AF31,AF33,AF35,AF37,AF39,AF41,AF43,AF45,AF47,AF49,AF51,AF53)","v":0}]
[null,{"$f":"IFERROR(VLOOKUP(C21,Feuil1!B:C,2,FALSE),0)","v":0},null,null,null,null,null,null,null,null,null,null,null,null,null,null,null,null,null,null,null,null,null,{"$f":"COUNTA(D21:W21)","v":0},{"$f":"A22","v":0},null,null,null,{"$f":"IF(Z21>AA21,AA21-Z21+IF(Z21>AA21,1),AA21-Z21)-(AB21)","v":"00:00:00"},{"$f":"IFERROR(X21/(AC21*24),0)","v":0},{"$f":"IFERROR(Y21/(AC21*24),0)","v":0},{"$f":"SUM(LEN(D22:W22))-SUM(LEN(SUBSTITUTE(SUBSTITUTE(D22:W22,\"\",\"\"),\"e\",\"\")))","v":0}]
[{"$f":"SUM(IF(ISBLANK(D22:W22),0,SUBSTITUTE(SUBSTITUTE(SUBSTITUTE(SUBSTITUTE(D22:W22,\"b\",\"\"),\"B\",\"\"),\"e\",\"\"),\"E\",\"\")*1))","v":0},null,null,null,null,null,null,null,null,null,null,null,null,null,null,null,null,null,null,null,null,null,null,null,null,null,null,null,null,null,null,{"$f":"SUM(LEN(D22:W22))-SUM(LEN(SUBSTITUTE(SUBSTITUTE(D22:W22,\"B\",\"\"),\"b\",\"\")))","v":0}]
[null,{"$f":"IFERROR(VLOOKUP(C23,Feuil1!B:C,2,FALSE),0)","v":0},null,null,null,null,null,null,null,null,null,null,null,null,null,null,null,null,null,null,null,null,null,{"$f":"COUNTA(D23:W23)","v":0},{"$f":"A24","v":0},null,null,null,{"$f":"IF(Z23>AA23,AA23-Z23+IF(Z23>AA23,1),AA23-Z23)-(AB23)","v":"00:00:00"},{"$f":"IFERROR(X23/(AC23*24),0)","v":0},{"$f":"IFERROR(Y23/(AC23*24),0)","v":0},{"$f":"SUM(LEN(D24:W24))-SUM(LEN(SUBSTITUTE(SUBSTITUTE(D24:W24,\"\",\"\"),\"e\",\"\")))","v":0}]
[{"$f":"SUM(IF(ISBLANK(D24:W24),0,SUBSTITUTE(SUBSTITUTE(SUBSTITUTE(SUBSTITUTE(D24:W24,\"b\",\"\"),\"B\",\"\"),\"e\",\"\"),\"E\",\"\")*1))","v":0},null,null,null,null,null,null,null,null,null,null,null,null,null,null,null,null,null,null,null,null,null,null,null,null,null,null,null,null,null,null,{"$f":"SUM(LEN(D24:W24))-SUM(LEN(SUBSTITUTE(SUBSTITUTE(D24:W24,\"B\",\"\"),\"b\",\"\")))","v":0},"Commentaires"]
[null,{"$f":"IFERROR(VLOOKUP(C25,Feuil1!B:C,2,FALSE),0)","v":0},null,null,null,null,null,null,null,null,null,null,null,null,null,null,null,null,null,null,null,null,null,{"$f":"COUNTA(D25:W25)","v":0},{"$f":"A26","v":0},null,null,null,{"$f":"IF(Z25>AA25,AA25-Z25+IF(Z25>AA25,1),AA25-Z25)-(AB25)","v":"00:00:00"},{"$f":"IFERROR(X25/(AC25*24),0)","v":0},{"$f":"IFERROR(Y25/(AC25*24),0)","v":0},{"$f":"SUM(LEN(D26:W26))-SUM(LEN(SUBSTITUTE(SUBSTITUTE(D26:W26,\"\",\"\"),\"e\",\"\")))","v":0}]
[{"$f":"SUM(IF(ISBLANK(D26:W26),0,SUBSTITUTE(SUBSTITUTE(SUBSTITUTE(SUBSTITUTE(D26:W26,\"b\",\"\"),\"B\",\"\"),\"e\",\"\"),\"E\",\"\")*1))","v":0},null,null,null,null,null,null,null,null,null,null,null,null,null,null,null,null,null,null,null,null,null,null,null,null,null,null,null,null,null,null,{"$f":"SUM(LEN(D26:W26))-SUM(LEN(SUBSTITUTE(SUBSTITUTE(D26:W26,\"B\",\"\"),\"b\",\"\")))","v":0}]
[null,{"$f":"IFERROR(VLOOKUP(C27,Feuil1!B:C,2,FALSE),0)","v":0},null,null,null,null,null,null,null,null,null,null,null,null,null,null,null,null,null,null,null,null,null,{"$f":"COUNTA(D27:W27)","v":0},{"$f":"A28","v":0},null,null,null,{"$f":"IF(Z27>AA27,AA27-Z27+IF(Z27>AA27,1),AA27-Z27)-(AB27)","v":"00:00:00"},{"$f":"IFERROR(X27/(AC27*24),0)","v":0},{"$f":"IFERROR(Y27/(AC27*24),0)","v":0},{"$f":"SUM(LEN(D28:W28))-SUM(LEN(SUBSTITUTE(SUBSTITUTE(D28:W28,\"\",\"\"),\"e\",\"\")))","v":0}]
[{"$f":"SUM(IF(ISBLANK(D28:W28),0,SUBSTITUTE(SUBSTITUTE(SUBSTITUTE(SUBSTITUTE(D28:W28,\"b\",\"\"),\"B\",\"\"),\"e\",\"\"),\"E\",\"\")*1))","v":0},null,null,null,null,null,null,null,null,null,null,null,null,null,null,null,null,null,null,null,null,null,null,null,null,null,null,null,null,null,null,{"$f":"SUM(LEN(D28:W28))-SUM(LEN(SUBSTITUTE(SUBSTITUTE(D28:W28,\"B\",\"\"),\"b\",\"\")))","v":0}]
[null,{"$f":"IFERROR(VLOOKUP(C29,Feuil1!B:C,2,FALSE),0)","v":0},null,null,null,null,null,null,null,null,null,null,null,null,null,null,null,null,null,null,null,null,null,{"$f":"COUNTA(D29:W29)","v":0},{"$f":"A30","v":0},null,null,null,{"$f":"IF(Z29>AA29,AA29-Z29+IF(Z29>AA29,1),AA29-Z29)-(AB29)","v":"00:00:00"},{"$f":"IFERROR(X29/(AC29*24),0)","v":0},{"$f":"IFERROR(Y29/(AC29*24),0)","v":0},{"$f":"SUM(LEN(D30:W30))-SUM(LEN(SUBSTITUTE(SUBSTITUTE(D30:W30,\"\",\"\"),\"e\",\"\")))","v":0}]
[{"$f":"SUM(IF(ISBLANK(D30:W30),0,SUBSTITUTE(SUBSTITUTE(SUBSTITUTE(SUBSTITUTE(D30:W30,\"b\",\"\"),\"B\",\"\"),\"e\",\"\"),\"E\",\"\")*1))","v":0},null,null,null,null,null,null,null,null,null,null,null,null,null,null,null,null,null,null,null,null,null,null,null,null,null,null,null,null,null,null,{"$f":"SUM(LEN(D30:W30))-SUM(LEN(SUBSTITUTE(SUBSTITUTE(D30:W30,\"B\",\"\"),\"b\",\"\")))","v":0}]
[null,{"$f":"IFERROR(VLOOKUP(C31,Feuil1!B:C,2,FALSE),0)","v":0},null,null,null,null,null,null,null,null,null,null,null,null,null,null,null,null,null,null,null,null,null,{"$f":"COUNTA(D31:W31)","v":0},{"$f":"A32","v":0},null,null,null,{"$f":"IF(Z31>AA31,AA31-Z31+IF(Z31>AA31,1),AA31-Z31)-(AB31)","v":"00:00:00"},{"$f":"IFERROR(X31/(AC31*24),0)","v":0},{"$f":"IFERROR(Y31/(AC31*24),0)","v":0},{"$f":"SUM(LEN(D32:W32))-SUM(LEN(SUBSTITUTE(SUBSTITUTE(D32:W32,\"\",\"\"),\"e\",\"\")))","v":0}]
[{"$f":"SUM(IF(ISBLANK(D32:W32),0,SUBSTITUTE(SUBSTITUTE(SUBSTITUTE(SUBSTITUTE(D32:W32,\"b\",\"\"),\"B\",\"\"),\"e\",\"\"),\"E\",\"\")*1))","v":0},null,null,null,null,null,null,null,null,null,null,null,null,null,null,null,null,null,null,null,null,null,null,null,null,null,null,null,null,null,null,{"$f":"SUM(LEN(D32:W32))-SUM(LEN(SUBSTITUTE(SUBSTITUTE(D32:W32,\"B\",\"\"),\"b\",\"\")))","v":0}]
[null,{"$f":"IFERROR(VLOOKUP(C33,Feuil1!B:C,2,FALSE),0)","v":0},null,null,null,null,null,null,null,null,null,null,null,null,null,null,null,null,null,null,null,null,null,{"$f":"COUNTA(D33:W33)","v":0},{"$f":"A34","v":0},null,null,null,{"$f":"IF(Z33>AA33,AA33-Z33+IF(Z33>AA33,1),AA33-Z33)-(AB33)","v":"00:00:00"},{"$f":"IFERROR(X33/(AC33*24),0)","v":0},{"$f":"IFERROR(Y33/(AC33*24),0)","v":0},{"$f":"SUM(LEN(D34:W34))-SUM(LEN(SUBSTITUTE(SUBSTITUTE(D34:W34,\"\",\"\"),\"e\",\"\")))","v":0}]
[{"$f":"SUM(IF(ISBLANK(D34:W34),0,SUBSTITUTE(SUBSTITUTE(SUBSTITUTE(SUBSTITUTE(D34:W34,\"b\",\"\"),\"B\",\"\"),\"e\",\"\"),\"E\",\"\")*1))","v":0},null,null,null,null,null,null,null,null,null,null,null,null,null,null,null,null,null,null,null,null,null,null,null,null,null,null,null,null,null,null,{"$f":"SUM(LEN(D34:W34))-SUM(LEN(SUBSTITUTE(SUBSTITUTE(D34:W34,\"B\",\"\"),\"b\",\"\")))","v":0}]
[null,{"$f":"IFERROR(VLOOKUP(C35,Feuil1!B:C,2,FALSE),0)","v":0},null,null,null,null,null,null,null,null,null,null,null,null,null,null,null,null,null,null,null,null,null,{"$f":"COUNTA(D35:W35)","v":0},{"$f":"A36","v":0},null,null,null,{"$f":"IF(Z35>AA35,AA35-Z35+IF(Z35>AA35,1),AA35-Z35)-(AB35)","v":"00:00:00"},{"$f":"IFERROR(X35/(AC35*24),0)","v":0},{"$f":"IFERROR(Y35/(AC35*24),0)","v":0},{"$f":"SUM(LEN(D36:W36))-SUM(LEN(SUBSTITUTE(SUBSTITUTE(D36:W36,\"\",\"\"),\"e\",\"\")))","v":0}]
[{"$f":"SUM(IF(ISBLANK(D36:W36),0,SUBSTITUTE(SUBSTITUTE(SUBSTITUTE(SUBSTITUTE(D36:W36,\"b\",\"\"),\"B\",\"\"),\"e\",\"\"),\"E\",\"\")*1))","v":0},null,null,null,null,null,null,null,null,null,null,null,null,null,null,null,null,null,null,null,null,null,null,null,null,null,null,null,null,null,null,{"$f":"SUM(LEN(D36:W36))-SUM(LEN(SUBSTITUTE(SUBSTITUTE(D36:W36,\"B\",\"\"),\"b\",\"\")))","v":0}]
[null,{"$f":"IFERROR(VLOOKUP(C37,Feuil1!B:C,2,FALSE),0)","v":0},null,null,null,null,null,null,null,null,null,null,null,null,null,null,null,null,null,null,null,null,null,{"$f":"COUNTA(D37:W37)","v":0},{"$f":"A38","v":0},null,null,null,{"$f":"IF(Z37>AA37,AA37-Z37+IF(Z37>AA37,1),AA37-Z37)-(AB37)","v":"00:00:00"},{"$f":"IFERROR(X37/(AC37*24),0)","v":0},{"$f":"IFERROR(Y37/(AC37*24),0)","v":0},{"$f":"SUM(LEN(D38:W38))-SUM(LEN(SUBSTITUTE(SUBSTITUTE(D38:W38,\"\",\"\"),\"e\",\"\")))","v":0}]
[{"$f":"SUM(IF(ISBLANK(D38:W38),0,SUBSTITUTE(SUBSTITUTE(SUBSTITUTE(SUBSTITUTE(D38:W38,\"b\",\"\"),\"B\",\"\"),\"e\",\"\"),\"E\",\"\")*1))","v":0},null,null,null,null,null,null,null,null,null,null,null,null,null,null,null,null,null,null,null,null,null,null,null,null,null,null,null,null,null,null,{"$f":"SUM(LEN(D38:W38))-SUM(LEN(SUBSTITUTE(SUBSTITUTE(D38:W38,\"B\",\"\"),\"b\",\"\")))","v":0}]
[null,{"$f":"IFERROR(VLOOKUP(C39,Feuil1!B:C,2,FALSE),0)","v":0},null,null,null,null,null,null,null,null,null,null,null,null,null,null,null,null,null,null,null,null,null,{"$f":"COUNTA(D39:W39)","v":0},{"$f":"A40","v":0},null,null,null,{"$f":"IF(Z39>AA39,AA39-Z39+IF(Z39>AA39,1),AA39-Z39)-(AB39)","v":"00:00:00"},{"$f":"IFERROR(X39/(AC39*24),0)","v":0},{"$f":"IFERROR(Y39/(AC39*24),0)","v":0},{"$f":"SUM(LEN(D40:W40))-SUM(LEN(SUBSTITUTE(SUBSTITUTE(D40:W40,\"\",\"\"),\"e\",\"\")))","v":0}]
[{"$f":"SUM(IF(ISBLANK(D40:W40),0,SUBSTITUTE(SUBSTITUTE(SUBSTITUTE(SUBSTITUTE(D40:W40,\"b\",\"\"),\"B\",\"\"),\"e\",\"\"),\"E\",\"\")*1))","v":0},null,null,null,null,null,null,null,null,null,null,null,null,null,null,null,null,null,null,null,null,null,null,null,null,null,null,null,null,null,null,{"$f":"SUM(LEN(D40:W40))-SUM(LEN(SUBSTITUTE(SUBSTITUTE(D40:W40,\"B\",\"\"),\"b\",\"\")))","v":0}]
{"$rows_left_out":16}
{"sheet":"Feuil1","index":1,"n_rows":103,"n_cols":3,"rows_kept":103,"cut":false,"hidden":false,"merged":[[1,1,1,2]]}
[]
[null,"Liste du personnel"]
[null,"N°Pers.","Noms"]
[null,1,"RAPHAEL"]
[null,2,"SAMUEL"]
[null,3,"ENZO"]
[null,4,"NICOLAS"]
[null,5,"HUGO"]
[null,6,"ANTOINE"]
[null,7,"FREDERIC"]
[null,8,"THEO"]
[null,9,"JEREMIE"]
[null,10,"ADOLPHE"]
[null,11,"MATHIS"]
[null,12,"ALEXANDRE"]
[null,13,"BENJAMIN"]
[null,14,"LUCAS"]
[null,15,"SEBASTIEN"]
[null,16,"THOMAS"]
[null,17,"MARTIAL"]
[null,18,"MOHAMED"]
[null,19,"JEAN"]
[null,20,"SAYAN"]
[null,21,"ROBIN"]
[null,22,"FREDERIQUE"]
[null,23,"GAETAN"]
[null,24,"ETIENNE"]
[null,25,"SACHA"]
[null,26,"ANTHONY"]
[null,27,"ENAUT"]
[null,28,"MAXIME"]
[null,29,"SOHAN"]
[null,30,"NATHAN"]
[null,31,"KEVIN"]
[null,32,"GORKA"]
[null,33,"JULIEN"]
[null,34,"MARINE"]
[null,35,"STEPHANE"]
[null,36,"FRANCO"]
[null,37,"YASSINE"]
{"$rows_left_out":63}