{"text_format":"1","workbook":"xlsx","n_sheets":3,"sheets":["Prod","Data","Liste du personnel"],"not_rendered":{"charts":0,"images":0,"macros":1,"external_links":0,"defined_names":0,"comments":0,"pivot_tables":0},"unopened":[],"bounds":{"document_bytes":16777216,"sheet_cells":100000,"rows_first":2000,"rows_last":500,"rows_between":2000,"halvings":0,"cell_chars":16384,"cell_head_chars":4096},"cells_cut":0,"cells_raw":0,"read":"whole","date_system":"1900"}

{"sheet":"Prod","index":0,"n_rows":44,"n_cols":29,"rows_kept":44,"cut":false,"hidden":false,"merged":[[41,24,42,24],[41,25,42,25],[41,26,42,26],[41,27,42,27],[41,28,42,28],[43,24,44,24],[43,25,44,25],[43,26,44,26],[43,27,44,27],[43,28,44,28],[37,24,38,24],[37,25,38,25],[37,26,38,26],[37,27,38,27],[37,28,38,28],[39,24,40,24],[39,25,40,25],[39,26,40,26],[39,27,40,27],[39,28,40,28],[33,24,34,24],[33,25,34,25],[33,26,34,26],[33,27,34,27],[33,28,34,28],[35,24,36,24],[35,25,36,25],[35,26,36,26],[35,27,36,27],[35,28,36,28],[29,24,30,24],[29,25,30,25],[29,26,30,26],[29,27,30,27],[29,28,30,28],[31,24,32,24],[31,25,32,25],[31,26,32,26],[31,27,32,27],[31,28,32,28],[25,24,26,24],[25,25,26,25],[25,26,26,26],[25,27,26,27],[25,28,26,28],[27,24,28,24],[27,25,28,25],[27,26,28,26],[27,27,28,27],[27,28,28,28],[21,24,22,24],[21,25,22,25],[21,26,22,26],[21,27,22,27],[21,28,22,28],[23,24,24,24],[23,25,24,25],[23,26,24,26],[23,27,24,27],[23,28,24,28],[17,24,18,24],[17,25,18,25],[17,26,18,26],[17,27,18,27],[17,28,18,28],[19,24,20,24],[19,25,20,25],[19,26,20,26],[19,27,20,27],[19,28,20,28],[13,24,14,24],[13,25,14,25],[13,26,14,26],[13,27,14,27],[13,28,14,28],[15,24,16,24],[15,25,16,25],[15,26,16,26],[15,27,16,27],[15,28,16,28],[9,24,10,24],[9,25,10,25],[9,26,10,26],[9,27,10,27],[9,28,10,28],[11,24,12,24],[11,25,12,25],[11,26,12,26],[11,27,12,27],[11,28,12,28],[5,24,6,24],[5,25,6,25],[5,26,6,26],[5,27,6,27],[5,28,6,28],[7,24,8,24],[7,25,8,25],[7,26,8,26],[7,27,8,27],[7,28,8,28],[39,23,40,23],[41,23,42,23],[43,23,44,23],[21,23,22,23],[23,23,24,23],[25,23,26,23],[27,23,28,23],[29,23,30,23],[31,23,32,23],[43,2,44,2],[5,23,6,23],[7,23,8,23],[9,23,10,23],[11,23,12,23],[13,23,14,23],[15,23,16,23],[17,23,18,23],[19,23,20,23],[29,2,30,2],[31,2,32,2],[33,2,34,2],[35,2,36,2],[37,2,38,2],[39,2,40,2],[17,2,18,2],[19,2,20,2],[21,2,22,2],[23,2,24,2],[25,2,26,2],[27,2,28,2],[33,23,34,23],[35,23,36,23],[37,23,38,23],[15,2,16,2],[13,2,14,2],[4,3,4,12],[4,13,4,22],[11,2,12,2],[9,2,10,2],[7,2,8,2],[5,2,6,2],[41,2,42,2]]}
[]
[]
[]
[]
[null,"Noms","N°Pers.","Produits",null,null,null,null,null,null,null,null,null,"Quantités",null,null,null,null,null,null,null,null,null,"Total","Début","Fin","Arrêt","Heures","Prod"]
[null,{"$f":"VLOOKUP(C6,'Liste du personnel'!$B:$C,2,0)","v":{"$error":"#N/A"}},{"$f":"Data!B5","v":"1"},{"$f":"Data!$E7","v":0},{"$f":"Data!$E8","v":0},{"$f":"Data!$E9","v":0},{"$f":"Data!$E10","v":0},{"$f":"Data!$E11","v":0},{"$f":"Data!$E12","v":0},{"$f":"Data!$E13","v":0},{"$f":"Data!$E14","v":0},{"$f":"Data!$E15","v":0},{"$f":"Data!$E16","v":0},{"$f":"Data!$E17","v":0},{"$f":"Data!$E18","v":0},{"$f":"Data!$E19","v":0},{"$f":"Data!$E20","v":0},{"$f":"Data!$E21","v":0},{"$f":"Data!$E22","v":0},{"$f":"Data!$E23","v":0},{"$f":"Data!$E24","v":0},{"$f":"Data!$E25","v":0},{"$f":"Data!$E26","v":0},{"$f":"SUM(D7:W7)","v":0},"06:00:00","14:00:00","01:00:00",{"$f":"IF(Y6>Z6,Z6-Y6+IF(Y6>Z6,1),Z6-Y6)-(AA6)","v":"07:00:00"},{"$f":"X6/(AB6*24)","v":0}]
[null,null,null,{"$f":"Data!$F7","v":0},{"$f":"Data!$F8","v":0},{"$f":"Data!$F9","v":0},{"$f":"Data!$F10","v":0},{"$f":"Data!$F11","v":0},{"$f":"Data!$F12","v":0},{"$f":"Data!$F13","v":0},{"$f":"Data!$F14","v":0},{"$f":"Data!$F15","v":0},{"$f":"Data!$F16","v":0},{"$f":"Data!$F17","v":0},{"$f":"Data!$F18","v":0},{"$f":"Data!$F19","v":0},{"$f":"Data!$F20","v":0},{"$f":"Data!$F21","v":0},{"$f":"Data!$F22","v":0},{"$f":"Data!$F23","v":0},{"$f":"Data!$F24","v":0},{"$f":"Data!$F25","v":0},{"$f":"Data!$F26","v":0}]
[null,{"$f":"VLOOKUP(C8,'Liste du personnel'!$B:$C,2,0)","v":{"$error":"#REF!"}},{"$f":"Data!#REF!","v":{"$error":"#REF!"}},null,null,null,null,null,null,null,null,null,null,null,null,null,null,null,null,null,null,null,null,{"$f":"SUM(D9:W9)","v":0},null,null,null,{"$f":"IF(Y8>Z8,Z8-Y8+IF(Y8>Z8,1),Z8-Y8)-(AA8)","v":"00:00:00"}]
[]
[null,{"$f":"VLOOKUP(C10,'Liste du personnel'!$B:$C,2,0)","v":{"$error":"#N/A"}},null,null,null,null,null,null,null,null,null,null,null,null,null,null,null,null,null,null,null,null,null,{"$f":"SUM(D11:W11)","v":0},null,null,null,{"$f":"IF(Y10>Z10,Z10-Y10+IF(Y10>Z10,1),Z10-Y10)-(AA10)","v":"00:00:00"}]
[]
[null,{"$f":"VLOOKUP(C12,'Liste du personnel'!$B:$C,2,0)","v":{"$error":"#N/A"}},null,null,null,null,null,null,null,null,null,null,null,null,null,null,null,null,null,null,null,null,null,{"$f":"SUM(D13:W13)","v":0},null,null,null,{"$f":"IF(Y12>Z12,Z12-Y12+IF(Y12>Z12,1),Z12-Y12)-(AA12)","v":"00:00:00"}]
[]
[null,{"$f":"VLOOKUP(C14,'Liste du personnel'!$B:$C,2,0)","v":{"$error":"#N/A"}},null,null,null,null,null,null,null,null,null,null,null,null,null,null,null,null,null,null,null,null,null,{"$f":"SUM(D15:W15)","v":0},null,null,null,{"$f":"IF(Y14>Z14,Z14-Y14+IF(Y14>Z14,1),Z14-Y14)-(AA14)","v":"00:00:00"}]
[]
{"$rows_left_out":30}
{"sheet":"Data","index":1,"n_rows":6,"n_cols":612,"rows_kept":6,"cut":false,"hidden":false,"merged":[[4,111,4,113],[4,115,4,116],[4,117,4,119],[4,97,4,98],[4,99,4,101],[4,103,4,104],[4,105,4,107],[4,109,4,110],[4,1,4,2],[4,3,4,5],[4,7,4,8],[4,9,4,11],[4,39,4,41],[4,43,4,44],[4,45,4,47],[4,49,4,50],[4,25,4,26],[4,27,4,29],[4,31,4,32],[4,33,4,35],[4,37,4,38],[4,121,4,122],[4,123,4,125],[4,127,4,128],[4,129,4,131],[4,133,4,134],[4,13,4,14],[4,15,4,17],[4,19,4,20],[4,21,4,23],[4,51,4,53],[4,55,4,56],[4,57,4,59],[4,61,4,62],[4,63,4,65],[4,67,4,68],[4,69,4,71],[4,73,4,74],[4,75,4,77],[4,79,4,80],[4,81,4,83],[4,85,4,86],[4,87,4,89],[4,91,4,92],[4,93,4,95],[4,151,4,152],[4,153,4,155],[4,157,4,158],[4,159,4,161],[4,163,4,164],[4,135,4,137],[4,139,4,140],[4,141,4,143],[4,145,4,146],[4,147,4,149],[4,181,4,182],[4,183,4,185],[4,187,4,188],[4,189,4,191],[4,193,4,194],[4,165,4,167],[4,169,4,170],[4,171,4,173],[4,175,4,176],[4,177,4,179],[4,211,4,212],[4,213,4,215],[4,217,4,218],[4,219,4,221],[4,223,4,224],[4,195,4,197],[4,199,4,200],[4,201,4,203],[4,205,4,206],[4,207,4,209],[4,241,4,242],[4,243,4,245],[4,247,4,248],[4,249,4,251],[4,253,4,254],[4,225,4,227],[4,229,4,230],[4,231,4,233],[4,235,4,236],[4,237,4,239],[4,271,4,272],[4,273,4,275],[4,277,4,278],[4,279,4,281],[4,283,4,284],[4,255,4,257],[4,259,4,260],[4,261,4,263],[4,265,4,266],[4,267,4,269],[4,301,4,302],[4,303,4,305],[4,307,4,308],[4,309,4,311],[4,313,4,314],[4,285,4,287],[4,289,4,290],[4,291,4,293],[4,295,4,296],[4,297,4,299],[4,331,4,332],[4,333,4,335],[4,337,4,338],[4,339,4,341],[4,343,4,344],[4,315,4,317],[4,319,4,320],[4,321,4,323],[4,325,4,326],[4,327,4,329],[4,361,4,362],[4,363,4,365],[4,367,4,368],[4,369,4,371],[4,373,4,374],[4,345,4,347],[4,349,4,350],[4,351,4,353],[4,355,4,356],[4,357,4,359],[4,391,4,392],[4,393,4,395],[4,397,4,398],[4,399,4,401],[4,403,4,404],[4,375,4,377],[4,379,4,380],[4,381,4,383],[4,385,4,386],[4,387,4,389],[4,421,4,422],[4,423,4,425],[4,427,4,428],[4,429,4,431],[4,433,4,434],[4,405,4,407],[4,409,4,410],[4,411,4,413],[4,415,4,416],[4,417,4,419],[4,451,4,452],[4,453,4,455],[4,457,4,458],[4,459,4,461],[4,463,4,464],[4,435,4,437],[4,439,4,440],[4,441,4,443],[4,445,4,446],[4,447,4,449],[4,481,4,482],[4,483,4,485],[4,487,4,488],[4,489,4,491],[4,493,4,494],[4,465,4,467],[4,469,4,470],[4,471,4,473],[4,475,4,476],[4,477,4,479],[4,511,4,512],[4,513,4,515],[4,517,4,518],[4,519,4,521],[4,523,4,524],[4,495,4,497],[4,499,4,500],[4,501,4,503],[4,505,4,506],[4,507,4,509],[4,541,4,542],[4,543,4,545],[4,547,4,548],[4,549,4,551],[4,553,4,554],[4,525,4,527],[4,529,4,530],[4,531,4,533],[4,535,4,536],[4,537,4,539],[4,571,4,572],[4,573,4,575],[4,577,4,578],[4,579,4,581],[4,583,4,584],[4,555,4,557],[4,559,4,560],[4,561,4,563],[4,565,4,566],[4,567,4,569],[4,601,4,602],[4,603,4,605],[4,607,4,608],[4,609,4,611],[4,585,4,587],[4,589,4,590],[4,591,4,593],[4,595,4,596],[4,597,4,599]]}
[]
[]
[]
[]
[null,"1",null,{"$f":"VLOOKUP(B5,'Liste du personnel'!$B:$C,2,0)","v":{"$error":"#N/A"}},null,null,null,{"$f":"B5+1","v":2},null,{"$f":"VLOOKUP(H5,'Liste du personnel'!$B:$C,2,0)","v":"SAMUEL"},null,null,null,{"$f":"H5+1","v":3},null,{"$f":"VLOOKUP(N5,'Liste du personnel'!$B:$C,2,0)","v":"ENZO"},null,null,null,{"$f":"N5+1","v":4},null,{"$f":"VLOOKUP(T5,'Liste du personnel'!$B:$C,2,0)","v":"NICOLAS"},null,null,null,{"$f":"T5+1","v":5},null,{"$f":"VLOOKUP(Z5,'Liste du personnel'!$B:$C,2,0)","v":"HUGO"},null,null,null,{"$f":"Z5+1","v":6},null,{"$f":"VLOOKUP(AF5,'Liste du personnel'!$B:$C,2,0)","v":"ANTOINE"},null,null,null,{"$f":"AF5+1","v":7},null,{"$f":"VLOOKUP(AL5,'Liste du personnel'!$B:$C,2,0)","v":"FREDERIC"},null,null,null,{"$f":"AL5+1","v":8},null,{"$f":"VLOOKUP(AR5,'Liste du personnel'!$B:$C,2,0)","v":"THEO"},null,null,null,{"$f":"AR5+1","v":9},null,{"$f":"VLOOKUP(AX5,'Liste du personnel'!$B:$C,2,0)","v":"JEREMIE"},null,null,null,{"$f":"AX5+1","v":10},null,{"$f":"VLOOKUP(BD5,'Liste du personnel'!$B:$C,2,0)","v":"ADOLPHE"},null,null,null,{"$f":"BD5+1","v":11},null,{"$f":"VLOOKUP(BJ5,'Liste du personnel'!$B:$C,2,0)","v":"MATHIS"},null,null,null,{"$f":"BJ5+1","v":12},null,{"$f":"VLOOKUP(BP5,'Liste du personnel'!$B:$C,2,0)","v":"ALEXANDRE"},null,null,null,{"$f":"BP5+1","v":13},null,{"$f":"VLOOKUP(BV5,'Liste du personnel'!$B:$C,2,0)","v":"BENJAMIN"},null,null,null,{"$f":"BV5+1","v":14},null,{"$f":"VLOOKUP(CB5,'Liste du personnel'!$B:$C,2,0)","v":"LUCAS"},null,null,null,{"$f":"CB5+1","v":15},null,{"$f":"VLOOKUP(CH5,'Liste du personnel'!$B:$C,2,0)","v":"SEBASTIEN"},null,null,null,{"$f":"CH5+1","v":16},null,{"$f":"VLOOKUP(CN5,'Liste du personnel'!$B:$C,2,0)","v":"THOMAS"},null,null,null,{"$f":"CN5+1","v":17},null,{"$f":"VLOOKUP(CT5,'Liste du personnel'!$B:$C,2,0)","v":"MARTIAL"},null,null,null,{"$f":"CT5+1","v":18},null,{"$f":"VLOOKUP(CZ5,'Liste du personnel'!$B:$C,2,0)","v":"MOHAMED"},null,null,null,{"$f":"CZ5+1","v":19},null,{"$f":"VLOOKUP(DF5,'Liste du personnel'!$B:$C,2,0)","v":"JEAN"},null,null,null,{"$f":"DF5+1","v":20},null,{"$f":"VLOOKUP(DL5,'Liste du personnel'!$B:$C,2,0)","v":"SAYAN"},null,null,null,{"$f":"DL5+1","v":21},null,{"$f":"VLOOKUP(DR5,'Liste du personnel'!$B:$C,2,0)","v":"ROBIN"},null,null,null,{"$f":"DR5+1","v":22},null,{"$f":"VLOOKUP(DX5,'Liste du personnel'!$B:$C,2,0)","v":"FREDERIQUE"},null,null,null,{"$f":"DX5+1","v":23},null,{"$f":"VLOOKUP(ED5,'Liste du personnel'!$B:$C,2,0)","v":"GAETAN"},null,null,null,{"$f":"ED5+1","v":24},null,{"$f":"VLOOKUP(EJ5,'Liste du personnel'!$B:$C,2,0)","v":"ETIENNE"},null,null,null,{"$f":"EJ5+1","v":25},null,{"$f":"VLOOKUP(EP5,'Liste du personnel'!$B:$C,2,0)","v":"SACHA"},null,null,null,{"$f":"EP5+1","v":26},null,{"$f":"VLOOKUP(EV5,'Liste du personnel'!$B:$C,2,0)","v":"ANTHONY"},null,null,null,{"$f":"EV5+1","v":27},null,{"$f":"VLOOKUP(FB5,'Liste du personnel'!$B:$C,2,0)","v":"ENAUT"},null,null,null,{"$f":"FB5+1","v":28},null,{"$f":"VLOOKUP(FH5,'Liste du personnel'!$B:$C,2,0)","v":"MAXIME"},null,null,null,{"$f":"FH5+1","v":29},null,{"$f":"VLOOKUP(FN5,'Liste du personnel'!$B:$C,2,0)","v":"SOHAN"},null,null,null,{"$f":"FN5+1","v":30},null,{"$f":"VLOOKUP(FT5,'Liste du personnel'!$B:$C,2,0)","v":"NATHAN"},null,null,null,{"$f":"FT5+1","v":31},null,{"$f":"VLOOKUP(FZ5,'Liste du personnel'!$B:$C,2,0)","v":"KEVIN"},null,null,null,{"$f":"FZ5+1","v":32},null,{"$f":"VLOOKUP(GF5,'Liste du personnel'!$B:$C,2,0)","v":"GORKA"},null,null,null,{"$f":"GF5+1","v":33},null,{"$f":"VLOOKUP(GL5,'Liste du personnel'!$B:$C,2,0)","v":"JULIEN"},null,null,null,{"$f":"GL5+1","v":34},null,{"$f":"VLOOKUP(GR5,'Liste du personnel'!$B:$C,2,0)","v":"MARINE"},null,null,null,{"$f":"GR5+1","v":35},null,{"$f":"VLOOKUP(GX5,'Liste du personnel'!$B:$C,2,0)","v":"STEPHANE"},null,null,null,{"$f":"GX5+1","v":36},null,{"$f":"VLOOKUP(HD5,'Liste du personnel'!$B:$C,2,0)","v":"FRANCO"},null,null,null,{"$f":"HD5+1","v":37},null,{"$f":"VLOOKUP(HJ5,'Liste du personnel'!$B:$C,2,0)","v":"YASSINE"},null,null,null,{"$f":"HJ5+1","v":38},null,{"$f":"VLOOKUP(HP5,'Liste du personnel'!$B:$C,2,0)","v":"GABRIEL"},null,null,null,{"$f":"HP5+1","v":39},null,{"$f":"VLOOKUP(HV5,'Liste du personnel'!$B:$C,2,0)","v":"HAI"},null,null,null,{"$f":"HV5+1","v":40},null,{"$f":"VLOOKUP(IB5,'Liste du personnel'!$B:$C,2,0)","v":"DAVID"},null,null,null,{"$f":"IB5+1","v":41},null,{"$f":"VLOOKUP(IH5,'Liste du personnel'!$B:$C,2,0)","v":"KEPA"},null,null,null,{"$f":"IH5+1","v":42},null,{"$f":"VLOOKUP(IN5,'Liste du personnel'!$B:$C,2,0)","v":"DYLAN"},null,null,null,{"$f":"IN5+1","v":43},null,{"$f":"VLOOKUP(IT5,'Liste du personnel'!$B:$C,2,0)","v":"NANS"},null,null,null,{"$f":"IT5+1","v":44},null,{"$f":"VLOOKUP(IZ5,'Liste du personnel'!$B:$C,2,0)","v":"LEANDRE"},null,null,null,{"$f":"IZ5+1","v":45},null,{"$f":"VLOOKUP(JF5,'Liste du personnel'!$B:$C,2,0)","v":"NOEL"},null,null,null,{"$f":"JF5+1","v":46},null,{"$f":"VLOOKUP(JL5,'Liste du personnel'!$B:$C,2,0)","v":"GUILLAUME"},null,null,null,{"$f":"JL5+1","v":47},null,{"$f":"VLOOKUP(JR5,'Liste du personnel'!$B:$C,2,0)","v":"LOUIS"},null,null,null,{"$f":"JR5+1","v":48},null,{"$f":"VLOOKUP(JX5,'Liste du personnel'!$B:$C,2,0)","v":"MICHEL"},null,null,null,{"$f":"JX5+1","v":49},null,{"$f":"VLOOKUP(KD5,'Liste du personnel'!$B:$C,2,0)","v":"YANIS"},null,null,null,{"$f":"KD5+1","v":50},null,{"$f":"VLOOKUP(KJ5,'Liste du personnel'!$B:$C,2,0)","v":"JULES"},null,null,null,{"$f":"KJ5+1","v":51},null,{"$f":"VLOOKUP(KP5,'Liste du personnel'!$B:$C,2,0)","v":"SARAH"},null,null,null,{"$f":"KP5+1","v":52},null,{"$f":"VLOOKUP(KV5,'Liste du personnel'!$B:$C,2,0)","v":"CAMILLE"},null,null,null,{"$f":"KV5+1","v":53},null,{"$f":"VLOOKUP(LB5,'Liste du personnel'!$B:$C,2,0)","v":"NAYA"},null,null,null,{"$f":"LB5+1","v":54},null,{"$f":"VLOOKUP(LH5,'Liste du personnel'!$B:$C,2,0)","v":"MANON"},null,null,null,{"$f":"LH5+1","v":55},null,{"$f":"VLOOKUP(LN5,'Liste du personnel'!$B:$C,2,0)","v":"MAXIME"},null,null,null,{"$f":"LN5+1","v":56},null,{"$f":"VLOOKUP(LT5,'Liste du personnel'!$B:$C,2,0)","v":"YSEE"},null,null,null,{"$f":"LT5+1","v":57},null,{"$f":"VLOOKUP(LZ5,'Liste du personnel'!$B:$C,2,0)","v":"INES"},null,null,null,{"$f":"LZ5+1","v":58},null,{"$f":"VLOOKUP(MF5,'Liste du personnel'!$B:$C,2,0)","v":"GAELLE"},null,null,null,{"$f":"MF5+1","v":59},null,{"$f":"VLOOKUP(ML5,'Liste du personnel'!$B:$C,2,0)","v":"CLARA"},null,null,null,{"$f":"ML5+1","v":60},null,{"$f":"VLOOKUP(MR5,'Liste du personnel'!$B:$C,2,0)","v":"MARGAUX"},null,null,null,{"$f":"MR5+1","v":61},null,{"$f":"VLOOKUP(MX5,'Liste du personnel'!$B:$C,2,0)","v":"EMMA"},null,null,null,{"$f":"MX5+1","v":62},null,{"$f":"VLOOKUP(ND5,'Liste du personnel'!$B:$C,2,0)","v":"MELENA"},null,null,null,{"$f":"ND5+1","v":63},null,{"$f":"VLOOKUP(NJ5,'Liste du personnel'!$B:$C,2,0)","v":"RIHANA"},null,null,null,{"$f":"NJ5+1","v":64},null,{"$f":"VLOOKUP(NP5,'Liste du personnel'!$B:$C,2,0)","v":"MAITENA"},null,null,null,{"$f":"NP5+1","v":65},null,{"$f":"VLOOKUP(NV5,'Liste du personnel'!$B:$C,2,0)","v":"LAURA"},null,null,null,{"$f":"NV5+1","v":66},null,{"$f":"VLOOKUP(OB5,'Liste du personnel'!$B:$C,2,0)","v":"MYRIAM"},null,null,null,{"$f":"OB5+1","v":67},null,{"$f":"VLOOKUP(OH5,'Liste du personnel'!$B:$C,2,0)","v":"SALOME"},null,null,null,{"$f":"OH5+1","v":68},null,{"$f":"VLOOKUP(ON5,'Liste du personnel'!$B:$C,2,0)","v":"CHLOE"},null,null,null,{"$f":"ON5+1","v":69},null,{"$f":"VLOOKUP(OT5,'Liste du personnel'!$B:$C,2,0)","v":"CLAIRE"},null,null,null,{"$f":"OT5+1","v":70},null,{"$f":"VLOOKUP(OZ5,'Liste du personnel'!$B:$C,2,0)","v":"ANAYA"},null,null,null,{"$f":"OZ5+1","v":71},null,{"$f":"VLOOKUP(PF5,'Liste du personnel'!$B:$C,2,0)","v":"LAYANA"},null,null,null,{"$f":"PF5+1","v":72},null,{"$f":"VLOOKUP(PL5,'Liste du personnel'!$B:$C,2,0)","v":"LINA"},null,null,null,{"$f":"PL5+1","v":73},null,{"$f":"VLOOKUP(PR5,'Liste du personnel'!$B:$C,2,0)","v":"LISE"},null,null,null,{"$f":"PR5+1","v":74},null,{"$f":"VLOOKUP(PX5,'Liste du personnel'!$B:$C,2,0)","v":"NELIA"},null,null,null,{"$f":"PX5+1","v":75},null,{"$f":"VLOOKUP(QD5,'Liste du personnel'!$B:$C,2,0)","v":"CYPRINE"},null,null,null,{"$f":"QD5+1","v":76},null,{"$f":"VLOOKUP(QJ5,'Liste du personnel'!$B:$C,2,0)","v":"AMBRINE"},null,null,null,{"$f":"QJ5+1","v":77},null,{"$f":"VLOOKUP(QP5,'Liste du personnel'!$B:$C,2,0)","v":"ADELE"},null,null,null,{"$f":"QP5+1","v":78},null,{"$f":"VLOOKUP(QV5,'Liste du personnel'!$B:$C,2,0)","v":"JADE"},null,null,null,{"$f":"QV5+1","v":79},null,{"$f":"VLOOKUP(RB5,'Liste du personnel'!$B:$C,2,0)","v":"HAKIMA"},null,null,null,{"$f":"RB5+1","v":80},null,{"$f":"VLOOKUP(RH5,'Liste du personnel'!$B:$C,2,0)","v":"AGATHE"},null,null,null,{"$f":"RH5+1","v":81},null,{"$f":"VLOOKUP(RN5,'Liste du personnel'!$B:$C,2,0)","v":"AYANA"},null,null,null,{"$f":"RN5+1","v":82},null,{"$f":"VLOOKUP(RT5,'Liste du personnel'!$B:$C,2,0)","v":"UHAINA"},null,null,null,{"$f":"RT5+1","v":83},null,{"$f":"VLOOKUP(RZ5,'Liste du personnel'!$B:$C,2,0)","v":"ALICE"},null,null,null,{"$f":"RZ5+1","v":84},null,{"$f":"VLOOKUP(SF5,'Liste du personnel'!$B:$C,2,0)","v":"JODIE"},null,null,null,{"$f":"SF5+1","v":85},null,{"$f":"VLOOKUP(SL5,'Liste du personnel'!$B:$C,2,0)","v":"KENZA"},null,null,null,{"$f":"SL5+1","v":86},null,{"$f":"VLOOKUP(SR5,'Liste du personnel'!$B:$C,2,0)","v":"CYRILLE"},null,null,null,{"$f":"SR5+1","v":87},null,{"$f":"VLOOKUP(SX5,'Liste du personnel'!$B:$C,2,0)","v":"LEA"},null,null,null,{"$f":"SX5+1","v":88},null,{"$f":"VLOOKUP(TD5,'Liste du personnel'!$B:$C,2,0)","v":"STELLA"},null,null,null,{"$f":"TD5+1","v":89},null,{"$f":"VLOOKUP(TJ5,'Liste du personnel'!$B:$C,2,0)","v":"DOMITILLE"},null,null,null,{"$f":"TJ5+1","v":90},null,{"$f":"VLOOKUP(TP5,'Liste du personnel'!$B:$C,2,0)","v":"SOHANE"},null,null,null,{"$f":"TP5+1","v":91},null,{"$f":"VLOOKUP(TV5,'Liste du personnel'!$B:$C,2,0)","v":"PAULE"},null,null,null,{"$f":"TV5+1","v":92},null,{"$f":"VLOOKUP(UB5,'Liste du personnel'!$B:$C,2,0)","v":"ENA"},null,null,null,{"$f":"UB5+1","v":93},null,{"$f":"VLOOKUP(UH5,'Liste du personnel'!$B:$C,2,0)","v":"LAILA"},null,null,null,{"$f":"UH5+1","v":94},null,{"$f":"VLOOKUP(UN5,'Liste du personnel'!$B:$C,2,0)","v":"INTZA"},null,null,null,{"$f":"UN5+1","v":95},null,{"$f":"VLOOKUP(UT5,'Liste du personnel'!$B:$C,2,0)","v":"ALISON"},null,null,null,{"$f":"UT5+1","v":96},null,{"$f":"VLOOKUP(UZ5,'Liste du personnel'!$B:$C,2,0)","v":"OCEANE"},null,null,null,{"$f":"UZ5+1","v":97},null,{"$f":"VLOOKUP(VF5,'Liste du personnel'!$B:$C,2,0)","v":"HAIZE"},null,null,null,{"$f":"VF5+1","v":98},null,{"$f":"VLOOKUP(VL5,'Liste du personnel'!$B:$C,2,0)","v":"MAGGY"},null,null,null,{"$f":"VL5+1","v":99},null,{"$f":"VLOOKUP(VR5,'Liste du personnel'!$B:$C,2,0)","v":"MARIE"},null,null,null,{"$f":"VR5+1","v":100},null,{"$f":"VLOOKUP(VX5,'Liste du personnel'!$B:$C,2,0)","v":"NATHALIE"},null,null,null,{"$f":"VX5+1","v":101},null,{"$f":"VLOOKUP(WD5,'Liste du personnel'!$B:$C,2,0)","v":"fdp"},null,null,null,{"$f":"WD5+1","v":102},null,{"$f":"VLOOKUP(WJ5,'Liste du personnel'!$B:$C,2,0)","v":{"$error":"#N/A"}}]
[null,"Dates","Heures","N°Pers.","Produits","Quantités",null,"Dates","Heures","N°Pers.","Produits","Quantités",null,"Dates","Heures","N°Pers.","Produits","Quantités",null,"Dates","Heures","N°Pers.","Produits","Quantités",null,"Dates","Heures","N°Pers.","Produits","Quantités",null,"Dates","Heures","N°Pers.","Produits","Quantités",null,"Dates","Heures","N°Pers.","Produits","Quantités",null,"Dates","Heures","N°Pers.","Produits","Quantités",null,"Dates","Heures","N°Pers.","Produits","Quantités",null,"Dates","Heures","N°Pers.","Produits","Quantités",null,"Dates","Heures","N°Pers.","Produits","Quantités",null,"Dates","Heures","N°Pers.","Produits","Quantités",null,"Dates","Heures","N°Pers.","Produits","Quantités",null,"Dates","Heures","N°Pers.","Produits","Quantités",null,"Dates","Heures","N°Pers.","Produits","Quantités",null,"Dates","Heures","N°Pers.","Produits","Quantités",null,"Dates","Heures","N°Pers.","Produits","Quantités",null,"Dates","Heures","N°Pers.","Produits","Quantités",null,"Dates","Heures","N°Pers.","Produits","Quantités",null,"Dates","Heures","N°Pers.","Produits","Quantités",null,"Dates","Heures","N°Pers.","Produits","Quantités",null,"Dates","Heures","N°Pers.","Produits","Quantités",null,"Dates","Heures","N°Pers.","Produits","Quantités",null,"Dates","Heures","N°Pers.","Produits","Quantités",null,"Dates","Heures","N°Pers.","Produits","Quantités",null,"Dates","Heures","N°Pers.","Produits","Quantités",null,"Dates","Heures","N°Pers.","Produits","Quantités",null,"Dates","Heures","N°Pers.","Produits","Quantités",null,"Dates","Heures","N°Pers.","Produits","Quantités",null,"Dates","Heures","N°Pers.","Produits","Quantités",null,"Dates","Heures","N°Pers.","Produits","Quantités",null,"Dates","Heures","N°Pers.","Produits","Quantités",null,"Dates","Heures","N°Pers.","Produits","Quantités",null,"Dates","Heures","N°Pers.","Produits","Quantités",null,"Dates","Heures","N°Pers.","Produits","Quantités",null,"Dates","Heures","N°Pers.","Produits","Quantités",null,"Dates","Heures","N°Pers.","Produits","Quantités",null,"Dates","Heures","N°Pers.","Produits","Quantités",null,"Dates","Heures","N°Pers.","Produits","Quantités",null,"Dates","Heures","N°Pers.","Produits","Quantités",null,"Dates","Heures","N°Pers.","Produits","Quantités",null,"Dates","Heures","N°Pers.","Produits","Quantités",null,"Dates","Heures","N°Pers.","Produits","Quantités",null,"Dates","Heures","N°Pers.","Produits","Quantités",null,"Dates","Heures","N°Pers.","Produits","Quantités",null,"Dates","Heures","N°Pers.","Produits","Quantités",null,"Dates","Heures","N°Pers.","Produits","Quantités",null,"Dates","Heures","N°Pers.","Produits","Quantités",null,"Dates","Heures","N°Pers.","Produits","Quantités",null,"Dates","Heures","N°Pers.","Produits","Quantités",null,"Dates","Heures","N°Pers.","Produits","Quantités",null,"Dates","Heures","N°Pers.","Produits","Quantités",null,"Dates","Heures","N°Pers.","Produits","Quantités",null,"Dates","Heures","N°Pers.","Produits","Quantités",null,"Dates","Heures","N°Pers.","Produits","Quantités",null,"Dates","Heures","N°Pers.","Produits","Quantités",null,"Dates","Heures","N°Pers.","Produits","Quantités",null,"Dates","Heures","N°Pers.","Produits","Quantités",null,"Dates","Heures","N°Pers.","Produits","Quantités",null,"Dates","Heures","N°Pers.","Produits","Quantités",null,"Dates","Heures","N°Pers.","Produits","Quantités",null,"Dates","Heures","N°Pers.","Produits","Quantités",null,"Dates","Heures","N°Pers.","Produits","Quantités",null,"Dates","Heures","N°Pers.","Produits","Quantités",null,"Dates","Heures","N°Pers.","Produits","Quantités",null,"Dates","Heures","N°Pers.","Produits","Quantités",null,"Dates","Heures","N°Pers.","Produits","Quantités",null,"Dates","Heures","N°Pers.","Produits","Quantités",null,"Dates","Heures","N°Pers.","Produits","Quantités",null,"Dates","Heures","N°Pers.","Produits","Quantités",null,"Dates","Heures","N°Pers.","Produits","Quantités",null,"Dates","Heures","N°Pers.","Produits","Quantités",null,"Dates","Heures","N°Pers.","Produits","Quantités",null,"Dates","Heures","N°Pers.","Produits","Quantités",null,"Dates","Heures","N°Pers.","Produits","Quantités",null,"Dates","Heures","N°Pers.","Produits","Quantités",null,"Dates","Heures","N°Pers.","Produits","Quantités",null,"Dates","Heures","N°Pers.","Produits","Quantités",null,"Dates","Heures","N°Pers.","Produits","Quantités",null,"Dates","Heures","N°Pers.","Produits","Quantités",null,"Dates","Heures","N°Pers.","Produits","Quantités",null,"Dates","Heures","N°Pers.","Produits","Quantités",null,"Dates","Heures","N°Pers.","Produits","Quantités",null,"Dates","Heures","N°Pers.","Produits","Quantités",null,"Dates","Heures","N°Pers.","Produits","Quantités",null,"Dates","Heures","N°Pers.","Produits","Quantités",null,"Dates","Heures","N°Pers.","Produits","Quantités",null,"Dates","Heures","N°Pers.","Produits","Quantités",null,"Dates","Heures","N°Pers.","Produits","Quantités",null,"Dates","Heures","N°Pers.","Produits","Quantités",null,"Dates","Heures","N°Pers.","Produits","Quantités",null,"Dates","Heures","N°Pers.","Produits","Quantités",null,"Dates","Heures","N°Pers.","Produits","Quantités",null,"Dates","Heures","N°Pers.","Produits","Quantités",null,"Dates","Heures","N°Pers.","Produits","Quantités",null,"Dates","Heures","N°Pers.","Produits","Quantités",null,"Dates","Heures","N°Pers.","Produits","Quantités",null,"Dates","Heures","N°Pers.","Produits","Quantités",null,"Dates","Heures","N°Pers.","Produits","Quantités",null,"Dates","Heures","N°Pers.","Produits","Quantités",null,"Dates","Heures","N°Pers.","Produits","Quantités",null,"Dates","Heures","N°Pers.","Produits","Quantités"]

{"sheet":"Liste du personnel","index":2,"n_rows":104,"n_cols":3,"rows_kept":104,"cut":false,"hidden":false,"merged":[[1,1,1,2]]}
[]
[null,"Liste du personnel"]
[null,"N°Pers.","Noms"]
[null,1,"RAPHAEL"]
[null,2,"SAMUEL"]
[null,3,"ENZO"]
[null,4,"NICOLAS"]
[null,5,"HUGO"]
[null,6,"ANTOINE"]
[null,7,"FREDERIC"]
[null,8,"THEO"]
[null,9,"JEREMIE"]
[null,10,"ADOLPHE"]
[null,11,"MATHIS"]
[null,12,"ALEXANDRE"]
{"$rows_left_out":89}