{"text_format":"1","workbook":"xlsx","n_sheets":22,"sheets":["MENU","Antargaz","Primagaz","Butagaz","Totalgaz","Huiles_20180110","Huiles","Huilesveg","Neons_20180105","Neons","Ampoules","Piles","Cartouches","Pneus_20180108","Pneus","Registre_01","Registre_2","Registre_3","Registre_4","Registre_5","Registre_02","Registre"],"not_rendered":{"charts":0,"images":54,"macros":1,"external_links":0,"defined_names":62,"comments":0,"pivot_tables":0},"unopened":[],"bounds":{"document_bytes":16777216,"sheet_cells":100000,"rows_first":2000,"rows_last":500,"rows_between":2000,"halvings":0,"cell_chars":16384,"cell_head_chars":4096},"cells_cut":0,"cells_raw":0,"read":"whole","date_system":"1900"}

{"sheet":"MENU","index":0,"n_rows":0,"n_cols":0,"rows_kept":0,"cut":false,"hidden":false,"merged":[]}

{"sheet":"Antargaz","index":1,"n_rows":64,"n_cols":11,"rows_kept":64,"cut":false,"hidden":true,"merged":[[35,2,43,2],[44,2,45,2],[64,0,69,3],[64,4,69,7],[44,7,45,7],[44,3,45,3],[44,4,45,4],[44,5,45,5],[46,2,46,9],[64,8,69,11],[58,4,59,4],[58,5,59,5],[58,6,59,6],[51,6,57,6],[60,2,60,5],[63,0,63,3],[63,4,63,7],[63,8,63,11],[51,2,57,2],[58,2,59,2],[58,3,59,3],[12,0,13,11],[44,9,45,9],[44,10,45,10],[15,2,15,3],[15,4,15,6],[17,2,17,4],[21,2,21,4],[21,5,21,7],[23,3,23,7],[25,2,25,4],[25,5,25,10],[28,4,28,6],[30,4,30,6],[35,10,43,10],[32,5,32,6],[44,8,45,8]]}
[]
[]
[]
[]
[]
[]
[]
[]
[]
[]
[]
[]
["FORMULAIRE D'ENLEVEMENT"]
[]
[]
[null,null,"Date de la demande :"]
[]
[null,null,"Demandeur - nom de la déchetterie :",null,null,"NICE OUEST"]
[]
[null,null,"Compte :",70615043]
[]
[null,null,"Nom de la personne à contacter : ",null,null,"Mr Peters ou Mr Quenin"]
[]
[null,null,"Tél : ","06/64/48/10/08 ou 06/65/53/22/23"]
[]
[null,null,"Adresse du site de récupération : ",null,null,"DECHETTERIE DE NICE EST - Angle Bd Jean Baptiste Vérany / Rue Georges Chapel"]
[]
[]
[null,null,"Jours d'ouverture :",null,"L - M - M - J - V - S - D"]
[]
[null,null,"Heures d'ouverture : ",null,"8H30 – 11H45 et 14H30 – 17H"]
[]
[]
[]
[]
[null,null,"Exemples de\nbouteilles\nAntagaz",null,null,null,null,null,null,null,"Total"]
[]
[]
[]
[]
[]
[]
[]
[]
[null,null,"Nombre de\nbouteilles à\nrécupérer",null,null,null,null,null,null,null,{"$f":"D45+E45+F45+G45+H45+I45+J45","v":0}]
[]
[null,null,"Nombre de bouteilles récupérées.\nA remplir par\nle chauffeur"]
[]
[]
[]
[]
[null,null,"Exemples de\nbouteilles\nAntagaz",null,null,null,"Total"]
[]
[]
[]
[]
[]
[]
[null,null,"Nombre de\nbouteilles à\nrécupérer",null,null,null,{"$f":"D59+E59+F59","v":0}]
[]
[null,null,"Nombre de bouteilles récupérées.\nA remplir par\nle chauffeur"]
[]
[]
["Date de reprise",null,null,null,"Nom et signature du Chauffeur",null,null,null,"Nom et signature de la déchetterie"]

{"sheet":"Primagaz","index":2,"n_rows":55,"n_cols":11,"rows_kept":55,"cut":false,"hidden":true,"merged":[[14,1,14,9],[15,2,15,3],[15,4,15,6],[17,2,17,4],[34,3,40,3],[34,4,40,4],[34,5,40,5],[34,6,40,6],[20,2,20,4],[20,5,20,7],[22,3,22,7],[24,2,24,4],[24,5,24,10],[55,0,60,3],[55,4,60,7],[55,8,60,11],[12,0,13,11],[34,10,40,10],[42,2,42,9],[50,2,50,7],[54,0,54,3],[54,4,54,7],[54,8,54,11],[34,7,40,7],[34,8,40,8],[34,9,40,9],[34,2,40,2],[27,4,27,6],[29,4,29,6]]}
[]
[]
[]
[]
[]
[]
[]
[]
[]
[]
[]
[]
["FORMULAIRE D'ENLEVEMENT"]
[]
[]
[null,null,"Date de la demande :"]
[]
[null,null,"Demandeur - nom de la déchetterie :",null,null,"NICE OUEST"]
[]
[]
[null,null,"Nom de la personne à contacter : ",null,null,"Mr Peters ou Mr Quenin"]
[]
[null,null,"Tél : ","06/64/48/10/08 ou 06/65/53/22/23"]
[]
[null,null,"Adresse du site de récupération : ",null,null,"DECHETTERIE DE NICE EST - Angle Bd Jean Baptiste Vérany / Rue Georges Chapel"]
[]
[]
[null,null,"Jours d'ouverture :",null,"L - M - M - J - V - S - D"]
[]
[null,null,"Heures d'ouverture : ",null,"8H30 – 11H45 et 14H30 – 17H"]
[]
[]
[]
[]
[null,null,"Exemples de\nbouteilles\nPrimagaz",null,null,null,null,null,null,null,"Total"]
[]
[]
[]
[]
[]
[]
[null,null,"Nombre de\nbouteilles à\nrécupérer",null,null,null,null,null,null,null,{"$f":"D42+E42+F42+G42+H42+I42+J42","v":0}]
[null,null,"Nombre de bouteilles récupérées.\nA remplir par le chauffeur"]
[]
[]
[]
[]
[]
[null,null,"Exemples de Bouteilles\nPrimagaz",null,null,null,null,null,"Total"]
[null,null,"Nombre de\nbouteilles à\nrécupérer",null,null,null,null,null,{"$f":"D50+E50+F50+G50+H50","v":0}]
[null,null,"Nombre de bouteilles récupérées.\nA remplir par le chauffeur"]
[]
[]
[]
["Date de reprise",null,null,null,"Nom et signature du Chauffeur",null,null,null,"Nom et signature de la déchetterie"]

{"sheet":"Butagaz","index":3,"n_rows":49,"n_cols":9,"rows_kept":49,"cut":false,"hidden":true,"merged":[[48,8,48,11],[49,0,54,3],[49,4,54,7],[49,8,54,11],[43,5,43,7],[34,7,41,7],[44,5,44,6],[48,0,48,3],[48,4,48,7],[29,4,29,6],[12,0,13,11],[22,3,22,7],[24,2,24,4],[24,5,24,10],[27,4,27,6],[15,2,15,3],[15,4,15,6],[17,2,17,4],[20,2,20,4],[20,5,20,7]]}
[]
[]
[]
[]
[]
[]
[]
[]
[]
[]
[]
[]
["FORMULAIRE D'ENLEVEMENT"]
[]
[]
[null,null,"Date de la demande :"]
[]
[null,null,"Demandeur - nom de la déchetterie :",null,null,"NICE OUEST"]
[]
[]
[null,null,"Nom de la personne à contacter : ",null,null,"Mr Peters ou Mr Quenin"]
[]
[null,null,"Tél : ","06/64/48/10/08 ou 06/65/53/22/23"]
[]
[null,null,"Adresse du site de récupération : ",null,null,"DECHETTERIE DE NICE EST - Angle Bd Jean Baptiste Vérany / Rue Georges Chapel"]
[]
[]
[null,null,"Jours d'ouverture :",null,"L - M - M - J - V - S - D"]
[]
[null,null,"Heures d'ouverture : ",null,"8H30 – 11H45 et 14H30 – 17H"]
[]
[]
[]
[null,null,null,null,null,"+ / -","Nbr de bouteilles\nà récupérer","Nbr de bouteilles\nrécupérées.\nA remplir par le chauffeur"]
[null,null,null,null,null,"13 kg \nbutane"]
[null,null,null,null,null,"13 kg \npropane"]
[null,null,null,null,null,"13 kg \ncarburation"]
[null,null,null,null,null,"35 kg \npropane"]
[null,null,null,null,null,"viseo"]
[null,null,null,null,null,"10 kg \nbutane"]
[null,null,null,null,null,"Cube \n6 kg butane"]
[null,null,null,null,null,"Cube \n5 kg propane"]
[null,null,null,null,null,"Total",{"$f":"G35+G36+G37+G38+G39+G40+G41+G42","v":0}]
[null,null,null,null,null,"MERCI de COLLECTER LE RELIQUAT"]
[]
[]
[]
[]
["Date de reprise",null,null,null,"Nom et signature du Chauffeur",null,null,null,"Nom et signature de la déchetterie"]

{"sheet":"Totalgaz","index":4,"n_rows":49,"n_cols":11,"rows_kept":49,"cut":false,"hidden":true,"merged":[[37,2,37,9],[12,0,13,11],[48,8,48,11],[49,0,54,3],[49,4,54,7],[49,8,54,11],[15,2,15,3],[15,4,15,6],[17,2,17,4],[21,2,21,4],[21,5,21,7],[23,3,23,7],[25,2,25,4],[25,5,25,10],[28,4,28,6],[30,4,30,6],[48,0,48,3],[48,4,48,7],[43,2,43,6]]}
[]
[]
[]
[]
[]
[]
[]
[]
[]
[]
[]
[]
["FORMULAIRE D'ENLEVEMENT"]
[]
[]
[null,null,"Date de la demande :"]
[]
[null,null,"Demandeur - nom de la déchetterie :",null,null,"NICE OUEST"]
[]
[null,null,"Compte :",80615450]
[]
[null,null,"Nom de la personne à contacter : ",null,null,"Mr Peters ou Mr Quenin"]
[]
[null,null,"Tél : ","06/64/48/10/08 ou 06/65/53/22/23"]
[]
[null,null,"Adresse du site de récupération : ",null,null,"DECHETTERIE DE NICE EST - Angle Bd Jean Baptiste Vérany / Rue Georges Chapel"]
[]
[]
[null,null,"Jours d'ouverture :",null,"L - M - M - J - V - S - D"]
[]
[null,null,"Heures d'ouverture : ",null,"8H30 – 11H45 et 14H30 – 17H"]
[]
[]
[]
[null,null,"Exemples de\nbouteilles\nTotalgaz"]
[null,null,null,"6kg","10kg","13kg","5kg","13kg","13kg","35kg","Total"]
[null,null,"Nombre de\nbouteilles à\nrécupérer",null,null,null,null,null,null,null,{"$f":"SUM(D37:J37)","v":0}]
[null,null,"Nombre de bouteilles récupérées.\nA remplir par\nle chauffeur"]
[]
[]
[null,null,"Exemples de\nbouteilles\nSogasud\net Repsol",null,null,null,"Autres marques\ndes bouteilles\nrattachées"]
[null,null,null,"12,5kg","11kg","35kg",null,null,null,null,"Total"]
[null,null,"Nombre de\nbouteilles à\nrécupérer",null,null,null,null,null,null,null,{"$f":"D43+E43+F43+H43","v":0}]
[null,null,"Nombre de bouteilles récupérées.\nA remplir par\nle chauffeur"]
[]
[]
[]
[]
["Date de reprise",null,null,null,"Nom et signature du Chauffeur",null,null,null,"Nom et signature de la déchetterie"]

{"sheet":"Huiles_20180110","index":5,"n_rows":64,"n_cols":10,"rows_kept":64,"cut":false,"hidden":false,"merged":[[62,0,62,1],[62,2,62,4],[62,5,62,8],[62,9,62,11],[63,0,68,1],[63,2,68,4],[63,5,68,8],[63,9,68,11],[31,4,31,8],[12,0,13,11],[14,1,14,9],[15,2,15,3],[15,4,15,6],[17,2,17,4],[20,2,20,4],[20,5,20,7],[22,3,22,7],[24,2,24,4],[24,5,24,10],[27,4,27,6],[29,4,29,6]]}
[]
[]
[]
[]
[]
[]
[]
[]
[]
[]
[]
[]
["FORMULAIRE D'ENLEVEMENT"]
[]
[]
[null,null,"Date de la demande :",null,"2018-01-10"]
[]
[null,null,"Demandeur - nom de la déchetterie :",null,null,"NICE OUEST"]
[]
[]
[null,null,"Nom de la personne à contacter : ",null,null,"Mr Peters ou Mr Reynaud"]
[]
[null,null,"Tél : ","06/64/48/10/08 "]
[]
[null,null,"Adresse du site de récupération : ",null,null,"DECHETTERIE DE NICE OUEST- Angle Av Ste Marguerite / Traverse des Arboras"]
[]
[]
[null,null,"Jours d'ouverture :",null,"L - M - M - J - V - S - D"]
[]
[null,null,"Heures d'ouverture : ",null,"8H30 – 11H45 et 14H30 – 17H"]
[]
[null,null,null,null,"HUILES DE VIDANGES"]
[]
[]
[]
[]
[]
[]
[]
[]
[]
[]
[]
[]
[]
[]
[]
[]
[]
[]
[]
[]
[]
[]
[]
[]
[]
[]
[]
[]
[]
[]
["Date de reprise",null,"Nom et signature du Chauffeur",null,null,"Nom et signature de la déchetterie",null,null,null,"N°Fiche Intervention"]
["2018-01-11",null,null,null,null,null,null,null,null,"0088899A"]

{"sheet":"Huiles","index":6,"n_rows":63,"n_cols":10,"rows_kept":63,"cut":false,"hidden":false,"merged":[[62,0,62,1],[62,2,62,4],[62,5,62,8],[62,9,62,11],[63,0,68,1],[63,2,68,4],[63,5,68,8],[63,9,68,11],[31,4,31,8],[12,0,13,11],[14,1,14,9],[15,2,15,3],[15,4,15,6],[17,2,17,4],[20,2,20,4],[20,5,20,7],[22,3,22,7],[24,2,24,4],[24,5,24,10],[27,4,27,6],[29,4,29,6]]}
[]
[]
[]
[]
[]
[]
[]
[]
[]
[]
[]
[]
["FORMULAIRE D'ENLEVEMENT"]
[]
[]
[null,null,"Date de la demande :"]
[]
[null,null,"Demandeur - nom de la déchetterie :",null,null,"NICE OUEST"]
[]
[]
[null,null,"Nom de la personne à contacter : ",null,null,"Mr Peters ou Mr Reynaud"]
[]
[null,null,"Tél : ","06/64/48/10/08 "]
[]
[null,null,"Adresse du site de récupération : ",null,null,"DECHETTERIE DE NICE OUEST- Angle Av Ste Marguerite / Traverse des Arboras"]
[]
[]
[null,null,"Jours d'ouverture :",null,"L - M - M - J - V - S - D"]
[]
[null,null,"Heures d'ouverture : ",null,"8H30 – 11H45 et 14H30 – 17H"]
[]
[null,null,null,null,"HUILES DE VIDANGES"]
[]
[]
[]
[]
[]
[]
[]
[]
[]
[]
[]
[]
[]
[]
[]
[]
[]
[]
[]
[]
[]
[]
[]
[]
[]
[]
[]
[]
[]
[]
["Date de reprise",null,"Nom et signature du Chauffeur",null,null,"Nom et signature de la déchetterie",null,null,null,"N°Fiche Intervention"]

{"sheet":"Huilesveg","index":7,"n_rows":63,"n_cols":10,"rows_kept":63,"cut":false,"hidden":false,"merged":[[62,0,62,1],[62,2,62,4],[62,5,62,8],[62,9,62,11],[63,0,68,1],[63,2,68,4],[63,5,68,8],[63,9,68,11],[31,4,31,8],[12,0,13,11],[14,1,14,9],[15,2,15,3],[15,4,15,6],[17,2,17,4],[20,2,20,4],[20,5,20,7],[22,3,22,7],[24,2,24,4],[24,5,24,10],[27,4,27,6],[29,4,29,6]]}
[]
[]
[]
[]
[]
[]
[]
[]
[]
[]
[]
[]
["FORMULAIRE D'ENLEVEMENT"]
[]
[]
[null,null,"Date de la demande :"]
[]
[null,null,"Demandeur - nom de la déchetterie :",null,null,"NICE OUEST"]
[]
[]
[null,null,"Nom de la personne à contacter : ",null,null,"Mr Peters ou Mr Reynaud"]
[]
[null,null,"Tél : ","06/64/48/10/08 "]
[]
[null,null,"Adresse du site de récupération : ",null,null,"DECHETTERIE DE NICE OUEST- Angle Av Ste Marguerite / Traverse des Arboras"]
[]
[]
[null,null,"Jours d'ouverture :",null,"L - M - M - J - V - S - D"]
[]
[null,null,"Heures d'ouverture : ",null,"8H30 – 11H45 et 14H30 – 17H"]
[]
[null,null,null,null,"HUILES VEGETALES"]
[]
[]
[]
[]
[]
[]
[]
[]
[]
[]
[]
[]
[]
[]
[]
[]
[]
[]
[]
[]
[]
[]
[]
[]
[]
[]
[]
[]
[]
[]
["Date de reprise",null,"Nom et signature du Chauffeur",null,null,"Nom et signature de la déchetterie",null,null,null,"N°Fiche Intervention"]

{"sheet":"Neons_20180105","index":8,"n_rows":64,"n_cols":10,"rows_kept":64,"cut":false,"hidden":false,"merged":[[63,0,68,1],[63,2,68,4],[63,5,68,8],[63,9,68,11],[52,4,52,8],[53,4,58,8],[62,0,62,1],[62,2,62,4],[62,5,62,8],[62,9,62,11],[31,4,31,8],[12,0,13,11],[14,1,14,9],[15,2,15,3],[15,4,15,6],[17,2,17,4],[20,2,20,4],[20,5,20,7],[22,3,22,7],[24,2,24,4],[24,5,24,10],[27,4,27,6],[29,4,29,6]]}
[]
[]
[]
[]
[]
[]
[]
[]
[]
[]
[]
[]
["FORMULAIRE D'ENLEVEMENT"]
[]
[]
[null,null,"Date de la demande :",null,"2018-01-05"]
[]
[null,null,"Demandeur - nom de la déchetterie :",null,null,"NICE OUEST"]
[]
[]
[null,null,"Nom de la personne à contacter : ",null,null,"Mr Peters ou Mr Reynaud"]
[]
[null,null,"Tél : ","06/64/48/10/08 "]
[]
[null,null,"Adresse du site de récupération : ",null,null,"DECHETTERIE DE NICE OUEST- Angle Av Ste Marguerite / Traverse des Arboras"]
[]
[]
[null,null,"Jours d'ouverture :",null,"L - M - M - J - V - S - D"]
[]
[null,null,"Heures d'ouverture : ",null,"8H30 – 11H45 et 14H30 – 17H"]
[]
[null,null,null,null,"TUBES FLUORESCENTS"]
[]
[]
[]
[]
[]
[]
[]
[]
[]
[]
[]
[]
[]
[]
[]
[]
[]
[]
[]
[]
[null,null,null,null,"NUMERO DU BAC"]
[]
[]
[]
[]
[]
[]
[]
[]
[]
["Date de reprise",null,"Nom et signature du Chauffeur",null,null,"Nom et signature de la déchetterie",null,null,null,"N°Fiche Intervention"]
["2018-01-08",null,null,null,null,"AUDIBERT",null,null,null,"265116E"]

{"sheet":"Neons","index":9,"n_rows":64,"n_cols":10,"rows_kept":64,"cut":false,"hidden":false,"merged":[[62,0,62,1],[62,2,62,4],[62,5,62,8],[62,9,62,11],[63,0,68,1],[63,2,68,4],[63,5,68,8],[63,9,68,11],[20,2,20,4],[20,5,20,7],[12,0,13,11],[14,1,14,9],[15,2,15,3],[15,4,15,6],[17,2,17,4],[52,4,52,8],[31,4,31,8],[53,4,58,8],[22,3,22,7],[24,2,24,4],[24,5,24,10],[27,4,27,6],[29,4,29,6]]}
[]
[]
[]
[]
[]
[]
[]
[]
[]
[]
[]
[]
["FORMULAIRE D'ENLEVEMENT"]
[]
[]
[null,null,"Date de la demande :",null,"2018-01-26"]
[]
[null,null,"Demandeur - nom de la déchetterie :",null,null,"NICE OUEST"]
[]
[]
[null,null,"Nom de la personne à contacter : ",null,null,"Mr Peters ou Mr Reynaud"]
[]
[null,null,"Tél : ","06/64/48/10/08 "]
[]
[null,null,"Adresse du site de récupération : ",null,null,"DECHETTERIE DE NICE OUEST- Angle Av Ste Marguerite / Traverse des Arboras"]
[]
[]
[null,null,"Jours d'ouverture :",null,"L - M - M - J - V - S - D"]
[]
[null,null,"Heures d'ouverture : ",null,"8H30 – 11H45 et 14H30 – 17H"]
[]
[null,null,null,null,"TUBES FLUORESCENTS"]
[]
[]
[]
[]
[]
[]
[]
[]
[]
[]
[]
[]
[]
[]
[]
[]
[]
[]
[]
[]
[null,null,null,null,"NUMERO DU BAC"]
[null,null,null,null,614016409]
[]
[]
[]
[]
[]
[]
[]
[]
["Date de reprise",null,"Nom et signature du Chauffeur",null,null,"Nom et signature de la déchetterie",null,null,null,"N°Fiche Intervention"]
["2018-01-31",null,null,null,null,null,null,null,null,614016409]

{"sheet":"Ampoules","index":10,"n_rows":63,"n_cols":10,"rows_kept":63,"cut":false,"hidden":false,"merged":[[31,4,31,8],[52,4,52,8],[53,4,58,8],[62,0,62,1],[62,2,62,4],[62,5,62,8],[22,3,22,7],[24,2,24,4],[24,5,24,10],[27,4,27,6],[29,4,29,6],[20,2,20,4],[20,5,20,7],[12,0,13,11],[14,1,14,9],[15,2,15,3],[15,4,15,6],[17,2,17,4],[62,9,62,11],[63,0,68,1],[63,2,68,4],[63,5,68,8],[63,9,68,11]]}
[]
[]
[]
[]
[]
[]
[]
[]
[]
[]
[]
[]
["FORMULAIRE D'ENLEVEMENT"]
[]
[]
[null,null,"Date de la demande :"]
[]
[null,null,"Demandeur - nom de la déchetterie :",null,null,"NICE OUEST"]
[]
[]
[null,null,"Nom de la personne à contacter : ",null,null,"Mr Peters ou Mr Reynaud"]
[]
[null,null,"Tél : ","06/64/48/10/08 "]
[]
[null,null,"Adresse du site de récupération : ",null,null,"DECHETTERIE DE NICE OUEST- Angle Av Ste Marguerite / Traverse des Arboras"]
[]
[]
[null,null,"Jours d'ouverture :",null,"L - M - M - J - V - S - D"]
[]
[null,null,"Heures d'ouverture : ",null,"8H30 – 11H45 et 14H30 – 17H"]
[]
[null,null,null,null,"AMPOULES BASSE CONSOMMATION"]
[]
[]
[]
[]
[]
[]
[]
[]
[]
[]
[]
[]
[]
[]
[]
[]
[]
[]
[]
[]
[null,null,null,null,"NUMERO DU BAC"]
[]
[]
[]
[]
[]
[]
[]
[]
[]
["Date de reprise",null,"Nom et signature du Chauffeur",null,null,"Nom et signature de la déchetterie",null,null,null,"N°Fiche Intervention"]

{"sheet":"Piles","index":11,"n_rows":63,"n_cols":10,"rows_kept":63,"cut":false,"hidden":false,"merged":[[31,4,31,8],[52,4,52,6],[52,7,52,8],[62,0,62,1],[62,2,62,4],[62,5,62,8],[22,3,22,7],[24,2,24,4],[24,5,24,10],[27,4,27,6],[29,4,29,6],[20,2,20,4],[20,5,20,7],[12,0,13,11],[14,1,14,9],[15,2,15,3],[15,4,15,6],[17,2,17,4],[62,9,62,11],[63,0,68,1],[63,2,68,4],[63,5,68,8],[63,9,68,11]]}
[]
[]
[]
[]
[]
[]
[]
[]
[]
[]
[]
[]
["FORMULAIRE D'ENLEVEMENT"]
[]
[]
[null,null,"Date de la demande :"]
[]
[null,null,"Demandeur - nom de la déchetterie :",null,null,"NICE OUEST"]
[]
[]
[null,null,"Nom de la personne à contacter : ",null,null,"Mr Peters ou Mr Reynaud"]
[]
[null,null,"Tél : ","06/64/48/10/08 "]
[]
[null,null,"Adresse du site de récupération : ",null,null,"DECHETTERIE DE NICE OUEST- Angle Av Ste Marguerite / Traverse des Arboras"]
[]
[]
[null,null,"Jours d'ouverture :",null,"L - M - M - J - V - S - D"]
[]
[null,null,"Heures d'ouverture : ",null,"8H30 – 11H45 et 14H30 – 17H"]
[]
[null,null,null,null,"PILES USAGEES"]
[]
[]
[]
[]
[]
[]
[]
[]
[]
[]
[]
[]
[]
[]
[]
[]
[]
[]
[]
[]
[null,null,null,null,"NBR DE FUTS"]
[]
[]
[]
[]
[]
[]
[]
[]
[]
["Date de reprise",null,"Nom et signature du Chauffeur",null,null,"Nom et signature de la déchetterie",null,null,null,"N°Fiche Intervention"]

{"sheet":"Cartouches","index":12,"n_rows":63,"n_cols":10,"rows_kept":63,"cut":false,"hidden":false,"merged":[[31,4,31,8],[52,4,52,6],[52,7,52,8],[62,0,62,1],[62,2,62,4],[62,5,62,8],[22,3,22,7],[24,2,24,4],[24,5,24,10],[27,4,27,6],[29,4,29,6],[20,2,20,4],[20,5,20,7],[12,0,13,11],[14,1,14,9],[15,2,15,3],[15,4,15,6],[17,2,17,4],[62,9,62,11],[63,0,68,1],[63,2,68,4],[63,5,68,8],[63,9,68,11]]}
[]
[]
[]
[]
[]
[]
[]
[]
[]
[]
[]
[]
["FORMULAIRE D'ENLEVEMENT"]
[]
[]
[null,null,"Date de la demande :"]
[]
[null,null,"Demandeur - nom de la déchetterie :",null,null,"NICE OUEST"]
[]
[]
[null,null,"Nom de la personne à contacter : ",null,null,"Mr Peters ou Mr Reynaud"]
[]
[null,null,"Tél : ","06/64/48/10/08 "]
[]
[null,null,"Adresse du site de récupération : ",null,null,"DECHETTERIE DE NICE OUEST- Angle Av Ste Marguerite / Traverse des Arboras"]
[]
[]
[null,null,"Jours d'ouverture :",null,"L - M - M - J - V - S - D"]
[]
[null,null,"Heures d'ouverture : ",null,"8H30 – 11H45 et 14H30 – 17H"]
[]
[null,null,null,null,"CARTOUCHES D'ENCRE"]
[]
[]
[]
[]
[]
[]
[]
[]
[]
[]
[]
[]
[]
[]
[]
[]
[]
[]
[]
[]
[null,null,null,null,"NBR DE BACS"]
[]
[]
[]
[]
[]
[]
[]
[]
[]
["Date de reprise",null,"Nom et signature du Chauffeur",null,null,"Nom et signature de la déchetterie",null,null,null,"N°Fiche Intervention"]

{"sheet":"Pneus_20180108","index":13,"n_rows":63,"n_cols":10,"rows_kept":63,"cut":false,"hidden":false,"merged":[[63,0,68,1],[63,2,68,4],[63,5,68,8],[63,9,68,11],[52,4,52,6],[52,7,52,8],[62,0,62,1],[62,2,62,4],[62,5,62,8],[62,9,62,11],[31,4,31,8],[12,0,13,11],[14,1,14,9],[15,2,15,3],[15,4,15,6],[17,2,17,4],[20,2,20,4],[20,5,20,7],[22,3,22,7],[24,2,24,4],[24,5,24,10],[27,4,27,6],[29,4,29,6]]}
[]
[]
[]
[]
[]
[]
[]
[]
[]
[]
[]
[]
["FORMULAIRE D'ENLEVEMENT"]
[]
[]
[null,null,"Date de la demande :",null,"2018-01-08"]
[]
[null,null,"Demandeur - nom de la déchetterie :",null,null,"NICE OUEST"]
[]
[]
[null,null,"Nom de la personne à contacter : ",null,null,"Mr Peters ou Mr Reynaud"]
[]
[null,null,"Tél : ","06/64/48/10/08 "]
[]
[null,null,"Adresse du site de récupération : ",null,null,"DECHETTERIE DE NICE OUEST- Angle Av Ste Marguerite / Traverse des Arboras"]
[]
[]
[null,null,"Jours d'ouverture :",null,"L - M - M - J - V - S - D"]
[]
[null,null,"Heures d'ouverture : ",null,"8H30 – 11H45 et 14H30 – 17H"]
[]
[null,null,null,null,"PNEUS USAGES"]
[]
[]
[]
[]
[]
[]
[]
[]
[]
[]
[]
[]
[]
[]
[]
[]
[]
[]
[]
[]
[null,null,null,null,"NBR DE PNEUS",null,null,100]
[]
[]
[]
[]
[]
[]
[]
[]
[]
["Date de reprise",null,"Nom et signature du Chauffeur",null,null,"Nom et signature de la déchetterie",null,null,null,"N°Fiche Intervention"]

{"sheet":"Pneus","index":14,"n_rows":63,"n_cols":10,"rows_kept":63,"cut":false,"hidden":false,"merged":[[20,2,20,4],[20,5,20,7],[12,0,13,11],[14,1,14,9],[15,2,15,3],[15,4,15,6],[17,2,17,4],[31,4,31,8],[52,4,52,6],[52,7,52,8],[62,0,62,1],[62,2,62,4],[62,5,62,8],[22,3,22,7],[24,2,24,4],[24,5,24,10],[27,4,27,6],[29,4,29,6],[62,9,62,11],[63,0,68,1],[63,2,68,4],[63,5,68,8],[63,9,68,11]]}
[]
[]
[]
[]
[]
[]
[]
[]
[]
[]
[]
[]
["FORMULAIRE D'ENLEVEMENT"]
[]
[]
[null,null,"Date de la demande :"]
[]
[null,null,"Demandeur - nom de la déchetterie :",null,null,"NICE OUEST"]
[]
[]
[null,null,"Nom de la personne à contacter : ",null,null,"Mr Peters ou Mr Reynaud"]
[]
[null,null,"Tél : ","06/64/48/10/08 "]
[]
[null,null,"Adresse du site de récupération : ",null,null,"DECHETTERIE DE NICE OUEST- Angle Av Ste Marguerite / Traverse des Arboras"]
[]
[]
[null,null,"Jours d'ouverture :",null,"L - M - M - J - V - S - D"]
[]
[null,null,"Heures d'ouverture : ",null,"8H30 – 11H45 et 14H30 – 17H"]
[]
[null,null,null,null,"PNEUS USAGES"]
[]
[]
[]
[]
[]
[]
[]
[]
[]
[]
[]
[]
[]
[]
[]
[]
[]
[]
[]
[]
[null,null,null,null,"NBR DE PNEUS"]
[]
[]
[]
[]
[]
[]
[]
[]
[]
["Date de reprise",null,"Nom et signature du Chauffeur",null,null,"Nom et signature de la déchetterie",null,null,null,"N°Fiche Intervention"]

{"sheet":"Registre_01","index":15,"n_rows":83,"n_cols":14,"rows_kept":83,"cut":false,"hidden":false,"merged":[[25,11,25,12],[17,11,17,12]]}
["Date d'enlèvement","Nature du déchets","Quantité de déchets\n (en kg)","Unité","Installation de destination \n(nom et adresse)","Transporteur ","Immatriculation","Fiche d'intervention","Signature"]
["2018-01-02","TOUT VENANT",null,null,{"$f":"IF(B2=\"TOUT VENANT\",\"Véolia Nice Tri - Parc d'activité logistique\",IF(B2=\"DECHETS VERTS\",\"Orédui Carros Compostage - ZI de la Grave\",IF(B2=\"GRAVATS PROPRES\",\"La Gaude K3 Sita Sud - 5211 Rte de St Jeannet\",IF(B2=\"GRAVATS SALES\",\"Véolia Nice Tri - 20 Ch du Saquier\",IF(B2=\"BOIS\",\"SEAS La Glacière - 1019 Rte de la Grasse\",IF(B2=\"METAUX\",\"PURFER - ZI Carros 15ème Rue - 06517 Carros\",IF(B2=\"BATTERIES\",\"PURFER - ZI Carros 15ème Rue - 06517 Carros\",IF(B2=\"NEON\",\"Sofovar - 126 Av Louis Lépine - 83600 Fréjus\",IF(B2=\"PEINTURES\",\"Orédui - ZI Bois de Grasse - 06310 Grasse\",IF(B2=\"PRODUITS NON IDENTIFIES\",\"Orédui - ZI Bois de Grasse - 06310 Grasse\",IF(B2=\"AEROSOLS\",\"Orédui - ZI Bois de Grasse - 06310 Grasse\",IF(B2=\"FROIDS\",\"SEAS - 1079 Rte de Grasse - 06270 Villeneuve Loubet\",IF(B2=\"HORS FROIDS\",\"SEAS - 1079 Rte de Grasse - 06270 Villeneuve Loubet\",IF(B2=\"PAM\",\"SEAS - 1079 Rte de Grasse - 06270 Villeneuve Loubet\",IF(B2=\"ECRANS\",\"SEAS - 1079 Rte de Grasse - 06270 Villeneuve Loubet\",IF(B2=\"BOX HORS FROIDS\",\"SEAS - 1079 Rte de Grasse - 06270 Villeneuve Loubet\",IF(B2=\"PILES\",\"Corepile\",IF(B2=\"CUMULUS\",\"SEAS - 1079 Rte de Grasse - 06270 Villeneuve Loubet\",IF(B2=\"PNEUS\",\"TFM Pneus - 117 Ch Clausonnes - 06560 Valbonne\",IF(B2=\"HUILES VEGETALES\",\"Orédui - ZI Bois de Grasse - 06310 Grasse\",IF(B2=\"HUILES DE VIDANGE\",\"SERAHU - 68 Ch de la Campanette - 06800 Cagnes sur Mer\")))))))))))))))))))))","v":"Véolia Nice Tri - Parc d'activité logistique"},{"$f":"IF(OR(B2=\"TOUT VENANT\",B2=\"DECHETS VERTS\",B2=\"GRAVATS SALES\",B2=\"GRAVATS PROPRES\",B2=\"BOIS\"),\"SUEZ\",IF(OR(B2=\"PNEUS\"),\"TFM\",IF(OR(B2=\"FROIDS\",B2=\"HORS FROIDS\",B2=\"BOX HORS FROIDS\",B2=\"CUMULUS\",B2=\"PAM\",B2=\"ECRANS\"),\"SEAS\",IF(OR(B2=\"METAUX\",B2=\"BATTERIES\"),\"DERICHEBOURG\",IF(OR(B2=\"NEON\"),\"SOFOVAR\",IF(OR(B2=\"PEINTURES\",B2=\"PRODUITS NON IDENTIFIES\",B2=\"AEROSOLS\",B2=\"HUILES VEGETALES\"),\"OREDUI\",IF(OR(B2=\"HUILES DE VIDANGE\"),\"SERAHU\")))))))","v":"SUEZ"},null,"B0300473502"]
["2018-01-02","GRAVATS SALES",null,null,{"$f":"IF(B3=\"TOUT VENANT\",\"Véolia Nice Tri - Parc d'activité logistique\",IF(B3=\"DECHETS VERTS\",\"Orédui Carros Compostage - ZI de la Grave\",IF(B3=\"GRAVATS PROPRES\",\"La Gaude K3 Sita Sud - 5211 Rte de St Jeannet\",IF(B3=\"GRAVATS SALES\",\"Véolia Nice Tri - 20 Ch du Saquier\",IF(B3=\"BOIS\",\"SEAS La Glacière - 1019 Rte de la Grasse\",IF(B3=\"METAUX\",\"PURFER - ZI Carros 15ème Rue - 06517 Carros\",IF(B3=\"BATTERIES\",\"PURFER - ZI Carros 15ème Rue - 06517 Carros\",IF(B3=\"NEON\",\"Sofovar - 126 Av Louis Lépine - 83600 Fréjus\",IF(B3=\"PEINTURES\",\"Orédui - ZI Bois de Grasse - 06310 Grasse\",IF(B3=\"PRODUITS NON IDENTIFIES\",\"Orédui - ZI Bois de Grasse - 06310 Grasse\",IF(B3=\"AEROSOLS\",\"Orédui - ZI Bois de Grasse - 06310 Grasse\",IF(B3=\"FROIDS\",\"SEAS - 1079 Rte de Grasse - 06270 Villeneuve Loubet\",IF(B3=\"HORS FROIDS\",\"SEAS - 1079 Rte de Grasse - 06270 Villeneuve Loubet\",IF(B3=\"PAM\",\"SEAS - 1079 Rte de Grasse - 06270 Villeneuve Loubet\",IF(B3=\"ECRANS\",\"SEAS - 1079 Rte de Grasse - 06270 Villeneuve Loubet\",IF(B3=\"BOX HORS FROIDS\",\"SEAS - 1079 Rte de Grasse - 06270 Villeneuve Loubet\",IF(B3=\"PILES\",\"Corepile\",IF(B3=\"CUMULUS\",\"SEAS - 1079 Rte de Grasse - 06270 Villeneuve Loubet\",IF(B3=\"PNEUS\",\"TFM Pneus - 117 Ch Clausonnes - 06560 Valbonne\",IF(B3=\"HUILES VEGETALES\",\"Orédui - ZI Bois de Grasse - 06310 Grasse\",IF(B3=\"HUILES DE VIDANGE\",\"SERAHU - 68 Ch de la Campanette - 06800 Cagnes sur Mer\")))))))))))))))))))))","v":"Véolia Nice Tri - 20 Ch du Saquier"},{"$f":"IF(OR(B3=\"TOUT VENANT\",B3=\"DECHETS VERTS\",B3=\"GRAVATS SALES\",B3=\"GRAVATS PROPRES\",B3=\"BOIS\"),\"SUEZ\",IF(OR(B3=\"PNEUS\"),\"TFM\",IF(OR(B3=\"FROIDS\",B3=\"HORS FROIDS\",B3=\"BOX HORS FROIDS\",B3=\"CUMULUS\",B3=\"PAM\",B3=\"ECRANS\"),\"SEAS\",IF(OR(B3=\"METAUX\",B3=\"BATTERIES\"),\"DERICHEBOURG\",IF(OR(B3=\"NEON\"),\"SOFOVAR\",IF(OR(B3=\"PEINTURES\",B3=\"PRODUITS NON IDENTIFIES\",B3=\"AEROSOLS\",B3=\"HUILES VEGETALES\"),\"OREDUI\",IF(OR(B3=\"HUILES DE VIDANGE\"),\"SERAHU\")))))))","v":"SUEZ"},null,"B0300472042"]
["2018-01-02","BOIS",1100,null,"SEAS La Glacière - 1019 Rte de la Grasse","SUEZ",null,"B0300471874"]
["2018-01-02","TOUT VENANT",1720,null,"Véolia Nice Tri - Parc d'activité logistique","SUEZ",null,"B0300472374"]
["2018-01-02","METAUX",null,null,"PURFER - ZI Carros 15ème Rue - 06517 Carros","DERICHEBOURG",null,2461]
["2018-01-02","DECHETS VERTS",1060,null,"Orédui Carros Compostage - ZI de la Grave","SUEZ",null,"B0300474375"]
["2018-01-02","DECHETS VERTS",2900,null,"Orédui Carros Compostage - ZI de la Grave","SUEZ",null,"B0300471805"]
["2018-01-02","DECHETS VERTS",3280,null,"Orédui Carros Compostage - ZI de la Grave","SUEZ",null,"B0300471912"]
["2018-01-02","BOIS",1580,null,"SEAS La Glacière - 1019 Rte de la Grasse","SUEZ",null,"B0300474376"]
["2018-01-02","DECHETS VERTS",1060,null,"Orédui Carros Compostage - ZI de la Grave","SUEZ",null,"B0300474375"]
["2018-01-02","BOIS",2020,null,"SEAS La Glacière - 1019 Rte de la Grasse","SUEZ",null,"B0300472004"]
["2018-01-02","BOIS",1780,null,"SEAS La Glacière - 1019 Rte de la Grasse","SUEZ",null,"B0300471836"]
["2018-01-02","GRAVATS PROPRES",null,null,"La Gaude K3 Sita Sud - 5211 Rte de St Jeannet","SUEZ",null,"B0300473471"]
["2017-01-03","METAUX",null,null,"PURFER - ZI Carros 15ème Rue - 06517 Carros","DERICHEBOURG",null,2464]
["2018-01-03","TOUT VENANT",null,null,"Véolia Nice Tri - Parc d'activité logistique","SUEZ",null,"B0300472349"]
["2018-01-03","TOUT VENANT",null,null,"Véolia Nice Tri - Parc d'activité logistique","SUEZ",null,"B0300472476"]
["2018-01-03","TOUT VENANT",null,null,"Véolia Nice Tri - Parc d'activité logistique","SUEZ",null,"B0300472380",null,null,null,"PRESTATIONS JOURNALIERES SUEZ"]
["2018-01-03","TOUT VENANT",null,null,"Véolia Nice Tri - Parc d'activité logistique","SUEZ",null,"B0300474482",null,null,null,"6 TV ","6 ROTATIONS DE CAMION AMPIROLES"]
["2018-01-03","TOUT VENANT",null,null,"Véolia Nice Tri - Parc d'activité logistique","SUEZ",null,"B0300474481",null,null,null,"6 TV ","3 ROTATIONS DE CAMION GRAPPIN","LUNDI 4 ROTATIONS DE GRAPPIN"]
["2018-01-03","TOUT VENANT",null,null,"Véolia Nice Tri - Parc d'activité logistique","SUEZ",null,"B0300474480",null,null,null,"2 GRAVATS SALES","1  MATIN ET 1 APRES MIDI"]
["2018-01-03","TOUT VENANT",null,null,"Véolia Nice Tri - Parc d'activité logistique","SUEZ",null,"B0300474479",null,null,null,"3 GRAVATS PROPRES","3 ROTATIONS DE CAMION AMPIROLES"]
["2018-01-03","GRAVATS SALES",null,null,"Véolia Nice Tri - 20 Ch du Saquier","SUEZ",null,"B0300473737",null,null,null,"2 DECHETS VERTS","2 ROTATIONS DE CAMION AMPIROLES"]
["2018-01-03","GRAVATS PROPRES",null,null,"La Gaude K3 Sita Sud - 5211 Rte de St Jeannet","SUEZ",null,"B0300473508",null,null,null,"2 BOIS","2 ROTATIONS DE CAMION AMPIROLES"]
["2018-01-03","GRAVATS SALES",null,null,"Véolia Nice Tri - 20 Ch du Saquier","SUEZ",null,"B0300472048",null,null,null,"1 METAUX","1 ROTATION DE CAMION GRAPPIN"]
["2018-01-03","GRAVATS PROPRES",null,null,"La Gaude K3 Sita Sud - 5211 Rte de St Jeannet","SUEZ",null,"B0300473539",null,null,null,"Le samedi présence d'un camion minimum jusqu'à 16H"]
["2018-01-03","DECHETS VERTS",980,null,"Orédui Carros Compostage - ZI de la Grave","SUEZ",null,"B0300471918"]
["2018-01-03","TOUT VENANT",1340,null,"Véolia Nice Tri - Parc d'activité logistique","SUEZ",null,"B0300473576"]
["2018-01-03","BOIS",2240,null,"SEAS La Glacière - 1019 Rte de la Grasse","SUEZ",null,"B0300471880"]
["2018-01-03","DECHETS VERTS",640,null,"Orédui Carros Compostage - ZI de la Grave","SUEZ",null,"B0300472125"]
["2018-01-03","BOIS",1320,null,"SEAS La Glacière - 1019 Rte de la Grasse","SUEZ",null,"B0300471842"]
["2018-01-03","BOIS",1660,null,"SEAS La Glacière - 1019 Rte de la Grasse","SUEZ",null,"B0300472010"]
["2018-01-03","BOIS",1960,null,"SEAS La Glacière - 1019 Rte de la Grasse","SUEZ",null,"B0300471811"]
["2018-01-04","METAUX",null,null,"PURFER - ZI Carros 15ème Rue - 06517 Carros","DERICHEBOURG",null,2468]
["2018-01-04","METAUX",null,null,"PURFER - ZI Carros 15ème Rue - 06517 Carros","DERICHEBOURG",null,2470]
["2018-01-04","BOIS",1720,null,"SEAS La Glacière - 1019 Rte de la Grasse","SUEZ",null,"B0300471848"]
["2018-01-04","DECHETS VERTS",1220,null,"Orédui Carros Compostage - ZI de la Grave","SUEZ",null,"B0300471817"]
["2018-01-04","DECHETS VERTS",null,null,"Orédui Carros Compostage - ZI de la Grave","SUEZ",null,"B0300474550"]
["2018-01-04","DECHETS VERTS",1620,null,"Orédui Carros Compostage - ZI de la Grave","SUEZ",null,"B0300471924"]
["2018-01-04","DECHETS VERTS",820,null,"Orédui Carros Compostage - ZI de la Grave","SUEZ",null,"B0300474555"]
["2018-01-04","BOIS",1540,null,"SEAS La Glacière - 1019 Rte de la Grasse","SUEZ",null,"B0300471886"]
["2018-01-04","TOUT VENANT",2340,null,"Véolia Nice Tri - Parc d'activité logistique","SUEZ",null,"B0300473582"]
["2018-01-04","TOUT VENANT",1780,null,"Véolia Nice Tri - Parc d'activité logistique","SUEZ",null,"B0300474515"]
["2018-01-04","TOUT VENANT",960,null,"Véolia Nice Tri - Parc d'activité logistique","SUEZ",null,"B0300474512"]
["2018-01-04","BOIS",2480,null,"SEAS La Glacière - 1019 Rte de la Grasse","SUEZ",null,"B0300472016"]
["2018-01-04","TOUT VENANT",880,null,"Véolia Nice Tri - Parc d'activité logistique","SUEZ",null,"B0300474514"]
["2018-01-04","TOUT VENANT",920,null,"Véolia Nice Tri - Parc d'activité logistique","SUEZ",null,"B0300472482"]
["2018-01-04","TOUT VENANT",1580,null,"Véolia Nice Tri - Parc d'activité logistique","SUEZ",null,"B0300472386"]
["2018-01-04","TOUT VENANT",1560,null,"Véolia Nice Tri - Parc d'activité logistique","SUEZ",null,"B0300472355"]
["2018-01-04","GRAVATS SALES",null,null,"Véolia Nice Tri - 20 Ch du Saquier","SUEZ",null,"B0300472054"]
["2018-01-04","GRAVATS PROPRES",null,null,"La Gaude K3 Sita Sud - 5211 Rte de St Jeannet","SUEZ",null,"B0300473483"]
["2018-01-04","GRAVATS PROPRES",null,null,"La Gaude K3 Sita Sud - 5211 Rte de St Jeannet","SUEZ",null,"B0300473514"]
["2018-01-05","METAUX",null,null,"PURFER - ZI Carros 15ème Rue - 06517 Carros","DERICHEBOURG",null,2474]
["2018-01-05","GRAVATS SALES",null,null,"Véolia Nice Tri - 20 Ch du Saquier","SUEZ",null,"B0300472061"]
["2018-01-05","DECHETS VERTS",null,null,"Orédui Carros Compostage - ZI de la Grave","SUEZ",null,"B0300472132"]
["2018-01-05","BOIS",null,null,"SEAS La Glacière - 1019 Rte de la Grasse","SUEZ",null,"B0300471893"]
["2018-01-05","DECHETS VERTS",null,null,"Orédui Carros Compostage - ZI de la Grave","SUEZ",null,"B0300471824"]
["2018-01-05","BOIS",null,null,"SEAS La Glacière - 1019 Rte de la Grasse","SUEZ",null,"B0300472023"]
["2018-01-05","BOIS",null,null,"SEAS La Glacière - 1019 Rte de la Grasse","SUEZ",null,"B0300471855"]
["2018-01-05","GRAVATS PROPRES",null,null,"La Gaude K3 Sita Sud - 5211 Rte de St Jeannet","SUEZ",null,"B0300473521"]
["2018-01-05","GRAVATS SALES",null,null,"Véolia Nice Tri - 20 Ch du Saquier","SUEZ",null,"B0300473750"]
["2018-01-05","GRAVATS PROPRES",null,null,"La Gaude K3 Sita Sud - 5211 Rte de St Jeannet","SUEZ",null,"B0300473552"]
["2018-01-05","GRAVATS PROPRES",null,null,"La Gaude K3 Sita Sud - 5211 Rte de St Jeannet","SUEZ",null,"B0300473490"]
["2018-01-05","TOUT VENANT",null,null,"Véolia Nice Tri - Parc d'activité logistique","SUEZ",null,"B0300472362"]
["2018-01-05","TOUT VENANT",1820,null,"Véolia Nice Tri - Parc d'activité logistique","SUEZ",null,"B0300472393"]
["2018-01-05","TOUT VENANT",1280,null,"Véolia Nice Tri - Parc d'activité logistique","SUEZ",null,"B0300472489"]
["2018-01-05","TOUT VENANT",1260,null,{"$f":"IF(B67=\"TOUT VENANT\",\"Véolia Nice Tri - Parc d'activité logistique\",IF(B67=\"DECHETS VERTS\",\"Orédui Carros Compostage - ZI de la Grave\",IF(B67=\"GRAVATS PROPRES\",\"La Gaude K3 Sita Sud - 5211 Rte de St Jeannet\",IF(B67=\"GRAVATS SALES\",\"Véolia Nice Tri - 20 Ch du Saquier\",IF(B67=\"BOIS\",\"SEAS La Glacière - 1019 Rte de la Grasse\",IF(B67=\"METAUX\",\"PURFER - ZI Carros 15ème Rue - 06517 Carros\",IF(B67=\"BATTERIES\",\"PURFER - ZI Carros 15ème Rue - 06517 Carros\",IF(B67=\"NEON\",\"Sofovar - 126 Av Louis Lépine - 83600 Fréjus\",IF(B67=\"PEINTURES\",\"Orédui - ZI Bois de Grasse - 06310 Grasse\",IF(B67=\"PRODUITS NON IDENTIFIES\",\"Orédui - ZI Bois de Grasse - 06310 Grasse\",IF(B67=\"AEROSOLS\",\"Orédui - ZI Bois de Grasse - 06310 Grasse\",IF(B67=\"FROIDS\",\"SEAS - 1079 Rte de Grasse - 06270 Villeneuve Loubet\",IF(B67=\"HORS FROIDS\",\"SEAS - 1079 Rte de Grasse - 06270 Villeneuve Loubet\",IF(B67=\"PAM\",\"SEAS - 1079 Rte de Grasse - 06270 Villeneuve Loubet\",IF(B67=\"ECRANS\",\"SEAS - 1079 Rte de Grasse - 06270 Villeneuve Loubet\",IF(B67=\"BOX HORS FROIDS\",\"SEAS - 1079 Rte de Grasse - 06270 Villeneuve Loubet\",IF(B67=\"PILES\",\"Corepile\",IF(B67=\"CUMULUS\",\"SEAS - 1079 Rte de Grasse - 06270 Villeneuve Loubet\",IF(B67=\"PNEUS\",\"TFM Pneus - 117 Ch Clausonnes - 06560 Valbonne\",IF(B67=\"HUILES VEGETALES\",\"Orédui - ZI Bois de Grasse - 06310 Grasse\",IF(B67=\"HUILES DE VIDANGE\",\"SERAHU - 68 Ch de la Campanette - 06800 Cagnes sur Mer\")))))))))))))))))))))","v":"Véolia Nice Tri - Parc d'activité logistique"},{"$f":"IF(OR(B67=\"TOUT VENANT\",B67=\"DECHETS VERTS\",B67=\"GRAVATS SALES\",B67=\"GRAVATS PROPRES\",B67=\"BOIS\"),\"SUEZ\",IF(OR(B67=\"PNEUS\"),\"TFM\",IF(OR(B67=\"FROIDS\",B67=\"HORS FROIDS\",B67=\"BOX HORS FROIDS\",B67=\"CUMULUS\",B67=\"PAM\",B67=\"ECRANS\"),\"SEAS\",IF(OR(B67=\"METAUX\",B67=\"BATTERIES\"),\"DERICHEBOURG\",IF(OR(B67=\"NEON\"),\"SOFOVAR\",IF(OR(B67=\"PEINTURES\",B67=\"PRODUITS NON IDENTIFIES\",B67=\"AEROSOLS\",B67=\"HUILES VEGETALES\"),\"OREDUI\",IF(OR(B67=\"HUILES DE VIDANGE\"),\"SERAHU\")))))))","v":"SUEZ"},null,"B0300474622"]
["2018-01-05","TOUT VENANT",1600,null,"Véolia Nice Tri - Parc d'activité logistique","SUEZ",null,"B0300474623"]
["2018-01-05","TOUT VENANT",3580,null,"Véolia Nice Tri - Parc d'activité logistique","SUEZ",null,"B0300474624"]
["2018-01-06","METAUX",null,null,"PURFER - ZI Carros 15ème Rue - 06517 Carros","DERICHEBOURG",null,2477]
["2018-01-06","TOUT VENANT",2440,null,"Véolia Nice Tri - Parc d'activité logistique","SUEZ",null,"B0300472181"]
["2018-01-06","TOUT VENANT",1040,null,"Véolia Nice Tri - Parc d'activité logistique","SUEZ",null,"B0300474663"]
["2018-01-06","TOUT VENANT",800,null,"Véolia Nice Tri - Parc d'activité logistique","SUEZ",null,"B0300474662"]
["2018-01-06","TOUT VENANT",1400,null,"Véolia Nice Tri - Parc d'activité logistique","SUEZ",null,"B0300474664"]
["2018-01-06","TOUT VENANT",2520,null,"Véolia Nice Tri - Parc d'activité logistique","SUEZ",null,"B0300472167"]
["2018-01-06","TOUT VENANT",1640,null,"Véolia Nice Tri - Parc d'activité logistique","SUEZ",null,"B0300472188"]
["2018-01-06","TOUT VENANT",1560,null,"Véolia Nice Tri - Parc d'activité logistique","SUEZ",null,"B0300472195"]
["2018-01-06","METAUX",null,null,"PURFER - ZI Carros 15ème Rue - 06517 Carros","DERICHEBOURG",null,2478]
["2018-01-06","GRAVATS PROPRES",null,null,"La Gaude K3 Sita Sud - 5211 Rte de St Jeannet","SUEZ",null,"B0300472699"]
["2018-01-06","BOIS",null,null,"SEAS La Glacière - 1019 Rte de la Grasse","SUEZ",null,"B0300472223"]
["2018-01-06","DECHETS VERTS",null,null,"Orédui Carros Compostage - ZI de la Grave","SUEZ",null,"B0300472209"]
["2018-01-06","GRAVATS SALES",null,null,"Véolia Nice Tri - 20 Ch du Saquier","SUEZ",null,"B0300473757"]
[null,null,null,""]

{"sheet":"Registre_2","index":16,"n_rows":774,"n_cols":15,"rows_kept":774,"cut":false,"hidden":false,"merged":[[18,12,18,13],[5,2,5,3],[6,2,6,3],[7,2,7,3],[8,2,8,3],[9,2,9,3],[10,2,10,3],[0,0,0,1],[1,2,1,3],[2,2,2,3],[3,2,3,3],[4,2,4,3],[17,2,17,3],[18,2,18,3],[0,2,0,9],[19,2,19,3],[20,2,20,3],[21,2,21,3],[22,2,22,3],[11,2,11,3],[12,2,12,3],[13,2,13,3],[14,2,14,3],[15,2,15,3],[16,2,16,3],[29,2,29,3],[30,2,30,3],[31,2,31,3],[32,2,32,3],[33,2,33,3],[34,2,34,3],[23,2,23,3],[24,2,24,3],[25,2,25,3],[26,2,26,3],[27,2,27,3],[28,2,28,3],[41,2,41,3],[42,2,42,3],[43,2,43,3],[44,2,44,3],[45,2,45,3],[46,2,46,3],[35,2,35,3],[36,2,36,3],[37,2,37,3],[38,2,38,3],[39,2,39,3],[40,2,40,3],[53,2,53,3],[54,2,54,3],[55,2,55,3],[56,2,56,3],[57,2,57,3],[58,2,58,3],[47,2,47,3],[48,2,48,3],[49,2,49,3],[50,2,50,3],[51,2,51,3],[52,2,52,3],[65,2,65,3],[66,2,66,3],[67,2,67,3],[68,2,68,3],[69,2,69,3],[70,2,70,3],[59,2,59,3],[60,2,60,3],[61,2,61,3],[62,2,62,3],[63,2,63,3],[64,2,64,3],[77,2,77,3],[78,2,78,3],[79,2,79,3],[80,2,80,3],[81,2,81,3],[82,2,82,3],[71,2,71,3],[72,2,72,3],[73,2,73,3],[74,2,74,3],[75,2,75,3],[76,2,76,3],[89,2,89,3],[90,2,90,3],[91,2,91,3],[92,2,92,3],[93,2,93,3],[94,2,94,3],[83,2,83,3],[84,2,84,3],[85,2,85,3],[86,2,86,3],[87,2,87,3],[88,2,88,3],[100,2,100,3],[101,2,101,3],[102,2,102,3],[103,2,103,3],[104,2,104,3],[105,2,105,3],[95,2,95,3],[96,2,96,3],[97,2,97,3],[98,2,98,3],[99,2,99,3],[112,2,112,3],[113,2,113,3],[114,2,114,3],[115,2,115,3],[116,2,116,3],[106,2,106,3],[107,2,107,3],[108,2,108,3],[109,2,109,3],[110,2,110,3],[111,2,111,3],[123,2,123,3],[124,2,124,3],[125,2,125,3],[126,2,126,3],[127,2,127,3],[128,2,128,3],[117,2,117,3],[118,2,118,3],[119,2,119,3],[120,2,120,3],[121,2,121,3],[122,2,122,3],[135,2,135,3],[136,2,136,3],[137,2,137,3],[138,2,138,3],[139,2,139,3],[140,2,140,3],[129,2,129,3],[130,2,130,3],[131,2,131,3],[132,2,132,3],[133,2,133,3],[134,2,134,3],[147,2,147,3],[148,2,148,3],[149,2,149,3],[150,2,150,3],[151,2,151,3],[152,2,152,3],[141,2,141,3],[142,2,142,3],[143,2,143,3],[144,2,144,3],[145,2,145,3],[146,2,146,3],[159,2,159,3],[160,2,160,3],[161,2,161,3],[162,2,162,3],[163,2,163,3],[164,2,164,3],[153,2,153,3],[154,2,154,3],[155,2,155,3],[156,2,156,3],[157,2,157,3],[158,2,158,3],[171,2,171,3],[172,2,172,3],[173,2,173,3],[174,2,174,3],[175,2,175,3],[176,2,176,3],[165,2,165,3],[166,2,166,3],[167,2,167,3],[168,2,168,3],[169,2,169,3],[170,2,170,3],[183,2,183,3],[184,2,184,3],[185,2,185,3],[186,2,186,3],[187,2,187,3],[188,2,188,3],[177,2,177,3],[178,2,178,3],[179,2,179,3],[180,2,180,3],[181,2,181,3],[182,2,182,3],[195,2,195,3],[196,2,196,3],[197,2,197,3],[198,2,198,3],[199,2,199,3],[200,2,200,3],[189,2,189,3],[190,2,190,3],[191,2,191,3],[192,2,192,3],[193,2,193,3],[194,2,194,3],[207,2,207,3],[208,2,208,3],[209,2,209,3],[210,2,210,3],[211,2,211,3],[212,2,212,3],[201,2,201,3],[202,2,202,3],[203,2,203,3],[204,2,204,3],[205,2,205,3],[206,2,206,3],[219,2,219,3],[220,2,220,3],[221,2,221,3],[222,2,222,3],[223,2,223,3],[224,2,224,3],[213,2,213,3],[214,2,214,3],[215,2,215,3],[216,2,216,3],[217,2,217,3],[218,2,218,3],[231,2,231,3],[232,2,232,3],[233,2,233,3],[234,2,234,3],[235,2,235,3],[236,2,236,3],[225,2,225,3],[226,2,226,3],[227,2,227,3],[228,2,228,3],[229,2,229,3],[230,2,230,3],[243,2,243,3],[244,2,244,3],[245,2,245,3],[246,2,246,3],[247,2,247,3],[248,2,248,3],[237,2,237,3],[238,2,238,3],[239,2,239,3],[240,2,240,3],[241,2,241,3],[242,2,242,3],[255,2,255,3],[256,2,256,3],[257,2,257,3],[258,2,258,3],[259,2,259,3],[260,2,260,3],[249,2,249,3],[250,2,250,3],[251,2,251,3],[252,2,252,3],[253,2,253,3],[254,2,254,3],[267,2,267,3],[268,2,268,3],[269,2,269,3],[270,2,270,3],[271,2,271,3],[272,2,272,3],[261,2,261,3],[262,2,262,3],[263,2,263,3],[264,2,264,3],[265,2,265,3],[266,2,266,3],[279,2,279,3],[280,2,280,3],[281,2,281,3],[282,2,282,3],[283,2,283,3],[284,2,284,3],[273,2,273,3],[274,2,274,3],[275,2,275,3],[276,2,276,3],[277,2,277,3],[278,2,278,3],[291,2,291,3],[292,2,292,3],[293,2,293,3],[294,2,294,3],[295,2,295,3],[296,2,296,3],[285,2,285,3],[286,2,286,3],[287,2,287,3],[288,2,288,3],[289,2,289,3],[290,2,290,3],[303,2,303,3],[304,2,304,3],[305,2,305,3],[306,2,306,3],[307,2,307,3],[308,2,308,3],[297,2,297,3],[298,2,298,3],[299,2,299,3],[300,2,300,3],[301,2,301,3],[302,2,302,3],[315,2,315,3],[316,2,316,3],[317,2,317,3],[318,2,318,3],[319,2,319,3],[320,2,320,3],[309,2,309,3],[310,2,310,3],[311,2,311,3],[312,2,312,3],[313,2,313,3],[314,2,314,3],[327,2,327,3],[328,2,328,3],[329,2,329,3],[330,2,330,3],[331,2,331,3],[332,2,332,3],[321,2,321,3],[322,2,322,3],[323,2,323,3],[324,2,324,3],[325,2,325,3],[326,2,326,3],[339,2,339,3],[340,2,340,3],[341,2,341,3],[342,2,342,3],[343,2,343,3],[344,2,344,3],[333,2,333,3],[334,2,334,3],[335,2,335,3],[336,2,336,3],[337,2,337,3],[338,2,338,3],[351,2,351,3],[352,2,352,3],[353,2,353,3],[354,2,354,3],[355,2,355,3],[356,2,356,3],[345,2,345,3],[346,2,346,3],[347,2,347,3],[348,2,348,3],[349,2,349,3],[350,2,350,3],[363,2,363,3],[364,2,364,3],[365,2,365,3],[366,2,366,3],[367,2,367,3],[368,2,368,3],[357,2,357,3],[358,2,358,3],[359,2,359,3],[360,2,360,3],[361,2,361,3],[362,2,362,3],[375,2,375,3],[376,2,376,3],[377,2,377,3],[378,2,378,3],[379,2,379,3],[380,2,380,3],[369,2,369,3],[370,2,370,3],[371,2,371,3],[372,2,372,3],[373,2,373,3],[374,2,374,3],[387,2,387,3],[388,2,388,3],[389,2,389,3],[390,2,390,3],[391,2,391,3],[392,2,392,3],[381,2,381,3],[382,2,382,3],[383,2,383,3],[384,2,384,3],[385,2,385,3],[386,2,386,3],[399,2,399,3],[400,2,400,3],[401,2,401,3],[402,2,402,3],[403,2,403,3],[404,2,404,3],[393,2,393,3],[394,2,394,3],[395,2,395,3],[396,2,396,3],[397,2,397,3],[398,2,398,3],[411,2,411,3],[412,2,412,3],[413,2,413,3],[414,2,414,3],[415,2,415,3],[416,2,416,3],[405,2,405,3],[406,2,406,3],[407,2,407,3],[408,2,408,3],[409,2,409,3],[410,2,410,3],[423,2,423,3],[424,2,424,3],[425,2,425,3],[426,2,426,3],[427,2,427,3],[428,2,428,3],[417,2,417,3],[418,2,418,3],[419,2,419,3],[420,2,420,3],[421,2,421,3],[422,2,422,3],[435,2,435,3],[436,2,436,3],[437,2,437,3],[438,2,438,3],[439,2,439,3],[440,2,440,3],[429,2,429,3],[430,2,430,3],[431,2,431,3],[432,2,432,3],[433,2,433,3],[434,2,434,3],[447,2,447,3],[448,2,448,3],[449,2,449,3],[450,2,450,3],[451,2,451,3],[452,2,452,3],[441,2,441,3],[442,2,442,3],[443,2,443,3],[444,2,444,3],[445,2,445,3],[446,2,446,3],[459,2,459,3],[460,2,460,3],[461,2,461,3],[462,2,462,3],[463,2,463,3],[464,2,464,3],[453,2,453,3],[454,2,454,3],[455,2,455,3],[456,2,456,3],[457,2,457,3],[458,2,458,3],[471,2,471,3],[472,2,472,3],[473,2,473,3],[474,2,474,3],[475,2,475,3],[476,2,476,3],[465,2,465,3],[466,2,466,3],[467,2,467,3],[468,2,468,3],[469,2,469,3],[470,2,470,3],[483,2,483,3],[484,2,484,3],[485,2,485,3],[486,2,486,3],[487,2,487,3],[488,2,488,3],[477,2,477,3],[478,2,478,3],[479,2,479,3],[480,2,480,3],[481,2,481,3],[482,2,482,3],[495,2,495,3],[496,2,496,3],[497,2,497,3],[498,2,498,3],[499,2,499,3],[500,2,500,3],[489,2,489,3],[490,2,490,3],[491,2,491,3],[492,2,492,3],[493,2,493,3],[494,2,494,3],[507,2,507,3],[508,2,508,3],[509,2,509,3],[510,2,510,3],[511,2,511,3],[512,2,512,3],[501,2,501,3],[502,2,502,3],[503,2,503,3],[504,2,504,3],[505,2,505,3],[506,2,506,3],[519,2,519,3],[520,2,520,3],[521,2,521,3],[522,2,522,3],[523,2,523,3],[524,2,524,3],[513,2,513,3],[514,2,514,3],[515,2,515,3],[516,2,516,3],[517,2,517,3],[518,2,518,3],[531,2,531,3],[532,2,532,3],[533,2,533,3],[534,2,534,3],[535,2,535,3],[536,2,536,3],[525,2,525,3],[526,2,526,3],[527,2,527,3],[528,2,528,3],[529,2,529,3],[530,2,530,3],[543,2,543,3],[544,2,544,3],[545,2,545,3],[546,2,546,3],[547,2,547,3],[548,2,548,3],[537,2,537,3],[538,2,538,3],[539,2,539,3],[540,2,540,3],[541,2,541,3],[542,2,542,3],[555,2,555,3],[556,2,556,3],[557,2,557,3],[558,2,558,3],[559,2,559,3],[560,2,560,3],[549,2,549,3],[550,2,550,3],[551,2,551,3],[552,2,552,3],[553,2,553,3],[554,2,554,3],[567,2,567,3],[568,2,568,3],[569,2,569,3],[570,2,570,3],[571,2,571,3],[572,2,572,3],[561,2,561,3],[562,2,562,3],[563,2,563,3],[564,2,564,3],[565,2,565,3],[566,2,566,3],[579,2,579,3],[580,2,580,3],[581,2,581,3],[582,2,582,3],[583,2,583,3],[584,2,584,3],[573,2,573,3],[574,2,574,3],[575,2,575,3],[576,2,576,3],[577,2,577,3],[578,2,578,3],[591,2,591,3],[592,2,592,3],[593,2,593,3],[594,2,594,3],[595,2,595,3],[596,2,596,3],[585,2,585,3],[586,2,586,3],[587,2,587,3],[588,2,588,3],[589,2,589,3],[590,2,590,3],[603,2,603,3],[604,2,604,3],[605,2,605,3],[606,2,606,3],[607,2,607,3],[608,2,608,3],[597,2,597,3],[598,2,598,3],[599,2,599,3],[600,2,600,3],[601,2,601,3],[602,2,602,3],[615,2,615,3],[616,2,616,3],[617,2,617,3],[618,2,618,3],[619,2,619,3],[620,2,620,3],[609,2,609,3],[610,2,610,3],[611,2,611,3],[612,2,612,3],[613,2,613,3],[614,2,614,3],[627,2,627,3],[628,2,628,3],[629,2,629,3],[630,2,630,3],[631,2,631,3],[632,2,632,3],[621,2,621,3],[622,2,622,3],[623,2,623,3],[624,2,624,3],[625,2,625,3],[626,2,626,3],[639,2,639,3],[640,2,640,3],[641,2,641,3],[642,2,642,3],[643,2,643,3],[644,2,644,3],[633,2,633,3],[634,2,634,3],[635,2,635,3],[636,2,636,3],[637,2,637,3],[638,2,638,3],[651,2,651,3],[652,2,652,3],[653,2,653,3],[654,2,654,3],[655,2,655,3],[656,2,656,3],[645,2,645,3],[646,2,646,3],[647,2,647,3],[648,2,648,3],[649,2,649,3],[650,2,650,3],[663,2,663,3],[664,2,664,3],[665,2,665,3],[666,2,666,3],[667,2,667,3],[668,2,668,3],[657,2,657,3],[658,2,658,3],[659,2,659,3],[660,2,660,3],[661,2,661,3],[662,2,662,3],[675,2,675,3],[676,2,676,3],[677,2,677,3],[678,2,678,3],[679,2,679,3],[680,2,680,3],[669,2,669,3],[670,2,670,3],[671,2,671,3],[672,2,672,3],[673,2,673,3],[674,2,674,3],[687,2,687,3],[688,2,688,3],[689,2,689,3],[690,2,690,3],[691,2,691,3],[692,2,692,3],[681,2,681,3],[682,2,682,3],[683,2,683,3],[684,2,684,3],[685,2,685,3],[686,2,686,3],[699,2,699,3],[700,2,700,3],[701,2,701,3],[702,2,702,3],[703,2,703,3],[704,2,704,3],[693,2,693,3],[694,2,694,3],[695,2,695,3],[696,2,696,3],[697,2,697,3],[698,2,698,3],[711,2,711,3],[712,2,712,3],[713,2,713,3],[714,2,714,3],[715,2,715,3],[716,2,716,3],[705,2,705,3],[706,2,706,3],[707,2,707,3],[708,2,708,3],[709,2,709,3],[710,2,710,3],[723,2,723,3],[724,2,724,3],[725,2,725,3],[726,2,726,3],[727,2,727,3],[728,2,728,3],[717,2,717,3],[718,2,718,3],[719,2,719,3],[720,2,720,3],[721,2,721,3],[722,2,722,3],[735,2,735,3],[736,2,736,3],[737,2,737,3],[738,2,738,3],[739,2,739,3],[740,2,740,3],[729,2,729,3],[730,2,730,3],[731,2,731,3],[732,2,732,3],[733,2,733,3],[734,2,734,3],[749,2,749,3],[750,2,750,3],[751,2,751,3],[752,2,752,3],[741,2,741,3],[742,2,742,3],[743,2,743,3],[744,2,744,3],[745,2,745,3],[746,2,746,3],[26,12,26,13],[771,2,771,3],[772,2,772,3],[773,2,773,3],[765,2,765,3],[766,2,766,3],[767,2,767,3],[768,2,768,3],[769,2,769,3],[770,2,770,3],[759,2,759,3],[760,2,760,3],[761,2,761,3],[762,2,762,3],[763,2,763,3],[764,2,764,3],[753,2,753,3],[754,2,754,3],[755,2,755,3],[756,2,756,3],[757,2,757,3],[758,2,758,3],[747,2,747,3],[748,2,748,3]]}
[null,null,"REGISTRE DECHETS NON DANGEREUX\n(Arrêté du 29 février 2012 fixant le contenu des registres mentionnés aux articles R. 541-43 et R. 541-46 du code de l'environnement )"]
["Date d'enlèvement","Nature du déchets","Quantité de déchets\n (en kg)",null,"Unité","Installation de destination \n(nom et adresse)","Transporteur ","Immatriculation","Fiche d'intervention","Signature"]
["2018-01-08","TOUT VENANT",1880,null,null,{"$f":"IF(B3=\"TOUT VENANT\",\"Véolia Nice Tri - Parc d'activité logistique\",IF(B3=\"DECHETS VERTS\",\"Orédui Carros Compostage - ZI de la Grave\",IF(B3=\"GRAVATS PROPRES\",\"La Gaude K3 Sita Sud - 5211 Rte de St Jeannet\",IF(B3=\"GRAVATS SALES\",\"Véolia Nice Tri - 20 Ch du Saquier\",IF(B3=\"BOIS\",\"SEAS La Glacière - 1019 Rte de la Grasse\",IF(B3=\"METAUX\",\"PURFER - ZI Carros 15ème Rue - 06517 Carros\",IF(B3=\"BATTERIES\",\"PURFER - ZI Carros 15ème Rue - 06517 Carros\",IF(B3=\"NEON\",\"Sofovar - 126 Av Louis Lépine - 83600 Fréjus\",IF(B3=\"PEINTURES\",\"Orédui - ZI Bois de Grasse - 06310 Grasse\",IF(B3=\"PRODUITS NON IDENTIFIES\",\"Orédui - ZI Bois de Grasse - 06310 Grasse\",IF(B3=\"AEROSOLS\",\"Orédui - ZI Bois de Grasse - 06310 Grasse\",IF(B3=\"FROIDS\",\"SEAS - 1079 Rte de Grasse - 06270 Villeneuve Loubet\",IF(B3=\"HORS FROIDS\",\"SEAS - 1079 Rte de Grasse - 06270 Villeneuve Loubet\",IF(B3=\"PAM\",\"SEAS - 1079 Rte de Grasse - 06270 Villeneuve Loubet\",IF(B3=\"ECRANS\",\"SEAS - 1079 Rte de Grasse - 06270 Villeneuve Loubet\",IF(B3=\"BOX HORS FROIDS\",\"SEAS - 1079 Rte de Grasse - 06270 Villeneuve Loubet\",IF(B3=\"PILES\",\"Corepile\",IF(B3=\"CUMULUS\",\"SEAS - 1079 Rte de Grasse - 06270 Villeneuve Loubet\",IF(B3=\"PNEUS\",\"TFM Pneus - 117 Ch Clausonnes - 06560 Valbonne\",IF(B3=\"HUILES VEGETALES\",\"Orédui - ZI Bois de Grasse - 06310 Grasse\",IF(B3=\"HUILES DE VIDANGE\",\"SERAHU - 68 Ch de la Campanette - 06800 Cagnes sur Mer\")))))))))))))))))))))","v":"Véolia Nice Tri - Parc d'activité logistique"},{"$f":"IF(OR(B3=\"TOUT VENANT\",B3=\"DECHETS VERTS\",B3=\"GRAVATS SALES\",B3=\"GRAVATS PROPRES\",B3=\"BOIS\"),\"SUEZ\",IF(OR(B3=\"PNEUS\"),\"TFM\",IF(OR(B3=\"FROIDS\",B3=\"HORS FROIDS\",B3=\"BOX HORS FROIDS\",B3=\"CUMULUS\",B3=\"PAM\",B3=\"ECRANS\"),\"SEAS\",IF(OR(B3=\"METAUX\",B3=\"BATTERIES\"),\"DERICHEBOURG\",IF(OR(B3=\"NEON\"),\"SOFOVAR\",IF(OR(B3=\"PEINTURES\",B3=\"PRODUITS NON IDENTIFIES\",B3=\"AEROSOLS\",B3=\"HUILES VEGETALES\"),\"OREDUI\",IF(OR(B3=\"HUILES DE VIDANGE\"),\"SERAHU\")))))))","v":"SUEZ"},null,"B0300474648"]
["2018-01-08","BOIS",1240,null,null,{"$f":"IF(B4=\"TOUT VENANT\",\"Véolia Nice Tri - Parc d'activité logistique\",IF(B4=\"DECHETS VERTS\",\"Orédui Carros Compostage - ZI de la Grave\",IF(B4=\"GRAVATS PROPRES\",\"La Gaude K3 Sita Sud - 5211 Rte de St Jeannet\",IF(B4=\"GRAVATS SALES\",\"Véolia Nice Tri - 20 Ch du Saquier\",IF(B4=\"BOIS\",\"SEAS La Glacière - 1019 Rte de la Grasse\",IF(B4=\"METAUX\",\"PURFER - ZI Carros 15ème Rue - 06517 Carros\",IF(B4=\"BATTERIES\",\"PURFER - ZI Carros 15ème Rue - 06517 Carros\",IF(B4=\"NEON\",\"Sofovar - 126 Av Louis Lépine - 83600 Fréjus\",IF(B4=\"PEINTURES\",\"Orédui - ZI Bois de Grasse - 06310 Grasse\",IF(B4=\"PRODUITS NON IDENTIFIES\",\"Orédui - ZI Bois de Grasse - 06310 Grasse\",IF(B4=\"AEROSOLS\",\"Orédui - ZI Bois de Grasse - 06310 Grasse\",IF(B4=\"FROIDS\",\"SEAS - 1079 Rte de Grasse - 06270 Villeneuve Loubet\",IF(B4=\"HORS FROIDS\",\"SEAS - 1079 Rte de Grasse - 06270 Villeneuve Loubet\",IF(B4=\"PAM\",\"SEAS - 1079 Rte de Grasse - 06270 Villeneuve Loubet\",IF(B4=\"ECRANS\",\"SEAS - 1079 Rte de Grasse - 06270 Villeneuve Loubet\",IF(B4=\"BOX HORS FROIDS\",\"SEAS - 1079 Rte de Grasse - 06270 Villeneuve Loubet\",IF(B4=\"PILES\",\"Corepile\",IF(B4=\"CUMULUS\",\"SEAS - 1079 Rte de Grasse - 06270 Villeneuve Loubet\",IF(B4=\"PNEUS\",\"TFM Pneus - 117 Ch Clausonnes - 06560 Valbonne\",IF(B4=\"HUILES VEGETALES\",\"Orédui - ZI Bois de Grasse - 06310 Grasse\",IF(B4=\"HUILES DE VIDANGE\",\"SERAHU - 68 Ch de la Campanette - 06800 Cagnes sur Mer\")))))))))))))))))))))","v":"SEAS La Glacière - 1019 Rte de la Grasse"},{"$f":"IF(OR(B4=\"TOUT VENANT\",B4=\"DECHETS VERTS\",B4=\"GRAVATS SALES\",B4=\"GRAVATS PROPRES\",B4=\"BOIS\"),\"SUEZ\",IF(OR(B4=\"PNEUS\"),\"TFM\",IF(OR(B4=\"FROIDS\",B4=\"HORS FROIDS\",B4=\"BOX HORS FROIDS\",B4=\"CUMULUS\",B4=\"PAM\",B4=\"ECRANS\"),\"SEAS\",IF(OR(B4=\"METAUX\",B4=\"BATTERIES\"),\"DERICHEBOURG\",IF(OR(B4=\"NEON\"),\"SOFOVAR\",IF(OR(B4=\"PEINTURES\",B4=\"PRODUITS NON IDENTIFIES\",B4=\"AEROSOLS\",B4=\"HUILES VEGETALES\"),\"OREDUI\",IF(OR(B4=\"HUILES DE VIDANGE\"),\"SERAHU\")))))))","v":"SUEZ"},null,"B0300471999"]
["2018-01-08","BOIS",1380,null,null,"SEAS La Glacière - 1019 Rte de la Grasse","SUEZ",null,"B0300471831"]
["2018-01-08","DECHETS VERTS",3220,null,null,"Orédui Carros Compostage - ZI de la Grave","SUEZ",null,"B0300472120"]
["2018-01-08","BOIS",1780,null,null,"SEAS La Glacière - 1019 Rte de la Grasse","SUEZ",null,"B0300471869"]
["2018-01-08","TOUT VENANT",1520,null,null,"Véolia Nice Tri - Parc d'activité logistique","SUEZ",null,"B0300471800"]
["2018-01-08","GRAVATS SALES",null,null,null,"Véolia Nice Tri - 20 Ch du Saquier","SUEZ",null,"B0300473466"]
["2018-01-08","GRAVATS PROPRES",null,null,null,"La Gaude K3 Sita Sud - 5211 Rte de St Jeannet","SUEZ",null,"B0300471769"]
["2018-01-08","GRAVATS SALES",null,null,null,"Véolia Nice Tri - 20 Ch du Saquier","SUEZ",null,"B0300473726"]
["2018-01-08","GRAVATS PROPRES",null,null,null,"La Gaude K3 Sita Sud - 5211 Rte de St Jeannet","SUEZ",null,"B0300473528"]
["2018-01-08","METAUX",null,null,null,"PURFER - ZI Carros 15ème Rue - 06517 Carros","DERICHEBOURG",null,2439]
["2018-01-08","GRAVATS PROPRES",null,null,null,"La Gaude K3 Sita Sud - 5211 Rte de St Jeannet","SUEZ",null,"B0300472037"]
["2018-01-08","TOUT VENANT",1820,null,null,"Véolia Nice Tri - Parc d'activité logistique","SUEZ",null,"B0300474644"]
["2018-01-08","DECHETS VERTS",1360,null,null,"Orédui Carros Compostage - ZI de la Grave","SUEZ",null,"B0300474649"]
["2018-01-08","TOUT VENANT",2280,null,null,"Véolia Nice Tri - Parc d'activité logistique","SUEZ",null,"B0300472465"]
["2018-01-08","TOUT VENANT",null,null,null,"Véolia Nice Tri - Parc d'activité logistique","SUEZ",null,"B0300473565"]
["2018-01-08","TOUT VENANT",1740,null,null,"Véolia Nice Tri - Parc d'activité logistique","SUEZ",null,"B0300472369",null,null,null,"PRESTATIONS JOURNALIERES SUEZ"]
["2018-01-08","TOUT VENANT",1800,null,null,"Véolia Nice Tri - Parc d'activité logistique","SUEZ",null,"B0300474647",null,null,null,"6 TV ","6 ROTATIONS DE CAMION AMPIROLES"]
["2018-01-08","TOUT VENANT",1400,null,null,"Véolia Nice Tri - Parc d'activité logistique","SUEZ",null,"B0300474646",null,null,null,"6 TV ","2*3 ROTATIONS DE CAMION GRAPPIN","LUNDI 4 ROTATIONS DE GRAPPIN"]
["2018-01-08","TOUT VENANT",1760,null,null,"Véolia Nice Tri - Parc d'activité logistique","SUEZ",null,"B0300472338",null,null,null,"2 GRAVATS SALES","1  MATIN ET 1 APRES MIDI"]
["2018-01-09","DECHETS VERTS",1900,null,null,"Orédui Carros Compostage - ZI de la Grave","SUEZ",null,"B0300471806",null,null,null,"3 GRAVATS PROPRES","3 ROTATIONS DE CAMION AMPIROLES"]
["2018-01-09","BOIS",1560,null,null,"SEAS La Glacière - 1019 Rte de la Grasse","SUEZ",null,"B0300471837",null,null,null,"2 DECHETS VERTS","2 ROTATIONS DE CAMION AMPIROLES"]
["2018-01-09","GRAVATS PROPRES",null,null,null,"La Gaude K3 Sita Sud - 5211 Rte de St Jeannet","SUEZ",null,"B0300473503",null,null,null,"2 BOIS","2 ROTATIONS DE CAMION AMPIROLES"]
["2018-01-09","GRAVATS SALES",null,null,null,"Véolia Nice Tri - 20 Ch du Saquier","SUEZ",null,"B0300472043",null,null,null,"1 METAUX","1 ROTATION DE CAMION GRAPPIN"]
["2018-01-09","GRAVATS PROPRES",null,null,null,"La Gaude K3 Sita Sud - 5211 Rte de St Jeannet","SUEZ",null,"B0300473472",null,null,null,"Le samedi présence d'un camion minimum jusqu'à 16H"]
["2018-01-09","DECHETS VERTS",600,null,null,"Orédui Carros Compostage - ZI de la Grave","SUEZ",null,"B0300471913"]
["2018-01-09","METAUX",null,null,null,"PURFER - ZI Carros 15ème Rue - 06517 Carros","DERICHEBOURG",null,2483]
["2018-01-09","DECHETS VERTS",2860,null,null,"Orédui Carros Compostage - ZI de la Grave","SUEZ",null,"B0300474720"]
["2018-01-09","TOUT VENANT",null,null,null,"Véolia Nice Tri - Parc d'activité logistique","SUEZ",null,"B0300472471"]
["2018-01-09","TOUT VENANT",2080,null,null,"Véolia Nice Tri - Parc d'activité logistique","SUEZ",null,"B0300473571"]
["2018-01-09","TOUT VENANT",1180,null,null,"Véolia Nice Tri - Parc d'activité logistique","SUEZ",null,"B0300474722"]
["2018-01-09","BOIS",1800,null,null,"SEAS La Glacière - 1019 Rte de la Grasse","SUEZ",null,"B0300471875"]
["2018-01-09","TOUT VENANT",1640,null,null,"Véolia Nice Tri - Parc d'activité logistique","SUEZ",null,"B0300474723"]
["2018-01-09","TOUT VENANT",null,null,null,"Véolia Nice Tri - Parc d'activité logistique","SUEZ",null,"B0300474724"]
["2018-01-09","TOUT VENANT",3260,null,null,"Véolia Nice Tri - Parc d'activité logistique","SUEZ",null,652]
["2018-01-09","TOUT VENANT",3880,null,null,"Véolia Nice Tri - Parc d'activité logistique","SUEZ",null,651]
["2018-01-09","TOUT VENANT",3180,null,null,"Véolia Nice Tri - Parc d'activité logistique","SUEZ",null,653]
["2018-01-10","METAUX",null,null,null,"PURFER - ZI Carros 15ème Rue - 06517 Carros","DERICHEBOURG",null,2446]
["2018-01-10","BOIS",1360,null,null,"SEAS La Glacière - 1019 Rte de la Grasse","SUEZ",null,"B0300472011"]
["2018-01-10","DECHETS VERTS",1420,null,null,"Orédui Carros Compostage - ZI de la Grave","SUEZ",null,"B0300471919"]
["2018-01-10","TOUT VENANT",3920,null,null,"Véolia Nice Tri - Parc d'activité logistique","SUEZ",null,654]
["2018-01-10","DECHETS VERTS",920,null,null,"Orédui Carros Compostage - ZI de la Grave","SUEZ",null,"B0300472126"]
["2018-01-10","TOUT VENANT",null,null,null,"Véolia Nice Tri - Parc d'activité logistique","SUEZ",null,"B0300473577"]
["2018-01-10","TOUT VENANT",1160,null,null,"Véolia Nice Tri - Parc d'activité logistique","SUEZ",null,"B0300472477"]
["2018-01-10","TOUT VENANT",700,null,null,"Véolia Nice Tri - Parc d'activité logistique","SUEZ",null,"B0300472381"]
["2018-01-10","BOIS",1520,null,null,"SEAS La Glacière - 1019 Rte de la Grasse","SUEZ",null,"B0300471843"]
["2018-01-10","GRAVATS PROPRES",null,null,null,"La Gaude K3 Sita Sud - 5211 Rte de St Jeannet","SUEZ",null,"B0300473540"]
["2018-01-10","GRAVATS SALES",4700,null,null,"Véolia Nice Tri - 20 Ch du Saquier","SUEZ",null,"B0300473738"]
["2018-01-10","GRAVATS PROPRES",3850,null,null,"La Gaude K3 Sita Sud - 5211 Rte de St Jeannet","SUEZ",null,"B0300473478"]
["2018-01-10","GRAVATS PROPRES",7350,null,null,"La Gaude K3 Sita Sud - 5211 Rte de St Jeannet","SUEZ",null,"B0300471781"]
["2018-01-10","GRAVATS SALES",5840,null,null,"Véolia Nice Tri - 20 Ch du Saquier","SUEZ",null,"B0300472049"]
["2018-01-10","TOUT VENANT",null,null,null,"Véolia Nice Tri - Parc d'activité logistique","SUEZ",null,655]
["2018-01-10","DECHETS VERTS",680,null,null,"Orédui Carros Compostage - ZI de la Grave","SUEZ",null,"B0300475995"]
["2018-01-10","TOUT VENANT",2160,null,null,"Véolia Nice Tri - Parc d'activité logistique","SUEZ",null,"B0300475997"]
["2018-01-10","TOUT VENANT",null,null,null,"Véolia Nice Tri - Parc d'activité logistique","SUEZ",null,"B0300475998"]
["2018-01-10","TOUT VENANT",1360,null,null,"Véolia Nice Tri - Parc d'activité logistique","SUEZ",null,"B0300472350"]
["2018-01-11","METAUX",null,null,null,"PURFER - ZI Carros 15ème Rue - 06517 Carros","DERICHEBOURG",null,2450]
["2018-01-11","DECHETS VERTS",1000,null,null,"Orédui Carros Compostage - ZI de la Grave","SUEZ",null,"B0300471818"]
["2018-01-11","DECHETS VERTS",2520,null,null,"Orédui Carros Compostage - ZI de la Grave","SUEZ",null,"B0300471925"]
["2018-01-11","TOUT VENANT",2140,null,null,"Véolia Nice Tri - Parc d'activité logistique","SUEZ",null,"B0300472483"]
["2018-01-11","GRAVATS PROPRES",null,null,null,"La Gaude K3 Sita Sud - 5211 Rte de St Jeannet","SUEZ",null,"B0300473546"]
["2018-01-11","GRAVATS SALES",null,null,null,"Véolia Nice Tri - 20 Ch du Saquier","SUEZ",null,"B0300473744"]
["2018-01-11","GRAVATS PROPRES",null,null,null,"La Gaude K3 Sita Sud - 5211 Rte de St Jeannet","SUEZ",null,"B0300473515"]
["2018-01-11","GRAVATS SALES",null,null,null,"Véolia Nice Tri - 20 Ch du Saquier","SUEZ",null,"B0300472055"]
["2018-01-11","GRAVATS PROPRES",null,null,null,"La Gaude K3 Sita Sud - 5211 Rte de St Jeannet","SUEZ",null,"B0300473484"]
["2018-01-11","TOUT VENANT",1440,null,null,{"$f":"IF(B68=\"TOUT VENANT\",\"Véolia Nice Tri - Parc d'activité logistique\",IF(B68=\"DECHETS VERTS\",\"Orédui Carros Compostage - ZI de la Grave\",IF(B68=\"GRAVATS PROPRES\",\"La Gaude K3 Sita Sud - 5211 Rte de St Jeannet\",IF(B68=\"GRAVATS SALES\",\"Véolia Nice Tri - 20 Ch du Saquier\",IF(B68=\"BOIS\",\"SEAS La Glacière - 1019 Rte de la Grasse\",IF(B68=\"METAUX\",\"PURFER - ZI Carros 15ème Rue - 06517 Carros\",IF(B68=\"BATTERIES\",\"PURFER - ZI Carros 15ème Rue - 06517 Carros\",IF(B68=\"NEON\",\"Sofovar - 126 Av Louis Lépine - 83600 Fréjus\",IF(B68=\"PEINTURES\",\"Orédui - ZI Bois de Grasse - 06310 Grasse\",IF(B68=\"PRODUITS NON IDENTIFIES\",\"Orédui - ZI Bois de Grasse - 06310 Grasse\",IF(B68=\"AEROSOLS\",\"Orédui - ZI Bois de Grasse - 06310 Grasse\",IF(B68=\"FROIDS\",\"SEAS - 1079 Rte de Grasse - 06270 Villeneuve Loubet\",IF(B68=\"HORS FROIDS\",\"SEAS - 1079 Rte de Grasse - 06270 Villeneuve Loubet\",IF(B68=\"PAM\",\"SEAS - 1079 Rte de Grasse - 06270 Villeneuve Loubet\",IF(B68=\"ECRANS\",\"SEAS - 1079 Rte de Grasse - 06270 Villeneuve Loubet\",IF(B68=\"BOX HORS FROIDS\",\"SEAS - 1079 Rte de Grasse - 06270 Villeneuve Loubet\",IF(B68=\"PILES\",\"Corepile\",IF(B68=\"CUMULUS\",\"SEAS - 1079 Rte de Grasse - 06270 Villeneuve Loubet\",IF(B68=\"PNEUS\",\"TFM Pneus - 117 Ch Clausonnes - 06560 Valbonne\",IF(B68=\"HUILES VEGETALES\",\"Orédui - ZI Bois de Grasse - 06310 Grasse\",IF(B68=\"HUILES DE VIDANGE\",\"SERAHU - 68 Ch de la Campanette - 06800 Cagnes sur Mer\")))))))))))))))))))))","v":"Véolia Nice Tri - Parc d'activité logistique"},{"$f":"IF(OR(B68=\"TOUT VENANT\",B68=\"DECHETS VERTS\",B68=\"GRAVATS SALES\",B68=\"GRAVATS PROPRES\",B68=\"BOIS\"),\"SUEZ\",IF(OR(B68=\"PNEUS\"),\"TFM\",IF(OR(B68=\"FROIDS\",B68=\"HORS FROIDS\",B68=\"BOX HORS FROIDS\",B68=\"CUMULUS\",B68=\"PAM\",B68=\"ECRANS\"),\"SEAS\",IF(OR(B68=\"METAUX\",B68=\"BATTERIES\"),\"DERICHEBOURG\",IF(OR(B68=\"NEON\"),\"SOFOVAR\",IF(OR(B68=\"PEINTURES\",B68=\"PRODUITS NON IDENTIFIES\",B68=\"AEROSOLS\",B68=\"HUILES VEGETALES\"),\"OREDUI\",IF(OR(B68=\"HUILES DE VIDANGE\"),\"SERAHU\")))))))","v":"SUEZ"},null,"B0300472387"]
["2018-01-11","BOIS",1480,null,null,"SEAS La Glacière - 1019 Rte de la Grasse","SUEZ",null,"B0300471849"]
["2018-01-11","TOUT VENANT",null,null,null,"Véolia Nice Tri - Parc d'activité logistique","SUEZ",null,"B0300476015"]
["2018-01-11","TOUT VENANT",1700,null,null,"Véolia Nice Tri - Parc d'activité logistique","SUEZ",null,"B0300476016"]
["2018-01-11","TOUT VENANT",3200,null,null,"Véolia Nice Tri - Parc d'activité logistique","SUEZ",null,"B0300473583"]
["2018-01-11","DECHETS VERTS",1480,null,null,"Orédui Carros Compostage - ZI de la Grave","SUEZ",null,"B0300476014"]
["2018-01-11","BOIS",2180,null,null,"SEAS La Glacière - 1019 Rte de la Grasse","SUEZ",null,"B0300471887"]
["2018-01-11","TOUT VENANT",1580,null,null,"Véolia Nice Tri - Parc d'activité logistique","SUEZ",null,"B0300476017"]
["2018-01-12","GRAVATS PROPRES",8850,null,null,"La Gaude K3 Sita Sud - 5211 Rte de St Jeannet","SUEZ",null,"B0300473491"]
["2018-01-11","NEON",null,null,null,"Sofovar - 126 Av Louis Lépine - 83600 Fréjus","SOFOVAR",null,"265116E"]
["2018-01-11","HUILES DE VIDANGE",900,null,null,"SERAHU - 68 Ch de la Campanette - 06800 Cagnes sur Mer","SERAHU",null,"0088899A"]
["2018-01-12","GRAVATS SALES",4360,null,null,"Véolia Nice Tri - 20 Ch du Saquier","SUEZ",null,"B0300472062"]
["2018-01-12","DECHETS VERTS",1140,null,null,"Orédui Carros Compostage - ZI de la Grave","SUEZ",null,"B0300471825"]
["2018-01-12","BOIS",2420,null,null,"SEAS La Glacière - 1019 Rte de la Grasse","SUEZ",null,"B0300471856"]
["2018-01-12","TOUT VENANT",1500,null,null,"Véolia Nice Tri - Parc d'activité logistique","SUEZ",null,"B0300472490"]
["2018-01-12","TOUT VENANT",4100,null,null,"Véolia Nice Tri - Parc d'activité logistique","SUEZ",null,103251]
["2018-01-12","GRAVATS PROPRES",6150,null,null,"La Gaude K3 Sita Sud - 5211 Rte de St Jeannet","SUEZ",null,"B0300473522"]
["2018-01-12","DECHETS VERTS",1040,null,null,"Orédui Carros Compostage - ZI de la Grave","SUEZ",null,"B0300471932"]
["2018-01-12","GRAVATS PROPRES",4560,null,null,"La Gaude K3 Sita Sud - 5211 Rte de St Jeannet","SUEZ",null,"BAL085"]
["2018-01-12","BOIS",2060,null,null,"SEAS La Glacière - 1019 Rte de la Grasse","SUEZ",null,"B0300471894"]
["2018-01-12","GRAVATS PROPRES",6400,null,null,"La Gaude K3 Sita Sud - 5211 Rte de St Jeannet","SUEZ",null,"B0300473553"]
["2018-01-12","TOUT VENANT",3240,null,null,"Véolia Nice Tri - Parc d'activité logistique","SUEZ",null,103252]
["2018-01-12","DECHETS VERTS",2160,null,null,"Orédui Carros Compostage - ZI de la Grave","SUEZ",null,"B0300472133"]
["2018-01-12","TOUT VENANT",1820,null,null,"Véolia Nice Tri - Parc d'activité logistique","SUEZ",null,"B0300473590"]
["2018-01-12","TOUT VENANT",2020,null,null,"Véolia Nice Tri - Parc d'activité logistique","SUEZ",null,"B0300476072"]
["2018-01-12","BOIS",1880,null,null,"SEAS La Glacière - 1019 Rte de la Grasse","SUEZ",null,"B0300472024"]
["2018-01-12","TOUT VENANT",2280,null,null,"Véolia Nice Tri - Parc d'activité logistique","SUEZ",null,"B0300476073"]
["2018-01-12","BOIS",2200,null,null,"SEAS La Glacière - 1019 Rte de la Grasse","SUEZ",null,"B0300472394"]
["2018-01-12","METAUX",null,null,null,"PURFER - ZI Carros 15ème Rue - 06517 Carros","DERICHEBOURG",null,2205]
["2018-01-12","TOUT VENANT",1300,null,null,"Véolia Nice Tri - Parc d'activité logistique","SUEZ",null,"B0300476075"]
["2018-01-13","METAUX",null,null,null,"PURFER - ZI Carros 15ème Rue - 06517 Carros","DERICHEBOURG",null,2209]
["2018-01-13","BOIS",3000,null,null,"SEAS La Glacière - 1019 Rte de la Grasse","SUEZ",null,"B0300472031"]
["2018-01-13","BOIS",860,null,null,"SEAS La Glacière - 1019 Rte de la Grasse","SUEZ",null,"B0300471901"]
["2018-01-13","DECHETS VERTS",2400,null,null,"Orédui Carros Compostage - ZI de la Grave","SUEZ",null,"B0300472140"]
["2018-01-13","BOIS",1440,null,null,"SEAS La Glacière - 1019 Rte de la Grasse","SUEZ",null,"B0300471863"]
["2018-01-13","TOUT VENANT",2580,null,null,"Véolia Nice Tri - Parc d'activité logistique","SUEZ",null,"B0300472168"]
["2018-01-13","TOUT VENANT",3020,null,null,"Véolia Nice Tri - Parc d'activité logistique","SUEZ",null,"B0300476188"]
["2018-01-13","TOUT VENANT",1840,null,null,"Véolia Nice Tri - Parc d'activité logistique","SUEZ",null,"B0300476189"]
["2018-01-13","TOUT VENANT",1400,null,null,"Véolia Nice Tri - Parc d'activité logistique","SUEZ",null,"B0300476190"]
["2018-01-13","BOIS",1520,null,null,"SEAS La Glacière - 1019 Rte de la Grasse","SUEZ",null,"B0300472182"]
["2018-01-13","TOUT VENANT",2340,null,null,"Véolia Nice Tri - Parc d'activité logistique","SUEZ",null,"B0300472189"]
["2018-01-13","TOUT VENANT",1780,null,null,"Véolia Nice Tri - Parc d'activité logistique","SUEZ",null,"B0300472196"]
["2018-01-13","GRAVATS PROPRES",6820,null,null,"La Gaude K3 Sita Sud - 5211 Rte de St Jeannet","SUEZ",null,"B0300472693"]
["2018-01-13","GRAVATS PROPRES",5700,null,null,"La Gaude K3 Sita Sud - 5211 Rte de St Jeannet","SUEZ",null,"B0300472707"]
["2018-01-13","GRAVATS PROPRES",10340,null,null,"La Gaude K3 Sita Sud - 5211 Rte de St Jeannet","SUEZ",null,"B0300472700"]
["2018-01-13","GRAVATS SALES",4140,null,null,"Véolia Nice Tri - 20 Ch du Saquier","SUEZ",null,"B0300473758"]
["2018-01-12","TOUT VENANT","2400",null,"","Véolia Nice Tri - Parc d'activité logistique","SUEZ",null,"0103306"]
["12/01/18","PEINTURES","",null,"3","Orédui - ZI Bois de Grasse - 06310 Grasse","OREDUI",null,"131077-0000200"]
[null,null,null,null,null,false,false]
[null,null,null,null,null,false,false]
[null,null,null,null,null,false,false]
[null,null,null,null,null,false,false]
[null,null,null,null,null,false,false]
[null,null,null,null,null,false,false]
[null,null,null,null,null,false,false]
[null,null,null,null,null,false,false]
[null,null,null,null,null,false,false]
[null,null,null,null,null,false,false]
[null,null,null,null,null,false,false]
[null,null,null,null,null,false,false]
[null,null,null,null,null,false,false]
[null,null,null,null,null,false,false]
[null,null,null,null,null,false,false]
[null,null,null,null,null,false,false]
[null,null,null,null,null,{"$f":"IF(B132=\"TOUT VENANT\",\"Véolia Nice Tri - Parc d'activité logistique\",IF(B132=\"DECHETS VERTS\",\"Orédui Carros Compostage - ZI de la Grave\",IF(B132=\"GRAVATS PROPRES\",\"La Gaude K3 Sita Sud - 5211 Rte de St Jeannet\",IF(B132=\"GRAVATS SALES\",\"Véolia Nice Tri - 20 Ch du Saquier\",IF(B132=\"BOIS\",\"SEAS La Glacière - 1019 Rte de la Grasse\",IF(B132=\"METAUX\",\"PURFER - ZI Carros 15ème Rue - 06517 Carros\",IF(B132=\"BATTERIES\",\"PURFER - ZI Carros 15ème Rue - 06517 Carros\",IF(B132=\"NEON\",\"Sofovar - 126 Av Louis Lépine - 83600 Fréjus\",IF(B132=\"PEINTURES\",\"Orédui - ZI Bois de Grasse - 06310 Grasse\",IF(B132=\"PRODUITS NON IDENTIFIES\",\"Orédui - ZI Bois de Grasse - 06310 Grasse\",IF(B132=\"AEROSOLS\",\"Orédui - ZI Bois de Grasse - 06310 Grasse\",IF(B132=\"FROIDS\",\"SEAS - 1079 Rte de Grasse - 06270 Villeneuve Loubet\",IF(B132=\"HORS FROIDS\",\"SEAS - 1079 Rte de Grasse - 06270 Villeneuve Loubet\",IF(B132=\"PAM\",\"SEAS - 1079 Rte de Grasse - 06270 Villeneuve Loubet\",IF(B132=\"ECRANS\",\"SEAS - 1079 Rte de Grasse - 06270 Villeneuve Loubet\",IF(B132=\"BOX HORS FROIDS\",\"SEAS - 1079 Rte de Grasse - 06270 Villeneuve Loubet\",IF(B132=\"PILES\",\"Corepile\",IF(B132=\"CUMULUS\",\"SEAS - 1079 Rte de Grasse - 06270 Villeneuve Loubet\",IF(B132=\"PNEUS\",\"TFM Pneus - 117 Ch Clausonnes - 06560 Valbonne\",IF(B132=\"HUILES VEGETALES\",\"Orédui - ZI Bois de Grasse - 06310 Grasse\",IF(B132=\"HUILES DE VIDANGE\",\"SERAHU - 68 Ch de la Campanette - 06800 Cagnes sur Mer\")))))))))))))))))))))","v":false},{"$f":"IF(OR(B132=\"TOUT VENANT\",B132=\"DECHETS VERTS\",B132=\"GRAVATS SALES\",B132=\"GRAVATS PROPRES\",B132=\"BOIS\"),\"SUEZ\",IF(OR(B132=\"PNEUS\"),\"TFM\",IF(OR(B132=\"FROIDS\",B132=\"HORS FROIDS\",B132=\"BOX HORS FROIDS\",B132=\"CUMULUS\",B132=\"PAM\",B132=\"ECRANS\"),\"SEAS\",IF(OR(B132=\"METAUX\",B132=\"BATTERIES\"),\"DERICHEBOURG\",IF(OR(B132=\"NEON\"),\"SOFOVAR\",IF(OR(B132=\"PEINTURES\",B132=\"PRODUITS NON IDENTIFIES\",B132=\"AEROSOLS\",B132=\"HUILES VEGETALES\"),\"OREDUI\",IF(OR(B132=\"HUILES DE VIDANGE\"),\"SERAHU\")))))))","v":false}]
[null,null,null,null,null,false,false]
[null,null,null,null,null,false,false]
[null,null,null,null,null,false,false]
[null,null,null,null,null,false,false]
[null,null,null,null,null,false,false]
[null,null,null,null,null,false,false]
[null,null,null,null,null,false,false]
[null,null,null,null,null,false,false]
[null,null,null,null,null,false,false]
[null,null,null,null,null,false,false]
[null,null,null,null,null,false,false]
[null,null,null,null,null,false,false]
[null,null,null,null,null,false,false]
[null,null,null,null,null,false,false]
[null,null,null,null,null,false,false]
[null,null,null,null,null,false,false]
[null,null,null,null,null,false,false]
[null,null,null,null,null,false,false]
[null,null,null,null,null,false,false]
[null,null,null,null,null,false,false]
[null,null,null,null,null,false,false]
[null,null,null,null,null,false,false]
[null,null,null,null,null,false,false]
[null,null,null,null,null,false,false]
[null,null,null,null,null,false,false]
[null,null,null,null,null,false,false]
[null,null,null,null,null,false,false]
[null,null,null,null,null,false,false]
[null,null,null,null,null,false,false]
[null,null,null,null,null,false,false]
[null,null,null,null,null,false,false]
[null,null,null,null,null,false,false]
[null,null,null,null,null,false,false]
[null,null,null,null,null,false,false]
[null,null,null,null,null,false,false]
[null,null,null,null,null,false,false]
[null,null,null,null,null,false,false]
[null,null,null,null,null,false,false]
[null,null,null,null,null,false,false]
[null,null,null,null,null,false,false]
[null,null,null,null,null,false,false]
[null,null,null,null,null,false,false]
[null,null,null,null,null,false,false]
[null,null,null,null,null,false,false]
[null,null,null,null,null,false,false]
[null,null,null,null,null,false,false]
[null,null,null,null,null,false,false]
[null,null,null,null,null,false,false]
[null,null,null,null,null,false,false]
[null,null,null,null,null,false,false]
[null,null,null,null,null,false,false]
[null,null,null,null,null,false,false]
[null,null,null,null,null,false,false]
[null,null,null,null,null,false,false]
[null,null,null,null,null,false,false]
[null,null,null,null,null,false,false]
[null,null,null,null,null,false,false]
[null,null,null,null,null,false,false]
[null,null,null,null,null,false,false]
[null,null,null,null,null,false,false]
[null,null,null,null,null,false,false]
[null,null,null,null,null,false,false]
[null,null,null,null,null,false,false]
[null,null,null,null,null,{"$f":"IF(B196=\"TOUT VENANT\",\"Véolia Nice Tri - Parc d'activité logistique\",IF(B196=\"DECHETS VERTS\",\"Orédui Carros Compostage - ZI de la Grave\",IF(B196=\"GRAVATS PROPRES\",\"La Gaude K3 Sita Sud - 5211 Rte de St Jeannet\",IF(B196=\"GRAVATS SALES\",\"Véolia Nice Tri - 20 Ch du Saquier\",IF(B196=\"BOIS\",\"SEAS La Glacière - 1019 Rte de la Grasse\",IF(B196=\"METAUX\",\"PURFER - ZI Carros 15ème Rue - 06517 Carros\",IF(B196=\"BATTERIES\",\"PURFER - ZI Carros 15ème Rue - 06517 Carros\",IF(B196=\"NEON\",\"Sofovar - 126 Av Louis Lépine - 83600 Fréjus\",IF(B196=\"PEINTURES\",\"Orédui - ZI Bois de Grasse - 06310 Grasse\",IF(B196=\"PRODUITS NON IDENTIFIES\",\"Orédui - ZI Bois de Grasse - 06310 Grasse\",IF(B196=\"AEROSOLS\",\"Orédui - ZI Bois de Grasse - 06310 Grasse\",IF(B196=\"FROIDS\",\"SEAS - 1079 Rte de Grasse - 06270 Villeneuve Loubet\",IF(B196=\"HORS FROIDS\",\"SEAS - 1079 Rte de Grasse - 06270 Villeneuve Loubet\",IF(B196=\"PAM\",\"SEAS - 1079 Rte de Grasse - 06270 Villeneuve Loubet\",IF(B196=\"ECRANS\",\"SEAS - 1079 Rte de Grasse - 06270 Villeneuve Loubet\",IF(B196=\"BOX HORS FROIDS\",\"SEAS - 1079 Rte de Grasse - 06270 Villeneuve Loubet\",IF(B196=\"PILES\",\"Corepile\",IF(B196=\"CUMULUS\",\"SEAS - 1079 Rte de Grasse - 06270 Villeneuve Loubet\",IF(B196=\"PNEUS\",\"TFM Pneus - 117 Ch Clausonnes - 06560 Valbonne\",IF(B196=\"HUILES VEGETALES\",\"Orédui - ZI Bois de Grasse - 06310 Grasse\",IF(B196=\"HUILES DE VIDANGE\",\"SERAHU - 68 Ch de la Campanette - 06800 Cagnes sur Mer\")))))))))))))))))))))","v":false},{"$f":"IF(OR(B196=\"TOUT VENANT\",B196=\"DECHETS VERTS\",B196=\"GRAVATS SALES\",B196=\"GRAVATS PROPRES\",B196=\"BOIS\"),\"SUEZ\",IF(OR(B196=\"PNEUS\"),\"TFM\",IF(OR(B196=\"FROIDS\",B196=\"HORS FROIDS\",B196=\"BOX HORS FROIDS\",B196=\"CUMULUS\",B196=\"PAM\",B196=\"ECRANS\"),\"SEAS\",IF(OR(B196=\"METAUX\",B196=\"BATTERIES\"),\"DERICHEBOURG\",IF(OR(B196=\"NEON\"),\"SOFOVAR\",IF(OR(B196=\"PEINTURES\",B196=\"PRODUITS NON IDENTIFIES\",B196=\"AEROSOLS\",B196=\"HUILES VEGETALES\"),\"OREDUI\",IF(OR(B196=\"HUILES DE VIDANGE\"),\"SERAHU\")))))))","v":false}]
[null,null,null,null,null,false,false]
[null,null,null,null,null,false,false]
[null,null,null,null,null,false,false]
[null,null,null,null,null,false,false]
[null,null,null,null,null,false,false]
[null,null,null,null,null,false,false]
[null,null,null,null,null,false,false]
[null,null,null,null,null,false,false]
[null,null,null,null,null,false,false]
[null,null,null,null,null,false,false]
[null,null,null,null,null,false,false]
[null,null,null,null,null,false,false]
[null,null,null,null,null,false,false]
[null,null,null,null,null,false,false]
[null,null,null,null,null,false,false]
[null,null,null,null,null,false,false]
[null,null,null,null,null,false,false]
[null,null,null,null,null,false,false]
[null,null,null,null,null,false,false]
[null,null,null,null,null,false,false]
[null,null,null,null,null,false,false]
[null,null,null,null,null,false,false]
[null,null,null,null,null,false,false]
[null,null,null,null,null,false,false]
[null,null,null,null,null,false,false]
[null,null,null,null,null,false,false]
[null,null,null,null,null,false,false]
[null,null,null,null,null,false,false]
[null,null,null,null,null,false,false]
[null,null,null,null,null,false,false]
[null,null,null,null,null,false,false]
[null,null,null,null,null,false,false]
[null,null,null,null,null,false,false]
[null,null,null,null,null,false,false]
[null,null,null,null,null,false,false]
[null,null,null,null,null,false,false]
[null,null,null,null,null,false,false]
[null,null,null,null,null,false,false]
[null,null,null,null,null,false,false]
[null,null,null,null,null,false,false]
[null,null,null,null,null,false,false]
[null,null,null,null,null,false,false]
[null,null,null,null,null,false,false]
[null,null,null,null,null,false,false]
[null,null,null,null,null,false,false]
[null,null,null,null,null,false,false]
[null,null,null,null,null,false,false]
[null,null,null,null,null,false,false]
[null,null,null,null,null,false,false]
[null,null,null,null,null,false,false]
[null,null,null,null,null,false,false]
[null,null,null,null,null,false,false]
[null,null,null,null,null,false,false]
[null,null,null,null,null,false,false]
[null,null,null,null,null,false,false]
[null,null,null,null,null,false,false]
[null,null,null,null,null,false,false]
[null,null,null,null,null,false,false]
[null,null,null,null,null,false,false]
[null,null,null,null,null,false,false]
[null,null,null,null,null,false,false]
[null,null,null,null,null,false,false]
[null,null,null,null,null,false,false]
[null,null,null,null,null,{"$f":"IF(B260=\"TOUT VENANT\",\"Véolia Nice Tri - Parc d'activité logistique\",IF(B260=\"DECHETS VERTS\",\"Orédui Carros Compostage - ZI de la Grave\",IF(B260=\"GRAVATS PROPRES\",\"La Gaude K3 Sita Sud - 5211 Rte de St Jeannet\",IF(B260=\"GRAVATS SALES\",\"Véolia Nice Tri - 20 Ch du Saquier\",IF(B260=\"BOIS\",\"SEAS La Glacière - 1019 Rte de la Grasse\",IF(B260=\"METAUX\",\"PURFER - ZI Carros 15ème Rue - 06517 Carros\",IF(B260=\"BATTERIES\",\"PURFER - ZI Carros 15ème Rue - 06517 Carros\",IF(B260=\"NEON\",\"Sofovar - 126 Av Louis Lépine - 83600 Fréjus\",IF(B260=\"PEINTURES\",\"Orédui - ZI Bois de Grasse - 06310 Grasse\",IF(B260=\"PRODUITS NON IDENTIFIES\",\"Orédui - ZI Bois de Grasse - 06310 Grasse\",IF(B260=\"AEROSOLS\",\"Orédui - ZI Bois de Grasse - 06310 Grasse\",IF(B260=\"FROIDS\",\"SEAS - 1079 Rte de Grasse - 06270 Villeneuve Loubet\",IF(B260=\"HORS FROIDS\",\"SEAS - 1079 Rte de Grasse - 06270 Villeneuve Loubet\",IF(B260=\"PAM\",\"SEAS - 1079 Rte de Grasse - 06270 Villeneuve Loubet\",IF(B260=\"ECRANS\",\"SEAS - 1079 Rte de Grasse - 06270 Villeneuve Loubet\",IF(B260=\"BOX HORS FROIDS\",\"SEAS - 1079 Rte de Grasse - 06270 Villeneuve Loubet\",IF(B260=\"PILES\",\"Corepile\",IF(B260=\"CUMULUS\",\"SEAS - 1079 Rte de Grasse - 06270 Villeneuve Loubet\",IF(B260=\"PNEUS\",\"TFM Pneus - 117 Ch Clausonnes - 06560 Valbonne\",IF(B260=\"HUILES VEGETALES\",\"Orédui - ZI Bois de Grasse - 06310 Grasse\",IF(B260=\"HUILES DE VIDANGE\",\"SERAHU - 68 Ch de la Campanette - 06800 Cagnes sur Mer\")))))))))))))))))))))","v":false},{"$f":"IF(OR(B260=\"TOUT VENANT\",B260=\"DECHETS VERTS\",B260=\"GRAVATS SALES\",B260=\"GRAVATS PROPRES\",B260=\"BOIS\"),\"SUEZ\",IF(OR(B260=\"PNEUS\"),\"TFM\",IF(OR(B260=\"FROIDS\",B260=\"HORS FROIDS\",B260=\"BOX HORS FROIDS\",B260=\"CUMULUS\",B260=\"PAM\",B260=\"ECRANS\"),\"SEAS\",IF(OR(B260=\"METAUX\",B260=\"BATTERIES\"),\"DERICHEBOURG\",IF(OR(B260=\"NEON\"),\"SOFOVAR\",IF(OR(B260=\"PEINTURES\",B260=\"PRODUITS NON IDENTIFIES\",B260=\"AEROSOLS\",B260=\"HUILES VEGETALES\"),\"OREDUI\",IF(OR(B260=\"HUILES DE VIDANGE\"),\"SERAHU\")))))))","v":false}]
[null,null,null,null,null,false,false]
[null,null,null,null,null,false,false]
[null,null,null,null,null,false,false]
[null,null,null,null,null,false,false]
[null,null,null,null,null,false,false]
[null,null,null,null,null,false,false]
[null,null,null,null,null,false,false]
[null,null,null,null,null,false,false]
[null,null,null,null,null,false,false]
[null,null,null,null,null,false,false]
[null,null,null,null,null,false,false]
[null,null,null,null,null,false,false]
[null,null,null,null,null,false,false]
[null,null,null,null,null,false,false]
[null,null,null,null,null,false,false]
[null,null,null,null,null,false,false]
[null,null,null,null,null,false,false]
[null,null,null,null,null,false,false]
[null,null,null,null,null,false,false]
[null,null,null,null,null,false,false]
[null,null,null,null,null,false,false]
[null,null,null,null,null,false,false]
[null,null,null,null,null,false,false]
[null,null,null,null,null,false,false]
[null,null,null,null,null,false,false]
[null,null,null,null,null,false,false]
[null,null,null,null,null,false,false]
[null,null,null,null,null,false,false]
[null,null,null,null,null,false,false]
[null,null,null,null,null,false,false]
[null,null,null,null,null,false,false]
[null,null,null,null,null,false,false]
[null,null,null,null,null,false,false]
[null,null,null,null,null,false,false]
[null,null,null,null,null,false,false]
[null,null,null,null,null,false,false]
[null,null,null,null,null,false,false]
[null,null,null,null,null,false,false]
[null,null,null,null,null,false,false]
[null,null,null,null,null,false,false]
[null,null,null,null,null,false,false]
[null,null,null,null,null,false,false]
[null,null,null,null,null,false,false]
[null,null,null,null,null,false,false]
[null,null,null,null,null,false,false]
[null,null,null,null,null,false,false]
[null,null,null,null,null,false,false]
[null,null,null,null,null,false,false]
[null,null,null,null,null,false,false]
[null,null,null,null,null,false,false]
[null,null,null,null,null,false,false]
[null,null,null,null,null,false,false]
[null,null,null,null,null,false,false]
[null,null,null,null,null,false,false]
[null,null,null,null,null,false,false]
[null,null,null,null,null,false,false]
[null,null,null,null,null,false,false]
[null,null,null,null,null,false,false]
[null,null,null,null,null,false,false]
[null,null,null,null,null,false,false]
[null,null,null,null,null,false,false]
[null,null,null,null,null,false,false]
[null,null,null,null,null,false,false]
[null,null,null,null,null,{"$f":"IF(B324=\"TOUT VENANT\",\"Véolia Nice Tri - Parc d'activité logistique\",IF(B324=\"DECHETS VERTS\",\"Orédui Carros Compostage - ZI de la Grave\",IF(B324=\"GRAVATS PROPRES\",\"La Gaude K3 Sita Sud - 5211 Rte de St Jeannet\",IF(B324=\"GRAVATS SALES\",\"Véolia Nice Tri - 20 Ch du Saquier\",IF(B324=\"BOIS\",\"SEAS La Glacière - 1019 Rte de la Grasse\",IF(B324=\"METAUX\",\"PURFER - ZI Carros 15ème Rue - 06517 Carros\",IF(B324=\"BATTERIES\",\"PURFER - ZI Carros 15ème Rue - 06517 Carros\",IF(B324=\"NEON\",\"Sofovar - 126 Av Louis Lépine - 83600 Fréjus\",IF(B324=\"PEINTURES\",\"Orédui - ZI Bois de Grasse - 06310 Grasse\",IF(B324=\"PRODUITS NON IDENTIFIES\",\"Orédui - ZI Bois de Grasse - 06310 Grasse\",IF(B324=\"AEROSOLS\",\"Orédui - ZI Bois de Grasse - 06310 Grasse\",IF(B324=\"FROIDS\",\"SEAS - 1079 Rte de Grasse - 06270 Villeneuve Loubet\",IF(B324=\"HORS FROIDS\",\"SEAS - 1079 Rte de Grasse - 06270 Villeneuve Loubet\",IF(B324=\"PAM\",\"SEAS - 1079 Rte de Grasse - 06270 Villeneuve Loubet\",IF(B324=\"ECRANS\",\"SEAS - 1079 Rte de Grasse - 06270 Villeneuve Loubet\",IF(B324=\"BOX HORS FROIDS\",\"SEAS - 1079 Rte de Grasse - 06270 Villeneuve Loubet\",IF(B324=\"PILES\",\"Corepile\",IF(B324=\"CUMULUS\",\"SEAS - 1079 Rte de Grasse - 06270 Villeneuve Loubet\",IF(B324=\"PNEUS\",\"TFM Pneus - 117 Ch Clausonnes - 06560 Valbonne\",IF(B324=\"HUILES VEGETALES\",\"Orédui - ZI Bois de Grasse - 06310 Grasse\",IF(B324=\"HUILES DE VIDANGE\",\"SERAHU - 68 Ch de la Campanette - 06800 Cagnes sur Mer\")))))))))))))))))))))","v":false},{"$f":"IF(OR(B324=\"TOUT VENANT\",B324=\"DECHETS VERTS\",B324=\"GRAVATS SALES\",B324=\"GRAVATS PROPRES\",B324=\"BOIS\"),\"SUEZ\",IF(OR(B324=\"PNEUS\"),\"TFM\",IF(OR(B324=\"FROIDS\",B324=\"HORS FROIDS\",B324=\"BOX HORS FROIDS\",B324=\"CUMULUS\",B324=\"PAM\",B324=\"ECRANS\"),\"SEAS\",IF(OR(B324=\"METAUX\",B324=\"BATTERIES\"),\"DERICHEBOURG\",IF(OR(B324=\"NEON\"),\"SOFOVAR\",IF(OR(B324=\"PEINTURES\",B324=\"PRODUITS NON IDENTIFIES\",B324=\"AEROSOLS\",B324=\"HUILES VEGETALES\"),\"OREDUI\",IF(OR(B324=\"HUILES DE VIDANGE\"),\"SERAHU\")))))))","v":false}]
[null,null,null,null,null,false,false]
[null,null,null,null,null,false,false]
[null,null,null,null,null,false,false]
[null,null,null,null,null,false,false]
[null,null,null,null,null,false,false]
[null,null,null,null,null,false,false]
[null,null,null,null,null,false,false]
[null,null,null,null,null,false,false]
[null,null,null,null,null,false,false]
[null,null,null,null,null,false,false]
[null,null,null,null,null,false,false]
[null,null,null,null,null,false,false]
[null,null,null,null,null,false,false]
[null,null,null,null,null,false,false]
[null,null,null,null,null,false,false]
[null,null,null,null,null,false,false]
[null,null,null,null,null,false,false]
[null,null,null,null,null,false,false]
[null,null,null,null,null,false,false]
[null,null,null,null,null,false,false]
[null,null,null,null,null,false,false]
[null,null,null,null,null,false,false]
[null,null,null,null,null,false,false]
[null,null,null,null,null,false,false]
[null,null,null,null,null,false,false]
[null,null,null,null,null,false,false]
[null,null,null,null,null,false,false]
[null,null,null,null,null,false,false]
[null,null,null,null,null,false,false]
[null,null,null,null,null,false,false]
[null,null,null,null,null,false,false]
[null,null,null,null,null,false,false]
[null,null,null,null,null,false,false]
[null,null,null,null,null,false,false]
[null,null,null,null,null,false,false]
[null,null,null,null,null,false,false]
[null,null,null,null,null,false,false]
[null,null,null,null,null,false,false]
[null,null,null,null,null,false,false]
[null,null,null,null,null,false,false]
[null,null,null,null,null,false,false]
[null,null,null,null,null,false,false]
[null,null,null,null,null,false,false]
[null,null,null,null,null,false,false]
[null,null,null,null,null,false,false]
[null,null,null,null,null,false,false]
[null,null,null,null,null,false,false]
[null,null,null,null,null,false,false]
[null,null,null,null,null,false,false]
[null,null,null,null,null,false,false]
[null,null,null,null,null,false,false]
[null,null,null,null,null,false,false]
[null,null,null,null,null,false,false]
[null,null,null,null,null,false,false]
[null,null,null,null,null,false,false]
[null,null,null,null,null,false,false]
[null,null,null,null,null,false,false]
[null,null,null,null,null,false,false]
[null,null,null,null,null,false,false]
[null,null,null,null,null,false,false]
[null,null,null,null,null,false,false]
[null,null,null,null,null,false,false]
[null,null,null,null,null,false,false]
[null,null,null,null,null,{"$f":"IF(B388=\"TOUT VENANT\",\"Véolia Nice Tri - Parc d'activité logistique\",IF(B388=\"DECHETS VERTS\",\"Orédui Carros Compostage - ZI de la Grave\",IF(B388=\"GRAVATS PROPRES\",\"La Gaude K3 Sita Sud - 5211 Rte de St Jeannet\",IF(B388=\"GRAVATS SALES\",\"Véolia Nice Tri - 20 Ch du Saquier\",IF(B388=\"BOIS\",\"SEAS La Glacière - 1019 Rte de la Grasse\",IF(B388=\"METAUX\",\"PURFER - ZI Carros 15ème Rue - 06517 Carros\",IF(B388=\"BATTERIES\",\"PURFER - ZI Carros 15ème Rue - 06517 Carros\",IF(B388=\"NEON\",\"Sofovar - 126 Av Louis Lépine - 83600 Fréjus\",IF(B388=\"PEINTURES\",\"Orédui - ZI Bois de Grasse - 06310 Grasse\",IF(B388=\"PRODUITS NON IDENTIFIES\",\"Orédui - ZI Bois de Grasse - 06310 Grasse\",IF(B388=\"AEROSOLS\",\"Orédui - ZI Bois de Grasse - 06310 Grasse\",IF(B388=\"FROIDS\",\"SEAS - 1079 Rte de Grasse - 06270 Villeneuve Loubet\",IF(B388=\"HORS FROIDS\",\"SEAS - 1079 Rte de Grasse - 06270 Villeneuve Loubet\",IF(B388=\"PAM\",\"SEAS - 1079 Rte de Grasse - 06270 Villeneuve Loubet\",IF(B388=\"ECRANS\",\"SEAS - 1079 Rte de Grasse - 06270 Villeneuve Loubet\",IF(B388=\"BOX HORS FROIDS\",\"SEAS - 1079 Rte de Grasse - 06270 Villeneuve Loubet\",IF(B388=\"PILES\",\"Corepile\",IF(B388=\"CUMULUS\",\"SEAS - 1079 Rte de Grasse - 06270 Villeneuve Loubet\",IF(B388=\"PNEUS\",\"TFM Pneus - 117 Ch Clausonnes - 06560 Valbonne\",IF(B388=\"HUILES VEGETALES\",\"Orédui - ZI Bois de Grasse - 06310 Grasse\",IF(B388=\"HUILES DE VIDANGE\",\"SERAHU - 68 Ch de la Campanette - 06800 Cagnes sur Mer\")))))))))))))))))))))","v":false},{"$f":"IF(OR(B388=\"TOUT VENANT\",B388=\"DECHETS VERTS\",B388=\"GRAVATS SALES\",B388=\"GRAVATS PROPRES\",B388=\"BOIS\"),\"SUEZ\",IF(OR(B388=\"PNEUS\"),\"TFM\",IF(OR(B388=\"FROIDS\",B388=\"HORS FROIDS\",B388=\"BOX HORS FROIDS\",B388=\"CUMULUS\",B388=\"PAM\",B388=\"ECRANS\"),\"SEAS\",IF(OR(B388=\"METAUX\",B388=\"BATTERIES\"),\"DERICHEBOURG\",IF(OR(B388=\"NEON\"),\"SOFOVAR\",IF(OR(B388=\"PEINTURES\",B388=\"PRODUITS NON IDENTIFIES\",B388=\"AEROSOLS\",B388=\"HUILES VEGETALES\"),\"OREDUI\",IF(OR(B388=\"HUILES DE VIDANGE\"),\"SERAHU\")))))))","v":false}]
[null,null,null,null,null,false,false]
[null,null,null,null,null,false,false]
[null,null,null,null,null,false,false]
[null,null,null,null,null,false,false]
[null,null,null,null,null,false,false]
[null,null,null,null,null,false,false]
[null,null,null,null,null,false,false]
[null,null,null,null,null,false,false]
[null,null,null,null,null,false,false]
[null,null,null,null,null,false,false]
[null,null,null,null,null,false,false]
[null,null,null,null,null,false,false]
[null,null,null,null,null,false,false]
[null,null,null,null,null,false,false]
[null,null,null,null,null,false,false]
[null,null,null,null,null,false,false]
[null,null,null,null,null,false,false]
[null,null,null,null,null,false,false]
[null,null,null,null,null,false,false]
[null,null,null,null,null,false,false]
[null,null,null,null,null,false,false]
[null,null,null,null,null,false,false]
[null,null,null,null,null,false,false]
[null,null,null,null,null,false,false]
[null,null,null,null,null,false,false]
[null,null,null,null,null,false,false]
[null,null,null,null,null,false,false]
[null,null,null,null,null,false,false]
[null,null,null,null,null,false,false]
[null,null,null,null,null,false,false]
[null,null,null,null,null,false,false]
[null,null,null,null,null,false,false]
[null,null,null,null,null,false,false]
[null,null,null,null,null,false,false]
[null,null,null,null,null,false,false]
[null,null,null,null,null,false,false]
[null,null,null,null,null,false,false]
[null,null,null,null,null,false,false]
[null,null,null,null,null,false,false]
[null,null,null,null,null,false,false]
[null,null,null,null,null,false,false]
[null,null,null,null,null,false,false]
[null,null,null,null,null,false,false]
[null,null,null,null,null,false,false]
[null,null,null,null,null,false,false]
[null,null,null,null,null,false,false]
[null,null,null,null,null,false,false]
[null,null,null,null,null,false,false]
[null,null,null,null,null,false,false]
[null,null,null,null,null,false,false]
[null,null,null,null,null,false,false]
[null,null,null,null,null,false,false]
[null,null,null,null,null,false,false]
[null,null,null,null,null,false,false]
[null,null,null,null,null,false,false]
[null,null,null,null,null,false,false]
[null,null,null,null,null,false,false]
[null,null,null,null,null,false,false]
[null,null,null,null,null,false,false]
[null,null,null,null,null,false,false]
[null,null,null,null,null,false,false]
[null,null,null,null,null,false,false]
[null,null,null,null,null,false,false]
[null,null,null,null,null,{"$f":"IF(B452=\"TOUT VENANT\",\"Véolia Nice Tri - Parc d'activité logistique\",IF(B452=\"DECHETS VERTS\",\"Orédui Carros Compostage - ZI de la Grave\",IF(B452=\"GRAVATS PROPRES\",\"La Gaude K3 Sita Sud - 5211 Rte de St Jeannet\",IF(B452=\"GRAVATS SALES\",\"Véolia Nice Tri - 20 Ch du Saquier\",IF(B452=\"BOIS\",\"SEAS La Glacière - 1019 Rte de la Grasse\",IF(B452=\"METAUX\",\"PURFER - ZI Carros 15ème Rue - 06517 Carros\",IF(B452=\"BATTERIES\",\"PURFER - ZI Carros 15ème Rue - 06517 Carros\",IF(B452=\"NEON\",\"Sofovar - 126 Av Louis Lépine - 83600 Fréjus\",IF(B452=\"PEINTURES\",\"Orédui - ZI Bois de Grasse - 06310 Grasse\",IF(B452=\"PRODUITS NON IDENTIFIES\",\"Orédui - ZI Bois de Grasse - 06310 Grasse\",IF(B452=\"AEROSOLS\",\"Orédui - ZI Bois de Grasse - 06310 Grasse\",IF(B452=\"FROIDS\",\"SEAS - 1079 Rte de Grasse - 06270 Villeneuve Loubet\",IF(B452=\"HORS FROIDS\",\"SEAS - 1079 Rte de Grasse - 06270 Villeneuve Loubet\",IF(B452=\"PAM\",\"SEAS - 1079 Rte de Grasse - 06270 Villeneuve Loubet\",IF(B452=\"ECRANS\",\"SEAS - 1079 Rte de Grasse - 06270 Villeneuve Loubet\",IF(B452=\"BOX HORS FROIDS\",\"SEAS - 1079 Rte de Grasse - 06270 Villeneuve Loubet\",IF(B452=\"PILES\",\"Corepile\",IF(B452=\"CUMULUS\",\"SEAS - 1079 Rte de Grasse - 06270 Villeneuve Loubet\",IF(B452=\"PNEUS\",\"TFM Pneus - 117 Ch Clausonnes - 06560 Valbonne\",IF(B452=\"HUILES VEGETALES\",\"Orédui - ZI Bois de Grasse - 06310 Grasse\",IF(B452=\"HUILES DE VIDANGE\",\"SERAHU - 68 Ch de la Campanette - 06800 Cagnes sur Mer\")))))))))))))))))))))","v":false},{"$f":"IF(OR(B452=\"TOUT VENANT\",B452=\"DECHETS VERTS\",B452=\"GRAVATS SALES\",B452=\"GRAVATS PROPRES\",B452=\"BOIS\"),\"SUEZ\",IF(OR(B452=\"PNEUS\"),\"TFM\",IF(OR(B452=\"FROIDS\",B452=\"HORS FROIDS\",B452=\"BOX HORS FROIDS\",B452=\"CUMULUS\",B452=\"PAM\",B452=\"ECRANS\"),\"SEAS\",IF(OR(B452=\"METAUX\",B452=\"BATTERIES\"),\"DERICHEBOURG\",IF(OR(B452=\"NEON\"),\"SOFOVAR\",IF(OR(B452=\"PEINTURES\",B452=\"PRODUITS NON IDENTIFIES\",B452=\"AEROSOLS\",B452=\"HUILES VEGETALES\"),\"OREDUI\",IF(OR(B452=\"HUILES DE VIDANGE\"),\"SERAHU\")))))))","v":false}]
[null,null,null,null,null,false,false]
[null,null,null,null,null,false,false]
[null,null,null,null,null,false,false]
[null,null,null,null,null,false,false]
[null,null,null,null,null,false,false]
[null,null,null,null,null,false,false]
[null,null,null,null,null,false,false]
[null,null,null,null,null,false,false]
[null,null,null,null,null,false,false]
[null,null,null,null,null,false,false]
[null,null,null,null,null,false,false]
[null,null,null,null,null,false,false]
[null,null,null,null,null,false,false]
[null,null,null,null,null,false,false]
[null,null,null,null,null,false,false]
[null,null,null,null,null,false,false]
[null,null,null,null,null,false,false]
[null,null,null,null,null,false,false]
[null,null,null,null,null,false,false]
[null,null,null,null,null,false,false]
[null,null,null,null,null,false,false]
[null,null,null,null,null,false,false]
[null,null,null,null,null,false,false]
[null,null,null,null,null,false,false]
[null,null,null,null,null,false,false]
[null,null,null,null,null,false,false]
[null,null,null,null,null,false,false]
[null,null,null,null,null,false,false]
[null,null,null,null,null,false,false]
[null,null,null,null,null,false,false]
[null,null,null,null,null,false,false]
[null,null,null,null,null,false,false]
[null,null,null,null,null,false,false]
[null,null,null,null,null,false,false]
[null,null,null,null,null,false,false]
[null,null,null,null,null,false,false]
[null,null,null,null,null,false,false]
[null,null,null,null,null,false,false]
[null,null,null,null,null,false,false]
[null,null,null,null,null,false,false]
[null,null,null,null,null,false,false]
[null,null,null,null,null,false,false]
[null,null,null,null,null,false,false]
[null,null,null,null,null,false,false]
[null,null,null,null,null,false,false]
[null,null,null,null,null,false,false]
[null,null,null,null,null,false,false]
[null,null,null,null,null,false,false]
[null,null,null,null,null,false,false]
[null,null,null,null,null,false,false]
[null,null,null,null,null,false,false]
[null,null,null,null,null,false,false]
[null,null,null,null,null,false,false]
[null,null,null,null,null,false,false]
[null,null,null,null,null,false,false]
[null,null,null,null,null,false,false]
[null,null,null,null,null,false,false]
[null,null,null,null,null,false,false]
[null,null,null,null,null,false,false]
[null,null,null,null,null,false,false]
[null,null,null,null,null,false,false]
[null,null,null,null,null,false,false]
[null,null,null,null,null,false,false]
[null,null,null,null,null,{"$f":"IF(B516=\"TOUT VENANT\",\"Véolia Nice Tri - Parc d'activité logistique\",IF(B516=\"DECHETS VERTS\",\"Orédui Carros Compostage - ZI de la Grave\",IF(B516=\"GRAVATS PROPRES\",\"La Gaude K3 Sita Sud - 5211 Rte de St Jeannet\",IF(B516=\"GRAVATS SALES\",\"Véolia Nice Tri - 20 Ch du Saquier\",IF(B516=\"BOIS\",\"SEAS La Glacière - 1019 Rte de la Grasse\",IF(B516=\"METAUX\",\"PURFER - ZI Carros 15ème Rue - 06517 Carros\",IF(B516=\"BATTERIES\",\"PURFER - ZI Carros 15ème Rue - 06517 Carros\",IF(B516=\"NEON\",\"Sofovar - 126 Av Louis Lépine - 83600 Fréjus\",IF(B516=\"PEINTURES\",\"Orédui - ZI Bois de Grasse - 06310 Grasse\",IF(B516=\"PRODUITS NON IDENTIFIES\",\"Orédui - ZI Bois de Grasse - 06310 Grasse\",IF(B516=\"AEROSOLS\",\"Orédui - ZI Bois de Grasse - 06310 Grasse\",IF(B516=\"FROIDS\",\"SEAS - 1079 Rte de Grasse - 06270 Villeneuve Loubet\",IF(B516=\"HORS FROIDS\",\"SEAS - 1079 Rte de Grasse - 06270 Villeneuve Loubet\",IF(B516=\"PAM\",\"SEAS - 1079 Rte de Grasse - 06270 Villeneuve Loubet\",IF(B516=\"ECRANS\",\"SEAS - 1079 Rte de Grasse - 06270 Villeneuve Loubet\",IF(B516=\"BOX HORS FROIDS\",\"SEAS - 1079 Rte de Grasse - 06270 Villeneuve Loubet\",IF(B516=\"PILES\",\"Corepile\",IF(B516=\"CUMULUS\",\"SEAS - 1079 Rte de Grasse - 06270 Villeneuve Loubet\",IF(B516=\"PNEUS\",\"TFM Pneus - 117 Ch Clausonnes - 06560 Valbonne\",IF(B516=\"HUILES VEGETALES\",\"Orédui - ZI Bois de Grasse - 06310 Grasse\",IF(B516=\"HUILES DE VIDANGE\",\"SERAHU - 68 Ch de la Campanette - 06800 Cagnes sur Mer\")))))))))))))))))))))","v":false},{"$f":"IF(OR(B516=\"TOUT VENANT\",B516=\"DECHETS VERTS\",B516=\"GRAVATS SALES\",B516=\"GRAVATS PROPRES\",B516=\"BOIS\"),\"SUEZ\",IF(OR(B516=\"PNEUS\"),\"TFM\",IF(OR(B516=\"FROIDS\",B516=\"HORS FROIDS\",B516=\"BOX HORS FROIDS\",B516=\"CUMULUS\",B516=\"PAM\",B516=\"ECRANS\"),\"SEAS\",IF(OR(B516=\"METAUX\",B516=\"BATTERIES\"),\"DERICHEBOURG\",IF(OR(B516=\"NEON\"),\"SOFOVAR\",IF(OR(B516=\"PEINTURES\",B516=\"PRODUITS NON IDENTIFIES\",B516=\"AEROSOLS\",B516=\"HUILES VEGETALES\"),\"OREDUI\",IF(OR(B516=\"HUILES DE VIDANGE\"),\"SERAHU\")))))))","v":false}]
[null,null,null,null,null,false,false]
[null,null,null,null,null,false,false]
[null,null,null,null,null,false,false]
[null,null,null,null,null,false,false]
[null,null,null,null,null,false,false]
[null,null,null,null,null,false,false]
[null,null,null,null,null,false,false]
[null,null,null,null,null,false,false]
[null,null,null,null,null,false,false]
[null,null,null,null,null,false,false]
[null,null,null,null,null,false,false]
[null,null,null,null,null,false,false]
[null,null,null,null,null,false,false]
[null,null,null,null,null,false,false]
[null,null,null,null,null,false,false]
[null,null,null,null,null,false,false]
[null,null,null,null,null,false,false]
[null,null,null,null,null,false,false]
[null,null,null,null,null,false,false]
[null,null,null,null,null,false,false]
[null,null,null,null,null,false,false]
[null,null,null,null,null,false,false]
[null,null,null,null,null,false,false]
[null,null,null,null,null,false,false]
[null,null,null,null,null,false,false]
[null,null,null,null,null,false,false]
[null,null,null,null,null,false,false]
[null,null,null,null,null,false,false]
[null,null,null,null,null,false,false]
[null,null,null,null,null,false,false]
[null,null,null,null,null,false,false]
[null,null,null,null,null,false,false]
[null,null,null,null,null,false,false]
[null,null,null,null,null,false,false]
[null,null,null,null,null,false,false]
[null,null,null,null,null,false,false]
[null,null,null,null,null,false,false]
[null,null,null,null,null,false,false]
[null,null,null,null,null,false,false]
[null,null,null,null,null,false,false]
[null,null,null,null,null,false,false]
[null,null,null,null,null,false,false]
[null,null,null,null,null,false,false]
[null,null,null,null,null,false,false]
[null,null,null,null,null,false,false]
[null,null,null,null,null,false,false]
[null,null,null,null,null,false,false]
[null,null,null,null,null,false,false]
[null,null,null,null,null,false,false]
[null,null,null,null,null,false,false]
[null,null,null,null,null,false,false]
[null,null,null,null,null,false,false]
[null,null,null,null,null,false,false]
[null,null,null,null,null,false,false]
[null,null,null,null,null,false,false]
[null,null,null,null,null,false,false]
[null,null,null,null,null,false,false]
[null,null,null,null,null,false,false]
[null,null,null,null,null,false,false]
[null,null,null,null,null,false,false]
[null,null,null,null,null,false,false]
[null,null,null,null,null,false,false]
[null,null,null,null,null,false,false]
[null,null,null,null,null,{"$f":"IF(B580=\"TOUT VENANT\",\"Véolia Nice Tri - Parc d'activité logistique\",IF(B580=\"DECHETS VERTS\",\"Orédui Carros Compostage - ZI de la Grave\",IF(B580=\"GRAVATS PROPRES\",\"La Gaude K3 Sita Sud - 5211 Rte de St Jeannet\",IF(B580=\"GRAVATS SALES\",\"Véolia Nice Tri - 20 Ch du Saquier\",IF(B580=\"BOIS\",\"SEAS La Glacière - 1019 Rte de la Grasse\",IF(B580=\"METAUX\",\"PURFER - ZI Carros 15ème Rue - 06517 Carros\",IF(B580=\"BATTERIES\",\"PURFER - ZI Carros 15ème Rue - 06517 Carros\",IF(B580=\"NEON\",\"Sofovar - 126 Av Louis Lépine - 83600 Fréjus\",IF(B580=\"PEINTURES\",\"Orédui - ZI Bois de Grasse - 06310 Grasse\",IF(B580=\"PRODUITS NON IDENTIFIES\",\"Orédui - ZI Bois de Grasse - 06310 Grasse\",IF(B580=\"AEROSOLS\",\"Orédui - ZI Bois de Grasse - 06310 Grasse\",IF(B580=\"FROIDS\",\"SEAS - 1079 Rte de Grasse - 06270 Villeneuve Loubet\",IF(B580=\"HORS FROIDS\",\"SEAS - 1079 Rte de Grasse - 06270 Villeneuve Loubet\",IF(B580=\"PAM\",\"SEAS - 1079 Rte de Grasse - 06270 Villeneuve Loubet\",IF(B580=\"ECRANS\",\"SEAS - 1079 Rte de Grasse - 06270 Villeneuve Loubet\",IF(B580=\"BOX HORS FROIDS\",\"SEAS - 1079 Rte de Grasse - 06270 Villeneuve Loubet\",IF(B580=\"PILES\",\"Corepile\",IF(B580=\"CUMULUS\",\"SEAS - 1079 Rte de Grasse - 06270 Villeneuve Loubet\",IF(B580=\"PNEUS\",\"TFM Pneus - 117 Ch Clausonnes - 06560 Valbonne\",IF(B580=\"HUILES VEGETALES\",\"Orédui - ZI Bois de Grasse - 06310 Grasse\",IF(B580=\"HUILES DE VIDANGE\",\"SERAHU - 68 Ch de la Campanette - 06800 Cagnes sur Mer\")))))))))))))))))))))","v":false},{"$f":"IF(OR(B580=\"TOUT VENANT\",B580=\"DECHETS VERTS\",B580=\"GRAVATS SALES\",B580=\"GRAVATS PROPRES\",B580=\"BOIS\"),\"SUEZ\",IF(OR(B580=\"PNEUS\"),\"TFM\",IF(OR(B580=\"FROIDS\",B580=\"HORS FROIDS\",B580=\"BOX HORS FROIDS\",B580=\"CUMULUS\",B580=\"PAM\",B580=\"ECRANS\"),\"SEAS\",IF(OR(B580=\"METAUX\",B580=\"BATTERIES\"),\"DERICHEBOURG\",IF(OR(B580=\"NEON\"),\"SOFOVAR\",IF(OR(B580=\"PEINTURES\",B580=\"PRODUITS NON IDENTIFIES\",B580=\"AEROSOLS\",B580=\"HUILES VEGETALES\"),\"OREDUI\",IF(OR(B580=\"HUILES DE VIDANGE\"),\"SERAHU\")))))))","v":false}]
[null,null,null,null,null,false,false]
[null,null,null,null,null,false,false]
[null,null,null,null,null,false,false]
[null,null,null,null,null,false,false]
[null,null,null,null,null,false,false]
[null,null,null,null,null,false,false]
[null,null,null,null,null,false,false]
[null,null,null,null,null,false,false]
[null,null,null,null,null,false,false]
[null,null,null,null,null,false,false]
[null,null,null,null,null,false,false]
[null,null,null,null,null,false,false]
[null,null,null,null,null,false,false]
[null,null,null,null,null,false,false]
[null,null,null,null,null,false,false]
[null,null,null,null,null,false,false]
[null,null,null,null,null,false,false]
[null,null,null,null,null,false,false]
[null,null,null,null,null,false,false]
[null,null,null,null,null,false,false]
[null,null,null,null,null,false,false]
[null,null,null,null,null,false,false]
[null,null,null,null,null,false,false]
[null,null,null,null,null,false,false]
[null,null,null,null,null,false,false]
[null,null,null,null,null,false,false]
[null,null,null,null,null,false,false]
[null,null,null,null,null,false,false]
[null,null,null,null,null,false,false]
[null,null,null,null,null,false,false]
[null,null,null,null,null,false,false]
[null,null,null,null,null,false,false]
[null,null,null,null,null,false,false]
[null,null,null,null,null,false,false]
[null,null,null,null,null,false,false]
[null,null,null,null,null,false,false]
[null,null,null,null,null,false,false]
[null,null,null,null,null,false,false]
[null,null,null,null,null,false,false]
[null,null,null,null,null,false,false]
[null,null,null,null,null,false,false]
[null,null,null,null,null,false,false]
[null,null,null,null,null,false,false]
[null,null,null,null,null,false,false]
[null,null,null,null,null,false,false]
[null,null,null,null,null,false,false]
[null,null,null,null,null,false,false]
[null,null,null,null,null,false,false]
[null,null,null,null,null,false,false]
[null,null,null,null,null,false,false]
[null,null,null,null,null,false,false]
[null,null,null,null,null,false,false]
[null,null,null,null,null,false,false]
[null,null,null,null,null,false,false]
[null,null,null,null,null,false,false]
[null,null,null,null,null,false,false]
[null,null,null,null,null,false,false]
[null,null,null,null,null,false,false]
[null,null,null,null,null,false,false]
[null,null,null,null,null,false,false]
[null,null,null,null,null,false,false]
[null,null,null,null,null,false,false]
[null,null,null,null,null,false,false]
[null,null,null,null,null,{"$f":"IF(B644=\"TOUT VENANT\",\"Véolia Nice Tri - Parc d'activité logistique\",IF(B644=\"DECHETS VERTS\",\"Orédui Carros Compostage - ZI de la Grave\",IF(B644=\"GRAVATS PROPRES\",\"La Gaude K3 Sita Sud - 5211 Rte de St Jeannet\",IF(B644=\"GRAVATS SALES\",\"Véolia Nice Tri - 20 Ch du Saquier\",IF(B644=\"BOIS\",\"SEAS La Glacière - 1019 Rte de la Grasse\",IF(B644=\"METAUX\",\"PURFER - ZI Carros 15ème Rue - 06517 Carros\",IF(B644=\"BATTERIES\",\"PURFER - ZI Carros 15ème Rue - 06517 Carros\",IF(B644=\"NEON\",\"Sofovar - 126 Av Louis Lépine - 83600 Fréjus\",IF(B644=\"PEINTURES\",\"Orédui - ZI Bois de Grasse - 06310 Grasse\",IF(B644=\"PRODUITS NON IDENTIFIES\",\"Orédui - ZI Bois de Grasse - 06310 Grasse\",IF(B644=\"AEROSOLS\",\"Orédui - ZI Bois de Grasse - 06310 Grasse\",IF(B644=\"FROIDS\",\"SEAS - 1079 Rte de Grasse - 06270 Villeneuve Loubet\",IF(B644=\"HORS FROIDS\",\"SEAS - 1079 Rte de Grasse - 06270 Villeneuve Loubet\",IF(B644=\"PAM\",\"SEAS - 1079 Rte de Grasse - 06270 Villeneuve Loubet\",IF(B644=\"ECRANS\",\"SEAS - 1079 Rte de Grasse - 06270 Villeneuve Loubet\",IF(B644=\"BOX HORS FROIDS\",\"SEAS - 1079 Rte de Grasse - 06270 Villeneuve Loubet\",IF(B644=\"PILES\",\"Corepile\",IF(B644=\"CUMULUS\",\"SEAS - 1079 Rte de Grasse - 06270 Villeneuve Loubet\",IF(B644=\"PNEUS\",\"TFM Pneus - 117 Ch Clausonnes - 06560 Valbonne\",IF(B644=\"HUILES VEGETALES\",\"Orédui - ZI Bois de Grasse - 06310 Grasse\",IF(B644=\"HUILES DE VIDANGE\",\"SERAHU - 68 Ch de la Campanette - 06800 Cagnes sur Mer\")))))))))))))))))))))","v":false},{"$f":"IF(OR(B644=\"TOUT VENANT\",B644=\"DECHETS VERTS\",B644=\"GRAVATS SALES\",B644=\"GRAVATS PROPRES\",B644=\"BOIS\"),\"SUEZ\",IF(OR(B644=\"PNEUS\"),\"TFM\",IF(OR(B644=\"FROIDS\",B644=\"HORS FROIDS\",B644=\"BOX HORS FROIDS\",B644=\"CUMULUS\",B644=\"PAM\",B644=\"ECRANS\"),\"SEAS\",IF(OR(B644=\"METAUX\",B644=\"BATTERIES\"),\"DERICHEBOURG\",IF(OR(B644=\"NEON\"),\"SOFOVAR\",IF(OR(B644=\"PEINTURES\",B644=\"PRODUITS NON IDENTIFIES\",B644=\"AEROSOLS\",B644=\"HUILES VEGETALES\"),\"OREDUI\",IF(OR(B644=\"HUILES DE VIDANGE\"),\"SERAHU\")))))))","v":false}]
[null,null,null,null,null,false,false]
[null,null,null,null,null,false,false]
[null,null,null,null,null,false,false]
[null,null,null,null,null,false,false]
[null,null,null,null,null,false,false]
[null,null,null,null,null,false,false]
[null,null,null,null,null,false,false]
[null,null,null,null,null,false,false]
[null,null,null,null,null,false,false]
[null,null,null,null,null,false,false]
[null,null,null,null,null,false,false]
[null,null,null,null,null,false,false]
[null,null,null,null,null,false,false]
[null,null,null,null,null,false,false]
[null,null,null,null,null,false,false]
[null,null,null,null,null,false,false]
[null,null,null,null,null,false,false]
[null,null,null,null,null,false,false]
[null,null,null,null,null,false,false]
[null,null,null,null,null,false,false]
[null,null,null,null,null,false,false]
[null,null,null,null,null,false,false]
[null,null,null,null,null,false,false]
[null,null,null,null,null,false,false]
[null,null,null,null,null,false,false]
[null,null,null,null,null,false,false]
[null,null,null,null,null,false,false]
[null,null,null,null,null,false,false]
[null,null,null,null,null,false,false]
[null,null,null,null,null,false,false]
[null,null,null,null,null,false,false]
[null,null,null,null,null,false,false]
[null,null,null,null,null,false,false]
[null,null,null,null,null,false,false]
[null,null,null,null,null,false,false]
[null,null,null,null,null,false,false]
[null,null,null,null,null,false,false]
[null,null,null,null,null,false,false]
[null,null,null,null,null,false,false]
[null,null,null,null,null,false,false]
[null,null,null,null,null,false,false]
[null,null,null,null,null,false,false]
[null,null,null,null,null,false,false]
[null,null,null,null,null,false,false]
[null,null,null,null,null,false,false]
[null,null,null,null,null,false,false]
[null,null,null,null,null,false,false]
[null,null,null,null,null,false,false]
[null,null,null,null,null,false,false]
[null,null,null,null,null,false,false]
[null,null,null,null,null,false,false]
[null,null,null,null,null,false,false]
[null,null,null,null,null,false,false]
[null,null,null,null,null,false,false]
[null,null,null,null,null,false,false]
[null,null,null,null,null,false,false]
[null,null,null,null,null,false,false]
[null,null,null,null,null,false,false]
[null,null,null,null,null,false,false]
[null,null,null,null,null,false,false]
[null,null,null,null,null,false,false]
[null,null,null,null,null,false,false]
[null,null,null,null,null,false,false]
[null,null,null,null,null,{"$f":"IF(B708=\"TOUT VENANT\",\"Véolia Nice Tri - Parc d'activité logistique\",IF(B708=\"DECHETS VERTS\",\"Orédui Carros Compostage - ZI de la Grave\",IF(B708=\"GRAVATS PROPRES\",\"La Gaude K3 Sita Sud - 5211 Rte de St Jeannet\",IF(B708=\"GRAVATS SALES\",\"Véolia Nice Tri - 20 Ch du Saquier\",IF(B708=\"BOIS\",\"SEAS La Glacière - 1019 Rte de la Grasse\",IF(B708=\"METAUX\",\"PURFER - ZI Carros 15ème Rue - 06517 Carros\",IF(B708=\"BATTERIES\",\"PURFER - ZI Carros 15ème Rue - 06517 Carros\",IF(B708=\"NEON\",\"Sofovar - 126 Av Louis Lépine - 83600 Fréjus\",IF(B708=\"PEINTURES\",\"Orédui - ZI Bois de Grasse - 06310 Grasse\",IF(B708=\"PRODUITS NON IDENTIFIES\",\"Orédui - ZI Bois de Grasse - 06310 Grasse\",IF(B708=\"AEROSOLS\",\"Orédui - ZI Bois de Grasse - 06310 Grasse\",IF(B708=\"FROIDS\",\"SEAS - 1079 Rte de Grasse - 06270 Villeneuve Loubet\",IF(B708=\"HORS FROIDS\",\"SEAS - 1079 Rte de Grasse - 06270 Villeneuve Loubet\",IF(B708=\"PAM\",\"SEAS - 1079 Rte de Grasse - 06270 Villeneuve Loubet\",IF(B708=\"ECRANS\",\"SEAS - 1079 Rte de Grasse - 06270 Villeneuve Loubet\",IF(B708=\"BOX HORS FROIDS\",\"SEAS - 1079 Rte de Grasse - 06270 Villeneuve Loubet\",IF(B708=\"PILES\",\"Corepile\",IF(B708=\"CUMULUS\",\"SEAS - 1079 Rte de Grasse - 06270 Villeneuve Loubet\",IF(B708=\"PNEUS\",\"TFM Pneus - 117 Ch Clausonnes - 06560 Valbonne\",IF(B708=\"HUILES VEGETALES\",\"Orédui - ZI Bois de Grasse - 06310 Grasse\",IF(B708=\"HUILES DE VIDANGE\",\"SERAHU - 68 Ch de la Campanette - 06800 Cagnes sur Mer\")))))))))))))))))))))","v":false},{"$f":"IF(OR(B708=\"TOUT VENANT\",B708=\"DECHETS VERTS\",B708=\"GRAVATS SALES\",B708=\"GRAVATS PROPRES\",B708=\"BOIS\"),\"SUEZ\",IF(OR(B708=\"PNEUS\"),\"TFM\",IF(OR(B708=\"FROIDS\",B708=\"HORS FROIDS\",B708=\"BOX HORS FROIDS\",B708=\"CUMULUS\",B708=\"PAM\",B708=\"ECRANS\"),\"SEAS\",IF(OR(B708=\"METAUX\",B708=\"BATTERIES\"),\"DERICHEBOURG\",IF(OR(B708=\"NEON\"),\"SOFOVAR\",IF(OR(B708=\"PEINTURES\",B708=\"PRODUITS NON IDENTIFIES\",B708=\"AEROSOLS\",B708=\"HUILES VEGETALES\"),\"OREDUI\",IF(OR(B708=\"HUILES DE VIDANGE\"),\"SERAHU\")))))))","v":false}]
[null,null,null,null,null,false,false]
[null,null,null,null,null,false,false]
[null,null,null,null,null,false,false]
[null,null,null,null,null,false,false]
[null,null,null,null,null,false,false]
[null,null,null,null,null,false,false]
[null,null,null,null,null,false,false]
[null,null,null,null,null,false,false]
[null,null,null,null,null,false,false]
[null,null,null,null,null,false,false]
[null,null,null,null,null,false,false]
[null,null,null,null,null,false,false]
[null,null,null,null,null,false,false]
[null,null,null,null,null,false,false]
[null,null,null,null,null,false,false]
[null,null,null,null,null,false,false]
[null,null,null,null,null,false,false]
[null,null,null,null,null,false,false]
[null,null,null,null,null,false,false]
[null,null,null,null,null,false,false]
[null,null,null,null,null,false,false]
[null,null,null,null,null,false,false]
[null,null,null,null,null,false,false]
[null,null,null,null,null,false,false]
[null,null,null,null,null,false,false]
[null,null,null,null,null,false,false]
[null,null,null,null,null,false,false]
[null,null,null,null,null,false,false]
[null,null,null,null,null,false,false]
[null,null,null,null,null,false,false]
[null,null,null,null,null,false,false]
[null,null,null,null,null,false,false]
[null,null,null,null,null,false,false]
[null,null,null,null,null,false,false]
[null,null,null,null,null,false,false]
[null,null,null,null,null,false,false]
[null,null,null,null,null,false,false]
[null,null,null,null,null,false,false]
[null,null,null,null,null,false,false]
[null,null,null,null,null,false,false]
[null,null,null,null,null,false,false]
[null,null,null,null,null,false,false]
[null,null,null,null,null,false,false]
[null,null,null,null,null,false,false]
[null,null,null,null,null,false,false]
[null,null,null,null,null,false,false]
[null,null,null,null,null,false,false]
[null,null,null,null,null,false,false]
[null,null,null,null,null,false,false]
[null,null,null,null,null,false,false]
[null,null,null,null,null,false,false]
[null,null,null,null,null,false,false]
[null,null,null,null,null,false,false]
[null,null,null,null,null,false,false]
[null,null,null,null,null,false,false]
[null,null,null,null,null,false,false]
[null,null,null,null,null,false,false]
[null,null,null,null,null,false,false]
[null,null,null,null,null,false,false]
[null,null,null,null,null,false,false]
[null,null,null,null,null,false,false]
[null,null,null,null,null,false,false]
[null,null,null,null,null,false,false]
[null,null,null,null,null,{"$f":"IF(B772=\"TOUT VENANT\",\"Véolia Nice Tri - Parc d'activité logistique\",IF(B772=\"DECHETS VERTS\",\"Orédui Carros Compostage - ZI de la Grave\",IF(B772=\"GRAVATS PROPRES\",\"La Gaude K3 Sita Sud - 5211 Rte de St Jeannet\",IF(B772=\"GRAVATS SALES\",\"Véolia Nice Tri - 20 Ch du Saquier\",IF(B772=\"BOIS\",\"SEAS La Glacière - 1019 Rte de la Grasse\",IF(B772=\"METAUX\",\"PURFER - ZI Carros 15ème Rue - 06517 Carros\",IF(B772=\"BATTERIES\",\"PURFER - ZI Carros 15ème Rue - 06517 Carros\",IF(B772=\"NEON\",\"Sofovar - 126 Av Louis Lépine - 83600 Fréjus\",IF(B772=\"PEINTURES\",\"Orédui - ZI Bois de Grasse - 06310 Grasse\",IF(B772=\"PRODUITS NON IDENTIFIES\",\"Orédui - ZI Bois de Grasse - 06310 Grasse\",IF(B772=\"AEROSOLS\",\"Orédui - ZI Bois de Grasse - 06310 Grasse\",IF(B772=\"FROIDS\",\"SEAS - 1079 Rte de Grasse - 06270 Villeneuve Loubet\",IF(B772=\"HORS FROIDS\",\"SEAS - 1079 Rte de Grasse - 06270 Villeneuve Loubet\",IF(B772=\"PAM\",\"SEAS - 1079 Rte de Grasse - 06270 Villeneuve Loubet\",IF(B772=\"ECRANS\",\"SEAS - 1079 Rte de Grasse - 06270 Villeneuve Loubet\",IF(B772=\"BOX HORS FROIDS\",\"SEAS - 1079 Rte de Grasse - 06270 Villeneuve Loubet\",IF(B772=\"PILES\",\"Corepile\",IF(B772=\"CUMULUS\",\"SEAS - 1079 Rte de Grasse - 06270 Villeneuve Loubet\",IF(B772=\"PNEUS\",\"TFM Pneus - 117 Ch Clausonnes - 06560 Valbonne\",IF(B772=\"HUILES VEGETALES\",\"Orédui - ZI Bois de Grasse - 06310 Grasse\",IF(B772=\"HUILES DE VIDANGE\",\"SERAHU - 68 Ch de la Campanette - 06800 Cagnes sur Mer\")))))))))))))))))))))","v":false},{"$f":"IF(OR(B772=\"TOUT VENANT\",B772=\"DECHETS VERTS\",B772=\"GRAVATS SALES\",B772=\"GRAVATS PROPRES\",B772=\"BOIS\"),\"SUEZ\",IF(OR(B772=\"PNEUS\"),\"TFM\",IF(OR(B772=\"FROIDS\",B772=\"HORS FROIDS\",B772=\"BOX HORS FROIDS\",B772=\"CUMULUS\",B772=\"PAM\",B772=\"ECRANS\"),\"SEAS\",IF(OR(B772=\"METAUX\",B772=\"BATTERIES\"),\"DERICHEBOURG\",IF(OR(B772=\"NEON\"),\"SOFOVAR\",IF(OR(B772=\"PEINTURES\",B772=\"PRODUITS NON IDENTIFIES\",B772=\"AEROSOLS\",B772=\"HUILES VEGETALES\"),\"OREDUI\",IF(OR(B772=\"HUILES DE VIDANGE\"),\"SERAHU\")))))))","v":false}]
[null,null,null,null,null,{"$f":"IF(B773=\"TOUT VENANT\",\"Véolia Nice Tri - Parc d'activité logistique\",IF(B773=\"DECHETS VERTS\",\"Orédui Carros Compostage - ZI de la Grave\",IF(B773=\"GRAVATS PROPRES\",\"La Gaude K3 Sita Sud - 5211 Rte de St Jeannet\",IF(B773=\"GRAVATS SALES\",\"Véolia Nice Tri - 20 Ch du Saquier\",IF(B773=\"BOIS\",\"SEAS La Glacière - 1019 Rte de la Grasse\",IF(B773=\"METAUX\",\"PURFER - ZI Carros 15ème Rue - 06517 Carros\",IF(B773=\"BATTERIES\",\"PURFER - ZI Carros 15ème Rue - 06517 Carros\",IF(B773=\"NEON\",\"Sofovar - 126 Av Louis Lépine - 83600 Fréjus\",IF(B773=\"PEINTURES\",\"Orédui - ZI Bois de Grasse - 06310 Grasse\",IF(B773=\"PRODUITS NON IDENTIFIES\",\"Orédui - ZI Bois de Grasse - 06310 Grasse\",IF(B773=\"AEROSOLS\",\"Orédui - ZI Bois de Grasse - 06310 Grasse\",IF(B773=\"FROIDS\",\"SEAS - 1079 Rte de Grasse - 06270 Villeneuve Loubet\",IF(B773=\"HORS FROIDS\",\"SEAS - 1079 Rte de Grasse - 06270 Villeneuve Loubet\",IF(B773=\"PAM\",\"SEAS - 1079 Rte de Grasse - 06270 Villeneuve Loubet\",IF(B773=\"ECRANS\",\"SEAS - 1079 Rte de Grasse - 06270 Villeneuve Loubet\",IF(B773=\"BOX HORS FROIDS\",\"SEAS - 1079 Rte de Grasse - 06270 Villeneuve Loubet\",IF(B773=\"PILES\",\"Corepile\",IF(B773=\"CUMULUS\",\"SEAS - 1079 Rte de Grasse - 06270 Villeneuve Loubet\",IF(B773=\"PNEUS\",\"TFM Pneus - 117 Ch Clausonnes - 06560 Valbonne\",IF(B773=\"HUILES VEGETALES\",\"Orédui - ZI Bois de Grasse - 06310 Grasse\",IF(B773=\"HUILES DE VIDANGE\",\"SERAHU - 68 Ch de la Campanette - 06800 Cagnes sur Mer\")))))))))))))))))))))","v":false},{"$f":"IF(OR(B773=\"TOUT VENANT\",B773=\"DECHETS VERTS\",B773=\"GRAVATS SALES\",B773=\"GRAVATS PROPRES\",B773=\"BOIS\"),\"SUEZ\",IF(OR(B773=\"PNEUS\"),\"TFM\",IF(OR(B773=\"FROIDS\",B773=\"HORS FROIDS\",B773=\"BOX HORS FROIDS\",B773=\"CUMULUS\",B773=\"PAM\",B773=\"ECRANS\"),\"SEAS\",IF(OR(B773=\"METAUX\",B773=\"BATTERIES\"),\"DERICHEBOURG\",IF(OR(B773=\"NEON\"),\"SOFOVAR\",IF(OR(B773=\"PEINTURES\",B773=\"PRODUITS NON IDENTIFIES\",B773=\"AEROSOLS\",B773=\"HUILES VEGETALES\"),\"OREDUI\",IF(OR(B773=\"HUILES DE VIDANGE\"),\"SERAHU\")))))))","v":false}]
[null,null,null,null,null,{"$f":"IF(B774=\"TOUT VENANT\",\"Véolia Nice Tri - Parc d'activité logistique\",IF(B774=\"DECHETS VERTS\",\"Orédui Carros Compostage - ZI de la Grave\",IF(B774=\"GRAVATS PROPRES\",\"La Gaude K3 Sita Sud - 5211 Rte de St Jeannet\",IF(B774=\"GRAVATS SALES\",\"Véolia Nice Tri - 20 Ch du Saquier\",IF(B774=\"BOIS\",\"SEAS La Glacière - 1019 Rte de la Grasse\",IF(B774=\"METAUX\",\"PURFER - ZI Carros 15ème Rue - 06517 Carros\",IF(B774=\"BATTERIES\",\"PURFER - ZI Carros 15ème Rue - 06517 Carros\",IF(B774=\"NEON\",\"Sofovar - 126 Av Louis Lépine - 83600 Fréjus\",IF(B774=\"PEINTURES\",\"Orédui - ZI Bois de Grasse - 06310 Grasse\",IF(B774=\"PRODUITS NON IDENTIFIES\",\"Orédui - ZI Bois de Grasse - 06310 Grasse\",IF(B774=\"AEROSOLS\",\"Orédui - ZI Bois de Grasse - 06310 Grasse\",IF(B774=\"FROIDS\",\"SEAS - 1079 Rte de Grasse - 06270 Villeneuve Loubet\",IF(B774=\"HORS FROIDS\",\"SEAS - 1079 Rte de Grasse - 06270 Villeneuve Loubet\",IF(B774=\"PAM\",\"SEAS - 1079 Rte de Grasse - 06270 Villeneuve Loubet\",IF(B774=\"ECRANS\",\"SEAS - 1079 Rte de Grasse - 06270 Villeneuve Loubet\",IF(B774=\"BOX HORS FROIDS\",\"SEAS - 1079 Rte de Grasse - 06270 Villeneuve Loubet\",IF(B774=\"PILES\",\"Corepile\",IF(B774=\"CUMULUS\",\"SEAS - 1079 Rte de Grasse - 06270 Villeneuve Loubet\",IF(B774=\"PNEUS\",\"TFM Pneus - 117 Ch Clausonnes - 06560 Valbonne\",IF(B774=\"HUILES VEGETALES\",\"Orédui - ZI Bois de Grasse - 06310 Grasse\",IF(B774=\"HUILES DE VIDANGE\",\"SERAHU - 68 Ch de la Campanette - 06800 Cagnes sur Mer\")))))))))))))))))))))","v":false},{"$f":"IF(OR(B774=\"TOUT VENANT\",B774=\"DECHETS VERTS\",B774=\"GRAVATS SALES\",B774=\"GRAVATS PROPRES\",B774=\"BOIS\"),\"SUEZ\",IF(OR(B774=\"PNEUS\"),\"TFM\",IF(OR(B774=\"FROIDS\",B774=\"HORS FROIDS\",B774=\"BOX HORS FROIDS\",B774=\"CUMULUS\",B774=\"PAM\",B774=\"ECRANS\"),\"SEAS\",IF(OR(B774=\"METAUX\",B774=\"BATTERIES\"),\"DERICHEBOURG\",IF(OR(B774=\"NEON\"),\"SOFOVAR\",IF(OR(B774=\"PEINTURES\",B774=\"PRODUITS NON IDENTIFIES\",B774=\"AEROSOLS\",B774=\"HUILES VEGETALES\"),\"OREDUI\",IF(OR(B774=\"HUILES DE VIDANGE\"),\"SERAHU\")))))))","v":false}]

{"sheet":"Registre_3","index":17,"n_rows":776,"n_cols":15,"rows_kept":776,"cut":false,"hidden":false,"merged":[[26,12,26,13],[771,2,771,3],[772,2,772,3],[773,2,773,3],[774,2,774,3],[775,2,775,3],[765,2,765,3],[766,2,766,3],[767,2,767,3],[768,2,768,3],[769,2,769,3],[770,2,770,3],[759,2,759,3],[760,2,760,3],[761,2,761,3],[762,2,762,3],[763,2,763,3],[764,2,764,3],[753,2,753,3],[754,2,754,3],[755,2,755,3],[756,2,756,3],[757,2,757,3],[758,2,758,3],[747,2,747,3],[748,2,748,3],[749,2,749,3],[750,2,750,3],[751,2,751,3],[752,2,752,3],[741,2,741,3],[742,2,742,3],[743,2,743,3],[744,2,744,3],[745,2,745,3],[746,2,746,3],[735,2,735,3],[736,2,736,3],[737,2,737,3],[738,2,738,3],[739,2,739,3],[740,2,740,3],[729,2,729,3],[730,2,730,3],[731,2,731,3],[732,2,732,3],[733,2,733,3],[734,2,734,3],[723,2,723,3],[724,2,724,3],[725,2,725,3],[726,2,726,3],[727,2,727,3],[728,2,728,3],[717,2,717,3],[718,2,718,3],[719,2,719,3],[720,2,720,3],[721,2,721,3],[722,2,722,3],[711,2,711,3],[712,2,712,3],[713,2,713,3],[714,2,714,3],[715,2,715,3],[716,2,716,3],[705,2,705,3],[706,2,706,3],[707,2,707,3],[708,2,708,3],[709,2,709,3],[710,2,710,3],[699,2,699,3],[700,2,700,3],[701,2,701,3],[702,2,702,3],[703,2,703,3],[704,2,704,3],[693,2,693,3],[694,2,694,3],[695,2,695,3],[696,2,696,3],[697,2,697,3],[698,2,698,3],[687,2,687,3],[688,2,688,3],[689,2,689,3],[690,2,690,3],[691,2,691,3],[692,2,692,3],[681,2,681,3],[682,2,682,3],[683,2,683,3],[684,2,684,3],[685,2,685,3],[686,2,686,3],[675,2,675,3],[676,2,676,3],[677,2,677,3],[678,2,678,3],[679,2,679,3],[680,2,680,3],[669,2,669,3],[670,2,670,3],[671,2,671,3],[672,2,672,3],[673,2,673,3],[674,2,674,3],[663,2,663,3],[664,2,664,3],[665,2,665,3],[666,2,666,3],[667,2,667,3],[668,2,668,3],[657,2,657,3],[658,2,658,3],[659,2,659,3],[660,2,660,3],[661,2,661,3],[662,2,662,3],[651,2,651,3],[652,2,652,3],[653,2,653,3],[654,2,654,3],[655,2,655,3],[656,2,656,3],[645,2,645,3],[646,2,646,3],[647,2,647,3],[648,2,648,3],[649,2,649,3],[650,2,650,3],[639,2,639,3],[640,2,640,3],[641,2,641,3],[642,2,642,3],[643,2,643,3],[644,2,644,3],[633,2,633,3],[634,2,634,3],[635,2,635,3],[636,2,636,3],[637,2,637,3],[638,2,638,3],[627,2,627,3],[628,2,628,3],[629,2,629,3],[630,2,630,3],[631,2,631,3],[632,2,632,3],[621,2,621,3],[622,2,622,3],[623,2,623,3],[624,2,624,3],[625,2,625,3],[626,2,626,3],[615,2,615,3],[616,2,616,3],[617,2,617,3],[618,2,618,3],[619,2,619,3],[620,2,620,3],[609,2,609,3],[610,2,610,3],[611,2,611,3],[612,2,612,3],[613,2,613,3],[614,2,614,3],[603,2,603,3],[604,2,604,3],[605,2,605,3],[606,2,606,3],[607,2,607,3],[608,2,608,3],[597,2,597,3],[598,2,598,3],[599,2,599,3],[600,2,600,3],[601,2,601,3],[602,2,602,3],[591,2,591,3],[592,2,592,3],[593,2,593,3],[594,2,594,3],[595,2,595,3],[596,2,596,3],[585,2,585,3],[586,2,586,3],[587,2,587,3],[588,2,588,3],[589,2,589,3],[590,2,590,3],[579,2,579,3],[580,2,580,3],[581,2,581,3],[582,2,582,3],[583,2,583,3],[584,2,584,3],[573,2,573,3],[574,2,574,3],[575,2,575,3],[576,2,576,3],[577,2,577,3],[578,2,578,3],[567,2,567,3],[568,2,568,3],[569,2,569,3],[570,2,570,3],[571,2,571,3],[572,2,572,3],[561,2,561,3],[562,2,562,3],[563,2,563,3],[564,2,564,3],[565,2,565,3],[566,2,566,3],[555,2,555,3],[556,2,556,3],[557,2,557,3],[558,2,558,3],[559,2,559,3],[560,2,560,3],[549,2,549,3],[550,2,550,3],[551,2,551,3],[552,2,552,3],[553,2,553,3],[554,2,554,3],[543,2,543,3],[544,2,544,3],[545,2,545,3],[546,2,546,3],[547,2,547,3],[548,2,548,3],[537,2,537,3],[538,2,538,3],[539,2,539,3],[540,2,540,3],[541,2,541,3],[542,2,542,3],[531,2,531,3],[532,2,532,3],[533,2,533,3],[534,2,534,3],[535,2,535,3],[536,2,536,3],[525,2,525,3],[526,2,526,3],[527,2,527,3],[528,2,528,3],[529,2,529,3],[530,2,530,3],[519,2,519,3],[520,2,520,3],[521,2,521,3],[522,2,522,3],[523,2,523,3],[524,2,524,3],[513,2,513,3],[514,2,514,3],[515,2,515,3],[516,2,516,3],[517,2,517,3],[518,2,518,3],[507,2,507,3],[508,2,508,3],[509,2,509,3],[510,2,510,3],[511,2,511,3],[512,2,512,3],[501,2,501,3],[502,2,502,3],[503,2,503,3],[504,2,504,3],[505,2,505,3],[506,2,506,3],[495,2,495,3],[496,2,496,3],[497,2,497,3],[498,2,498,3],[499,2,499,3],[500,2,500,3],[489,2,489,3],[490,2,490,3],[491,2,491,3],[492,2,492,3],[493,2,493,3],[494,2,494,3],[483,2,483,3],[484,2,484,3],[485,2,485,3],[486,2,486,3],[487,2,487,3],[488,2,488,3],[477,2,477,3],[478,2,478,3],[479,2,479,3],[480,2,480,3],[481,2,481,3],[482,2,482,3],[471,2,471,3],[472,2,472,3],[473,2,473,3],[474,2,474,3],[475,2,475,3],[476,2,476,3],[465,2,465,3],[466,2,466,3],[467,2,467,3],[468,2,468,3],[469,2,469,3],[470,2,470,3],[459,2,459,3],[460,2,460,3],[461,2,461,3],[462,2,462,3],[463,2,463,3],[464,2,464,3],[453,2,453,3],[454,2,454,3],[455,2,455,3],[456,2,456,3],[457,2,457,3],[458,2,458,3],[447,2,447,3],[448,2,448,3],[449,2,449,3],[450,2,450,3],[451,2,451,3],[452,2,452,3],[441,2,441,3],[442,2,442,3],[443,2,443,3],[444,2,444,3],[445,2,445,3],[446,2,446,3],[435,2,435,3],[436,2,436,3],[437,2,437,3],[438,2,438,3],[439,2,439,3],[440,2,440,3],[429,2,429,3],[430,2,430,3],[431,2,431,3],[432,2,432,3],[433,2,433,3],[434,2,434,3],[423,2,423,3],[424,2,424,3],[425,2,425,3],[426,2,426,3],[427,2,427,3],[428,2,428,3],[417,2,417,3],[418,2,418,3],[419,2,419,3],[420,2,420,3],[421,2,421,3],[422,2,422,3],[411,2,411,3],[412,2,412,3],[413,2,413,3],[414,2,414,3],[415,2,415,3],[416,2,416,3],[405,2,405,3],[406,2,406,3],[407,2,407,3],[408,2,408,3],[409,2,409,3],[410,2,410,3],[399,2,399,3],[400,2,400,3],[401,2,401,3],[402,2,402,3],[403,2,403,3],[404,2,404,3],[393,2,393,3],[394,2,394,3],[395,2,395,3],[396,2,396,3],[397,2,397,3],[398,2,398,3],[387,2,387,3],[388,2,388,3],[389,2,389,3],[390,2,390,3],[391,2,391,3],[392,2,392,3],[381,2,381,3],[382,2,382,3],[383,2,383,3],[384,2,384,3],[385,2,385,3],[386,2,386,3],[375,2,375,3],[376,2,376,3],[377,2,377,3],[378,2,378,3],[379,2,379,3],[380,2,380,3],[369,2,369,3],[370,2,370,3],[371,2,371,3],[372,2,372,3],[373,2,373,3],[374,2,374,3],[363,2,363,3],[364,2,364,3],[365,2,365,3],[366,2,366,3],[367,2,367,3],[368,2,368,3],[357,2,357,3],[358,2,358,3],[359,2,359,3],[360,2,360,3],[361,2,361,3],[362,2,362,3],[351,2,351,3],[352,2,352,3],[353,2,353,3],[354,2,354,3],[355,2,355,3],[356,2,356,3],[345,2,345,3],[346,2,346,3],[347,2,347,3],[348,2,348,3],[349,2,349,3],[350,2,350,3],[339,2,339,3],[340,2,340,3],[341,2,341,3],[342,2,342,3],[343,2,343,3],[344,2,344,3],[333,2,333,3],[334,2,334,3],[335,2,335,3],[336,2,336,3],[337,2,337,3],[338,2,338,3],[327,2,327,3],[328,2,328,3],[329,2,329,3],[330,2,330,3],[331,2,331,3],[332,2,332,3],[321,2,321,3],[322,2,322,3],[323,2,323,3],[324,2,324,3],[325,2,325,3],[326,2,326,3],[315,2,315,3],[316,2,316,3],[317,2,317,3],[318,2,318,3],[319,2,319,3],[320,2,320,3],[309,2,309,3],[310,2,310,3],[311,2,311,3],[312,2,312,3],[313,2,313,3],[314,2,314,3],[303,2,303,3],[304,2,304,3],[305,2,305,3],[306,2,306,3],[307,2,307,3],[308,2,308,3],[297,2,297,3],[298,2,298,3],[299,2,299,3],[300,2,300,3],[301,2,301,3],[302,2,302,3],[291,2,291,3],[292,2,292,3],[293,2,293,3],[294,2,294,3],[295,2,295,3],[296,2,296,3],[285,2,285,3],[286,2,286,3],[287,2,287,3],[288,2,288,3],[289,2,289,3],[290,2,290,3],[279,2,279,3],[280,2,280,3],[281,2,281,3],[282,2,282,3],[283,2,283,3],[284,2,284,3],[273,2,273,3],[274,2,274,3],[275,2,275,3],[276,2,276,3],[277,2,277,3],[278,2,278,3],[267,2,267,3],[268,2,268,3],[269,2,269,3],[270,2,270,3],[271,2,271,3],[272,2,272,3],[261,2,261,3],[262,2,262,3],[263,2,263,3],[264,2,264,3],[265,2,265,3],[266,2,266,3],[255,2,255,3],[256,2,256,3],[257,2,257,3],[258,2,258,3],[259,2,259,3],[260,2,260,3],[249,2,249,3],[250,2,250,3],[251,2,251,3],[252,2,252,3],[253,2,253,3],[254,2,254,3],[243,2,243,3],[244,2,244,3],[245,2,245,3],[246,2,246,3],[247,2,247,3],[248,2,248,3],[237,2,237,3],[238,2,238,3],[239,2,239,3],[240,2,240,3],[241,2,241,3],[242,2,242,3],[231,2,231,3],[232,2,232,3],[233,2,233,3],[234,2,234,3],[235,2,235,3],[236,2,236,3],[225,2,225,3],[226,2,226,3],[227,2,227,3],[228,2,228,3],[229,2,229,3],[230,2,230,3],[219,2,219,3],[220,2,220,3],[221,2,221,3],[222,2,222,3],[223,2,223,3],[224,2,224,3],[213,2,213,3],[214,2,214,3],[215,2,215,3],[216,2,216,3],[217,2,217,3],[218,2,218,3],[207,2,207,3],[208,2,208,3],[209,2,209,3],[210,2,210,3],[211,2,211,3],[212,2,212,3],[201,2,201,3],[202,2,202,3],[203,2,203,3],[204,2,204,3],[205,2,205,3],[206,2,206,3],[195,2,195,3],[196,2,196,3],[197,2,197,3],[198,2,198,3],[199,2,199,3],[200,2,200,3],[189,2,189,3],[190,2,190,3],[191,2,191,3],[192,2,192,3],[193,2,193,3],[194,2,194,3],[183,2,183,3],[184,2,184,3],[185,2,185,3],[186,2,186,3],[187,2,187,3],[188,2,188,3],[177,2,177,3],[178,2,178,3],[179,2,179,3],[180,2,180,3],[181,2,181,3],[182,2,182,3],[171,2,171,3],[172,2,172,3],[173,2,173,3],[174,2,174,3],[175,2,175,3],[176,2,176,3],[165,2,165,3],[166,2,166,3],[167,2,167,3],[168,2,168,3],[169,2,169,3],[170,2,170,3],[159,2,159,3],[160,2,160,3],[161,2,161,3],[162,2,162,3],[163,2,163,3],[164,2,164,3],[153,2,153,3],[154,2,154,3],[155,2,155,3],[156,2,156,3],[157,2,157,3],[158,2,158,3],[147,2,147,3],[148,2,148,3],[149,2,149,3],[150,2,150,3],[151,2,151,3],[152,2,152,3],[141,2,141,3],[142,2,142,3],[143,2,143,3],[144,2,144,3],[145,2,145,3],[146,2,146,3],[135,2,135,3],[136,2,136,3],[137,2,137,3],[138,2,138,3],[139,2,139,3],[140,2,140,3],[129,2,129,3],[130,2,130,3],[131,2,131,3],[132,2,132,3],[133,2,133,3],[134,2,134,3],[123,2,123,3],[124,2,124,3],[125,2,125,3],[126,2,126,3],[127,2,127,3],[128,2,128,3],[117,2,117,3],[118,2,118,3],[119,2,119,3],[120,2,120,3],[121,2,121,3],[122,2,122,3],[111,2,111,3],[112,2,112,3],[113,2,113,3],[114,2,114,3],[115,2,115,3],[116,2,116,3],[105,2,105,3],[106,2,106,3],[107,2,107,3],[108,2,108,3],[109,2,109,3],[110,2,110,3],[99,2,99,3],[100,2,100,3],[101,2,101,3],[102,2,102,3],[103,2,103,3],[104,2,104,3],[93,2,93,3],[94,2,94,3],[95,2,95,3],[96,2,96,3],[97,2,97,3],[98,2,98,3],[87,2,87,3],[88,2,88,3],[89,2,89,3],[90,2,90,3],[91,2,91,3],[92,2,92,3],[81,2,81,3],[82,2,82,3],[83,2,83,3],[84,2,84,3],[85,2,85,3],[86,2,86,3],[75,2,75,3],[76,2,76,3],[77,2,77,3],[78,2,78,3],[79,2,79,3],[80,2,80,3],[69,2,69,3],[70,2,70,3],[71,2,71,3],[72,2,72,3],[73,2,73,3],[74,2,74,3],[63,2,63,3],[64,2,64,3],[65,2,65,3],[66,2,66,3],[67,2,67,3],[68,2,68,3],[57,2,57,3],[58,2,58,3],[59,2,59,3],[60,2,60,3],[61,2,61,3],[62,2,62,3],[51,2,51,3],[52,2,52,3],[53,2,53,3],[54,2,54,3],[55,2,55,3],[56,2,56,3],[45,2,45,3],[46,2,46,3],[47,2,47,3],[48,2,48,3],[49,2,49,3],[50,2,50,3],[40,2,40,3],[41,2,41,3],[42,2,42,3],[43,2,43,3],[44,2,44,3],[33,2,33,3],[34,2,34,3],[35,2,35,3],[36,2,36,3],[37,2,37,3],[38,2,38,3],[30,2,30,3],[31,2,31,3],[32,2,32,3],[22,2,22,3],[23,2,23,3],[24,2,24,3],[25,2,25,3],[26,2,26,3],[39,2,39,3],[19,2,19,3],[20,2,20,3],[21,2,21,3],[11,2,11,3],[12,2,12,3],[13,2,13,3],[27,2,27,3],[28,2,28,3],[29,2,29,3],[0,0,0,1],[1,2,1,3],[2,2,2,3],[3,2,3,3],[4,2,4,3],[18,12,18,13],[14,2,14,3],[15,2,15,3],[5,2,5,3],[6,2,6,3],[7,2,7,3],[8,2,8,3],[9,2,9,3],[10,2,10,3],[16,2,16,3],[17,2,17,3],[18,2,18,3],[0,2,0,9]]}
[null,null,"REGISTRE DECHETS NON DANGEREUX\n(Arrêté du 29 février 2012 fixant le contenu des registres mentionnés aux articles R. 541-43 et R. 541-46 du code de l'environnement )"]
["Date d'enlèvement","Nature du déchets","Quantité de déchets\n (en kg)",null,"Unité","Installation de destination \n(nom et adresse)","Transporteur ","Immatriculation","Fiche d'intervention","Signature"]
["15/01/18","GRAVATS PROPRES",7800,null,null,{"$f":"IF(B3=\"TOUT VENANT\",\"Véolia Nice Tri - Parc d'activité logistique\",IF(B3=\"DECHETS VERTS\",\"Orédui Carros Compostage - ZI de la Grave\",IF(B3=\"GRAVATS PROPRES\",\"La Gaude K3 Sita Sud - 5211 Rte de St Jeannet\",IF(B3=\"GRAVATS SALES\",\"Véolia Nice Tri - 20 Ch du Saquier\",IF(B3=\"BOIS\",\"SEAS La Glacière - 1019 Rte de la Grasse\",IF(B3=\"METAUX\",\"PURFER - ZI Carros 15ème Rue - 06517 Carros\",IF(B3=\"BATTERIES\",\"PURFER - ZI Carros 15ème Rue - 06517 Carros\",IF(B3=\"NEON\",\"Sofovar - 126 Av Louis Lépine - 83600 Fréjus\",IF(B3=\"PEINTURES\",\"Orédui - ZI Bois de Grasse - 06310 Grasse\",IF(B3=\"PRODUITS NON IDENTIFIES\",\"Orédui - ZI Bois de Grasse - 06310 Grasse\",IF(B3=\"AEROSOLS\",\"Orédui - ZI Bois de Grasse - 06310 Grasse\",IF(B3=\"FROIDS\",\"SEAS - 1079 Rte de Grasse - 06270 Villeneuve Loubet\",IF(B3=\"HORS FROIDS\",\"SEAS - 1079 Rte de Grasse - 06270 Villeneuve Loubet\",IF(B3=\"PAM\",\"SEAS - 1079 Rte de Grasse - 06270 Villeneuve Loubet\",IF(B3=\"ECRANS\",\"SEAS - 1079 Rte de Grasse - 06270 Villeneuve Loubet\",IF(B3=\"BOX HORS FROIDS\",\"SEAS - 1079 Rte de Grasse - 06270 Villeneuve Loubet\",IF(B3=\"PILES\",\"Corepile\",IF(B3=\"CUMULUS\",\"SEAS - 1079 Rte de Grasse - 06270 Villeneuve Loubet\",IF(B3=\"PNEUS\",\"TFM Pneus - 117 Ch Clausonnes - 06560 Valbonne\",IF(B3=\"HUILES VEGETALES\",\"Orédui - ZI Bois de Grasse - 06310 Grasse\",IF(B3=\"HUILES DE VIDANGE\",\"SERAHU - 68 Ch de la Campanette - 06800 Cagnes sur Mer\")))))))))))))))))))))","v":"La Gaude K3 Sita Sud - 5211 Rte de St Jeannet"},{"$f":"IF(OR(B3=\"TOUT VENANT\",B3=\"DECHETS VERTS\",B3=\"GRAVATS SALES\",B3=\"GRAVATS PROPRES\",B3=\"BOIS\"),\"SUEZ\",IF(OR(B3=\"PNEUS\"),\"TFM\",IF(OR(B3=\"FROIDS\",B3=\"HORS FROIDS\",B3=\"BOX HORS FROIDS\",B3=\"CUMULUS\",B3=\"PAM\",B3=\"ECRANS\"),\"SEAS\",IF(OR(B3=\"METAUX\",B3=\"BATTERIES\"),\"DERICHEBOURG\",IF(OR(B3=\"NEON\"),\"SOFOVAR\",IF(OR(B3=\"PEINTURES\",B3=\"PRODUITS NON IDENTIFIES\",B3=\"AEROSOLS\",B3=\"HUILES VEGETALES\"),\"OREDUI\",IF(OR(B3=\"HUILES DE VIDANGE\"),\"SERAHU\")))))))","v":"SUEZ"},null,"B0300473467"]
["15/01/18","GRAVATS SALES",4300,null,null,{"$f":"IF(B4=\"TOUT VENANT\",\"Véolia Nice Tri - Parc d'activité logistique\",IF(B4=\"DECHETS VERTS\",\"Orédui Carros Compostage - ZI de la Grave\",IF(B4=\"GRAVATS PROPRES\",\"La Gaude K3 Sita Sud - 5211 Rte de St Jeannet\",IF(B4=\"GRAVATS SALES\",\"Véolia Nice Tri - 20 Ch du Saquier\",IF(B4=\"BOIS\",\"SEAS La Glacière - 1019 Rte de la Grasse\",IF(B4=\"METAUX\",\"PURFER - ZI Carros 15ème Rue - 06517 Carros\",IF(B4=\"BATTERIES\",\"PURFER - ZI Carros 15ème Rue - 06517 Carros\",IF(B4=\"NEON\",\"Sofovar - 126 Av Louis Lépine - 83600 Fréjus\",IF(B4=\"PEINTURES\",\"Orédui - ZI Bois de Grasse - 06310 Grasse\",IF(B4=\"PRODUITS NON IDENTIFIES\",\"Orédui - ZI Bois de Grasse - 06310 Grasse\",IF(B4=\"AEROSOLS\",\"Orédui - ZI Bois de Grasse - 06310 Grasse\",IF(B4=\"FROIDS\",\"SEAS - 1079 Rte de Grasse - 06270 Villeneuve Loubet\",IF(B4=\"HORS FROIDS\",\"SEAS - 1079 Rte de Grasse - 06270 Villeneuve Loubet\",IF(B4=\"PAM\",\"SEAS - 1079 Rte de Grasse - 06270 Villeneuve Loubet\",IF(B4=\"ECRANS\",\"SEAS - 1079 Rte de Grasse - 06270 Villeneuve Loubet\",IF(B4=\"BOX HORS FROIDS\",\"SEAS - 1079 Rte de Grasse - 06270 Villeneuve Loubet\",IF(B4=\"PILES\",\"Corepile\",IF(B4=\"CUMULUS\",\"SEAS - 1079 Rte de Grasse - 06270 Villeneuve Loubet\",IF(B4=\"PNEUS\",\"TFM Pneus - 117 Ch Clausonnes - 06560 Valbonne\",IF(B4=\"HUILES VEGETALES\",\"Orédui - ZI Bois de Grasse - 06310 Grasse\",IF(B4=\"HUILES DE VIDANGE\",\"SERAHU - 68 Ch de la Campanette - 06800 Cagnes sur Mer\")))))))))))))))))))))","v":"Véolia Nice Tri - 20 Ch du Saquier"},{"$f":"IF(OR(B4=\"TOUT VENANT\",B4=\"DECHETS VERTS\",B4=\"GRAVATS SALES\",B4=\"GRAVATS PROPRES\",B4=\"BOIS\"),\"SUEZ\",IF(OR(B4=\"PNEUS\"),\"TFM\",IF(OR(B4=\"FROIDS\",B4=\"HORS FROIDS\",B4=\"BOX HORS FROIDS\",B4=\"CUMULUS\",B4=\"PAM\",B4=\"ECRANS\"),\"SEAS\",IF(OR(B4=\"METAUX\",B4=\"BATTERIES\"),\"DERICHEBOURG\",IF(OR(B4=\"NEON\"),\"SOFOVAR\",IF(OR(B4=\"PEINTURES\",B4=\"PRODUITS NON IDENTIFIES\",B4=\"AEROSOLS\",B4=\"HUILES VEGETALES\"),\"OREDUI\",IF(OR(B4=\"HUILES DE VIDANGE\"),\"SERAHU\")))))))","v":"SUEZ"},null,"B0300472038"]
["15/01/18","TOUT VENANT","",null,null,"Véolia Nice Tri - Parc d'activité logistique","SUEZ",null,"0103301"]
["15/01/18","METAUX","",null,null,"PURFER - ZI Carros 15ème Rue - 06517 Carros","DERICHEBOURG",null,"2308"]
["15/01/18","BOIS",2560,null,null,"SEAS La Glacière - 1019 Rte de la Grasse","SUEZ",null,"B0300471832"]
["15/01/18","GRAVATS PROPRES",8250,null,null,"La Gaude K3 Sita Sud - 5211 Rte de St Jeannet","SUEZ",null,"B0300473498"]
["15/01/18","TOUT VENANT","",null,null,"Véolia Nice Tri - Parc d'activité logistique","SUEZ",null,"103302"]
["15/01/18","TOUT VENANT",1280,null,null,"Véolia Nice Tri - Parc d'activité logistique","SUEZ",null,"B0300472466"]
["15/01/18","GRAVATS PROPRES",7300,null,null,"La Gaude K3 Sita Sud - 5211 Rte de St Jeannet","SUEZ",null,"B0300473529"]
["15/01/18","DECHETS VERTS",1260,null,null,"Orédui Carros Compostage - ZI de la Grave","SUEZ",null,"B0300471801"]
["15/01/18","BOIS",2260,null,null,"SEAS La Glacière - 1019 Rte de la Grasse","SUEZ",null,"B0300471870"]
["15/01/18","GRAVATS SALES",1100,null,null,"Véolia Nice Tri - 20 Ch du Saquier","SUEZ",null,"B0300473727"]
["15/01/18","BOIS",2620,null,null,"SEAS La Glacière - 1019 Rte de la Grasse","SUEZ",null,"B0300472000"]
["15/01/18","TOUT VENANT",1000,null,null,"Véolia Nice Tri - Parc d'activité logistique","SUEZ",null,"B0300467199"]
["15/01/18","TOUT VENANT",2540,null,null,"Véolia Nice Tri - Parc d'activité logistique","SUEZ",null,"B0300473566"]
["15/01/18","BOIS",2360,null,null,"SEAS La Glacière - 1019 Rte de la Grasse","SUEZ",null,"B0300472339"]
["15/01/18","TOUT VENANT",2620,null,null,"Véolia Nice Tri - Parc d'activité logistique","SUEZ",null,"B0300476200",null,null,null,"PRESTATIONS JOURNALIERES SUEZ"]
["16/01/18","GRAVATS PROPRES","8100",null,"","La Gaude K3 Sita Sud - 5211 Rte de St Jeannet","SUEZ",null,"b0300473473",null,null,null,"6 TV ","6 ROTATIONS DE CAMION AMPIROLES"]
["2018-01-16","GRAVATS SALES","4060",null,"","Véolia Nice Tri - 20 Ch du Saquier","SUEZ",null,"B0300472044",null,null,null,"6 TV ","3 ROTATIONS DE CAMION GRAPPIN","LUNDI 4 ROTATIONS DE GRAPPIN"]
["2018-01-16","DECHETS VERTS","3620",null,"","Orédui Carros Compostage - ZI de la Grave","SUEZ",null,"B0300471807",null,null,null,"2 GRAVATS SALES","1  MATIN ET 1 APRES MIDI"]
["2018-01-16","BOIS","3020",null,"","SEAS La Glacière - 1019 Rte de la Grasse","SUEZ",null,"B0300471838",null,null,null,"3 GRAVATS PROPRES","3 ROTATIONS DE CAMION AMPIROLES"]
["2018-01-16","METAUX","",null,"","PURFER - ZI Carros 15ème Rue - 06517 Carros","DERICHEBOURG",null,"2214",null,null,null,"2 DECHETS VERTS","2 ROTATIONS DE CAMION AMPIROLES"]
["16/01/18","DECHETS VERTS","1360",null,"","Orédui Carros Compostage - ZI de la Grave","SUEZ",null,"B0300471914",null,null,null,"2 BOIS","2 ROTATIONS DE CAMION AMPIROLES"]
["16/01/18","GRAVATS PROPRES","5550",null,"","La Gaude K3 Sita Sud - 5211 Rte de St Jeannet","SUEZ",null,"B0300473504",null,null,null,"1 METAUX","1 ROTATION DE CAMION GRAPPIN"]
["16/01/18","TOUT VENANT","4700",null,"","Véolia Nice Tri - Parc d'activité logistique","SUEZ",null,"0103303",null,null,null,"Le samedi présence d'un camion minimum jusqu'à 16H"]
["16/01/18","TOUT VENANT","3980",null,"","Véolia Nice Tri - Parc d'activité logistique","SUEZ",null,"0103304"]
["16/01/18","BOIS","2060",null,"","SEAS La Glacière - 1019 Rte de la Grasse","SUEZ",null,"B0300471876"]
["16/01/18","GRAVATS PROPRES","5150",null,"","La Gaude K3 Sita Sud - 5211 Rte de St Jeannet","SUEZ",null,"B0300473535"]
["2018-01-16","PNEUS","",null,"150","TFM Pneus - 117 Ch Clausonnes - 06560 Valbonne","TFM",null,"???"]
["2018-01-16","BOIS","1300",null,"","SEAS La Glacière - 1019 Rte de la Grasse","SUEZ",null,"B0300472006"]
["2018-01-16","GRAVATS SALES","3980",null,"","Véolia Nice Tri - 20 Ch du Saquier","SUEZ",null,"B0300473733"]
["16/01/18","DECHETS VERTS",640,null,"","Orédui Carros Compostage - ZI de la Grave","SUEZ",null,"B0300476253"]
["16/01/18","DECHETS VERTS",980,null,"","Orédui Carros Compostage - ZI de la Grave","SUEZ",null,"B0300476254"]
["16/01/18","BOIS",1080,null,"","SEAS La Glacière - 1019 Rte de la Grasse","SUEZ",null,"B0300476255"]
["16/01/18","BOIS","2600",null,"","SEAS La Glacière - 1019 Rte de la Grasse","SUEZ",null,"B0300476251"]
["2018-01-17","GRAVATS PROPRES","10500",null,"","La Gaude K3 Sita Sud - 5211 Rte de St Jeannet","SUEZ",null,"B0300473479"]
["15/01/18","PEINTURES","",null,"6","Orédui - ZI Bois de Grasse - 06310 Grasse","OREDUI",null,"131194-0000202"]
["17/01/18","GRAVATS SALES","2340",null,"","Véolia Nice Tri - 20 Ch du Saquier","SUEZ",null,"B0300472050"]
["17/01/18","DECHETS VERTS","880",null,"","Orédui Carros Compostage - ZI de la Grave","SUEZ",null,"B0300471813"]
["17/01/18","GRAVATS PROPRES","9700",null,"","La Gaude K3 Sita Sud - 5211 Rte de St Jeannet","SUEZ",null,"B0300473510"]
["17/01/18","HORS FROIDS","",null,"8","SEAS - 1079 Rte de Grasse - 06270 Villeneuve Loubet","SEAS",null,"1274077"]
["17/01/18","FROIDS","",null,"4","SEAS - 1079 Rte de Grasse - 06270 Villeneuve Loubet","SEAS",null,"1274077"]
["17/01/18","PAM","",null,"1","SEAS - 1079 Rte de Grasse - 06270 Villeneuve Loubet","SEAS",null,"1274077"]
["17/01/18","ECRANS","",null,"1","SEAS - 1079 Rte de Grasse - 06270 Villeneuve Loubet","SEAS",null,"1274077"]
["17/01/18","DECHETS VERTS","1500",null,"","Orédui Carros Compostage - ZI de la Grave","SUEZ",null,"B0300471920"]
["17/01/18","METAUX","",null,"","PURFER - ZI Carros 15ème Rue - 06517 Carros","DERICHEBOURG",null,"2219"]
["17/01/18","BOIS","1560",null,"","SEAS La Glacière - 1019 Rte de la Grasse","SUEZ",null,"B0300471844"]
["17/01/18","BOIS","1900",null,"","SEAS La Glacière - 1019 Rte de la Grasse","SUEZ",null,"B0300471882"]
["17/01/18","GRAVATS PROPRES","3150",null,"","La Gaude K3 Sita Sud - 5211 Rte de St Jeannet","SUEZ",null,"B0300471782"]
["17.01.18","GRAVATS PROPRES","10100",null,"","La Gaude K3 Sita Sud - 5211 Rte de St Jeannet","SUEZ",null,"B0300473541"]
["17/01/18","GRAVATS SALES","3480",null,"","Véolia Nice Tri - 20 Ch du Saquier","SUEZ",null,"B0300473739"]
["17/01/18","BOIS","1700",null,"","SEAS La Glacière - 1019 Rte de la Grasse","SUEZ",null,"B0300472012"]
["17/01/18","TOUT VENANT","1360",null,"","Véolia Nice Tri - Parc d'activité logistique","SUEZ",null,"B0300476310"]
["17/01/18","TOUT VENANT","3040",null,"","Véolia Nice Tri - Parc d'activité logistique","SUEZ",null,"B0300472382"]
["18/01/18","GRAVATS PROPRES","7950",null,"","La Gaude K3 Sita Sud - 5211 Rte de St Jeannet","SUEZ",null,"B0300473485"]
["18/01/18","GRAVATS SALES","2560",null,"","Véolia Nice Tri - 20 Ch du Saquier","SUEZ",null,"B0300472056"]
["16/01/18","TOUT VENANT","4100",null,"","Véolia Nice Tri - Parc d'activité logistique","SUEZ",null,"0103305"]
["17/01/18","TOUT VENANT","4480",null,"","Véolia Nice Tri - Parc d'activité logistique","SUEZ",null,"0103309"]
["17/01/18","TOUT VENANT",2300,null,"","Véolia Nice Tri - Parc d'activité logistique","SUEZ",null,"0103308"]
["17/01/18","TOUT VENANT","3020",null,"","Véolia Nice Tri - Parc d'activité logistique","SUEZ",null,"0103307"]
["18/01/18","DECHETS VERTS","1200",null,"","Orédui Carros Compostage - ZI de la Grave","SUEZ",null,"B0300471819"]
["18/01/18","TOUT VENANT","4340",null,"","Véolia Nice Tri - Parc d'activité logistique","SUEZ",null,"0103310"]
["18/01/18","DECHETS VERTS","3060",null,"","Orédui Carros Compostage - ZI de la Grave","SUEZ",null,"B0300471926"]
["2018-01-18","GRAVATS PROPRES","7500",null,"","La Gaude K3 Sita Sud - 5211 Rte de St Jeannet","SUEZ",null,"B0300473516"]
["18/01/18","TOUT VENANT","4240",null,"","Véolia Nice Tri - Parc d'activité logistique","SUEZ",null,"0103311"]
["18/01/18","GRAVATS PROPRES","7850",null,"",{"$f":"IF(B68=\"TOUT VENANT\",\"Véolia Nice Tri - Parc d'activité logistique\",IF(B68=\"DECHETS VERTS\",\"Orédui Carros Compostage - ZI de la Grave\",IF(B68=\"GRAVATS PROPRES\",\"La Gaude K3 Sita Sud - 5211 Rte de St Jeannet\",IF(B68=\"GRAVATS SALES\",\"Véolia Nice Tri - 20 Ch du Saquier\",IF(B68=\"BOIS\",\"SEAS La Glacière - 1019 Rte de la Grasse\",IF(B68=\"METAUX\",\"PURFER - ZI Carros 15ème Rue - 06517 Carros\",IF(B68=\"BATTERIES\",\"PURFER - ZI Carros 15ème Rue - 06517 Carros\",IF(B68=\"NEON\",\"Sofovar - 126 Av Louis Lépine - 83600 Fréjus\",IF(B68=\"PEINTURES\",\"Orédui - ZI Bois de Grasse - 06310 Grasse\",IF(B68=\"PRODUITS NON IDENTIFIES\",\"Orédui - ZI Bois de Grasse - 06310 Grasse\",IF(B68=\"AEROSOLS\",\"Orédui - ZI Bois de Grasse - 06310 Grasse\",IF(B68=\"FROIDS\",\"SEAS - 1079 Rte de Grasse - 06270 Villeneuve Loubet\",IF(B68=\"HORS FROIDS\",\"SEAS - 1079 Rte de Grasse - 06270 Villeneuve Loubet\",IF(B68=\"PAM\",\"SEAS - 1079 Rte de Grasse - 06270 Villeneuve Loubet\",IF(B68=\"ECRANS\",\"SEAS - 1079 Rte de Grasse - 06270 Villeneuve Loubet\",IF(B68=\"BOX HORS FROIDS\",\"SEAS - 1079 Rte de Grasse - 06270 Villeneuve Loubet\",IF(B68=\"PILES\",\"Corepile\",IF(B68=\"CUMULUS\",\"SEAS - 1079 Rte de Grasse - 06270 Villeneuve Loubet\",IF(B68=\"PNEUS\",\"TFM Pneus - 117 Ch Clausonnes - 06560 Valbonne\",IF(B68=\"HUILES VEGETALES\",\"Orédui - ZI Bois de Grasse - 06310 Grasse\",IF(B68=\"HUILES DE VIDANGE\",\"SERAHU - 68 Ch de la Campanette - 06800 Cagnes sur Mer\")))))))))))))))))))))","v":"La Gaude K3 Sita Sud - 5211 Rte de St Jeannet"},{"$f":"IF(OR(B68=\"TOUT VENANT\",B68=\"DECHETS VERTS\",B68=\"GRAVATS SALES\",B68=\"GRAVATS PROPRES\",B68=\"BOIS\"),\"SUEZ\",IF(OR(B68=\"PNEUS\"),\"TFM\",IF(OR(B68=\"FROIDS\",B68=\"HORS FROIDS\",B68=\"BOX HORS FROIDS\",B68=\"CUMULUS\",B68=\"PAM\",B68=\"ECRANS\"),\"SEAS\",IF(OR(B68=\"METAUX\",B68=\"BATTERIES\"),\"DERICHEBOURG\",IF(OR(B68=\"NEON\"),\"SOFOVAR\",IF(OR(B68=\"PEINTURES\",B68=\"PRODUITS NON IDENTIFIES\",B68=\"AEROSOLS\",B68=\"HUILES VEGETALES\"),\"OREDUI\",IF(OR(B68=\"HUILES DE VIDANGE\"),\"SERAHU\")))))))","v":"SUEZ"},null,"B0300473547"]
["18/01/18","GRAVATS SALES","5160",null,"","Véolia Nice Tri - 20 Ch du Saquier","SUEZ",null,"B0300473745"]
["18/01/18","BOIS","2500",null,"","SEAS La Glacière - 1019 Rte de la Grasse","SUEZ",null,"B0300471850"]
["18/01/18","DECHETS VERTS","2020",null,"","Orédui Carros Compostage - ZI de la Grave","SUEZ",null,"B0300476354"]
["18/01/18","TOUT VENANT","1920",null,"","Véolia Nice Tri - Parc d'activité logistique","SUEZ",null,"B0300473584"]
["18/01/18","TOUT VENANT","2540",null,"","Véolia Nice Tri - Parc d'activité logistique","SUEZ",null,"B0300472484"]
["18/01/18","BOIS","2540",null,"","SEAS La Glacière - 1019 Rte de la Grasse","SUEZ",null,"B0300471888"]
["18/01/18","BOIS","3180",null,"","SEAS La Glacière - 1019 Rte de la Grasse","SUEZ",null,"B0300472018"]
["18/01/18","TOUT VENANT","",null,"","Véolia Nice Tri - Parc d'activité logistique","SUEZ",null,"B0300476356"]
["19/01/18","BOIS","2260",null,"","SEAS La Glacière - 1019 Rte de la Grasse","SUEZ",null,"B0300471857"]
["18/01/18","METAUX","",null,"","PURFER - ZI Carros 15ème Rue - 06517 Carros","DERICHEBOURG",null,"2223"]
["19/01/18","PEINTURES","",null,"3","Orédui - ZI Bois de Grasse - 06310 Grasse","OREDUI",null,"131103-0000202"]
["2018-01-19","METAUX","",null,"","PURFER - ZI Carros 15ème Rue - 06517 Carros","DERICHEBOURG",null,"227"]
["2018-01-19","TOUT VENANT","1560",null,"","Véolia Nice Tri - Parc d'activité logistique","SUEZ",null,"0103314"]
["2018-01-19","TOUT VENANT","3360",null,"","Véolia Nice Tri - Parc d'activité logistique","SUEZ",null,"0103313"]
["2018-01-19","TOUT VENANT","3860",null,"","Véolia Nice Tri - Parc d'activité logistique","SUEZ",null,"0103312"]
["2018-01-19","GRAVATS SALES","5680",null,"","Véolia Nice Tri - 20 Ch du Saquier","SUEZ",null,"B0300472063"]
["2018-01-19","GRAVATS PROPRES","4600",null,"","La Gaude K3 Sita Sud - 5211 Rte de St Jeannet","SUEZ",null,"B0300473523"]
["2018-01-19","GRAVATS PROPRES","9200",null,"","La Gaude K3 Sita Sud - 5211 Rte de St Jeannet","SUEZ",null,"B0300473492"]
["2018-01-19","GRAVATS PROPRES","7000",null,"","La Gaude K3 Sita Sud - 5211 Rte de St Jeannet","SUEZ",null,"B0300471795"]
["2018-01-19","BOIS","2720",null,"","SEAS La Glacière - 1019 Rte de la Grasse","SUEZ",null,"B0300471895"]
["2018-01-19","DECHETS VERTS","1260",null,"","Orédui Carros Compostage - ZI de la Grave","SUEZ",null,"B0300471933"]
["2018-01-19","DECHETS VERTS","2340",null,"","Orédui Carros Compostage - ZI de la Grave","SUEZ",null,"B0300471826"]
["2018-01-19","TOUT VENANT","1140",null,"","Véolia Nice Tri - Parc d'activité logistique","SUEZ",null,"B0300476380"]
["2018-01-19","GRAVATS SALES","5280",null,"","Véolia Nice Tri - 20 Ch du Saquier","SUEZ",null,"B0300473752"]
["2018-01-19","BOIS","1740",null,"","SEAS La Glacière - 1019 Rte de la Grasse","SUEZ",null,"B0300472025"]
["2018-01-20","METAUX","",null,"","PURFER - ZI Carros 15ème Rue - 06517 Carros","DERICHEBOURG",null,"2322"]
["2018-01-20","BOIS","1240",null,"","SEAS La Glacière - 1019 Rte de la Grasse","SUEZ",null,"B0300471864"]
["2018-01-20","TOUT VENANT","1080",null,"","Véolia Nice Tri - Parc d'activité logistique","SUEZ",null,"B0300472176"]
["2018-01-20","GRAVATS SALES","1760",null,"","Véolia Nice Tri - 20 Ch du Saquier","SUEZ",null,"B0300473759"]
["2018-01-20","GRAVATS PROPRES","7260",null,"","La Gaude K3 Sita Sud - 5211 Rte de St Jeannet","SUEZ",null,"B0300472694"]
["2018-01-20","GRAVATS PROPRES","",null,"","La Gaude K3 Sita Sud - 5211 Rte de St Jeannet","SUEZ",null,"B0300472701"]
["2018-01-20","DECHETS VERTS","2280",null,"","Orédui Carros Compostage - ZI de la Grave","SUEZ",null,"B0300472141"]
["2018-01-20","TOUT VENANT","1480",null,"","Véolia Nice Tri - Parc d'activité logistique","SUEZ",null,"B0300471902"]
["2018-01-20","TOUT VENANT","1900",null,"","Véolia Nice Tri - Parc d'activité logistique","SUEZ",null,"B0300472169"]
["20/01/18","BOIS","1400",null,"","SEAS La Glacière - 1019 Rte de la Grasse","SUEZ",null,"B0300472032"]
["20/01/18","TOUT VENANT","2500",null,"","Véolia Nice Tri - Parc d'activité logistique","SUEZ",null,"B0300472190"]
["20/01/18","TOUT VENANT","640",null,"","Véolia Nice Tri - Parc d'activité logistique","SUEZ",null,"B0300476437"]
["20/01/18","TOUT VENANT","2900",null,"","Véolia Nice Tri - Parc d'activité logistique","SUEZ",null,"B0300476436"]
["20/01/18","TOUT VENANT","3120",null,"","Véolia Nice Tri - Parc d'activité logistique","SUEZ",null,"B0300472197"]
["20/01/18","TOUT VENANT","",null,"","Véolia Nice Tri - Parc d'activité logistique","SUEZ",null,"B0300476438"]
["20/01/18","GRAVATS PROPRES","",null,"","La Gaude K3 Sita Sud - 5211 Rte de St Jeannet","SUEZ",null,"B0300472708"]
["19/01/18","FROIDS","",null,"6","SEAS - 1079 Rte de Grasse - 06270 Villeneuve Loubet","SEAS",null,"ES0001276054001"]
["19/01/18","HORS FROIDS","",null,"4","SEAS - 1079 Rte de Grasse - 06270 Villeneuve Loubet","SEAS",null,"ES0001276054002"]
["19/01/18","PAM","",null,"2","SEAS - 1079 Rte de Grasse - 06270 Villeneuve Loubet","SEAS",null,"ES0001276054002"]
[null,null,null,null,null,false,false]
[null,null,null,null,null,false,false]
[null,null,null,null,null,false,false]
[null,null,null,null,null,false,false]
[null,null,null,null,null,false,false]
[null,null,null,null,null,false,false]
[null,null,null,null,null,false,false]
[null,null,null,null,null,false,false]
[null,null,null,null,null,false,false]
[null,null,null,null,null,false,false]
[null,null,null,null,null,false,false]
[null,null,null,null,null,false,false]
[null,null,null,null,null,false,false]
[null,null,null,null,null,false,false]
[null,null,null,null,null,false,false]
[null,null,null,null,null,false,false]
[null,null,null,null,null,false,false]
[null,null,null,null,null,false,false]
[null,null,null,null,null,false,false]
[null,null,null,null,null,{"$f":"IF(B132=\"TOUT VENANT\",\"Véolia Nice Tri - Parc d'activité logistique\",IF(B132=\"DECHETS VERTS\",\"Orédui Carros Compostage - ZI de la Grave\",IF(B132=\"GRAVATS PROPRES\",\"La Gaude K3 Sita Sud - 5211 Rte de St Jeannet\",IF(B132=\"GRAVATS SALES\",\"Véolia Nice Tri - 20 Ch du Saquier\",IF(B132=\"BOIS\",\"SEAS La Glacière - 1019 Rte de la Grasse\",IF(B132=\"METAUX\",\"PURFER - ZI Carros 15ème Rue - 06517 Carros\",IF(B132=\"BATTERIES\",\"PURFER - ZI Carros 15ème Rue - 06517 Carros\",IF(B132=\"NEON\",\"Sofovar - 126 Av Louis Lépine - 83600 Fréjus\",IF(B132=\"PEINTURES\",\"Orédui - ZI Bois de Grasse - 06310 Grasse\",IF(B132=\"PRODUITS NON IDENTIFIES\",\"Orédui - ZI Bois de Grasse - 06310 Grasse\",IF(B132=\"AEROSOLS\",\"Orédui - ZI Bois de Grasse - 06310 Grasse\",IF(B132=\"FROIDS\",\"SEAS - 1079 Rte de Grasse - 06270 Villeneuve Loubet\",IF(B132=\"HORS FROIDS\",\"SEAS - 1079 Rte de Grasse - 06270 Villeneuve Loubet\",IF(B132=\"PAM\",\"SEAS - 1079 Rte de Grasse - 06270 Villeneuve Loubet\",IF(B132=\"ECRANS\",\"SEAS - 1079 Rte de Grasse - 06270 Villeneuve Loubet\",IF(B132=\"BOX HORS FROIDS\",\"SEAS - 1079 Rte de Grasse - 06270 Villeneuve Loubet\",IF(B132=\"PILES\",\"Corepile\",IF(B132=\"CUMULUS\",\"SEAS - 1079 Rte de Grasse - 06270 Villeneuve Loubet\",IF(B132=\"PNEUS\",\"TFM Pneus - 117 Ch Clausonnes - 06560 Valbonne\",IF(B132=\"HUILES VEGETALES\",\"Orédui - ZI Bois de Grasse - 06310 Grasse\",IF(B132=\"HUILES DE VIDANGE\",\"SERAHU - 68 Ch de la Campanette - 06800 Cagnes sur Mer\")))))))))))))))))))))","v":false},{"$f":"IF(OR(B132=\"TOUT VENANT\",B132=\"DECHETS VERTS\",B132=\"GRAVATS SALES\",B132=\"GRAVATS PROPRES\",B132=\"BOIS\"),\"SUEZ\",IF(OR(B132=\"PNEUS\"),\"TFM\",IF(OR(B132=\"FROIDS\",B132=\"HORS FROIDS\",B132=\"BOX HORS FROIDS\",B132=\"CUMULUS\",B132=\"PAM\",B132=\"ECRANS\"),\"SEAS\",IF(OR(B132=\"METAUX\",B132=\"BATTERIES\"),\"DERICHEBOURG\",IF(OR(B132=\"NEON\"),\"SOFOVAR\",IF(OR(B132=\"PEINTURES\",B132=\"PRODUITS NON IDENTIFIES\",B132=\"AEROSOLS\",B132=\"HUILES VEGETALES\"),\"OREDUI\",IF(OR(B132=\"HUILES DE VIDANGE\"),\"SERAHU\")))))))","v":false}]
[null,null,null,null,null,false,false]
[null,null,null,null,null,false,false]
[null,null,null,null,null,false,false]
[null,null,null,null,null,false,false]
[null,null,null,null,null,false,false]
[null,null,null,null,null,false,false]
[null,null,null,null,null,false,false]
[null,null,null,null,null,false,false]
[null,null,null,null,null,false,false]
[null,null,null,null,null,false,false]
[null,null,null,null,null,false,false]
[null,null,null,null,null,false,false]
[null,null,null,null,null,false,false]
[null,null,null,null,null,false,false]
[null,null,null,null,null,false,false]
[null,null,null,null,null,false,false]
[null,null,null,null,null,false,false]
[null,null,null,null,null,false,false]
[null,null,null,null,null,false,false]
[null,null,null,null,null,false,false]
[null,null,null,null,null,false,false]
[null,null,null,null,null,false,false]
[null,null,null,null,null,false,false]
[null,null,null,null,null,false,false]
[null,null,null,null,null,false,false]
[null,null,null,null,null,false,false]
[null,null,null,null,null,false,false]
[null,null,null,null,null,false,false]
[null,null,null,null,null,false,false]
[null,null,null,null,null,false,false]
[null,null,null,null,null,false,false]
[null,null,null,null,null,false,false]
[null,null,null,null,null,false,false]
[null,null,null,null,null,false,false]
[null,null,null,null,null,false,false]
[null,null,null,null,null,false,false]
[null,null,null,null,null,false,false]
[null,null,null,null,null,false,false]
[null,null,null,null,null,false,false]
[null,null,null,null,null,false,false]
[null,null,null,null,null,false,false]
[null,null,null,null,null,false,false]
[null,null,null,null,null,false,false]
[null,null,null,null,null,false,false]
[null,null,null,null,null,false,false]
[null,null,null,null,null,false,false]
[null,null,null,null,null,false,false]
[null,null,null,null,null,false,false]
[null,null,null,null,null,false,false]
[null,null,null,null,null,false,false]
[null,null,null,null,null,false,false]
[null,null,null,null,null,false,false]
[null,null,null,null,null,false,false]
[null,null,null,null,null,false,false]
[null,null,null,null,null,false,false]
[null,null,null,null,null,false,false]
[null,null,null,null,null,false,false]
[null,null,null,null,null,false,false]
[null,null,null,null,null,false,false]
[null,null,null,null,null,false,false]
[null,null,null,null,null,false,false]
[null,null,null,null,null,false,false]
[null,null,null,null,null,false,false]
[null,null,null,null,null,{"$f":"IF(B196=\"TOUT VENANT\",\"Véolia Nice Tri - Parc d'activité logistique\",IF(B196=\"DECHETS VERTS\",\"Orédui Carros Compostage - ZI de la Grave\",IF(B196=\"GRAVATS PROPRES\",\"La Gaude K3 Sita Sud - 5211 Rte de St Jeannet\",IF(B196=\"GRAVATS SALES\",\"Véolia Nice Tri - 20 Ch du Saquier\",IF(B196=\"BOIS\",\"SEAS La Glacière - 1019 Rte de la Grasse\",IF(B196=\"METAUX\",\"PURFER - ZI Carros 15ème Rue - 06517 Carros\",IF(B196=\"BATTERIES\",\"PURFER - ZI Carros 15ème Rue - 06517 Carros\",IF(B196=\"NEON\",\"Sofovar - 126 Av Louis Lépine - 83600 Fréjus\",IF(B196=\"PEINTURES\",\"Orédui - ZI Bois de Grasse - 06310 Grasse\",IF(B196=\"PRODUITS NON IDENTIFIES\",\"Orédui - ZI Bois de Grasse - 06310 Grasse\",IF(B196=\"AEROSOLS\",\"Orédui - ZI Bois de Grasse - 06310 Grasse\",IF(B196=\"FROIDS\",\"SEAS - 1079 Rte de Grasse - 06270 Villeneuve Loubet\",IF(B196=\"HORS FROIDS\",\"SEAS - 1079 Rte de Grasse - 06270 Villeneuve Loubet\",IF(B196=\"PAM\",\"SEAS - 1079 Rte de Grasse - 06270 Villeneuve Loubet\",IF(B196=\"ECRANS\",\"SEAS - 1079 Rte de Grasse - 06270 Villeneuve Loubet\",IF(B196=\"BOX HORS FROIDS\",\"SEAS - 1079 Rte de Grasse - 06270 Villeneuve Loubet\",IF(B196=\"PILES\",\"Corepile\",IF(B196=\"CUMULUS\",\"SEAS - 1079 Rte de Grasse - 06270 Villeneuve Loubet\",IF(B196=\"PNEUS\",\"TFM Pneus - 117 Ch Clausonnes - 06560 Valbonne\",IF(B196=\"HUILES VEGETALES\",\"Orédui - ZI Bois de Grasse - 06310 Grasse\",IF(B196=\"HUILES DE VIDANGE\",\"SERAHU - 68 Ch de la Campanette - 06800 Cagnes sur Mer\")))))))))))))))))))))","v":false},{"$f":"IF(OR(B196=\"TOUT VENANT\",B196=\"DECHETS VERTS\",B196=\"GRAVATS SALES\",B196=\"GRAVATS PROPRES\",B196=\"BOIS\"),\"SUEZ\",IF(OR(B196=\"PNEUS\"),\"TFM\",IF(OR(B196=\"FROIDS\",B196=\"HORS FROIDS\",B196=\"BOX HORS FROIDS\",B196=\"CUMULUS\",B196=\"PAM\",B196=\"ECRANS\"),\"SEAS\",IF(OR(B196=\"METAUX\",B196=\"BATTERIES\"),\"DERICHEBOURG\",IF(OR(B196=\"NEON\"),\"SOFOVAR\",IF(OR(B196=\"PEINTURES\",B196=\"PRODUITS NON IDENTIFIES\",B196=\"AEROSOLS\",B196=\"HUILES VEGETALES\"),\"OREDUI\",IF(OR(B196=\"HUILES DE VIDANGE\"),\"SERAHU\")))))))","v":false}]
[null,null,null,null,null,false,false]
[null,null,null,null,null,false,false]
[null,null,null,null,null,false,false]
[null,null,null,null,null,false,false]
[null,null,null,null,null,false,false]
[null,null,null,null,null,false,false]
[null,null,null,null,null,false,false]
[null,null,null,null,null,false,false]
[null,null,null,null,null,false,false]
[null,null,null,null,null,false,false]
[null,null,null,null,null,false,false]
[null,null,null,null,null,false,false]
[null,null,null,null,null,false,false]
[null,null,null,null,null,false,false]
[null,null,null,null,null,false,false]
[null,null,null,null,null,false,false]
[null,null,null,null,null,false,false]
[null,null,null,null,null,false,false]
[null,null,null,null,null,false,false]
[null,null,null,null,null,false,false]
[null,null,null,null,null,false,false]
[null,null,null,null,null,false,false]
[null,null,null,null,null,false,false]
[null,null,null,null,null,false,false]
[null,null,null,null,null,false,false]
[null,null,null,null,null,false,false]
[null,null,null,null,null,false,false]
[null,null,null,null,null,false,false]
[null,null,null,null,null,false,false]
[null,null,null,null,null,false,false]
[null,null,null,null,null,false,false]
[null,null,null,null,null,false,false]
[null,null,null,null,null,false,false]
[null,null,null,null,null,false,false]
[null,null,null,null,null,false,false]
[null,null,null,null,null,false,false]
[null,null,null,null,null,false,false]
[null,null,null,null,null,false,false]
[null,null,null,null,null,false,false]
[null,null,null,null,null,false,false]
[null,null,null,null,null,false,false]
[null,null,null,null,null,false,false]
[null,null,null,null,null,false,false]
[null,null,null,null,null,false,false]
[null,null,null,null,null,false,false]
[null,null,null,null,null,false,false]
[null,null,null,null,null,false,false]
[null,null,null,null,null,false,false]
[null,null,null,null,null,false,false]
[null,null,null,null,null,false,false]
[null,null,null,null,null,false,false]
[null,null,null,null,null,false,false]
[null,null,null,null,null,false,false]
[null,null,null,null,null,false,false]
[null,null,null,null,null,false,false]
[null,null,null,null,null,false,false]
[null,null,null,null,null,false,false]
[null,null,null,null,null,false,false]
[null,null,null,null,null,false,false]
[null,null,null,null,null,false,false]
[null,null,null,null,null,false,false]
[null,null,null,null,null,false,false]
[null,null,null,null,null,false,false]
[null,null,null,null,null,{"$f":"IF(B260=\"TOUT VENANT\",\"Véolia Nice Tri - Parc d'activité logistique\",IF(B260=\"DECHETS VERTS\",\"Orédui Carros Compostage - ZI de la Grave\",IF(B260=\"GRAVATS PROPRES\",\"La Gaude K3 Sita Sud - 5211 Rte de St Jeannet\",IF(B260=\"GRAVATS SALES\",\"Véolia Nice Tri - 20 Ch du Saquier\",IF(B260=\"BOIS\",\"SEAS La Glacière - 1019 Rte de la Grasse\",IF(B260=\"METAUX\",\"PURFER - ZI Carros 15ème Rue - 06517 Carros\",IF(B260=\"BATTERIES\",\"PURFER - ZI Carros 15ème Rue - 06517 Carros\",IF(B260=\"NEON\",\"Sofovar - 126 Av Louis Lépine - 83600 Fréjus\",IF(B260=\"PEINTURES\",\"Orédui - ZI Bois de Grasse - 06310 Grasse\",IF(B260=\"PRODUITS NON IDENTIFIES\",\"Orédui - ZI Bois de Grasse - 06310 Grasse\",IF(B260=\"AEROSOLS\",\"Orédui - ZI Bois de Grasse - 06310 Grasse\",IF(B260=\"FROIDS\",\"SEAS - 1079 Rte de Grasse - 06270 Villeneuve Loubet\",IF(B260=\"HORS FROIDS\",\"SEAS - 1079 Rte de Grasse - 06270 Villeneuve Loubet\",IF(B260=\"PAM\",\"SEAS - 1079 Rte de Grasse - 06270 Villeneuve Loubet\",IF(B260=\"ECRANS\",\"SEAS - 1079 Rte de Grasse - 06270 Villeneuve Loubet\",IF(B260=\"BOX HORS FROIDS\",\"SEAS - 1079 Rte de Grasse - 06270 Villeneuve Loubet\",IF(B260=\"PILES\",\"Corepile\",IF(B260=\"CUMULUS\",\"SEAS - 1079 Rte de Grasse - 06270 Villeneuve Loubet\",IF(B260=\"PNEUS\",\"TFM Pneus - 117 Ch Clausonnes - 06560 Valbonne\",IF(B260=\"HUILES VEGETALES\",\"Orédui - ZI Bois de Grasse - 06310 Grasse\",IF(B260=\"HUILES DE VIDANGE\",\"SERAHU - 68 Ch de la Campanette - 06800 Cagnes sur Mer\")))))))))))))))))))))","v":false},{"$f":"IF(OR(B260=\"TOUT VENANT\",B260=\"DECHETS VERTS\",B260=\"GRAVATS SALES\",B260=\"GRAVATS PROPRES\",B260=\"BOIS\"),\"SUEZ\",IF(OR(B260=\"PNEUS\"),\"TFM\",IF(OR(B260=\"FROIDS\",B260=\"HORS FROIDS\",B260=\"BOX HORS FROIDS\",B260=\"CUMULUS\",B260=\"PAM\",B260=\"ECRANS\"),\"SEAS\",IF(OR(B260=\"METAUX\",B260=\"BATTERIES\"),\"DERICHEBOURG\",IF(OR(B260=\"NEON\"),\"SOFOVAR\",IF(OR(B260=\"PEINTURES\",B260=\"PRODUITS NON IDENTIFIES\",B260=\"AEROSOLS\",B260=\"HUILES VEGETALES\"),\"OREDUI\",IF(OR(B260=\"HUILES DE VIDANGE\"),\"SERAHU\")))))))","v":false}]
[null,null,null,null,null,false,false]
[null,null,null,null,null,false,false]
[null,null,null,null,null,false,false]
[null,null,null,null,null,false,false]
[null,null,null,null,null,false,false]
[null,null,null,null,null,false,false]
[null,null,null,null,null,false,false]
[null,null,null,null,null,false,false]
[null,null,null,null,null,false,false]
[null,null,null,null,null,false,false]
[null,null,null,null,null,false,false]
[null,null,null,null,null,false,false]
[null,null,null,null,null,false,false]
[null,null,null,null,null,false,false]
[null,null,null,null,null,false,false]
[null,null,null,null,null,false,false]
[null,null,null,null,null,false,false]
[null,null,null,null,null,false,false]
[null,null,null,null,null,false,false]
[null,null,null,null,null,false,false]
[null,null,null,null,null,false,false]
[null,null,null,null,null,false,false]
[null,null,null,null,null,false,false]
[null,null,null,null,null,false,false]
[null,null,null,null,null,false,false]
[null,null,null,null,null,false,false]
[null,null,null,null,null,false,false]
[null,null,null,null,null,false,false]
[null,null,null,null,null,false,false]
[null,null,null,null,null,false,false]
[null,null,null,null,null,false,false]
[null,null,null,null,null,false,false]
[null,null,null,null,null,false,false]
[null,null,null,null,null,false,false]
[null,null,null,null,null,false,false]
[null,null,null,null,null,false,false]
[null,null,null,null,null,false,false]
[null,null,null,null,null,false,false]
[null,null,null,null,null,false,false]
[null,null,null,null,null,false,false]
[null,null,null,null,null,false,false]
[null,null,null,null,null,false,false]
[null,null,null,null,null,false,false]
[null,null,null,null,null,false,false]
[null,null,null,null,null,false,false]
[null,null,null,null,null,false,false]
[null,null,null,null,null,false,false]
[null,null,null,null,null,false,false]
[null,null,null,null,null,false,false]
[null,null,null,null,null,false,false]
[null,null,null,null,null,false,false]
[null,null,null,null,null,false,false]
[null,null,null,null,null,false,false]
[null,null,null,null,null,false,false]
[null,null,null,null,null,false,false]
[null,null,null,null,null,false,false]
[null,null,null,null,null,false,false]
[null,null,null,null,null,false,false]
[null,null,null,null,null,false,false]
[null,null,null,null,null,false,false]
[null,null,null,null,null,false,false]
[null,null,null,null,null,false,false]
[null,null,null,null,null,false,false]
[null,null,null,null,null,{"$f":"IF(B324=\"TOUT VENANT\",\"Véolia Nice Tri - Parc d'activité logistique\",IF(B324=\"DECHETS VERTS\",\"Orédui Carros Compostage - ZI de la Grave\",IF(B324=\"GRAVATS PROPRES\",\"La Gaude K3 Sita Sud - 5211 Rte de St Jeannet\",IF(B324=\"GRAVATS SALES\",\"Véolia Nice Tri - 20 Ch du Saquier\",IF(B324=\"BOIS\",\"SEAS La Glacière - 1019 Rte de la Grasse\",IF(B324=\"METAUX\",\"PURFER - ZI Carros 15ème Rue - 06517 Carros\",IF(B324=\"BATTERIES\",\"PURFER - ZI Carros 15ème Rue - 06517 Carros\",IF(B324=\"NEON\",\"Sofovar - 126 Av Louis Lépine - 83600 Fréjus\",IF(B324=\"PEINTURES\",\"Orédui - ZI Bois de Grasse - 06310 Grasse\",IF(B324=\"PRODUITS NON IDENTIFIES\",\"Orédui - ZI Bois de Grasse - 06310 Grasse\",IF(B324=\"AEROSOLS\",\"Orédui - ZI Bois de Grasse - 06310 Grasse\",IF(B324=\"FROIDS\",\"SEAS - 1079 Rte de Grasse - 06270 Villeneuve Loubet\",IF(B324=\"HORS FROIDS\",\"SEAS - 1079 Rte de Grasse - 06270 Villeneuve Loubet\",IF(B324=\"PAM\",\"SEAS - 1079 Rte de Grasse - 06270 Villeneuve Loubet\",IF(B324=\"ECRANS\",\"SEAS - 1079 Rte de Grasse - 06270 Villeneuve Loubet\",IF(B324=\"BOX HORS FROIDS\",\"SEAS - 1079 Rte de Grasse - 06270 Villeneuve Loubet\",IF(B324=\"PILES\",\"Corepile\",IF(B324=\"CUMULUS\",\"SEAS - 1079 Rte de Grasse - 06270 Villeneuve Loubet\",IF(B324=\"PNEUS\",\"TFM Pneus - 117 Ch Clausonnes - 06560 Valbonne\",IF(B324=\"HUILES VEGETALES\",\"Orédui - ZI Bois de Grasse - 06310 Grasse\",IF(B324=\"HUILES DE VIDANGE\",\"SERAHU - 68 Ch de la Campanette - 06800 Cagnes sur Mer\")))))))))))))))))))))","v":false},{"$f":"IF(OR(B324=\"TOUT VENANT\",B324=\"DECHETS VERTS\",B324=\"GRAVATS SALES\",B324=\"GRAVATS PROPRES\",B324=\"BOIS\"),\"SUEZ\",IF(OR(B324=\"PNEUS\"),\"TFM\",IF(OR(B324=\"FROIDS\",B324=\"HORS FROIDS\",B324=\"BOX HORS FROIDS\",B324=\"CUMULUS\",B324=\"PAM\",B324=\"ECRANS\"),\"SEAS\",IF(OR(B324=\"METAUX\",B324=\"BATTERIES\"),\"DERICHEBOURG\",IF(OR(B324=\"NEON\"),\"SOFOVAR\",IF(OR(B324=\"PEINTURES\",B324=\"PRODUITS NON IDENTIFIES\",B324=\"AEROSOLS\",B324=\"HUILES VEGETALES\"),\"OREDUI\",IF(OR(B324=\"HUILES DE VIDANGE\"),\"SERAHU\")))))))","v":false}]
[null,null,null,null,null,false,false]
[null,null,null,null,null,false,false]
[null,null,null,null,null,false,false]
[null,null,null,null,null,false,false]
[null,null,null,null,null,false,false]
[null,null,null,null,null,false,false]
[null,null,null,null,null,false,false]
[null,null,null,null,null,false,false]
[null,null,null,null,null,false,false]
[null,null,null,null,null,false,false]
[null,null,null,null,null,false,false]
[null,null,null,null,null,false,false]
[null,null,null,null,null,false,false]
[null,null,null,null,null,false,false]
[null,null,null,null,null,false,false]
[null,null,null,null,null,false,false]
[null,null,null,null,null,false,false]
[null,null,null,null,null,false,false]
[null,null,null,null,null,false,false]
[null,null,null,null,null,false,false]
[null,null,null,null,null,false,false]
[null,null,null,null,null,false,false]
[null,null,null,null,null,false,false]
[null,null,null,null,null,false,false]
[null,null,null,null,null,false,false]
[null,null,null,null,null,false,false]
[null,null,null,null,null,false,false]
[null,null,null,null,null,false,false]
[null,null,null,null,null,false,false]
[null,null,null,null,null,false,false]
[null,null,null,null,null,false,false]
[null,null,null,null,null,false,false]
[null,null,null,null,null,false,false]
[null,null,null,null,null,false,false]
[null,null,null,null,null,false,false]
[null,null,null,null,null,false,false]
[null,null,null,null,null,false,false]
[null,null,null,null,null,false,false]
[null,null,null,null,null,false,false]
[null,null,null,null,null,false,false]
[null,null,null,null,null,false,false]
[null,null,null,null,null,false,false]
[null,null,null,null,null,false,false]
[null,null,null,null,null,false,false]
[null,null,null,null,null,false,false]
[null,null,null,null,null,false,false]
[null,null,null,null,null,false,false]
[null,null,null,null,null,false,false]
[null,null,null,null,null,false,false]
[null,null,null,null,null,false,false]
[null,null,null,null,null,false,false]
[null,null,null,null,null,false,false]
[null,null,null,null,null,false,false]
[null,null,null,null,null,false,false]
[null,null,null,null,null,false,false]
[null,null,null,null,null,false,false]
[null,null,null,null,null,false,false]
[null,null,null,null,null,false,false]
[null,null,null,null,null,false,false]
[null,null,null,null,null,false,false]
[null,null,null,null,null,false,false]
[null,null,null,null,null,false,false]
[null,null,null,null,null,false,false]
[null,null,null,null,null,{"$f":"IF(B388=\"TOUT VENANT\",\"Véolia Nice Tri - Parc d'activité logistique\",IF(B388=\"DECHETS VERTS\",\"Orédui Carros Compostage - ZI de la Grave\",IF(B388=\"GRAVATS PROPRES\",\"La Gaude K3 Sita Sud - 5211 Rte de St Jeannet\",IF(B388=\"GRAVATS SALES\",\"Véolia Nice Tri - 20 Ch du Saquier\",IF(B388=\"BOIS\",\"SEAS La Glacière - 1019 Rte de la Grasse\",IF(B388=\"METAUX\",\"PURFER - ZI Carros 15ème Rue - 06517 Carros\",IF(B388=\"BATTERIES\",\"PURFER - ZI Carros 15ème Rue - 06517 Carros\",IF(B388=\"NEON\",\"Sofovar - 126 Av Louis Lépine - 83600 Fréjus\",IF(B388=\"PEINTURES\",\"Orédui - ZI Bois de Grasse - 06310 Grasse\",IF(B388=\"PRODUITS NON IDENTIFIES\",\"Orédui - ZI Bois de Grasse - 06310 Grasse\",IF(B388=\"AEROSOLS\",\"Orédui - ZI Bois de Grasse - 06310 Grasse\",IF(B388=\"FROIDS\",\"SEAS - 1079 Rte de Grasse - 06270 Villeneuve Loubet\",IF(B388=\"HORS FROIDS\",\"SEAS - 1079 Rte de Grasse - 06270 Villeneuve Loubet\",IF(B388=\"PAM\",\"SEAS - 1079 Rte de Grasse - 06270 Villeneuve Loubet\",IF(B388=\"ECRANS\",\"SEAS - 1079 Rte de Grasse - 06270 Villeneuve Loubet\",IF(B388=\"BOX HORS FROIDS\",\"SEAS - 1079 Rte de Grasse - 06270 Villeneuve Loubet\",IF(B388=\"PILES\",\"Corepile\",IF(B388=\"CUMULUS\",\"SEAS - 1079 Rte de Grasse - 06270 Villeneuve Loubet\",IF(B388=\"PNEUS\",\"TFM Pneus - 117 Ch Clausonnes - 06560 Valbonne\",IF(B388=\"HUILES VEGETALES\",\"Orédui - ZI Bois de Grasse - 06310 Grasse\",IF(B388=\"HUILES DE VIDANGE\",\"SERAHU - 68 Ch de la Campanette - 06800 Cagnes sur Mer\")))))))))))))))))))))","v":false},{"$f":"IF(OR(B388=\"TOUT VENANT\",B388=\"DECHETS VERTS\",B388=\"GRAVATS SALES\",B388=\"GRAVATS PROPRES\",B388=\"BOIS\"),\"SUEZ\",IF(OR(B388=\"PNEUS\"),\"TFM\",IF(OR(B388=\"FROIDS\",B388=\"HORS FROIDS\",B388=\"BOX HORS FROIDS\",B388=\"CUMULUS\",B388=\"PAM\",B388=\"ECRANS\"),\"SEAS\",IF(OR(B388=\"METAUX\",B388=\"BATTERIES\"),\"DERICHEBOURG\",IF(OR(B388=\"NEON\"),\"SOFOVAR\",IF(OR(B388=\"PEINTURES\",B388=\"PRODUITS NON IDENTIFIES\",B388=\"AEROSOLS\",B388=\"HUILES VEGETALES\"),\"OREDUI\",IF(OR(B388=\"HUILES DE VIDANGE\"),\"SERAHU\")))))))","v":false}]
[null,null,null,null,null,false,false]
[null,null,null,null,null,false,false]
[null,null,null,null,null,false,false]
[null,null,null,null,null,false,false]
[null,null,null,null,null,false,false]
[null,null,null,null,null,false,false]
[null,null,null,null,null,false,false]
[null,null,null,null,null,false,false]
[null,null,null,null,null,false,false]
[null,null,null,null,null,false,false]
[null,null,null,null,null,false,false]
[null,null,null,null,null,false,false]
[null,null,null,null,null,false,false]
[null,null,null,null,null,false,false]
[null,null,null,null,null,false,false]
[null,null,null,null,null,false,false]
[null,null,null,null,null,false,false]
[null,null,null,null,null,false,false]
[null,null,null,null,null,false,false]
[null,null,null,null,null,false,false]
[null,null,null,null,null,false,false]
[null,null,null,null,null,false,false]
[null,null,null,null,null,false,false]
[null,null,null,null,null,false,false]
[null,null,null,null,null,false,false]
[null,null,null,null,null,false,false]
[null,null,null,null,null,false,false]
[null,null,null,null,null,false,false]
[null,null,null,null,null,false,false]
[null,null,null,null,null,false,false]
[null,null,null,null,null,false,false]
[null,null,null,null,null,false,false]
[null,null,null,null,null,false,false]
[null,null,null,null,null,false,false]
[null,null,null,null,null,false,false]
[null,null,null,null,null,false,false]
[null,null,null,null,null,false,false]
[null,null,null,null,null,false,false]
[null,null,null,null,null,false,false]
[null,null,null,null,null,false,false]
[null,null,null,null,null,false,false]
[null,null,null,null,null,false,false]
[null,null,null,null,null,false,false]
[null,null,null,null,null,false,false]
[null,null,null,null,null,false,false]
[null,null,null,null,null,false,false]
[null,null,null,null,null,false,false]
[null,null,null,null,null,false,false]
[null,null,null,null,null,false,false]
[null,null,null,null,null,false,false]
[null,null,null,null,null,false,false]
[null,null,null,null,null,false,false]
[null,null,null,null,null,false,false]
[null,null,null,null,null,false,false]
[null,null,null,null,null,false,false]
[null,null,null,null,null,false,false]
[null,null,null,null,null,false,false]
[null,null,null,null,null,false,false]
[null,null,null,null,null,false,false]
[null,null,null,null,null,false,false]
[null,null,null,null,null,false,false]
[null,null,null,null,null,false,false]
[null,null,null,null,null,false,false]
[null,null,null,null,null,{"$f":"IF(B452=\"TOUT VENANT\",\"Véolia Nice Tri - Parc d'activité logistique\",IF(B452=\"DECHETS VERTS\",\"Orédui Carros Compostage - ZI de la Grave\",IF(B452=\"GRAVATS PROPRES\",\"La Gaude K3 Sita Sud - 5211 Rte de St Jeannet\",IF(B452=\"GRAVATS SALES\",\"Véolia Nice Tri - 20 Ch du Saquier\",IF(B452=\"BOIS\",\"SEAS La Glacière - 1019 Rte de la Grasse\",IF(B452=\"METAUX\",\"PURFER - ZI Carros 15ème Rue - 06517 Carros\",IF(B452=\"BATTERIES\",\"PURFER - ZI Carros 15ème Rue - 06517 Carros\",IF(B452=\"NEON\",\"Sofovar - 126 Av Louis Lépine - 83600 Fréjus\",IF(B452=\"PEINTURES\",\"Orédui - ZI Bois de Grasse - 06310 Grasse\",IF(B452=\"PRODUITS NON IDENTIFIES\",\"Orédui - ZI Bois de Grasse - 06310 Grasse\",IF(B452=\"AEROSOLS\",\"Orédui - ZI Bois de Grasse - 06310 Grasse\",IF(B452=\"FROIDS\",\"SEAS - 1079 Rte de Grasse - 06270 Villeneuve Loubet\",IF(B452=\"HORS FROIDS\",\"SEAS - 1079 Rte de Grasse - 06270 Villeneuve Loubet\",IF(B452=\"PAM\",\"SEAS - 1079 Rte de Grasse - 06270 Villeneuve Loubet\",IF(B452=\"ECRANS\",\"SEAS - 1079 Rte de Grasse - 06270 Villeneuve Loubet\",IF(B452=\"BOX HORS FROIDS\",\"SEAS - 1079 Rte de Grasse - 06270 Villeneuve Loubet\",IF(B452=\"PILES\",\"Corepile\",IF(B452=\"CUMULUS\",\"SEAS - 1079 Rte de Grasse - 06270 Villeneuve Loubet\",IF(B452=\"PNEUS\",\"TFM Pneus - 117 Ch Clausonnes - 06560 Valbonne\",IF(B452=\"HUILES VEGETALES\",\"Orédui - ZI Bois de Grasse - 06310 Grasse\",IF(B452=\"HUILES DE VIDANGE\",\"SERAHU - 68 Ch de la Campanette - 06800 Cagnes sur Mer\")))))))))))))))))))))","v":false},{"$f":"IF(OR(B452=\"TOUT VENANT\",B452=\"DECHETS VERTS\",B452=\"GRAVATS SALES\",B452=\"GRAVATS PROPRES\",B452=\"BOIS\"),\"SUEZ\",IF(OR(B452=\"PNEUS\"),\"TFM\",IF(OR(B452=\"FROIDS\",B452=\"HORS FROIDS\",B452=\"BOX HORS FROIDS\",B452=\"CUMULUS\",B452=\"PAM\",B452=\"ECRANS\"),\"SEAS\",IF(OR(B452=\"METAUX\",B452=\"BATTERIES\"),\"DERICHEBOURG\",IF(OR(B452=\"NEON\"),\"SOFOVAR\",IF(OR(B452=\"PEINTURES\",B452=\"PRODUITS NON IDENTIFIES\",B452=\"AEROSOLS\",B452=\"HUILES VEGETALES\"),\"OREDUI\",IF(OR(B452=\"HUILES DE VIDANGE\"),\"SERAHU\")))))))","v":false}]
[null,null,null,null,null,false,false]
[null,null,null,null,null,false,false]
[null,null,null,null,null,false,false]
[null,null,null,null,null,false,false]
[null,null,null,null,null,false,false]
[null,null,null,null,null,false,false]
[null,null,null,null,null,false,false]
[null,null,null,null,null,false,false]
[null,null,null,null,null,false,false]
[null,null,null,null,null,false,false]
[null,null,null,null,null,false,false]
[null,null,null,null,null,false,false]
[null,null,null,null,null,false,false]
[null,null,null,null,null,false,false]
[null,null,null,null,null,false,false]
[null,null,null,null,null,false,false]
[null,null,null,null,null,false,false]
[null,null,null,null,null,false,false]
[null,null,null,null,null,false,false]
[null,null,null,null,null,false,false]
[null,null,null,null,null,false,false]
[null,null,null,null,null,false,false]
[null,null,null,null,null,false,false]
[null,null,null,null,null,false,false]
[null,null,null,null,null,false,false]
[null,null,null,null,null,false,false]
[null,null,null,null,null,false,false]
[null,null,null,null,null,false,false]
[null,null,null,null,null,false,false]
[null,null,null,null,null,false,false]
[null,null,null,null,null,false,false]
[null,null,null,null,null,false,false]
[null,null,null,null,null,false,false]
[null,null,null,null,null,false,false]
[null,null,null,null,null,false,false]
[null,null,null,null,null,false,false]
[null,null,null,null,null,false,false]
[null,null,null,null,null,false,false]
[null,null,null,null,null,false,false]
[null,null,null,null,null,false,false]
[null,null,null,null,null,false,false]
[null,null,null,null,null,false,false]
[null,null,null,null,null,false,false]
[null,null,null,null,null,false,false]
[null,null,null,null,null,false,false]
[null,null,null,null,null,false,false]
[null,null,null,null,null,false,false]
[null,null,null,null,null,false,false]
[null,null,null,null,null,false,false]
[null,null,null,null,null,false,false]
[null,null,null,null,null,false,false]
[null,null,null,null,null,false,false]
[null,null,null,null,null,false,false]
[null,null,null,null,null,false,false]
[null,null,null,null,null,false,false]
[null,null,null,null,null,false,false]
[null,null,null,null,null,false,false]
[null,null,null,null,null,false,false]
[null,null,null,null,null,false,false]
[null,null,null,null,null,false,false]
[null,null,null,null,null,false,false]
[null,null,null,null,null,false,false]
[null,null,null,null,null,false,false]
[null,null,null,null,null,{"$f":"IF(B516=\"TOUT VENANT\",\"Véolia Nice Tri - Parc d'activité logistique\",IF(B516=\"DECHETS VERTS\",\"Orédui Carros Compostage - ZI de la Grave\",IF(B516=\"GRAVATS PROPRES\",\"La Gaude K3 Sita Sud - 5211 Rte de St Jeannet\",IF(B516=\"GRAVATS SALES\",\"Véolia Nice Tri - 20 Ch du Saquier\",IF(B516=\"BOIS\",\"SEAS La Glacière - 1019 Rte de la Grasse\",IF(B516=\"METAUX\",\"PURFER - ZI Carros 15ème Rue - 06517 Carros\",IF(B516=\"BATTERIES\",\"PURFER - ZI Carros 15ème Rue - 06517 Carros\",IF(B516=\"NEON\",\"Sofovar - 126 Av Louis Lépine - 83600 Fréjus\",IF(B516=\"PEINTURES\",\"Orédui - ZI Bois de Grasse - 06310 Grasse\",IF(B516=\"PRODUITS NON IDENTIFIES\",\"Orédui - ZI Bois de Grasse - 06310 Grasse\",IF(B516=\"AEROSOLS\",\"Orédui - ZI Bois de Grasse - 06310 Grasse\",IF(B516=\"FROIDS\",\"SEAS - 1079 Rte de Grasse - 06270 Villeneuve Loubet\",IF(B516=\"HORS FROIDS\",\"SEAS - 1079 Rte de Grasse - 06270 Villeneuve Loubet\",IF(B516=\"PAM\",\"SEAS - 1079 Rte de Grasse - 06270 Villeneuve Loubet\",IF(B516=\"ECRANS\",\"SEAS - 1079 Rte de Grasse - 06270 Villeneuve Loubet\",IF(B516=\"BOX HORS FROIDS\",\"SEAS - 1079 Rte de Grasse - 06270 Villeneuve Loubet\",IF(B516=\"PILES\",\"Corepile\",IF(B516=\"CUMULUS\",\"SEAS - 1079 Rte de Grasse - 06270 Villeneuve Loubet\",IF(B516=\"PNEUS\",\"TFM Pneus - 117 Ch Clausonnes - 06560 Valbonne\",IF(B516=\"HUILES VEGETALES\",\"Orédui - ZI Bois de Grasse - 06310 Grasse\",IF(B516=\"HUILES DE VIDANGE\",\"SERAHU - 68 Ch de la Campanette - 06800 Cagnes sur Mer\")))))))))))))))))))))","v":false},{"$f":"IF(OR(B516=\"TOUT VENANT\",B516=\"DECHETS VERTS\",B516=\"GRAVATS SALES\",B516=\"GRAVATS PROPRES\",B516=\"BOIS\"),\"SUEZ\",IF(OR(B516=\"PNEUS\"),\"TFM\",IF(OR(B516=\"FROIDS\",B516=\"HORS FROIDS\",B516=\"BOX HORS FROIDS\",B516=\"CUMULUS\",B516=\"PAM\",B516=\"ECRANS\"),\"SEAS\",IF(OR(B516=\"METAUX\",B516=\"BATTERIES\"),\"DERICHEBOURG\",IF(OR(B516=\"NEON\"),\"SOFOVAR\",IF(OR(B516=\"PEINTURES\",B516=\"PRODUITS NON IDENTIFIES\",B516=\"AEROSOLS\",B516=\"HUILES VEGETALES\"),\"OREDUI\",IF(OR(B516=\"HUILES DE VIDANGE\"),\"SERAHU\")))))))","v":false}]
[null,null,null,null,null,false,false]
[null,null,null,null,null,false,false]
[null,null,null,null,null,false,false]
[null,null,null,null,null,false,false]
[null,null,null,null,null,false,false]
[null,null,null,null,null,false,false]
[null,null,null,null,null,false,false]
[null,null,null,null,null,false,false]
[null,null,null,null,null,false,false]
[null,null,null,null,null,false,false]
[null,null,null,null,null,false,false]
[null,null,null,null,null,false,false]
[null,null,null,null,null,false,false]
[null,null,null,null,null,false,false]
[null,null,null,null,null,false,false]
[null,null,null,null,null,false,false]
[null,null,null,null,null,false,false]
[null,null,null,null,null,false,false]
[null,null,null,null,null,false,false]
[null,null,null,null,null,false,false]
[null,null,null,null,null,false,false]
[null,null,null,null,null,false,false]
[null,null,null,null,null,false,false]
[null,null,null,null,null,false,false]
[null,null,null,null,null,false,false]
[null,null,null,null,null,false,false]
[null,null,null,null,null,false,false]
[null,null,null,null,null,false,false]
[null,null,null,null,null,false,false]
[null,null,null,null,null,false,false]
[null,null,null,null,null,false,false]
[null,null,null,null,null,false,false]
[null,null,null,null,null,false,false]
[null,null,null,null,null,false,false]
[null,null,null,null,null,false,false]
[null,null,null,null,null,false,false]
[null,null,null,null,null,false,false]
[null,null,null,null,null,false,false]
[null,null,null,null,null,false,false]
[null,null,null,null,null,false,false]
[null,null,null,null,null,false,false]
[null,null,null,null,null,false,false]
[null,null,null,null,null,false,false]
[null,null,null,null,null,false,false]
[null,null,null,null,null,false,false]
[null,null,null,null,null,false,false]
[null,null,null,null,null,false,false]
[null,null,null,null,null,false,false]
[null,null,null,null,null,false,false]
[null,null,null,null,null,false,false]
[null,null,null,null,null,false,false]
[null,null,null,null,null,false,false]
[null,null,null,null,null,false,false]
[null,null,null,null,null,false,false]
[null,null,null,null,null,false,false]
[null,null,null,null,null,false,false]
[null,null,null,null,null,false,false]
[null,null,null,null,null,false,false]
[null,null,null,null,null,false,false]
[null,null,null,null,null,false,false]
[null,null,null,null,null,false,false]
[null,null,null,null,null,false,false]
[null,null,null,null,null,false,false]
[null,null,null,null,null,{"$f":"IF(B580=\"TOUT VENANT\",\"Véolia Nice Tri - Parc d'activité logistique\",IF(B580=\"DECHETS VERTS\",\"Orédui Carros Compostage - ZI de la Grave\",IF(B580=\"GRAVATS PROPRES\",\"La Gaude K3 Sita Sud - 5211 Rte de St Jeannet\",IF(B580=\"GRAVATS SALES\",\"Véolia Nice Tri - 20 Ch du Saquier\",IF(B580=\"BOIS\",\"SEAS La Glacière - 1019 Rte de la Grasse\",IF(B580=\"METAUX\",\"PURFER - ZI Carros 15ème Rue - 06517 Carros\",IF(B580=\"BATTERIES\",\"PURFER - ZI Carros 15ème Rue - 06517 Carros\",IF(B580=\"NEON\",\"Sofovar - 126 Av Louis Lépine - 83600 Fréjus\",IF(B580=\"PEINTURES\",\"Orédui - ZI Bois de Grasse - 06310 Grasse\",IF(B580=\"PRODUITS NON IDENTIFIES\",\"Orédui - ZI Bois de Grasse - 06310 Grasse\",IF(B580=\"AEROSOLS\",\"Orédui - ZI Bois de Grasse - 06310 Grasse\",IF(B580=\"FROIDS\",\"SEAS - 1079 Rte de Grasse - 06270 Villeneuve Loubet\",IF(B580=\"HORS FROIDS\",\"SEAS - 1079 Rte de Grasse - 06270 Villeneuve Loubet\",IF(B580=\"PAM\",\"SEAS - 1079 Rte de Grasse - 06270 Villeneuve Loubet\",IF(B580=\"ECRANS\",\"SEAS - 1079 Rte de Grasse - 06270 Villeneuve Loubet\",IF(B580=\"BOX HORS FROIDS\",\"SEAS - 1079 Rte de Grasse - 06270 Villeneuve Loubet\",IF(B580=\"PILES\",\"Corepile\",IF(B580=\"CUMULUS\",\"SEAS - 1079 Rte de Grasse - 06270 Villeneuve Loubet\",IF(B580=\"PNEUS\",\"TFM Pneus - 117 Ch Clausonnes - 06560 Valbonne\",IF(B580=\"HUILES VEGETALES\",\"Orédui - ZI Bois de Grasse - 06310 Grasse\",IF(B580=\"HUILES DE VIDANGE\",\"SERAHU - 68 Ch de la Campanette - 06800 Cagnes sur Mer\")))))))))))))))))))))","v":false},{"$f":"IF(OR(B580=\"TOUT VENANT\",B580=\"DECHETS VERTS\",B580=\"GRAVATS SALES\",B580=\"GRAVATS PROPRES\",B580=\"BOIS\"),\"SUEZ\",IF(OR(B580=\"PNEUS\"),\"TFM\",IF(OR(B580=\"FROIDS\",B580=\"HORS FROIDS\",B580=\"BOX HORS FROIDS\",B580=\"CUMULUS\",B580=\"PAM\",B580=\"ECRANS\"),\"SEAS\",IF(OR(B580=\"METAUX\",B580=\"BATTERIES\"),\"DERICHEBOURG\",IF(OR(B580=\"NEON\"),\"SOFOVAR\",IF(OR(B580=\"PEINTURES\",B580=\"PRODUITS NON IDENTIFIES\",B580=\"AEROSOLS\",B580=\"HUILES VEGETALES\"),\"OREDUI\",IF(OR(B580=\"HUILES DE VIDANGE\"),\"SERAHU\")))))))","v":false}]
[null,null,null,null,null,false,false]
[null,null,null,null,null,false,false]
[null,null,null,null,null,false,false]
[null,null,null,null,null,false,false]
[null,null,null,null,null,false,false]
[null,null,null,null,null,false,false]
[null,null,null,null,null,false,false]
[null,null,null,null,null,false,false]
[null,null,null,null,null,false,false]
[null,null,null,null,null,false,false]
[null,null,null,null,null,false,false]
[null,null,null,null,null,false,false]
[null,null,null,null,null,false,false]
[null,null,null,null,null,false,false]
[null,null,null,null,null,false,false]
[null,null,null,null,null,false,false]
[null,null,null,null,null,false,false]
[null,null,null,null,null,false,false]
[null,null,null,null,null,false,false]
[null,null,null,null,null,false,false]
[null,null,null,null,null,false,false]
[null,null,null,null,null,false,false]
[null,null,null,null,null,false,false]
[null,null,null,null,null,false,false]
[null,null,null,null,null,false,false]
[null,null,null,null,null,false,false]
[null,null,null,null,null,false,false]
[null,null,null,null,null,false,false]
[null,null,null,null,null,false,false]
[null,null,null,null,null,false,false]
[null,null,null,null,null,false,false]
[null,null,null,null,null,false,false]
[null,null,null,null,null,false,false]
[null,null,null,null,null,false,false]
[null,null,null,null,null,false,false]
[null,null,null,null,null,false,false]
[null,null,null,null,null,false,false]
[null,null,null,null,null,false,false]
[null,null,null,null,null,false,false]
[null,null,null,null,null,false,false]
[null,null,null,null,null,false,false]
[null,null,null,null,null,false,false]
[null,null,null,null,null,false,false]
[null,null,null,null,null,false,false]
[null,null,null,null,null,false,false]
[null,null,null,null,null,false,false]
[null,null,null,null,null,false,false]
[null,null,null,null,null,false,false]
[null,null,null,null,null,false,false]
[null,null,null,null,null,false,false]
[null,null,null,null,null,false,false]
[null,null,null,null,null,false,false]
[null,null,null,null,null,false,false]
[null,null,null,null,null,false,false]
[null,null,null,null,null,false,false]
[null,null,null,null,null,false,false]
[null,null,null,null,null,false,false]
[null,null,null,null,null,false,false]
[null,null,null,null,null,false,false]
[null,null,null,null,null,false,false]
[null,null,null,null,null,false,false]
[null,null,null,null,null,false,false]
[null,null,null,null,null,false,false]
[null,null,null,null,null,{"$f":"IF(B644=\"TOUT VENANT\",\"Véolia Nice Tri - Parc d'activité logistique\",IF(B644=\"DECHETS VERTS\",\"Orédui Carros Compostage - ZI de la Grave\",IF(B644=\"GRAVATS PROPRES\",\"La Gaude K3 Sita Sud - 5211 Rte de St Jeannet\",IF(B644=\"GRAVATS SALES\",\"Véolia Nice Tri - 20 Ch du Saquier\",IF(B644=\"BOIS\",\"SEAS La Glacière - 1019 Rte de la Grasse\",IF(B644=\"METAUX\",\"PURFER - ZI Carros 15ème Rue - 06517 Carros\",IF(B644=\"BATTERIES\",\"PURFER - ZI Carros 15ème Rue - 06517 Carros\",IF(B644=\"NEON\",\"Sofovar - 126 Av Louis Lépine - 83600 Fréjus\",IF(B644=\"PEINTURES\",\"Orédui - ZI Bois de Grasse - 06310 Grasse\",IF(B644=\"PRODUITS NON IDENTIFIES\",\"Orédui - ZI Bois de Grasse - 06310 Grasse\",IF(B644=\"AEROSOLS\",\"Orédui - ZI Bois de Grasse - 06310 Grasse\",IF(B644=\"FROIDS\",\"SEAS - 1079 Rte de Grasse - 06270 Villeneuve Loubet\",IF(B644=\"HORS FROIDS\",\"SEAS - 1079 Rte de Grasse - 06270 Villeneuve Loubet\",IF(B644=\"PAM\",\"SEAS - 1079 Rte de Grasse - 06270 Villeneuve Loubet\",IF(B644=\"ECRANS\",\"SEAS - 1079 Rte de Grasse - 06270 Villeneuve Loubet\",IF(B644=\"BOX HORS FROIDS\",\"SEAS - 1079 Rte de Grasse - 06270 Villeneuve Loubet\",IF(B644=\"PILES\",\"Corepile\",IF(B644=\"CUMULUS\",\"SEAS - 1079 Rte de Grasse - 06270 Villeneuve Loubet\",IF(B644=\"PNEUS\",\"TFM Pneus - 117 Ch Clausonnes - 06560 Valbonne\",IF(B644=\"HUILES VEGETALES\",\"Orédui - ZI Bois de Grasse - 06310 Grasse\",IF(B644=\"HUILES DE VIDANGE\",\"SERAHU - 68 Ch de la Campanette - 06800 Cagnes sur Mer\")))))))))))))))))))))","v":false},{"$f":"IF(OR(B644=\"TOUT VENANT\",B644=\"DECHETS VERTS\",B644=\"GRAVATS SALES\",B644=\"GRAVATS PROPRES\",B644=\"BOIS\"),\"SUEZ\",IF(OR(B644=\"PNEUS\"),\"TFM\",IF(OR(B644=\"FROIDS\",B644=\"HORS FROIDS\",B644=\"BOX HORS FROIDS\",B644=\"CUMULUS\",B644=\"PAM\",B644=\"ECRANS\"),\"SEAS\",IF(OR(B644=\"METAUX\",B644=\"BATTERIES\"),\"DERICHEBOURG\",IF(OR(B644=\"NEON\"),\"SOFOVAR\",IF(OR(B644=\"PEINTURES\",B644=\"PRODUITS NON IDENTIFIES\",B644=\"AEROSOLS\",B644=\"HUILES VEGETALES\"),\"OREDUI\",IF(OR(B644=\"HUILES DE VIDANGE\"),\"SERAHU\")))))))","v":false}]
[null,null,null,null,null,false,false]
[null,null,null,null,null,false,false]
[null,null,null,null,null,false,false]
[null,null,null,null,null,false,false]
[null,null,null,null,null,false,false]
[null,null,null,null,null,false,false]
[null,null,null,null,null,false,false]
[null,null,null,null,null,false,false]
[null,null,null,null,null,false,false]
[null,null,null,null,null,false,false]
[null,null,null,null,null,false,false]
[null,null,null,null,null,false,false]
[null,null,null,null,null,false,false]
[null,null,null,null,null,false,false]
[null,null,null,null,null,false,false]
[null,null,null,null,null,false,false]
[null,null,null,null,null,false,false]
[null,null,null,null,null,false,false]
[null,null,null,null,null,false,false]
[null,null,null,null,null,false,false]
[null,null,null,null,null,false,false]
[null,null,null,null,null,false,false]
[null,null,null,null,null,false,false]
[null,null,null,null,null,false,false]
[null,null,null,null,null,false,false]
[null,null,null,null,null,false,false]
[null,null,null,null,null,false,false]
[null,null,null,null,null,false,false]
[null,null,null,null,null,false,false]
[null,null,null,null,null,false,false]
[null,null,null,null,null,false,false]
[null,null,null,null,null,false,false]
[null,null,null,null,null,false,false]
[null,null,null,null,null,false,false]
[null,null,null,null,null,false,false]
[null,null,null,null,null,false,false]
[null,null,null,null,null,false,false]
[null,null,null,null,null,false,false]
[null,null,null,null,null,false,false]
[null,null,null,null,null,false,false]
[null,null,null,null,null,false,false]
[null,null,null,null,null,false,false]
[null,null,null,null,null,false,false]
[null,null,null,null,null,false,false]
[null,null,null,null,null,false,false]
[null,null,null,null,null,false,false]
[null,null,null,null,null,false,false]
[null,null,null,null,null,false,false]
[null,null,null,null,null,false,false]
[null,null,null,null,null,false,false]
[null,null,null,null,null,false,false]
[null,null,null,null,null,false,false]
[null,null,null,null,null,false,false]
[null,null,null,null,null,false,false]
[null,null,null,null,null,false,false]
[null,null,null,null,null,false,false]
[null,null,null,null,null,false,false]
[null,null,null,null,null,false,false]
[null,null,null,null,null,false,false]
[null,null,null,null,null,false,false]
[null,null,null,null,null,false,false]
[null,null,null,null,null,false,false]
[null,null,null,null,null,false,false]
[null,null,null,null,null,{"$f":"IF(B708=\"TOUT VENANT\",\"Véolia Nice Tri - Parc d'activité logistique\",IF(B708=\"DECHETS VERTS\",\"Orédui Carros Compostage - ZI de la Grave\",IF(B708=\"GRAVATS PROPRES\",\"La Gaude K3 Sita Sud - 5211 Rte de St Jeannet\",IF(B708=\"GRAVATS SALES\",\"Véolia Nice Tri - 20 Ch du Saquier\",IF(B708=\"BOIS\",\"SEAS La Glacière - 1019 Rte de la Grasse\",IF(B708=\"METAUX\",\"PURFER - ZI Carros 15ème Rue - 06517 Carros\",IF(B708=\"BATTERIES\",\"PURFER - ZI Carros 15ème Rue - 06517 Carros\",IF(B708=\"NEON\",\"Sofovar - 126 Av Louis Lépine - 83600 Fréjus\",IF(B708=\"PEINTURES\",\"Orédui - ZI Bois de Grasse - 06310 Grasse\",IF(B708=\"PRODUITS NON IDENTIFIES\",\"Orédui - ZI Bois de Grasse - 06310 Grasse\",IF(B708=\"AEROSOLS\",\"Orédui - ZI Bois de Grasse - 06310 Grasse\",IF(B708=\"FROIDS\",\"SEAS - 1079 Rte de Grasse - 06270 Villeneuve Loubet\",IF(B708=\"HORS FROIDS\",\"SEAS - 1079 Rte de Grasse - 06270 Villeneuve Loubet\",IF(B708=\"PAM\",\"SEAS - 1079 Rte de Grasse - 06270 Villeneuve Loubet\",IF(B708=\"ECRANS\",\"SEAS - 1079 Rte de Grasse - 06270 Villeneuve Loubet\",IF(B708=\"BOX HORS FROIDS\",\"SEAS - 1079 Rte de Grasse - 06270 Villeneuve Loubet\",IF(B708=\"PILES\",\"Corepile\",IF(B708=\"CUMULUS\",\"SEAS - 1079 Rte de Grasse - 06270 Villeneuve Loubet\",IF(B708=\"PNEUS\",\"TFM Pneus - 117 Ch Clausonnes - 06560 Valbonne\",IF(B708=\"HUILES VEGETALES\",\"Orédui - ZI Bois de Grasse - 06310 Grasse\",IF(B708=\"HUILES DE VIDANGE\",\"SERAHU - 68 Ch de la Campanette - 06800 Cagnes sur Mer\")))))))))))))))))))))","v":false},{"$f":"IF(OR(B708=\"TOUT VENANT\",B708=\"DECHETS VERTS\",B708=\"GRAVATS SALES\",B708=\"GRAVATS PROPRES\",B708=\"BOIS\"),\"SUEZ\",IF(OR(B708=\"PNEUS\"),\"TFM\",IF(OR(B708=\"FROIDS\",B708=\"HORS FROIDS\",B708=\"BOX HORS FROIDS\",B708=\"CUMULUS\",B708=\"PAM\",B708=\"ECRANS\"),\"SEAS\",IF(OR(B708=\"METAUX\",B708=\"BATTERIES\"),\"DERICHEBOURG\",IF(OR(B708=\"NEON\"),\"SOFOVAR\",IF(OR(B708=\"PEINTURES\",B708=\"PRODUITS NON IDENTIFIES\",B708=\"AEROSOLS\",B708=\"HUILES VEGETALES\"),\"OREDUI\",IF(OR(B708=\"HUILES DE VIDANGE\"),\"SERAHU\")))))))","v":false}]
[null,null,null,null,null,false,false]
[null,null,null,null,null,false,false]
[null,null,null,null,null,false,false]
[null,null,null,null,null,false,false]
[null,null,null,null,null,false,false]
[null,null,null,null,null,false,false]
[null,null,null,null,null,false,false]
[null,null,null,null,null,false,false]
[null,null,null,null,null,false,false]
[null,null,null,null,null,false,false]
[null,null,null,null,null,false,false]
[null,null,null,null,null,false,false]
[null,null,null,null,null,false,false]
[null,null,null,null,null,false,false]
[null,null,null,null,null,false,false]
[null,null,null,null,null,false,false]
[null,null,null,null,null,false,false]
[null,null,null,null,null,false,false]
[null,null,null,null,null,false,false]
[null,null,null,null,null,false,false]
[null,null,null,null,null,false,false]
[null,null,null,null,null,false,false]
[null,null,null,null,null,false,false]
[null,null,null,null,null,false,false]
[null,null,null,null,null,false,false]
[null,null,null,null,null,false,false]
[null,null,null,null,null,false,false]
[null,null,null,null,null,false,false]
[null,null,null,null,null,false,false]
[null,null,null,null,null,false,false]
[null,null,null,null,null,false,false]
[null,null,null,null,null,false,false]
[null,null,null,null,null,false,false]
[null,null,null,null,null,false,false]
[null,null,null,null,null,false,false]
[null,null,null,null,null,false,false]
[null,null,null,null,null,false,false]
[null,null,null,null,null,false,false]
[null,null,null,null,null,false,false]
[null,null,null,null,null,false,false]
[null,null,null,null,null,false,false]
[null,null,null,null,null,false,false]
[null,null,null,null,null,false,false]
[null,null,null,null,null,false,false]
[null,null,null,null,null,false,false]
[null,null,null,null,null,false,false]
[null,null,null,null,null,false,false]
[null,null,null,null,null,false,false]
[null,null,null,null,null,false,false]
[null,null,null,null,null,false,false]
[null,null,null,null,null,false,false]
[null,null,null,null,null,false,false]
[null,null,null,null,null,false,false]
[null,null,null,null,null,false,false]
[null,null,null,null,null,false,false]
[null,null,null,null,null,false,false]
[null,null,null,null,null,false,false]
[null,null,null,null,null,false,false]
[null,null,null,null,null,false,false]
[null,null,null,null,null,false,false]
[null,null,null,null,null,false,false]
[null,null,null,null,null,false,false]
[null,null,null,null,null,false,false]
[null,null,null,null,null,{"$f":"IF(B772=\"TOUT VENANT\",\"Véolia Nice Tri - Parc d'activité logistique\",IF(B772=\"DECHETS VERTS\",\"Orédui Carros Compostage - ZI de la Grave\",IF(B772=\"GRAVATS PROPRES\",\"La Gaude K3 Sita Sud - 5211 Rte de St Jeannet\",IF(B772=\"GRAVATS SALES\",\"Véolia Nice Tri - 20 Ch du Saquier\",IF(B772=\"BOIS\",\"SEAS La Glacière - 1019 Rte de la Grasse\",IF(B772=\"METAUX\",\"PURFER - ZI Carros 15ème Rue - 06517 Carros\",IF(B772=\"BATTERIES\",\"PURFER - ZI Carros 15ème Rue - 06517 Carros\",IF(B772=\"NEON\",\"Sofovar - 126 Av Louis Lépine - 83600 Fréjus\",IF(B772=\"PEINTURES\",\"Orédui - ZI Bois de Grasse - 06310 Grasse\",IF(B772=\"PRODUITS NON IDENTIFIES\",\"Orédui - ZI Bois de Grasse - 06310 Grasse\",IF(B772=\"AEROSOLS\",\"Orédui - ZI Bois de Grasse - 06310 Grasse\",IF(B772=\"FROIDS\",\"SEAS - 1079 Rte de Grasse - 06270 Villeneuve Loubet\",IF(B772=\"HORS FROIDS\",\"SEAS - 1079 Rte de Grasse - 06270 Villeneuve Loubet\",IF(B772=\"PAM\",\"SEAS - 1079 Rte de Grasse - 06270 Villeneuve Loubet\",IF(B772=\"ECRANS\",\"SEAS - 1079 Rte de Grasse - 06270 Villeneuve Loubet\",IF(B772=\"BOX HORS FROIDS\",\"SEAS - 1079 Rte de Grasse - 06270 Villeneuve Loubet\",IF(B772=\"PILES\",\"Corepile\",IF(B772=\"CUMULUS\",\"SEAS - 1079 Rte de Grasse - 06270 Villeneuve Loubet\",IF(B772=\"PNEUS\",\"TFM Pneus - 117 Ch Clausonnes - 06560 Valbonne\",IF(B772=\"HUILES VEGETALES\",\"Orédui - ZI Bois de Grasse - 06310 Grasse\",IF(B772=\"HUILES DE VIDANGE\",\"SERAHU - 68 Ch de la Campanette - 06800 Cagnes sur Mer\")))))))))))))))))))))","v":false},{"$f":"IF(OR(B772=\"TOUT VENANT\",B772=\"DECHETS VERTS\",B772=\"GRAVATS SALES\",B772=\"GRAVATS PROPRES\",B772=\"BOIS\"),\"SUEZ\",IF(OR(B772=\"PNEUS\"),\"TFM\",IF(OR(B772=\"FROIDS\",B772=\"HORS FROIDS\",B772=\"BOX HORS FROIDS\",B772=\"CUMULUS\",B772=\"PAM\",B772=\"ECRANS\"),\"SEAS\",IF(OR(B772=\"METAUX\",B772=\"BATTERIES\"),\"DERICHEBOURG\",IF(OR(B772=\"NEON\"),\"SOFOVAR\",IF(OR(B772=\"PEINTURES\",B772=\"PRODUITS NON IDENTIFIES\",B772=\"AEROSOLS\",B772=\"HUILES VEGETALES\"),\"OREDUI\",IF(OR(B772=\"HUILES DE VIDANGE\"),\"SERAHU\")))))))","v":false}]
[null,null,null,null,null,{"$f":"IF(B773=\"TOUT VENANT\",\"Véolia Nice Tri - Parc d'activité logistique\",IF(B773=\"DECHETS VERTS\",\"Orédui Carros Compostage - ZI de la Grave\",IF(B773=\"GRAVATS PROPRES\",\"La Gaude K3 Sita Sud - 5211 Rte de St Jeannet\",IF(B773=\"GRAVATS SALES\",\"Véolia Nice Tri - 20 Ch du Saquier\",IF(B773=\"BOIS\",\"SEAS La Glacière - 1019 Rte de la Grasse\",IF(B773=\"METAUX\",\"PURFER - ZI Carros 15ème Rue - 06517 Carros\",IF(B773=\"BATTERIES\",\"PURFER - ZI Carros 15ème Rue - 06517 Carros\",IF(B773=\"NEON\",\"Sofovar - 126 Av Louis Lépine - 83600 Fréjus\",IF(B773=\"PEINTURES\",\"Orédui - ZI Bois de Grasse - 06310 Grasse\",IF(B773=\"PRODUITS NON IDENTIFIES\",\"Orédui - ZI Bois de Grasse - 06310 Grasse\",IF(B773=\"AEROSOLS\",\"Orédui - ZI Bois de Grasse - 06310 Grasse\",IF(B773=\"FROIDS\",\"SEAS - 1079 Rte de Grasse - 06270 Villeneuve Loubet\",IF(B773=\"HORS FROIDS\",\"SEAS - 1079 Rte de Grasse - 06270 Villeneuve Loubet\",IF(B773=\"PAM\",\"SEAS - 1079 Rte de Grasse - 06270 Villeneuve Loubet\",IF(B773=\"ECRANS\",\"SEAS - 1079 Rte de Grasse - 06270 Villeneuve Loubet\",IF(B773=\"BOX HORS FROIDS\",\"SEAS - 1079 Rte de Grasse - 06270 Villeneuve Loubet\",IF(B773=\"PILES\",\"Corepile\",IF(B773=\"CUMULUS\",\"SEAS - 1079 Rte de Grasse - 06270 Villeneuve Loubet\",IF(B773=\"PNEUS\",\"TFM Pneus - 117 Ch Clausonnes - 06560 Valbonne\",IF(B773=\"HUILES VEGETALES\",\"Orédui - ZI Bois de Grasse - 06310 Grasse\",IF(B773=\"HUILES DE VIDANGE\",\"SERAHU - 68 Ch de la Campanette - 06800 Cagnes sur Mer\")))))))))))))))))))))","v":false},{"$f":"IF(OR(B773=\"TOUT VENANT\",B773=\"DECHETS VERTS\",B773=\"GRAVATS SALES\",B773=\"GRAVATS PROPRES\",B773=\"BOIS\"),\"SUEZ\",IF(OR(B773=\"PNEUS\"),\"TFM\",IF(OR(B773=\"FROIDS\",B773=\"HORS FROIDS\",B773=\"BOX HORS FROIDS\",B773=\"CUMULUS\",B773=\"PAM\",B773=\"ECRANS\"),\"SEAS\",IF(OR(B773=\"METAUX\",B773=\"BATTERIES\"),\"DERICHEBOURG\",IF(OR(B773=\"NEON\"),\"SOFOVAR\",IF(OR(B773=\"PEINTURES\",B773=\"PRODUITS NON IDENTIFIES\",B773=\"AEROSOLS\",B773=\"HUILES VEGETALES\"),\"OREDUI\",IF(OR(B773=\"HUILES DE VIDANGE\"),\"SERAHU\")))))))","v":false}]
[null,null,null,null,null,{"$f":"IF(B774=\"TOUT VENANT\",\"Véolia Nice Tri - Parc d'activité logistique\",IF(B774=\"DECHETS VERTS\",\"Orédui Carros Compostage - ZI de la Grave\",IF(B774=\"GRAVATS PROPRES\",\"La Gaude K3 Sita Sud - 5211 Rte de St Jeannet\",IF(B774=\"GRAVATS SALES\",\"Véolia Nice Tri - 20 Ch du Saquier\",IF(B774=\"BOIS\",\"SEAS La Glacière - 1019 Rte de la Grasse\",IF(B774=\"METAUX\",\"PURFER - ZI Carros 15ème Rue - 06517 Carros\",IF(B774=\"BATTERIES\",\"PURFER - ZI Carros 15ème Rue - 06517 Carros\",IF(B774=\"NEON\",\"Sofovar - 126 Av Louis Lépine - 83600 Fréjus\",IF(B774=\"PEINTURES\",\"Orédui - ZI Bois de Grasse - 06310 Grasse\",IF(B774=\"PRODUITS NON IDENTIFIES\",\"Orédui - ZI Bois de Grasse - 06310 Grasse\",IF(B774=\"AEROSOLS\",\"Orédui - ZI Bois de Grasse - 06310 Grasse\",IF(B774=\"FROIDS\",\"SEAS - 1079 Rte de Grasse - 06270 Villeneuve Loubet\",IF(B774=\"HORS FROIDS\",\"SEAS - 1079 Rte de Grasse - 06270 Villeneuve Loubet\",IF(B774=\"PAM\",\"SEAS - 1079 Rte de Grasse - 06270 Villeneuve Loubet\",IF(B774=\"ECRANS\",\"SEAS - 1079 Rte de Grasse - 06270 Villeneuve Loubet\",IF(B774=\"BOX HORS FROIDS\",\"SEAS - 1079 Rte de Grasse - 06270 Villeneuve Loubet\",IF(B774=\"PILES\",\"Corepile\",IF(B774=\"CUMULUS\",\"SEAS - 1079 Rte de Grasse - 06270 Villeneuve Loubet\",IF(B774=\"PNEUS\",\"TFM Pneus - 117 Ch Clausonnes - 06560 Valbonne\",IF(B774=\"HUILES VEGETALES\",\"Orédui - ZI Bois de Grasse - 06310 Grasse\",IF(B774=\"HUILES DE VIDANGE\",\"SERAHU - 68 Ch de la Campanette - 06800 Cagnes sur Mer\")))))))))))))))))))))","v":false},{"$f":"IF(OR(B774=\"TOUT VENANT\",B774=\"DECHETS VERTS\",B774=\"GRAVATS SALES\",B774=\"GRAVATS PROPRES\",B774=\"BOIS\"),\"SUEZ\",IF(OR(B774=\"PNEUS\"),\"TFM\",IF(OR(B774=\"FROIDS\",B774=\"HORS FROIDS\",B774=\"BOX HORS FROIDS\",B774=\"CUMULUS\",B774=\"PAM\",B774=\"ECRANS\"),\"SEAS\",IF(OR(B774=\"METAUX\",B774=\"BATTERIES\"),\"DERICHEBOURG\",IF(OR(B774=\"NEON\"),\"SOFOVAR\",IF(OR(B774=\"PEINTURES\",B774=\"PRODUITS NON IDENTIFIES\",B774=\"AEROSOLS\",B774=\"HUILES VEGETALES\"),\"OREDUI\",IF(OR(B774=\"HUILES DE VIDANGE\"),\"SERAHU\")))))))","v":false}]
[null,null,null,null,null,{"$f":"IF(B775=\"TOUT VENANT\",\"Véolia Nice Tri - Parc d'activité logistique\",IF(B775=\"DECHETS VERTS\",\"Orédui Carros Compostage - ZI de la Grave\",IF(B775=\"GRAVATS PROPRES\",\"La Gaude K3 Sita Sud - 5211 Rte de St Jeannet\",IF(B775=\"GRAVATS SALES\",\"Véolia Nice Tri - 20 Ch du Saquier\",IF(B775=\"BOIS\",\"SEAS La Glacière - 1019 Rte de la Grasse\",IF(B775=\"METAUX\",\"PURFER - ZI Carros 15ème Rue - 06517 Carros\",IF(B775=\"BATTERIES\",\"PURFER - ZI Carros 15ème Rue - 06517 Carros\",IF(B775=\"NEON\",\"Sofovar - 126 Av Louis Lépine - 83600 Fréjus\",IF(B775=\"PEINTURES\",\"Orédui - ZI Bois de Grasse - 06310 Grasse\",IF(B775=\"PRODUITS NON IDENTIFIES\",\"Orédui - ZI Bois de Grasse - 06310 Grasse\",IF(B775=\"AEROSOLS\",\"Orédui - ZI Bois de Grasse - 06310 Grasse\",IF(B775=\"FROIDS\",\"SEAS - 1079 Rte de Grasse - 06270 Villeneuve Loubet\",IF(B775=\"HORS FROIDS\",\"SEAS - 1079 Rte de Grasse - 06270 Villeneuve Loubet\",IF(B775=\"PAM\",\"SEAS - 1079 Rte de Grasse - 06270 Villeneuve Loubet\",IF(B775=\"ECRANS\",\"SEAS - 1079 Rte de Grasse - 06270 Villeneuve Loubet\",IF(B775=\"BOX HORS FROIDS\",\"SEAS - 1079 Rte de Grasse - 06270 Villeneuve Loubet\",IF(B775=\"PILES\",\"Corepile\",IF(B775=\"CUMULUS\",\"SEAS - 1079 Rte de Grasse - 06270 Villeneuve Loubet\",IF(B775=\"PNEUS\",\"TFM Pneus - 117 Ch Clausonnes - 06560 Valbonne\",IF(B775=\"HUILES VEGETALES\",\"Orédui - ZI Bois de Grasse - 06310 Grasse\",IF(B775=\"HUILES DE VIDANGE\",\"SERAHU - 68 Ch de la Campanette - 06800 Cagnes sur Mer\")))))))))))))))))))))","v":false},{"$f":"IF(OR(B775=\"TOUT VENANT\",B775=\"DECHETS VERTS\",B775=\"GRAVATS SALES\",B775=\"GRAVATS PROPRES\",B775=\"BOIS\"),\"SUEZ\",IF(OR(B775=\"PNEUS\"),\"TFM\",IF(OR(B775=\"FROIDS\",B775=\"HORS FROIDS\",B775=\"BOX HORS FROIDS\",B775=\"CUMULUS\",B775=\"PAM\",B775=\"ECRANS\"),\"SEAS\",IF(OR(B775=\"METAUX\",B775=\"BATTERIES\"),\"DERICHEBOURG\",IF(OR(B775=\"NEON\"),\"SOFOVAR\",IF(OR(B775=\"PEINTURES\",B775=\"PRODUITS NON IDENTIFIES\",B775=\"AEROSOLS\",B775=\"HUILES VEGETALES\"),\"OREDUI\",IF(OR(B775=\"HUILES DE VIDANGE\"),\"SERAHU\")))))))","v":false}]
[null,null,null,null,null,{"$f":"IF(B776=\"TOUT VENANT\",\"Véolia Nice Tri - Parc d'activité logistique\",IF(B776=\"DECHETS VERTS\",\"Orédui Carros Compostage - ZI de la Grave\",IF(B776=\"GRAVATS PROPRES\",\"La Gaude K3 Sita Sud - 5211 Rte de St Jeannet\",IF(B776=\"GRAVATS SALES\",\"Véolia Nice Tri - 20 Ch du Saquier\",IF(B776=\"BOIS\",\"SEAS La Glacière - 1019 Rte de la Grasse\",IF(B776=\"METAUX\",\"PURFER - ZI Carros 15ème Rue - 06517 Carros\",IF(B776=\"BATTERIES\",\"PURFER - ZI Carros 15ème Rue - 06517 Carros\",IF(B776=\"NEON\",\"Sofovar - 126 Av Louis Lépine - 83600 Fréjus\",IF(B776=\"PEINTURES\",\"Orédui - ZI Bois de Grasse - 06310 Grasse\",IF(B776=\"PRODUITS NON IDENTIFIES\",\"Orédui - ZI Bois de Grasse - 06310 Grasse\",IF(B776=\"AEROSOLS\",\"Orédui - ZI Bois de Grasse - 06310 Grasse\",IF(B776=\"FROIDS\",\"SEAS - 1079 Rte de Grasse - 06270 Villeneuve Loubet\",IF(B776=\"HORS FROIDS\",\"SEAS - 1079 Rte de Grasse - 06270 Villeneuve Loubet\",IF(B776=\"PAM\",\"SEAS - 1079 Rte de Grasse - 06270 Villeneuve Loubet\",IF(B776=\"ECRANS\",\"SEAS - 1079 Rte de Grasse - 06270 Villeneuve Loubet\",IF(B776=\"BOX HORS FROIDS\",\"SEAS - 1079 Rte de Grasse - 06270 Villeneuve Loubet\",IF(B776=\"PILES\",\"Corepile\",IF(B776=\"CUMULUS\",\"SEAS - 1079 Rte de Grasse - 06270 Villeneuve Loubet\",IF(B776=\"PNEUS\",\"TFM Pneus - 117 Ch Clausonnes - 06560 Valbonne\",IF(B776=\"HUILES VEGETALES\",\"Orédui - ZI Bois de Grasse - 06310 Grasse\",IF(B776=\"HUILES DE VIDANGE\",\"SERAHU - 68 Ch de la Campanette - 06800 Cagnes sur Mer\")))))))))))))))))))))","v":false},{"$f":"IF(OR(B776=\"TOUT VENANT\",B776=\"DECHETS VERTS\",B776=\"GRAVATS SALES\",B776=\"GRAVATS PROPRES\",B776=\"BOIS\"),\"SUEZ\",IF(OR(B776=\"PNEUS\"),\"TFM\",IF(OR(B776=\"FROIDS\",B776=\"HORS FROIDS\",B776=\"BOX HORS FROIDS\",B776=\"CUMULUS\",B776=\"PAM\",B776=\"ECRANS\"),\"SEAS\",IF(OR(B776=\"METAUX\",B776=\"BATTERIES\"),\"DERICHEBOURG\",IF(OR(B776=\"NEON\"),\"SOFOVAR\",IF(OR(B776=\"PEINTURES\",B776=\"PRODUITS NON IDENTIFIES\",B776=\"AEROSOLS\",B776=\"HUILES VEGETALES\"),\"OREDUI\",IF(OR(B776=\"HUILES DE VIDANGE\"),\"SERAHU\")))))))","v":false}]

{"sheet":"Registre_4","index":18,"n_rows":775,"n_cols":15,"rows_kept":775,"cut":false,"hidden":false,"merged":[[771,2,771,3],[772,2,772,3],[773,2,773,3],[774,2,774,3],[765,2,765,3],[766,2,766,3],[767,2,767,3],[768,2,768,3],[769,2,769,3],[770,2,770,3],[759,2,759,3],[760,2,760,3],[761,2,761,3],[762,2,762,3],[763,2,763,3],[764,2,764,3],[753,2,753,3],[754,2,754,3],[755,2,755,3],[756,2,756,3],[757,2,757,3],[758,2,758,3],[747,2,747,3],[748,2,748,3],[749,2,749,3],[750,2,750,3],[751,2,751,3],[752,2,752,3],[741,2,741,3],[742,2,742,3],[743,2,743,3],[744,2,744,3],[745,2,745,3],[746,2,746,3],[735,2,735,3],[736,2,736,3],[737,2,737,3],[738,2,738,3],[739,2,739,3],[740,2,740,3],[729,2,729,3],[730,2,730,3],[731,2,731,3],[732,2,732,3],[733,2,733,3],[734,2,734,3],[723,2,723,3],[724,2,724,3],[725,2,725,3],[726,2,726,3],[727,2,727,3],[728,2,728,3],[717,2,717,3],[718,2,718,3],[719,2,719,3],[720,2,720,3],[721,2,721,3],[722,2,722,3],[711,2,711,3],[712,2,712,3],[713,2,713,3],[714,2,714,3],[715,2,715,3],[716,2,716,3],[705,2,705,3],[706,2,706,3],[707,2,707,3],[708,2,708,3],[709,2,709,3],[710,2,710,3],[699,2,699,3],[700,2,700,3],[701,2,701,3],[702,2,702,3],[703,2,703,3],[704,2,704,3],[693,2,693,3],[694,2,694,3],[695,2,695,3],[696,2,696,3],[697,2,697,3],[698,2,698,3],[687,2,687,3],[688,2,688,3],[689,2,689,3],[690,2,690,3],[691,2,691,3],[692,2,692,3],[681,2,681,3],[682,2,682,3],[683,2,683,3],[684,2,684,3],[685,2,685,3],[686,2,686,3],[675,2,675,3],[676,2,676,3],[677,2,677,3],[678,2,678,3],[679,2,679,3],[680,2,680,3],[669,2,669,3],[670,2,670,3],[671,2,671,3],[672,2,672,3],[673,2,673,3],[674,2,674,3],[663,2,663,3],[664,2,664,3],[665,2,665,3],[666,2,666,3],[667,2,667,3],[668,2,668,3],[657,2,657,3],[658,2,658,3],[659,2,659,3],[660,2,660,3],[661,2,661,3],[662,2,662,3],[651,2,651,3],[652,2,652,3],[653,2,653,3],[654,2,654,3],[655,2,655,3],[656,2,656,3],[645,2,645,3],[646,2,646,3],[647,2,647,3],[648,2,648,3],[649,2,649,3],[650,2,650,3],[639,2,639,3],[640,2,640,3],[641,2,641,3],[642,2,642,3],[643,2,643,3],[644,2,644,3],[633,2,633,3],[634,2,634,3],[635,2,635,3],[636,2,636,3],[637,2,637,3],[638,2,638,3],[627,2,627,3],[628,2,628,3],[629,2,629,3],[630,2,630,3],[631,2,631,3],[632,2,632,3],[621,2,621,3],[622,2,622,3],[623,2,623,3],[624,2,624,3],[625,2,625,3],[626,2,626,3],[615,2,615,3],[616,2,616,3],[617,2,617,3],[618,2,618,3],[619,2,619,3],[620,2,620,3],[609,2,609,3],[610,2,610,3],[611,2,611,3],[612,2,612,3],[613,2,613,3],[614,2,614,3],[603,2,603,3],[604,2,604,3],[605,2,605,3],[606,2,606,3],[607,2,607,3],[608,2,608,3],[597,2,597,3],[598,2,598,3],[599,2,599,3],[600,2,600,3],[601,2,601,3],[602,2,602,3],[591,2,591,3],[592,2,592,3],[593,2,593,3],[594,2,594,3],[595,2,595,3],[596,2,596,3],[585,2,585,3],[586,2,586,3],[587,2,587,3],[588,2,588,3],[589,2,589,3],[590,2,590,3],[579,2,579,3],[580,2,580,3],[581,2,581,3],[582,2,582,3],[583,2,583,3],[584,2,584,3],[573,2,573,3],[574,2,574,3],[575,2,575,3],[576,2,576,3],[577,2,577,3],[578,2,578,3],[567,2,567,3],[568,2,568,3],[569,2,569,3],[570,2,570,3],[571,2,571,3],[572,2,572,3],[561,2,561,3],[562,2,562,3],[563,2,563,3],[564,2,564,3],[565,2,565,3],[566,2,566,3],[555,2,555,3],[556,2,556,3],[557,2,557,3],[558,2,558,3],[559,2,559,3],[560,2,560,3],[549,2,549,3],[550,2,550,3],[551,2,551,3],[552,2,552,3],[553,2,553,3],[554,2,554,3],[543,2,543,3],[544,2,544,3],[545,2,545,3],[546,2,546,3],[547,2,547,3],[548,2,548,3],[537,2,537,3],[538,2,538,3],[539,2,539,3],[540,2,540,3],[541,2,541,3],[542,2,542,3],[531,2,531,3],[532,2,532,3],[533,2,533,3],[534,2,534,3],[535,2,535,3],[536,2,536,3],[525,2,525,3],[526,2,526,3],[527,2,527,3],[528,2,528,3],[529,2,529,3],[530,2,530,3],[519,2,519,3],[520,2,520,3],[521,2,521,3],[522,2,522,3],[523,2,523,3],[524,2,524,3],[513,2,513,3],[514,2,514,3],[515,2,515,3],[516,2,516,3],[517,2,517,3],[518,2,518,3],[507,2,507,3],[508,2,508,3],[509,2,509,3],[510,2,510,3],[511,2,511,3],[512,2,512,3],[501,2,501,3],[502,2,502,3],[503,2,503,3],[504,2,504,3],[505,2,505,3],[506,2,506,3],[495,2,495,3],[496,2,496,3],[497,2,497,3],[498,2,498,3],[499,2,499,3],[500,2,500,3],[489,2,489,3],[490,2,490,3],[491,2,491,3],[492,2,492,3],[493,2,493,3],[494,2,494,3],[483,2,483,3],[484,2,484,3],[485,2,485,3],[486,2,486,3],[487,2,487,3],[488,2,488,3],[477,2,477,3],[478,2,478,3],[479,2,479,3],[480,2,480,3],[481,2,481,3],[482,2,482,3],[471,2,471,3],[472,2,472,3],[473,2,473,3],[474,2,474,3],[475,2,475,3],[476,2,476,3],[465,2,465,3],[466,2,466,3],[467,2,467,3],[468,2,468,3],[469,2,469,3],[470,2,470,3],[459,2,459,3],[460,2,460,3],[461,2,461,3],[462,2,462,3],[463,2,463,3],[464,2,464,3],[453,2,453,3],[454,2,454,3],[455,2,455,3],[456,2,456,3],[457,2,457,3],[458,2,458,3],[447,2,447,3],[448,2,448,3],[449,2,449,3],[450,2,450,3],[451,2,451,3],[452,2,452,3],[441,2,441,3],[442,2,442,3],[443,2,443,3],[444,2,444,3],[445,2,445,3],[446,2,446,3],[435,2,435,3],[436,2,436,3],[437,2,437,3],[438,2,438,3],[439,2,439,3],[440,2,440,3],[429,2,429,3],[430,2,430,3],[431,2,431,3],[432,2,432,3],[433,2,433,3],[434,2,434,3],[423,2,423,3],[424,2,424,3],[425,2,425,3],[426,2,426,3],[427,2,427,3],[428,2,428,3],[417,2,417,3],[418,2,418,3],[419,2,419,3],[420,2,420,3],[421,2,421,3],[422,2,422,3],[411,2,411,3],[412,2,412,3],[413,2,413,3],[414,2,414,3],[415,2,415,3],[416,2,416,3],[405,2,405,3],[406,2,406,3],[407,2,407,3],[408,2,408,3],[409,2,409,3],[410,2,410,3],[399,2,399,3],[400,2,400,3],[401,2,401,3],[402,2,402,3],[403,2,403,3],[404,2,404,3],[393,2,393,3],[394,2,394,3],[395,2,395,3],[396,2,396,3],[397,2,397,3],[398,2,398,3],[387,2,387,3],[388,2,388,3],[389,2,389,3],[390,2,390,3],[391,2,391,3],[392,2,392,3],[381,2,381,3],[382,2,382,3],[383,2,383,3],[384,2,384,3],[385,2,385,3],[386,2,386,3],[375,2,375,3],[376,2,376,3],[377,2,377,3],[378,2,378,3],[379,2,379,3],[380,2,380,3],[369,2,369,3],[370,2,370,3],[371,2,371,3],[372,2,372,3],[373,2,373,3],[374,2,374,3],[363,2,363,3],[364,2,364,3],[365,2,365,3],[366,2,366,3],[367,2,367,3],[368,2,368,3],[357,2,357,3],[358,2,358,3],[359,2,359,3],[360,2,360,3],[361,2,361,3],[362,2,362,3],[351,2,351,3],[352,2,352,3],[353,2,353,3],[354,2,354,3],[355,2,355,3],[356,2,356,3],[345,2,345,3],[346,2,346,3],[347,2,347,3],[348,2,348,3],[349,2,349,3],[350,2,350,3],[339,2,339,3],[340,2,340,3],[341,2,341,3],[342,2,342,3],[343,2,343,3],[344,2,344,3],[333,2,333,3],[334,2,334,3],[335,2,335,3],[336,2,336,3],[337,2,337,3],[338,2,338,3],[327,2,327,3],[328,2,328,3],[329,2,329,3],[330,2,330,3],[331,2,331,3],[332,2,332,3],[321,2,321,3],[322,2,322,3],[323,2,323,3],[324,2,324,3],[325,2,325,3],[326,2,326,3],[315,2,315,3],[316,2,316,3],[317,2,317,3],[318,2,318,3],[319,2,319,3],[320,2,320,3],[309,2,309,3],[310,2,310,3],[311,2,311,3],[312,2,312,3],[313,2,313,3],[314,2,314,3],[303,2,303,3],[304,2,304,3],[305,2,305,3],[306,2,306,3],[307,2,307,3],[308,2,308,3],[297,2,297,3],[298,2,298,3],[299,2,299,3],[300,2,300,3],[301,2,301,3],[302,2,302,3],[291,2,291,3],[292,2,292,3],[293,2,293,3],[294,2,294,3],[295,2,295,3],[296,2,296,3],[285,2,285,3],[286,2,286,3],[287,2,287,3],[288,2,288,3],[289,2,289,3],[290,2,290,3],[279,2,279,3],[280,2,280,3],[281,2,281,3],[282,2,282,3],[283,2,283,3],[284,2,284,3],[273,2,273,3],[274,2,274,3],[275,2,275,3],[276,2,276,3],[277,2,277,3],[278,2,278,3],[267,2,267,3],[268,2,268,3],[269,2,269,3],[270,2,270,3],[271,2,271,3],[272,2,272,3],[261,2,261,3],[262,2,262,3],[263,2,263,3],[264,2,264,3],[265,2,265,3],[266,2,266,3],[255,2,255,3],[256,2,256,3],[257,2,257,3],[258,2,258,3],[259,2,259,3],[260,2,260,3],[249,2,249,3],[250,2,250,3],[251,2,251,3],[252,2,252,3],[253,2,253,3],[254,2,254,3],[243,2,243,3],[244,2,244,3],[245,2,245,3],[246,2,246,3],[247,2,247,3],[248,2,248,3],[237,2,237,3],[238,2,238,3],[239,2,239,3],[240,2,240,3],[241,2,241,3],[242,2,242,3],[231,2,231,3],[232,2,232,3],[233,2,233,3],[234,2,234,3],[235,2,235,3],[236,2,236,3],[225,2,225,3],[226,2,226,3],[227,2,227,3],[228,2,228,3],[229,2,229,3],[230,2,230,3],[219,2,219,3],[220,2,220,3],[221,2,221,3],[222,2,222,3],[223,2,223,3],[224,2,224,3],[213,2,213,3],[214,2,214,3],[215,2,215,3],[216,2,216,3],[217,2,217,3],[218,2,218,3],[207,2,207,3],[208,2,208,3],[209,2,209,3],[210,2,210,3],[211,2,211,3],[212,2,212,3],[201,2,201,3],[202,2,202,3],[203,2,203,3],[204,2,204,3],[205,2,205,3],[206,2,206,3],[195,2,195,3],[196,2,196,3],[197,2,197,3],[198,2,198,3],[199,2,199,3],[200,2,200,3],[189,2,189,3],[190,2,190,3],[191,2,191,3],[192,2,192,3],[193,2,193,3],[194,2,194,3],[183,2,183,3],[184,2,184,3],[185,2,185,3],[186,2,186,3],[187,2,187,3],[188,2,188,3],[177,2,177,3],[178,2,178,3],[179,2,179,3],[180,2,180,3],[181,2,181,3],[182,2,182,3],[171,2,171,3],[172,2,172,3],[173,2,173,3],[174,2,174,3],[175,2,175,3],[176,2,176,3],[165,2,165,3],[166,2,166,3],[167,2,167,3],[168,2,168,3],[169,2,169,3],[170,2,170,3],[159,2,159,3],[160,2,160,3],[161,2,161,3],[162,2,162,3],[163,2,163,3],[164,2,164,3],[153,2,153,3],[154,2,154,3],[155,2,155,3],[156,2,156,3],[157,2,157,3],[158,2,158,3],[147,2,147,3],[148,2,148,3],[149,2,149,3],[150,2,150,3],[151,2,151,3],[152,2,152,3],[141,2,141,3],[142,2,142,3],[143,2,143,3],[144,2,144,3],[145,2,145,3],[146,2,146,3],[135,2,135,3],[136,2,136,3],[137,2,137,3],[138,2,138,3],[139,2,139,3],[140,2,140,3],[129,2,129,3],[130,2,130,3],[131,2,131,3],[132,2,132,3],[133,2,133,3],[134,2,134,3],[123,2,123,3],[124,2,124,3],[125,2,125,3],[126,2,126,3],[127,2,127,3],[128,2,128,3],[117,2,117,3],[118,2,118,3],[119,2,119,3],[120,2,120,3],[121,2,121,3],[122,2,122,3],[111,2,111,3],[112,2,112,3],[113,2,113,3],[114,2,114,3],[115,2,115,3],[116,2,116,3],[105,2,105,3],[106,2,106,3],[107,2,107,3],[108,2,108,3],[109,2,109,3],[110,2,110,3],[99,2,99,3],[100,2,100,3],[101,2,101,3],[102,2,102,3],[103,2,103,3],[104,2,104,3],[93,2,93,3],[94,2,94,3],[95,2,95,3],[96,2,96,3],[97,2,97,3],[98,2,98,3],[87,2,87,3],[88,2,88,3],[89,2,89,3],[90,2,90,3],[91,2,91,3],[92,2,92,3],[81,2,81,3],[82,2,82,3],[83,2,83,3],[84,2,84,3],[85,2,85,3],[86,2,86,3],[75,2,75,3],[76,2,76,3],[77,2,77,3],[78,2,78,3],[79,2,79,3],[80,2,80,3],[69,2,69,3],[70,2,70,3],[71,2,71,3],[72,2,72,3],[73,2,73,3],[74,2,74,3],[63,2,63,3],[64,2,64,3],[65,2,65,3],[66,2,66,3],[67,2,67,3],[68,2,68,3],[57,2,57,3],[58,2,58,3],[59,2,59,3],[60,2,60,3],[61,2,61,3],[62,2,62,3],[51,2,51,3],[52,2,52,3],[53,2,53,3],[54,2,54,3],[55,2,55,3],[56,2,56,3],[45,2,45,3],[46,2,46,3],[47,2,47,3],[48,2,48,3],[49,2,49,3],[50,2,50,3],[39,2,39,3],[40,2,40,3],[41,2,41,3],[42,2,42,3],[43,2,43,3],[44,2,44,3],[33,2,33,3],[34,2,34,3],[35,2,35,3],[36,2,36,3],[37,2,37,3],[38,2,38,3],[27,2,27,3],[28,2,28,3],[29,2,29,3],[30,2,30,3],[31,2,31,3],[32,2,32,3],[22,2,22,3],[23,2,23,3],[24,2,24,3],[25,2,25,3],[25,12,25,13],[26,2,26,3],[17,2,17,3],[17,12,17,13],[18,2,18,3],[19,2,19,3],[20,2,20,3],[21,2,21,3],[11,2,11,3],[12,2,12,3],[13,2,13,3],[14,2,14,3],[15,2,15,3],[16,2,16,3],[5,2,5,3],[6,2,6,3],[7,2,7,3],[8,2,8,3],[9,2,9,3],[10,2,10,3],[0,0,0,1],[1,2,1,3],[2,2,2,3],[3,2,3,3],[4,2,4,3],[0,2,0,9]]}
[null,null,"REGISTRE DECHETS NON DANGEREUX\n(Arrêté du 29 février 2012 fixant le contenu des registres mentionnés aux articles R. 541-43 et R. 541-46 du code de l'environnement )"]
["Date d'enlèvement","Nature du déchets","Quantité de déchets\n (en kg)",null,"Unité","Installation de destination \n(nom et adresse)","Transporteur ","Immatriculation","Fiche d'intervention","Signature"]
["22/01/18","DECHETS VERTS","860",null,"",{"$f":"IF(B3=\"TOUT VENANT\",\"Véolia Nice Tri - Parc d'activité logistique\",IF(B3=\"DECHETS VERTS\",\"Orédui Carros Compostage - ZI de la Grave\",IF(B3=\"GRAVATS PROPRES\",\"La Gaude K3 Sita Sud - 5211 Rte de St Jeannet\",IF(B3=\"GRAVATS SALES\",\"Véolia Nice Tri - 20 Ch du Saquier\",IF(B3=\"BOIS\",\"SEAS La Glacière - 1019 Rte de la Grasse\",IF(B3=\"METAUX\",\"PURFER - ZI Carros 15ème Rue - 06517 Carros\",IF(B3=\"BATTERIES\",\"PURFER - ZI Carros 15ème Rue - 06517 Carros\",IF(B3=\"NEON\",\"Sofovar - 126 Av Louis Lépine - 83600 Fréjus\",IF(B3=\"PEINTURES\",\"Orédui - ZI Bois de Grasse - 06310 Grasse\",IF(B3=\"PRODUITS NON IDENTIFIES\",\"Orédui - ZI Bois de Grasse - 06310 Grasse\",IF(B3=\"AEROSOLS\",\"Orédui - ZI Bois de Grasse - 06310 Grasse\",IF(B3=\"FROIDS\",\"SEAS - 1079 Rte de Grasse - 06270 Villeneuve Loubet\",IF(B3=\"HORS FROIDS\",\"SEAS - 1079 Rte de Grasse - 06270 Villeneuve Loubet\",IF(B3=\"PAM\",\"SEAS - 1079 Rte de Grasse - 06270 Villeneuve Loubet\",IF(B3=\"ECRANS\",\"SEAS - 1079 Rte de Grasse - 06270 Villeneuve Loubet\",IF(B3=\"BOX HORS FROIDS\",\"SEAS - 1079 Rte de Grasse - 06270 Villeneuve Loubet\",IF(B3=\"PILES\",\"Corepile\",IF(B3=\"CUMULUS\",\"SEAS - 1079 Rte de Grasse - 06270 Villeneuve Loubet\",IF(B3=\"PNEUS\",\"TFM Pneus - 117 Ch Clausonnes - 06560 Valbonne\",IF(B3=\"HUILES VEGETALES\",\"Orédui - ZI Bois de Grasse - 06310 Grasse\",IF(B3=\"HUILES DE VIDANGE\",\"SERAHU - 68 Ch de la Campanette - 06800 Cagnes sur Mer\")))))))))))))))))))))","v":"Orédui Carros Compostage - ZI de la Grave"},{"$f":"IF(OR(B3=\"TOUT VENANT\",B3=\"DECHETS VERTS\",B3=\"GRAVATS SALES\",B3=\"GRAVATS PROPRES\",B3=\"BOIS\"),\"SUEZ\",IF(OR(B3=\"PNEUS\"),\"TFM\",IF(OR(B3=\"FROIDS\",B3=\"HORS FROIDS\",B3=\"BOX HORS FROIDS\",B3=\"CUMULUS\",B3=\"PAM\",B3=\"ECRANS\"),\"SEAS\",IF(OR(B3=\"METAUX\",B3=\"BATTERIES\"),\"DERICHEBOURG\",IF(OR(B3=\"NEON\"),\"SOFOVAR\",IF(OR(B3=\"PEINTURES\",B3=\"PRODUITS NON IDENTIFIES\",B3=\"AEROSOLS\",B3=\"HUILES VEGETALES\"),\"OREDUI\",IF(OR(B3=\"HUILES DE VIDANGE\"),\"SERAHU\")))))))","v":"SUEZ"},null,"B0300471802"]
["20/01/18","GRAVATS PROPRES","10550",null,"",{"$f":"IF(B4=\"TOUT VENANT\",\"Véolia Nice Tri - Parc d'activité logistique\",IF(B4=\"DECHETS VERTS\",\"Orédui Carros Compostage - ZI de la Grave\",IF(B4=\"GRAVATS PROPRES\",\"La Gaude K3 Sita Sud - 5211 Rte de St Jeannet\",IF(B4=\"GRAVATS SALES\",\"Véolia Nice Tri - 20 Ch du Saquier\",IF(B4=\"BOIS\",\"SEAS La Glacière - 1019 Rte de la Grasse\",IF(B4=\"METAUX\",\"PURFER - ZI Carros 15ème Rue - 06517 Carros\",IF(B4=\"BATTERIES\",\"PURFER - ZI Carros 15ème Rue - 06517 Carros\",IF(B4=\"NEON\",\"Sofovar - 126 Av Louis Lépine - 83600 Fréjus\",IF(B4=\"PEINTURES\",\"Orédui - ZI Bois de Grasse - 06310 Grasse\",IF(B4=\"PRODUITS NON IDENTIFIES\",\"Orédui - ZI Bois de Grasse - 06310 Grasse\",IF(B4=\"AEROSOLS\",\"Orédui - ZI Bois de Grasse - 06310 Grasse\",IF(B4=\"FROIDS\",\"SEAS - 1079 Rte de Grasse - 06270 Villeneuve Loubet\",IF(B4=\"HORS FROIDS\",\"SEAS - 1079 Rte de Grasse - 06270 Villeneuve Loubet\",IF(B4=\"PAM\",\"SEAS - 1079 Rte de Grasse - 06270 Villeneuve Loubet\",IF(B4=\"ECRANS\",\"SEAS - 1079 Rte de Grasse - 06270 Villeneuve Loubet\",IF(B4=\"BOX HORS FROIDS\",\"SEAS - 1079 Rte de Grasse - 06270 Villeneuve Loubet\",IF(B4=\"PILES\",\"Corepile\",IF(B4=\"CUMULUS\",\"SEAS - 1079 Rte de Grasse - 06270 Villeneuve Loubet\",IF(B4=\"PNEUS\",\"TFM Pneus - 117 Ch Clausonnes - 06560 Valbonne\",IF(B4=\"HUILES VEGETALES\",\"Orédui - ZI Bois de Grasse - 06310 Grasse\",IF(B4=\"HUILES DE VIDANGE\",\"SERAHU - 68 Ch de la Campanette - 06800 Cagnes sur Mer\")))))))))))))))))))))","v":"La Gaude K3 Sita Sud - 5211 Rte de St Jeannet"},{"$f":"IF(OR(B4=\"TOUT VENANT\",B4=\"DECHETS VERTS\",B4=\"GRAVATS SALES\",B4=\"GRAVATS PROPRES\",B4=\"BOIS\"),\"SUEZ\",IF(OR(B4=\"PNEUS\"),\"TFM\",IF(OR(B4=\"FROIDS\",B4=\"HORS FROIDS\",B4=\"BOX HORS FROIDS\",B4=\"CUMULUS\",B4=\"PAM\",B4=\"ECRANS\"),\"SEAS\",IF(OR(B4=\"METAUX\",B4=\"BATTERIES\"),\"DERICHEBOURG\",IF(OR(B4=\"NEON\"),\"SOFOVAR\",IF(OR(B4=\"PEINTURES\",B4=\"PRODUITS NON IDENTIFIES\",B4=\"AEROSOLS\",B4=\"HUILES VEGETALES\"),\"OREDUI\",IF(OR(B4=\"HUILES DE VIDANGE\"),\"SERAHU\")))))))","v":"SUEZ"},null,"B0300473468"]
["22/01/18","DECHETS VERTS","3000",null,"","Orédui Carros Compostage - ZI de la Grave","SUEZ",null,"B0300471909"]
["22/01/18","GRAVATS PROPRES","5650",null,"","La Gaude K3 Sita Sud - 5211 Rte de St Jeannet","SUEZ",null,"B0300473499"]
["22/01/18","METAUX","",null,"","PURFER - ZI Carros 15ème Rue - 06517 Carros","DERICHEBOURG",null,"2232"]
["22/01/18","BOIS","3560",null,"","SEAS La Glacière - 1019 Rte de la Grasse","SUEZ",null,"B0300471833"]
["22/01/18","TOUT VENANT","3540",null,"","Véolia Nice Tri - Parc d'activité logistique","SUEZ",null,"0103317"]
["22/01/18","TOUT VENANT","3740",null,"","Véolia Nice Tri - Parc d'activité logistique","SUEZ",null,"0103316"]
["22/01/18","GRAVATS SALES","6480",null,"","Véolia Nice Tri - 20 Ch du Saquier","SUEZ",null,"B0300472039"]
["22/01/18","GRAVATS PROPRES","10800",null,"","La Gaude K3 Sita Sud - 5211 Rte de St Jeannet","SUEZ",null,"B0300473530"]
["22/01/18","TOUT VENANT","",null,"","Véolia Nice Tri - Parc d'activité logistique","SUEZ",null,"B0300472371"]
["22/01/18","TOUT VENANT","400",null,"","Véolia Nice Tri - Parc d'activité logistique","SUEZ",null,"431529"]
["22/01/18","BOIS","3440",null,"","SEAS La Glacière - 1019 Rte de la Grasse","SUEZ",null,"B0300471871"]
["22/01/18","HORS FROIDS","",null,"24","SEAS - 1079 Rte de Grasse - 06270 Villeneuve Loubet","SEAS",null,"ES0001277229001"]
["22/01/18","FROIDS","",null,"12","SEAS - 1079 Rte de Grasse - 06270 Villeneuve Loubet","SEAS",null,"ES0001277229002"]
["22/01/18","PAM","",null,"6","SEAS - 1079 Rte de Grasse - 06270 Villeneuve Loubet","SEAS",null,"ES0001277229002",null,null,null,"PRESTATIONS JOURNALIERES SUEZ"]
["22/01/18","GRAVATS SALES","2220",null,"","Véolia Nice Tri - 20 Ch du Saquier","SUEZ",null,"B0300473728",null,null,null,"6 TV ","6 ROTATIONS DE CAMION AMPIROLES"]
["22/01/18","TOUT VENANT","1420",null,"","Véolia Nice Tri - Parc d'activité logistique","SUEZ",null,"B0300473567",null,null,null,"6 TV ","3 ROTATIONS DE CAMION GRAPPIN","LUNDI 4 ROTATIONS DE GRAPPIN"]
["22/01/18","TOUT VENANT","1840",null,"","Véolia Nice Tri - Parc d'activité logistique","SUEZ",null,"B0300476444",null,null,null,"2 GRAVATS SALES","1  MATIN ET 1 APRES MIDI"]
["22/01/18","BOIS","2260",null,"","SEAS La Glacière - 1019 Rte de la Grasse","SUEZ",null,"B0300472001",null,null,null,"3 GRAVATS PROPRES","3 ROTATIONS DE CAMION AMPIROLES"]
["22/01/18","TOUT VENANT","2020",null,"","Véolia Nice Tri - Parc d'activité logistique","SUEZ",null,"B0300476447",null,null,null,"2 DECHETS VERTS","2 ROTATIONS DE CAMION AMPIROLES"]
["19/01/18","TOUT VENANT","4500",null,"","Véolia Nice Tri - Parc d'activité logistique","SUEZ",null,"0103315",null,null,null,"2 BOIS","2 ROTATIONS DE CAMION AMPIROLES"]
["23/01/18","GRAVATS PROPRES","11250",null,"","La Gaude K3 Sita Sud - 5211 Rte de St Jeannet","SUEZ","BAL085","B0300473474",null,null,null,"1 METAUX","1 ROTATION DE CAMION GRAPPIN"]
["23/01/18","GRAVATS SALES","3700",null,"","Véolia Nice Tri - 20 Ch du Saquier","SUEZ",null,"B0300472045",null,null,null,"Le samedi présence d'un camion minimum jusqu'à 16H"]
["23/01/18","GRAVATS SALES","3700",null,"","Véolia Nice Tri - 20 Ch du Saquier","SUEZ","BAL085","B0300472045"]
["23/01/18","GRAVATS PROPRES","9350",null,"","La Gaude K3 Sita Sud - 5211 Rte de St Jeannet","SUEZ","BAL085","B0300473505"]
["23/01/18","GRAVATS SALES","4660",null,"","Véolia Nice Tri - 20 Ch du Saquier","SUEZ","BAL085","B0300473734"]
["23/01/18","METAUX","",null,"","PURFER - ZI Carros 15ème Rue - 06517 Carros","DERICHEBOURG",null,"2235"]
["23/01/18","GRAVATS PROPRES","9200",null,"","La Gaude K3 Sita Sud - 5211 Rte de St Jeannet","SUEZ","BAL085","B0300473536"]
["23/01/18","GRAVATS SALES","5320",null,"","Véolia Nice Tri - 20 Ch du Saquier","SUEZ","BAL085","B0300471777"]
["23/01/18","TOUT VENANT","1140",null,"","Véolia Nice Tri - Parc d'activité logistique","SUEZ","BA0871","B0300476514"]
["23/01/18","TOUT VENANT","1740",null,"","Véolia Nice Tri - Parc d'activité logistique","SUEZ","BA0871","B0300473573"]
["23/01/18","TOUT VENANT","2380",null,"","Véolia Nice Tri - Parc d'activité logistique","SUEZ","BA0870","B0300472473"]
["23/01/18","DECHETS VERTS","2420",null,"","Orédui Carros Compostage - ZI de la Grave","SUEZ","BA0870","B0300471808"]
["23/01/18","DECHETS VERTS","1920",null,"","Orédui Carros Compostage - ZI de la Grave","SUEZ","BA0870","B0300471915"]
["23/01/18","BOIS","2260",null,"","SEAS La Glacière - 1019 Rte de la Grasse","SUEZ","BA0870","B0300471839"]
["23/01/18","BOIS","2560",null,"","SEAS La Glacière - 1019 Rte de la Grasse","SUEZ","BA0870","B0300471877"]
["23/01/18","TOUT VENANT","2800",null,"","Véolia Nice Tri - Parc d'activité logistique","SUEZ","BA0870","B0300472346"]
["23/01/18","DECHETS VERTS","1620",null,"","Orédui Carros Compostage - ZI de la Grave","SUEZ","BA0870","B0300476517"]
["23/01/18","BOIS","2380",null,"","SEAS La Glacière - 1019 Rte de la Grasse","SUEZ","BA0870","B0300472007"]
["24/01/18","DECHETS VERTS","3800",null,"","Orédui Carros Compostage - ZI de la Grave","SUEZ","BA0874","B0300471814"]
["24/01/18","PEINTURES","",null,"4","Orédui - ZI Bois de Grasse - 06310 Grasse","OREDUI",4084,"131380-0000202"]
["24/01/18","HORS FROIDS","",null,"10","SEAS - 1079 Rte de Grasse - 06270 Villeneuve Loubet","SEAS","EJ-541-YH","ES0001279385002"]
["24/01/18","FROIDS","",null,"5","SEAS - 1079 Rte de Grasse - 06270 Villeneuve Loubet","SEAS","EJ-541-YH","ES0001279385002"]
["24/01/18","PAM","",null,"2","SEAS - 1079 Rte de Grasse - 06270 Villeneuve Loubet","SEAS","EJ-541-YH","ES0001279385002"]
["24/01/18","ECRANS","",null,"3","SEAS - 1079 Rte de Grasse - 06270 Villeneuve Loubet","SEAS","EJ-541-YH","ES0001279385002"]
["24/01/18","BOIS","2300",null,"","SEAS La Glacière - 1019 Rte de la Grasse","SUEZ","BA0874","B0300471845"]
["24/01/18","GRAVATS SALES","4420",null,"","Véolia Nice Tri - 20 Ch du Saquier","SUEZ","BA0985","B0300472051"]
["24/01/18","GRAVATS PROPRES","5100",null,"","La Gaude K3 Sita Sud - 5211 Rte de St Jeannet","SUEZ","BA0985","B0300471783"]
["24/01/18","GRAVATS PROPRES","8800",null,"","La Gaude K3 Sita Sud - 5211 Rte de St Jeannet","SUEZ","BA0985","B0300473542"]
["24/01/18","GRAVATS PROPRES","9250",null,"","La Gaude K3 Sita Sud - 5211 Rte de St Jeannet","SUEZ","BA0985","B0300473511"]
["24/01/18","GRAVATS PROPRES","8250",null,"","La Gaude K3 Sita Sud - 5211 Rte de St Jeannet","SUEZ","BA0985","B0300473480"]
["24/01/18","DECHETS VERTS","420",null,"","Orédui Carros Compostage - ZI de la Grave","SUEZ","BA0870","B0300476561"]
["24/01/18","TOUT VENANT","1720",null,"","Véolia Nice Tri - Parc d'activité logistique","SUEZ","BA0870","B0300476562"]
["24/01/18","TOUT VENANT","1100",null,"","Véolia Nice Tri - Parc d'activité logistique","SUEZ","BA0870","B0300473579"]
["24/01/18","GRAVATS SALES","5400",null,"","Véolia Nice Tri - 20 Ch du Saquier","SUEZ","BA0985","B0300473740"]
["24/01/18","AEROSOLS","",null,"1","Orédui - ZI Bois de Grasse - 06310 Grasse","OREDUI",null,"131380-0000202"]
["24/01/18","PRODUITS NON IDENTIFIES","",null,"1","Orédui - ZI Bois de Grasse - 06310 Grasse","OREDUI",null,"131380-0000202"]
["25/01/18","DECHETS VERTS","860",null,"","Orédui Carros Compostage - ZI de la Grave","SUEZ","BA0874","B0300471820"]
["25/01/18","METAUX","",null,"","PURFER - ZI Carros 15ème Rue - 06517 Carros","DERICHEBOURG","BF837EE","2243"]
["25/01/18","TOUT VENANT","3460",null,"","Véolia Nice Tri - Parc d'activité logistique","SUEZ","CY860PA","0566"]
["25/01/18","TOUT VENANT","2300",null,"","Véolia Nice Tri - Parc d'activité logistique","SUEZ","CY860PA","0565"]
["25/01/18","BOIS","1860",null,"","SEAS La Glacière - 1019 Rte de la Grasse","SUEZ","BA0874","B0300471851"]
["25/01/18","GRAVATS PROPRES","9150",null,"","La Gaude K3 Sita Sud - 5211 Rte de St Jeannet","SUEZ","BA0984","B0300471789"]
["25/01/18","TOUT VENANT","2980",null,"","Véolia Nice Tri - Parc d'activité logistique","SUEZ","BA0874","B0300472389"]
["25/01/18","GRAVATS PROPRES","4600",null,"",{"$f":"IF(B68=\"TOUT VENANT\",\"Véolia Nice Tri - Parc d'activité logistique\",IF(B68=\"DECHETS VERTS\",\"Orédui Carros Compostage - ZI de la Grave\",IF(B68=\"GRAVATS PROPRES\",\"La Gaude K3 Sita Sud - 5211 Rte de St Jeannet\",IF(B68=\"GRAVATS SALES\",\"Véolia Nice Tri - 20 Ch du Saquier\",IF(B68=\"BOIS\",\"SEAS La Glacière - 1019 Rte de la Grasse\",IF(B68=\"METAUX\",\"PURFER - ZI Carros 15ème Rue - 06517 Carros\",IF(B68=\"BATTERIES\",\"PURFER - ZI Carros 15ème Rue - 06517 Carros\",IF(B68=\"NEON\",\"Sofovar - 126 Av Louis Lépine - 83600 Fréjus\",IF(B68=\"PEINTURES\",\"Orédui - ZI Bois de Grasse - 06310 Grasse\",IF(B68=\"PRODUITS NON IDENTIFIES\",\"Orédui - ZI Bois de Grasse - 06310 Grasse\",IF(B68=\"AEROSOLS\",\"Orédui - ZI Bois de Grasse - 06310 Grasse\",IF(B68=\"FROIDS\",\"SEAS - 1079 Rte de Grasse - 06270 Villeneuve Loubet\",IF(B68=\"HORS FROIDS\",\"SEAS - 1079 Rte de Grasse - 06270 Villeneuve Loubet\",IF(B68=\"PAM\",\"SEAS - 1079 Rte de Grasse - 06270 Villeneuve Loubet\",IF(B68=\"ECRANS\",\"SEAS - 1079 Rte de Grasse - 06270 Villeneuve Loubet\",IF(B68=\"BOX HORS FROIDS\",\"SEAS - 1079 Rte de Grasse - 06270 Villeneuve Loubet\",IF(B68=\"PILES\",\"Corepile\",IF(B68=\"CUMULUS\",\"SEAS - 1079 Rte de Grasse - 06270 Villeneuve Loubet\",IF(B68=\"PNEUS\",\"TFM Pneus - 117 Ch Clausonnes - 06560 Valbonne\",IF(B68=\"HUILES VEGETALES\",\"Orédui - ZI Bois de Grasse - 06310 Grasse\",IF(B68=\"HUILES DE VIDANGE\",\"SERAHU - 68 Ch de la Campanette - 06800 Cagnes sur Mer\")))))))))))))))))))))","v":"La Gaude K3 Sita Sud - 5211 Rte de St Jeannet"},{"$f":"IF(OR(B68=\"TOUT VENANT\",B68=\"DECHETS VERTS\",B68=\"GRAVATS SALES\",B68=\"GRAVATS PROPRES\",B68=\"BOIS\"),\"SUEZ\",IF(OR(B68=\"PNEUS\"),\"TFM\",IF(OR(B68=\"FROIDS\",B68=\"HORS FROIDS\",B68=\"BOX HORS FROIDS\",B68=\"CUMULUS\",B68=\"PAM\",B68=\"ECRANS\"),\"SEAS\",IF(OR(B68=\"METAUX\",B68=\"BATTERIES\"),\"DERICHEBOURG\",IF(OR(B68=\"NEON\"),\"SOFOVAR\",IF(OR(B68=\"PEINTURES\",B68=\"PRODUITS NON IDENTIFIES\",B68=\"AEROSOLS\",B68=\"HUILES VEGETALES\"),\"OREDUI\",IF(OR(B68=\"HUILES DE VIDANGE\"),\"SERAHU\")))))))","v":"SUEZ"},"BA0984","B0300473548"]
["25/01/18","GRAVATS PROPRES","6650",null,"","La Gaude K3 Sita Sud - 5211 Rte de St Jeannet","SUEZ","BA0984","B0300473486"]
["25/01/18","TOUT VENANT","2080",null,"","Véolia Nice Tri - Parc d'activité logistique","SUEZ","BA0874","B0300472358"]
["25/01/18","GRAVATS SALES","1280",null,"","Véolia Nice Tri - 20 Ch du Saquier","SUEZ","BA0984","B0300472057"]
["25/01/18","DECHETS VERTS","740",null,"","Orédui Carros Compostage - ZI de la Grave","SUEZ","BA0984","B0300473517"]
["25/01/18","TOUT VENANT","",null,"","Véolia Nice Tri - Parc d'activité logistique","SUEZ","CV108JH","0523"]
["24/01/18","TOUT VENANT","",null,"","Véolia Nice Tri - Parc d'activité logistique","SUEZ","CV108JH","0519"]
["23/01/18","TOUT VENANT","",null,"","Véolia Nice Tri - Parc d'activité logistique","SUEZ","CY860PA","0561"]
["23/01/18","TOUT VENANT","",null,"","Véolia Nice Tri - Parc d'activité logistique","SUEZ","CY860PA","0559"]
["24/01/18","TOUT VENANT","",null,"","Véolia Nice Tri - Parc d'activité logistique","SUEZ","CY860PA","0564"]
["24/01/18","TOUT VENANT","",null,"","Véolia Nice Tri - Parc d'activité logistique","SUEZ","CY860PA","0563"]
["24/01/18","TOUT VENANT","",null,"","Véolia Nice Tri - Parc d'activité logistique","SUEZ","CY860PA","0562"]
["25/01/18","TOUT VENANT","",null,"","Véolia Nice Tri - Parc d'activité logistique","SUEZ","CY860PA","0567"]
["25/01/18","BOIS","3400",null,"","SEAS La Glacière - 1019 Rte de la Grasse","SUEZ","BA0874","B0300472019"]
["25/01/18","BOIS","2900",null,"","SEAS La Glacière - 1019 Rte de la Grasse","SUEZ","BA0874","B0300471889"]
["25/01/18","TOUT VENANT","2000",null,"","Véolia Nice Tri - Parc d'activité logistique","SUEZ","BA0872","B0300476605"]
["25/01/18","TOUT VENANT","2340",null,"","Véolia Nice Tri - Parc d'activité logistique","SUEZ","BA0872","B0300476607"]
["25/01/18","TOUT VENANT","2580",null,"","Véolia Nice Tri - Parc d'activité logistique","SUEZ","BA0872","B0300476604"]
["25/01/18","TOUT VENANT","1460",null,"","Véolia Nice Tri - Parc d'activité logistique","SUEZ","BA0872","B0300472485"]
["25/01/18","GRAVATS SALES",2160,null,"","Véolia Nice Tri - 20 Ch du Saquier","SUEZ","BA0984","B0300473746"]
["26/01/18","TOUT VENANT","1800",null,"","Véolia Nice Tri - Parc d'activité logistique","SUEZ","BA0869","B0300472492"]
["26/01/18","DECHETS VERTS","2960",null,"","Orédui Carros Compostage - ZI de la Grave","SUEZ","BA0869","B0300473592"]
["26/01/18","GRAVATS PROPRES","8850",null,"","La Gaude K3 Sita Sud - 5211 Rte de St Jeannet","SUEZ","BAL085","B0300473493"]
["26/01/18","BOIS","3760",null,"","SEAS La Glacière - 1019 Rte de la Grasse","SUEZ","BA0874","B0300471858"]
["26/01/18","TOUT VENANT","2980",null,"","Véolia Nice Tri - Parc d'activité logistique","SUEZ","CY860PA","0568"]
["26/01/18","PEINTURES","",null,"5","Orédui - ZI Bois de Grasse - 06310 Grasse","OREDUI",4084,"131475-0000202"]
["26/01/18","DECHETS VERTS","2180",null,"","Orédui Carros Compostage - ZI de la Grave","SUEZ","BA0874","B0300471827"]
["26/01/18","GRAVATS SALES","3220",null,"","Véolia Nice Tri - 20 Ch du Saquier","SUEZ","BAL085","B0300472064"]
["26/01/18","TOUT VENANT","2080",null,"","Véolia Nice Tri - Parc d'activité logistique","SUEZ","BA0869","B0300476662"]
["26/01/18","TOUT VENANT","1480",null,"","Véolia Nice Tri - Parc d'activité logistique","SUEZ","BA0874","B0300472396"]
["26/01/18","TOUT VENANT","",null,"","Véolia Nice Tri - Parc d'activité logistique","SUEZ","BF837EE","2248"]
["26/01/18","TOUT VENANT","2820",null,"","Véolia Nice Tri - Parc d'activité logistique","SUEZ","CY860PA","0569"]
["26/01/18","TOUT VENANT","",null,"","Véolia Nice Tri - Parc d'activité logistique","SUEZ","CV108JH","0527"]
["26/01/18","TOUT VENANT","2720",null,"","Véolia Nice Tri - Parc d'activité logistique","SUEZ","BA0869","B0300476663"]
["26/01/18","TOUT VENANT","1140",null,"","Véolia Nice Tri - Parc d'activité logistique","SUEZ","BA0869","B0300476664"]
["26/01/18","TOUT VENANT","",null,"","Véolia Nice Tri - Parc d'activité logistique","SUEZ","CY860PA","0570"]
["26/01/18","BOIS","1540",null,"","SEAS La Glacière - 1019 Rte de la Grasse","SUEZ","BA0874","B0300471896"]
["26/01/18","BOIS","1800",null,"","SEAS La Glacière - 1019 Rte de la Grasse","SUEZ","BA0869","B0300476665"]
["26/01/18","FROIDS","",null,"17","SEAS - 1079 Rte de Grasse - 06270 Villeneuve Loubet","SEAS","DG948QC","1281316"]
["26/01/18","PAM","",null,"6","SEAS - 1079 Rte de Grasse - 06270 Villeneuve Loubet","SEAS","DG948QC","1281316"]
["26/01/18","ECRANS","",null,"1","SEAS - 1079 Rte de Grasse - 06270 Villeneuve Loubet","SEAS","DG948QC","1281316"]
["26/01/18","HORS FROIDS","",null,"22","SEAS - 1079 Rte de Grasse - 06270 Villeneuve Loubet","SEAS","DG948QC","1281316"]
["26/01/18","BOIS","2880",null,"","SEAS La Glacière - 1019 Rte de la Grasse","SUEZ","BA0874","B0300472026"]
["26/01/18","GRAVATS PROPRES","11650",null,"","La Gaude K3 Sita Sud - 5211 Rte de St Jeannet","SUEZ","BAL085","B0300471796"]
["26/01/18","GRAVATS PROPRES","8600",null,"","La Gaude K3 Sita Sud - 5211 Rte de St Jeannet","SUEZ","BAL085","B0300473555"]
["27/01/18","GRAVATS PROPRES","7640",null,"","La Gaude K3 Sita Sud - 5211 Rte de St Jeannet","SUEZ","BAL085","B0300472695"]
["27/01/18","DECHETS VERTS","1600",null,"","Orédui Carros Compostage - ZI de la Grave","SUEZ","BA0870","B0300472212"]
["27/01/18","DECHETS VERTS","2800",null,"","Orédui Carros Compostage - ZI de la Grave","SUEZ","BA0870","B0300472205"]
["27/01/18","GRAVATS SALES","6420",null,"","Véolia Nice Tri - 20 Ch du Saquier","SUEZ","BAL085","B0300473760"]
["27/01/18","METAUX","",null,"","PURFER - ZI Carros 15ème Rue - 06517 Carros","DERICHEBOURG","CY860PA","0571"]
["27/01/18","GRAVATS PROPRES","6420",null,"","La Gaude K3 Sita Sud - 5211 Rte de St Jeannet","SUEZ","B0300476608","B0300472709"]
["27/01/18","GRAVATS PROPRES","8880",null,"","La Gaude K3 Sita Sud - 5211 Rte de St Jeannet","SUEZ","BAL085","B0300472702"]
["27/01/18","TOUT VENANT","2600",null,"","Véolia Nice Tri - Parc d'activité logistique","SUEZ","BA0870","B0300472177"]
["25/01/18","TOUT VENANT","1460",null,"","Véolia Nice Tri - Parc d'activité logistique","SUEZ","BA0872","B0300476608"]
["24/01/18","METAUX","",null,"","PURFER - ZI Carros 15ème Rue - 06517 Carros","DERICHEBOURG","BF837EE","2241"]
["27/01/18","TOUT VENANT","1340",null,"","Véolia Nice Tri - Parc d'activité logistique","SUEZ",null,"B0300427170"]
["27/01/18","TOUT VENANT","1220",null,"","Véolia Nice Tri - Parc d'activité logistique","SUEZ","BA0870","B0300471903"]
["27/01/18","TOUT VENANT",1140,null,"","Véolia Nice Tri - Parc d'activité logistique","SUEZ","BA0986","B0300476700"]
["27/01/18","TOUT VENANT",1280,null,"","Véolia Nice Tri - Parc d'activité logistique","SUEZ","BA0986","B0300476699"]
["27/01/18","TOUT VENANT","3320",null,"","Véolia Nice Tri - Parc d'activité logistique","SUEZ","BA0986","B0300472184"]
["27/01/18","TOUT VENANT",1320,null,"","Véolia Nice Tri - Parc d'activité logistique","SUEZ","BA0986","B0300472191"]
["27/01/18","TOUT VENANT",820,null,"","Véolia Nice Tri - Parc d'activité logistique","SUEZ","BA0986","B0300472198"]
["27/01/18","TOUT VENANT",2100,null,"","Véolia Nice Tri - Parc d'activité logistique","SUEZ","BA0986","B0300476698"]
["27/01/18","TOUT VENANT",2470,null,"","Véolia Nice Tri - Parc d'activité logistique","SUEZ","BA0986","B0300476701"]
["27/01/18","BOIS",2380,null,"",{"$f":"IF(B132=\"TOUT VENANT\",\"Véolia Nice Tri - Parc d'activité logistique\",IF(B132=\"DECHETS VERTS\",\"Orédui Carros Compostage - ZI de la Grave\",IF(B132=\"GRAVATS PROPRES\",\"La Gaude K3 Sita Sud - 5211 Rte de St Jeannet\",IF(B132=\"GRAVATS SALES\",\"Véolia Nice Tri - 20 Ch du Saquier\",IF(B132=\"BOIS\",\"SEAS La Glacière - 1019 Rte de la Grasse\",IF(B132=\"METAUX\",\"PURFER - ZI Carros 15ème Rue - 06517 Carros\",IF(B132=\"BATTERIES\",\"PURFER - ZI Carros 15ème Rue - 06517 Carros\",IF(B132=\"NEON\",\"Sofovar - 126 Av Louis Lépine - 83600 Fréjus\",IF(B132=\"PEINTURES\",\"Orédui - ZI Bois de Grasse - 06310 Grasse\",IF(B132=\"PRODUITS NON IDENTIFIES\",\"Orédui - ZI Bois de Grasse - 06310 Grasse\",IF(B132=\"AEROSOLS\",\"Orédui - ZI Bois de Grasse - 06310 Grasse\",IF(B132=\"FROIDS\",\"SEAS - 1079 Rte de Grasse - 06270 Villeneuve Loubet\",IF(B132=\"HORS FROIDS\",\"SEAS - 1079 Rte de Grasse - 06270 Villeneuve Loubet\",IF(B132=\"PAM\",\"SEAS - 1079 Rte de Grasse - 06270 Villeneuve Loubet\",IF(B132=\"ECRANS\",\"SEAS - 1079 Rte de Grasse - 06270 Villeneuve Loubet\",IF(B132=\"BOX HORS FROIDS\",\"SEAS - 1079 Rte de Grasse - 06270 Villeneuve Loubet\",IF(B132=\"PILES\",\"Corepile\",IF(B132=\"CUMULUS\",\"SEAS - 1079 Rte de Grasse - 06270 Villeneuve Loubet\",IF(B132=\"PNEUS\",\"TFM Pneus - 117 Ch Clausonnes - 06560 Valbonne\",IF(B132=\"HUILES VEGETALES\",\"Orédui - ZI Bois de Grasse - 06310 Grasse\",IF(B132=\"HUILES DE VIDANGE\",\"SERAHU - 68 Ch de la Campanette - 06800 Cagnes sur Mer\")))))))))))))))))))))","v":"SEAS La Glacière - 1019 Rte de la Grasse"},{"$f":"IF(OR(B132=\"TOUT VENANT\",B132=\"DECHETS VERTS\",B132=\"GRAVATS SALES\",B132=\"GRAVATS PROPRES\",B132=\"BOIS\"),\"SUEZ\",IF(OR(B132=\"PNEUS\"),\"TFM\",IF(OR(B132=\"FROIDS\",B132=\"HORS FROIDS\",B132=\"BOX HORS FROIDS\",B132=\"CUMULUS\",B132=\"PAM\",B132=\"ECRANS\"),\"SEAS\",IF(OR(B132=\"METAUX\",B132=\"BATTERIES\"),\"DERICHEBOURG\",IF(OR(B132=\"NEON\"),\"SOFOVAR\",IF(OR(B132=\"PEINTURES\",B132=\"PRODUITS NON IDENTIFIES\",B132=\"AEROSOLS\",B132=\"HUILES VEGETALES\"),\"OREDUI\",IF(OR(B132=\"HUILES DE VIDANGE\"),\"SERAHU\")))))))","v":"SUEZ"},"BA0870","B0300471865"]
[null,null,null,null,null,false,false]
[null,null,null,null,null,false,false]
[null,null,null,null,null,false,false]
[null,null,null,null,null,false,false]
[null,null,null,null,null,false,false]
[null,null,null,null,null,false,false]
[null,null,null,null,null,false,false]
[null,null,null,null,null,false,false]
[null,null,null,null,null,false,false]
[null,null,null,null,null,false,false]
[null,null,null,null,null,false,false]
[null,null,null,null,null,false,false]
[null,null,null,null,null,false,false]
[null,null,null,null,null,false,false]
[null,null,null,null,null,false,false]
[null,null,null,null,null,false,false]
[null,null,null,null,null,false,false]
[null,null,null,null,null,false,false]
[null,null,null,null,null,false,false]
[null,null,null,null,null,false,false]
[null,null,null,null,null,false,false]
[null,null,null,null,null,false,false]
[null,null,null,null,null,false,false]
[null,null,null,null,null,false,false]
[null,null,null,null,null,false,false]
[null,null,null,null,null,false,false]
[null,null,null,null,null,false,false]
[null,null,null,null,null,false,false]
[null,null,null,null,null,false,false]
[null,null,null,null,null,false,false]
[null,null,null,null,null,false,false]
[null,null,null,null,null,false,false]
[null,null,null,null,null,false,false]
[null,null,null,null,null,false,false]
[null,null,null,null,null,false,false]
[null,null,null,null,null,false,false]
[null,null,null,null,null,false,false]
[null,null,null,null,null,false,false]
[null,null,null,null,null,false,false]
[null,null,null,null,null,false,false]
[null,null,null,null,null,false,false]
[null,null,null,null,null,false,false]
[null,null,null,null,null,false,false]
[null,null,null,null,null,false,false]
[null,null,null,null,null,false,false]
[null,null,null,null,null,false,false]
[null,null,null,null,null,false,false]
[null,null,null,null,null,false,false]
[null,null,null,null,null,false,false]
[null,null,null,null,null,false,false]
[null,null,null,null,null,false,false]
[null,null,null,null,null,false,false]
[null,null,null,null,null,false,false]
[null,null,null,null,null,false,false]
[null,null,null,null,null,false,false]
[null,null,null,null,null,false,false]
[null,null,null,null,null,false,false]
[null,null,null,null,null,false,false]
[null,null,null,null,null,false,false]
[null,null,null,null,null,false,false]
[null,null,null,null,null,false,false]
[null,null,null,null,null,false,false]
[null,null,null,null,null,false,false]
[null,null,null,null,null,{"$f":"IF(B196=\"TOUT VENANT\",\"Véolia Nice Tri - Parc d'activité logistique\",IF(B196=\"DECHETS VERTS\",\"Orédui Carros Compostage - ZI de la Grave\",IF(B196=\"GRAVATS PROPRES\",\"La Gaude K3 Sita Sud - 5211 Rte de St Jeannet\",IF(B196=\"GRAVATS SALES\",\"Véolia Nice Tri - 20 Ch du Saquier\",IF(B196=\"BOIS\",\"SEAS La Glacière - 1019 Rte de la Grasse\",IF(B196=\"METAUX\",\"PURFER - ZI Carros 15ème Rue - 06517 Carros\",IF(B196=\"BATTERIES\",\"PURFER - ZI Carros 15ème Rue - 06517 Carros\",IF(B196=\"NEON\",\"Sofovar - 126 Av Louis Lépine - 83600 Fréjus\",IF(B196=\"PEINTURES\",\"Orédui - ZI Bois de Grasse - 06310 Grasse\",IF(B196=\"PRODUITS NON IDENTIFIES\",\"Orédui - ZI Bois de Grasse - 06310 Grasse\",IF(B196=\"AEROSOLS\",\"Orédui - ZI Bois de Grasse - 06310 Grasse\",IF(B196=\"FROIDS\",\"SEAS - 1079 Rte de Grasse - 06270 Villeneuve Loubet\",IF(B196=\"HORS FROIDS\",\"SEAS - 1079 Rte de Grasse - 06270 Villeneuve Loubet\",IF(B196=\"PAM\",\"SEAS - 1079 Rte de Grasse - 06270 Villeneuve Loubet\",IF(B196=\"ECRANS\",\"SEAS - 1079 Rte de Grasse - 06270 Villeneuve Loubet\",IF(B196=\"BOX HORS FROIDS\",\"SEAS - 1079 Rte de Grasse - 06270 Villeneuve Loubet\",IF(B196=\"PILES\",\"Corepile\",IF(B196=\"CUMULUS\",\"SEAS - 1079 Rte de Grasse - 06270 Villeneuve Loubet\",IF(B196=\"PNEUS\",\"TFM Pneus - 117 Ch Clausonnes - 06560 Valbonne\",IF(B196=\"HUILES VEGETALES\",\"Orédui - ZI Bois de Grasse - 06310 Grasse\",IF(B196=\"HUILES DE VIDANGE\",\"SERAHU - 68 Ch de la Campanette - 06800 Cagnes sur Mer\")))))))))))))))))))))","v":false},{"$f":"IF(OR(B196=\"TOUT VENANT\",B196=\"DECHETS VERTS\",B196=\"GRAVATS SALES\",B196=\"GRAVATS PROPRES\",B196=\"BOIS\"),\"SUEZ\",IF(OR(B196=\"PNEUS\"),\"TFM\",IF(OR(B196=\"FROIDS\",B196=\"HORS FROIDS\",B196=\"BOX HORS FROIDS\",B196=\"CUMULUS\",B196=\"PAM\",B196=\"ECRANS\"),\"SEAS\",IF(OR(B196=\"METAUX\",B196=\"BATTERIES\"),\"DERICHEBOURG\",IF(OR(B196=\"NEON\"),\"SOFOVAR\",IF(OR(B196=\"PEINTURES\",B196=\"PRODUITS NON IDENTIFIES\",B196=\"AEROSOLS\",B196=\"HUILES VEGETALES\"),\"OREDUI\",IF(OR(B196=\"HUILES DE VIDANGE\"),\"SERAHU\")))))))","v":false}]
[null,null,null,null,null,false,false]
[null,null,null,null,null,false,false]
[null,null,null,null,null,false,false]
[null,null,null,null,null,false,false]
[null,null,null,null,null,false,false]
[null,null,null,null,null,false,false]
[null,null,null,null,null,false,false]
[null,null,null,null,null,false,false]
[null,null,null,null,null,false,false]
[null,null,null,null,null,false,false]
[null,null,null,null,null,false,false]
[null,null,null,null,null,false,false]
[null,null,null,null,null,false,false]
[null,null,null,null,null,false,false]
[null,null,null,null,null,false,false]
[null,null,null,null,null,false,false]
[null,null,null,null,null,false,false]
[null,null,null,null,null,false,false]
[null,null,null,null,null,false,false]
[null,null,null,null,null,false,false]
[null,null,null,null,null,false,false]
[null,null,null,null,null,false,false]
[null,null,null,null,null,false,false]
[null,null,null,null,null,false,false]
[null,null,null,null,null,false,false]
[null,null,null,null,null,false,false]
[null,null,null,null,null,false,false]
[null,null,null,null,null,false,false]
[null,null,null,null,null,false,false]
[null,null,null,null,null,false,false]
[null,null,null,null,null,false,false]
[null,null,null,null,null,false,false]
[null,null,null,null,null,false,false]
[null,null,null,null,null,false,false]
[null,null,null,null,null,false,false]
[null,null,null,null,null,false,false]
[null,null,null,null,null,false,false]
[null,null,null,null,null,false,false]
[null,null,null,null,null,false,false]
[null,null,null,null,null,false,false]
[null,null,null,null,null,false,false]
[null,null,null,null,null,false,false]
[null,null,null,null,null,false,false]
[null,null,null,null,null,false,false]
[null,null,null,null,null,false,false]
[null,null,null,null,null,false,false]
[null,null,null,null,null,false,false]
[null,null,null,null,null,false,false]
[null,null,null,null,null,false,false]
[null,null,null,null,null,false,false]
[null,null,null,null,null,false,false]
[null,null,null,null,null,false,false]
[null,null,null,null,null,false,false]
[null,null,null,null,null,false,false]
[null,null,null,null,null,false,false]
[null,null,null,null,null,false,false]
[null,null,null,null,null,false,false]
[null,null,null,null,null,false,false]
[null,null,null,null,null,false,false]
[null,null,null,null,null,false,false]
[null,null,null,null,null,false,false]
[null,null,null,null,null,false,false]
[null,null,null,null,null,false,false]
[null,null,null,null,null,{"$f":"IF(B260=\"TOUT VENANT\",\"Véolia Nice Tri - Parc d'activité logistique\",IF(B260=\"DECHETS VERTS\",\"Orédui Carros Compostage - ZI de la Grave\",IF(B260=\"GRAVATS PROPRES\",\"La Gaude K3 Sita Sud - 5211 Rte de St Jeannet\",IF(B260=\"GRAVATS SALES\",\"Véolia Nice Tri - 20 Ch du Saquier\",IF(B260=\"BOIS\",\"SEAS La Glacière - 1019 Rte de la Grasse\",IF(B260=\"METAUX\",\"PURFER - ZI Carros 15ème Rue - 06517 Carros\",IF(B260=\"BATTERIES\",\"PURFER - ZI Carros 15ème Rue - 06517 Carros\",IF(B260=\"NEON\",\"Sofovar - 126 Av Louis Lépine - 83600 Fréjus\",IF(B260=\"PEINTURES\",\"Orédui - ZI Bois de Grasse - 06310 Grasse\",IF(B260=\"PRODUITS NON IDENTIFIES\",\"Orédui - ZI Bois de Grasse - 06310 Grasse\",IF(B260=\"AEROSOLS\",\"Orédui - ZI Bois de Grasse - 06310 Grasse\",IF(B260=\"FROIDS\",\"SEAS - 1079 Rte de Grasse - 06270 Villeneuve Loubet\",IF(B260=\"HORS FROIDS\",\"SEAS - 1079 Rte de Grasse - 06270 Villeneuve Loubet\",IF(B260=\"PAM\",\"SEAS - 1079 Rte de Grasse - 06270 Villeneuve Loubet\",IF(B260=\"ECRANS\",\"SEAS - 1079 Rte de Grasse - 06270 Villeneuve Loubet\",IF(B260=\"BOX HORS FROIDS\",\"SEAS - 1079 Rte de Grasse - 06270 Villeneuve Loubet\",IF(B260=\"PILES\",\"Corepile\",IF(B260=\"CUMULUS\",\"SEAS - 1079 Rte de Grasse - 06270 Villeneuve Loubet\",IF(B260=\"PNEUS\",\"TFM Pneus - 117 Ch Clausonnes - 06560 Valbonne\",IF(B260=\"HUILES VEGETALES\",\"Orédui - ZI Bois de Grasse - 06310 Grasse\",IF(B260=\"HUILES DE VIDANGE\",\"SERAHU - 68 Ch de la Campanette - 06800 Cagnes sur Mer\")))))))))))))))))))))","v":false},{"$f":"IF(OR(B260=\"TOUT VENANT\",B260=\"DECHETS VERTS\",B260=\"GRAVATS SALES\",B260=\"GRAVATS PROPRES\",B260=\"BOIS\"),\"SUEZ\",IF(OR(B260=\"PNEUS\"),\"TFM\",IF(OR(B260=\"FROIDS\",B260=\"HORS FROIDS\",B260=\"BOX HORS FROIDS\",B260=\"CUMULUS\",B260=\"PAM\",B260=\"ECRANS\"),\"SEAS\",IF(OR(B260=\"METAUX\",B260=\"BATTERIES\"),\"DERICHEBOURG\",IF(OR(B260=\"NEON\"),\"SOFOVAR\",IF(OR(B260=\"PEINTURES\",B260=\"PRODUITS NON IDENTIFIES\",B260=\"AEROSOLS\",B260=\"HUILES VEGETALES\"),\"OREDUI\",IF(OR(B260=\"HUILES DE VIDANGE\"),\"SERAHU\")))))))","v":false}]
[null,null,null,null,null,false,false]
[null,null,null,null,null,false,false]
[null,null,null,null,null,false,false]
[null,null,null,null,null,false,false]
[null,null,null,null,null,false,false]
[null,null,null,null,null,false,false]
[null,null,null,null,null,false,false]
[null,null,null,null,null,false,false]
[null,null,null,null,null,false,false]
[null,null,null,null,null,false,false]
[null,null,null,null,null,false,false]
[null,null,null,null,null,false,false]
[null,null,null,null,null,false,false]
[null,null,null,null,null,false,false]
[null,null,null,null,null,false,false]
[null,null,null,null,null,false,false]
[null,null,null,null,null,false,false]
[null,null,null,null,null,false,false]
[null,null,null,null,null,false,false]
[null,null,null,null,null,false,false]
[null,null,null,null,null,false,false]
[null,null,null,null,null,false,false]
[null,null,null,null,null,false,false]
[null,null,null,null,null,false,false]
[null,null,null,null,null,false,false]
[null,null,null,null,null,false,false]
[null,null,null,null,null,false,false]
[null,null,null,null,null,false,false]
[null,null,null,null,null,false,false]
[null,null,null,null,null,false,false]
[null,null,null,null,null,false,false]
[null,null,null,null,null,false,false]
[null,null,null,null,null,false,false]
[null,null,null,null,null,false,false]
[null,null,null,null,null,false,false]
[null,null,null,null,null,false,false]
[null,null,null,null,null,false,false]
[null,null,null,null,null,false,false]
[null,null,null,null,null,false,false]
[null,null,null,null,null,false,false]
[null,null,null,null,null,false,false]
[null,null,null,null,null,false,false]
[null,null,null,null,null,false,false]
[null,null,null,null,null,false,false]
[null,null,null,null,null,false,false]
[null,null,null,null,null,false,false]
[null,null,null,null,null,false,false]
[null,null,null,null,null,false,false]
[null,null,null,null,null,false,false]
[null,null,null,null,null,false,false]
[null,null,null,null,null,false,false]
[null,null,null,null,null,false,false]
[null,null,null,null,null,false,false]
[null,null,null,null,null,false,false]
[null,null,null,null,null,false,false]
[null,null,null,null,null,false,false]
[null,null,null,null,null,false,false]
[null,null,null,null,null,false,false]
[null,null,null,null,null,false,false]
[null,null,null,null,null,false,false]
[null,null,null,null,null,false,false]
[null,null,null,null,null,false,false]
[null,null,null,null,null,false,false]
[null,null,null,null,null,{"$f":"IF(B324=\"TOUT VENANT\",\"Véolia Nice Tri - Parc d'activité logistique\",IF(B324=\"DECHETS VERTS\",\"Orédui Carros Compostage - ZI de la Grave\",IF(B324=\"GRAVATS PROPRES\",\"La Gaude K3 Sita Sud - 5211 Rte de St Jeannet\",IF(B324=\"GRAVATS SALES\",\"Véolia Nice Tri - 20 Ch du Saquier\",IF(B324=\"BOIS\",\"SEAS La Glacière - 1019 Rte de la Grasse\",IF(B324=\"METAUX\",\"PURFER - ZI Carros 15ème Rue - 06517 Carros\",IF(B324=\"BATTERIES\",\"PURFER - ZI Carros 15ème Rue - 06517 Carros\",IF(B324=\"NEON\",\"Sofovar - 126 Av Louis Lépine - 83600 Fréjus\",IF(B324=\"PEINTURES\",\"Orédui - ZI Bois de Grasse - 06310 Grasse\",IF(B324=\"PRODUITS NON IDENTIFIES\",\"Orédui - ZI Bois de Grasse - 06310 Grasse\",IF(B324=\"AEROSOLS\",\"Orédui - ZI Bois de Grasse - 06310 Grasse\",IF(B324=\"FROIDS\",\"SEAS - 1079 Rte de Grasse - 06270 Villeneuve Loubet\",IF(B324=\"HORS FROIDS\",\"SEAS - 1079 Rte de Grasse - 06270 Villeneuve Loubet\",IF(B324=\"PAM\",\"SEAS - 1079 Rte de Grasse - 06270 Villeneuve Loubet\",IF(B324=\"ECRANS\",\"SEAS - 1079 Rte de Grasse - 06270 Villeneuve Loubet\",IF(B324=\"BOX HORS FROIDS\",\"SEAS - 1079 Rte de Grasse - 06270 Villeneuve Loubet\",IF(B324=\"PILES\",\"Corepile\",IF(B324=\"CUMULUS\",\"SEAS - 1079 Rte de Grasse - 06270 Villeneuve Loubet\",IF(B324=\"PNEUS\",\"TFM Pneus - 117 Ch Clausonnes - 06560 Valbonne\",IF(B324=\"HUILES VEGETALES\",\"Orédui - ZI Bois de Grasse - 06310 Grasse\",IF(B324=\"HUILES DE VIDANGE\",\"SERAHU - 68 Ch de la Campanette - 06800 Cagnes sur Mer\")))))))))))))))))))))","v":false},{"$f":"IF(OR(B324=\"TOUT VENANT\",B324=\"DECHETS VERTS\",B324=\"GRAVATS SALES\",B324=\"GRAVATS PROPRES\",B324=\"BOIS\"),\"SUEZ\",IF(OR(B324=\"PNEUS\"),\"TFM\",IF(OR(B324=\"FROIDS\",B324=\"HORS FROIDS\",B324=\"BOX HORS FROIDS\",B324=\"CUMULUS\",B324=\"PAM\",B324=\"ECRANS\"),\"SEAS\",IF(OR(B324=\"METAUX\",B324=\"BATTERIES\"),\"DERICHEBOURG\",IF(OR(B324=\"NEON\"),\"SOFOVAR\",IF(OR(B324=\"PEINTURES\",B324=\"PRODUITS NON IDENTIFIES\",B324=\"AEROSOLS\",B324=\"HUILES VEGETALES\"),\"OREDUI\",IF(OR(B324=\"HUILES DE VIDANGE\"),\"SERAHU\")))))))","v":false}]
[null,null,null,null,null,false,false]
[null,null,null,null,null,false,false]
[null,null,null,null,null,false,false]
[null,null,null,null,null,false,false]
[null,null,null,null,null,false,false]
[null,null,null,null,null,false,false]
[null,null,null,null,null,false,false]
[null,null,null,null,null,false,false]
[null,null,null,null,null,false,false]
[null,null,null,null,null,false,false]
[null,null,null,null,null,false,false]
[null,null,null,null,null,false,false]
[null,null,null,null,null,false,false]
[null,null,null,null,null,false,false]
[null,null,null,null,null,false,false]
[null,null,null,null,null,false,false]
[null,null,null,null,null,false,false]
[null,null,null,null,null,false,false]
[null,null,null,null,null,false,false]
[null,null,null,null,null,false,false]
[null,null,null,null,null,false,false]
[null,null,null,null,null,false,false]
[null,null,null,null,null,false,false]
[null,null,null,null,null,false,false]
[null,null,null,null,null,false,false]
[null,null,null,null,null,false,false]
[null,null,null,null,null,false,false]
[null,null,null,null,null,false,false]
[null,null,null,null,null,false,false]
[null,null,null,null,null,false,false]
[null,null,null,null,null,false,false]
[null,null,null,null,null,false,false]
[null,null,null,null,null,false,false]
[null,null,null,null,null,false,false]
[null,null,null,null,null,false,false]
[null,null,null,null,null,false,false]
[null,null,null,null,null,false,false]
[null,null,null,null,null,false,false]
[null,null,null,null,null,false,false]
[null,null,null,null,null,false,false]
[null,null,null,null,null,false,false]
[null,null,null,null,null,false,false]
[null,null,null,null,null,false,false]
[null,null,null,null,null,false,false]
[null,null,null,null,null,false,false]
[null,null,null,null,null,false,false]
[null,null,null,null,null,false,false]
[null,null,null,null,null,false,false]
[null,null,null,null,null,false,false]
[null,null,null,null,null,false,false]
[null,null,null,null,null,false,false]
[null,null,null,null,null,false,false]
[null,null,null,null,null,false,false]
[null,null,null,null,null,false,false]
[null,null,null,null,null,false,false]
[null,null,null,null,null,false,false]
[null,null,null,null,null,false,false]
[null,null,null,null,null,false,false]
[null,null,null,null,null,false,false]
[null,null,null,null,null,false,false]
[null,null,null,null,null,false,false]
[null,null,null,null,null,false,false]
[null,null,null,null,null,false,false]
[null,null,null,null,null,{"$f":"IF(B388=\"TOUT VENANT\",\"Véolia Nice Tri - Parc d'activité logistique\",IF(B388=\"DECHETS VERTS\",\"Orédui Carros Compostage - ZI de la Grave\",IF(B388=\"GRAVATS PROPRES\",\"La Gaude K3 Sita Sud - 5211 Rte de St Jeannet\",IF(B388=\"GRAVATS SALES\",\"Véolia Nice Tri - 20 Ch du Saquier\",IF(B388=\"BOIS\",\"SEAS La Glacière - 1019 Rte de la Grasse\",IF(B388=\"METAUX\",\"PURFER - ZI Carros 15ème Rue - 06517 Carros\",IF(B388=\"BATTERIES\",\"PURFER - ZI Carros 15ème Rue - 06517 Carros\",IF(B388=\"NEON\",\"Sofovar - 126 Av Louis Lépine - 83600 Fréjus\",IF(B388=\"PEINTURES\",\"Orédui - ZI Bois de Grasse - 06310 Grasse\",IF(B388=\"PRODUITS NON IDENTIFIES\",\"Orédui - ZI Bois de Grasse - 06310 Grasse\",IF(B388=\"AEROSOLS\",\"Orédui - ZI Bois de Grasse - 06310 Grasse\",IF(B388=\"FROIDS\",\"SEAS - 1079 Rte de Grasse - 06270 Villeneuve Loubet\",IF(B388=\"HORS FROIDS\",\"SEAS - 1079 Rte de Grasse - 06270 Villeneuve Loubet\",IF(B388=\"PAM\",\"SEAS - 1079 Rte de Grasse - 06270 Villeneuve Loubet\",IF(B388=\"ECRANS\",\"SEAS - 1079 Rte de Grasse - 06270 Villeneuve Loubet\",IF(B388=\"BOX HORS FROIDS\",\"SEAS - 1079 Rte de Grasse - 06270 Villeneuve Loubet\",IF(B388=\"PILES\",\"Corepile\",IF(B388=\"CUMULUS\",\"SEAS - 1079 Rte de Grasse - 06270 Villeneuve Loubet\",IF(B388=\"PNEUS\",\"TFM Pneus - 117 Ch Clausonnes - 06560 Valbonne\",IF(B388=\"HUILES VEGETALES\",\"Orédui - ZI Bois de Grasse - 06310 Grasse\",IF(B388=\"HUILES DE VIDANGE\",\"SERAHU - 68 Ch de la Campanette - 06800 Cagnes sur Mer\")))))))))))))))))))))","v":false},{"$f":"IF(OR(B388=\"TOUT VENANT\",B388=\"DECHETS VERTS\",B388=\"GRAVATS SALES\",B388=\"GRAVATS PROPRES\",B388=\"BOIS\"),\"SUEZ\",IF(OR(B388=\"PNEUS\"),\"TFM\",IF(OR(B388=\"FROIDS\",B388=\"HORS FROIDS\",B388=\"BOX HORS FROIDS\",B388=\"CUMULUS\",B388=\"PAM\",B388=\"ECRANS\"),\"SEAS\",IF(OR(B388=\"METAUX\",B388=\"BATTERIES\"),\"DERICHEBOURG\",IF(OR(B388=\"NEON\"),\"SOFOVAR\",IF(OR(B388=\"PEINTURES\",B388=\"PRODUITS NON IDENTIFIES\",B388=\"AEROSOLS\",B388=\"HUILES VEGETALES\"),\"OREDUI\",IF(OR(B388=\"HUILES DE VIDANGE\"),\"SERAHU\")))))))","v":false}]
[null,null,null,null,null,false,false]
[null,null,null,null,null,false,false]
[null,null,null,null,null,false,false]
[null,null,null,null,null,false,false]
[null,null,null,null,null,false,false]
[null,null,null,null,null,false,false]
[null,null,null,null,null,false,false]
[null,null,null,null,null,false,false]
[null,null,null,null,null,false,false]
[null,null,null,null,null,false,false]
[null,null,null,null,null,false,false]
[null,null,null,null,null,false,false]
[null,null,null,null,null,false,false]
[null,null,null,null,null,false,false]
[null,null,null,null,null,false,false]
[null,null,null,null,null,false,false]
[null,null,null,null,null,false,false]
[null,null,null,null,null,false,false]
[null,null,null,null,null,false,false]
[null,null,null,null,null,false,false]
[null,null,null,null,null,false,false]
[null,null,null,null,null,false,false]
[null,null,null,null,null,false,false]
[null,null,null,null,null,false,false]
[null,null,null,null,null,false,false]
[null,null,null,null,null,false,false]
[null,null,null,null,null,false,false]
[null,null,null,null,null,false,false]
[null,null,null,null,null,false,false]
[null,null,null,null,null,false,false]
[null,null,null,null,null,false,false]
[null,null,null,null,null,false,false]
[null,null,null,null,null,false,false]
[null,null,null,null,null,false,false]
[null,null,null,null,null,false,false]
[null,null,null,null,null,false,false]
[null,null,null,null,null,false,false]
[null,null,null,null,null,false,false]
[null,null,null,null,null,false,false]
[null,null,null,null,null,false,false]
[null,null,null,null,null,false,false]
[null,null,null,null,null,false,false]
[null,null,null,null,null,false,false]
[null,null,null,null,null,false,false]
[null,null,null,null,null,false,false]
[null,null,null,null,null,false,false]
[null,null,null,null,null,false,false]
[null,null,null,null,null,false,false]
[null,null,null,null,null,false,false]
[null,null,null,null,null,false,false]
[null,null,null,null,null,false,false]
[null,null,null,null,null,false,false]
[null,null,null,null,null,false,false]
[null,null,null,null,null,false,false]
[null,null,null,null,null,false,false]
[null,null,null,null,null,false,false]
[null,null,null,null,null,false,false]
[null,null,null,null,null,false,false]
[null,null,null,null,null,false,false]
[null,null,null,null,null,false,false]
[null,null,null,null,null,false,false]
[null,null,null,null,null,false,false]
[null,null,null,null,null,false,false]
[null,null,null,null,null,{"$f":"IF(B452=\"TOUT VENANT\",\"Véolia Nice Tri - Parc d'activité logistique\",IF(B452=\"DECHETS VERTS\",\"Orédui Carros Compostage - ZI de la Grave\",IF(B452=\"GRAVATS PROPRES\",\"La Gaude K3 Sita Sud - 5211 Rte de St Jeannet\",IF(B452=\"GRAVATS SALES\",\"Véolia Nice Tri - 20 Ch du Saquier\",IF(B452=\"BOIS\",\"SEAS La Glacière - 1019 Rte de la Grasse\",IF(B452=\"METAUX\",\"PURFER - ZI Carros 15ème Rue - 06517 Carros\",IF(B452=\"BATTERIES\",\"PURFER - ZI Carros 15ème Rue - 06517 Carros\",IF(B452=\"NEON\",\"Sofovar - 126 Av Louis Lépine - 83600 Fréjus\",IF(B452=\"PEINTURES\",\"Orédui - ZI Bois de Grasse - 06310 Grasse\",IF(B452=\"PRODUITS NON IDENTIFIES\",\"Orédui - ZI Bois de Grasse - 06310 Grasse\",IF(B452=\"AEROSOLS\",\"Orédui - ZI Bois de Grasse - 06310 Grasse\",IF(B452=\"FROIDS\",\"SEAS - 1079 Rte de Grasse - 06270 Villeneuve Loubet\",IF(B452=\"HORS FROIDS\",\"SEAS - 1079 Rte de Grasse - 06270 Villeneuve Loubet\",IF(B452=\"PAM\",\"SEAS - 1079 Rte de Grasse - 06270 Villeneuve Loubet\",IF(B452=\"ECRANS\",\"SEAS - 1079 Rte de Grasse - 06270 Villeneuve Loubet\",IF(B452=\"BOX HORS FROIDS\",\"SEAS - 1079 Rte de Grasse - 06270 Villeneuve Loubet\",IF(B452=\"PILES\",\"Corepile\",IF(B452=\"CUMULUS\",\"SEAS - 1079 Rte de Grasse - 06270 Villeneuve Loubet\",IF(B452=\"PNEUS\",\"TFM Pneus - 117 Ch Clausonnes - 06560 Valbonne\",IF(B452=\"HUILES VEGETALES\",\"Orédui - ZI Bois de Grasse - 06310 Grasse\",IF(B452=\"HUILES DE VIDANGE\",\"SERAHU - 68 Ch de la Campanette - 06800 Cagnes sur Mer\")))))))))))))))))))))","v":false},{"$f":"IF(OR(B452=\"TOUT VENANT\",B452=\"DECHETS VERTS\",B452=\"GRAVATS SALES\",B452=\"GRAVATS PROPRES\",B452=\"BOIS\"),\"SUEZ\",IF(OR(B452=\"PNEUS\"),\"TFM\",IF(OR(B452=\"FROIDS\",B452=\"HORS FROIDS\",B452=\"BOX HORS FROIDS\",B452=\"CUMULUS\",B452=\"PAM\",B452=\"ECRANS\"),\"SEAS\",IF(OR(B452=\"METAUX\",B452=\"BATTERIES\"),\"DERICHEBOURG\",IF(OR(B452=\"NEON\"),\"SOFOVAR\",IF(OR(B452=\"PEINTURES\",B452=\"PRODUITS NON IDENTIFIES\",B452=\"AEROSOLS\",B452=\"HUILES VEGETALES\"),\"OREDUI\",IF(OR(B452=\"HUILES DE VIDANGE\"),\"SERAHU\")))))))","v":false}]
[null,null,null,null,null,false,false]
[null,null,null,null,null,false,false]
[null,null,null,null,null,false,false]
[null,null,null,null,null,false,false]
[null,null,null,null,null,false,false]
[null,null,null,null,null,false,false]
[null,null,null,null,null,false,false]
[null,null,null,null,null,false,false]
[null,null,null,null,null,false,false]
[null,null,null,null,null,false,false]
[null,null,null,null,null,false,false]
[null,null,null,null,null,false,false]
[null,null,null,null,null,false,false]
[null,null,null,null,null,false,false]
[null,null,null,null,null,false,false]
[null,null,null,null,null,false,false]
[null,null,null,null,null,false,false]
[null,null,null,null,null,false,false]
[null,null,null,null,null,false,false]
[null,null,null,null,null,false,false]
[null,null,null,null,null,false,false]
[null,null,null,null,null,false,false]
[null,null,null,null,null,false,false]
[null,null,null,null,null,false,false]
[null,null,null,null,null,false,false]
[null,null,null,null,null,false,false]
[null,null,null,null,null,false,false]
[null,null,null,null,null,false,false]
[null,null,null,null,null,false,false]
[null,null,null,null,null,false,false]
[null,null,null,null,null,false,false]
[null,null,null,null,null,false,false]
[null,null,null,null,null,false,false]
[null,null,null,null,null,false,false]
[null,null,null,null,null,false,false]
[null,null,null,null,null,false,false]
[null,null,null,null,null,false,false]
[null,null,null,null,null,false,false]
[null,null,null,null,null,false,false]
[null,null,null,null,null,false,false]
[null,null,null,null,null,false,false]
[null,null,null,null,null,false,false]
[null,null,null,null,null,false,false]
[null,null,null,null,null,false,false]
[null,null,null,null,null,false,false]
[null,null,null,null,null,false,false]
[null,null,null,null,null,false,false]
[null,null,null,null,null,false,false]
[null,null,null,null,null,false,false]
[null,null,null,null,null,false,false]
[null,null,null,null,null,false,false]
[null,null,null,null,null,false,false]
[null,null,null,null,null,false,false]
[null,null,null,null,null,false,false]
[null,null,null,null,null,false,false]
[null,null,null,null,null,false,false]
[null,null,null,null,null,false,false]
[null,null,null,null,null,false,false]
[null,null,null,null,null,false,false]
[null,null,null,null,null,false,false]
[null,null,null,null,null,false,false]
[null,null,null,null,null,false,false]
[null,null,null,null,null,false,false]
[null,null,null,null,null,{"$f":"IF(B516=\"TOUT VENANT\",\"Véolia Nice Tri - Parc d'activité logistique\",IF(B516=\"DECHETS VERTS\",\"Orédui Carros Compostage - ZI de la Grave\",IF(B516=\"GRAVATS PROPRES\",\"La Gaude K3 Sita Sud - 5211 Rte de St Jeannet\",IF(B516=\"GRAVATS SALES\",\"Véolia Nice Tri - 20 Ch du Saquier\",IF(B516=\"BOIS\",\"SEAS La Glacière - 1019 Rte de la Grasse\",IF(B516=\"METAUX\",\"PURFER - ZI Carros 15ème Rue - 06517 Carros\",IF(B516=\"BATTERIES\",\"PURFER - ZI Carros 15ème Rue - 06517 Carros\",IF(B516=\"NEON\",\"Sofovar - 126 Av Louis Lépine - 83600 Fréjus\",IF(B516=\"PEINTURES\",\"Orédui - ZI Bois de Grasse - 06310 Grasse\",IF(B516=\"PRODUITS NON IDENTIFIES\",\"Orédui - ZI Bois de Grasse - 06310 Grasse\",IF(B516=\"AEROSOLS\",\"Orédui - ZI Bois de Grasse - 06310 Grasse\",IF(B516=\"FROIDS\",\"SEAS - 1079 Rte de Grasse - 06270 Villeneuve Loubet\",IF(B516=\"HORS FROIDS\",\"SEAS - 1079 Rte de Grasse - 06270 Villeneuve Loubet\",IF(B516=\"PAM\",\"SEAS - 1079 Rte de Grasse - 06270 Villeneuve Loubet\",IF(B516=\"ECRANS\",\"SEAS - 1079 Rte de Grasse - 06270 Villeneuve Loubet\",IF(B516=\"BOX HORS FROIDS\",\"SEAS - 1079 Rte de Grasse - 06270 Villeneuve Loubet\",IF(B516=\"PILES\",\"Corepile\",IF(B516=\"CUMULUS\",\"SEAS - 1079 Rte de Grasse - 06270 Villeneuve Loubet\",IF(B516=\"PNEUS\",\"TFM Pneus - 117 Ch Clausonnes - 06560 Valbonne\",IF(B516=\"HUILES VEGETALES\",\"Orédui - ZI Bois de Grasse - 06310 Grasse\",IF(B516=\"HUILES DE VIDANGE\",\"SERAHU - 68 Ch de la Campanette - 06800 Cagnes sur Mer\")))))))))))))))))))))","v":false},{"$f":"IF(OR(B516=\"TOUT VENANT\",B516=\"DECHETS VERTS\",B516=\"GRAVATS SALES\",B516=\"GRAVATS PROPRES\",B516=\"BOIS\"),\"SUEZ\",IF(OR(B516=\"PNEUS\"),\"TFM\",IF(OR(B516=\"FROIDS\",B516=\"HORS FROIDS\",B516=\"BOX HORS FROIDS\",B516=\"CUMULUS\",B516=\"PAM\",B516=\"ECRANS\"),\"SEAS\",IF(OR(B516=\"METAUX\",B516=\"BATTERIES\"),\"DERICHEBOURG\",IF(OR(B516=\"NEON\"),\"SOFOVAR\",IF(OR(B516=\"PEINTURES\",B516=\"PRODUITS NON IDENTIFIES\",B516=\"AEROSOLS\",B516=\"HUILES VEGETALES\"),\"OREDUI\",IF(OR(B516=\"HUILES DE VIDANGE\"),\"SERAHU\")))))))","v":false}]
[null,null,null,null,null,false,false]
[null,null,null,null,null,false,false]
[null,null,null,null,null,false,false]
[null,null,null,null,null,false,false]
[null,null,null,null,null,false,false]
[null,null,null,null,null,false,false]
[null,null,null,null,null,false,false]
[null,null,null,null,null,false,false]
[null,null,null,null,null,false,false]
[null,null,null,null,null,false,false]
[null,null,null,null,null,false,false]
[null,null,null,null,null,false,false]
[null,null,null,null,null,false,false]
[null,null,null,null,null,false,false]
[null,null,null,null,null,false,false]
[null,null,null,null,null,false,false]
[null,null,null,null,null,false,false]
[null,null,null,null,null,false,false]
[null,null,null,null,null,false,false]
[null,null,null,null,null,false,false]
[null,null,null,null,null,false,false]
[null,null,null,null,null,false,false]
[null,null,null,null,null,false,false]
[null,null,null,null,null,false,false]
[null,null,null,null,null,false,false]
[null,null,null,null,null,false,false]
[null,null,null,null,null,false,false]
[null,null,null,null,null,false,false]
[null,null,null,null,null,false,false]
[null,null,null,null,null,false,false]
[null,null,null,null,null,false,false]
[null,null,null,null,null,false,false]
[null,null,null,null,null,false,false]
[null,null,null,null,null,false,false]
[null,null,null,null,null,false,false]
[null,null,null,null,null,false,false]
[null,null,null,null,null,false,false]
[null,null,null,null,null,false,false]
[null,null,null,null,null,false,false]
[null,null,null,null,null,false,false]
[null,null,null,null,null,false,false]
[null,null,null,null,null,false,false]
[null,null,null,null,null,false,false]
[null,null,null,null,null,false,false]
[null,null,null,null,null,false,false]
[null,null,null,null,null,false,false]
[null,null,null,null,null,false,false]
[null,null,null,null,null,false,false]
[null,null,null,null,null,false,false]
[null,null,null,null,null,false,false]
[null,null,null,null,null,false,false]
[null,null,null,null,null,false,false]
[null,null,null,null,null,false,false]
[null,null,null,null,null,false,false]
[null,null,null,null,null,false,false]
[null,null,null,null,null,false,false]
[null,null,null,null,null,false,false]
[null,null,null,null,null,false,false]
[null,null,null,null,null,false,false]
[null,null,null,null,null,false,false]
[null,null,null,null,null,false,false]
[null,null,null,null,null,false,false]
[null,null,null,null,null,false,false]
[null,null,null,null,null,{"$f":"IF(B580=\"TOUT VENANT\",\"Véolia Nice Tri - Parc d'activité logistique\",IF(B580=\"DECHETS VERTS\",\"Orédui Carros Compostage - ZI de la Grave\",IF(B580=\"GRAVATS PROPRES\",\"La Gaude K3 Sita Sud - 5211 Rte de St Jeannet\",IF(B580=\"GRAVATS SALES\",\"Véolia Nice Tri - 20 Ch du Saquier\",IF(B580=\"BOIS\",\"SEAS La Glacière - 1019 Rte de la Grasse\",IF(B580=\"METAUX\",\"PURFER - ZI Carros 15ème Rue - 06517 Carros\",IF(B580=\"BATTERIES\",\"PURFER - ZI Carros 15ème Rue - 06517 Carros\",IF(B580=\"NEON\",\"Sofovar - 126 Av Louis Lépine - 83600 Fréjus\",IF(B580=\"PEINTURES\",\"Orédui - ZI Bois de Grasse - 06310 Grasse\",IF(B580=\"PRODUITS NON IDENTIFIES\",\"Orédui - ZI Bois de Grasse - 06310 Grasse\",IF(B580=\"AEROSOLS\",\"Orédui - ZI Bois de Grasse - 06310 Grasse\",IF(B580=\"FROIDS\",\"SEAS - 1079 Rte de Grasse - 06270 Villeneuve Loubet\",IF(B580=\"HORS FROIDS\",\"SEAS - 1079 Rte de Grasse - 06270 Villeneuve Loubet\",IF(B580=\"PAM\",\"SEAS - 1079 Rte de Grasse - 06270 Villeneuve Loubet\",IF(B580=\"ECRANS\",\"SEAS - 1079 Rte de Grasse - 06270 Villeneuve Loubet\",IF(B580=\"BOX HORS FROIDS\",\"SEAS - 1079 Rte de Grasse - 06270 Villeneuve Loubet\",IF(B580=\"PILES\",\"Corepile\",IF(B580=\"CUMULUS\",\"SEAS - 1079 Rte de Grasse - 06270 Villeneuve Loubet\",IF(B580=\"PNEUS\",\"TFM Pneus - 117 Ch Clausonnes - 06560 Valbonne\",IF(B580=\"HUILES VEGETALES\",\"Orédui - ZI Bois de Grasse - 06310 Grasse\",IF(B580=\"HUILES DE VIDANGE\",\"SERAHU - 68 Ch de la Campanette - 06800 Cagnes sur Mer\")))))))))))))))))))))","v":false},{"$f":"IF(OR(B580=\"TOUT VENANT\",B580=\"DECHETS VERTS\",B580=\"GRAVATS SALES\",B580=\"GRAVATS PROPRES\",B580=\"BOIS\"),\"SUEZ\",IF(OR(B580=\"PNEUS\"),\"TFM\",IF(OR(B580=\"FROIDS\",B580=\"HORS FROIDS\",B580=\"BOX HORS FROIDS\",B580=\"CUMULUS\",B580=\"PAM\",B580=\"ECRANS\"),\"SEAS\",IF(OR(B580=\"METAUX\",B580=\"BATTERIES\"),\"DERICHEBOURG\",IF(OR(B580=\"NEON\"),\"SOFOVAR\",IF(OR(B580=\"PEINTURES\",B580=\"PRODUITS NON IDENTIFIES\",B580=\"AEROSOLS\",B580=\"HUILES VEGETALES\"),\"OREDUI\",IF(OR(B580=\"HUILES DE VIDANGE\"),\"SERAHU\")))))))","v":false}]
[null,null,null,null,null,false,false]
[null,null,null,null,null,false,false]
[null,null,null,null,null,false,false]
[null,null,null,null,null,false,false]
[null,null,null,null,null,false,false]
[null,null,null,null,null,false,false]
[null,null,null,null,null,false,false]
[null,null,null,null,null,false,false]
[null,null,null,null,null,false,false]
[null,null,null,null,null,false,false]
[null,null,null,null,null,false,false]
[null,null,null,null,null,false,false]
[null,null,null,null,null,false,false]
[null,null,null,null,null,false,false]
[null,null,null,null,null,false,false]
[null,null,null,null,null,false,false]
[null,null,null,null,null,false,false]
[null,null,null,null,null,false,false]
[null,null,null,null,null,false,false]
[null,null,null,null,null,false,false]
[null,null,null,null,null,false,false]
[null,null,null,null,null,false,false]
[null,null,null,null,null,false,false]
[null,null,null,null,null,false,false]
[null,null,null,null,null,false,false]
[null,null,null,null,null,false,false]
[null,null,null,null,null,false,false]
[null,null,null,null,null,false,false]
[null,null,null,null,null,false,false]
[null,null,null,null,null,false,false]
[null,null,null,null,null,false,false]
[null,null,null,null,null,false,false]
[null,null,null,null,null,false,false]
[null,null,null,null,null,false,false]
[null,null,null,null,null,false,false]
[null,null,null,null,null,false,false]
[null,null,null,null,null,false,false]
[null,null,null,null,null,false,false]
[null,null,null,null,null,false,false]
[null,null,null,null,null,false,false]
[null,null,null,null,null,false,false]
[null,null,null,null,null,false,false]
[null,null,null,null,null,false,false]
[null,null,null,null,null,false,false]
[null,null,null,null,null,false,false]
[null,null,null,null,null,false,false]
[null,null,null,null,null,false,false]
[null,null,null,null,null,false,false]
[null,null,null,null,null,false,false]
[null,null,null,null,null,false,false]
[null,null,null,null,null,false,false]
[null,null,null,null,null,false,false]
[null,null,null,null,null,false,false]
[null,null,null,null,null,false,false]
[null,null,null,null,null,false,false]
[null,null,null,null,null,false,false]
[null,null,null,null,null,false,false]
[null,null,null,null,null,false,false]
[null,null,null,null,null,false,false]
[null,null,null,null,null,false,false]
[null,null,null,null,null,false,false]
[null,null,null,null,null,false,false]
[null,null,null,null,null,false,false]
[null,null,null,null,null,{"$f":"IF(B644=\"TOUT VENANT\",\"Véolia Nice Tri - Parc d'activité logistique\",IF(B644=\"DECHETS VERTS\",\"Orédui Carros Compostage - ZI de la Grave\",IF(B644=\"GRAVATS PROPRES\",\"La Gaude K3 Sita Sud - 5211 Rte de St Jeannet\",IF(B644=\"GRAVATS SALES\",\"Véolia Nice Tri - 20 Ch du Saquier\",IF(B644=\"BOIS\",\"SEAS La Glacière - 1019 Rte de la Grasse\",IF(B644=\"METAUX\",\"PURFER - ZI Carros 15ème Rue - 06517 Carros\",IF(B644=\"BATTERIES\",\"PURFER - ZI Carros 15ème Rue - 06517 Carros\",IF(B644=\"NEON\",\"Sofovar - 126 Av Louis Lépine - 83600 Fréjus\",IF(B644=\"PEINTURES\",\"Orédui - ZI Bois de Grasse - 06310 Grasse\",IF(B644=\"PRODUITS NON IDENTIFIES\",\"Orédui - ZI Bois de Grasse - 06310 Grasse\",IF(B644=\"AEROSOLS\",\"Orédui - ZI Bois de Grasse - 06310 Grasse\",IF(B644=\"FROIDS\",\"SEAS - 1079 Rte de Grasse - 06270 Villeneuve Loubet\",IF(B644=\"HORS FROIDS\",\"SEAS - 1079 Rte de Grasse - 06270 Villeneuve Loubet\",IF(B644=\"PAM\",\"SEAS - 1079 Rte de Grasse - 06270 Villeneuve Loubet\",IF(B644=\"ECRANS\",\"SEAS - 1079 Rte de Grasse - 06270 Villeneuve Loubet\",IF(B644=\"BOX HORS FROIDS\",\"SEAS - 1079 Rte de Grasse - 06270 Villeneuve Loubet\",IF(B644=\"PILES\",\"Corepile\",IF(B644=\"CUMULUS\",\"SEAS - 1079 Rte de Grasse - 06270 Villeneuve Loubet\",IF(B644=\"PNEUS\",\"TFM Pneus - 117 Ch Clausonnes - 06560 Valbonne\",IF(B644=\"HUILES VEGETALES\",\"Orédui - ZI Bois de Grasse - 06310 Grasse\",IF(B644=\"HUILES DE VIDANGE\",\"SERAHU - 68 Ch de la Campanette - 06800 Cagnes sur Mer\")))))))))))))))))))))","v":false},{"$f":"IF(OR(B644=\"TOUT VENANT\",B644=\"DECHETS VERTS\",B644=\"GRAVATS SALES\",B644=\"GRAVATS PROPRES\",B644=\"BOIS\"),\"SUEZ\",IF(OR(B644=\"PNEUS\"),\"TFM\",IF(OR(B644=\"FROIDS\",B644=\"HORS FROIDS\",B644=\"BOX HORS FROIDS\",B644=\"CUMULUS\",B644=\"PAM\",B644=\"ECRANS\"),\"SEAS\",IF(OR(B644=\"METAUX\",B644=\"BATTERIES\"),\"DERICHEBOURG\",IF(OR(B644=\"NEON\"),\"SOFOVAR\",IF(OR(B644=\"PEINTURES\",B644=\"PRODUITS NON IDENTIFIES\",B644=\"AEROSOLS\",B644=\"HUILES VEGETALES\"),\"OREDUI\",IF(OR(B644=\"HUILES DE VIDANGE\"),\"SERAHU\")))))))","v":false}]
[null,null,null,null,null,false,false]
[null,null,null,null,null,false,false]
[null,null,null,null,null,false,false]
[null,null,null,null,null,false,false]
[null,null,null,null,null,false,false]
[null,null,null,null,null,false,false]
[null,null,null,null,null,false,false]
[null,null,null,null,null,false,false]
[null,null,null,null,null,false,false]
[null,null,null,null,null,false,false]
[null,null,null,null,null,false,false]
[null,null,null,null,null,false,false]
[null,null,null,null,null,false,false]
[null,null,null,null,null,false,false]
[null,null,null,null,null,false,false]
[null,null,null,null,null,false,false]
[null,null,null,null,null,false,false]
[null,null,null,null,null,false,false]
[null,null,null,null,null,false,false]
[null,null,null,null,null,false,false]
[null,null,null,null,null,false,false]
[null,null,null,null,null,false,false]
[null,null,null,null,null,false,false]
[null,null,null,null,null,false,false]
[null,null,null,null,null,false,false]
[null,null,null,null,null,false,false]
[null,null,null,null,null,false,false]
[null,null,null,null,null,false,false]
[null,null,null,null,null,false,false]
[null,null,null,null,null,false,false]
[null,null,null,null,null,false,false]
[null,null,null,null,null,false,false]
[null,null,null,null,null,false,false]
[null,null,null,null,null,false,false]
[null,null,null,null,null,false,false]
[null,null,null,null,null,false,false]
[null,null,null,null,null,false,false]
[null,null,null,null,null,false,false]
[null,null,null,null,null,false,false]
[null,null,null,null,null,false,false]
[null,null,null,null,null,false,false]
[null,null,null,null,null,false,false]
[null,null,null,null,null,false,false]
[null,null,null,null,null,false,false]
[null,null,null,null,null,false,false]
[null,null,null,null,null,false,false]
[null,null,null,null,null,false,false]
[null,null,null,null,null,false,false]
[null,null,null,null,null,false,false]
[null,null,null,null,null,false,false]
[null,null,null,null,null,false,false]
[null,null,null,null,null,false,false]
[null,null,null,null,null,false,false]
[null,null,null,null,null,false,false]
[null,null,null,null,null,false,false]
[null,null,null,null,null,false,false]
[null,null,null,null,null,false,false]
[null,null,null,null,null,false,false]
[null,null,null,null,null,false,false]
[null,null,null,null,null,false,false]
[null,null,null,null,null,false,false]
[null,null,null,null,null,false,false]
[null,null,null,null,null,false,false]
[null,null,null,null,null,{"$f":"IF(B708=\"TOUT VENANT\",\"Véolia Nice Tri - Parc d'activité logistique\",IF(B708=\"DECHETS VERTS\",\"Orédui Carros Compostage - ZI de la Grave\",IF(B708=\"GRAVATS PROPRES\",\"La Gaude K3 Sita Sud - 5211 Rte de St Jeannet\",IF(B708=\"GRAVATS SALES\",\"Véolia Nice Tri - 20 Ch du Saquier\",IF(B708=\"BOIS\",\"SEAS La Glacière - 1019 Rte de la Grasse\",IF(B708=\"METAUX\",\"PURFER - ZI Carros 15ème Rue - 06517 Carros\",IF(B708=\"BATTERIES\",\"PURFER - ZI Carros 15ème Rue - 06517 Carros\",IF(B708=\"NEON\",\"Sofovar - 126 Av Louis Lépine - 83600 Fréjus\",IF(B708=\"PEINTURES\",\"Orédui - ZI Bois de Grasse - 06310 Grasse\",IF(B708=\"PRODUITS NON IDENTIFIES\",\"Orédui - ZI Bois de Grasse - 06310 Grasse\",IF(B708=\"AEROSOLS\",\"Orédui - ZI Bois de Grasse - 06310 Grasse\",IF(B708=\"FROIDS\",\"SEAS - 1079 Rte de Grasse - 06270 Villeneuve Loubet\",IF(B708=\"HORS FROIDS\",\"SEAS - 1079 Rte de Grasse - 06270 Villeneuve Loubet\",IF(B708=\"PAM\",\"SEAS - 1079 Rte de Grasse - 06270 Villeneuve Loubet\",IF(B708=\"ECRANS\",\"SEAS - 1079 Rte de Grasse - 06270 Villeneuve Loubet\",IF(B708=\"BOX HORS FROIDS\",\"SEAS - 1079 Rte de Grasse - 06270 Villeneuve Loubet\",IF(B708=\"PILES\",\"Corepile\",IF(B708=\"CUMULUS\",\"SEAS - 1079 Rte de Grasse - 06270 Villeneuve Loubet\",IF(B708=\"PNEUS\",\"TFM Pneus - 117 Ch Clausonnes - 06560 Valbonne\",IF(B708=\"HUILES VEGETALES\",\"Orédui - ZI Bois de Grasse - 06310 Grasse\",IF(B708=\"HUILES DE VIDANGE\",\"SERAHU - 68 Ch de la Campanette - 06800 Cagnes sur Mer\")))))))))))))))))))))","v":false},{"$f":"IF(OR(B708=\"TOUT VENANT\",B708=\"DECHETS VERTS\",B708=\"GRAVATS SALES\",B708=\"GRAVATS PROPRES\",B708=\"BOIS\"),\"SUEZ\",IF(OR(B708=\"PNEUS\"),\"TFM\",IF(OR(B708=\"FROIDS\",B708=\"HORS FROIDS\",B708=\"BOX HORS FROIDS\",B708=\"CUMULUS\",B708=\"PAM\",B708=\"ECRANS\"),\"SEAS\",IF(OR(B708=\"METAUX\",B708=\"BATTERIES\"),\"DERICHEBOURG\",IF(OR(B708=\"NEON\"),\"SOFOVAR\",IF(OR(B708=\"PEINTURES\",B708=\"PRODUITS NON IDENTIFIES\",B708=\"AEROSOLS\",B708=\"HUILES VEGETALES\"),\"OREDUI\",IF(OR(B708=\"HUILES DE VIDANGE\"),\"SERAHU\")))))))","v":false}]
[null,null,null,null,null,false,false]
[null,null,null,null,null,false,false]
[null,null,null,null,null,false,false]
[null,null,null,null,null,false,false]
[null,null,null,null,null,false,false]
[null,null,null,null,null,false,false]
[null,null,null,null,null,false,false]
[null,null,null,null,null,false,false]
[null,null,null,null,null,false,false]
[null,null,null,null,null,false,false]
[null,null,null,null,null,false,false]
[null,null,null,null,null,false,false]
[null,null,null,null,null,false,false]
[null,null,null,null,null,false,false]
[null,null,null,null,null,false,false]
[null,null,null,null,null,false,false]
[null,null,null,null,null,false,false]
[null,null,null,null,null,false,false]
[null,null,null,null,null,false,false]
[null,null,null,null,null,false,false]
[null,null,null,null,null,false,false]
[null,null,null,null,null,false,false]
[null,null,null,null,null,false,false]
[null,null,null,null,null,false,false]
[null,null,null,null,null,false,false]
[null,null,null,null,null,false,false]
[null,null,null,null,null,false,false]
[null,null,null,null,null,false,false]
[null,null,null,null,null,false,false]
[null,null,null,null,null,false,false]
[null,null,null,null,null,false,false]
[null,null,null,null,null,false,false]
[null,null,null,null,null,false,false]
[null,null,null,null,null,false,false]
[null,null,null,null,null,false,false]
[null,null,null,null,null,false,false]
[null,null,null,null,null,false,false]
[null,null,null,null,null,false,false]
[null,null,null,null,null,false,false]
[null,null,null,null,null,false,false]
[null,null,null,null,null,false,false]
[null,null,null,null,null,false,false]
[null,null,null,null,null,false,false]
[null,null,null,null,null,false,false]
[null,null,null,null,null,false,false]
[null,null,null,null,null,false,false]
[null,null,null,null,null,false,false]
[null,null,null,null,null,false,false]
[null,null,null,null,null,false,false]
[null,null,null,null,null,false,false]
[null,null,null,null,null,false,false]
[null,null,null,null,null,false,false]
[null,null,null,null,null,false,false]
[null,null,null,null,null,false,false]
[null,null,null,null,null,false,false]
[null,null,null,null,null,false,false]
[null,null,null,null,null,false,false]
[null,null,null,null,null,false,false]
[null,null,null,null,null,false,false]
[null,null,null,null,null,false,false]
[null,null,null,null,null,false,false]
[null,null,null,null,null,false,false]
[null,null,null,null,null,false,false]
[null,null,null,null,null,{"$f":"IF(B772=\"TOUT VENANT\",\"Véolia Nice Tri - Parc d'activité logistique\",IF(B772=\"DECHETS VERTS\",\"Orédui Carros Compostage - ZI de la Grave\",IF(B772=\"GRAVATS PROPRES\",\"La Gaude K3 Sita Sud - 5211 Rte de St Jeannet\",IF(B772=\"GRAVATS SALES\",\"Véolia Nice Tri - 20 Ch du Saquier\",IF(B772=\"BOIS\",\"SEAS La Glacière - 1019 Rte de la Grasse\",IF(B772=\"METAUX\",\"PURFER - ZI Carros 15ème Rue - 06517 Carros\",IF(B772=\"BATTERIES\",\"PURFER - ZI Carros 15ème Rue - 06517 Carros\",IF(B772=\"NEON\",\"Sofovar - 126 Av Louis Lépine - 83600 Fréjus\",IF(B772=\"PEINTURES\",\"Orédui - ZI Bois de Grasse - 06310 Grasse\",IF(B772=\"PRODUITS NON IDENTIFIES\",\"Orédui - ZI Bois de Grasse - 06310 Grasse\",IF(B772=\"AEROSOLS\",\"Orédui - ZI Bois de Grasse - 06310 Grasse\",IF(B772=\"FROIDS\",\"SEAS - 1079 Rte de Grasse - 06270 Villeneuve Loubet\",IF(B772=\"HORS FROIDS\",\"SEAS - 1079 Rte de Grasse - 06270 Villeneuve Loubet\",IF(B772=\"PAM\",\"SEAS - 1079 Rte de Grasse - 06270 Villeneuve Loubet\",IF(B772=\"ECRANS\",\"SEAS - 1079 Rte de Grasse - 06270 Villeneuve Loubet\",IF(B772=\"BOX HORS FROIDS\",\"SEAS - 1079 Rte de Grasse - 06270 Villeneuve Loubet\",IF(B772=\"PILES\",\"Corepile\",IF(B772=\"CUMULUS\",\"SEAS - 1079 Rte de Grasse - 06270 Villeneuve Loubet\",IF(B772=\"PNEUS\",\"TFM Pneus - 117 Ch Clausonnes - 06560 Valbonne\",IF(B772=\"HUILES VEGETALES\",\"Orédui - ZI Bois de Grasse - 06310 Grasse\",IF(B772=\"HUILES DE VIDANGE\",\"SERAHU - 68 Ch de la Campanette - 06800 Cagnes sur Mer\")))))))))))))))))))))","v":false},{"$f":"IF(OR(B772=\"TOUT VENANT\",B772=\"DECHETS VERTS\",B772=\"GRAVATS SALES\",B772=\"GRAVATS PROPRES\",B772=\"BOIS\"),\"SUEZ\",IF(OR(B772=\"PNEUS\"),\"TFM\",IF(OR(B772=\"FROIDS\",B772=\"HORS FROIDS\",B772=\"BOX HORS FROIDS\",B772=\"CUMULUS\",B772=\"PAM\",B772=\"ECRANS\"),\"SEAS\",IF(OR(B772=\"METAUX\",B772=\"BATTERIES\"),\"DERICHEBOURG\",IF(OR(B772=\"NEON\"),\"SOFOVAR\",IF(OR(B772=\"PEINTURES\",B772=\"PRODUITS NON IDENTIFIES\",B772=\"AEROSOLS\",B772=\"HUILES VEGETALES\"),\"OREDUI\",IF(OR(B772=\"HUILES DE VIDANGE\"),\"SERAHU\")))))))","v":false}]
[null,null,null,null,null,{"$f":"IF(B773=\"TOUT VENANT\",\"Véolia Nice Tri - Parc d'activité logistique\",IF(B773=\"DECHETS VERTS\",\"Orédui Carros Compostage - ZI de la Grave\",IF(B773=\"GRAVATS PROPRES\",\"La Gaude K3 Sita Sud - 5211 Rte de St Jeannet\",IF(B773=\"GRAVATS SALES\",\"Véolia Nice Tri - 20 Ch du Saquier\",IF(B773=\"BOIS\",\"SEAS La Glacière - 1019 Rte de la Grasse\",IF(B773=\"METAUX\",\"PURFER - ZI Carros 15ème Rue - 06517 Carros\",IF(B773=\"BATTERIES\",\"PURFER - ZI Carros 15ème Rue - 06517 Carros\",IF(B773=\"NEON\",\"Sofovar - 126 Av Louis Lépine - 83600 Fréjus\",IF(B773=\"PEINTURES\",\"Orédui - ZI Bois de Grasse - 06310 Grasse\",IF(B773=\"PRODUITS NON IDENTIFIES\",\"Orédui - ZI Bois de Grasse - 06310 Grasse\",IF(B773=\"AEROSOLS\",\"Orédui - ZI Bois de Grasse - 06310 Grasse\",IF(B773=\"FROIDS\",\"SEAS - 1079 Rte de Grasse - 06270 Villeneuve Loubet\",IF(B773=\"HORS FROIDS\",\"SEAS - 1079 Rte de Grasse - 06270 Villeneuve Loubet\",IF(B773=\"PAM\",\"SEAS - 1079 Rte de Grasse - 06270 Villeneuve Loubet\",IF(B773=\"ECRANS\",\"SEAS - 1079 Rte de Grasse - 06270 Villeneuve Loubet\",IF(B773=\"BOX HORS FROIDS\",\"SEAS - 1079 Rte de Grasse - 06270 Villeneuve Loubet\",IF(B773=\"PILES\",\"Corepile\",IF(B773=\"CUMULUS\",\"SEAS - 1079 Rte de Grasse - 06270 Villeneuve Loubet\",IF(B773=\"PNEUS\",\"TFM Pneus - 117 Ch Clausonnes - 06560 Valbonne\",IF(B773=\"HUILES VEGETALES\",\"Orédui - ZI Bois de Grasse - 06310 Grasse\",IF(B773=\"HUILES DE VIDANGE\",\"SERAHU - 68 Ch de la Campanette - 06800 Cagnes sur Mer\")))))))))))))))))))))","v":false},{"$f":"IF(OR(B773=\"TOUT VENANT\",B773=\"DECHETS VERTS\",B773=\"GRAVATS SALES\",B773=\"GRAVATS PROPRES\",B773=\"BOIS\"),\"SUEZ\",IF(OR(B773=\"PNEUS\"),\"TFM\",IF(OR(B773=\"FROIDS\",B773=\"HORS FROIDS\",B773=\"BOX HORS FROIDS\",B773=\"CUMULUS\",B773=\"PAM\",B773=\"ECRANS\"),\"SEAS\",IF(OR(B773=\"METAUX\",B773=\"BATTERIES\"),\"DERICHEBOURG\",IF(OR(B773=\"NEON\"),\"SOFOVAR\",IF(OR(B773=\"PEINTURES\",B773=\"PRODUITS NON IDENTIFIES\",B773=\"AEROSOLS\",B773=\"HUILES VEGETALES\"),\"OREDUI\",IF(OR(B773=\"HUILES DE VIDANGE\"),\"SERAHU\")))))))","v":false}]
[null,null,null,null,null,{"$f":"IF(B774=\"TOUT VENANT\",\"Véolia Nice Tri - Parc d'activité logistique\",IF(B774=\"DECHETS VERTS\",\"Orédui Carros Compostage - ZI de la Grave\",IF(B774=\"GRAVATS PROPRES\",\"La Gaude K3 Sita Sud - 5211 Rte de St Jeannet\",IF(B774=\"GRAVATS SALES\",\"Véolia Nice Tri - 20 Ch du Saquier\",IF(B774=\"BOIS\",\"SEAS La Glacière - 1019 Rte de la Grasse\",IF(B774=\"METAUX\",\"PURFER - ZI Carros 15ème Rue - 06517 Carros\",IF(B774=\"BATTERIES\",\"PURFER - ZI Carros 15ème Rue - 06517 Carros\",IF(B774=\"NEON\",\"Sofovar - 126 Av Louis Lépine - 83600 Fréjus\",IF(B774=\"PEINTURES\",\"Orédui - ZI Bois de Grasse - 06310 Grasse\",IF(B774=\"PRODUITS NON IDENTIFIES\",\"Orédui - ZI Bois de Grasse - 06310 Grasse\",IF(B774=\"AEROSOLS\",\"Orédui - ZI Bois de Grasse - 06310 Grasse\",IF(B774=\"FROIDS\",\"SEAS - 1079 Rte de Grasse - 06270 Villeneuve Loubet\",IF(B774=\"HORS FROIDS\",\"SEAS - 1079 Rte de Grasse - 06270 Villeneuve Loubet\",IF(B774=\"PAM\",\"SEAS - 1079 Rte de Grasse - 06270 Villeneuve Loubet\",IF(B774=\"ECRANS\",\"SEAS - 1079 Rte de Grasse - 06270 Villeneuve Loubet\",IF(B774=\"BOX HORS FROIDS\",\"SEAS - 1079 Rte de Grasse - 06270 Villeneuve Loubet\",IF(B774=\"PILES\",\"Corepile\",IF(B774=\"CUMULUS\",\"SEAS - 1079 Rte de Grasse - 06270 Villeneuve Loubet\",IF(B774=\"PNEUS\",\"TFM Pneus - 117 Ch Clausonnes - 06560 Valbonne\",IF(B774=\"HUILES VEGETALES\",\"Orédui - ZI Bois de Grasse - 06310 Grasse\",IF(B774=\"HUILES DE VIDANGE\",\"SERAHU - 68 Ch de la Campanette - 06800 Cagnes sur Mer\")))))))))))))))))))))","v":false},{"$f":"IF(OR(B774=\"TOUT VENANT\",B774=\"DECHETS VERTS\",B774=\"GRAVATS SALES\",B774=\"GRAVATS PROPRES\",B774=\"BOIS\"),\"SUEZ\",IF(OR(B774=\"PNEUS\"),\"TFM\",IF(OR(B774=\"FROIDS\",B774=\"HORS FROIDS\",B774=\"BOX HORS FROIDS\",B774=\"CUMULUS\",B774=\"PAM\",B774=\"ECRANS\"),\"SEAS\",IF(OR(B774=\"METAUX\",B774=\"BATTERIES\"),\"DERICHEBOURG\",IF(OR(B774=\"NEON\"),\"SOFOVAR\",IF(OR(B774=\"PEINTURES\",B774=\"PRODUITS NON IDENTIFIES\",B774=\"AEROSOLS\",B774=\"HUILES VEGETALES\"),\"OREDUI\",IF(OR(B774=\"HUILES DE VIDANGE\"),\"SERAHU\")))))))","v":false}]
[null,null,null,null,null,{"$f":"IF(B775=\"TOUT VENANT\",\"Véolia Nice Tri - Parc d'activité logistique\",IF(B775=\"DECHETS VERTS\",\"Orédui Carros Compostage - ZI de la Grave\",IF(B775=\"GRAVATS PROPRES\",\"La Gaude K3 Sita Sud - 5211 Rte de St Jeannet\",IF(B775=\"GRAVATS SALES\",\"Véolia Nice Tri - 20 Ch du Saquier\",IF(B775=\"BOIS\",\"SEAS La Glacière - 1019 Rte de la Grasse\",IF(B775=\"METAUX\",\"PURFER - ZI Carros 15ème Rue - 06517 Carros\",IF(B775=\"BATTERIES\",\"PURFER - ZI Carros 15ème Rue - 06517 Carros\",IF(B775=\"NEON\",\"Sofovar - 126 Av Louis Lépine - 83600 Fréjus\",IF(B775=\"PEINTURES\",\"Orédui - ZI Bois de Grasse - 06310 Grasse\",IF(B775=\"PRODUITS NON IDENTIFIES\",\"Orédui - ZI Bois de Grasse - 06310 Grasse\",IF(B775=\"AEROSOLS\",\"Orédui - ZI Bois de Grasse - 06310 Grasse\",IF(B775=\"FROIDS\",\"SEAS - 1079 Rte de Grasse - 06270 Villeneuve Loubet\",IF(B775=\"HORS FROIDS\",\"SEAS - 1079 Rte de Grasse - 06270 Villeneuve Loubet\",IF(B775=\"PAM\",\"SEAS - 1079 Rte de Grasse - 06270 Villeneuve Loubet\",IF(B775=\"ECRANS\",\"SEAS - 1079 Rte de Grasse - 06270 Villeneuve Loubet\",IF(B775=\"BOX HORS FROIDS\",\"SEAS - 1079 Rte de Grasse - 06270 Villeneuve Loubet\",IF(B775=\"PILES\",\"Corepile\",IF(B775=\"CUMULUS\",\"SEAS - 1079 Rte de Grasse - 06270 Villeneuve Loubet\",IF(B775=\"PNEUS\",\"TFM Pneus - 117 Ch Clausonnes - 06560 Valbonne\",IF(B775=\"HUILES VEGETALES\",\"Orédui - ZI Bois de Grasse - 06310 Grasse\",IF(B775=\"HUILES DE VIDANGE\",\"SERAHU - 68 Ch de la Campanette - 06800 Cagnes sur Mer\")))))))))))))))))))))","v":false},{"$f":"IF(OR(B775=\"TOUT VENANT\",B775=\"DECHETS VERTS\",B775=\"GRAVATS SALES\",B775=\"GRAVATS PROPRES\",B775=\"BOIS\"),\"SUEZ\",IF(OR(B775=\"PNEUS\"),\"TFM\",IF(OR(B775=\"FROIDS\",B775=\"HORS FROIDS\",B775=\"BOX HORS FROIDS\",B775=\"CUMULUS\",B775=\"PAM\",B775=\"ECRANS\"),\"SEAS\",IF(OR(B775=\"METAUX\",B775=\"BATTERIES\"),\"DERICHEBOURG\",IF(OR(B775=\"NEON\"),\"SOFOVAR\",IF(OR(B775=\"PEINTURES\",B775=\"PRODUITS NON IDENTIFIES\",B775=\"AEROSOLS\",B775=\"HUILES VEGETALES\"),\"OREDUI\",IF(OR(B775=\"HUILES DE VIDANGE\"),\"SERAHU\")))))))","v":false}]

{"sheet":"Registre_5","index":19,"n_rows":777,"n_cols":15,"rows_kept":777,"cut":false,"hidden":false,"merged":[[773,2,773,3],[774,2,774,3],[775,2,775,3],[776,2,776,3],[767,2,767,3],[768,2,768,3],[769,2,769,3],[770,2,770,3],[771,2,771,3],[772,2,772,3],[761,2,761,3],[762,2,762,3],[763,2,763,3],[764,2,764,3],[765,2,765,3],[766,2,766,3],[755,2,755,3],[756,2,756,3],[757,2,757,3],[758,2,758,3],[759,2,759,3],[760,2,760,3],[749,2,749,3],[750,2,750,3],[751,2,751,3],[752,2,752,3],[753,2,753,3],[754,2,754,3],[743,2,743,3],[744,2,744,3],[745,2,745,3],[746,2,746,3],[747,2,747,3],[748,2,748,3],[737,2,737,3],[738,2,738,3],[739,2,739,3],[740,2,740,3],[741,2,741,3],[742,2,742,3],[731,2,731,3],[732,2,732,3],[733,2,733,3],[734,2,734,3],[735,2,735,3],[736,2,736,3],[725,2,725,3],[726,2,726,3],[727,2,727,3],[728,2,728,3],[729,2,729,3],[730,2,730,3],[719,2,719,3],[720,2,720,3],[721,2,721,3],[722,2,722,3],[723,2,723,3],[724,2,724,3],[713,2,713,3],[714,2,714,3],[715,2,715,3],[716,2,716,3],[717,2,717,3],[718,2,718,3],[707,2,707,3],[708,2,708,3],[709,2,709,3],[710,2,710,3],[711,2,711,3],[712,2,712,3],[701,2,701,3],[702,2,702,3],[703,2,703,3],[704,2,704,3],[705,2,705,3],[706,2,706,3],[695,2,695,3],[696,2,696,3],[697,2,697,3],[698,2,698,3],[699,2,699,3],[700,2,700,3],[689,2,689,3],[690,2,690,3],[691,2,691,3],[692,2,692,3],[693,2,693,3],[694,2,694,3],[683,2,683,3],[684,2,684,3],[685,2,685,3],[686,2,686,3],[687,2,687,3],[688,2,688,3],[677,2,677,3],[678,2,678,3],[679,2,679,3],[680,2,680,3],[681,2,681,3],[682,2,682,3],[671,2,671,3],[672,2,672,3],[673,2,673,3],[674,2,674,3],[675,2,675,3],[676,2,676,3],[665,2,665,3],[666,2,666,3],[667,2,667,3],[668,2,668,3],[669,2,669,3],[670,2,670,3],[659,2,659,3],[660,2,660,3],[661,2,661,3],[662,2,662,3],[663,2,663,3],[664,2,664,3],[653,2,653,3],[654,2,654,3],[655,2,655,3],[656,2,656,3],[657,2,657,3],[658,2,658,3],[647,2,647,3],[648,2,648,3],[649,2,649,3],[650,2,650,3],[651,2,651,3],[652,2,652,3],[641,2,641,3],[642,2,642,3],[643,2,643,3],[644,2,644,3],[645,2,645,3],[646,2,646,3],[635,2,635,3],[636,2,636,3],[637,2,637,3],[638,2,638,3],[639,2,639,3],[640,2,640,3],[629,2,629,3],[630,2,630,3],[631,2,631,3],[632,2,632,3],[633,2,633,3],[634,2,634,3],[623,2,623,3],[624,2,624,3],[625,2,625,3],[626,2,626,3],[627,2,627,3],[628,2,628,3],[617,2,617,3],[618,2,618,3],[619,2,619,3],[620,2,620,3],[621,2,621,3],[622,2,622,3],[611,2,611,3],[612,2,612,3],[613,2,613,3],[614,2,614,3],[615,2,615,3],[616,2,616,3],[605,2,605,3],[606,2,606,3],[607,2,607,3],[608,2,608,3],[609,2,609,3],[610,2,610,3],[599,2,599,3],[600,2,600,3],[601,2,601,3],[602,2,602,3],[603,2,603,3],[604,2,604,3],[593,2,593,3],[594,2,594,3],[595,2,595,3],[596,2,596,3],[597,2,597,3],[598,2,598,3],[587,2,587,3],[588,2,588,3],[589,2,589,3],[590,2,590,3],[591,2,591,3],[592,2,592,3],[581,2,581,3],[582,2,582,3],[583,2,583,3],[584,2,584,3],[585,2,585,3],[586,2,586,3],[575,2,575,3],[576,2,576,3],[577,2,577,3],[578,2,578,3],[579,2,579,3],[580,2,580,3],[569,2,569,3],[570,2,570,3],[571,2,571,3],[572,2,572,3],[573,2,573,3],[574,2,574,3],[563,2,563,3],[564,2,564,3],[565,2,565,3],[566,2,566,3],[567,2,567,3],[568,2,568,3],[557,2,557,3],[558,2,558,3],[559,2,559,3],[560,2,560,3],[561,2,561,3],[562,2,562,3],[551,2,551,3],[552,2,552,3],[553,2,553,3],[554,2,554,3],[555,2,555,3],[556,2,556,3],[545,2,545,3],[546,2,546,3],[547,2,547,3],[548,2,548,3],[549,2,549,3],[550,2,550,3],[539,2,539,3],[540,2,540,3],[541,2,541,3],[542,2,542,3],[543,2,543,3],[544,2,544,3],[533,2,533,3],[534,2,534,3],[535,2,535,3],[536,2,536,3],[537,2,537,3],[538,2,538,3],[527,2,527,3],[528,2,528,3],[529,2,529,3],[530,2,530,3],[531,2,531,3],[532,2,532,3],[521,2,521,3],[522,2,522,3],[523,2,523,3],[524,2,524,3],[525,2,525,3],[526,2,526,3],[515,2,515,3],[516,2,516,3],[517,2,517,3],[518,2,518,3],[519,2,519,3],[520,2,520,3],[509,2,509,3],[510,2,510,3],[511,2,511,3],[512,2,512,3],[513,2,513,3],[514,2,514,3],[503,2,503,3],[504,2,504,3],[505,2,505,3],[506,2,506,3],[507,2,507,3],[508,2,508,3],[497,2,497,3],[498,2,498,3],[499,2,499,3],[500,2,500,3],[501,2,501,3],[502,2,502,3],[491,2,491,3],[492,2,492,3],[493,2,493,3],[494,2,494,3],[495,2,495,3],[496,2,496,3],[485,2,485,3],[486,2,486,3],[487,2,487,3],[488,2,488,3],[489,2,489,3],[490,2,490,3],[479,2,479,3],[480,2,480,3],[481,2,481,3],[482,2,482,3],[483,2,483,3],[484,2,484,3],[473,2,473,3],[474,2,474,3],[475,2,475,3],[476,2,476,3],[477,2,477,3],[478,2,478,3],[467,2,467,3],[468,2,468,3],[469,2,469,3],[470,2,470,3],[471,2,471,3],[472,2,472,3],[461,2,461,3],[462,2,462,3],[463,2,463,3],[464,2,464,3],[465,2,465,3],[466,2,466,3],[455,2,455,3],[456,2,456,3],[457,2,457,3],[458,2,458,3],[459,2,459,3],[460,2,460,3],[449,2,449,3],[450,2,450,3],[451,2,451,3],[452,2,452,3],[453,2,453,3],[454,2,454,3],[443,2,443,3],[444,2,444,3],[445,2,445,3],[446,2,446,3],[447,2,447,3],[448,2,448,3],[437,2,437,3],[438,2,438,3],[439,2,439,3],[440,2,440,3],[441,2,441,3],[442,2,442,3],[431,2,431,3],[432,2,432,3],[433,2,433,3],[434,2,434,3],[435,2,435,3],[436,2,436,3],[425,2,425,3],[426,2,426,3],[427,2,427,3],[428,2,428,3],[429,2,429,3],[430,2,430,3],[419,2,419,3],[420,2,420,3],[421,2,421,3],[422,2,422,3],[423,2,423,3],[424,2,424,3],[413,2,413,3],[414,2,414,3],[415,2,415,3],[416,2,416,3],[417,2,417,3],[418,2,418,3],[407,2,407,3],[408,2,408,3],[409,2,409,3],[410,2,410,3],[411,2,411,3],[412,2,412,3],[401,2,401,3],[402,2,402,3],[403,2,403,3],[404,2,404,3],[405,2,405,3],[406,2,406,3],[395,2,395,3],[396,2,396,3],[397,2,397,3],[398,2,398,3],[399,2,399,3],[400,2,400,3],[389,2,389,3],[390,2,390,3],[391,2,391,3],[392,2,392,3],[393,2,393,3],[394,2,394,3],[383,2,383,3],[384,2,384,3],[385,2,385,3],[386,2,386,3],[387,2,387,3],[388,2,388,3],[377,2,377,3],[378,2,378,3],[379,2,379,3],[380,2,380,3],[381,2,381,3],[382,2,382,3],[371,2,371,3],[372,2,372,3],[373,2,373,3],[374,2,374,3],[375,2,375,3],[376,2,376,3],[365,2,365,3],[366,2,366,3],[367,2,367,3],[368,2,368,3],[369,2,369,3],[370,2,370,3],[359,2,359,3],[360,2,360,3],[361,2,361,3],[362,2,362,3],[363,2,363,3],[364,2,364,3],[353,2,353,3],[354,2,354,3],[355,2,355,3],[356,2,356,3],[357,2,357,3],[358,2,358,3],[347,2,347,3],[348,2,348,3],[349,2,349,3],[350,2,350,3],[351,2,351,3],[352,2,352,3],[341,2,341,3],[342,2,342,3],[343,2,343,3],[344,2,344,3],[345,2,345,3],[346,2,346,3],[335,2,335,3],[336,2,336,3],[337,2,337,3],[338,2,338,3],[339,2,339,3],[340,2,340,3],[329,2,329,3],[330,2,330,3],[331,2,331,3],[332,2,332,3],[333,2,333,3],[334,2,334,3],[323,2,323,3],[324,2,324,3],[325,2,325,3],[326,2,326,3],[327,2,327,3],[328,2,328,3],[317,2,317,3],[318,2,318,3],[319,2,319,3],[320,2,320,3],[321,2,321,3],[322,2,322,3],[311,2,311,3],[312,2,312,3],[313,2,313,3],[314,2,314,3],[315,2,315,3],[316,2,316,3],[305,2,305,3],[306,2,306,3],[307,2,307,3],[308,2,308,3],[309,2,309,3],[310,2,310,3],[299,2,299,3],[300,2,300,3],[301,2,301,3],[302,2,302,3],[303,2,303,3],[304,2,304,3],[293,2,293,3],[294,2,294,3],[295,2,295,3],[296,2,296,3],[297,2,297,3],[298,2,298,3],[287,2,287,3],[288,2,288,3],[289,2,289,3],[290,2,290,3],[291,2,291,3],[292,2,292,3],[281,2,281,3],[282,2,282,3],[283,2,283,3],[284,2,284,3],[285,2,285,3],[286,2,286,3],[275,2,275,3],[276,2,276,3],[277,2,277,3],[278,2,278,3],[279,2,279,3],[280,2,280,3],[269,2,269,3],[270,2,270,3],[271,2,271,3],[272,2,272,3],[273,2,273,3],[274,2,274,3],[263,2,263,3],[264,2,264,3],[265,2,265,3],[266,2,266,3],[267,2,267,3],[268,2,268,3],[257,2,257,3],[258,2,258,3],[259,2,259,3],[260,2,260,3],[261,2,261,3],[262,2,262,3],[251,2,251,3],[252,2,252,3],[253,2,253,3],[254,2,254,3],[255,2,255,3],[256,2,256,3],[245,2,245,3],[246,2,246,3],[247,2,247,3],[248,2,248,3],[249,2,249,3],[250,2,250,3],[239,2,239,3],[240,2,240,3],[241,2,241,3],[242,2,242,3],[243,2,243,3],[244,2,244,3],[233,2,233,3],[234,2,234,3],[235,2,235,3],[236,2,236,3],[237,2,237,3],[238,2,238,3],[227,2,227,3],[228,2,228,3],[229,2,229,3],[230,2,230,3],[231,2,231,3],[232,2,232,3],[221,2,221,3],[222,2,222,3],[223,2,223,3],[224,2,224,3],[225,2,225,3],[226,2,226,3],[215,2,215,3],[216,2,216,3],[217,2,217,3],[218,2,218,3],[219,2,219,3],[220,2,220,3],[209,2,209,3],[210,2,210,3],[211,2,211,3],[212,2,212,3],[213,2,213,3],[214,2,214,3],[203,2,203,3],[204,2,204,3],[205,2,205,3],[206,2,206,3],[207,2,207,3],[208,2,208,3],[197,2,197,3],[198,2,198,3],[199,2,199,3],[200,2,200,3],[201,2,201,3],[202,2,202,3],[191,2,191,3],[192,2,192,3],[193,2,193,3],[194,2,194,3],[195,2,195,3],[196,2,196,3],[185,2,185,3],[186,2,186,3],[187,2,187,3],[188,2,188,3],[189,2,189,3],[190,2,190,3],[179,2,179,3],[180,2,180,3],[181,2,181,3],[182,2,182,3],[183,2,183,3],[184,2,184,3],[173,2,173,3],[174,2,174,3],[175,2,175,3],[176,2,176,3],[177,2,177,3],[178,2,178,3],[167,2,167,3],[168,2,168,3],[169,2,169,3],[170,2,170,3],[171,2,171,3],[172,2,172,3],[161,2,161,3],[162,2,162,3],[163,2,163,3],[164,2,164,3],[165,2,165,3],[166,2,166,3],[155,2,155,3],[156,2,156,3],[157,2,157,3],[158,2,158,3],[159,2,159,3],[160,2,160,3],[149,2,149,3],[150,2,150,3],[151,2,151,3],[152,2,152,3],[153,2,153,3],[154,2,154,3],[143,2,143,3],[144,2,144,3],[145,2,145,3],[146,2,146,3],[147,2,147,3],[148,2,148,3],[137,2,137,3],[138,2,138,3],[139,2,139,3],[140,2,140,3],[141,2,141,3],[142,2,142,3],[131,2,131,3],[132,2,132,3],[133,2,133,3],[134,2,134,3],[135,2,135,3],[136,2,136,3],[125,2,125,3],[126,2,126,3],[127,2,127,3],[128,2,128,3],[129,2,129,3],[130,2,130,3],[119,2,119,3],[120,2,120,3],[121,2,121,3],[122,2,122,3],[123,2,123,3],[124,2,124,3],[113,2,113,3],[114,2,114,3],[115,2,115,3],[116,2,116,3],[117,2,117,3],[118,2,118,3],[107,2,107,3],[108,2,108,3],[109,2,109,3],[110,2,110,3],[111,2,111,3],[112,2,112,3],[101,2,101,3],[102,2,102,3],[103,2,103,3],[104,2,104,3],[105,2,105,3],[106,2,106,3],[95,2,95,3],[96,2,96,3],[97,2,97,3],[98,2,98,3],[99,2,99,3],[100,2,100,3],[89,2,89,3],[90,2,90,3],[91,2,91,3],[92,2,92,3],[93,2,93,3],[94,2,94,3],[83,2,83,3],[84,2,84,3],[85,2,85,3],[86,2,86,3],[87,2,87,3],[88,2,88,3],[77,2,77,3],[78,2,78,3],[79,2,79,3],[80,2,80,3],[81,2,81,3],[82,2,82,3],[71,2,71,3],[72,2,72,3],[73,2,73,3],[74,2,74,3],[75,2,75,3],[76,2,76,3],[65,2,65,3],[66,2,66,3],[67,2,67,3],[68,2,68,3],[69,2,69,3],[70,2,70,3],[59,2,59,3],[60,2,60,3],[61,2,61,3],[62,2,62,3],[63,2,63,3],[64,2,64,3],[53,2,53,3],[54,2,54,3],[55,2,55,3],[56,2,56,3],[57,2,57,3],[58,2,58,3],[47,2,47,3],[48,2,48,3],[49,2,49,3],[50,2,50,3],[51,2,51,3],[52,2,52,3],[41,2,41,3],[42,2,42,3],[43,2,43,3],[44,2,44,3],[45,2,45,3],[46,2,46,3],[35,2,35,3],[36,2,36,3],[37,2,37,3],[38,2,38,3],[39,2,39,3],[40,2,40,3],[29,2,29,3],[30,2,30,3],[31,2,31,3],[32,2,32,3],[33,2,33,3],[34,2,34,3],[24,2,24,3],[25,2,25,3],[26,2,26,3],[27,2,27,3],[27,12,27,13],[28,2,28,3],[19,2,19,3],[19,12,19,13],[20,2,20,3],[21,2,21,3],[22,2,22,3],[23,2,23,3],[13,2,13,3],[14,2,14,3],[15,2,15,3],[16,2,16,3],[17,2,17,3],[18,2,18,3],[5,2,5,3],[8,2,8,3],[9,2,9,3],[10,2,10,3],[11,2,11,3],[12,2,12,3],[0,0,0,1],[1,2,1,3],[2,2,2,3],[3,2,3,3],[4,2,4,3],[6,2,6,3],[7,2,7,3],[0,2,0,9]]}
[null,null,"REGISTRE DECHETS NON DANGEREUX\n(Arrêté du 29 février 2012 fixant le contenu des registres mentionnés aux articles R. 541-43 et R. 541-46 du code de l'environnement )"]
["Date d'enlèvement","Nature du déchets","Quantité de déchets\n (en kg)",null,"Unité","Installation de destination \n(nom et adresse)","Transporteur ","Immatriculation","Fiche d'intervention","Signature"]
["29/01/18","HORS FROIDS","",null,"16",{"$f":"IF(B3=\"TOUT VENANT\",\"Véolia Nice Tri - Parc d'activité logistique\",IF(B3=\"DECHETS VERTS\",\"Orédui Carros Compostage - ZI de la Grave\",IF(B3=\"GRAVATS PROPRES\",\"La Gaude K3 Sita Sud - 5211 Rte de St Jeannet\",IF(B3=\"GRAVATS SALES\",\"Véolia Nice Tri - 20 Ch du Saquier\",IF(B3=\"BOIS\",\"SEAS La Glacière - 1019 Rte de la Grasse\",IF(B3=\"METAUX\",\"PURFER - ZI Carros 15ème Rue - 06517 Carros\",IF(B3=\"BATTERIES\",\"PURFER - ZI Carros 15ème Rue - 06517 Carros\",IF(B3=\"NEON\",\"Sofovar - 126 Av Louis Lépine - 83600 Fréjus\",IF(B3=\"PEINTURES\",\"Orédui - ZI Bois de Grasse - 06310 Grasse\",IF(B3=\"PRODUITS NON IDENTIFIES\",\"Orédui - ZI Bois de Grasse - 06310 Grasse\",IF(B3=\"AEROSOLS\",\"Orédui - ZI Bois de Grasse - 06310 Grasse\",IF(B3=\"FROIDS\",\"SEAS - 1079 Rte de Grasse - 06270 Villeneuve Loubet\",IF(B3=\"HORS FROIDS\",\"SEAS - 1079 Rte de Grasse - 06270 Villeneuve Loubet\",IF(B3=\"PAM\",\"SEAS - 1079 Rte de Grasse - 06270 Villeneuve Loubet\",IF(B3=\"ECRANS\",\"SEAS - 1079 Rte de Grasse - 06270 Villeneuve Loubet\",IF(B3=\"BOX HORS FROIDS\",\"SEAS - 1079 Rte de Grasse - 06270 Villeneuve Loubet\",IF(B3=\"PILES\",\"Corepile\",IF(B3=\"CUMULUS\",\"SEAS - 1079 Rte de Grasse - 06270 Villeneuve Loubet\",IF(B3=\"PNEUS\",\"TFM Pneus - 117 Ch Clausonnes - 06560 Valbonne\",IF(B3=\"HUILES VEGETALES\",\"Orédui - ZI Bois de Grasse - 06310 Grasse\",IF(B3=\"HUILES DE VIDANGE\",\"SERAHU - 68 Ch de la Campanette - 06800 Cagnes sur Mer\")))))))))))))))))))))","v":"SEAS - 1079 Rte de Grasse - 06270 Villeneuve Loubet"},{"$f":"IF(OR(B3=\"TOUT VENANT\",B3=\"DECHETS VERTS\",B3=\"GRAVATS SALES\",B3=\"GRAVATS PROPRES\",B3=\"BOIS\"),\"SUEZ\",IF(OR(B3=\"PNEUS\"),\"TFM\",IF(OR(B3=\"FROIDS\",B3=\"HORS FROIDS\",B3=\"BOX HORS FROIDS\",B3=\"CUMULUS\",B3=\"PAM\",B3=\"ECRANS\"),\"SEAS\",IF(OR(B3=\"METAUX\",B3=\"BATTERIES\"),\"DERICHEBOURG\",IF(OR(B3=\"NEON\"),\"SOFOVAR\",IF(OR(B3=\"PEINTURES\",B3=\"PRODUITS NON IDENTIFIES\",B3=\"AEROSOLS\",B3=\"HUILES VEGETALES\"),\"OREDUI\",IF(OR(B3=\"HUILES DE VIDANGE\"),\"SERAHU\")))))))","v":"SEAS"},null,"ES0001282248001"]
["29/01/18","PAM","",null,"2",{"$f":"IF(B4=\"TOUT VENANT\",\"Véolia Nice Tri - Parc d'activité logistique\",IF(B4=\"DECHETS VERTS\",\"Orédui Carros Compostage - ZI de la Grave\",IF(B4=\"GRAVATS PROPRES\",\"La Gaude K3 Sita Sud - 5211 Rte de St Jeannet\",IF(B4=\"GRAVATS SALES\",\"Véolia Nice Tri - 20 Ch du Saquier\",IF(B4=\"BOIS\",\"SEAS La Glacière - 1019 Rte de la Grasse\",IF(B4=\"METAUX\",\"PURFER - ZI Carros 15ème Rue - 06517 Carros\",IF(B4=\"BATTERIES\",\"PURFER - ZI Carros 15ème Rue - 06517 Carros\",IF(B4=\"NEON\",\"Sofovar - 126 Av Louis Lépine - 83600 Fréjus\",IF(B4=\"PEINTURES\",\"Orédui - ZI Bois de Grasse - 06310 Grasse\",IF(B4=\"PRODUITS NON IDENTIFIES\",\"Orédui - ZI Bois de Grasse - 06310 Grasse\",IF(B4=\"AEROSOLS\",\"Orédui - ZI Bois de Grasse - 06310 Grasse\",IF(B4=\"FROIDS\",\"SEAS - 1079 Rte de Grasse - 06270 Villeneuve Loubet\",IF(B4=\"HORS FROIDS\",\"SEAS - 1079 Rte de Grasse - 06270 Villeneuve Loubet\",IF(B4=\"PAM\",\"SEAS - 1079 Rte de Grasse - 06270 Villeneuve Loubet\",IF(B4=\"ECRANS\",\"SEAS - 1079 Rte de Grasse - 06270 Villeneuve Loubet\",IF(B4=\"BOX HORS FROIDS\",\"SEAS - 1079 Rte de Grasse - 06270 Villeneuve Loubet\",IF(B4=\"PILES\",\"Corepile\",IF(B4=\"CUMULUS\",\"SEAS - 1079 Rte de Grasse - 06270 Villeneuve Loubet\",IF(B4=\"PNEUS\",\"TFM Pneus - 117 Ch Clausonnes - 06560 Valbonne\",IF(B4=\"HUILES VEGETALES\",\"Orédui - ZI Bois de Grasse - 06310 Grasse\",IF(B4=\"HUILES DE VIDANGE\",\"SERAHU - 68 Ch de la Campanette - 06800 Cagnes sur Mer\")))))))))))))))))))))","v":"SEAS - 1079 Rte de Grasse - 06270 Villeneuve Loubet"},{"$f":"IF(OR(B4=\"TOUT VENANT\",B4=\"DECHETS VERTS\",B4=\"GRAVATS SALES\",B4=\"GRAVATS PROPRES\",B4=\"BOIS\"),\"SUEZ\",IF(OR(B4=\"PNEUS\"),\"TFM\",IF(OR(B4=\"FROIDS\",B4=\"HORS FROIDS\",B4=\"BOX HORS FROIDS\",B4=\"CUMULUS\",B4=\"PAM\",B4=\"ECRANS\"),\"SEAS\",IF(OR(B4=\"METAUX\",B4=\"BATTERIES\"),\"DERICHEBOURG\",IF(OR(B4=\"NEON\"),\"SOFOVAR\",IF(OR(B4=\"PEINTURES\",B4=\"PRODUITS NON IDENTIFIES\",B4=\"AEROSOLS\",B4=\"HUILES VEGETALES\"),\"OREDUI\",IF(OR(B4=\"HUILES DE VIDANGE\"),\"SERAHU\")))))))","v":"SEAS"},null,"ES0001282248001"]
["29/01/18","ECRANS","",null,"1","SEAS - 1079 Rte de Grasse - 06270 Villeneuve Loubet","SEAS",null,"ES0001282248001"]
["29/01/18","FROIDS","",null,"10","SEAS - 1079 Rte de Grasse - 06270 Villeneuve Loubet","SEAS",null,"ES0001282248001"]
["2018-01-29","CUMULUS",null,null,3,"SEAS - 1079 Rte de Grasse - 06270 Villeneuve Loubet","SEAS",null,"ES0001282248001"]
["2018-01-29","BOX HORS FROIDS",null,null,1,"SEAS - 1079 Rte de Grasse - 06270 Villeneuve Loubet","SEAS",null,"ES0001282248001"]
["29/01/18","TOUT VENANT","980",null,"","Véolia Nice Tri - Parc d'activité logistique","SUEZ","BA0874","B0300475286"]
["29/01/18","GRAVATS SALES","6120",null,"","Véolia Nice Tri - 20 Ch du Saquier","SUEZ","BA0865","B0300474920"]
["29/01/18","GRAVATS PROPRES","9250",null,"","La Gaude K3 Sita Sud - 5211 Rte de St Jeannet","SUEZ","BA0865","B0300475780"]
["29/01/18","TOUT VENANT",8040,null,"","Véolia Nice Tri - Parc d'activité logistique","SUEZ","CY860PA","2336"]
["29/01/18","DECHETS VERTS","1300",null,"","Orédui Carros Compostage - ZI de la Grave","SUEZ","BA0874","B0300474779"]
["29/01/18","METAUX","",null,"","PURFER - ZI Carros 15ème Rue - 06517 Carros","DERICHEBOURG","BF837EE","0803"]
["29/01/18","GRAVATS PROPRES","4100",null,"","La Gaude K3 Sita Sud - 5211 Rte de St Jeannet","SUEZ","BA0865","B0300475800"]
["29/01/18","GRAVATS PROPRES","3760",null,"","La Gaude K3 Sita Sud - 5211 Rte de St Jeannet","SUEZ","BA0865","B0300474759"]
["29/01/18","TOUT VENANT","1280",null,"","Véolia Nice Tri - Parc d'activité logistique","SUEZ","BA0986","B0300476708"]
["29/01/18","TOUT VENANT","2000",null,"","Véolia Nice Tri - Parc d'activité logistique","SUEZ","BA0986","B0300475361"]
["29/01/18","TOUT VENANT","4360",null,"","Véolia Nice Tri - Parc d'activité logistique","SUEZ","CY860PA","0573"]
["29/01/18","BOIS","3440",null,"","SEAS La Glacière - 1019 Rte de la Grasse","SUEZ","BA0874","B0300474822",null,null,null,"PRESTATIONS JOURNALIERES SUEZ"]
["29/01/18","BOIS","2480",null,"","SEAS La Glacière - 1019 Rte de la Grasse","SUEZ","BA0874","B0300474799",null,null,null,"6 TV ","6 ROTATIONS DE CAMION AMPIROLES"]
["29/01/18","DECHETS VERTS","2140",null,"","Orédui Carros Compostage - ZI de la Grave","SUEZ","BA0874","B0300474845",null,null,null,"6 TV ","3 ROTATIONS DE CAMION GRAPPIN","LUNDI 4 ROTATIONS DE GRAPPIN"]
["29/01/18","TOUT VENANT","",null,"","Véolia Nice Tri - Parc d'activité logistique","SUEZ","CY860PA","0574",null,null,null,"2 GRAVATS SALES","1  MATIN ET 1 APRES MIDI"]
["29/01/18","BOIS","2680",null,"","SEAS La Glacière - 1019 Rte de la Grasse","SUEZ","BA0874","B0300474897",null,null,null,"3 GRAVATS PROPRES","3 ROTATIONS DE CAMION AMPIROLES"]
["30/01/18","GRAVATS SALES","3700",null,"","Véolia Nice Tri - 20 Ch du Saquier","SUEZ","BAL085","B0300474924",null,null,null,"2 DECHETS VERTS","2 ROTATIONS DE CAMION AMPIROLES"]
["30/01/18","GRAVATS PROPRES","9450",null,"","La Gaude K3 Sita Sud - 5211 Rte de St Jeannet","SUEZ","BAL085","B0300475784",null,null,null,"2 BOIS","2 ROTATIONS DE CAMION AMPIROLES"]
["30/01/18","TOUT VENANT","",null,"","Véolia Nice Tri - Parc d'activité logistique","SUEZ","CY860PA","0575",null,null,null,"1 METAUX","1 ROTATION DE CAMION GRAPPIN"]
["30/01/18","HUILES DE VIDANGE","900",null,"","SERAHU - 68 Ch de la Campanette - 06800 Cagnes sur Mer","SERAHU","CN458D","0090221",null,null,null,"Le samedi présence d'un camion minimum jusqu'à 16H"]
["30/01/18","DECHETS VERTS","980",null,"","Orédui Carros Compostage - ZI de la Grave","SUEZ","BA0874","B0300474783"]
["30/01/18","GRAVATS PROPRES","10550",null,"","La Gaude K3 Sita Sud - 5211 Rte de St Jeannet","SUEZ","BAL085","B0300475804"]
["30/01/18","DECHETS VERTS","1460",null,"","Orédui Carros Compostage - ZI de la Grave","SUEZ","BA0874","B0300474849"]
["30/01/18","GRAVATS PROPRES","6000",null,"","La Gaude K3 Sita Sud - 5211 Rte de St Jeannet","SUEZ","BAL085","B0300475824"]
["30/01/18","TOUT VENANT","1760",null,"","Véolia Nice Tri - Parc d'activité logistique","SUEZ","BA0874","B0300475365"]
["30/01/18","GRAVATS PROPRES","5700",null,"","La Gaude K3 Sita Sud - 5211 Rte de St Jeannet","SUEZ","BA0865","B0300474763"]
["30/01/18","BOIS","2180",null,"","SEAS La Glacière - 1019 Rte de la Grasse","SUEZ","BA0874","B0300474803"]
["30/01/18","TOUT VENANT","2640",null,"","Véolia Nice Tri - Parc d'activité logistique","SUEZ","BA0874","B0300475290"]
["30/01/18","BOIS","2640",null,"","SEAS La Glacière - 1019 Rte de la Grasse","SUEZ","BA0874","B0300474826"]
["30/01/18","TOUT VENANT","",null,"","Véolia Nice Tri - Parc d'activité logistique","SUEZ","CY860PA","0578"]
["30/01/18","TOUT VENANT","",null,"","Véolia Nice Tri - Parc d'activité logistique","SUEZ","CY860PA","0577"]
["30/01/18","GRAVATS SALES",5820,null,"","Véolia Nice Tri - 20 Ch du Saquier","SUEZ","BA0865","B0300475952"]
["30/01/18","TOUT VENANT",1440,null,"","Véolia Nice Tri - Parc d'activité logistique","SUEZ","BA0874","B0300474901"]
["30/01/18","TOUT VENANT","",null,"","Véolia Nice Tri - Parc d'activité logistique","SUEZ","CY860PA","2337"]
["30/01/18","METAUX","",null,"","PURFER - ZI Carros 15ème Rue - 06517 Carros","DERICHEBOURG","BF837EE","0808"]
["31/01/18","TOUT VENANT","",null,"","Véolia Nice Tri - Parc d'activité logistique","SUEZ","","0579"]
["31/01/18","DECHETS VERTS","2780",null,"","Orédui Carros Compostage - ZI de la Grave","SUEZ","","B0300474787"]
["31/01/18","GRAVATS SALES","5520",null,"","Véolia Nice Tri - 20 Ch du Saquier","SUEZ","","B0300474928"]
["31/01/18","GRAVATS PROPRES","10750",null,"","La Gaude K3 Sita Sud - 5211 Rte de St Jeannet","SUEZ","","B0300475788"]
["31/01/18","NEON","",null,"1","Sofovar - 126 Av Louis Lépine - 83600 Fréjus","SOFOVAR","","268099E"]
["31/01/18","DECHETS VERTS","3200",null,"","Orédui Carros Compostage - ZI de la Grave","SUEZ","BA0874","B0300474853"]
["31/01/18","GRAVATS PROPRES","8900",null,"","La Gaude K3 Sita Sud - 5211 Rte de St Jeannet","SUEZ","BAL085","B0300475808"]
["31/01/18","TOUT VENANT","",null,"","Véolia Nice Tri - Parc d'activité logistique","SUEZ","CY860PA","0580"]
["31/01/18","HORS FROIDS","",null,"6","SEAS - 1079 Rte de Grasse - 06270 Villeneuve Loubet","SEAS","","ES0001284678001"]
["31/01/18","FROIDS","",null,"6","SEAS - 1079 Rte de Grasse - 06270 Villeneuve Loubet","SEAS","","ES0001284678001"]
["31/01/18","PAM","",null,"2","SEAS - 1079 Rte de Grasse - 06270 Villeneuve Loubet","SEAS","","ES0001284678001"]
["31/01/18","PEINTURES","",null,"4","Orédui - ZI Bois de Grasse - 06310 Grasse","OREDUI","4084","131552-0000202"]
["31/01/18","PRODUITS NON IDENTIFIES","",null,"3","Orédui - ZI Bois de Grasse - 06310 Grasse","OREDUI","4084","131552-0000202"]
["31/01/18","TOUT VENANT","1280",null,"","Véolia Nice Tri - Parc d'activité logistique","SUEZ","BAL086","B0300476953"]
["31/01/18","BOIS","2300",null,"","SEAS La Glacière - 1019 Rte de la Grasse","SUEZ","BAL086","B0300476952"]
["31/01/18","TOUT VENANT","3120",null,"","Véolia Nice Tri - Parc d'activité logistique","SUEZ","BAL086","B0300476954"]
["31/01/18","TOUT VENANT","1580",null,"","Véolia Nice Tri - Parc d'activité logistique","SUEZ","BAL086","B0300475369"]
["31/01/18","TOUT VENANT","2340",null,"","Véolia Nice Tri - Parc d'activité logistique","SUEZ","BAL086","B0300475852"]
["31/01/18","GRAVATS SALES","5380",null,"","Véolia Nice Tri - 20 Ch du Saquier","SUEZ","BAL085","B0300475956"]
["31/01/18","BOIS","2780",null,"","SEAS La Glacière - 1019 Rte de la Grasse","SUEZ","BAO874","B0300474830"]
["31/01/18","BOIS","2580",null,"","SEAS La Glacière - 1019 Rte de la Grasse","SUEZ","BAO874","B0300474807"]
["31/01/18","GRAVATS PROPRES","8400",null,"","La Gaude K3 Sita Sud - 5211 Rte de St Jeannet","SUEZ","BAL085","B0300475828"]
["31/01/18","TOUT VENANT","",null,"","Véolia Nice Tri - Parc d'activité logistique","SUEZ","CY860PA","0582"]
["31/01/18","TOUT VENANT","",null,"","Véolia Nice Tri - Parc d'activité logistique","SUEZ","CY860PA","0581"]
["31/01/18","METAUX","",null,"",{"$f":"IF(B68=\"TOUT VENANT\",\"Véolia Nice Tri - Parc d'activité logistique\",IF(B68=\"DECHETS VERTS\",\"Orédui Carros Compostage - ZI de la Grave\",IF(B68=\"GRAVATS PROPRES\",\"La Gaude K3 Sita Sud - 5211 Rte de St Jeannet\",IF(B68=\"GRAVATS SALES\",\"Véolia Nice Tri - 20 Ch du Saquier\",IF(B68=\"BOIS\",\"SEAS La Glacière - 1019 Rte de la Grasse\",IF(B68=\"METAUX\",\"PURFER - ZI Carros 15ème Rue - 06517 Carros\",IF(B68=\"BATTERIES\",\"PURFER - ZI Carros 15ème Rue - 06517 Carros\",IF(B68=\"NEON\",\"Sofovar - 126 Av Louis Lépine - 83600 Fréjus\",IF(B68=\"PEINTURES\",\"Orédui - ZI Bois de Grasse - 06310 Grasse\",IF(B68=\"PRODUITS NON IDENTIFIES\",\"Orédui - ZI Bois de Grasse - 06310 Grasse\",IF(B68=\"AEROSOLS\",\"Orédui - ZI Bois de Grasse - 06310 Grasse\",IF(B68=\"FROIDS\",\"SEAS - 1079 Rte de Grasse - 06270 Villeneuve Loubet\",IF(B68=\"HORS FROIDS\",\"SEAS - 1079 Rte de Grasse - 06270 Villeneuve Loubet\",IF(B68=\"PAM\",\"SEAS - 1079 Rte de Grasse - 06270 Villeneuve Loubet\",IF(B68=\"ECRANS\",\"SEAS - 1079 Rte de Grasse - 06270 Villeneuve Loubet\",IF(B68=\"BOX HORS FROIDS\",\"SEAS - 1079 Rte de Grasse - 06270 Villeneuve Loubet\",IF(B68=\"PILES\",\"Corepile\",IF(B68=\"CUMULUS\",\"SEAS - 1079 Rte de Grasse - 06270 Villeneuve Loubet\",IF(B68=\"PNEUS\",\"TFM Pneus - 117 Ch Clausonnes - 06560 Valbonne\",IF(B68=\"HUILES VEGETALES\",\"Orédui - ZI Bois de Grasse - 06310 Grasse\",IF(B68=\"HUILES DE VIDANGE\",\"SERAHU - 68 Ch de la Campanette - 06800 Cagnes sur Mer\")))))))))))))))))))))","v":"PURFER - ZI Carros 15ème Rue - 06517 Carros"},{"$f":"IF(OR(B68=\"TOUT VENANT\",B68=\"DECHETS VERTS\",B68=\"GRAVATS SALES\",B68=\"GRAVATS PROPRES\",B68=\"BOIS\"),\"SUEZ\",IF(OR(B68=\"PNEUS\"),\"TFM\",IF(OR(B68=\"FROIDS\",B68=\"HORS FROIDS\",B68=\"BOX HORS FROIDS\",B68=\"CUMULUS\",B68=\"PAM\",B68=\"ECRANS\"),\"SEAS\",IF(OR(B68=\"METAUX\",B68=\"BATTERIES\"),\"DERICHEBOURG\",IF(OR(B68=\"NEON\"),\"SOFOVAR\",IF(OR(B68=\"PEINTURES\",B68=\"PRODUITS NON IDENTIFIES\",B68=\"AEROSOLS\",B68=\"HUILES VEGETALES\"),\"OREDUI\",IF(OR(B68=\"HUILES DE VIDANGE\"),\"SERAHU\")))))))","v":"DERICHEBOURG"},"BF837EE","0812"]
[null,null,null,null,null,false,false]
[null,null,null,null,null,false,false]
[null,null,null,null,null,false,false]
[null,null,null,null,null,false,false]
[null,null,null,null,null,false,false]
[null,null,null,null,null,false,false]
[null,null,null,null,null,false,false]
[null,null,null,null,null,false,false]
[null,null,null,null,null,false,false]
[null,null,null,null,null,false,false]
[null,null,null,null,null,false,false]
[null,null,null,null,null,false,false]
[null,null,null,null,null,false,false]
[null,null,null,null,null,false,false]
[null,null,null,null,null,false,false]
[null,null,null,null,null,false,false]
[null,null,null,null,null,false,false]
[null,null,null,null,null,false,false]
[null,null,null,null,null,false,false]
[null,null,null,null,null,false,false]
[null,null,null,null,null,false,false]
[null,null,null,null,null,false,false]
[null,null,null,null,null,false,false]
[null,null,null,null,null,false,false]
[null,null,null,null,null,false,false]
[null,null,null,null,null,false,false]
[null,null,null,null,null,false,false]
[null,null,null,null,null,false,false]
[null,null,null,null,null,false,false]
[null,null,null,null,null,false,false]
[null,null,null,null,null,false,false]
[null,null,null,null,null,false,false]
[null,null,null,null,null,false,false]
[null,null,null,null,null,false,false]
[null,null,null,null,null,false,false]
[null,null,null,null,null,false,false]
[null,null,null,null,null,false,false]
[null,null,null,null,null,false,false]
[null,null,null,null,null,false,false]
[null,null,null,null,null,false,false]
[null,null,null,null,null,false,false]
[null,null,null,null,null,false,false]
[null,null,null,null,null,false,false]
[null,null,null,null,null,false,false]
[null,null,null,null,null,false,false]
[null,null,null,null,null,false,false]
[null,null,null,null,null,false,false]
[null,null,null,null,null,false,false]
[null,null,null,null,null,false,false]
[null,null,null,null,null,false,false]
[null,null,null,null,null,false,false]
[null,null,null,null,null,false,false]
[null,null,null,null,null,false,false]
[null,null,null,null,null,false,false]
[null,null,null,null,null,false,false]
[null,null,null,null,null,false,false]
[null,null,null,null,null,false,false]
[null,null,null,null,null,false,false]
[null,null,null,null,null,false,false]
[null,null,null,null,null,false,false]
[null,null,null,null,null,false,false]
[null,null,null,null,null,false,false]
[null,null,null,null,null,false,false]
[null,null,null,null,null,{"$f":"IF(B132=\"TOUT VENANT\",\"Véolia Nice Tri - Parc d'activité logistique\",IF(B132=\"DECHETS VERTS\",\"Orédui Carros Compostage - ZI de la Grave\",IF(B132=\"GRAVATS PROPRES\",\"La Gaude K3 Sita Sud - 5211 Rte de St Jeannet\",IF(B132=\"GRAVATS SALES\",\"Véolia Nice Tri - 20 Ch du Saquier\",IF(B132=\"BOIS\",\"SEAS La Glacière - 1019 Rte de la Grasse\",IF(B132=\"METAUX\",\"PURFER - ZI Carros 15ème Rue - 06517 Carros\",IF(B132=\"BATTERIES\",\"PURFER - ZI Carros 15ème Rue - 06517 Carros\",IF(B132=\"NEON\",\"Sofovar - 126 Av Louis Lépine - 83600 Fréjus\",IF(B132=\"PEINTURES\",\"Orédui - ZI Bois de Grasse - 06310 Grasse\",IF(B132=\"PRODUITS NON IDENTIFIES\",\"Orédui - ZI Bois de Grasse - 06310 Grasse\",IF(B132=\"AEROSOLS\",\"Orédui - ZI Bois de Grasse - 06310 Grasse\",IF(B132=\"FROIDS\",\"SEAS - 1079 Rte de Grasse - 06270 Villeneuve Loubet\",IF(B132=\"HORS FROIDS\",\"SEAS - 1079 Rte de Grasse - 06270 Villeneuve Loubet\",IF(B132=\"PAM\",\"SEAS - 1079 Rte de Grasse - 06270 Villeneuve Loubet\",IF(B132=\"ECRANS\",\"SEAS - 1079 Rte de Grasse - 06270 Villeneuve Loubet\",IF(B132=\"BOX HORS FROIDS\",\"SEAS - 1079 Rte de Grasse - 06270 Villeneuve Loubet\",IF(B132=\"PILES\",\"Corepile\",IF(B132=\"CUMULUS\",\"SEAS - 1079 Rte de Grasse - 06270 Villeneuve Loubet\",IF(B132=\"PNEUS\",\"TFM Pneus - 117 Ch Clausonnes - 06560 Valbonne\",IF(B132=\"HUILES VEGETALES\",\"Orédui - ZI Bois de Grasse - 06310 Grasse\",IF(B132=\"HUILES DE VIDANGE\",\"SERAHU - 68 Ch de la Campanette - 06800 Cagnes sur Mer\")))))))))))))))))))))","v":false},{"$f":"IF(OR(B132=\"TOUT VENANT\",B132=\"DECHETS VERTS\",B132=\"GRAVATS SALES\",B132=\"GRAVATS PROPRES\",B132=\"BOIS\"),\"SUEZ\",IF(OR(B132=\"PNEUS\"),\"TFM\",IF(OR(B132=\"FROIDS\",B132=\"HORS FROIDS\",B132=\"BOX HORS FROIDS\",B132=\"CUMULUS\",B132=\"PAM\",B132=\"ECRANS\"),\"SEAS\",IF(OR(B132=\"METAUX\",B132=\"BATTERIES\"),\"DERICHEBOURG\",IF(OR(B132=\"NEON\"),\"SOFOVAR\",IF(OR(B132=\"PEINTURES\",B132=\"PRODUITS NON IDENTIFIES\",B132=\"AEROSOLS\",B132=\"HUILES VEGETALES\"),\"OREDUI\",IF(OR(B132=\"HUILES DE VIDANGE\"),\"SERAHU\")))))))","v":false}]
[null,null,null,null,null,false,false]
[null,null,null,null,null,false,false]
[null,null,null,null,null,false,false]
[null,null,null,null,null,false,false]
[null,null,null,null,null,false,false]
[null,null,null,null,null,false,false]
[null,null,null,null,null,false,false]
[null,null,null,null,null,false,false]
[null,null,null,null,null,false,false]
[null,null,null,null,null,false,false]
[null,null,null,null,null,false,false]
[null,null,null,null,null,false,false]
[null,null,null,null,null,false,false]
[null,null,null,null,null,false,false]
[null,null,null,null,null,false,false]
[null,null,null,null,null,false,false]
[null,null,null,null,null,false,false]
[null,null,null,null,null,false,false]
[null,null,null,null,null,false,false]
[null,null,null,null,null,false,false]
[null,null,null,null,null,false,false]
[null,null,null,null,null,false,false]
[null,null,null,null,null,false,false]
[null,null,null,null,null,false,false]
[null,null,null,null,null,false,false]
[null,null,null,null,null,false,false]
[null,null,null,null,null,false,false]
[null,null,null,null,null,false,false]
[null,null,null,null,null,false,false]
[null,null,null,null,null,false,false]
[null,null,null,null,null,false,false]
[null,null,null,null,null,false,false]
[null,null,null,null,null,false,false]
[null,null,null,null,null,false,false]
[null,null,null,null,null,false,false]
[null,null,null,null,null,false,false]
[null,null,null,null,null,false,false]
[null,null,null,null,null,false,false]
[null,null,null,null,null,false,false]
[null,null,null,null,null,false,false]
[null,null,null,null,null,false,false]
[null,null,null,null,null,false,false]
[null,null,null,null,null,false,false]
[null,null,null,null,null,false,false]
[null,null,null,null,null,false,false]
[null,null,null,null,null,false,false]
[null,null,null,null,null,false,false]
[null,null,null,null,null,false,false]
[null,null,null,null,null,false,false]
[null,null,null,null,null,false,false]
[null,null,null,null,null,false,false]
[null,null,null,null,null,false,false]
[null,null,null,null,null,false,false]
[null,null,null,null,null,false,false]
[null,null,null,null,null,false,false]
[null,null,null,null,null,false,false]
[null,null,null,null,null,false,false]
[null,null,null,null,null,false,false]
[null,null,null,null,null,false,false]
[null,null,null,null,null,false,false]
[null,null,null,null,null,false,false]
[null,null,null,null,null,false,false]
[null,null,null,null,null,false,false]
[null,null,null,null,null,{"$f":"IF(B196=\"TOUT VENANT\",\"Véolia Nice Tri - Parc d'activité logistique\",IF(B196=\"DECHETS VERTS\",\"Orédui Carros Compostage - ZI de la Grave\",IF(B196=\"GRAVATS PROPRES\",\"La Gaude K3 Sita Sud - 5211 Rte de St Jeannet\",IF(B196=\"GRAVATS SALES\",\"Véolia Nice Tri - 20 Ch du Saquier\",IF(B196=\"BOIS\",\"SEAS La Glacière - 1019 Rte de la Grasse\",IF(B196=\"METAUX\",\"PURFER - ZI Carros 15ème Rue - 06517 Carros\",IF(B196=\"BATTERIES\",\"PURFER - ZI Carros 15ème Rue - 06517 Carros\",IF(B196=\"NEON\",\"Sofovar - 126 Av Louis Lépine - 83600 Fréjus\",IF(B196=\"PEINTURES\",\"Orédui - ZI Bois de Grasse - 06310 Grasse\",IF(B196=\"PRODUITS NON IDENTIFIES\",\"Orédui - ZI Bois de Grasse - 06310 Grasse\",IF(B196=\"AEROSOLS\",\"Orédui - ZI Bois de Grasse - 06310 Grasse\",IF(B196=\"FROIDS\",\"SEAS - 1079 Rte de Grasse - 06270 Villeneuve Loubet\",IF(B196=\"HORS FROIDS\",\"SEAS - 1079 Rte de Grasse - 06270 Villeneuve Loubet\",IF(B196=\"PAM\",\"SEAS - 1079 Rte de Grasse - 06270 Villeneuve Loubet\",IF(B196=\"ECRANS\",\"SEAS - 1079 Rte de Grasse - 06270 Villeneuve Loubet\",IF(B196=\"BOX HORS FROIDS\",\"SEAS - 1079 Rte de Grasse - 06270 Villeneuve Loubet\",IF(B196=\"PILES\",\"Corepile\",IF(B196=\"CUMULUS\",\"SEAS - 1079 Rte de Grasse - 06270 Villeneuve Loubet\",IF(B196=\"PNEUS\",\"TFM Pneus - 117 Ch Clausonnes - 06560 Valbonne\",IF(B196=\"HUILES VEGETALES\",\"Orédui - ZI Bois de Grasse - 06310 Grasse\",IF(B196=\"HUILES DE VIDANGE\",\"SERAHU - 68 Ch de la Campanette - 06800 Cagnes sur Mer\")))))))))))))))))))))","v":false},{"$f":"IF(OR(B196=\"TOUT VENANT\",B196=\"DECHETS VERTS\",B196=\"GRAVATS SALES\",B196=\"GRAVATS PROPRES\",B196=\"BOIS\"),\"SUEZ\",IF(OR(B196=\"PNEUS\"),\"TFM\",IF(OR(B196=\"FROIDS\",B196=\"HORS FROIDS\",B196=\"BOX HORS FROIDS\",B196=\"CUMULUS\",B196=\"PAM\",B196=\"ECRANS\"),\"SEAS\",IF(OR(B196=\"METAUX\",B196=\"BATTERIES\"),\"DERICHEBOURG\",IF(OR(B196=\"NEON\"),\"SOFOVAR\",IF(OR(B196=\"PEINTURES\",B196=\"PRODUITS NON IDENTIFIES\",B196=\"AEROSOLS\",B196=\"HUILES VEGETALES\"),\"OREDUI\",IF(OR(B196=\"HUILES DE VIDANGE\"),\"SERAHU\")))))))","v":false}]
[null,null,null,null,null,false,false]
[null,null,null,null,null,false,false]
[null,null,null,null,null,false,false]
[null,null,null,null,null,false,false]
[null,null,null,null,null,false,false]
[null,null,null,null,null,false,false]
[null,null,null,null,null,false,false]
[null,null,null,null,null,false,false]
[null,null,null,null,null,false,false]
[null,null,null,null,null,false,false]
[null,null,null,null,null,false,false]
[null,null,null,null,null,false,false]
[null,null,null,null,null,false,false]
[null,null,null,null,null,false,false]
[null,null,null,null,null,false,false]
[null,null,null,null,null,false,false]
[null,null,null,null,null,false,false]
[null,null,null,null,null,false,false]
[null,null,null,null,null,false,false]
[null,null,null,null,null,false,false]
[null,null,null,null,null,false,false]
[null,null,null,null,null,false,false]
[null,null,null,null,null,false,false]
[null,null,null,null,null,false,false]
[null,null,null,null,null,false,false]
[null,null,null,null,null,false,false]
[null,null,null,null,null,false,false]
[null,null,null,null,null,false,false]
[null,null,null,null,null,false,false]
[null,null,null,null,null,false,false]
[null,null,null,null,null,false,false]
[null,null,null,null,null,false,false]
[null,null,null,null,null,false,false]
[null,null,null,null,null,false,false]
[null,null,null,null,null,false,false]
[null,null,null,null,null,false,false]
[null,null,null,null,null,false,false]
[null,null,null,null,null,false,false]
[null,null,null,null,null,false,false]
[null,null,null,null,null,false,false]
[null,null,null,null,null,false,false]
[null,null,null,null,null,false,false]
[null,null,null,null,null,false,false]
[null,null,null,null,null,false,false]
[null,null,null,null,null,false,false]
[null,null,null,null,null,false,false]
[null,null,null,null,null,false,false]
[null,null,null,null,null,false,false]
[null,null,null,null,null,false,false]
[null,null,null,null,null,false,false]
[null,null,null,null,null,false,false]
[null,null,null,null,null,false,false]
[null,null,null,null,null,false,false]
[null,null,null,null,null,false,false]
[null,null,null,null,null,false,false]
[null,null,null,null,null,false,false]
[null,null,null,null,null,false,false]
[null,null,null,null,null,false,false]
[null,null,null,null,null,false,false]
[null,null,null,null,null,false,false]
[null,null,null,null,null,false,false]
[null,null,null,null,null,false,false]
[null,null,null,null,null,false,false]
[null,null,null,null,null,{"$f":"IF(B260=\"TOUT VENANT\",\"Véolia Nice Tri - Parc d'activité logistique\",IF(B260=\"DECHETS VERTS\",\"Orédui Carros Compostage - ZI de la Grave\",IF(B260=\"GRAVATS PROPRES\",\"La Gaude K3 Sita Sud - 5211 Rte de St Jeannet\",IF(B260=\"GRAVATS SALES\",\"Véolia Nice Tri - 20 Ch du Saquier\",IF(B260=\"BOIS\",\"SEAS La Glacière - 1019 Rte de la Grasse\",IF(B260=\"METAUX\",\"PURFER - ZI Carros 15ème Rue - 06517 Carros\",IF(B260=\"BATTERIES\",\"PURFER - ZI Carros 15ème Rue - 06517 Carros\",IF(B260=\"NEON\",\"Sofovar - 126 Av Louis Lépine - 83600 Fréjus\",IF(B260=\"PEINTURES\",\"Orédui - ZI Bois de Grasse - 06310 Grasse\",IF(B260=\"PRODUITS NON IDENTIFIES\",\"Orédui - ZI Bois de Grasse - 06310 Grasse\",IF(B260=\"AEROSOLS\",\"Orédui - ZI Bois de Grasse - 06310 Grasse\",IF(B260=\"FROIDS\",\"SEAS - 1079 Rte de Grasse - 06270 Villeneuve Loubet\",IF(B260=\"HORS FROIDS\",\"SEAS - 1079 Rte de Grasse - 06270 Villeneuve Loubet\",IF(B260=\"PAM\",\"SEAS - 1079 Rte de Grasse - 06270 Villeneuve Loubet\",IF(B260=\"ECRANS\",\"SEAS - 1079 Rte de Grasse - 06270 Villeneuve Loubet\",IF(B260=\"BOX HORS FROIDS\",\"SEAS - 1079 Rte de Grasse - 06270 Villeneuve Loubet\",IF(B260=\"PILES\",\"Corepile\",IF(B260=\"CUMULUS\",\"SEAS - 1079 Rte de Grasse - 06270 Villeneuve Loubet\",IF(B260=\"PNEUS\",\"TFM Pneus - 117 Ch Clausonnes - 06560 Valbonne\",IF(B260=\"HUILES VEGETALES\",\"Orédui - ZI Bois de Grasse - 06310 Grasse\",IF(B260=\"HUILES DE VIDANGE\",\"SERAHU - 68 Ch de la Campanette - 06800 Cagnes sur Mer\")))))))))))))))))))))","v":false},{"$f":"IF(OR(B260=\"TOUT VENANT\",B260=\"DECHETS VERTS\",B260=\"GRAVATS SALES\",B260=\"GRAVATS PROPRES\",B260=\"BOIS\"),\"SUEZ\",IF(OR(B260=\"PNEUS\"),\"TFM\",IF(OR(B260=\"FROIDS\",B260=\"HORS FROIDS\",B260=\"BOX HORS FROIDS\",B260=\"CUMULUS\",B260=\"PAM\",B260=\"ECRANS\"),\"SEAS\",IF(OR(B260=\"METAUX\",B260=\"BATTERIES\"),\"DERICHEBOURG\",IF(OR(B260=\"NEON\"),\"SOFOVAR\",IF(OR(B260=\"PEINTURES\",B260=\"PRODUITS NON IDENTIFIES\",B260=\"AEROSOLS\",B260=\"HUILES VEGETALES\"),\"OREDUI\",IF(OR(B260=\"HUILES DE VIDANGE\"),\"SERAHU\")))))))","v":false}]
[null,null,null,null,null,false,false]
[null,null,null,null,null,false,false]
[null,null,null,null,null,false,false]
[null,null,null,null,null,false,false]
[null,null,null,null,null,false,false]
[null,null,null,null,null,false,false]
[null,null,null,null,null,false,false]
[null,null,null,null,null,false,false]
[null,null,null,null,null,false,false]
[null,null,null,null,null,false,false]
[null,null,null,null,null,false,false]
[null,null,null,null,null,false,false]
[null,null,null,null,null,false,false]
[null,null,null,null,null,false,false]
[null,null,null,null,null,false,false]
[null,null,null,null,null,false,false]
[null,null,null,null,null,false,false]
[null,null,null,null,null,false,false]
[null,null,null,null,null,false,false]
[null,null,null,null,null,false,false]
[null,null,null,null,null,false,false]
[null,null,null,null,null,false,false]
[null,null,null,null,null,false,false]
[null,null,null,null,null,false,false]
[null,null,null,null,null,false,false]
[null,null,null,null,null,false,false]
[null,null,null,null,null,false,false]
[null,null,null,null,null,false,false]
[null,null,null,null,null,false,false]
[null,null,null,null,null,false,false]
[null,null,null,null,null,false,false]
[null,null,null,null,null,false,false]
[null,null,null,null,null,false,false]
[null,null,null,null,null,false,false]
[null,null,null,null,null,false,false]
[null,null,null,null,null,false,false]
[null,null,null,null,null,false,false]
[null,null,null,null,null,false,false]
[null,null,null,null,null,false,false]
[null,null,null,null,null,false,false]
[null,null,null,null,null,false,false]
[null,null,null,null,null,false,false]
[null,null,null,null,null,false,false]
[null,null,null,null,null,false,false]
[null,null,null,null,null,false,false]
[null,null,null,null,null,false,false]
[null,null,null,null,null,false,false]
[null,null,null,null,null,false,false]
[null,null,null,null,null,false,false]
[null,null,null,null,null,false,false]
[null,null,null,null,null,false,false]
[null,null,null,null,null,false,false]
[null,null,null,null,null,false,false]
[null,null,null,null,null,false,false]
[null,null,null,null,null,false,false]
[null,null,null,null,null,false,false]
[null,null,null,null,null,false,false]
[null,null,null,null,null,false,false]
[null,null,null,null,null,false,false]
[null,null,null,null,null,false,false]
[null,null,null,null,null,false,false]
[null,null,null,null,null,false,false]
[null,null,null,null,null,false,false]
[null,null,null,null,null,{"$f":"IF(B324=\"TOUT VENANT\",\"Véolia Nice Tri - Parc d'activité logistique\",IF(B324=\"DECHETS VERTS\",\"Orédui Carros Compostage - ZI de la Grave\",IF(B324=\"GRAVATS PROPRES\",\"La Gaude K3 Sita Sud - 5211 Rte de St Jeannet\",IF(B324=\"GRAVATS SALES\",\"Véolia Nice Tri - 20 Ch du Saquier\",IF(B324=\"BOIS\",\"SEAS La Glacière - 1019 Rte de la Grasse\",IF(B324=\"METAUX\",\"PURFER - ZI Carros 15ème Rue - 06517 Carros\",IF(B324=\"BATTERIES\",\"PURFER - ZI Carros 15ème Rue - 06517 Carros\",IF(B324=\"NEON\",\"Sofovar - 126 Av Louis Lépine - 83600 Fréjus\",IF(B324=\"PEINTURES\",\"Orédui - ZI Bois de Grasse - 06310 Grasse\",IF(B324=\"PRODUITS NON IDENTIFIES\",\"Orédui - ZI Bois de Grasse - 06310 Grasse\",IF(B324=\"AEROSOLS\",\"Orédui - ZI Bois de Grasse - 06310 Grasse\",IF(B324=\"FROIDS\",\"SEAS - 1079 Rte de Grasse - 06270 Villeneuve Loubet\",IF(B324=\"HORS FROIDS\",\"SEAS - 1079 Rte de Grasse - 06270 Villeneuve Loubet\",IF(B324=\"PAM\",\"SEAS - 1079 Rte de Grasse - 06270 Villeneuve Loubet\",IF(B324=\"ECRANS\",\"SEAS - 1079 Rte de Grasse - 06270 Villeneuve Loubet\",IF(B324=\"BOX HORS FROIDS\",\"SEAS - 1079 Rte de Grasse - 06270 Villeneuve Loubet\",IF(B324=\"PILES\",\"Corepile\",IF(B324=\"CUMULUS\",\"SEAS - 1079 Rte de Grasse - 06270 Villeneuve Loubet\",IF(B324=\"PNEUS\",\"TFM Pneus - 117 Ch Clausonnes - 06560 Valbonne\",IF(B324=\"HUILES VEGETALES\",\"Orédui - ZI Bois de Grasse - 06310 Grasse\",IF(B324=\"HUILES DE VIDANGE\",\"SERAHU - 68 Ch de la Campanette - 06800 Cagnes sur Mer\")))))))))))))))))))))","v":false},{"$f":"IF(OR(B324=\"TOUT VENANT\",B324=\"DECHETS VERTS\",B324=\"GRAVATS SALES\",B324=\"GRAVATS PROPRES\",B324=\"BOIS\"),\"SUEZ\",IF(OR(B324=\"PNEUS\"),\"TFM\",IF(OR(B324=\"FROIDS\",B324=\"HORS FROIDS\",B324=\"BOX HORS FROIDS\",B324=\"CUMULUS\",B324=\"PAM\",B324=\"ECRANS\"),\"SEAS\",IF(OR(B324=\"METAUX\",B324=\"BATTERIES\"),\"DERICHEBOURG\",IF(OR(B324=\"NEON\"),\"SOFOVAR\",IF(OR(B324=\"PEINTURES\",B324=\"PRODUITS NON IDENTIFIES\",B324=\"AEROSOLS\",B324=\"HUILES VEGETALES\"),\"OREDUI\",IF(OR(B324=\"HUILES DE VIDANGE\"),\"SERAHU\")))))))","v":false}]
[null,null,null,null,null,false,false]
[null,null,null,null,null,false,false]
[null,null,null,null,null,false,false]
[null,null,null,null,null,false,false]
[null,null,null,null,null,false,false]
[null,null,null,null,null,false,false]
[null,null,null,null,null,false,false]
[null,null,null,null,null,false,false]
[null,null,null,null,null,false,false]
[null,null,null,null,null,false,false]
[null,null,null,null,null,false,false]
[null,null,null,null,null,false,false]
[null,null,null,null,null,false,false]
[null,null,null,null,null,false,false]
[null,null,null,null,null,false,false]
[null,null,null,null,null,false,false]
[null,null,null,null,null,false,false]
[null,null,null,null,null,false,false]
[null,null,null,null,null,false,false]
[null,null,null,null,null,false,false]
[null,null,null,null,null,false,false]
[null,null,null,null,null,false,false]
[null,null,null,null,null,false,false]
[null,null,null,null,null,false,false]
[null,null,null,null,null,false,false]
[null,null,null,null,null,false,false]
[null,null,null,null,null,false,false]
[null,null,null,null,null,false,false]
[null,null,null,null,null,false,false]
[null,null,null,null,null,false,false]
[null,null,null,null,null,false,false]
[null,null,null,null,null,false,false]
[null,null,null,null,null,false,false]
[null,null,null,null,null,false,false]
[null,null,null,null,null,false,false]
[null,null,null,null,null,false,false]
[null,null,null,null,null,false,false]
[null,null,null,null,null,false,false]
[null,null,null,null,null,false,false]
[null,null,null,null,null,false,false]
[null,null,null,null,null,false,false]
[null,null,null,null,null,false,false]
[null,null,null,null,null,false,false]
[null,null,null,null,null,false,false]
[null,null,null,null,null,false,false]
[null,null,null,null,null,false,false]
[null,null,null,null,null,false,false]
[null,null,null,null,null,false,false]
[null,null,null,null,null,false,false]
[null,null,null,null,null,false,false]
[null,null,null,null,null,false,false]
[null,null,null,null,null,false,false]
[null,null,null,null,null,false,false]
[null,null,null,null,null,false,false]
[null,null,null,null,null,false,false]
[null,null,null,null,null,false,false]
[null,null,null,null,null,false,false]
[null,null,null,null,null,false,false]
[null,null,null,null,null,false,false]
[null,null,null,null,null,false,false]
[null,null,null,null,null,false,false]
[null,null,null,null,null,false,false]
[null,null,null,null,null,false,false]
[null,null,null,null,null,{"$f":"IF(B388=\"TOUT VENANT\",\"Véolia Nice Tri - Parc d'activité logistique\",IF(B388=\"DECHETS VERTS\",\"Orédui Carros Compostage - ZI de la Grave\",IF(B388=\"GRAVATS PROPRES\",\"La Gaude K3 Sita Sud - 5211 Rte de St Jeannet\",IF(B388=\"GRAVATS SALES\",\"Véolia Nice Tri - 20 Ch du Saquier\",IF(B388=\"BOIS\",\"SEAS La Glacière - 1019 Rte de la Grasse\",IF(B388=\"METAUX\",\"PURFER - ZI Carros 15ème Rue - 06517 Carros\",IF(B388=\"BATTERIES\",\"PURFER - ZI Carros 15ème Rue - 06517 Carros\",IF(B388=\"NEON\",\"Sofovar - 126 Av Louis Lépine - 83600 Fréjus\",IF(B388=\"PEINTURES\",\"Orédui - ZI Bois de Grasse - 06310 Grasse\",IF(B388=\"PRODUITS NON IDENTIFIES\",\"Orédui - ZI Bois de Grasse - 06310 Grasse\",IF(B388=\"AEROSOLS\",\"Orédui - ZI Bois de Grasse - 06310 Grasse\",IF(B388=\"FROIDS\",\"SEAS - 1079 Rte de Grasse - 06270 Villeneuve Loubet\",IF(B388=\"HORS FROIDS\",\"SEAS - 1079 Rte de Grasse - 06270 Villeneuve Loubet\",IF(B388=\"PAM\",\"SEAS - 1079 Rte de Grasse - 06270 Villeneuve Loubet\",IF(B388=\"ECRANS\",\"SEAS - 1079 Rte de Grasse - 06270 Villeneuve Loubet\",IF(B388=\"BOX HORS FROIDS\",\"SEAS - 1079 Rte de Grasse - 06270 Villeneuve Loubet\",IF(B388=\"PILES\",\"Corepile\",IF(B388=\"CUMULUS\",\"SEAS - 1079 Rte de Grasse - 06270 Villeneuve Loubet\",IF(B388=\"PNEUS\",\"TFM Pneus - 117 Ch Clausonnes - 06560 Valbonne\",IF(B388=\"HUILES VEGETALES\",\"Orédui - ZI Bois de Grasse - 06310 Grasse\",IF(B388=\"HUILES DE VIDANGE\",\"SERAHU - 68 Ch de la Campanette - 06800 Cagnes sur Mer\")))))))))))))))))))))","v":false},{"$f":"IF(OR(B388=\"TOUT VENANT\",B388=\"DECHETS VERTS\",B388=\"GRAVATS SALES\",B388=\"GRAVATS PROPRES\",B388=\"BOIS\"),\"SUEZ\",IF(OR(B388=\"PNEUS\"),\"TFM\",IF(OR(B388=\"FROIDS\",B388=\"HORS FROIDS\",B388=\"BOX HORS FROIDS\",B388=\"CUMULUS\",B388=\"PAM\",B388=\"ECRANS\"),\"SEAS\",IF(OR(B388=\"METAUX\",B388=\"BATTERIES\"),\"DERICHEBOURG\",IF(OR(B388=\"NEON\"),\"SOFOVAR\",IF(OR(B388=\"PEINTURES\",B388=\"PRODUITS NON IDENTIFIES\",B388=\"AEROSOLS\",B388=\"HUILES VEGETALES\"),\"OREDUI\",IF(OR(B388=\"HUILES DE VIDANGE\"),\"SERAHU\")))))))","v":false}]
[null,null,null,null,null,false,false]
[null,null,null,null,null,false,false]
[null,null,null,null,null,false,false]
[null,null,null,null,null,false,false]
[null,null,null,null,null,false,false]
[null,null,null,null,null,false,false]
[null,null,null,null,null,false,false]
[null,null,null,null,null,false,false]
[null,null,null,null,null,false,false]
[null,null,null,null,null,false,false]
[null,null,null,null,null,false,false]
[null,null,null,null,null,false,false]
[null,null,null,null,null,false,false]
[null,null,null,null,null,false,false]
[null,null,null,null,null,false,false]
[null,null,null,null,null,false,false]
[null,null,null,null,null,false,false]
[null,null,null,null,null,false,false]
[null,null,null,null,null,false,false]
[null,null,null,null,null,false,false]
[null,null,null,null,null,false,false]
[null,null,null,null,null,false,false]
[null,null,null,null,null,false,false]
[null,null,null,null,null,false,false]
[null,null,null,null,null,false,false]
[null,null,null,null,null,false,false]
[null,null,null,null,null,false,false]
[null,null,null,null,null,false,false]
[null,null,null,null,null,false,false]
[null,null,null,null,null,false,false]
[null,null,null,null,null,false,false]
[null,null,null,null,null,false,false]
[null,null,null,null,null,false,false]
[null,null,null,null,null,false,false]
[null,null,null,null,null,false,false]
[null,null,null,null,null,false,false]
[null,null,null,null,null,false,false]
[null,null,null,null,null,false,false]
[null,null,null,null,null,false,false]
[null,null,null,null,null,false,false]
[null,null,null,null,null,false,false]
[null,null,null,null,null,false,false]
[null,null,null,null,null,false,false]
[null,null,null,null,null,false,false]
[null,null,null,null,null,false,false]
[null,null,null,null,null,false,false]
[null,null,null,null,null,false,false]
[null,null,null,null,null,false,false]
[null,null,null,null,null,false,false]
[null,null,null,null,null,false,false]
[null,null,null,null,null,false,false]
[null,null,null,null,null,false,false]
[null,null,null,null,null,false,false]
[null,null,null,null,null,false,false]
[null,null,null,null,null,false,false]
[null,null,null,null,null,false,false]
[null,null,null,null,null,false,false]
[null,null,null,null,null,false,false]
[null,null,null,null,null,false,false]
[null,null,null,null,null,false,false]
[null,null,null,null,null,false,false]
[null,null,null,null,null,false,false]
[null,null,null,null,null,false,false]
[null,null,null,null,null,{"$f":"IF(B452=\"TOUT VENANT\",\"Véolia Nice Tri - Parc d'activité logistique\",IF(B452=\"DECHETS VERTS\",\"Orédui Carros Compostage - ZI de la Grave\",IF(B452=\"GRAVATS PROPRES\",\"La Gaude K3 Sita Sud - 5211 Rte de St Jeannet\",IF(B452=\"GRAVATS SALES\",\"Véolia Nice Tri - 20 Ch du Saquier\",IF(B452=\"BOIS\",\"SEAS La Glacière - 1019 Rte de la Grasse\",IF(B452=\"METAUX\",\"PURFER - ZI Carros 15ème Rue - 06517 Carros\",IF(B452=\"BATTERIES\",\"PURFER - ZI Carros 15ème Rue - 06517 Carros\",IF(B452=\"NEON\",\"Sofovar - 126 Av Louis Lépine - 83600 Fréjus\",IF(B452=\"PEINTURES\",\"Orédui - ZI Bois de Grasse - 06310 Grasse\",IF(B452=\"PRODUITS NON IDENTIFIES\",\"Orédui - ZI Bois de Grasse - 06310 Grasse\",IF(B452=\"AEROSOLS\",\"Orédui - ZI Bois de Grasse - 06310 Grasse\",IF(B452=\"FROIDS\",\"SEAS - 1079 Rte de Grasse - 06270 Villeneuve Loubet\",IF(B452=\"HORS FROIDS\",\"SEAS - 1079 Rte de Grasse - 06270 Villeneuve Loubet\",IF(B452=\"PAM\",\"SEAS - 1079 Rte de Grasse - 06270 Villeneuve Loubet\",IF(B452=\"ECRANS\",\"SEAS - 1079 Rte de Grasse - 06270 Villeneuve Loubet\",IF(B452=\"BOX HORS FROIDS\",\"SEAS - 1079 Rte de Grasse - 06270 Villeneuve Loubet\",IF(B452=\"PILES\",\"Corepile\",IF(B452=\"CUMULUS\",\"SEAS - 1079 Rte de Grasse - 06270 Villeneuve Loubet\",IF(B452=\"PNEUS\",\"TFM Pneus - 117 Ch Clausonnes - 06560 Valbonne\",IF(B452=\"HUILES VEGETALES\",\"Orédui - ZI Bois de Grasse - 06310 Grasse\",IF(B452=\"HUILES DE VIDANGE\",\"SERAHU - 68 Ch de la Campanette - 06800 Cagnes sur Mer\")))))))))))))))))))))","v":false},{"$f":"IF(OR(B452=\"TOUT VENANT\",B452=\"DECHETS VERTS\",B452=\"GRAVATS SALES\",B452=\"GRAVATS PROPRES\",B452=\"BOIS\"),\"SUEZ\",IF(OR(B452=\"PNEUS\"),\"TFM\",IF(OR(B452=\"FROIDS\",B452=\"HORS FROIDS\",B452=\"BOX HORS FROIDS\",B452=\"CUMULUS\",B452=\"PAM\",B452=\"ECRANS\"),\"SEAS\",IF(OR(B452=\"METAUX\",B452=\"BATTERIES\"),\"DERICHEBOURG\",IF(OR(B452=\"NEON\"),\"SOFOVAR\",IF(OR(B452=\"PEINTURES\",B452=\"PRODUITS NON IDENTIFIES\",B452=\"AEROSOLS\",B452=\"HUILES VEGETALES\"),\"OREDUI\",IF(OR(B452=\"HUILES DE VIDANGE\"),\"SERAHU\")))))))","v":false}]
[null,null,null,null,null,false,false]
[null,null,null,null,null,false,false]
[null,null,null,null,null,false,false]
[null,null,null,null,null,false,false]
[null,null,null,null,null,false,false]
[null,null,null,null,null,false,false]
[null,null,null,null,null,false,false]
[null,null,null,null,null,false,false]
[null,null,null,null,null,false,false]
[null,null,null,null,null,false,false]
[null,null,null,null,null,false,false]
[null,null,null,null,null,false,false]
[null,null,null,null,null,false,false]
[null,null,null,null,null,false,false]
[null,null,null,null,null,false,false]
[null,null,null,null,null,false,false]
[null,null,null,null,null,false,false]
[null,null,null,null,null,false,false]
[null,null,null,null,null,false,false]
[null,null,null,null,null,false,false]
[null,null,null,null,null,false,false]
[null,null,null,null,null,false,false]
[null,null,null,null,null,false,false]
[null,null,null,null,null,false,false]
[null,null,null,null,null,false,false]
[null,null,null,null,null,false,false]
[null,null,null,null,null,false,false]
[null,null,null,null,null,false,false]
[null,null,null,null,null,false,false]
[null,null,null,null,null,false,false]
[null,null,null,null,null,false,false]
[null,null,null,null,null,false,false]
[null,null,null,null,null,false,false]
[null,null,null,null,null,false,false]
[null,null,null,null,null,false,false]
[null,null,null,null,null,false,false]
[null,null,null,null,null,false,false]
[null,null,null,null,null,false,false]
[null,null,null,null,null,false,false]
[null,null,null,null,null,false,false]
[null,null,null,null,null,false,false]
[null,null,null,null,null,false,false]
[null,null,null,null,null,false,false]
[null,null,null,null,null,false,false]
[null,null,null,null,null,false,false]
[null,null,null,null,null,false,false]
[null,null,null,null,null,false,false]
[null,null,null,null,null,false,false]
[null,null,null,null,null,false,false]
[null,null,null,null,null,false,false]
[null,null,null,null,null,false,false]
[null,null,null,null,null,false,false]
[null,null,null,null,null,false,false]
[null,null,null,null,null,false,false]
[null,null,null,null,null,false,false]
[null,null,null,null,null,false,false]
[null,null,null,null,null,false,false]
[null,null,null,null,null,false,false]
[null,null,null,null,null,false,false]
[null,null,null,null,null,false,false]
[null,null,null,null,null,false,false]
[null,null,null,null,null,false,false]
[null,null,null,null,null,false,false]
[null,null,null,null,null,{"$f":"IF(B516=\"TOUT VENANT\",\"Véolia Nice Tri - Parc d'activité logistique\",IF(B516=\"DECHETS VERTS\",\"Orédui Carros Compostage - ZI de la Grave\",IF(B516=\"GRAVATS PROPRES\",\"La Gaude K3 Sita Sud - 5211 Rte de St Jeannet\",IF(B516=\"GRAVATS SALES\",\"Véolia Nice Tri - 20 Ch du Saquier\",IF(B516=\"BOIS\",\"SEAS La Glacière - 1019 Rte de la Grasse\",IF(B516=\"METAUX\",\"PURFER - ZI Carros 15ème Rue - 06517 Carros\",IF(B516=\"BATTERIES\",\"PURFER - ZI Carros 15ème Rue - 06517 Carros\",IF(B516=\"NEON\",\"Sofovar - 126 Av Louis Lépine - 83600 Fréjus\",IF(B516=\"PEINTURES\",\"Orédui - ZI Bois de Grasse - 06310 Grasse\",IF(B516=\"PRODUITS NON IDENTIFIES\",\"Orédui - ZI Bois de Grasse - 06310 Grasse\",IF(B516=\"AEROSOLS\",\"Orédui - ZI Bois de Grasse - 06310 Grasse\",IF(B516=\"FROIDS\",\"SEAS - 1079 Rte de Grasse - 06270 Villeneuve Loubet\",IF(B516=\"HORS FROIDS\",\"SEAS - 1079 Rte de Grasse - 06270 Villeneuve Loubet\",IF(B516=\"PAM\",\"SEAS - 1079 Rte de Grasse - 06270 Villeneuve Loubet\",IF(B516=\"ECRANS\",\"SEAS - 1079 Rte de Grasse - 06270 Villeneuve Loubet\",IF(B516=\"BOX HORS FROIDS\",\"SEAS - 1079 Rte de Grasse - 06270 Villeneuve Loubet\",IF(B516=\"PILES\",\"Corepile\",IF(B516=\"CUMULUS\",\"SEAS - 1079 Rte de Grasse - 06270 Villeneuve Loubet\",IF(B516=\"PNEUS\",\"TFM Pneus - 117 Ch Clausonnes - 06560 Valbonne\",IF(B516=\"HUILES VEGETALES\",\"Orédui - ZI Bois de Grasse - 06310 Grasse\",IF(B516=\"HUILES DE VIDANGE\",\"SERAHU - 68 Ch de la Campanette - 06800 Cagnes sur Mer\")))))))))))))))))))))","v":false},{"$f":"IF(OR(B516=\"TOUT VENANT\",B516=\"DECHETS VERTS\",B516=\"GRAVATS SALES\",B516=\"GRAVATS PROPRES\",B516=\"BOIS\"),\"SUEZ\",IF(OR(B516=\"PNEUS\"),\"TFM\",IF(OR(B516=\"FROIDS\",B516=\"HORS FROIDS\",B516=\"BOX HORS FROIDS\",B516=\"CUMULUS\",B516=\"PAM\",B516=\"ECRANS\"),\"SEAS\",IF(OR(B516=\"METAUX\",B516=\"BATTERIES\"),\"DERICHEBOURG\",IF(OR(B516=\"NEON\"),\"SOFOVAR\",IF(OR(B516=\"PEINTURES\",B516=\"PRODUITS NON IDENTIFIES\",B516=\"AEROSOLS\",B516=\"HUILES VEGETALES\"),\"OREDUI\",IF(OR(B516=\"HUILES DE VIDANGE\"),\"SERAHU\")))))))","v":false}]
[null,null,null,null,null,false,false]
[null,null,null,null,null,false,false]
[null,null,null,null,null,false,false]
[null,null,null,null,null,false,false]
[null,null,null,null,null,false,false]
[null,null,null,null,null,false,false]
[null,null,null,null,null,false,false]
[null,null,null,null,null,false,false]
[null,null,null,null,null,false,false]
[null,null,null,null,null,false,false]
[null,null,null,null,null,false,false]
[null,null,null,null,null,false,false]
[null,null,null,null,null,false,false]
[null,null,null,null,null,false,false]
[null,null,null,null,null,false,false]
[null,null,null,null,null,false,false]
[null,null,null,null,null,false,false]
[null,null,null,null,null,false,false]
[null,null,null,null,null,false,false]
[null,null,null,null,null,false,false]
[null,null,null,null,null,false,false]
[null,null,null,null,null,false,false]
[null,null,null,null,null,false,false]
[null,null,null,null,null,false,false]
[null,null,null,null,null,false,false]
[null,null,null,null,null,false,false]
[null,null,null,null,null,false,false]
[null,null,null,null,null,false,false]
[null,null,null,null,null,false,false]
[null,null,null,null,null,false,false]
[null,null,null,null,null,false,false]
[null,null,null,null,null,false,false]
[null,null,null,null,null,false,false]
[null,null,null,null,null,false,false]
[null,null,null,null,null,false,false]
[null,null,null,null,null,false,false]
[null,null,null,null,null,false,false]
[null,null,null,null,null,false,false]
[null,null,null,null,null,false,false]
[null,null,null,null,null,false,false]
[null,null,null,null,null,false,false]
[null,null,null,null,null,false,false]
[null,null,null,null,null,false,false]
[null,null,null,null,null,false,false]
[null,null,null,null,null,false,false]
[null,null,null,null,null,false,false]
[null,null,null,null,null,false,false]
[null,null,null,null,null,false,false]
[null,null,null,null,null,false,false]
[null,null,null,null,null,false,false]
[null,null,null,null,null,false,false]
[null,null,null,null,null,false,false]
[null,null,null,null,null,false,false]
[null,null,null,null,null,false,false]
[null,null,null,null,null,false,false]
[null,null,null,null,null,false,false]
[null,null,null,null,null,false,false]
[null,null,null,null,null,false,false]
[null,null,null,null,null,false,false]
[null,null,null,null,null,false,false]
[null,null,null,null,null,false,false]
[null,null,null,null,null,false,false]
[null,null,null,null,null,false,false]
[null,null,null,null,null,{"$f":"IF(B580=\"TOUT VENANT\",\"Véolia Nice Tri - Parc d'activité logistique\",IF(B580=\"DECHETS VERTS\",\"Orédui Carros Compostage - ZI de la Grave\",IF(B580=\"GRAVATS PROPRES\",\"La Gaude K3 Sita Sud - 5211 Rte de St Jeannet\",IF(B580=\"GRAVATS SALES\",\"Véolia Nice Tri - 20 Ch du Saquier\",IF(B580=\"BOIS\",\"SEAS La Glacière - 1019 Rte de la Grasse\",IF(B580=\"METAUX\",\"PURFER - ZI Carros 15ème Rue - 06517 Carros\",IF(B580=\"BATTERIES\",\"PURFER - ZI Carros 15ème Rue - 06517 Carros\",IF(B580=\"NEON\",\"Sofovar - 126 Av Louis Lépine - 83600 Fréjus\",IF(B580=\"PEINTURES\",\"Orédui - ZI Bois de Grasse - 06310 Grasse\",IF(B580=\"PRODUITS NON IDENTIFIES\",\"Orédui - ZI Bois de Grasse - 06310 Grasse\",IF(B580=\"AEROSOLS\",\"Orédui - ZI Bois de Grasse - 06310 Grasse\",IF(B580=\"FROIDS\",\"SEAS - 1079 Rte de Grasse - 06270 Villeneuve Loubet\",IF(B580=\"HORS FROIDS\",\"SEAS - 1079 Rte de Grasse - 06270 Villeneuve Loubet\",IF(B580=\"PAM\",\"SEAS - 1079 Rte de Grasse - 06270 Villeneuve Loubet\",IF(B580=\"ECRANS\",\"SEAS - 1079 Rte de Grasse - 06270 Villeneuve Loubet\",IF(B580=\"BOX HORS FROIDS\",\"SEAS - 1079 Rte de Grasse - 06270 Villeneuve Loubet\",IF(B580=\"PILES\",\"Corepile\",IF(B580=\"CUMULUS\",\"SEAS - 1079 Rte de Grasse - 06270 Villeneuve Loubet\",IF(B580=\"PNEUS\",\"TFM Pneus - 117 Ch Clausonnes - 06560 Valbonne\",IF(B580=\"HUILES VEGETALES\",\"Orédui - ZI Bois de Grasse - 06310 Grasse\",IF(B580=\"HUILES DE VIDANGE\",\"SERAHU - 68 Ch de la Campanette - 06800 Cagnes sur Mer\")))))))))))))))))))))","v":false},{"$f":"IF(OR(B580=\"TOUT VENANT\",B580=\"DECHETS VERTS\",B580=\"GRAVATS SALES\",B580=\"GRAVATS PROPRES\",B580=\"BOIS\"),\"SUEZ\",IF(OR(B580=\"PNEUS\"),\"TFM\",IF(OR(B580=\"FROIDS\",B580=\"HORS FROIDS\",B580=\"BOX HORS FROIDS\",B580=\"CUMULUS\",B580=\"PAM\",B580=\"ECRANS\"),\"SEAS\",IF(OR(B580=\"METAUX\",B580=\"BATTERIES\"),\"DERICHEBOURG\",IF(OR(B580=\"NEON\"),\"SOFOVAR\",IF(OR(B580=\"PEINTURES\",B580=\"PRODUITS NON IDENTIFIES\",B580=\"AEROSOLS\",B580=\"HUILES VEGETALES\"),\"OREDUI\",IF(OR(B580=\"HUILES DE VIDANGE\"),\"SERAHU\")))))))","v":false}]
[null,null,null,null,null,false,false]
[null,null,null,null,null,false,false]
[null,null,null,null,null,false,false]
[null,null,null,null,null,false,false]
[null,null,null,null,null,false,false]
[null,null,null,null,null,false,false]
[null,null,null,null,null,false,false]
[null,null,null,null,null,false,false]
[null,null,null,null,null,false,false]
[null,null,null,null,null,false,false]
[null,null,null,null,null,false,false]
[null,null,null,null,null,false,false]
[null,null,null,null,null,false,false]
[null,null,null,null,null,false,false]
[null,null,null,null,null,false,false]
[null,null,null,null,null,false,false]
[null,null,null,null,null,false,false]
[null,null,null,null,null,false,false]
[null,null,null,null,null,false,false]
[null,null,null,null,null,false,false]
[null,null,null,null,null,false,false]
[null,null,null,null,null,false,false]
[null,null,null,null,null,false,false]
[null,null,null,null,null,false,false]
[null,null,null,null,null,false,false]
[null,null,null,null,null,false,false]
[null,null,null,null,null,false,false]
[null,null,null,null,null,false,false]
[null,null,null,null,null,false,false]
[null,null,null,null,null,false,false]
[null,null,null,null,null,false,false]
[null,null,null,null,null,false,false]
[null,null,null,null,null,false,false]
[null,null,null,null,null,false,false]
[null,null,null,null,null,false,false]
[null,null,null,null,null,false,false]
[null,null,null,null,null,false,false]
[null,null,null,null,null,false,false]
[null,null,null,null,null,false,false]
[null,null,null,null,null,false,false]
[null,null,null,null,null,false,false]
[null,null,null,null,null,false,false]
[null,null,null,null,null,false,false]
[null,null,null,null,null,false,false]
[null,null,null,null,null,false,false]
[null,null,null,null,null,false,false]
[null,null,null,null,null,false,false]
[null,null,null,null,null,false,false]
[null,null,null,null,null,false,false]
[null,null,null,null,null,false,false]
[null,null,null,null,null,false,false]
[null,null,null,null,null,false,false]
[null,null,null,null,null,false,false]
[null,null,null,null,null,false,false]
[null,null,null,null,null,false,false]
[null,null,null,null,null,false,false]
[null,null,null,null,null,false,false]
[null,null,null,null,null,false,false]
[null,null,null,null,null,false,false]
[null,null,null,null,null,false,false]
[null,null,null,null,null,false,false]
[null,null,null,null,null,false,false]
[null,null,null,null,null,false,false]
[null,null,null,null,null,{"$f":"IF(B644=\"TOUT VENANT\",\"Véolia Nice Tri - Parc d'activité logistique\",IF(B644=\"DECHETS VERTS\",\"Orédui Carros Compostage - ZI de la Grave\",IF(B644=\"GRAVATS PROPRES\",\"La Gaude K3 Sita Sud - 5211 Rte de St Jeannet\",IF(B644=\"GRAVATS SALES\",\"Véolia Nice Tri - 20 Ch du Saquier\",IF(B644=\"BOIS\",\"SEAS La Glacière - 1019 Rte de la Grasse\",IF(B644=\"METAUX\",\"PURFER - ZI Carros 15ème Rue - 06517 Carros\",IF(B644=\"BATTERIES\",\"PURFER - ZI Carros 15ème Rue - 06517 Carros\",IF(B644=\"NEON\",\"Sofovar - 126 Av Louis Lépine - 83600 Fréjus\",IF(B644=\"PEINTURES\",\"Orédui - ZI Bois de Grasse - 06310 Grasse\",IF(B644=\"PRODUITS NON IDENTIFIES\",\"Orédui - ZI Bois de Grasse - 06310 Grasse\",IF(B644=\"AEROSOLS\",\"Orédui - ZI Bois de Grasse - 06310 Grasse\",IF(B644=\"FROIDS\",\"SEAS - 1079 Rte de Grasse - 06270 Villeneuve Loubet\",IF(B644=\"HORS FROIDS\",\"SEAS - 1079 Rte de Grasse - 06270 Villeneuve Loubet\",IF(B644=\"PAM\",\"SEAS - 1079 Rte de Grasse - 06270 Villeneuve Loubet\",IF(B644=\"ECRANS\",\"SEAS - 1079 Rte de Grasse - 06270 Villeneuve Loubet\",IF(B644=\"BOX HORS FROIDS\",\"SEAS - 1079 Rte de Grasse - 06270 Villeneuve Loubet\",IF(B644=\"PILES\",\"Corepile\",IF(B644=\"CUMULUS\",\"SEAS - 1079 Rte de Grasse - 06270 Villeneuve Loubet\",IF(B644=\"PNEUS\",\"TFM Pneus - 117 Ch Clausonnes - 06560 Valbonne\",IF(B644=\"HUILES VEGETALES\",\"Orédui - ZI Bois de Grasse - 06310 Grasse\",IF(B644=\"HUILES DE VIDANGE\",\"SERAHU - 68 Ch de la Campanette - 06800 Cagnes sur Mer\")))))))))))))))))))))","v":false},{"$f":"IF(OR(B644=\"TOUT VENANT\",B644=\"DECHETS VERTS\",B644=\"GRAVATS SALES\",B644=\"GRAVATS PROPRES\",B644=\"BOIS\"),\"SUEZ\",IF(OR(B644=\"PNEUS\"),\"TFM\",IF(OR(B644=\"FROIDS\",B644=\"HORS FROIDS\",B644=\"BOX HORS FROIDS\",B644=\"CUMULUS\",B644=\"PAM\",B644=\"ECRANS\"),\"SEAS\",IF(OR(B644=\"METAUX\",B644=\"BATTERIES\"),\"DERICHEBOURG\",IF(OR(B644=\"NEON\"),\"SOFOVAR\",IF(OR(B644=\"PEINTURES\",B644=\"PRODUITS NON IDENTIFIES\",B644=\"AEROSOLS\",B644=\"HUILES VEGETALES\"),\"OREDUI\",IF(OR(B644=\"HUILES DE VIDANGE\"),\"SERAHU\")))))))","v":false}]
[null,null,null,null,null,false,false]
[null,null,null,null,null,false,false]
[null,null,null,null,null,false,false]
[null,null,null,null,null,false,false]
[null,null,null,null,null,false,false]
[null,null,null,null,null,false,false]
[null,null,null,null,null,false,false]
[null,null,null,null,null,false,false]
[null,null,null,null,null,false,false]
[null,null,null,null,null,false,false]
[null,null,null,null,null,false,false]
[null,null,null,null,null,false,false]
[null,null,null,null,null,false,false]
[null,null,null,null,null,false,false]
[null,null,null,null,null,false,false]
[null,null,null,null,null,false,false]
[null,null,null,null,null,false,false]
[null,null,null,null,null,false,false]
[null,null,null,null,null,false,false]
[null,null,null,null,null,false,false]
[null,null,null,null,null,false,false]
[null,null,null,null,null,false,false]
[null,null,null,null,null,false,false]
[null,null,null,null,null,false,false]
[null,null,null,null,null,false,false]
[null,null,null,null,null,false,false]
[null,null,null,null,null,false,false]
[null,null,null,null,null,false,false]
[null,null,null,null,null,false,false]
[null,null,null,null,null,false,false]
[null,null,null,null,null,false,false]
[null,null,null,null,null,false,false]
[null,null,null,null,null,false,false]
[null,null,null,null,null,false,false]
[null,null,null,null,null,false,false]
[null,null,null,null,null,false,false]
[null,null,null,null,null,false,false]
[null,null,null,null,null,false,false]
[null,null,null,null,null,false,false]
[null,null,null,null,null,false,false]
[null,null,null,null,null,false,false]
[null,null,null,null,null,false,false]
[null,null,null,null,null,false,false]
[null,null,null,null,null,false,false]
[null,null,null,null,null,false,false]
[null,null,null,null,null,false,false]
[null,null,null,null,null,false,false]
[null,null,null,null,null,false,false]
[null,null,null,null,null,false,false]
[null,null,null,null,null,false,false]
[null,null,null,null,null,false,false]
[null,null,null,null,null,false,false]
[null,null,null,null,null,false,false]
[null,null,null,null,null,false,false]
[null,null,null,null,null,false,false]
[null,null,null,null,null,false,false]
[null,null,null,null,null,false,false]
[null,null,null,null,null,false,false]
[null,null,null,null,null,false,false]
[null,null,null,null,null,false,false]
[null,null,null,null,null,false,false]
[null,null,null,null,null,false,false]
[null,null,null,null,null,false,false]
[null,null,null,null,null,{"$f":"IF(B708=\"TOUT VENANT\",\"Véolia Nice Tri - Parc d'activité logistique\",IF(B708=\"DECHETS VERTS\",\"Orédui Carros Compostage - ZI de la Grave\",IF(B708=\"GRAVATS PROPRES\",\"La Gaude K3 Sita Sud - 5211 Rte de St Jeannet\",IF(B708=\"GRAVATS SALES\",\"Véolia Nice Tri - 20 Ch du Saquier\",IF(B708=\"BOIS\",\"SEAS La Glacière - 1019 Rte de la Grasse\",IF(B708=\"METAUX\",\"PURFER - ZI Carros 15ème Rue - 06517 Carros\",IF(B708=\"BATTERIES\",\"PURFER - ZI Carros 15ème Rue - 06517 Carros\",IF(B708=\"NEON\",\"Sofovar - 126 Av Louis Lépine - 83600 Fréjus\",IF(B708=\"PEINTURES\",\"Orédui - ZI Bois de Grasse - 06310 Grasse\",IF(B708=\"PRODUITS NON IDENTIFIES\",\"Orédui - ZI Bois de Grasse - 06310 Grasse\",IF(B708=\"AEROSOLS\",\"Orédui - ZI Bois de Grasse - 06310 Grasse\",IF(B708=\"FROIDS\",\"SEAS - 1079 Rte de Grasse - 06270 Villeneuve Loubet\",IF(B708=\"HORS FROIDS\",\"SEAS - 1079 Rte de Grasse - 06270 Villeneuve Loubet\",IF(B708=\"PAM\",\"SEAS - 1079 Rte de Grasse - 06270 Villeneuve Loubet\",IF(B708=\"ECRANS\",\"SEAS - 1079 Rte de Grasse - 06270 Villeneuve Loubet\",IF(B708=\"BOX HORS FROIDS\",\"SEAS - 1079 Rte de Grasse - 06270 Villeneuve Loubet\",IF(B708=\"PILES\",\"Corepile\",IF(B708=\"CUMULUS\",\"SEAS - 1079 Rte de Grasse - 06270 Villeneuve Loubet\",IF(B708=\"PNEUS\",\"TFM Pneus - 117 Ch Clausonnes - 06560 Valbonne\",IF(B708=\"HUILES VEGETALES\",\"Orédui - ZI Bois de Grasse - 06310 Grasse\",IF(B708=\"HUILES DE VIDANGE\",\"SERAHU - 68 Ch de la Campanette - 06800 Cagnes sur Mer\")))))))))))))))))))))","v":false},{"$f":"IF(OR(B708=\"TOUT VENANT\",B708=\"DECHETS VERTS\",B708=\"GRAVATS SALES\",B708=\"GRAVATS PROPRES\",B708=\"BOIS\"),\"SUEZ\",IF(OR(B708=\"PNEUS\"),\"TFM\",IF(OR(B708=\"FROIDS\",B708=\"HORS FROIDS\",B708=\"BOX HORS FROIDS\",B708=\"CUMULUS\",B708=\"PAM\",B708=\"ECRANS\"),\"SEAS\",IF(OR(B708=\"METAUX\",B708=\"BATTERIES\"),\"DERICHEBOURG\",IF(OR(B708=\"NEON\"),\"SOFOVAR\",IF(OR(B708=\"PEINTURES\",B708=\"PRODUITS NON IDENTIFIES\",B708=\"AEROSOLS\",B708=\"HUILES VEGETALES\"),\"OREDUI\",IF(OR(B708=\"HUILES DE VIDANGE\"),\"SERAHU\")))))))","v":false}]
[null,null,null,null,null,false,false]
[null,null,null,null,null,false,false]
[null,null,null,null,null,false,false]
[null,null,null,null,null,false,false]
[null,null,null,null,null,false,false]
[null,null,null,null,null,false,false]
[null,null,null,null,null,false,false]
[null,null,null,null,null,false,false]
[null,null,null,null,null,false,false]
[null,null,null,null,null,false,false]
[null,null,null,null,null,false,false]
[null,null,null,null,null,false,false]
[null,null,null,null,null,false,false]
[null,null,null,null,null,false,false]
[null,null,null,null,null,false,false]
[null,null,null,null,null,false,false]
[null,null,null,null,null,false,false]
[null,null,null,null,null,false,false]
[null,null,null,null,null,false,false]
[null,null,null,null,null,false,false]
[null,null,null,null,null,false,false]
[null,null,null,null,null,false,false]
[null,null,null,null,null,false,false]
[null,null,null,null,null,false,false]
[null,null,null,null,null,false,false]
[null,null,null,null,null,false,false]
[null,null,null,null,null,false,false]
[null,null,null,null,null,false,false]
[null,null,null,null,null,false,false]
[null,null,null,null,null,false,false]
[null,null,null,null,null,false,false]
[null,null,null,null,null,false,false]
[null,null,null,null,null,false,false]
[null,null,null,null,null,false,false]
[null,null,null,null,null,false,false]
[null,null,null,null,null,false,false]
[null,null,null,null,null,false,false]
[null,null,null,null,null,false,false]
[null,null,null,null,null,false,false]
[null,null,null,null,null,false,false]
[null,null,null,null,null,false,false]
[null,null,null,null,null,false,false]
[null,null,null,null,null,false,false]
[null,null,null,null,null,false,false]
[null,null,null,null,null,false,false]
[null,null,null,null,null,false,false]
[null,null,null,null,null,false,false]
[null,null,null,null,null,false,false]
[null,null,null,null,null,false,false]
[null,null,null,null,null,false,false]
[null,null,null,null,null,false,false]
[null,null,null,null,null,false,false]
[null,null,null,null,null,false,false]
[null,null,null,null,null,false,false]
[null,null,null,null,null,false,false]
[null,null,null,null,null,false,false]
[null,null,null,null,null,false,false]
[null,null,null,null,null,false,false]
[null,null,null,null,null,false,false]
[null,null,null,null,null,false,false]
[null,null,null,null,null,false,false]
[null,null,null,null,null,false,false]
[null,null,null,null,null,false,false]
[null,null,null,null,null,{"$f":"IF(B772=\"TOUT VENANT\",\"Véolia Nice Tri - Parc d'activité logistique\",IF(B772=\"DECHETS VERTS\",\"Orédui Carros Compostage - ZI de la Grave\",IF(B772=\"GRAVATS PROPRES\",\"La Gaude K3 Sita Sud - 5211 Rte de St Jeannet\",IF(B772=\"GRAVATS SALES\",\"Véolia Nice Tri - 20 Ch du Saquier\",IF(B772=\"BOIS\",\"SEAS La Glacière - 1019 Rte de la Grasse\",IF(B772=\"METAUX\",\"PURFER - ZI Carros 15ème Rue - 06517 Carros\",IF(B772=\"BATTERIES\",\"PURFER - ZI Carros 15ème Rue - 06517 Carros\",IF(B772=\"NEON\",\"Sofovar - 126 Av Louis Lépine - 83600 Fréjus\",IF(B772=\"PEINTURES\",\"Orédui - ZI Bois de Grasse - 06310 Grasse\",IF(B772=\"PRODUITS NON IDENTIFIES\",\"Orédui - ZI Bois de Grasse - 06310 Grasse\",IF(B772=\"AEROSOLS\",\"Orédui - ZI Bois de Grasse - 06310 Grasse\",IF(B772=\"FROIDS\",\"SEAS - 1079 Rte de Grasse - 06270 Villeneuve Loubet\",IF(B772=\"HORS FROIDS\",\"SEAS - 1079 Rte de Grasse - 06270 Villeneuve Loubet\",IF(B772=\"PAM\",\"SEAS - 1079 Rte de Grasse - 06270 Villeneuve Loubet\",IF(B772=\"ECRANS\",\"SEAS - 1079 Rte de Grasse - 06270 Villeneuve Loubet\",IF(B772=\"BOX HORS FROIDS\",\"SEAS - 1079 Rte de Grasse - 06270 Villeneuve Loubet\",IF(B772=\"PILES\",\"Corepile\",IF(B772=\"CUMULUS\",\"SEAS - 1079 Rte de Grasse - 06270 Villeneuve Loubet\",IF(B772=\"PNEUS\",\"TFM Pneus - 117 Ch Clausonnes - 06560 Valbonne\",IF(B772=\"HUILES VEGETALES\",\"Orédui - ZI Bois de Grasse - 06310 Grasse\",IF(B772=\"HUILES DE VIDANGE\",\"SERAHU - 68 Ch de la Campanette - 06800 Cagnes sur Mer\")))))))))))))))))))))","v":false},{"$f":"IF(OR(B772=\"TOUT VENANT\",B772=\"DECHETS VERTS\",B772=\"GRAVATS SALES\",B772=\"GRAVATS PROPRES\",B772=\"BOIS\"),\"SUEZ\",IF(OR(B772=\"PNEUS\"),\"TFM\",IF(OR(B772=\"FROIDS\",B772=\"HORS FROIDS\",B772=\"BOX HORS FROIDS\",B772=\"CUMULUS\",B772=\"PAM\",B772=\"ECRANS\"),\"SEAS\",IF(OR(B772=\"METAUX\",B772=\"BATTERIES\"),\"DERICHEBOURG\",IF(OR(B772=\"NEON\"),\"SOFOVAR\",IF(OR(B772=\"PEINTURES\",B772=\"PRODUITS NON IDENTIFIES\",B772=\"AEROSOLS\",B772=\"HUILES VEGETALES\"),\"OREDUI\",IF(OR(B772=\"HUILES DE VIDANGE\"),\"SERAHU\")))))))","v":false}]
[null,null,null,null,null,false,false]
[null,null,null,null,null,false,false]
[null,null,null,null,null,false,false]
[null,null,null,null,null,false,false]
[null,null,null,null,null,false,false]

{"sheet":"Registre_02","index":20,"n_rows":1000,"n_cols":14,"rows_kept":1000,"cut":false,"hidden":false,"merged":[[16,11,16,12],[24,11,24,12]]}
["Date d'enlèvement","Nature du déchets","Quantité de déchets\n (en kg)","Unité","Installation de destination \n(nom et adresse)","Transporteur ","Immatriculation","Fiche d'intervention","Signature"]
[null,null,null,"",{"$f":"IF(B2=\"TOUT VENANT\",\"Véolia Nice Tri - Parc d'activité logistique\",IF(B2=\"DECHETS VERTS\",\"Orédui Carros Compostage - ZI de la Grave\",IF(B2=\"GRAVATS PROPRES\",\"La Gaude K3 Sita Sud - 5211 Rte de St Jeannet\",IF(B2=\"GRAVATS SALES\",\"Véolia Nice Tri - 20 Ch du Saquier\",IF(B2=\"BOIS\",\"SEAS La Glacière - 1019 Rte de la Grasse\",IF(B2=\"METAUX\",\"PURFER - ZI Carros 15ème Rue - 06517 Carros\",IF(B2=\"BATTERIES\",\"PURFER - ZI Carros 15ème Rue - 06517 Carros\",IF(B2=\"NEON\",\"Sofovar - 126 Av Louis Lépine - 83600 Fréjus\",IF(B2=\"PEINTURES\",\"Orédui - ZI Bois de Grasse - 06310 Grasse\",IF(B2=\"PRODUITS NON IDENTIFIES\",\"Orédui - ZI Bois de Grasse - 06310 Grasse\",IF(B2=\"AEROSOLS\",\"Orédui - ZI Bois de Grasse - 06310 Grasse\",IF(B2=\"FROIDS\",\"SEAS - 1079 Rte de Grasse - 06270 Villeneuve Loubet\",IF(B2=\"HORS FROIDS\",\"SEAS - 1079 Rte de Grasse - 06270 Villeneuve Loubet\",IF(B2=\"PAM\",\"SEAS - 1079 Rte de Grasse - 06270 Villeneuve Loubet\",IF(B2=\"ECRANS\",\"SEAS - 1079 Rte de Grasse - 06270 Villeneuve Loubet\",IF(B2=\"BOX HORS FROIDS\",\"SEAS - 1079 Rte de Grasse - 06270 Villeneuve Loubet\",IF(B2=\"PILES\",\"Corepile\",IF(B2=\"CUMULUS\",\"SEAS - 1079 Rte de Grasse - 06270 Villeneuve Loubet\",IF(B2=\"PNEUS\",\"TFM Pneus - 117 Ch Clausonnes - 06560 Valbonne\",IF(B2=\"HUILES VEGETALES\",\"Orédui - ZI Bois de Grasse - 06310 Grasse\",IF(B2=\"HUILES DE VIDANGE\",\"SERAHU - 68 Ch de la Campanette - 06800 Cagnes sur Mer\")))))))))))))))))))))","v":false},{"$f":"IF(OR(B2=\"TOUT VENANT\",B2=\"DECHETS VERTS\",B2=\"GRAVATS SALES\",B2=\"GRAVATS PROPRES\",B2=\"BOIS\"),\"SUEZ\",IF(OR(B2=\"PNEUS\"),\"TFM\",IF(OR(B2=\"FROIDS\",B2=\"HORS FROIDS\",B2=\"BOX HORS FROIDS\",B2=\"CUMULUS\",B2=\"PAM\",B2=\"ECRANS\"),\"SEAS\",IF(OR(B2=\"METAUX\",B2=\"BATTERIES\"),\"DERICHEBOURG\",IF(OR(B2=\"NEON\"),\"SOFOVAR\",IF(OR(B2=\"PEINTURES\",B2=\"PRODUITS NON IDENTIFIES\",B2=\"AEROSOLS\",B2=\"HUILES VEGETALES\"),\"OREDUI\",IF(OR(B2=\"HUILES DE VIDANGE\"),\"SERAHU\")))))))","v":false}]
[null,null,null,"",false,false]
[null,null,null,"",false,false]
[null,null,null,null,false,false]
[null,null,null,null,false,false]
[null,null,null,null,false,false]
[null,null,null,null,false,false]
[null,null,null,null,false,false]
[null,null,null,null,false,false]
[null,null,null,null,false,false]
[null,null,null,null,false,false]
[null,null,null,null,false,false]
[null,null,null,null,false,false]
[null,null,null,null,false,false]
[null,null,null,null,false,false]
[null,null,null,null,false,false,null,null,null,null,null,"PRESTATIONS JOURNALIERES SUEZ"]
[null,null,null,null,false,false,null,null,null,null,null,"6 TV ","6 ROTATIONS DE CAMION AMPIROLES"]
[null,null,null,null,false,false,null,null,null,null,null,"6 TV ","3 ROTATIONS DE CAMION GRAPPIN","LUNDI 4 ROTATIONS DE GRAPPIN"]
[null,null,null,null,false,false,null,null,null,null,null,"2 GRAVATS SALES","1  MATIN ET 1 APRES MIDI"]
[null,null,null,null,false,false,null,null,null,null,null,"3 GRAVATS PROPRES","3 ROTATIONS DE CAMION AMPIROLES"]
[null,null,null,null,false,false,null,null,null,null,null,"2 DECHETS VERTS","2 ROTATIONS DE CAMION AMPIROLES"]
[null,null,null,null,false,false,null,null,null,null,null,"2 BOIS","2 ROTATIONS DE CAMION AMPIROLES"]
[null,null,null,null,false,false,null,null,null,null,null,"1 METAUX","1 ROTATION DE CAMION GRAPPIN"]
[null,null,null,null,false,false,null,null,null,null,null,"Le samedi présence d'un camion minimum jusqu'à 16H"]
[null,null,null,null,false,false]
[null,null,null,null,false,false]
[null,null,null,null,false,false]
[null,null,null,null,false,false]
[null,null,null,null,false,false]
[null,null,null,null,false,false]
[null,null,null,null,false,false]
[null,null,null,null,false,false]
[null,null,null,null,false,false]
[null,null,null,null,false,false]
[null,null,null,null,false,false]
[null,null,null,null,false,false]
[null,null,null,null,false,false]
[null,null,null,null,false,false]
[null,null,null,null,false,false]
[null,null,null,null,false,false]
[null,null,null,null,false,false]
[null,null,null,null,false,false]
[null,null,null,null,false,false]
[null,null,null,null,false,false]
[null,null,null,null,false,false]
[null,null,null,null,false,false]
[null,null,null,null,false,false]
[null,null,null,null,false,false]
[null,null,null,null,false,false]
[null,null,null,null,false,false]
[null,null,null,null,false,false]
[null,null,null,null,false,false]
[null,null,null,null,false,false]
[null,null,null,null,false,false]
[null,null,null,null,false,false]
[null,null,null,null,false,false]
[null,null,null,null,false,false]
[null,null,null,null,false,false]
[null,null,null,null,false,false]
[null,null,null,null,false,false]
[null,null,null,null,false,false]
[null,null,null,null,false,false]
[null,null,null,null,false,false]
[null,null,null,null,false,false]
[null,null,null,null,{"$f":"IF(B66=\"TOUT VENANT\",\"Véolia Nice Tri - Parc d'activité logistique\",IF(B66=\"DECHETS VERTS\",\"Orédui Carros Compostage - ZI de la Grave\",IF(B66=\"GRAVATS PROPRES\",\"La Gaude K3 Sita Sud - 5211 Rte de St Jeannet\",IF(B66=\"GRAVATS SALES\",\"Véolia Nice Tri - 20 Ch du Saquier\",IF(B66=\"BOIS\",\"SEAS La Glacière - 1019 Rte de la Grasse\",IF(B66=\"METAUX\",\"PURFER - ZI Carros 15ème Rue - 06517 Carros\",IF(B66=\"BATTERIES\",\"PURFER - ZI Carros 15ème Rue - 06517 Carros\",IF(B66=\"NEON\",\"Sofovar - 126 Av Louis Lépine - 83600 Fréjus\",IF(B66=\"PEINTURES\",\"Orédui - ZI Bois de Grasse - 06310 Grasse\",IF(B66=\"PRODUITS NON IDENTIFIES\",\"Orédui - ZI Bois de Grasse - 06310 Grasse\",IF(B66=\"AEROSOLS\",\"Orédui - ZI Bois de Grasse - 06310 Grasse\",IF(B66=\"FROIDS\",\"SEAS - 1079 Rte de Grasse - 06270 Villeneuve Loubet\",IF(B66=\"HORS FROIDS\",\"SEAS - 1079 Rte de Grasse - 06270 Villeneuve Loubet\",IF(B66=\"PAM\",\"SEAS - 1079 Rte de Grasse - 06270 Villeneuve Loubet\",IF(B66=\"ECRANS\",\"SEAS - 1079 Rte de Grasse - 06270 Villeneuve Loubet\",IF(B66=\"BOX HORS FROIDS\",\"SEAS - 1079 Rte de Grasse - 06270 Villeneuve Loubet\",IF(B66=\"PILES\",\"Corepile\",IF(B66=\"CUMULUS\",\"SEAS - 1079 Rte de Grasse - 06270 Villeneuve Loubet\",IF(B66=\"PNEUS\",\"TFM Pneus - 117 Ch Clausonnes - 06560 Valbonne\",IF(B66=\"HUILES VEGETALES\",\"Orédui - ZI Bois de Grasse - 06310 Grasse\",IF(B66=\"HUILES DE VIDANGE\",\"SERAHU - 68 Ch de la Campanette - 06800 Cagnes sur Mer\")))))))))))))))))))))","v":false},{"$f":"IF(OR(B66=\"TOUT VENANT\",B66=\"DECHETS VERTS\",B66=\"GRAVATS SALES\",B66=\"GRAVATS PROPRES\",B66=\"BOIS\"),\"SUEZ\",IF(OR(B66=\"PNEUS\"),\"TFM\",IF(OR(B66=\"FROIDS\",B66=\"HORS FROIDS\",B66=\"BOX HORS FROIDS\",B66=\"CUMULUS\",B66=\"PAM\",B66=\"ECRANS\"),\"SEAS\",IF(OR(B66=\"METAUX\",B66=\"BATTERIES\"),\"DERICHEBOURG\",IF(OR(B66=\"NEON\"),\"SOFOVAR\",IF(OR(B66=\"PEINTURES\",B66=\"PRODUITS NON IDENTIFIES\",B66=\"AEROSOLS\",B66=\"HUILES VEGETALES\"),\"OREDUI\",IF(OR(B66=\"HUILES DE VIDANGE\"),\"SERAHU\")))))))","v":false}]
[null,null,null,null,false,false]
[null,null,null,null,false,false]
[null,null,null,null,false,false]
[null,null,null,null,false,false]
[null,null,null,null,false,false]
[null,null,null,null,false,false]
[null,null,null,null,false,false]
[null,null,null,null,false,false]
[null,null,null,null,false,false]
[null,null,null,null,false,false]
[null,null,null,null,false,false]
[null,null,null,null,false,false]
[null,null,null,null,false,false]
[null,null,null,null,false,false]
[null,null,null,null,false,false]
[null,null,null,null,false,false]
[null,null,null,null,false,false]
[null,null,null,null,false,false]
[null,null,null,null,false,false]
[null,null,null,null,false,false]
[null,null,null,null,false,false]
[null,null,null,null,false,false]
[null,null,null,null,false,false]
[null,null,null,null,false,false]
[null,null,null,null,false,false]
[null,null,null,null,false,false]
[null,null,null,null,false,false]
[null,null,null,null,false,false]
[null,null,null,null,false,false]
[null,null,null,null,false,false]
[null,null,null,null,false,false]
[null,null,null,null,false,false]
[null,null,null,null,false,false]
[null,null,null,null,false,false]
[null,null,null,null,false,false]
[null,null,null,null,false,false]
[null,null,null,null,false,false]
[null,null,null,null,false,false]
[null,null,null,null,false,false]
[null,null,null,null,false,false]
[null,null,null,null,false,false]
[null,null,null,null,false,false]
[null,null,null,null,false,false]
[null,null,null,null,false,false]
[null,null,null,null,false,false]
[null,null,null,null,false,false]
[null,null,null,null,false,false]
[null,null,null,null,false,false]
[null,null,null,null,false,false]
[null,null,null,null,false,false]
[null,null,null,null,false,false]
[null,null,null,null,false,false]
[null,null,null,null,false,false]
[null,null,null,null,false,false]
[null,null,null,null,false,false]
[null,null,null,null,false,false]
[null,null,null,null,false,false]
[null,null,null,null,false,false]
[null,null,null,null,false,false]
[null,null,null,null,false,false]
[null,null,null,null,false,false]
[null,null,null,null,false,false]
[null,null,null,null,false,false]
[null,null,null,null,{"$f":"IF(B130=\"TOUT VENANT\",\"Véolia Nice Tri - Parc d'activité logistique\",IF(B130=\"DECHETS VERTS\",\"Orédui Carros Compostage - ZI de la Grave\",IF(B130=\"GRAVATS PROPRES\",\"La Gaude K3 Sita Sud - 5211 Rte de St Jeannet\",IF(B130=\"GRAVATS SALES\",\"Véolia Nice Tri - 20 Ch du Saquier\",IF(B130=\"BOIS\",\"SEAS La Glacière - 1019 Rte de la Grasse\",IF(B130=\"METAUX\",\"PURFER - ZI Carros 15ème Rue - 06517 Carros\",IF(B130=\"BATTERIES\",\"PURFER - ZI Carros 15ème Rue - 06517 Carros\",IF(B130=\"NEON\",\"Sofovar - 126 Av Louis Lépine - 83600 Fréjus\",IF(B130=\"PEINTURES\",\"Orédui - ZI Bois de Grasse - 06310 Grasse\",IF(B130=\"PRODUITS NON IDENTIFIES\",\"Orédui - ZI Bois de Grasse - 06310 Grasse\",IF(B130=\"AEROSOLS\",\"Orédui - ZI Bois de Grasse - 06310 Grasse\",IF(B130=\"FROIDS\",\"SEAS - 1079 Rte de Grasse - 06270 Villeneuve Loubet\",IF(B130=\"HORS FROIDS\",\"SEAS - 1079 Rte de Grasse - 06270 Villeneuve Loubet\",IF(B130=\"PAM\",\"SEAS - 1079 Rte de Grasse - 06270 Villeneuve Loubet\",IF(B130=\"ECRANS\",\"SEAS - 1079 Rte de Grasse - 06270 Villeneuve Loubet\",IF(B130=\"BOX HORS FROIDS\",\"SEAS - 1079 Rte de Grasse - 06270 Villeneuve Loubet\",IF(B130=\"PILES\",\"Corepile\",IF(B130=\"CUMULUS\",\"SEAS - 1079 Rte de Grasse - 06270 Villeneuve Loubet\",IF(B130=\"PNEUS\",\"TFM Pneus - 117 Ch Clausonnes - 06560 Valbonne\",IF(B130=\"HUILES VEGETALES\",\"Orédui - ZI Bois de Grasse - 06310 Grasse\",IF(B130=\"HUILES DE VIDANGE\",\"SERAHU - 68 Ch de la Campanette - 06800 Cagnes sur Mer\")))))))))))))))))))))","v":false},{"$f":"IF(OR(B130=\"TOUT VENANT\",B130=\"DECHETS VERTS\",B130=\"GRAVATS SALES\",B130=\"GRAVATS PROPRES\",B130=\"BOIS\"),\"SUEZ\",IF(OR(B130=\"PNEUS\"),\"TFM\",IF(OR(B130=\"FROIDS\",B130=\"HORS FROIDS\",B130=\"BOX HORS FROIDS\",B130=\"CUMULUS\",B130=\"PAM\",B130=\"ECRANS\"),\"SEAS\",IF(OR(B130=\"METAUX\",B130=\"BATTERIES\"),\"DERICHEBOURG\",IF(OR(B130=\"NEON\"),\"SOFOVAR\",IF(OR(B130=\"PEINTURES\",B130=\"PRODUITS NON IDENTIFIES\",B130=\"AEROSOLS\",B130=\"HUILES VEGETALES\"),\"OREDUI\",IF(OR(B130=\"HUILES DE VIDANGE\"),\"SERAHU\")))))))","v":false}]
[null,null,null,null,false,false]
[null,null,null,null,false,false]
[null,null,null,null,false,false]
[null,null,null,null,false,false]
[null,null,null,null,false,false]
[null,null,null,null,false,false]
[null,null,null,null,false,false]
[null,null,null,null,false,false]
[null,null,null,null,false,false]
[null,null,null,null,false,false]
[null,null,null,null,false,false]
[null,null,null,null,false,false]
[null,null,null,null,false,false]
[null,null,null,null,false,false]
[null,null,null,null,false,false]
[null,null,null,null,false,false]
[null,null,null,null,false,false]
[null,null,null,null,false,false]
[null,null,null,null,false,false]
[null,null,null,null,false,false]
[null,null,null,null,false,false]
[null,null,null,null,false,false]
[null,null,null,null,false,false]
[null,null,null,null,false,false]
[null,null,null,null,false,false]
[null,null,null,null,false,false]
[null,null,null,null,false,false]
[null,null,null,null,false,false]
[null,null,null,null,false,false]
[null,null,null,null,false,false]
[null,null,null,null,false,false]
[null,null,null,null,false,false]
[null,null,null,null,false,false]
[null,null,null,null,false,false]
[null,null,null,null,false,false]
[null,null,null,null,false,false]
[null,null,null,null,false,false]
[null,null,null,null,false,false]
[null,null,null,null,false,false]
[null,null,null,null,false,false]
[null,null,null,null,false,false]
[null,null,null,null,false,false]
[null,null,null,null,false,false]
[null,null,null,null,false,false]
[null,null,null,null,false,false]
[null,null,null,null,false,false]
[null,null,null,null,false,false]
[null,null,null,null,false,false]
[null,null,null,null,false,false]
[null,null,null,null,false,false]
[null,null,null,null,false,false]
[null,null,null,null,false,false]
[null,null,null,null,false,false]
[null,null,null,null,false,false]
[null,null,null,null,false,false]
[null,null,null,null,false,false]
[null,null,null,null,false,false]
[null,null,null,null,false,false]
[null,null,null,null,false,false]
[null,null,null,null,false,false]
[null,null,null,null,false,false]
[null,null,null,null,false,false]
[null,null,null,null,false,false]
[null,null,null,null,{"$f":"IF(B194=\"TOUT VENANT\",\"Véolia Nice Tri - Parc d'activité logistique\",IF(B194=\"DECHETS VERTS\",\"Orédui Carros Compostage - ZI de la Grave\",IF(B194=\"GRAVATS PROPRES\",\"La Gaude K3 Sita Sud - 5211 Rte de St Jeannet\",IF(B194=\"GRAVATS SALES\",\"Véolia Nice Tri - 20 Ch du Saquier\",IF(B194=\"BOIS\",\"SEAS La Glacière - 1019 Rte de la Grasse\",IF(B194=\"METAUX\",\"PURFER - ZI Carros 15ème Rue - 06517 Carros\",IF(B194=\"BATTERIES\",\"PURFER - ZI Carros 15ème Rue - 06517 Carros\",IF(B194=\"NEON\",\"Sofovar - 126 Av Louis Lépine - 83600 Fréjus\",IF(B194=\"PEINTURES\",\"Orédui - ZI Bois de Grasse - 06310 Grasse\",IF(B194=\"PRODUITS NON IDENTIFIES\",\"Orédui - ZI Bois de Grasse - 06310 Grasse\",IF(B194=\"AEROSOLS\",\"Orédui - ZI Bois de Grasse - 06310 Grasse\",IF(B194=\"FROIDS\",\"SEAS - 1079 Rte de Grasse - 06270 Villeneuve Loubet\",IF(B194=\"HORS FROIDS\",\"SEAS - 1079 Rte de Grasse - 06270 Villeneuve Loubet\",IF(B194=\"PAM\",\"SEAS - 1079 Rte de Grasse - 06270 Villeneuve Loubet\",IF(B194=\"ECRANS\",\"SEAS - 1079 Rte de Grasse - 06270 Villeneuve Loubet\",IF(B194=\"BOX HORS FROIDS\",\"SEAS - 1079 Rte de Grasse - 06270 Villeneuve Loubet\",IF(B194=\"PILES\",\"Corepile\",IF(B194=\"CUMULUS\",\"SEAS - 1079 Rte de Grasse - 06270 Villeneuve Loubet\",IF(B194=\"PNEUS\",\"TFM Pneus - 117 Ch Clausonnes - 06560 Valbonne\",IF(B194=\"HUILES VEGETALES\",\"Orédui - ZI Bois de Grasse - 06310 Grasse\",IF(B194=\"HUILES DE VIDANGE\",\"SERAHU - 68 Ch de la Campanette - 06800 Cagnes sur Mer\")))))))))))))))))))))","v":false},{"$f":"IF(OR(B194=\"TOUT VENANT\",B194=\"DECHETS VERTS\",B194=\"GRAVATS SALES\",B194=\"GRAVATS PROPRES\",B194=\"BOIS\"),\"SUEZ\",IF(OR(B194=\"PNEUS\"),\"TFM\",IF(OR(B194=\"FROIDS\",B194=\"HORS FROIDS\",B194=\"BOX HORS FROIDS\",B194=\"CUMULUS\",B194=\"PAM\",B194=\"ECRANS\"),\"SEAS\",IF(OR(B194=\"METAUX\",B194=\"BATTERIES\"),\"DERICHEBOURG\",IF(OR(B194=\"NEON\"),\"SOFOVAR\",IF(OR(B194=\"PEINTURES\",B194=\"PRODUITS NON IDENTIFIES\",B194=\"AEROSOLS\",B194=\"HUILES VEGETALES\"),\"OREDUI\",IF(OR(B194=\"HUILES DE VIDANGE\"),\"SERAHU\")))))))","v":false}]
[null,null,null,null,false,false]
[null,null,null,null,false,false]
[null,null,null,null,false,false]
[null,null,null,null,false,false]
[null,null,null,null,false,false]
[null,null,null,null,false,false]
[null,null,null,null,false,false]
[null,null,null,null,false,false]
[null,null,null,null,false,false]
[null,null,null,null,false,false]
[null,null,null,null,false,false]
[null,null,null,null,false,false]
[null,null,null,null,false,false]
[null,null,null,null,false,false]
[null,null,null,null,false,false]
[null,null,null,null,false,false]
[null,null,null,null,false,false]
[null,null,null,null,false,false]
[null,null,null,null,false,false]
[null,null,null,null,false,false]
[null,null,null,null,false,false]
[null,null,null,null,false,false]
[null,null,null,null,false,false]
[null,null,null,null,false,false]
[null,null,null,null,false,false]
[null,null,null,null,false,false]
[null,null,null,null,false,false]
[null,null,null,null,false,false]
[null,null,null,null,false,false]
[null,null,null,null,false,false]
[null,null,null,null,false,false]
[null,null,null,null,false,false]
[null,null,null,null,false,false]
[null,null,null,null,false,false]
[null,null,null,null,false,false]
[null,null,null,null,false,false]
[null,null,null,null,false,false]
[null,null,null,null,false,false]
[null,null,null,null,false,false]
[null,null,null,null,false,false]
[null,null,null,null,false,false]
[null,null,null,null,false,false]
[null,null,null,null,false,false]
[null,null,null,null,false,false]
[null,null,null,null,false,false]
[null,null,null,null,false,false]
[null,null,null,null,false,false]
[null,null,null,null,false,false]
[null,null,null,null,false,false]
[null,null,null,null,false,false]
[null,null,null,null,false,false]
[null,null,null,null,false,false]
[null,null,null,null,false,false]
[null,null,null,null,false,false]
[null,null,null,null,false,false]
[null,null,null,null,false,false]
[null,null,null,null,false,false]
[null,null,null,null,false,false]
[null,null,null,null,false,false]
[null,null,null,null,false,false]
[null,null,null,null,false,false]
[null,null,null,null,false,false]
[null,null,null,null,false,false]
[null,null,null,null,{"$f":"IF(B258=\"TOUT VENANT\",\"Véolia Nice Tri - Parc d'activité logistique\",IF(B258=\"DECHETS VERTS\",\"Orédui Carros Compostage - ZI de la Grave\",IF(B258=\"GRAVATS PROPRES\",\"La Gaude K3 Sita Sud - 5211 Rte de St Jeannet\",IF(B258=\"GRAVATS SALES\",\"Véolia Nice Tri - 20 Ch du Saquier\",IF(B258=\"BOIS\",\"SEAS La Glacière - 1019 Rte de la Grasse\",IF(B258=\"METAUX\",\"PURFER - ZI Carros 15ème Rue - 06517 Carros\",IF(B258=\"BATTERIES\",\"PURFER - ZI Carros 15ème Rue - 06517 Carros\",IF(B258=\"NEON\",\"Sofovar - 126 Av Louis Lépine - 83600 Fréjus\",IF(B258=\"PEINTURES\",\"Orédui - ZI Bois de Grasse - 06310 Grasse\",IF(B258=\"PRODUITS NON IDENTIFIES\",\"Orédui - ZI Bois de Grasse - 06310 Grasse\",IF(B258=\"AEROSOLS\",\"Orédui - ZI Bois de Grasse - 06310 Grasse\",IF(B258=\"FROIDS\",\"SEAS - 1079 Rte de Grasse - 06270 Villeneuve Loubet\",IF(B258=\"HORS FROIDS\",\"SEAS - 1079 Rte de Grasse - 06270 Villeneuve Loubet\",IF(B258=\"PAM\",\"SEAS - 1079 Rte de Grasse - 06270 Villeneuve Loubet\",IF(B258=\"ECRANS\",\"SEAS - 1079 Rte de Grasse - 06270 Villeneuve Loubet\",IF(B258=\"BOX HORS FROIDS\",\"SEAS - 1079 Rte de Grasse - 06270 Villeneuve Loubet\",IF(B258=\"PILES\",\"Corepile\",IF(B258=\"CUMULUS\",\"SEAS - 1079 Rte de Grasse - 06270 Villeneuve Loubet\",IF(B258=\"PNEUS\",\"TFM Pneus - 117 Ch Clausonnes - 06560 Valbonne\",IF(B258=\"HUILES VEGETALES\",\"Orédui - ZI Bois de Grasse - 06310 Grasse\",IF(B258=\"HUILES DE VIDANGE\",\"SERAHU - 68 Ch de la Campanette - 06800 Cagnes sur Mer\")))))))))))))))))))))","v":false},{"$f":"IF(OR(B258=\"TOUT VENANT\",B258=\"DECHETS VERTS\",B258=\"GRAVATS SALES\",B258=\"GRAVATS PROPRES\",B258=\"BOIS\"),\"SUEZ\",IF(OR(B258=\"PNEUS\"),\"TFM\",IF(OR(B258=\"FROIDS\",B258=\"HORS FROIDS\",B258=\"BOX HORS FROIDS\",B258=\"CUMULUS\",B258=\"PAM\",B258=\"ECRANS\"),\"SEAS\",IF(OR(B258=\"METAUX\",B258=\"BATTERIES\"),\"DERICHEBOURG\",IF(OR(B258=\"NEON\"),\"SOFOVAR\",IF(OR(B258=\"PEINTURES\",B258=\"PRODUITS NON IDENTIFIES\",B258=\"AEROSOLS\",B258=\"HUILES VEGETALES\"),\"OREDUI\",IF(OR(B258=\"HUILES DE VIDANGE\"),\"SERAHU\")))))))","v":false}]
[null,null,null,null,false,false]
[null,null,null,null,false,false]
[null,null,null,null,false,false]
[null,null,null,null,false,false]
[null,null,null,null,false,false]
[null,null,null,null,false,false]
[null,null,null,null,false,false]
[null,null,null,null,false,false]
[null,null,null,null,false,false]
[null,null,null,null,false,false]
[null,null,null,null,false,false]
[null,null,null,null,false,false]
[null,null,null,null,false,false]
[null,null,null,null,false,false]
[null,null,null,null,false,false]
[null,null,null,null,false,false]
[null,null,null,null,false,false]
[null,null,null,null,false,false]
[null,null,null,null,false,false]
[null,null,null,null,false,false]
[null,null,null,null,false,false]
[null,null,null,null,false,false]
[null,null,null,null,false,false]
[null,null,null,null,false,false]
[null,null,null,null,false,false]
[null,null,null,null,false,false]
[null,null,null,null,false,false]
[null,null,null,null,false,false]
[null,null,null,null,false,false]
[null,null,null,null,false,false]
[null,null,null,null,false,false]
[null,null,null,null,false,false]
[null,null,null,null,false,false]
[null,null,null,null,false,false]
[null,null,null,null,false,false]
[null,null,null,null,false,false]
[null,null,null,null,false,false]
[null,null,null,null,false,false]
[null,null,null,null,false,false]
[null,null,null,null,false,false]
[null,null,null,null,false,false]
[null,null,null,null,false,false]
[null,null,null,null,false,false]
[null,null,null,null,false,false]
[null,null,null,null,false,false]
[null,null,null,null,false,false]
[null,null,null,null,false,false]
[null,null,null,null,false,false]
[null,null,null,null,false,false]
[null,null,null,null,false,false]
[null,null,null,null,false,false]
[null,null,null,null,false,false]
[null,null,null,null,false,false]
[null,null,null,null,false,false]
[null,null,null,null,false,false]
[null,null,null,null,false,false]
[null,null,null,null,false,false]
[null,null,null,null,false,false]
[null,null,null,null,false,false]
[null,null,null,null,false,false]
[null,null,null,null,false,false]
[null,null,null,null,false,false]
[null,null,null,null,false,false]
[null,null,null,null,{"$f":"IF(B322=\"TOUT VENANT\",\"Véolia Nice Tri - Parc d'activité logistique\",IF(B322=\"DECHETS VERTS\",\"Orédui Carros Compostage - ZI de la Grave\",IF(B322=\"GRAVATS PROPRES\",\"La Gaude K3 Sita Sud - 5211 Rte de St Jeannet\",IF(B322=\"GRAVATS SALES\",\"Véolia Nice Tri - 20 Ch du Saquier\",IF(B322=\"BOIS\",\"SEAS La Glacière - 1019 Rte de la Grasse\",IF(B322=\"METAUX\",\"PURFER - ZI Carros 15ème Rue - 06517 Carros\",IF(B322=\"BATTERIES\",\"PURFER - ZI Carros 15ème Rue - 06517 Carros\",IF(B322=\"NEON\",\"Sofovar - 126 Av Louis Lépine - 83600 Fréjus\",IF(B322=\"PEINTURES\",\"Orédui - ZI Bois de Grasse - 06310 Grasse\",IF(B322=\"PRODUITS NON IDENTIFIES\",\"Orédui - ZI Bois de Grasse - 06310 Grasse\",IF(B322=\"AEROSOLS\",\"Orédui - ZI Bois de Grasse - 06310 Grasse\",IF(B322=\"FROIDS\",\"SEAS - 1079 Rte de Grasse - 06270 Villeneuve Loubet\",IF(B322=\"HORS FROIDS\",\"SEAS - 1079 Rte de Grasse - 06270 Villeneuve Loubet\",IF(B322=\"PAM\",\"SEAS - 1079 Rte de Grasse - 06270 Villeneuve Loubet\",IF(B322=\"ECRANS\",\"SEAS - 1079 Rte de Grasse - 06270 Villeneuve Loubet\",IF(B322=\"BOX HORS FROIDS\",\"SEAS - 1079 Rte de Grasse - 06270 Villeneuve Loubet\",IF(B322=\"PILES\",\"Corepile\",IF(B322=\"CUMULUS\",\"SEAS - 1079 Rte de Grasse - 06270 Villeneuve Loubet\",IF(B322=\"PNEUS\",\"TFM Pneus - 117 Ch Clausonnes - 06560 Valbonne\",IF(B322=\"HUILES VEGETALES\",\"Orédui - ZI Bois de Grasse - 06310 Grasse\",IF(B322=\"HUILES DE VIDANGE\",\"SERAHU - 68 Ch de la Campanette - 06800 Cagnes sur Mer\")))))))))))))))))))))","v":false},{"$f":"IF(OR(B322=\"TOUT VENANT\",B322=\"DECHETS VERTS\",B322=\"GRAVATS SALES\",B322=\"GRAVATS PROPRES\",B322=\"BOIS\"),\"SUEZ\",IF(OR(B322=\"PNEUS\"),\"TFM\",IF(OR(B322=\"FROIDS\",B322=\"HORS FROIDS\",B322=\"BOX HORS FROIDS\",B322=\"CUMULUS\",B322=\"PAM\",B322=\"ECRANS\"),\"SEAS\",IF(OR(B322=\"METAUX\",B322=\"BATTERIES\"),\"DERICHEBOURG\",IF(OR(B322=\"NEON\"),\"SOFOVAR\",IF(OR(B322=\"PEINTURES\",B322=\"PRODUITS NON IDENTIFIES\",B322=\"AEROSOLS\",B322=\"HUILES VEGETALES\"),\"OREDUI\",IF(OR(B322=\"HUILES DE VIDANGE\"),\"SERAHU\")))))))","v":false}]
[null,null,null,null,false,false]
[null,null,null,null,false,false]
[null,null,null,null,false,false]
[null,null,null,null,false,false]
[null,null,null,null,false,false]
[null,null,null,null,false,false]
[null,null,null,null,false,false]
[null,null,null,null,false,false]
[null,null,null,null,false,false]
[null,null,null,null,false,false]
[null,null,null,null,false,false]
[null,null,null,null,false,false]
[null,null,null,null,false,false]
[null,null,null,null,false,false]
[null,null,null,null,false,false]
[null,null,null,null,false,false]
[null,null,null,null,false,false]
[null,null,null,null,false,false]
[null,null,null,null,false,false]
[null,null,null,null,false,false]
[null,null,null,null,false,false]
[null,null,null,null,false,false]
[null,null,null,null,false,false]
[null,null,null,null,false,false]
[null,null,null,null,false,false]
[null,null,null,null,false,false]
[null,null,null,null,false,false]
[null,null,null,null,false,false]
[null,null,null,null,false,false]
[null,null,null,null,false,false]
[null,null,null,null,false,false]
[null,null,null,null,false,false]
[null,null,null,null,false,false]
[null,null,null,null,false,false]
[null,null,null,null,false,false]
[null,null,null,null,false,false]
[null,null,null,null,false,false]
[null,null,null,null,false,false]
[null,null,null,null,false,false]
[null,null,null,null,false,false]
[null,null,null,null,false,false]
[null,null,null,null,false,false]
[null,null,null,null,false,false]
[null,null,null,null,false,false]
[null,null,null,null,false,false]
[null,null,null,null,false,false]
[null,null,null,null,false,false]
[null,null,null,null,false,false]
[null,null,null,null,false,false]
[null,null,null,null,false,false]
[null,null,null,null,false,false]
[null,null,null,null,false,false]
[null,null,null,null,false,false]
[null,null,null,null,false,false]
[null,null,null,null,false,false]
[null,null,null,null,false,false]
[null,null,null,null,false,false]
[null,null,null,null,false,false]
[null,null,null,null,false,false]
[null,null,null,null,false,false]
[null,null,null,null,false,false]
[null,null,null,null,false,false]
[null,null,null,null,false,false]
[null,null,null,null,{"$f":"IF(B386=\"TOUT VENANT\",\"Véolia Nice Tri - Parc d'activité logistique\",IF(B386=\"DECHETS VERTS\",\"Orédui Carros Compostage - ZI de la Grave\",IF(B386=\"GRAVATS PROPRES\",\"La Gaude K3 Sita Sud - 5211 Rte de St Jeannet\",IF(B386=\"GRAVATS SALES\",\"Véolia Nice Tri - 20 Ch du Saquier\",IF(B386=\"BOIS\",\"SEAS La Glacière - 1019 Rte de la Grasse\",IF(B386=\"METAUX\",\"PURFER - ZI Carros 15ème Rue - 06517 Carros\",IF(B386=\"BATTERIES\",\"PURFER - ZI Carros 15ème Rue - 06517 Carros\",IF(B386=\"NEON\",\"Sofovar - 126 Av Louis Lépine - 83600 Fréjus\",IF(B386=\"PEINTURES\",\"Orédui - ZI Bois de Grasse - 06310 Grasse\",IF(B386=\"PRODUITS NON IDENTIFIES\",\"Orédui - ZI Bois de Grasse - 06310 Grasse\",IF(B386=\"AEROSOLS\",\"Orédui - ZI Bois de Grasse - 06310 Grasse\",IF(B386=\"FROIDS\",\"SEAS - 1079 Rte de Grasse - 06270 Villeneuve Loubet\",IF(B386=\"HORS FROIDS\",\"SEAS - 1079 Rte de Grasse - 06270 Villeneuve Loubet\",IF(B386=\"PAM\",\"SEAS - 1079 Rte de Grasse - 06270 Villeneuve Loubet\",IF(B386=\"ECRANS\",\"SEAS - 1079 Rte de Grasse - 06270 Villeneuve Loubet\",IF(B386=\"BOX HORS FROIDS\",\"SEAS - 1079 Rte de Grasse - 06270 Villeneuve Loubet\",IF(B386=\"PILES\",\"Corepile\",IF(B386=\"CUMULUS\",\"SEAS - 1079 Rte de Grasse - 06270 Villeneuve Loubet\",IF(B386=\"PNEUS\",\"TFM Pneus - 117 Ch Clausonnes - 06560 Valbonne\",IF(B386=\"HUILES VEGETALES\",\"Orédui - ZI Bois de Grasse - 06310 Grasse\",IF(B386=\"HUILES DE VIDANGE\",\"SERAHU - 68 Ch de la Campanette - 06800 Cagnes sur Mer\")))))))))))))))))))))","v":false},{"$f":"IF(OR(B386=\"TOUT VENANT\",B386=\"DECHETS VERTS\",B386=\"GRAVATS SALES\",B386=\"GRAVATS PROPRES\",B386=\"BOIS\"),\"SUEZ\",IF(OR(B386=\"PNEUS\"),\"TFM\",IF(OR(B386=\"FROIDS\",B386=\"HORS FROIDS\",B386=\"BOX HORS FROIDS\",B386=\"CUMULUS\",B386=\"PAM\",B386=\"ECRANS\"),\"SEAS\",IF(OR(B386=\"METAUX\",B386=\"BATTERIES\"),\"DERICHEBOURG\",IF(OR(B386=\"NEON\"),\"SOFOVAR\",IF(OR(B386=\"PEINTURES\",B386=\"PRODUITS NON IDENTIFIES\",B386=\"AEROSOLS\",B386=\"HUILES VEGETALES\"),\"OREDUI\",IF(OR(B386=\"HUILES DE VIDANGE\"),\"SERAHU\")))))))","v":false}]
[null,null,null,null,false,false]
[null,null,null,null,false,false]
[null,null,null,null,false,false]
[null,null,null,null,false,false]
[null,null,null,null,false,false]
[null,null,null,null,false,false]
[null,null,null,null,false,false]
[null,null,null,null,false,false]
[null,null,null,null,false,false]
[null,null,null,null,false,false]
[null,null,null,null,false,false]
[null,null,null,null,false,false]
[null,null,null,null,false,false]
[null,null,null,null,false,false]
[null,null,null,null,false,false]
[null,null,null,null,false,false]
[null,null,null,null,false,false]
[null,null,null,null,false,false]
[null,null,null,null,false,false]
[null,null,null,null,false,false]
[null,null,null,null,false,false]
[null,null,null,null,false,false]
[null,null,null,null,false,false]
[null,null,null,null,false,false]
[null,null,null,null,false,false]
[null,null,null,null,false,false]
[null,null,null,null,false,false]
[null,null,null,null,false,false]
[null,null,null,null,false,false]
[null,null,null,null,false,false]
[null,null,null,null,false,false]
[null,null,null,null,false,false]
[null,null,null,null,false,false]
[null,null,null,null,false,false]
[null,null,null,null,false,false]
[null,null,null,null,false,false]
[null,null,null,null,false,false]
[null,null,null,null,false,false]
[null,null,null,null,false,false]
[null,null,null,null,false,false]
[null,null,null,null,false,false]
[null,null,null,null,false,false]
[null,null,null,null,false,false]
[null,null,null,null,false,false]
[null,null,null,null,false,false]
[null,null,null,null,false,false]
[null,null,null,null,false,false]
[null,null,null,null,false,false]
[null,null,null,null,false,false]
[null,null,null,null,false,false]
[null,null,null,null,false,false]
[null,null,null,null,false,false]
[null,null,null,null,false,false]
[null,null,null,null,false,false]
[null,null,null,null,false,false]
[null,null,null,null,false,false]
[null,null,null,null,false,false]
[null,null,null,null,false,false]
[null,null,null,null,false,false]
[null,null,null,null,false,false]
[null,null,null,null,false,false]
[null,null,null,null,false,false]
[null,null,null,null,false,false]
[null,null,null,null,{"$f":"IF(B450=\"TOUT VENANT\",\"Véolia Nice Tri - Parc d'activité logistique\",IF(B450=\"DECHETS VERTS\",\"Orédui Carros Compostage - ZI de la Grave\",IF(B450=\"GRAVATS PROPRES\",\"La Gaude K3 Sita Sud - 5211 Rte de St Jeannet\",IF(B450=\"GRAVATS SALES\",\"Véolia Nice Tri - 20 Ch du Saquier\",IF(B450=\"BOIS\",\"SEAS La Glacière - 1019 Rte de la Grasse\",IF(B450=\"METAUX\",\"PURFER - ZI Carros 15ème Rue - 06517 Carros\",IF(B450=\"BATTERIES\",\"PURFER - ZI Carros 15ème Rue - 06517 Carros\",IF(B450=\"NEON\",\"Sofovar - 126 Av Louis Lépine - 83600 Fréjus\",IF(B450=\"PEINTURES\",\"Orédui - ZI Bois de Grasse - 06310 Grasse\",IF(B450=\"PRODUITS NON IDENTIFIES\",\"Orédui - ZI Bois de Grasse - 06310 Grasse\",IF(B450=\"AEROSOLS\",\"Orédui - ZI Bois de Grasse - 06310 Grasse\",IF(B450=\"FROIDS\",\"SEAS - 1079 Rte de Grasse - 06270 Villeneuve Loubet\",IF(B450=\"HORS FROIDS\",\"SEAS - 1079 Rte de Grasse - 06270 Villeneuve Loubet\",IF(B450=\"PAM\",\"SEAS - 1079 Rte de Grasse - 06270 Villeneuve Loubet\",IF(B450=\"ECRANS\",\"SEAS - 1079 Rte de Grasse - 06270 Villeneuve Loubet\",IF(B450=\"BOX HORS FROIDS\",\"SEAS - 1079 Rte de Grasse - 06270 Villeneuve Loubet\",IF(B450=\"PILES\",\"Corepile\",IF(B450=\"CUMULUS\",\"SEAS - 1079 Rte de Grasse - 06270 Villeneuve Loubet\",IF(B450=\"PNEUS\",\"TFM Pneus - 117 Ch Clausonnes - 06560 Valbonne\",IF(B450=\"HUILES VEGETALES\",\"Orédui - ZI Bois de Grasse - 06310 Grasse\",IF(B450=\"HUILES DE VIDANGE\",\"SERAHU - 68 Ch de la Campanette - 06800 Cagnes sur Mer\")))))))))))))))))))))","v":false},{"$f":"IF(OR(B450=\"TOUT VENANT\",B450=\"DECHETS VERTS\",B450=\"GRAVATS SALES\",B450=\"GRAVATS PROPRES\",B450=\"BOIS\"),\"SUEZ\",IF(OR(B450=\"PNEUS\"),\"TFM\",IF(OR(B450=\"FROIDS\",B450=\"HORS FROIDS\",B450=\"BOX HORS FROIDS\",B450=\"CUMULUS\",B450=\"PAM\",B450=\"ECRANS\"),\"SEAS\",IF(OR(B450=\"METAUX\",B450=\"BATTERIES\"),\"DERICHEBOURG\",IF(OR(B450=\"NEON\"),\"SOFOVAR\",IF(OR(B450=\"PEINTURES\",B450=\"PRODUITS NON IDENTIFIES\",B450=\"AEROSOLS\",B450=\"HUILES VEGETALES\"),\"OREDUI\",IF(OR(B450=\"HUILES DE VIDANGE\"),\"SERAHU\")))))))","v":false}]
[null,null,null,null,false,false]
[null,null,null,null,false,false]
[null,null,null,null,false,false]
[null,null,null,null,false,false]
[null,null,null,null,false,false]
[null,null,null,null,false,false]
[null,null,null,null,false,false]
[null,null,null,null,false,false]
[null,null,null,null,false,false]
[null,null,null,null,false,false]
[null,null,null,null,false,false]
[null,null,null,null,false,false]
[null,null,null,null,false,false]
[null,null,null,null,false,false]
[null,null,null,null,false,false]
[null,null,null,null,false,false]
[null,null,null,null,false,false]
[null,null,null,null,false,false]
[null,null,null,null,false,false]
[null,null,null,null,false,false]
[null,null,null,null,false,false]
[null,null,null,null,false,false]
[null,null,null,null,false,false]
[null,null,null,null,false,false]
[null,null,null,null,false,false]
[null,null,null,null,false,false]
[null,null,null,null,false,false]
[null,null,null,null,false,false]
[null,null,null,null,false,false]
[null,null,null,null,false,false]
[null,null,null,null,false,false]
[null,null,null,null,false,false]
[null,null,null,null,false,false]
[null,null,null,null,false,false]
[null,null,null,null,false,false]
[null,null,null,null,false,false]
[null,null,null,null,false,false]
[null,null,null,null,false,false]
[null,null,null,null,false,false]
[null,null,null,null,false,false]
[null,null,null,null,false,false]
[null,null,null,null,false,false]
[null,null,null,null,false,false]
[null,null,null,null,false,false]
[null,null,null,null,false,false]
[null,null,null,null,false,false]
[null,null,null,null,false,false]
[null,null,null,null,false,false]
[null,null,null,null,false,false]
[null,null,null,null,false,false]
[null,null,null,null,false,false]
[null,null,null,null,false,false]
[null,null,null,null,false,false]
[null,null,null,null,false,false]
[null,null,null,null,false,false]
[null,null,null,null,false,false]
[null,null,null,null,false,false]
[null,null,null,null,false,false]
[null,null,null,null,false,false]
[null,null,null,null,false,false]
[null,null,null,null,false,false]
[null,null,null,null,false,false]
[null,null,null,null,false,false]
[null,null,null,null,{"$f":"IF(B514=\"TOUT VENANT\",\"Véolia Nice Tri - Parc d'activité logistique\",IF(B514=\"DECHETS VERTS\",\"Orédui Carros Compostage - ZI de la Grave\",IF(B514=\"GRAVATS PROPRES\",\"La Gaude K3 Sita Sud - 5211 Rte de St Jeannet\",IF(B514=\"GRAVATS SALES\",\"Véolia Nice Tri - 20 Ch du Saquier\",IF(B514=\"BOIS\",\"SEAS La Glacière - 1019 Rte de la Grasse\",IF(B514=\"METAUX\",\"PURFER - ZI Carros 15ème Rue - 06517 Carros\",IF(B514=\"BATTERIES\",\"PURFER - ZI Carros 15ème Rue - 06517 Carros\",IF(B514=\"NEON\",\"Sofovar - 126 Av Louis Lépine - 83600 Fréjus\",IF(B514=\"PEINTURES\",\"Orédui - ZI Bois de Grasse - 06310 Grasse\",IF(B514=\"PRODUITS NON IDENTIFIES\",\"Orédui - ZI Bois de Grasse - 06310 Grasse\",IF(B514=\"AEROSOLS\",\"Orédui - ZI Bois de Grasse - 06310 Grasse\",IF(B514=\"FROIDS\",\"SEAS - 1079 Rte de Grasse - 06270 Villeneuve Loubet\",IF(B514=\"HORS FROIDS\",\"SEAS - 1079 Rte de Grasse - 06270 Villeneuve Loubet\",IF(B514=\"PAM\",\"SEAS - 1079 Rte de Grasse - 06270 Villeneuve Loubet\",IF(B514=\"ECRANS\",\"SEAS - 1079 Rte de Grasse - 06270 Villeneuve Loubet\",IF(B514=\"BOX HORS FROIDS\",\"SEAS - 1079 Rte de Grasse - 06270 Villeneuve Loubet\",IF(B514=\"PILES\",\"Corepile\",IF(B514=\"CUMULUS\",\"SEAS - 1079 Rte de Grasse - 06270 Villeneuve Loubet\",IF(B514=\"PNEUS\",\"TFM Pneus - 117 Ch Clausonnes - 06560 Valbonne\",IF(B514=\"HUILES VEGETALES\",\"Orédui - ZI Bois de Grasse - 06310 Grasse\",IF(B514=\"HUILES DE VIDANGE\",\"SERAHU - 68 Ch de la Campanette - 06800 Cagnes sur Mer\")))))))))))))))))))))","v":false},{"$f":"IF(OR(B514=\"TOUT VENANT\",B514=\"DECHETS VERTS\",B514=\"GRAVATS SALES\",B514=\"GRAVATS PROPRES\",B514=\"BOIS\"),\"SUEZ\",IF(OR(B514=\"PNEUS\"),\"TFM\",IF(OR(B514=\"FROIDS\",B514=\"HORS FROIDS\",B514=\"BOX HORS FROIDS\",B514=\"CUMULUS\",B514=\"PAM\",B514=\"ECRANS\"),\"SEAS\",IF(OR(B514=\"METAUX\",B514=\"BATTERIES\"),\"DERICHEBOURG\",IF(OR(B514=\"NEON\"),\"SOFOVAR\",IF(OR(B514=\"PEINTURES\",B514=\"PRODUITS NON IDENTIFIES\",B514=\"AEROSOLS\",B514=\"HUILES VEGETALES\"),\"OREDUI\",IF(OR(B514=\"HUILES DE VIDANGE\"),\"SERAHU\")))))))","v":false}]
[null,null,null,null,false,false]
[null,null,null,null,false,false]
[null,null,null,null,false,false]
[null,null,null,null,false,false]
[null,null,null,null,false,false]
[null,null,null,null,false,false]
[null,null,null,null,false,false]
[null,null,null,null,false,false]
[null,null,null,null,false,false]
[null,null,null,null,false,false]
[null,null,null,null,false,false]
[null,null,null,null,false,false]
[null,null,null,null,false,false]
[null,null,null,null,false,false]
[null,null,null,null,false,false]
[null,null,null,null,false,false]
[null,null,null,null,false,false]
[null,null,null,null,false,false]
[null,null,null,null,false,false]
[null,null,null,null,false,false]
[null,null,null,null,false,false]
[null,null,null,null,false,false]
[null,null,null,null,false,false]
[null,null,null,null,false,false]
[null,null,null,null,false,false]
[null,null,null,null,false,false]
[null,null,null,null,false,false]
[null,null,null,null,false,false]
[null,null,null,null,false,false]
[null,null,null,null,false,false]
[null,null,null,null,false,false]
[null,null,null,null,false,false]
[null,null,null,null,false,false]
[null,null,null,null,false,false]
[null,null,null,null,false,false]
[null,null,null,null,false,false]
[null,null,null,null,false,false]
[null,null,null,null,false,false]
[null,null,null,null,false,false]
[null,null,null,null,false,false]
[null,null,null,null,false,false]
[null,null,null,null,false,false]
[null,null,null,null,false,false]
[null,null,null,null,false,false]
[null,null,null,null,false,false]
[null,null,null,null,false,false]
[null,null,null,null,false,false]
[null,null,null,null,false,false]
[null,null,null,null,false,false]
[null,null,null,null,false,false]
[null,null,null,null,false,false]
[null,null,null,null,false,false]
[null,null,null,null,false,false]
[null,null,null,null,false,false]
[null,null,null,null,false,false]
[null,null,null,null,false,false]
[null,null,null,null,false,false]
[null,null,null,null,false,false]
[null,null,null,null,false,false]
[null,null,null,null,false,false]
[null,null,null,null,false,false]
[null,null,null,null,false,false]
[null,null,null,null,false,false]
[null,null,null,null,{"$f":"IF(B578=\"TOUT VENANT\",\"Véolia Nice Tri - Parc d'activité logistique\",IF(B578=\"DECHETS VERTS\",\"Orédui Carros Compostage - ZI de la Grave\",IF(B578=\"GRAVATS PROPRES\",\"La Gaude K3 Sita Sud - 5211 Rte de St Jeannet\",IF(B578=\"GRAVATS SALES\",\"Véolia Nice Tri - 20 Ch du Saquier\",IF(B578=\"BOIS\",\"SEAS La Glacière - 1019 Rte de la Grasse\",IF(B578=\"METAUX\",\"PURFER - ZI Carros 15ème Rue - 06517 Carros\",IF(B578=\"BATTERIES\",\"PURFER - ZI Carros 15ème Rue - 06517 Carros\",IF(B578=\"NEON\",\"Sofovar - 126 Av Louis Lépine - 83600 Fréjus\",IF(B578=\"PEINTURES\",\"Orédui - ZI Bois de Grasse - 06310 Grasse\",IF(B578=\"PRODUITS NON IDENTIFIES\",\"Orédui - ZI Bois de Grasse - 06310 Grasse\",IF(B578=\"AEROSOLS\",\"Orédui - ZI Bois de Grasse - 06310 Grasse\",IF(B578=\"FROIDS\",\"SEAS - 1079 Rte de Grasse - 06270 Villeneuve Loubet\",IF(B578=\"HORS FROIDS\",\"SEAS - 1079 Rte de Grasse - 06270 Villeneuve Loubet\",IF(B578=\"PAM\",\"SEAS - 1079 Rte de Grasse - 06270 Villeneuve Loubet\",IF(B578=\"ECRANS\",\"SEAS - 1079 Rte de Grasse - 06270 Villeneuve Loubet\",IF(B578=\"BOX HORS FROIDS\",\"SEAS - 1079 Rte de Grasse - 06270 Villeneuve Loubet\",IF(B578=\"PILES\",\"Corepile\",IF(B578=\"CUMULUS\",\"SEAS - 1079 Rte de Grasse - 06270 Villeneuve Loubet\",IF(B578=\"PNEUS\",\"TFM Pneus - 117 Ch Clausonnes - 06560 Valbonne\",IF(B578=\"HUILES VEGETALES\",\"Orédui - ZI Bois de Grasse - 06310 Grasse\",IF(B578=\"HUILES DE VIDANGE\",\"SERAHU - 68 Ch de la Campanette - 06800 Cagnes sur Mer\")))))))))))))))))))))","v":false},{"$f":"IF(OR(B578=\"TOUT VENANT\",B578=\"DECHETS VERTS\",B578=\"GRAVATS SALES\",B578=\"GRAVATS PROPRES\",B578=\"BOIS\"),\"SUEZ\",IF(OR(B578=\"PNEUS\"),\"TFM\",IF(OR(B578=\"FROIDS\",B578=\"HORS FROIDS\",B578=\"BOX HORS FROIDS\",B578=\"CUMULUS\",B578=\"PAM\",B578=\"ECRANS\"),\"SEAS\",IF(OR(B578=\"METAUX\",B578=\"BATTERIES\"),\"DERICHEBOURG\",IF(OR(B578=\"NEON\"),\"SOFOVAR\",IF(OR(B578=\"PEINTURES\",B578=\"PRODUITS NON IDENTIFIES\",B578=\"AEROSOLS\",B578=\"HUILES VEGETALES\"),\"OREDUI\",IF(OR(B578=\"HUILES DE VIDANGE\"),\"SERAHU\")))))))","v":false}]
[null,null,null,null,false,false]
[null,null,null,null,false,false]
[null,null,null,null,false,false]
[null,null,null,null,false,false]
[null,null,null,null,false,false]
[null,null,null,null,false,false]
[null,null,null,null,false,false]
[null,null,null,null,false,false]
[null,null,null,null,false,false]
[null,null,null,null,false,false]
[null,null,null,null,false,false]
[null,null,null,null,false,false]
[null,null,null,null,false,false]
[null,null,null,null,false,false]
[null,null,null,null,false,false]
[null,null,null,null,false,false]
[null,null,null,null,false,false]
[null,null,null,null,false,false]
[null,null,null,null,false,false]
[null,null,null,null,false,false]
[null,null,null,null,false,false]
[null,null,null,null,false,false]
[null,null,null,null,false,false]
[null,null,null,null,false,false]
[null,null,null,null,false,false]
[null,null,null,null,false,false]
[null,null,null,null,false,false]
[null,null,null,null,false,false]
[null,null,null,null,false,false]
[null,null,null,null,false,false]
[null,null,null,null,false,false]
[null,null,null,null,false,false]
[null,null,null,null,false,false]
[null,null,null,null,false,false]
[null,null,null,null,false,false]
[null,null,null,null,false,false]
[null,null,null,null,false,false]
[null,null,null,null,false,false]
[null,null,null,null,false,false]
[null,null,null,null,false,false]
[null,null,null,null,false,false]
[null,null,null,null,false,false]
[null,null,null,null,false,false]
[null,null,null,null,false,false]
[null,null,null,null,false,false]
[null,null,null,null,false,false]
[null,null,null,null,false,false]
[null,null,null,null,false,false]
[null,null,null,null,false,false]
[null,null,null,null,false,false]
[null,null,null,null,false,false]
[null,null,null,null,false,false]
[null,null,null,null,false,false]
[null,null,null,null,false,false]
[null,null,null,null,false,false]
[null,null,null,null,false,false]
[null,null,null,null,false,false]
[null,null,null,null,false,false]
[null,null,null,null,false,false]
[null,null,null,null,false,false]
[null,null,null,null,false,false]
[null,null,null,null,false,false]
[null,null,null,null,false,false]
[null,null,null,null,{"$f":"IF(B642=\"TOUT VENANT\",\"Véolia Nice Tri - Parc d'activité logistique\",IF(B642=\"DECHETS VERTS\",\"Orédui Carros Compostage - ZI de la Grave\",IF(B642=\"GRAVATS PROPRES\",\"La Gaude K3 Sita Sud - 5211 Rte de St Jeannet\",IF(B642=\"GRAVATS SALES\",\"Véolia Nice Tri - 20 Ch du Saquier\",IF(B642=\"BOIS\",\"SEAS La Glacière - 1019 Rte de la Grasse\",IF(B642=\"METAUX\",\"PURFER - ZI Carros 15ème Rue - 06517 Carros\",IF(B642=\"BATTERIES\",\"PURFER - ZI Carros 15ème Rue - 06517 Carros\",IF(B642=\"NEON\",\"Sofovar - 126 Av Louis Lépine - 83600 Fréjus\",IF(B642=\"PEINTURES\",\"Orédui - ZI Bois de Grasse - 06310 Grasse\",IF(B642=\"PRODUITS NON IDENTIFIES\",\"Orédui - ZI Bois de Grasse - 06310 Grasse\",IF(B642=\"AEROSOLS\",\"Orédui - ZI Bois de Grasse - 06310 Grasse\",IF(B642=\"FROIDS\",\"SEAS - 1079 Rte de Grasse - 06270 Villeneuve Loubet\",IF(B642=\"HORS FROIDS\",\"SEAS - 1079 Rte de Grasse - 06270 Villeneuve Loubet\",IF(B642=\"PAM\",\"SEAS - 1079 Rte de Grasse - 06270 Villeneuve Loubet\",IF(B642=\"ECRANS\",\"SEAS - 1079 Rte de Grasse - 06270 Villeneuve Loubet\",IF(B642=\"BOX HORS FROIDS\",\"SEAS - 1079 Rte de Grasse - 06270 Villeneuve Loubet\",IF(B642=\"PILES\",\"Corepile\",IF(B642=\"CUMULUS\",\"SEAS - 1079 Rte de Grasse - 06270 Villeneuve Loubet\",IF(B642=\"PNEUS\",\"TFM Pneus - 117 Ch Clausonnes - 06560 Valbonne\",IF(B642=\"HUILES VEGETALES\",\"Orédui - ZI Bois de Grasse - 06310 Grasse\",IF(B642=\"HUILES DE VIDANGE\",\"SERAHU - 68 Ch de la Campanette - 06800 Cagnes sur Mer\")))))))))))))))))))))","v":false},{"$f":"IF(OR(B642=\"TOUT VENANT\",B642=\"DECHETS VERTS\",B642=\"GRAVATS SALES\",B642=\"GRAVATS PROPRES\",B642=\"BOIS\"),\"SUEZ\",IF(OR(B642=\"PNEUS\"),\"TFM\",IF(OR(B642=\"FROIDS\",B642=\"HORS FROIDS\",B642=\"BOX HORS FROIDS\",B642=\"CUMULUS\",B642=\"PAM\",B642=\"ECRANS\"),\"SEAS\",IF(OR(B642=\"METAUX\",B642=\"BATTERIES\"),\"DERICHEBOURG\",IF(OR(B642=\"NEON\"),\"SOFOVAR\",IF(OR(B642=\"PEINTURES\",B642=\"PRODUITS NON IDENTIFIES\",B642=\"AEROSOLS\",B642=\"HUILES VEGETALES\"),\"OREDUI\",IF(OR(B642=\"HUILES DE VIDANGE\"),\"SERAHU\")))))))","v":false}]
[null,null,null,null,false,false]
[null,null,null,null,false,false]
[null,null,null,null,false,false]
[null,null,null,null,false,false]
[null,null,null,null,false,false]
[null,null,null,null,false,false]
[null,null,null,null,false,false]
[null,null,null,null,false,false]
[null,null,null,null,false,false]
[null,null,null,null,false,false]
[null,null,null,null,false,false]
[null,null,null,null,false,false]
[null,null,null,null,false,false]
[null,null,null,null,false,false]
[null,null,null,null,false,false]
[null,null,null,null,false,false]
[null,null,null,null,false,false]
[null,null,null,null,false,false]
[null,null,null,null,false,false]
[null,null,null,null,false,false]
[null,null,null,null,false,false]
[null,null,null,null,false,false]
[null,null,null,null,false,false]
[null,null,null,null,false,false]
[null,null,null,null,false,false]
[null,null,null,null,false,false]
[null,null,null,null,false,false]
[null,null,null,null,false,false]
[null,null,null,null,false,false]
[null,null,null,null,false,false]
[null,null,null,null,false,false]
[null,null,null,null,false,false]
[null,null,null,null,false,false]
[null,null,null,null,false,false]
[null,null,null,null,false,false]
[null,null,null,null,false,false]
[null,null,null,null,false,false]
[null,null,null,null,false,false]
[null,null,null,null,false,false]
[null,null,null,null,false,false]
[null,null,null,null,false,false]
[null,null,null,null,false,false]
[null,null,null,null,false,false]
[null,null,null,null,false,false]
[null,null,null,null,false,false]
[null,null,null,null,false,false]
[null,null,null,null,false,false]
[null,null,null,null,false,false]
[null,null,null,null,false,false]
[null,null,null,null,false,false]
[null,null,null,null,false,false]
[null,null,null,null,false,false]
[null,null,null,null,false,false]
[null,null,null,null,false,false]
[null,null,null,null,false,false]
[null,null,null,null,false,false]
[null,null,null,null,false,false]
[null,null,null,null,false,false]
[null,null,null,null,false,false]
[null,null,null,null,false,false]
[null,null,null,null,false,false]
[null,null,null,null,false,false]
[null,null,null,null,false,false]
[null,null,null,null,{"$f":"IF(B706=\"TOUT VENANT\",\"Véolia Nice Tri - Parc d'activité logistique\",IF(B706=\"DECHETS VERTS\",\"Orédui Carros Compostage - ZI de la Grave\",IF(B706=\"GRAVATS PROPRES\",\"La Gaude K3 Sita Sud - 5211 Rte de St Jeannet\",IF(B706=\"GRAVATS SALES\",\"Véolia Nice Tri - 20 Ch du Saquier\",IF(B706=\"BOIS\",\"SEAS La Glacière - 1019 Rte de la Grasse\",IF(B706=\"METAUX\",\"PURFER - ZI Carros 15ème Rue - 06517 Carros\",IF(B706=\"BATTERIES\",\"PURFER - ZI Carros 15ème Rue - 06517 Carros\",IF(B706=\"NEON\",\"Sofovar - 126 Av Louis Lépine - 83600 Fréjus\",IF(B706=\"PEINTURES\",\"Orédui - ZI Bois de Grasse - 06310 Grasse\",IF(B706=\"PRODUITS NON IDENTIFIES\",\"Orédui - ZI Bois de Grasse - 06310 Grasse\",IF(B706=\"AEROSOLS\",\"Orédui - ZI Bois de Grasse - 06310 Grasse\",IF(B706=\"FROIDS\",\"SEAS - 1079 Rte de Grasse - 06270 Villeneuve Loubet\",IF(B706=\"HORS FROIDS\",\"SEAS - 1079 Rte de Grasse - 06270 Villeneuve Loubet\",IF(B706=\"PAM\",\"SEAS - 1079 Rte de Grasse - 06270 Villeneuve Loubet\",IF(B706=\"ECRANS\",\"SEAS - 1079 Rte de Grasse - 06270 Villeneuve Loubet\",IF(B706=\"BOX HORS FROIDS\",\"SEAS - 1079 Rte de Grasse - 06270 Villeneuve Loubet\",IF(B706=\"PILES\",\"Corepile\",IF(B706=\"CUMULUS\",\"SEAS - 1079 Rte de Grasse - 06270 Villeneuve Loubet\",IF(B706=\"PNEUS\",\"TFM Pneus - 117 Ch Clausonnes - 06560 Valbonne\",IF(B706=\"HUILES VEGETALES\",\"Orédui - ZI Bois de Grasse - 06310 Grasse\",IF(B706=\"HUILES DE VIDANGE\",\"SERAHU - 68 Ch de la Campanette - 06800 Cagnes sur Mer\")))))))))))))))))))))","v":false},{"$f":"IF(OR(B706=\"TOUT VENANT\",B706=\"DECHETS VERTS\",B706=\"GRAVATS SALES\",B706=\"GRAVATS PROPRES\",B706=\"BOIS\"),\"SUEZ\",IF(OR(B706=\"PNEUS\"),\"TFM\",IF(OR(B706=\"FROIDS\",B706=\"HORS FROIDS\",B706=\"BOX HORS FROIDS\",B706=\"CUMULUS\",B706=\"PAM\",B706=\"ECRANS\"),\"SEAS\",IF(OR(B706=\"METAUX\",B706=\"BATTERIES\"),\"DERICHEBOURG\",IF(OR(B706=\"NEON\"),\"SOFOVAR\",IF(OR(B706=\"PEINTURES\",B706=\"PRODUITS NON IDENTIFIES\",B706=\"AEROSOLS\",B706=\"HUILES VEGETALES\"),\"OREDUI\",IF(OR(B706=\"HUILES DE VIDANGE\"),\"SERAHU\")))))))","v":false}]
[null,null,null,null,false,false]
[null,null,null,null,false,false]
[null,null,null,null,false,false]
[null,null,null,null,false,false]
[null,null,null,null,false,false]
[null,null,null,null,false,false]
[null,null,null,null,false,false]
[null,null,null,null,false,false]
[null,null,null,null,false,false]
[null,null,null,null,false,false]
[null,null,null,null,false,false]
[null,null,null,null,false,false]
[null,null,null,null,false,false]
[null,null,null,null,false,false]
[null,null,null,null,false,false]
[null,null,null,null,false,false]
[null,null,null,null,false,false]
[null,null,null,null,false,false]
[null,null,null,null,false,false]
[null,null,null,null,false,false]
[null,null,null,null,false,false]
[null,null,null,null,false,false]
[null,null,null,null,false,false]
[null,null,null,null,false,false]
[null,null,null,null,false,false]
[null,null,null,null,false,false]
[null,null,null,null,false,false]
[null,null,null,null,false,false]
[null,null,null,null,false,false]
[null,null,null,null,false,false]
[null,null,null,null,false,false]
[null,null,null,null,false,false]
[null,null,null,null,false,false]
[null,null,null,null,false,false]
[null,null,null,null,false,false]
[null,null,null,null,false,false]
[null,null,null,null,false,false]
[null,null,null,null,false,false]
[null,null,null,null,false,false]
[null,null,null,null,false,false]
[null,null,null,null,false,false]
[null,null,null,null,false,false]
[null,null,null,null,false,false]
[null,null,null,null,false,false]
[null,null,null,null,false,false]
[null,null,null,null,false,false]
[null,null,null,null,false,false]
[null,null,null,null,false,false]
[null,null,null,null,false,false]
[null,null,null,null,false,false]
[null,null,null,null,false,false]
[null,null,null,null,false,false]
[null,null,null,null,false,false]
[null,null,null,null,false,false]
[null,null,null,null,false,false]
[null,null,null,null,false,false]
[null,null,null,null,false,false]
[null,null,null,null,false,false]
[null,null,null,null,false,false]
[null,null,null,null,false,false]
[null,null,null,null,false,false]
[null,null,null,null,false,false]
[null,null,null,null,false,false]
[null,null,null,null,false,false]
[null,null,null,null,false,false]
[null,null,null,null,false,false]
[null,null,null,null,false,false]
[null,null,null,null,false,false]
[null,null,null,null,{"$f":"IF(B775=\"TOUT VENANT\",\"Véolia Nice Tri - Parc d'activité logistique\",IF(B775=\"DECHETS VERTS\",\"Orédui Carros Compostage - ZI de la Grave\",IF(B775=\"GRAVATS PROPRES\",\"La Gaude K3 Sita Sud - 5211 Rte de St Jeannet\",IF(B775=\"GRAVATS SALES\",\"Véolia Nice Tri - 20 Ch du Saquier\",IF(B775=\"BOIS\",\"SEAS La Glacière - 1019 Rte de la Grasse\",IF(B775=\"METAUX\",\"PURFER - ZI Carros 15ème Rue - 06517 Carros\",IF(B775=\"BATTERIES\",\"PURFER - ZI Carros 15ème Rue - 06517 Carros\",IF(B775=\"NEON\",\"Sofovar - 126 Av Louis Lépine - 83600 Fréjus\",IF(B775=\"PEINTURES\",\"Orédui - ZI Bois de Grasse - 06310 Grasse\",IF(B775=\"PRODUITS NON IDENTIFIES\",\"Orédui - ZI Bois de Grasse - 06310 Grasse\",IF(B775=\"AEROSOLS\",\"Orédui - ZI Bois de Grasse - 06310 Grasse\",IF(B775=\"FROIDS\",\"SEAS - 1079 Rte de Grasse - 06270 Villeneuve Loubet\",IF(B775=\"HORS FROIDS\",\"SEAS - 1079 Rte de Grasse - 06270 Villeneuve Loubet\",IF(B775=\"PAM\",\"SEAS - 1079 Rte de Grasse - 06270 Villeneuve Loubet\",IF(B775=\"ECRANS\",\"SEAS - 1079 Rte de Grasse - 06270 Villeneuve Loubet\",IF(B775=\"BOX HORS FROIDS\",\"SEAS - 1079 Rte de Grasse - 06270 Villeneuve Loubet\",IF(B775=\"PILES\",\"Corepile\",IF(B775=\"CUMULUS\",\"SEAS - 1079 Rte de Grasse - 06270 Villeneuve Loubet\",IF(B775=\"PNEUS\",\"TFM Pneus - 117 Ch Clausonnes - 06560 Valbonne\",IF(B775=\"HUILES VEGETALES\",\"Orédui - ZI Bois de Grasse - 06310 Grasse\",IF(B775=\"HUILES DE VIDANGE\",\"SERAHU - 68 Ch de la Campanette - 06800 Cagnes sur Mer\")))))))))))))))))))))","v":false},{"$f":"IF(OR(B775=\"TOUT VENANT\",B775=\"DECHETS VERTS\",B775=\"GRAVATS SALES\",B775=\"GRAVATS PROPRES\",B775=\"BOIS\"),\"SUEZ\",IF(OR(B775=\"PNEUS\"),\"TFM\",IF(OR(B775=\"FROIDS\",B775=\"HORS FROIDS\",B775=\"BOX HORS FROIDS\",B775=\"CUMULUS\",B775=\"PAM\",B775=\"ECRANS\"),\"SEAS\",IF(OR(B775=\"METAUX\",B775=\"BATTERIES\"),\"DERICHEBOURG\",IF(OR(B775=\"NEON\"),\"SOFOVAR\",IF(OR(B775=\"PEINTURES\",B775=\"PRODUITS NON IDENTIFIES\",B775=\"AEROSOLS\",B775=\"HUILES VEGETALES\"),\"OREDUI\",IF(OR(B775=\"HUILES DE VIDANGE\"),\"SERAHU\")))))))","v":false}]
[null,null,null,null,false,false]
[null,null,null,null,false,false]
[null,null,null,null,false,false]
[null,null,null,null,false,false]
[null,null,null,null,false,false]
[null,null,null,null,false,false]
[null,null,null,null,false,false]
[null,null,null,null,false,false]
[null,null,null,null,false,false]
[null,null,null,null,false,false]
[null,null,null,null,false,false]
[null,null,null,null,false,false]
[null,null,null,null,false,false]
[null,null,null,null,false,false]
[null,null,null,null,false,false]
[null,null,null,null,false,false]
[null,null,null,null,false,false]
[null,null,null,null,false,false]
[null,null,null,null,false,false]
[null,null,null,null,false,false]
[null,null,null,null,false,false]
[null,null,null,null,false,false]
[null,null,null,null,false,false]
[null,null,null,null,false,false]
[null,null,null,null,false,false]
[null,null,null,null,false,false]
[null,null,null,null,false,false]
[null,null,null,null,false,false]
[null,null,null,null,false,false]
[null,null,null,null,false,false]
[null,null,null,null,false,false]
[null,null,null,null,false,false]
[null,null,null,null,false,false]
[null,null,null,null,false,false]
[null,null,null,null,false,false]
[null,null,null,null,false,false]
[null,null,null,null,false,false]
[null,null,null,null,false,false]
[null,null,null,null,false,false]
[null,null,null,null,false,false]
[null,null,null,null,false,false]
[null,null,null,null,false,false]
[null,null,null,null,false,false]
[null,null,null,null,false,false]
[null,null,null,null,false,false]
[null,null,null,null,false,false]
[null,null,null,null,false,false]
[null,null,null,null,false,false]
[null,null,null,null,false,false]
[null,null,null,null,false,false]
[null,null,null,null,false,false]
[null,null,null,null,false,false]
[null,null,null,null,false,false]
[null,null,null,null,false,false]
[null,null,null,null,false,false]
[null,null,null,null,false,false]
[null,null,null,null,false,false]
[null,null,null,null,false,false]
[null,null,null,null,false,false]
[null,null,null,null,false,false]
[null,null,null,null,false,false]
[null,null,null,null,false,false]
[null,null,null,null,false,false]
[null,null,null,null,{"$f":"IF(B839=\"TOUT VENANT\",\"Véolia Nice Tri - Parc d'activité logistique\",IF(B839=\"DECHETS VERTS\",\"Orédui Carros Compostage - ZI de la Grave\",IF(B839=\"GRAVATS PROPRES\",\"La Gaude K3 Sita Sud - 5211 Rte de St Jeannet\",IF(B839=\"GRAVATS SALES\",\"Véolia Nice Tri - 20 Ch du Saquier\",IF(B839=\"BOIS\",\"SEAS La Glacière - 1019 Rte de la Grasse\",IF(B839=\"METAUX\",\"PURFER - ZI Carros 15ème Rue - 06517 Carros\",IF(B839=\"BATTERIES\",\"PURFER - ZI Carros 15ème Rue - 06517 Carros\",IF(B839=\"NEON\",\"Sofovar - 126 Av Louis Lépine - 83600 Fréjus\",IF(B839=\"PEINTURES\",\"Orédui - ZI Bois de Grasse - 06310 Grasse\",IF(B839=\"PRODUITS NON IDENTIFIES\",\"Orédui - ZI Bois de Grasse - 06310 Grasse\",IF(B839=\"AEROSOLS\",\"Orédui - ZI Bois de Grasse - 06310 Grasse\",IF(B839=\"FROIDS\",\"SEAS - 1079 Rte de Grasse - 06270 Villeneuve Loubet\",IF(B839=\"HORS FROIDS\",\"SEAS - 1079 Rte de Grasse - 06270 Villeneuve Loubet\",IF(B839=\"PAM\",\"SEAS - 1079 Rte de Grasse - 06270 Villeneuve Loubet\",IF(B839=\"ECRANS\",\"SEAS - 1079 Rte de Grasse - 06270 Villeneuve Loubet\",IF(B839=\"BOX HORS FROIDS\",\"SEAS - 1079 Rte de Grasse - 06270 Villeneuve Loubet\",IF(B839=\"PILES\",\"Corepile\",IF(B839=\"CUMULUS\",\"SEAS - 1079 Rte de Grasse - 06270 Villeneuve Loubet\",IF(B839=\"PNEUS\",\"TFM Pneus - 117 Ch Clausonnes - 06560 Valbonne\",IF(B839=\"HUILES VEGETALES\",\"Orédui - ZI Bois de Grasse - 06310 Grasse\",IF(B839=\"HUILES DE VIDANGE\",\"SERAHU - 68 Ch de la Campanette - 06800 Cagnes sur Mer\")))))))))))))))))))))","v":false},{"$f":"IF(OR(B839=\"TOUT VENANT\",B839=\"DECHETS VERTS\",B839=\"GRAVATS SALES\",B839=\"GRAVATS PROPRES\",B839=\"BOIS\"),\"SUEZ\",IF(OR(B839=\"PNEUS\"),\"TFM\",IF(OR(B839=\"FROIDS\",B839=\"HORS FROIDS\",B839=\"BOX HORS FROIDS\",B839=\"CUMULUS\",B839=\"PAM\",B839=\"ECRANS\"),\"SEAS\",IF(OR(B839=\"METAUX\",B839=\"BATTERIES\"),\"DERICHEBOURG\",IF(OR(B839=\"NEON\"),\"SOFOVAR\",IF(OR(B839=\"PEINTURES\",B839=\"PRODUITS NON IDENTIFIES\",B839=\"AEROSOLS\",B839=\"HUILES VEGETALES\"),\"OREDUI\",IF(OR(B839=\"HUILES DE VIDANGE\"),\"SERAHU\")))))))","v":false}]
[null,null,null,null,false,false]
[null,null,null,null,false,false]
[null,null,null,null,false,false]
[null,null,null,null,false,false]
[null,null,null,null,false,false]
[null,null,null,null,false,false]
[null,null,null,null,false,false]
[null,null,null,null,false,false]
[null,null,null,null,false,false]
[null,null,null,null,false,false]
[null,null,null,null,false,false]
[null,null,null,null,false,false]
[null,null,null,null,false,false]
[null,null,null,null,false,false]
[null,null,null,null,false,false]
[null,null,null,null,false,false]
[null,null,null,null,false,false]
[null,null,null,null,false,false]
[null,null,null,null,false,false]
[null,null,null,null,false,false]
[null,null,null,null,false,false]
[null,null,null,null,false,false]
[null,null,null,null,false,false]
[null,null,null,null,false,false]
[null,null,null,null,false,false]
[null,null,null,null,false,false]
[null,null,null,null,false,false]
[null,null,null,null,false,false]
[null,null,null,null,false,false]
[null,null,null,null,false,false]
[null,null,null,null,false,false]
[null,null,null,null,false,false]
[null,null,null,null,false,false]
[null,null,null,null,false,false]
[null,null,null,null,false,false]
[null,null,null,null,false,false]
[null,null,null,null,false,false]
[null,null,null,null,false,false]
[null,null,null,null,false,false]
[null,null,null,null,false,false]
[null,null,null,null,false,false]
[null,null,null,null,false,false]
[null,null,null,null,false,false]
[null,null,null,null,false,false]
[null,null,null,null,false,false]
[null,null,null,null,false,false]
[null,null,null,null,false,false]
[null,null,null,null,false,false]
[null,null,null,null,false,false]
[null,null,null,null,false,false]
[null,null,null,null,false,false]
[null,null,null,null,false,false]
[null,null,null,null,false,false]
[null,null,null,null,false,false]
[null,null,null,null,false,false]
[null,null,null,null,false,false]
[null,null,null,null,false,false]
[null,null,null,null,false,false]
[null,null,null,null,false,false]
[null,null,null,null,false,false]
[null,null,null,null,false,false]
[null,null,null,null,false,false]
[null,null,null,null,false,false]
[null,null,null,null,{"$f":"IF(B903=\"TOUT VENANT\",\"Véolia Nice Tri - Parc d'activité logistique\",IF(B903=\"DECHETS VERTS\",\"Orédui Carros Compostage - ZI de la Grave\",IF(B903=\"GRAVATS PROPRES\",\"La Gaude K3 Sita Sud - 5211 Rte de St Jeannet\",IF(B903=\"GRAVATS SALES\",\"Véolia Nice Tri - 20 Ch du Saquier\",IF(B903=\"BOIS\",\"SEAS La Glacière - 1019 Rte de la Grasse\",IF(B903=\"METAUX\",\"PURFER - ZI Carros 15ème Rue - 06517 Carros\",IF(B903=\"BATTERIES\",\"PURFER - ZI Carros 15ème Rue - 06517 Carros\",IF(B903=\"NEON\",\"Sofovar - 126 Av Louis Lépine - 83600 Fréjus\",IF(B903=\"PEINTURES\",\"Orédui - ZI Bois de Grasse - 06310 Grasse\",IF(B903=\"PRODUITS NON IDENTIFIES\",\"Orédui - ZI Bois de Grasse - 06310 Grasse\",IF(B903=\"AEROSOLS\",\"Orédui - ZI Bois de Grasse - 06310 Grasse\",IF(B903=\"FROIDS\",\"SEAS - 1079 Rte de Grasse - 06270 Villeneuve Loubet\",IF(B903=\"HORS FROIDS\",\"SEAS - 1079 Rte de Grasse - 06270 Villeneuve Loubet\",IF(B903=\"PAM\",\"SEAS - 1079 Rte de Grasse - 06270 Villeneuve Loubet\",IF(B903=\"ECRANS\",\"SEAS - 1079 Rte de Grasse - 06270 Villeneuve Loubet\",IF(B903=\"BOX HORS FROIDS\",\"SEAS - 1079 Rte de Grasse - 06270 Villeneuve Loubet\",IF(B903=\"PILES\",\"Corepile\",IF(B903=\"CUMULUS\",\"SEAS - 1079 Rte de Grasse - 06270 Villeneuve Loubet\",IF(B903=\"PNEUS\",\"TFM Pneus - 117 Ch Clausonnes - 06560 Valbonne\",IF(B903=\"HUILES VEGETALES\",\"Orédui - ZI Bois de Grasse - 06310 Grasse\",IF(B903=\"HUILES DE VIDANGE\",\"SERAHU - 68 Ch de la Campanette - 06800 Cagnes sur Mer\")))))))))))))))))))))","v":false},{"$f":"IF(OR(B903=\"TOUT VENANT\",B903=\"DECHETS VERTS\",B903=\"GRAVATS SALES\",B903=\"GRAVATS PROPRES\",B903=\"BOIS\"),\"SUEZ\",IF(OR(B903=\"PNEUS\"),\"TFM\",IF(OR(B903=\"FROIDS\",B903=\"HORS FROIDS\",B903=\"BOX HORS FROIDS\",B903=\"CUMULUS\",B903=\"PAM\",B903=\"ECRANS\"),\"SEAS\",IF(OR(B903=\"METAUX\",B903=\"BATTERIES\"),\"DERICHEBOURG\",IF(OR(B903=\"NEON\"),\"SOFOVAR\",IF(OR(B903=\"PEINTURES\",B903=\"PRODUITS NON IDENTIFIES\",B903=\"AEROSOLS\",B903=\"HUILES VEGETALES\"),\"OREDUI\",IF(OR(B903=\"HUILES DE VIDANGE\"),\"SERAHU\")))))))","v":false}]
[null,null,null,null,false,false]
[null,null,null,null,false,false]
[null,null,null,null,false,false]
[null,null,null,null,false,false]
[null,null,null,null,false,false]
[null,null,null,null,false,false]
[null,null,null,null,false,false]
[null,null,null,null,false,false]
[null,null,null,null,false,false]
[null,null,null,null,false,false]
[null,null,null,null,false,false]
[null,null,null,null,false,false]
[null,null,null,null,false,false]
[null,null,null,null,false,false]
[null,null,null,null,false,false]
[null,null,null,null,false,false]
[null,null,null,null,false,false]
[null,null,null,null,false,false]
[null,null,null,null,false,false]
[null,null,null,null,false,false]
[null,null,null,null,false,false]
[null,null,null,null,false,false]
[null,null,null,null,false,false]
[null,null,null,null,false,false]
[null,null,null,null,false,false]
[null,null,null,null,false,false]
[null,null,null,null,false,false]
[null,null,null,null,false,false]
[null,null,null,null,false,false]
[null,null,null,null,false,false]
[null,null,null,null,false,false]
[null,null,null,null,false,false]
[null,null,null,null,false,false]
[null,null,null,null,false,false]
[null,null,null,null,false,false]
[null,null,null,null,false,false]
[null,null,null,null,false,false]
[null,null,null,null,false,false]
[null,null,null,null,false,false]
[null,null,null,null,false,false]
[null,null,null,null,false,false]
[null,null,null,null,false,false]
[null,null,null,null,false,false]
[null,null,null,null,false,false]
[null,null,null,null,false,false]
[null,null,null,null,false,false]
[null,null,null,null,false,false]
[null,null,null,null,false,false]
[null,null,null,null,false,false]
[null,null,null,null,false,false]
[null,null,null,null,false,false]
[null,null,null,null,false,false]
[null,null,null,null,false,false]
[null,null,null,null,false,false]
[null,null,null,null,false,false]
[null,null,null,null,false,false]
[null,null,null,null,false,false]
[null,null,null,null,false,false]
[null,null,null,null,false,false]
[null,null,null,null,false,false]
[null,null,null,null,false,false]
[null,null,null,null,false,false]
[null,null,null,null,false,false]
[null,null,null,null,{"$f":"IF(B967=\"TOUT VENANT\",\"Véolia Nice Tri - Parc d'activité logistique\",IF(B967=\"DECHETS VERTS\",\"Orédui Carros Compostage - ZI de la Grave\",IF(B967=\"GRAVATS PROPRES\",\"La Gaude K3 Sita Sud - 5211 Rte de St Jeannet\",IF(B967=\"GRAVATS SALES\",\"Véolia Nice Tri - 20 Ch du Saquier\",IF(B967=\"BOIS\",\"SEAS La Glacière - 1019 Rte de la Grasse\",IF(B967=\"METAUX\",\"PURFER - ZI Carros 15ème Rue - 06517 Carros\",IF(B967=\"BATTERIES\",\"PURFER - ZI Carros 15ème Rue - 06517 Carros\",IF(B967=\"NEON\",\"Sofovar - 126 Av Louis Lépine - 83600 Fréjus\",IF(B967=\"PEINTURES\",\"Orédui - ZI Bois de Grasse - 06310 Grasse\",IF(B967=\"PRODUITS NON IDENTIFIES\",\"Orédui - ZI Bois de Grasse - 06310 Grasse\",IF(B967=\"AEROSOLS\",\"Orédui - ZI Bois de Grasse - 06310 Grasse\",IF(B967=\"FROIDS\",\"SEAS - 1079 Rte de Grasse - 06270 Villeneuve Loubet\",IF(B967=\"HORS FROIDS\",\"SEAS - 1079 Rte de Grasse - 06270 Villeneuve Loubet\",IF(B967=\"PAM\",\"SEAS - 1079 Rte de Grasse - 06270 Villeneuve Loubet\",IF(B967=\"ECRANS\",\"SEAS - 1079 Rte de Grasse - 06270 Villeneuve Loubet\",IF(B967=\"BOX HORS FROIDS\",\"SEAS - 1079 Rte de Grasse - 06270 Villeneuve Loubet\",IF(B967=\"PILES\",\"Corepile\",IF(B967=\"CUMULUS\",\"SEAS - 1079 Rte de Grasse - 06270 Villeneuve Loubet\",IF(B967=\"PNEUS\",\"TFM Pneus - 117 Ch Clausonnes - 06560 Valbonne\",IF(B967=\"HUILES VEGETALES\",\"Orédui - ZI Bois de Grasse - 06310 Grasse\",IF(B967=\"HUILES DE VIDANGE\",\"SERAHU - 68 Ch de la Campanette - 06800 Cagnes sur Mer\")))))))))))))))))))))","v":false},{"$f":"IF(OR(B967=\"TOUT VENANT\",B967=\"DECHETS VERTS\",B967=\"GRAVATS SALES\",B967=\"GRAVATS PROPRES\",B967=\"BOIS\"),\"SUEZ\",IF(OR(B967=\"PNEUS\"),\"TFM\",IF(OR(B967=\"FROIDS\",B967=\"HORS FROIDS\",B967=\"BOX HORS FROIDS\",B967=\"CUMULUS\",B967=\"PAM\",B967=\"ECRANS\"),\"SEAS\",IF(OR(B967=\"METAUX\",B967=\"BATTERIES\"),\"DERICHEBOURG\",IF(OR(B967=\"NEON\"),\"SOFOVAR\",IF(OR(B967=\"PEINTURES\",B967=\"PRODUITS NON IDENTIFIES\",B967=\"AEROSOLS\",B967=\"HUILES VEGETALES\"),\"OREDUI\",IF(OR(B967=\"HUILES DE VIDANGE\"),\"SERAHU\")))))))","v":false}]
[null,null,null,null,false,false]
[null,null,null,null,false,false]
[null,null,null,null,false,false]
[null,null,null,null,false,false]
[null,null,null,null,false,false]
[null,null,null,null,false,false]
[null,null,null,null,false,false]
[null,null,null,null,false,false]
[null,null,null,null,false,false]
[null,null,null,null,false,false]
[null,null,null,null,false,false]
[null,null,null,null,false,false]
[null,null,null,null,false,false]
[null,null,null,null,false,false]
[null,null,null,null,false,false]
[null,null,null,null,false,false]
[null,null,null,null,false,false]
[null,null,null,null,false,false]
[null,null,null,null,false,false]
[null,null,null,null,false,false]
[null,null,null,null,false,false]
[null,null,null,null,false,false]
[null,null,null,null,false,false]
[null,null,null,null,false,false]
[null,null,null,null,false,false]
[null,null,null,null,false,false]
[null,null,null,null,false,false]
[null,null,null,null,false,false]
[null,null,null,null,false,false]
[null,null,null,null,false,false]
[null,null,null,null,false,false]
[null,null,null,null,false,false]
[null,null,null,null,false,false]

{"sheet":"Registre","index":21,"n_rows":1000,"n_cols":14,"rows_kept":1000,"cut":false,"hidden":false,"merged":[[24,11,24,12],[16,11,16,12]]}
["Date d'enlèvement","Nature du déchets","Quantité de déchets\n (en kg)","Unité","Installation de destination \n(nom et adresse)","Transporteur ","Immatriculation","Fiche d'intervention","Signature"]
[null,null,null,"",{"$f":"IF(B2=\"TOUT VENANT\",\"Véolia Nice Tri - Parc d'activité logistique\",IF(B2=\"DECHETS VERTS\",\"Orédui Carros Compostage - ZI de la Grave\",IF(B2=\"GRAVATS PROPRES\",\"La Gaude K3 Sita Sud - 5211 Rte de St Jeannet\",IF(B2=\"GRAVATS SALES\",\"Véolia Nice Tri - 20 Ch du Saquier\",IF(B2=\"BOIS\",\"SEAS La Glacière - 1019 Rte de la Grasse\",IF(B2=\"METAUX\",\"PURFER - ZI Carros 15ème Rue - 06517 Carros\",IF(B2=\"BATTERIES\",\"PURFER - ZI Carros 15ème Rue - 06517 Carros\",IF(B2=\"NEON\",\"Sofovar - 126 Av Louis Lépine - 83600 Fréjus\",IF(B2=\"PEINTURES\",\"Orédui - ZI Bois de Grasse - 06310 Grasse\",IF(B2=\"PRODUITS NON IDENTIFIES\",\"Orédui - ZI Bois de Grasse - 06310 Grasse\",IF(B2=\"AEROSOLS\",\"Orédui - ZI Bois de Grasse - 06310 Grasse\",IF(B2=\"FROIDS\",\"SEAS - 1079 Rte de Grasse - 06270 Villeneuve Loubet\",IF(B2=\"HORS FROIDS\",\"SEAS - 1079 Rte de Grasse - 06270 Villeneuve Loubet\",IF(B2=\"PAM\",\"SEAS - 1079 Rte de Grasse - 06270 Villeneuve Loubet\",IF(B2=\"ECRANS\",\"SEAS - 1079 Rte de Grasse - 06270 Villeneuve Loubet\",IF(B2=\"BOX HORS FROIDS\",\"SEAS - 1079 Rte de Grasse - 06270 Villeneuve Loubet\",IF(B2=\"PILES\",\"Corepile\",IF(B2=\"CUMULUS\",\"SEAS - 1079 Rte de Grasse - 06270 Villeneuve Loubet\",IF(B2=\"PNEUS\",\"TFM Pneus - 117 Ch Clausonnes - 06560 Valbonne\",IF(B2=\"HUILES VEGETALES\",\"Orédui - ZI Bois de Grasse - 06310 Grasse\",IF(B2=\"HUILES DE VIDANGE\",\"SERAHU - 68 Ch de la Campanette - 06800 Cagnes sur Mer\")))))))))))))))))))))","v":false},{"$f":"IF(OR(B2=\"TOUT VENANT\",B2=\"DECHETS VERTS\",B2=\"GRAVATS SALES\",B2=\"GRAVATS PROPRES\",B2=\"BOIS\"),\"SUEZ\",IF(OR(B2=\"PNEUS\"),\"TFM\",IF(OR(B2=\"FROIDS\",B2=\"HORS FROIDS\",B2=\"BOX HORS FROIDS\",B2=\"CUMULUS\",B2=\"PAM\",B2=\"ECRANS\"),\"SEAS\",IF(OR(B2=\"METAUX\",B2=\"BATTERIES\"),\"DERICHEBOURG\",IF(OR(B2=\"NEON\"),\"SOFOVAR\",IF(OR(B2=\"PEINTURES\",B2=\"PRODUITS NON IDENTIFIES\",B2=\"AEROSOLS\",B2=\"HUILES VEGETALES\"),\"OREDUI\",IF(OR(B2=\"HUILES DE VIDANGE\"),\"SERAHU\")))))))","v":false}]
[null,null,null,"",false,false]
[null,null,null,"",false,false]
[null,null,null,null,false,false]
[null,null,null,null,false,false]
[null,null,null,null,false,false]
[null,null,null,null,false,false]
[null,null,null,null,false,false]
[null,null,null,null,false,false]
[null,null,null,null,false,false]
[null,null,null,null,false,false]
[null,null,null,null,false,false]
[null,null,null,null,false,false]
[null,null,null,null,false,false]
[null,null,null,null,false,false]
[null,null,null,null,false,false,null,null,null,null,null,"PRESTATIONS JOURNALIERES SUEZ"]
[null,null,null,null,false,false,null,null,null,null,null,"6 TV ","6 ROTATIONS DE CAMION AMPIROLES"]
[null,null,null,null,false,false,null,null,null,null,null,"6 TV ","3 ROTATIONS DE CAMION GRAPPIN","LUNDI 4 ROTATIONS DE GRAPPIN"]
[null,null,null,null,false,false,null,null,null,null,null,"2 GRAVATS SALES","1  MATIN ET 1 APRES MIDI"]
[null,null,null,null,false,false,null,null,null,null,null,"3 GRAVATS PROPRES","3 ROTATIONS DE CAMION AMPIROLES"]
[null,null,null,null,false,false,null,null,null,null,null,"2 DECHETS VERTS","2 ROTATIONS DE CAMION AMPIROLES"]
[null,null,null,null,false,false,null,null,null,null,null,"2 BOIS","2 ROTATIONS DE CAMION AMPIROLES"]
[null,null,null,null,false,false,null,null,null,null,null,"1 METAUX","1 ROTATION DE CAMION GRAPPIN"]
[null,null,null,null,false,false,null,null,null,null,null,"Le samedi présence d'un camion minimum jusqu'à 16H"]
[null,null,null,null,false,false]
[null,null,null,null,false,false]
[null,null,null,null,false,false]
[null,null,null,null,false,false]
[null,null,null,null,false,false]
[null,null,null,null,false,false]
[null,null,null,null,false,false]
[null,null,null,null,false,false]
[null,null,null,null,false,false]
[null,null,null,null,false,false]
[null,null,null,null,false,false]
[null,null,null,null,false,false]
[null,null,null,null,false,false]
[null,null,null,null,false,false]
[null,null,null,null,false,false]
[null,null,null,null,false,false]
[null,null,null,null,false,false]
[null,null,null,null,false,false]
[null,null,null,null,false,false]
[null,null,null,null,false,false]
[null,null,null,null,false,false]
[null,null,null,null,false,false]
[null,null,null,null,false,false]
[null,null,null,null,false,false]
[null,null,null,null,false,false]
[null,null,null,null,false,false]
[null,null,null,null,false,false]
[null,null,null,null,false,false]
[null,null,null,null,false,false]
[null,null,null,null,false,false]
[null,null,null,null,false,false]
[null,null,null,null,false,false]
[null,null,null,null,false,false]
[null,null,null,null,false,false]
[null,null,null,null,false,false]
[null,null,null,null,false,false]
[null,null,null,null,false,false]
[null,null,null,null,false,false]
[null,null,null,null,false,false]
[null,null,null,null,false,false]
[null,null,null,null,{"$f":"IF(B66=\"TOUT VENANT\",\"Véolia Nice Tri - Parc d'activité logistique\",IF(B66=\"DECHETS VERTS\",\"Orédui Carros Compostage - ZI de la Grave\",IF(B66=\"GRAVATS PROPRES\",\"La Gaude K3 Sita Sud - 5211 Rte de St Jeannet\",IF(B66=\"GRAVATS SALES\",\"Véolia Nice Tri - 20 Ch du Saquier\",IF(B66=\"BOIS\",\"SEAS La Glacière - 1019 Rte de la Grasse\",IF(B66=\"METAUX\",\"PURFER - ZI Carros 15ème Rue - 06517 Carros\",IF(B66=\"BATTERIES\",\"PURFER - ZI Carros 15ème Rue - 06517 Carros\",IF(B66=\"NEON\",\"Sofovar - 126 Av Louis Lépine - 83600 Fréjus\",IF(B66=\"PEINTURES\",\"Orédui - ZI Bois de Grasse - 06310 Grasse\",IF(B66=\"PRODUITS NON IDENTIFIES\",\"Orédui - ZI Bois de Grasse - 06310 Grasse\",IF(B66=\"AEROSOLS\",\"Orédui - ZI Bois de Grasse - 06310 Grasse\",IF(B66=\"FROIDS\",\"SEAS - 1079 Rte de Grasse - 06270 Villeneuve Loubet\",IF(B66=\"HORS FROIDS\",\"SEAS - 1079 Rte de Grasse - 06270 Villeneuve Loubet\",IF(B66=\"PAM\",\"SEAS - 1079 Rte de Grasse - 06270 Villeneuve Loubet\",IF(B66=\"ECRANS\",\"SEAS - 1079 Rte de Grasse - 06270 Villeneuve Loubet\",IF(B66=\"BOX HORS FROIDS\",\"SEAS - 1079 Rte de Grasse - 06270 Villeneuve Loubet\",IF(B66=\"PILES\",\"Corepile\",IF(B66=\"CUMULUS\",\"SEAS - 1079 Rte de Grasse - 06270 Villeneuve Loubet\",IF(B66=\"PNEUS\",\"TFM Pneus - 117 Ch Clausonnes - 06560 Valbonne\",IF(B66=\"HUILES VEGETALES\",\"Orédui - ZI Bois de Grasse - 06310 Grasse\",IF(B66=\"HUILES DE VIDANGE\",\"SERAHU - 68 Ch de la Campanette - 06800 Cagnes sur Mer\")))))))))))))))))))))","v":false},{"$f":"IF(OR(B66=\"TOUT VENANT\",B66=\"DECHETS VERTS\",B66=\"GRAVATS SALES\",B66=\"GRAVATS PROPRES\",B66=\"BOIS\"),\"SUEZ\",IF(OR(B66=\"PNEUS\"),\"TFM\",IF(OR(B66=\"FROIDS\",B66=\"HORS FROIDS\",B66=\"BOX HORS FROIDS\",B66=\"CUMULUS\",B66=\"PAM\",B66=\"ECRANS\"),\"SEAS\",IF(OR(B66=\"METAUX\",B66=\"BATTERIES\"),\"DERICHEBOURG\",IF(OR(B66=\"NEON\"),\"SOFOVAR\",IF(OR(B66=\"PEINTURES\",B66=\"PRODUITS NON IDENTIFIES\",B66=\"AEROSOLS\",B66=\"HUILES VEGETALES\"),\"OREDUI\",IF(OR(B66=\"HUILES DE VIDANGE\"),\"SERAHU\")))))))","v":false}]
[null,null,null,null,false,false]
[null,null,null,null,false,false]
[null,null,null,null,false,false]
[null,null,null,null,false,false]
[null,null,null,null,false,false]
[null,null,null,null,false,false]
[null,null,null,null,false,false]
[null,null,null,null,false,false]
[null,null,null,null,false,false]
[null,null,null,null,false,false]
[null,null,null,null,false,false]
[null,null,null,null,false,false]
[null,null,null,null,false,false]
[null,null,null,null,false,false]
[null,null,null,null,false,false]
[null,null,null,null,false,false]
[null,null,null,null,false,false]
[null,null,null,null,false,false]
[null,null,null,null,false,false]
[null,null,null,null,false,false]
[null,null,null,null,false,false]
[null,null,null,null,false,false]
[null,null,null,null,false,false]
[null,null,null,null,false,false]
[null,null,null,null,false,false]
[null,null,null,null,false,false]
[null,null,null,null,false,false]
[null,null,null,null,false,false]
[null,null,null,null,false,false]
[null,null,null,null,false,false]
[null,null,null,null,false,false]
[null,null,null,null,false,false]
[null,null,null,null,false,false]
[null,null,null,null,false,false]
[null,null,null,null,false,false]
[null,null,null,null,false,false]
[null,null,null,null,false,false]
[null,null,null,null,false,false]
[null,null,null,null,false,false]
[null,null,null,null,false,false]
[null,null,null,null,false,false]
[null,null,null,null,false,false]
[null,null,null,null,false,false]
[null,null,null,null,false,false]
[null,null,null,null,false,false]
[null,null,null,null,false,false]
[null,null,null,null,false,false]
[null,null,null,null,false,false]
[null,null,null,null,false,false]
[null,null,null,null,false,false]
[null,null,null,null,false,false]
[null,null,null,null,false,false]
[null,null,null,null,false,false]
[null,null,null,null,false,false]
[null,null,null,null,false,false]
[null,null,null,null,false,false]
[null,null,null,null,false,false]
[null,null,null,null,false,false]
[null,null,null,null,false,false]
[null,null,null,null,false,false]
[null,null,null,null,false,false]
[null,null,null,null,false,false]
[null,null,null,null,false,false]
[null,null,null,null,{"$f":"IF(B130=\"TOUT VENANT\",\"Véolia Nice Tri - Parc d'activité logistique\",IF(B130=\"DECHETS VERTS\",\"Orédui Carros Compostage - ZI de la Grave\",IF(B130=\"GRAVATS PROPRES\",\"La Gaude K3 Sita Sud - 5211 Rte de St Jeannet\",IF(B130=\"GRAVATS SALES\",\"Véolia Nice Tri - 20 Ch du Saquier\",IF(B130=\"BOIS\",\"SEAS La Glacière - 1019 Rte de la Grasse\",IF(B130=\"METAUX\",\"PURFER - ZI Carros 15ème Rue - 06517 Carros\",IF(B130=\"BATTERIES\",\"PURFER - ZI Carros 15ème Rue - 06517 Carros\",IF(B130=\"NEON\",\"Sofovar - 126 Av Louis Lépine - 83600 Fréjus\",IF(B130=\"PEINTURES\",\"Orédui - ZI Bois de Grasse - 06310 Grasse\",IF(B130=\"PRODUITS NON IDENTIFIES\",\"Orédui - ZI Bois de Grasse - 06310 Grasse\",IF(B130=\"AEROSOLS\",\"Orédui - ZI Bois de Grasse - 06310 Grasse\",IF(B130=\"FROIDS\",\"SEAS - 1079 Rte de Grasse - 06270 Villeneuve Loubet\",IF(B130=\"HORS FROIDS\",\"SEAS - 1079 Rte de Grasse - 06270 Villeneuve Loubet\",IF(B130=\"PAM\",\"SEAS - 1079 Rte de Grasse - 06270 Villeneuve Loubet\",IF(B130=\"ECRANS\",\"SEAS - 1079 Rte de Grasse - 06270 Villeneuve Loubet\",IF(B130=\"BOX HORS FROIDS\",\"SEAS - 1079 Rte de Grasse - 06270 Villeneuve Loubet\",IF(B130=\"PILES\",\"Corepile\",IF(B130=\"CUMULUS\",\"SEAS - 1079 Rte de Grasse - 06270 Villeneuve Loubet\",IF(B130=\"PNEUS\",\"TFM Pneus - 117 Ch Clausonnes - 06560 Valbonne\",IF(B130=\"HUILES VEGETALES\",\"Orédui - ZI Bois de Grasse - 06310 Grasse\",IF(B130=\"HUILES DE VIDANGE\",\"SERAHU - 68 Ch de la Campanette - 06800 Cagnes sur Mer\")))))))))))))))))))))","v":false},{"$f":"IF(OR(B130=\"TOUT VENANT\",B130=\"DECHETS VERTS\",B130=\"GRAVATS SALES\",B130=\"GRAVATS PROPRES\",B130=\"BOIS\"),\"SUEZ\",IF(OR(B130=\"PNEUS\"),\"TFM\",IF(OR(B130=\"FROIDS\",B130=\"HORS FROIDS\",B130=\"BOX HORS FROIDS\",B130=\"CUMULUS\",B130=\"PAM\",B130=\"ECRANS\"),\"SEAS\",IF(OR(B130=\"METAUX\",B130=\"BATTERIES\"),\"DERICHEBOURG\",IF(OR(B130=\"NEON\"),\"SOFOVAR\",IF(OR(B130=\"PEINTURES\",B130=\"PRODUITS NON IDENTIFIES\",B130=\"AEROSOLS\",B130=\"HUILES VEGETALES\"),\"OREDUI\",IF(OR(B130=\"HUILES DE VIDANGE\"),\"SERAHU\")))))))","v":false}]
[null,null,null,null,false,false]
[null,null,null,null,false,false]
[null,null,null,null,false,false]
[null,null,null,null,false,false]
[null,null,null,null,false,false]
[null,null,null,null,false,false]
[null,null,null,null,false,false]
[null,null,null,null,false,false]
[null,null,null,null,false,false]
[null,null,null,null,false,false]
[null,null,null,null,false,false]
[null,null,null,null,false,false]
[null,null,null,null,false,false]
[null,null,null,null,false,false]
[null,null,null,null,false,false]
[null,null,null,null,false,false]
[null,null,null,null,false,false]
[null,null,null,null,false,false]
[null,null,null,null,false,false]
[null,null,null,null,false,false]
[null,null,null,null,false,false]
[null,null,null,null,false,false]
[null,null,null,null,false,false]
[null,null,null,null,false,false]
[null,null,null,null,false,false]
[null,null,null,null,false,false]
[null,null,null,null,false,false]
[null,null,null,null,false,false]
[null,null,null,null,false,false]
[null,null,null,null,false,false]
[null,null,null,null,false,false]
[null,null,null,null,false,false]
[null,null,null,null,false,false]
[null,null,null,null,false,false]
[null,null,null,null,false,false]
[null,null,null,null,false,false]
[null,null,null,null,false,false]
[null,null,null,null,false,false]
[null,null,null,null,false,false]
[null,null,null,null,false,false]
[null,null,null,null,false,false]
[null,null,null,null,false,false]
[null,null,null,null,false,false]
[null,null,null,null,false,false]
[null,null,null,null,false,false]
[null,null,null,null,false,false]
[null,null,null,null,false,false]
[null,null,null,null,false,false]
[null,null,null,null,false,false]
[null,null,null,null,false,false]
[null,null,null,null,false,false]
[null,null,null,null,false,false]
[null,null,null,null,false,false]
[null,null,null,null,false,false]
[null,null,null,null,false,false]
[null,null,null,null,false,false]
[null,null,null,null,false,false]
[null,null,null,null,false,false]
[null,null,null,null,false,false]
[null,null,null,null,false,false]
[null,null,null,null,false,false]
[null,null,null,null,false,false]
[null,null,null,null,false,false]
[null,null,null,null,{"$f":"IF(B194=\"TOUT VENANT\",\"Véolia Nice Tri - Parc d'activité logistique\",IF(B194=\"DECHETS VERTS\",\"Orédui Carros Compostage - ZI de la Grave\",IF(B194=\"GRAVATS PROPRES\",\"La Gaude K3 Sita Sud - 5211 Rte de St Jeannet\",IF(B194=\"GRAVATS SALES\",\"Véolia Nice Tri - 20 Ch du Saquier\",IF(B194=\"BOIS\",\"SEAS La Glacière - 1019 Rte de la Grasse\",IF(B194=\"METAUX\",\"PURFER - ZI Carros 15ème Rue - 06517 Carros\",IF(B194=\"BATTERIES\",\"PURFER - ZI Carros 15ème Rue - 06517 Carros\",IF(B194=\"NEON\",\"Sofovar - 126 Av Louis Lépine - 83600 Fréjus\",IF(B194=\"PEINTURES\",\"Orédui - ZI Bois de Grasse - 06310 Grasse\",IF(B194=\"PRODUITS NON IDENTIFIES\",\"Orédui - ZI Bois de Grasse - 06310 Grasse\",IF(B194=\"AEROSOLS\",\"Orédui - ZI Bois de Grasse - 06310 Grasse\",IF(B194=\"FROIDS\",\"SEAS - 1079 Rte de Grasse - 06270 Villeneuve Loubet\",IF(B194=\"HORS FROIDS\",\"SEAS - 1079 Rte de Grasse - 06270 Villeneuve Loubet\",IF(B194=\"PAM\",\"SEAS - 1079 Rte de Grasse - 06270 Villeneuve Loubet\",IF(B194=\"ECRANS\",\"SEAS - 1079 Rte de Grasse - 06270 Villeneuve Loubet\",IF(B194=\"BOX HORS FROIDS\",\"SEAS - 1079 Rte de Grasse - 06270 Villeneuve Loubet\",IF(B194=\"PILES\",\"Corepile\",IF(B194=\"CUMULUS\",\"SEAS - 1079 Rte de Grasse - 06270 Villeneuve Loubet\",IF(B194=\"PNEUS\",\"TFM Pneus - 117 Ch Clausonnes - 06560 Valbonne\",IF(B194=\"HUILES VEGETALES\",\"Orédui - ZI Bois de Grasse - 06310 Grasse\",IF(B194=\"HUILES DE VIDANGE\",\"SERAHU - 68 Ch de la Campanette - 06800 Cagnes sur Mer\")))))))))))))))))))))","v":false},{"$f":"IF(OR(B194=\"TOUT VENANT\",B194=\"DECHETS VERTS\",B194=\"GRAVATS SALES\",B194=\"GRAVATS PROPRES\",B194=\"BOIS\"),\"SUEZ\",IF(OR(B194=\"PNEUS\"),\"TFM\",IF(OR(B194=\"FROIDS\",B194=\"HORS FROIDS\",B194=\"BOX HORS FROIDS\",B194=\"CUMULUS\",B194=\"PAM\",B194=\"ECRANS\"),\"SEAS\",IF(OR(B194=\"METAUX\",B194=\"BATTERIES\"),\"DERICHEBOURG\",IF(OR(B194=\"NEON\"),\"SOFOVAR\",IF(OR(B194=\"PEINTURES\",B194=\"PRODUITS NON IDENTIFIES\",B194=\"AEROSOLS\",B194=\"HUILES VEGETALES\"),\"OREDUI\",IF(OR(B194=\"HUILES DE VIDANGE\"),\"SERAHU\")))))))","v":false}]
[null,null,null,null,false,false]
[null,null,null,null,false,false]
[null,null,null,null,false,false]
[null,null,null,null,false,false]
[null,null,null,null,false,false]
[null,null,null,null,false,false]
[null,null,null,null,false,false]
[null,null,null,null,false,false]
[null,null,null,null,false,false]
[null,null,null,null,false,false]
[null,null,null,null,false,false]
[null,null,null,null,false,false]
[null,null,null,null,false,false]
[null,null,null,null,false,false]
[null,null,null,null,false,false]
[null,null,null,null,false,false]
[null,null,null,null,false,false]
[null,null,null,null,false,false]
[null,null,null,null,false,false]
[null,null,null,null,false,false]
[null,null,null,null,false,false]
[null,null,null,null,false,false]
[null,null,null,null,false,false]
[null,null,null,null,false,false]
[null,null,null,null,false,false]
[null,null,null,null,false,false]
[null,null,null,null,false,false]
[null,null,null,null,false,false]
[null,null,null,null,false,false]
[null,null,null,null,false,false]
[null,null,null,null,false,false]
[null,null,null,null,false,false]
[null,null,null,null,false,false]
[null,null,null,null,false,false]
[null,null,null,null,false,false]
[null,null,null,null,false,false]
[null,null,null,null,false,false]
[null,null,null,null,false,false]
[null,null,null,null,false,false]
[null,null,null,null,false,false]
[null,null,null,null,false,false]
[null,null,null,null,false,false]
[null,null,null,null,false,false]
[null,null,null,null,false,false]
[null,null,null,null,false,false]
[null,null,null,null,false,false]
[null,null,null,null,false,false]
[null,null,null,null,false,false]
[null,null,null,null,false,false]
[null,null,null,null,false,false]
[null,null,null,null,false,false]
[null,null,null,null,false,false]
[null,null,null,null,false,false]
[null,null,null,null,false,false]
[null,null,null,null,false,false]
[null,null,null,null,false,false]
[null,null,null,null,false,false]
[null,null,null,null,false,false]
[null,null,null,null,false,false]
[null,null,null,null,false,false]
[null,null,null,null,false,false]
[null,null,null,null,false,false]
[null,null,null,null,false,false]
[null,null,null,null,{"$f":"IF(B258=\"TOUT VENANT\",\"Véolia Nice Tri - Parc d'activité logistique\",IF(B258=\"DECHETS VERTS\",\"Orédui Carros Compostage - ZI de la Grave\",IF(B258=\"GRAVATS PROPRES\",\"La Gaude K3 Sita Sud - 5211 Rte de St Jeannet\",IF(B258=\"GRAVATS SALES\",\"Véolia Nice Tri - 20 Ch du Saquier\",IF(B258=\"BOIS\",\"SEAS La Glacière - 1019 Rte de la Grasse\",IF(B258=\"METAUX\",\"PURFER - ZI Carros 15ème Rue - 06517 Carros\",IF(B258=\"BATTERIES\",\"PURFER - ZI Carros 15ème Rue - 06517 Carros\",IF(B258=\"NEON\",\"Sofovar - 126 Av Louis Lépine - 83600 Fréjus\",IF(B258=\"PEINTURES\",\"Orédui - ZI Bois de Grasse - 06310 Grasse\",IF(B258=\"PRODUITS NON IDENTIFIES\",\"Orédui - ZI Bois de Grasse - 06310 Grasse\",IF(B258=\"AEROSOLS\",\"Orédui - ZI Bois de Grasse - 06310 Grasse\",IF(B258=\"FROIDS\",\"SEAS - 1079 Rte de Grasse - 06270 Villeneuve Loubet\",IF(B258=\"HORS FROIDS\",\"SEAS - 1079 Rte de Grasse - 06270 Villeneuve Loubet\",IF(B258=\"PAM\",\"SEAS - 1079 Rte de Grasse - 06270 Villeneuve Loubet\",IF(B258=\"ECRANS\",\"SEAS - 1079 Rte de Grasse - 06270 Villeneuve Loubet\",IF(B258=\"BOX HORS FROIDS\",\"SEAS - 1079 Rte de Grasse - 06270 Villeneuve Loubet\",IF(B258=\"PILES\",\"Corepile\",IF(B258=\"CUMULUS\",\"SEAS - 1079 Rte de Grasse - 06270 Villeneuve Loubet\",IF(B258=\"PNEUS\",\"TFM Pneus - 117 Ch Clausonnes - 06560 Valbonne\",IF(B258=\"HUILES VEGETALES\",\"Orédui - ZI Bois de Grasse - 06310 Grasse\",IF(B258=\"HUILES DE VIDANGE\",\"SERAHU - 68 Ch de la Campanette - 06800 Cagnes sur Mer\")))))))))))))))))))))","v":false},{"$f":"IF(OR(B258=\"TOUT VENANT\",B258=\"DECHETS VERTS\",B258=\"GRAVATS SALES\",B258=\"GRAVATS PROPRES\",B258=\"BOIS\"),\"SUEZ\",IF(OR(B258=\"PNEUS\"),\"TFM\",IF(OR(B258=\"FROIDS\",B258=\"HORS FROIDS\",B258=\"BOX HORS FROIDS\",B258=\"CUMULUS\",B258=\"PAM\",B258=\"ECRANS\"),\"SEAS\",IF(OR(B258=\"METAUX\",B258=\"BATTERIES\"),\"DERICHEBOURG\",IF(OR(B258=\"NEON\"),\"SOFOVAR\",IF(OR(B258=\"PEINTURES\",B258=\"PRODUITS NON IDENTIFIES\",B258=\"AEROSOLS\",B258=\"HUILES VEGETALES\"),\"OREDUI\",IF(OR(B258=\"HUILES DE VIDANGE\"),\"SERAHU\")))))))","v":false}]
[null,null,null,null,false,false]
[null,null,null,null,false,false]
[null,null,null,null,false,false]
[null,null,null,null,false,false]
[null,null,null,null,false,false]
[null,null,null,null,false,false]
[null,null,null,null,false,false]
[null,null,null,null,false,false]
[null,null,null,null,false,false]
[null,null,null,null,false,false]
[null,null,null,null,false,false]
[null,null,null,null,false,false]
[null,null,null,null,false,false]
[null,null,null,null,false,false]
[null,null,null,null,false,false]
[null,null,null,null,false,false]
[null,null,null,null,false,false]
[null,null,null,null,false,false]
[null,null,null,null,false,false]
[null,null,null,null,false,false]
[null,null,null,null,false,false]
[null,null,null,null,false,false]
[null,null,null,null,false,false]
[null,null,null,null,false,false]
[null,null,null,null,false,false]
[null,null,null,null,false,false]
[null,null,null,null,false,false]
[null,null,null,null,false,false]
[null,null,null,null,false,false]
[null,null,null,null,false,false]
[null,null,null,null,false,false]
[null,null,null,null,false,false]
[null,null,null,null,false,false]
[null,null,null,null,false,false]
[null,null,null,null,false,false]
[null,null,null,null,false,false]
[null,null,null,null,false,false]
[null,null,null,null,false,false]
[null,null,null,null,false,false]
[null,null,null,null,false,false]
[null,null,null,null,false,false]
[null,null,null,null,false,false]
[null,null,null,null,false,false]
[null,null,null,null,false,false]
[null,null,null,null,false,false]
[null,null,null,null,false,false]
[null,null,null,null,false,false]
[null,null,null,null,false,false]
[null,null,null,null,false,false]
[null,null,null,null,false,false]
[null,null,null,null,false,false]
[null,null,null,null,false,false]
[null,null,null,null,false,false]
[null,null,null,null,false,false]
[null,null,null,null,false,false]
[null,null,null,null,false,false]
[null,null,null,null,false,false]
[null,null,null,null,false,false]
[null,null,null,null,false,false]
[null,null,null,null,false,false]
[null,null,null,null,false,false]
[null,null,null,null,false,false]
[null,null,null,null,false,false]
[null,null,null,null,{"$f":"IF(B322=\"TOUT VENANT\",\"Véolia Nice Tri - Parc d'activité logistique\",IF(B322=\"DECHETS VERTS\",\"Orédui Carros Compostage - ZI de la Grave\",IF(B322=\"GRAVATS PROPRES\",\"La Gaude K3 Sita Sud - 5211 Rte de St Jeannet\",IF(B322=\"GRAVATS SALES\",\"Véolia Nice Tri - 20 Ch du Saquier\",IF(B322=\"BOIS\",\"SEAS La Glacière - 1019 Rte de la Grasse\",IF(B322=\"METAUX\",\"PURFER - ZI Carros 15ème Rue - 06517 Carros\",IF(B322=\"BATTERIES\",\"PURFER - ZI Carros 15ème Rue - 06517 Carros\",IF(B322=\"NEON\",\"Sofovar - 126 Av Louis Lépine - 83600 Fréjus\",IF(B322=\"PEINTURES\",\"Orédui - ZI Bois de Grasse - 06310 Grasse\",IF(B322=\"PRODUITS NON IDENTIFIES\",\"Orédui - ZI Bois de Grasse - 06310 Grasse\",IF(B322=\"AEROSOLS\",\"Orédui - ZI Bois de Grasse - 06310 Grasse\",IF(B322=\"FROIDS\",\"SEAS - 1079 Rte de Grasse - 06270 Villeneuve Loubet\",IF(B322=\"HORS FROIDS\",\"SEAS - 1079 Rte de Grasse - 06270 Villeneuve Loubet\",IF(B322=\"PAM\",\"SEAS - 1079 Rte de Grasse - 06270 Villeneuve Loubet\",IF(B322=\"ECRANS\",\"SEAS - 1079 Rte de Grasse - 06270 Villeneuve Loubet\",IF(B322=\"BOX HORS FROIDS\",\"SEAS - 1079 Rte de Grasse - 06270 Villeneuve Loubet\",IF(B322=\"PILES\",\"Corepile\",IF(B322=\"CUMULUS\",\"SEAS - 1079 Rte de Grasse - 06270 Villeneuve Loubet\",IF(B322=\"PNEUS\",\"TFM Pneus - 117 Ch Clausonnes - 06560 Valbonne\",IF(B322=\"HUILES VEGETALES\",\"Orédui - ZI Bois de Grasse - 06310 Grasse\",IF(B322=\"HUILES DE VIDANGE\",\"SERAHU - 68 Ch de la Campanette - 06800 Cagnes sur Mer\")))))))))))))))))))))","v":false},{"$f":"IF(OR(B322=\"TOUT VENANT\",B322=\"DECHETS VERTS\",B322=\"GRAVATS SALES\",B322=\"GRAVATS PROPRES\",B322=\"BOIS\"),\"SUEZ\",IF(OR(B322=\"PNEUS\"),\"TFM\",IF(OR(B322=\"FROIDS\",B322=\"HORS FROIDS\",B322=\"BOX HORS FROIDS\",B322=\"CUMULUS\",B322=\"PAM\",B322=\"ECRANS\"),\"SEAS\",IF(OR(B322=\"METAUX\",B322=\"BATTERIES\"),\"DERICHEBOURG\",IF(OR(B322=\"NEON\"),\"SOFOVAR\",IF(OR(B322=\"PEINTURES\",B322=\"PRODUITS NON IDENTIFIES\",B322=\"AEROSOLS\",B322=\"HUILES VEGETALES\"),\"OREDUI\",IF(OR(B322=\"HUILES DE VIDANGE\"),\"SERAHU\")))))))","v":false}]
[null,null,null,null,false,false]
[null,null,null,null,false,false]
[null,null,null,null,false,false]
[null,null,null,null,false,false]
[null,null,null,null,false,false]
[null,null,null,null,false,false]
[null,null,null,null,false,false]
[null,null,null,null,false,false]
[null,null,null,null,false,false]
[null,null,null,null,false,false]
[null,null,null,null,false,false]
[null,null,null,null,false,false]
[null,null,null,null,false,false]
[null,null,null,null,false,false]
[null,null,null,null,false,false]
[null,null,null,null,false,false]
[null,null,null,null,false,false]
[null,null,null,null,false,false]
[null,null,null,null,false,false]
[null,null,null,null,false,false]
[null,null,null,null,false,false]
[null,null,null,null,false,false]
[null,null,null,null,false,false]
[null,null,null,null,false,false]
[null,null,null,null,false,false]
[null,null,null,null,false,false]
[null,null,null,null,false,false]
[null,null,null,null,false,false]
[null,null,null,null,false,false]
[null,null,null,null,false,false]
[null,null,null,null,false,false]
[null,null,null,null,false,false]
[null,null,null,null,false,false]
[null,null,null,null,false,false]
[null,null,null,null,false,false]
[null,null,null,null,false,false]
[null,null,null,null,false,false]
[null,null,null,null,false,false]
[null,null,null,null,false,false]
[null,null,null,null,false,false]
[null,null,null,null,false,false]
[null,null,null,null,false,false]
[null,null,null,null,false,false]
[null,null,null,null,false,false]
[null,null,null,null,false,false]
[null,null,null,null,false,false]
[null,null,null,null,false,false]
[null,null,null,null,false,false]
[null,null,null,null,false,false]
[null,null,null,null,false,false]
[null,null,null,null,false,false]
[null,null,null,null,false,false]
[null,null,null,null,false,false]
[null,null,null,null,false,false]
[null,null,null,null,false,false]
[null,null,null,null,false,false]
[null,null,null,null,false,false]
[null,null,null,null,false,false]
[null,null,null,null,false,false]
[null,null,null,null,false,false]
[null,null,null,null,false,false]
[null,null,null,null,false,false]
[null,null,null,null,false,false]
[null,null,null,null,{"$f":"IF(B386=\"TOUT VENANT\",\"Véolia Nice Tri - Parc d'activité logistique\",IF(B386=\"DECHETS VERTS\",\"Orédui Carros Compostage - ZI de la Grave\",IF(B386=\"GRAVATS PROPRES\",\"La Gaude K3 Sita Sud - 5211 Rte de St Jeannet\",IF(B386=\"GRAVATS SALES\",\"Véolia Nice Tri - 20 Ch du Saquier\",IF(B386=\"BOIS\",\"SEAS La Glacière - 1019 Rte de la Grasse\",IF(B386=\"METAUX\",\"PURFER - ZI Carros 15ème Rue - 06517 Carros\",IF(B386=\"BATTERIES\",\"PURFER - ZI Carros 15ème Rue - 06517 Carros\",IF(B386=\"NEON\",\"Sofovar - 126 Av Louis Lépine - 83600 Fréjus\",IF(B386=\"PEINTURES\",\"Orédui - ZI Bois de Grasse - 06310 Grasse\",IF(B386=\"PRODUITS NON IDENTIFIES\",\"Orédui - ZI Bois de Grasse - 06310 Grasse\",IF(B386=\"AEROSOLS\",\"Orédui - ZI Bois de Grasse - 06310 Grasse\",IF(B386=\"FROIDS\",\"SEAS - 1079 Rte de Grasse - 06270 Villeneuve Loubet\",IF(B386=\"HORS FROIDS\",\"SEAS - 1079 Rte de Grasse - 06270 Villeneuve Loubet\",IF(B386=\"PAM\",\"SEAS - 1079 Rte de Grasse - 06270 Villeneuve Loubet\",IF(B386=\"ECRANS\",\"SEAS - 1079 Rte de Grasse - 06270 Villeneuve Loubet\",IF(B386=\"BOX HORS FROIDS\",\"SEAS - 1079 Rte de Grasse - 06270 Villeneuve Loubet\",IF(B386=\"PILES\",\"Corepile\",IF(B386=\"CUMULUS\",\"SEAS - 1079 Rte de Grasse - 06270 Villeneuve Loubet\",IF(B386=\"PNEUS\",\"TFM Pneus - 117 Ch Clausonnes - 06560 Valbonne\",IF(B386=\"HUILES VEGETALES\",\"Orédui - ZI Bois de Grasse - 06310 Grasse\",IF(B386=\"HUILES DE VIDANGE\",\"SERAHU - 68 Ch de la Campanette - 06800 Cagnes sur Mer\")))))))))))))))))))))","v":false},{"$f":"IF(OR(B386=\"TOUT VENANT\",B386=\"DECHETS VERTS\",B386=\"GRAVATS SALES\",B386=\"GRAVATS PROPRES\",B386=\"BOIS\"),\"SUEZ\",IF(OR(B386=\"PNEUS\"),\"TFM\",IF(OR(B386=\"FROIDS\",B386=\"HORS FROIDS\",B386=\"BOX HORS FROIDS\",B386=\"CUMULUS\",B386=\"PAM\",B386=\"ECRANS\"),\"SEAS\",IF(OR(B386=\"METAUX\",B386=\"BATTERIES\"),\"DERICHEBOURG\",IF(OR(B386=\"NEON\"),\"SOFOVAR\",IF(OR(B386=\"PEINTURES\",B386=\"PRODUITS NON IDENTIFIES\",B386=\"AEROSOLS\",B386=\"HUILES VEGETALES\"),\"OREDUI\",IF(OR(B386=\"HUILES DE VIDANGE\"),\"SERAHU\")))))))","v":false}]
[null,null,null,null,false,false]
[null,null,null,null,false,false]
[null,null,null,null,false,false]
[null,null,null,null,false,false]
[null,null,null,null,false,false]
[null,null,null,null,false,false]
[null,null,null,null,false,false]
[null,null,null,null,false,false]
[null,null,null,null,false,false]
[null,null,null,null,false,false]
[null,null,null,null,false,false]
[null,null,null,null,false,false]
[null,null,null,null,false,false]
[null,null,null,null,false,false]
[null,null,null,null,false,false]
[null,null,null,null,false,false]
[null,null,null,null,false,false]
[null,null,null,null,false,false]
[null,null,null,null,false,false]
[null,null,null,null,false,false]
[null,null,null,null,false,false]
[null,null,null,null,false,false]
[null,null,null,null,false,false]
[null,null,null,null,false,false]
[null,null,null,null,false,false]
[null,null,null,null,false,false]
[null,null,null,null,false,false]
[null,null,null,null,false,false]
[null,null,null,null,false,false]
[null,null,null,null,false,false]
[null,null,null,null,false,false]
[null,null,null,null,false,false]
[null,null,null,null,false,false]
[null,null,null,null,false,false]
[null,null,null,null,false,false]
[null,null,null,null,false,false]
[null,null,null,null,false,false]
[null,null,null,null,false,false]
[null,null,null,null,false,false]
[null,null,null,null,false,false]
[null,null,null,null,false,false]
[null,null,null,null,false,false]
[null,null,null,null,false,false]
[null,null,null,null,false,false]
[null,null,null,null,false,false]
[null,null,null,null,false,false]
[null,null,null,null,false,false]
[null,null,null,null,false,false]
[null,null,null,null,false,false]
[null,null,null,null,false,false]
[null,null,null,null,false,false]
[null,null,null,null,false,false]
[null,null,null,null,false,false]
[null,null,null,null,false,false]
[null,null,null,null,false,false]
[null,null,null,null,false,false]
[null,null,null,null,false,false]
[null,null,null,null,false,false]
[null,null,null,null,false,false]
[null,null,null,null,false,false]
[null,null,null,null,false,false]
[null,null,null,null,false,false]
[null,null,null,null,false,false]
[null,null,null,null,{"$f":"IF(B450=\"TOUT VENANT\",\"Véolia Nice Tri - Parc d'activité logistique\",IF(B450=\"DECHETS VERTS\",\"Orédui Carros Compostage - ZI de la Grave\",IF(B450=\"GRAVATS PROPRES\",\"La Gaude K3 Sita Sud - 5211 Rte de St Jeannet\",IF(B450=\"GRAVATS SALES\",\"Véolia Nice Tri - 20 Ch du Saquier\",IF(B450=\"BOIS\",\"SEAS La Glacière - 1019 Rte de la Grasse\",IF(B450=\"METAUX\",\"PURFER - ZI Carros 15ème Rue - 06517 Carros\",IF(B450=\"BATTERIES\",\"PURFER - ZI Carros 15ème Rue - 06517 Carros\",IF(B450=\"NEON\",\"Sofovar - 126 Av Louis Lépine - 83600 Fréjus\",IF(B450=\"PEINTURES\",\"Orédui - ZI Bois de Grasse - 06310 Grasse\",IF(B450=\"PRODUITS NON IDENTIFIES\",\"Orédui - ZI Bois de Grasse - 06310 Grasse\",IF(B450=\"AEROSOLS\",\"Orédui - ZI Bois de Grasse - 06310 Grasse\",IF(B450=\"FROIDS\",\"SEAS - 1079 Rte de Grasse - 06270 Villeneuve Loubet\",IF(B450=\"HORS FROIDS\",\"SEAS - 1079 Rte de Grasse - 06270 Villeneuve Loubet\",IF(B450=\"PAM\",\"SEAS - 1079 Rte de Grasse - 06270 Villeneuve Loubet\",IF(B450=\"ECRANS\",\"SEAS - 1079 Rte de Grasse - 06270 Villeneuve Loubet\",IF(B450=\"BOX HORS FROIDS\",\"SEAS - 1079 Rte de Grasse - 06270 Villeneuve Loubet\",IF(B450=\"PILES\",\"Corepile\",IF(B450=\"CUMULUS\",\"SEAS - 1079 Rte de Grasse - 06270 Villeneuve Loubet\",IF(B450=\"PNEUS\",\"TFM Pneus - 117 Ch Clausonnes - 06560 Valbonne\",IF(B450=\"HUILES VEGETALES\",\"Orédui - ZI Bois de Grasse - 06310 Grasse\",IF(B450=\"HUILES DE VIDANGE\",\"SERAHU - 68 Ch de la Campanette - 06800 Cagnes sur Mer\")))))))))))))))))))))","v":false},{"$f":"IF(OR(B450=\"TOUT VENANT\",B450=\"DECHETS VERTS\",B450=\"GRAVATS SALES\",B450=\"GRAVATS PROPRES\",B450=\"BOIS\"),\"SUEZ\",IF(OR(B450=\"PNEUS\"),\"TFM\",IF(OR(B450=\"FROIDS\",B450=\"HORS FROIDS\",B450=\"BOX HORS FROIDS\",B450=\"CUMULUS\",B450=\"PAM\",B450=\"ECRANS\"),\"SEAS\",IF(OR(B450=\"METAUX\",B450=\"BATTERIES\"),\"DERICHEBOURG\",IF(OR(B450=\"NEON\"),\"SOFOVAR\",IF(OR(B450=\"PEINTURES\",B450=\"PRODUITS NON IDENTIFIES\",B450=\"AEROSOLS\",B450=\"HUILES VEGETALES\"),\"OREDUI\",IF(OR(B450=\"HUILES DE VIDANGE\"),\"SERAHU\")))))))","v":false}]
[null,null,null,null,false,false]
[null,null,null,null,false,false]
[null,null,null,null,false,false]
[null,null,null,null,false,false]
[null,null,null,null,false,false]
[null,null,null,null,false,false]
[null,null,null,null,false,false]
[null,null,null,null,false,false]
[null,null,null,null,false,false]
[null,null,null,null,false,false]
[null,null,null,null,false,false]
[null,null,null,null,false,false]
[null,null,null,null,false,false]
[null,null,null,null,false,false]
[null,null,null,null,false,false]
[null,null,null,null,false,false]
[null,null,null,null,false,false]
[null,null,null,null,false,false]
[null,null,null,null,false,false]
[null,null,null,null,false,false]
[null,null,null,null,false,false]
[null,null,null,null,false,false]
[null,null,null,null,false,false]
[null,null,null,null,false,false]
[null,null,null,null,false,false]
[null,null,null,null,false,false]
[null,null,null,null,false,false]
[null,null,null,null,false,false]
[null,null,null,null,false,false]
[null,null,null,null,false,false]
[null,null,null,null,false,false]
[null,null,null,null,false,false]
[null,null,null,null,false,false]
[null,null,null,null,false,false]
[null,null,null,null,false,false]
[null,null,null,null,false,false]
[null,null,null,null,false,false]
[null,null,null,null,false,false]
[null,null,null,null,false,false]
[null,null,null,null,false,false]
[null,null,null,null,false,false]
[null,null,null,null,false,false]
[null,null,null,null,false,false]
[null,null,null,null,false,false]
[null,null,null,null,false,false]
[null,null,null,null,false,false]
[null,null,null,null,false,false]
[null,null,null,null,false,false]
[null,null,null,null,false,false]
[null,null,null,null,false,false]
[null,null,null,null,false,false]
[null,null,null,null,false,false]
[null,null,null,null,false,false]
[null,null,null,null,false,false]
[null,null,null,null,false,false]
[null,null,null,null,false,false]
[null,null,null,null,false,false]
[null,null,null,null,false,false]
[null,null,null,null,false,false]
[null,null,null,null,false,false]
[null,null,null,null,false,false]
[null,null,null,null,false,false]
[null,null,null,null,false,false]
[null,null,null,null,{"$f":"IF(B514=\"TOUT VENANT\",\"Véolia Nice Tri - Parc d'activité logistique\",IF(B514=\"DECHETS VERTS\",\"Orédui Carros Compostage - ZI de la Grave\",IF(B514=\"GRAVATS PROPRES\",\"La Gaude K3 Sita Sud - 5211 Rte de St Jeannet\",IF(B514=\"GRAVATS SALES\",\"Véolia Nice Tri - 20 Ch du Saquier\",IF(B514=\"BOIS\",\"SEAS La Glacière - 1019 Rte de la Grasse\",IF(B514=\"METAUX\",\"PURFER - ZI Carros 15ème Rue - 06517 Carros\",IF(B514=\"BATTERIES\",\"PURFER - ZI Carros 15ème Rue - 06517 Carros\",IF(B514=\"NEON\",\"Sofovar - 126 Av Louis Lépine - 83600 Fréjus\",IF(B514=\"PEINTURES\",\"Orédui - ZI Bois de Grasse - 06310 Grasse\",IF(B514=\"PRODUITS NON IDENTIFIES\",\"Orédui - ZI Bois de Grasse - 06310 Grasse\",IF(B514=\"AEROSOLS\",\"Orédui - ZI Bois de Grasse - 06310 Grasse\",IF(B514=\"FROIDS\",\"SEAS - 1079 Rte de Grasse - 06270 Villeneuve Loubet\",IF(B514=\"HORS FROIDS\",\"SEAS - 1079 Rte de Grasse - 06270 Villeneuve Loubet\",IF(B514=\"PAM\",\"SEAS - 1079 Rte de Grasse - 06270 Villeneuve Loubet\",IF(B514=\"ECRANS\",\"SEAS - 1079 Rte de Grasse - 06270 Villeneuve Loubet\",IF(B514=\"BOX HORS FROIDS\",\"SEAS - 1079 Rte de Grasse - 06270 Villeneuve Loubet\",IF(B514=\"PILES\",\"Corepile\",IF(B514=\"CUMULUS\",\"SEAS - 1079 Rte de Grasse - 06270 Villeneuve Loubet\",IF(B514=\"PNEUS\",\"TFM Pneus - 117 Ch Clausonnes - 06560 Valbonne\",IF(B514=\"HUILES VEGETALES\",\"Orédui - ZI Bois de Grasse - 06310 Grasse\",IF(B514=\"HUILES DE VIDANGE\",\"SERAHU - 68 Ch de la Campanette - 06800 Cagnes sur Mer\")))))))))))))))))))))","v":false},{"$f":"IF(OR(B514=\"TOUT VENANT\",B514=\"DECHETS VERTS\",B514=\"GRAVATS SALES\",B514=\"GRAVATS PROPRES\",B514=\"BOIS\"),\"SUEZ\",IF(OR(B514=\"PNEUS\"),\"TFM\",IF(OR(B514=\"FROIDS\",B514=\"HORS FROIDS\",B514=\"BOX HORS FROIDS\",B514=\"CUMULUS\",B514=\"PAM\",B514=\"ECRANS\"),\"SEAS\",IF(OR(B514=\"METAUX\",B514=\"BATTERIES\"),\"DERICHEBOURG\",IF(OR(B514=\"NEON\"),\"SOFOVAR\",IF(OR(B514=\"PEINTURES\",B514=\"PRODUITS NON IDENTIFIES\",B514=\"AEROSOLS\",B514=\"HUILES VEGETALES\"),\"OREDUI\",IF(OR(B514=\"HUILES DE VIDANGE\"),\"SERAHU\")))))))","v":false}]
[null,null,null,null,false,false]
[null,null,null,null,false,false]
[null,null,null,null,false,false]
[null,null,null,null,false,false]
[null,null,null,null,false,false]
[null,null,null,null,false,false]
[null,null,null,null,false,false]
[null,null,null,null,false,false]
[null,null,null,null,false,false]
[null,null,null,null,false,false]
[null,null,null,null,false,false]
[null,null,null,null,false,false]
[null,null,null,null,false,false]
[null,null,null,null,false,false]
[null,null,null,null,false,false]
[null,null,null,null,false,false]
[null,null,null,null,false,false]
[null,null,null,null,false,false]
[null,null,null,null,false,false]
[null,null,null,null,false,false]
[null,null,null,null,false,false]
[null,null,null,null,false,false]
[null,null,null,null,false,false]
[null,null,null,null,false,false]
[null,null,null,null,false,false]
[null,null,null,null,false,false]
[null,null,null,null,false,false]
[null,null,null,null,false,false]
[null,null,null,null,false,false]
[null,null,null,null,false,false]
[null,null,null,null,false,false]
[null,null,null,null,false,false]
[null,null,null,null,false,false]
[null,null,null,null,false,false]
[null,null,null,null,false,false]
[null,null,null,null,false,false]
[null,null,null,null,false,false]
[null,null,null,null,false,false]
[null,null,null,null,false,false]
[null,null,null,null,false,false]
[null,null,null,null,false,false]
[null,null,null,null,false,false]
[null,null,null,null,false,false]
[null,null,null,null,false,false]
[null,null,null,null,false,false]
[null,null,null,null,false,false]
[null,null,null,null,false,false]
[null,null,null,null,false,false]
[null,null,null,null,false,false]
[null,null,null,null,false,false]
[null,null,null,null,false,false]
[null,null,null,null,false,false]
[null,null,null,null,false,false]
[null,null,null,null,false,false]
[null,null,null,null,false,false]
[null,null,null,null,false,false]
[null,null,null,null,false,false]
[null,null,null,null,false,false]
[null,null,null,null,false,false]
[null,null,null,null,false,false]
[null,null,null,null,false,false]
[null,null,null,null,false,false]
[null,null,null,null,false,false]
[null,null,null,null,{"$f":"IF(B578=\"TOUT VENANT\",\"Véolia Nice Tri - Parc d'activité logistique\",IF(B578=\"DECHETS VERTS\",\"Orédui Carros Compostage - ZI de la Grave\",IF(B578=\"GRAVATS PROPRES\",\"La Gaude K3 Sita Sud - 5211 Rte de St Jeannet\",IF(B578=\"GRAVATS SALES\",\"Véolia Nice Tri - 20 Ch du Saquier\",IF(B578=\"BOIS\",\"SEAS La Glacière - 1019 Rte de la Grasse\",IF(B578=\"METAUX\",\"PURFER - ZI Carros 15ème Rue - 06517 Carros\",IF(B578=\"BATTERIES\",\"PURFER - ZI Carros 15ème Rue - 06517 Carros\",IF(B578=\"NEON\",\"Sofovar - 126 Av Louis Lépine - 83600 Fréjus\",IF(B578=\"PEINTURES\",\"Orédui - ZI Bois de Grasse - 06310 Grasse\",IF(B578=\"PRODUITS NON IDENTIFIES\",\"Orédui - ZI Bois de Grasse - 06310 Grasse\",IF(B578=\"AEROSOLS\",\"Orédui - ZI Bois de Grasse - 06310 Grasse\",IF(B578=\"FROIDS\",\"SEAS - 1079 Rte de Grasse - 06270 Villeneuve Loubet\",IF(B578=\"HORS FROIDS\",\"SEAS - 1079 Rte de Grasse - 06270 Villeneuve Loubet\",IF(B578=\"PAM\",\"SEAS - 1079 Rte de Grasse - 06270 Villeneuve Loubet\",IF(B578=\"ECRANS\",\"SEAS - 1079 Rte de Grasse - 06270 Villeneuve Loubet\",IF(B578=\"BOX HORS FROIDS\",\"SEAS - 1079 Rte de Grasse - 06270 Villeneuve Loubet\",IF(B578=\"PILES\",\"Corepile\",IF(B578=\"CUMULUS\",\"SEAS - 1079 Rte de Grasse - 06270 Villeneuve Loubet\",IF(B578=\"PNEUS\",\"TFM Pneus - 117 Ch Clausonnes - 06560 Valbonne\",IF(B578=\"HUILES VEGETALES\",\"Orédui - ZI Bois de Grasse - 06310 Grasse\",IF(B578=\"HUILES DE VIDANGE\",\"SERAHU - 68 Ch de la Campanette - 06800 Cagnes sur Mer\")))))))))))))))))))))","v":false},{"$f":"IF(OR(B578=\"TOUT VENANT\",B578=\"DECHETS VERTS\",B578=\"GRAVATS SALES\",B578=\"GRAVATS PROPRES\",B578=\"BOIS\"),\"SUEZ\",IF(OR(B578=\"PNEUS\"),\"TFM\",IF(OR(B578=\"FROIDS\",B578=\"HORS FROIDS\",B578=\"BOX HORS FROIDS\",B578=\"CUMULUS\",B578=\"PAM\",B578=\"ECRANS\"),\"SEAS\",IF(OR(B578=\"METAUX\",B578=\"BATTERIES\"),\"DERICHEBOURG\",IF(OR(B578=\"NEON\"),\"SOFOVAR\",IF(OR(B578=\"PEINTURES\",B578=\"PRODUITS NON IDENTIFIES\",B578=\"AEROSOLS\",B578=\"HUILES VEGETALES\"),\"OREDUI\",IF(OR(B578=\"HUILES DE VIDANGE\"),\"SERAHU\")))))))","v":false}]
[null,null,null,null,false,false]
[null,null,null,null,false,false]
[null,null,null,null,false,false]
[null,null,null,null,false,false]
[null,null,null,null,false,false]
[null,null,null,null,false,false]
[null,null,null,null,false,false]
[null,null,null,null,false,false]
[null,null,null,null,false,false]
[null,null,null,null,false,false]
[null,null,null,null,false,false]
[null,null,null,null,false,false]
[null,null,null,null,false,false]
[null,null,null,null,false,false]
[null,null,null,null,false,false]
[null,null,null,null,false,false]
[null,null,null,null,false,false]
[null,null,null,null,false,false]
[null,null,null,null,false,false]
[null,null,null,null,false,false]
[null,null,null,null,false,false]
[null,null,null,null,false,false]
[null,null,null,null,false,false]
[null,null,null,null,false,false]
[null,null,null,null,false,false]
[null,null,null,null,false,false]
[null,null,null,null,false,false]
[null,null,null,null,false,false]
[null,null,null,null,false,false]
[null,null,null,null,false,false]
[null,null,null,null,false,false]
[null,null,null,null,false,false]
[null,null,null,null,false,false]
[null,null,null,null,false,false]
[null,null,null,null,false,false]
[null,null,null,null,false,false]
[null,null,null,null,false,false]
[null,null,null,null,false,false]
[null,null,null,null,false,false]
[null,null,null,null,false,false]
[null,null,null,null,false,false]
[null,null,null,null,false,false]
[null,null,null,null,false,false]
[null,null,null,null,false,false]
[null,null,null,null,false,false]
[null,null,null,null,false,false]
[null,null,null,null,false,false]
[null,null,null,null,false,false]
[null,null,null,null,false,false]
[null,null,null,null,false,false]
[null,null,null,null,false,false]
[null,null,null,null,false,false]
[null,null,null,null,false,false]
[null,null,null,null,false,false]
[null,null,null,null,false,false]
[null,null,null,null,false,false]
[null,null,null,null,false,false]
[null,null,null,null,false,false]
[null,null,null,null,false,false]
[null,null,null,null,false,false]
[null,null,null,null,false,false]
[null,null,null,null,false,false]
[null,null,null,null,false,false]
[null,null,null,null,{"$f":"IF(B642=\"TOUT VENANT\",\"Véolia Nice Tri - Parc d'activité logistique\",IF(B642=\"DECHETS VERTS\",\"Orédui Carros Compostage - ZI de la Grave\",IF(B642=\"GRAVATS PROPRES\",\"La Gaude K3 Sita Sud - 5211 Rte de St Jeannet\",IF(B642=\"GRAVATS SALES\",\"Véolia Nice Tri - 20 Ch du Saquier\",IF(B642=\"BOIS\",\"SEAS La Glacière - 1019 Rte de la Grasse\",IF(B642=\"METAUX\",\"PURFER - ZI Carros 15ème Rue - 06517 Carros\",IF(B642=\"BATTERIES\",\"PURFER - ZI Carros 15ème Rue - 06517 Carros\",IF(B642=\"NEON\",\"Sofovar - 126 Av Louis Lépine - 83600 Fréjus\",IF(B642=\"PEINTURES\",\"Orédui - ZI Bois de Grasse - 06310 Grasse\",IF(B642=\"PRODUITS NON IDENTIFIES\",\"Orédui - ZI Bois de Grasse - 06310 Grasse\",IF(B642=\"AEROSOLS\",\"Orédui - ZI Bois de Grasse - 06310 Grasse\",IF(B642=\"FROIDS\",\"SEAS - 1079 Rte de Grasse - 06270 Villeneuve Loubet\",IF(B642=\"HORS FROIDS\",\"SEAS - 1079 Rte de Grasse - 06270 Villeneuve Loubet\",IF(B642=\"PAM\",\"SEAS - 1079 Rte de Grasse - 06270 Villeneuve Loubet\",IF(B642=\"ECRANS\",\"SEAS - 1079 Rte de Grasse - 06270 Villeneuve Loubet\",IF(B642=\"BOX HORS FROIDS\",\"SEAS - 1079 Rte de Grasse - 06270 Villeneuve Loubet\",IF(B642=\"PILES\",\"Corepile\",IF(B642=\"CUMULUS\",\"SEAS - 1079 Rte de Grasse - 06270 Villeneuve Loubet\",IF(B642=\"PNEUS\",\"TFM Pneus - 117 Ch Clausonnes - 06560 Valbonne\",IF(B642=\"HUILES VEGETALES\",\"Orédui - ZI Bois de Grasse - 06310 Grasse\",IF(B642=\"HUILES DE VIDANGE\",\"SERAHU - 68 Ch de la Campanette - 06800 Cagnes sur Mer\")))))))))))))))))))))","v":false},{"$f":"IF(OR(B642=\"TOUT VENANT\",B642=\"DECHETS VERTS\",B642=\"GRAVATS SALES\",B642=\"GRAVATS PROPRES\",B642=\"BOIS\"),\"SUEZ\",IF(OR(B642=\"PNEUS\"),\"TFM\",IF(OR(B642=\"FROIDS\",B642=\"HORS FROIDS\",B642=\"BOX HORS FROIDS\",B642=\"CUMULUS\",B642=\"PAM\",B642=\"ECRANS\"),\"SEAS\",IF(OR(B642=\"METAUX\",B642=\"BATTERIES\"),\"DERICHEBOURG\",IF(OR(B642=\"NEON\"),\"SOFOVAR\",IF(OR(B642=\"PEINTURES\",B642=\"PRODUITS NON IDENTIFIES\",B642=\"AEROSOLS\",B642=\"HUILES VEGETALES\"),\"OREDUI\",IF(OR(B642=\"HUILES DE VIDANGE\"),\"SERAHU\")))))))","v":false}]
[null,null,null,null,false,false]
[null,null,null,null,false,false]
[null,null,null,null,false,false]
[null,null,null,null,false,false]
[null,null,null,null,false,false]
[null,null,null,null,false,false]
[null,null,null,null,false,false]
[null,null,null,null,false,false]
[null,null,null,null,false,false]
[null,null,null,null,false,false]
[null,null,null,null,false,false]
[null,null,null,null,false,false]
[null,null,null,null,false,false]
[null,null,null,null,false,false]
[null,null,null,null,false,false]
[null,null,null,null,false,false]
[null,null,null,null,false,false]
[null,null,null,null,false,false]
[null,null,null,null,false,false]
[null,null,null,null,false,false]
[null,null,null,null,false,false]
[null,null,null,null,false,false]
[null,null,null,null,false,false]
[null,null,null,null,false,false]
[null,null,null,null,false,false]
[null,null,null,null,false,false]
[null,null,null,null,false,false]
[null,null,null,null,false,false]
[null,null,null,null,false,false]
[null,null,null,null,false,false]
[null,null,null,null,false,false]
[null,null,null,null,false,false]
[null,null,null,null,false,false]
[null,null,null,null,false,false]
[null,null,null,null,false,false]
[null,null,null,null,false,false]
[null,null,null,null,false,false]
[null,null,null,null,false,false]
[null,null,null,null,false,false]
[null,null,null,null,false,false]
[null,null,null,null,false,false]
[null,null,null,null,false,false]
[null,null,null,null,false,false]
[null,null,null,null,false,false]
[null,null,null,null,false,false]
[null,null,null,null,false,false]
[null,null,null,null,false,false]
[null,null,null,null,false,false]
[null,null,null,null,false,false]
[null,null,null,null,false,false]
[null,null,null,null,false,false]
[null,null,null,null,false,false]
[null,null,null,null,false,false]
[null,null,null,null,false,false]
[null,null,null,null,false,false]
[null,null,null,null,false,false]
[null,null,null,null,false,false]
[null,null,null,null,false,false]
[null,null,null,null,false,false]
[null,null,null,null,false,false]
[null,null,null,null,false,false]
[null,null,null,null,false,false]
[null,null,null,null,false,false]
[null,null,null,null,{"$f":"IF(B706=\"TOUT VENANT\",\"Véolia Nice Tri - Parc d'activité logistique\",IF(B706=\"DECHETS VERTS\",\"Orédui Carros Compostage - ZI de la Grave\",IF(B706=\"GRAVATS PROPRES\",\"La Gaude K3 Sita Sud - 5211 Rte de St Jeannet\",IF(B706=\"GRAVATS SALES\",\"Véolia Nice Tri - 20 Ch du Saquier\",IF(B706=\"BOIS\",\"SEAS La Glacière - 1019 Rte de la Grasse\",IF(B706=\"METAUX\",\"PURFER - ZI Carros 15ème Rue - 06517 Carros\",IF(B706=\"BATTERIES\",\"PURFER - ZI Carros 15ème Rue - 06517 Carros\",IF(B706=\"NEON\",\"Sofovar - 126 Av Louis Lépine - 83600 Fréjus\",IF(B706=\"PEINTURES\",\"Orédui - ZI Bois de Grasse - 06310 Grasse\",IF(B706=\"PRODUITS NON IDENTIFIES\",\"Orédui - ZI Bois de Grasse - 06310 Grasse\",IF(B706=\"AEROSOLS\",\"Orédui - ZI Bois de Grasse - 06310 Grasse\",IF(B706=\"FROIDS\",\"SEAS - 1079 Rte de Grasse - 06270 Villeneuve Loubet\",IF(B706=\"HORS FROIDS\",\"SEAS - 1079 Rte de Grasse - 06270 Villeneuve Loubet\",IF(B706=\"PAM\",\"SEAS - 1079 Rte de Grasse - 06270 Villeneuve Loubet\",IF(B706=\"ECRANS\",\"SEAS - 1079 Rte de Grasse - 06270 Villeneuve Loubet\",IF(B706=\"BOX HORS FROIDS\",\"SEAS - 1079 Rte de Grasse - 06270 Villeneuve Loubet\",IF(B706=\"PILES\",\"Corepile\",IF(B706=\"CUMULUS\",\"SEAS - 1079 Rte de Grasse - 06270 Villeneuve Loubet\",IF(B706=\"PNEUS\",\"TFM Pneus - 117 Ch Clausonnes - 06560 Valbonne\",IF(B706=\"HUILES VEGETALES\",\"Orédui - ZI Bois de Grasse - 06310 Grasse\",IF(B706=\"HUILES DE VIDANGE\",\"SERAHU - 68 Ch de la Campanette - 06800 Cagnes sur Mer\")))))))))))))))))))))","v":false},{"$f":"IF(OR(B706=\"TOUT VENANT\",B706=\"DECHETS VERTS\",B706=\"GRAVATS SALES\",B706=\"GRAVATS PROPRES\",B706=\"BOIS\"),\"SUEZ\",IF(OR(B706=\"PNEUS\"),\"TFM\",IF(OR(B706=\"FROIDS\",B706=\"HORS FROIDS\",B706=\"BOX HORS FROIDS\",B706=\"CUMULUS\",B706=\"PAM\",B706=\"ECRANS\"),\"SEAS\",IF(OR(B706=\"METAUX\",B706=\"BATTERIES\"),\"DERICHEBOURG\",IF(OR(B706=\"NEON\"),\"SOFOVAR\",IF(OR(B706=\"PEINTURES\",B706=\"PRODUITS NON IDENTIFIES\",B706=\"AEROSOLS\",B706=\"HUILES VEGETALES\"),\"OREDUI\",IF(OR(B706=\"HUILES DE VIDANGE\"),\"SERAHU\")))))))","v":false}]
[null,null,null,null,false,false]
[null,null,null,null,false,false]
[null,null,null,null,false,false]
[null,null,null,null,false,false]
[null,null,null,null,false,false]
[null,null,null,null,false,false]
[null,null,null,null,false,false]
[null,null,null,null,false,false]
[null,null,null,null,false,false]
[null,null,null,null,false,false]
[null,null,null,null,false,false]
[null,null,null,null,false,false]
[null,null,null,null,false,false]
[null,null,null,null,false,false]
[null,null,null,null,false,false]
[null,null,null,null,false,false]
[null,null,null,null,false,false]
[null,null,null,null,false,false]
[null,null,null,null,false,false]
[null,null,null,null,false,false]
[null,null,null,null,false,false]
[null,null,null,null,false,false]
[null,null,null,null,false,false]
[null,null,null,null,false,false]
[null,null,null,null,false,false]
[null,null,null,null,false,false]
[null,null,null,null,false,false]
[null,null,null,null,false,false]
[null,null,null,null,false,false]
[null,null,null,null,false,false]
[null,null,null,null,false,false]
[null,null,null,null,false,false]
[null,null,null,null,false,false]
[null,null,null,null,false,false]
[null,null,null,null,false,false]
[null,null,null,null,false,false]
[null,null,null,null,false,false]
[null,null,null,null,false,false]
[null,null,null,null,false,false]
[null,null,null,null,false,false]
[null,null,null,null,false,false]
[null,null,null,null,false,false]
[null,null,null,null,false,false]
[null,null,null,null,false,false]
[null,null,null,null,false,false]
[null,null,null,null,false,false]
[null,null,null,null,false,false]
[null,null,null,null,false,false]
[null,null,null,null,false,false]
[null,null,null,null,false,false]
[null,null,null,null,false,false]
[null,null,null,null,false,false]
[null,null,null,null,false,false]
[null,null,null,null,false,false]
[null,null,null,null,false,false]
[null,null,null,null,false,false]
[null,null,null,null,false,false]
[null,null,null,null,false,false]
[null,null,null,null,false,false]
[null,null,null,null,false,false]
[null,null,null,null,false,false]
[null,null,null,null,false,false]
[null,null,null,null,false,false]
[null,null,null,null,false,false]
[null,null,null,null,false,false]
[null,null,null,null,false,false]
[null,null,null,null,false,false]
[null,null,null,null,false,false]
[null,null,null,null,{"$f":"IF(B775=\"TOUT VENANT\",\"Véolia Nice Tri - Parc d'activité logistique\",IF(B775=\"DECHETS VERTS\",\"Orédui Carros Compostage - ZI de la Grave\",IF(B775=\"GRAVATS PROPRES\",\"La Gaude K3 Sita Sud - 5211 Rte de St Jeannet\",IF(B775=\"GRAVATS SALES\",\"Véolia Nice Tri - 20 Ch du Saquier\",IF(B775=\"BOIS\",\"SEAS La Glacière - 1019 Rte de la Grasse\",IF(B775=\"METAUX\",\"PURFER - ZI Carros 15ème Rue - 06517 Carros\",IF(B775=\"BATTERIES\",\"PURFER - ZI Carros 15ème Rue - 06517 Carros\",IF(B775=\"NEON\",\"Sofovar - 126 Av Louis Lépine - 83600 Fréjus\",IF(B775=\"PEINTURES\",\"Orédui - ZI Bois de Grasse - 06310 Grasse\",IF(B775=\"PRODUITS NON IDENTIFIES\",\"Orédui - ZI Bois de Grasse - 06310 Grasse\",IF(B775=\"AEROSOLS\",\"Orédui - ZI Bois de Grasse - 06310 Grasse\",IF(B775=\"FROIDS\",\"SEAS - 1079 Rte de Grasse - 06270 Villeneuve Loubet\",IF(B775=\"HORS FROIDS\",\"SEAS - 1079 Rte de Grasse - 06270 Villeneuve Loubet\",IF(B775=\"PAM\",\"SEAS - 1079 Rte de Grasse - 06270 Villeneuve Loubet\",IF(B775=\"ECRANS\",\"SEAS - 1079 Rte de Grasse - 06270 Villeneuve Loubet\",IF(B775=\"BOX HORS FROIDS\",\"SEAS - 1079 Rte de Grasse - 06270 Villeneuve Loubet\",IF(B775=\"PILES\",\"Corepile\",IF(B775=\"CUMULUS\",\"SEAS - 1079 Rte de Grasse - 06270 Villeneuve Loubet\",IF(B775=\"PNEUS\",\"TFM Pneus - 117 Ch Clausonnes - 06560 Valbonne\",IF(B775=\"HUILES VEGETALES\",\"Orédui - ZI Bois de Grasse - 06310 Grasse\",IF(B775=\"HUILES DE VIDANGE\",\"SERAHU - 68 Ch de la Campanette - 06800 Cagnes sur Mer\")))))))))))))))))))))","v":false},{"$f":"IF(OR(B775=\"TOUT VENANT\",B775=\"DECHETS VERTS\",B775=\"GRAVATS SALES\",B775=\"GRAVATS PROPRES\",B775=\"BOIS\"),\"SUEZ\",IF(OR(B775=\"PNEUS\"),\"TFM\",IF(OR(B775=\"FROIDS\",B775=\"HORS FROIDS\",B775=\"BOX HORS FROIDS\",B775=\"CUMULUS\",B775=\"PAM\",B775=\"ECRANS\"),\"SEAS\",IF(OR(B775=\"METAUX\",B775=\"BATTERIES\"),\"DERICHEBOURG\",IF(OR(B775=\"NEON\"),\"SOFOVAR\",IF(OR(B775=\"PEINTURES\",B775=\"PRODUITS NON IDENTIFIES\",B775=\"AEROSOLS\",B775=\"HUILES VEGETALES\"),\"OREDUI\",IF(OR(B775=\"HUILES DE VIDANGE\"),\"SERAHU\")))))))","v":false}]
[null,null,null,null,false,false]
[null,null,null,null,false,false]
[null,null,null,null,false,false]
[null,null,null,null,false,false]
[null,null,null,null,false,false]
[null,null,null,null,false,false]
[null,null,null,null,false,false]
[null,null,null,null,false,false]
[null,null,null,null,false,false]
[null,null,null,null,false,false]
[null,null,null,null,false,false]
[null,null,null,null,false,false]
[null,null,null,null,false,false]
[null,null,null,null,false,false]
[null,null,null,null,false,false]
[null,null,null,null,false,false]
[null,null,null,null,false,false]
[null,null,null,null,false,false]
[null,null,null,null,false,false]
[null,null,null,null,false,false]
[null,null,null,null,false,false]
[null,null,null,null,false,false]
[null,null,null,null,false,false]
[null,null,null,null,false,false]
[null,null,null,null,false,false]
[null,null,null,null,false,false]
[null,null,null,null,false,false]
[null,null,null,null,false,false]
[null,null,null,null,false,false]
[null,null,null,null,false,false]
[null,null,null,null,false,false]
[null,null,null,null,false,false]
[null,null,null,null,false,false]
[null,null,null,null,false,false]
[null,null,null,null,false,false]
[null,null,null,null,false,false]
[null,null,null,null,false,false]
[null,null,null,null,false,false]
[null,null,null,null,false,false]
[null,null,null,null,false,false]
[null,null,null,null,false,false]
[null,null,null,null,false,false]
[null,null,null,null,false,false]
[null,null,null,null,false,false]
[null,null,null,null,false,false]
[null,null,null,null,false,false]
[null,null,null,null,false,false]
[null,null,null,null,false,false]
[null,null,null,null,false,false]
[null,null,null,null,false,false]
[null,null,null,null,false,false]
[null,null,null,null,false,false]
[null,null,null,null,false,false]
[null,null,null,null,false,false]
[null,null,null,null,false,false]
[null,null,null,null,false,false]
[null,null,null,null,false,false]
[null,null,null,null,false,false]
[null,null,null,null,false,false]
[null,null,null,null,false,false]
[null,null,null,null,false,false]
[null,null,null,null,false,false]
[null,null,null,null,false,false]
[null,null,null,null,{"$f":"IF(B839=\"TOUT VENANT\",\"Véolia Nice Tri - Parc d'activité logistique\",IF(B839=\"DECHETS VERTS\",\"Orédui Carros Compostage - ZI de la Grave\",IF(B839=\"GRAVATS PROPRES\",\"La Gaude K3 Sita Sud - 5211 Rte de St Jeannet\",IF(B839=\"GRAVATS SALES\",\"Véolia Nice Tri - 20 Ch du Saquier\",IF(B839=\"BOIS\",\"SEAS La Glacière - 1019 Rte de la Grasse\",IF(B839=\"METAUX\",\"PURFER - ZI Carros 15ème Rue - 06517 Carros\",IF(B839=\"BATTERIES\",\"PURFER - ZI Carros 15ème Rue - 06517 Carros\",IF(B839=\"NEON\",\"Sofovar - 126 Av Louis Lépine - 83600 Fréjus\",IF(B839=\"PEINTURES\",\"Orédui - ZI Bois de Grasse - 06310 Grasse\",IF(B839=\"PRODUITS NON IDENTIFIES\",\"Orédui - ZI Bois de Grasse - 06310 Grasse\",IF(B839=\"AEROSOLS\",\"Orédui - ZI Bois de Grasse - 06310 Grasse\",IF(B839=\"FROIDS\",\"SEAS - 1079 Rte de Grasse - 06270 Villeneuve Loubet\",IF(B839=\"HORS FROIDS\",\"SEAS - 1079 Rte de Grasse - 06270 Villeneuve Loubet\",IF(B839=\"PAM\",\"SEAS - 1079 Rte de Grasse - 06270 Villeneuve Loubet\",IF(B839=\"ECRANS\",\"SEAS - 1079 Rte de Grasse - 06270 Villeneuve Loubet\",IF(B839=\"BOX HORS FROIDS\",\"SEAS - 1079 Rte de Grasse - 06270 Villeneuve Loubet\",IF(B839=\"PILES\",\"Corepile\",IF(B839=\"CUMULUS\",\"SEAS - 1079 Rte de Grasse - 06270 Villeneuve Loubet\",IF(B839=\"PNEUS\",\"TFM Pneus - 117 Ch Clausonnes - 06560 Valbonne\",IF(B839=\"HUILES VEGETALES\",\"Orédui - ZI Bois de Grasse - 06310 Grasse\",IF(B839=\"HUILES DE VIDANGE\",\"SERAHU - 68 Ch de la Campanette - 06800 Cagnes sur Mer\")))))))))))))))))))))","v":false},{"$f":"IF(OR(B839=\"TOUT VENANT\",B839=\"DECHETS VERTS\",B839=\"GRAVATS SALES\",B839=\"GRAVATS PROPRES\",B839=\"BOIS\"),\"SUEZ\",IF(OR(B839=\"PNEUS\"),\"TFM\",IF(OR(B839=\"FROIDS\",B839=\"HORS FROIDS\",B839=\"BOX HORS FROIDS\",B839=\"CUMULUS\",B839=\"PAM\",B839=\"ECRANS\"),\"SEAS\",IF(OR(B839=\"METAUX\",B839=\"BATTERIES\"),\"DERICHEBOURG\",IF(OR(B839=\"NEON\"),\"SOFOVAR\",IF(OR(B839=\"PEINTURES\",B839=\"PRODUITS NON IDENTIFIES\",B839=\"AEROSOLS\",B839=\"HUILES VEGETALES\"),\"OREDUI\",IF(OR(B839=\"HUILES DE VIDANGE\"),\"SERAHU\")))))))","v":false}]
[null,null,null,null,false,false]
[null,null,null,null,false,false]
[null,null,null,null,false,false]
[null,null,null,null,false,false]
[null,null,null,null,false,false]
[null,null,null,null,false,false]
[null,null,null,null,false,false]
[null,null,null,null,false,false]
[null,null,null,null,false,false]
[null,null,null,null,false,false]
[null,null,null,null,false,false]
[null,null,null,null,false,false]
[null,null,null,null,false,false]
[null,null,null,null,false,false]
[null,null,null,null,false,false]
[null,null,null,null,false,false]
[null,null,null,null,false,false]
[null,null,null,null,false,false]
[null,null,null,null,false,false]
[null,null,null,null,false,false]
[null,null,null,null,false,false]
[null,null,null,null,false,false]
[null,null,null,null,false,false]
[null,null,null,null,false,false]
[null,null,null,null,false,false]
[null,null,null,null,false,false]
[null,null,null,null,false,false]
[null,null,null,null,false,false]
[null,null,null,null,false,false]
[null,null,null,null,false,false]
[null,null,null,null,false,false]
[null,null,null,null,false,false]
[null,null,null,null,false,false]
[null,null,null,null,false,false]
[null,null,null,null,false,false]
[null,null,null,null,false,false]
[null,null,null,null,false,false]
[null,null,null,null,false,false]
[null,null,null,null,false,false]
[null,null,null,null,false,false]
[null,null,null,null,false,false]
[null,null,null,null,false,false]
[null,null,null,null,false,false]
[null,null,null,null,false,false]
[null,null,null,null,false,false]
[null,null,null,null,false,false]
[null,null,null,null,false,false]
[null,null,null,null,false,false]
[null,null,null,null,false,false]
[null,null,null,null,false,false]
[null,null,null,null,false,false]
[null,null,null,null,false,false]
[null,null,null,null,false,false]
[null,null,null,null,false,false]
[null,null,null,null,false,false]
[null,null,null,null,false,false]
[null,null,null,null,false,false]
[null,null,null,null,false,false]
[null,null,null,null,false,false]
[null,null,null,null,false,false]
[null,null,null,null,false,false]
[null,null,null,null,false,false]
[null,null,null,null,false,false]
[null,null,null,null,{"$f":"IF(B903=\"TOUT VENANT\",\"Véolia Nice Tri - Parc d'activité logistique\",IF(B903=\"DECHETS VERTS\",\"Orédui Carros Compostage - ZI de la Grave\",IF(B903=\"GRAVATS PROPRES\",\"La Gaude K3 Sita Sud - 5211 Rte de St Jeannet\",IF(B903=\"GRAVATS SALES\",\"Véolia Nice Tri - 20 Ch du Saquier\",IF(B903=\"BOIS\",\"SEAS La Glacière - 1019 Rte de la Grasse\",IF(B903=\"METAUX\",\"PURFER - ZI Carros 15ème Rue - 06517 Carros\",IF(B903=\"BATTERIES\",\"PURFER - ZI Carros 15ème Rue - 06517 Carros\",IF(B903=\"NEON\",\"Sofovar - 126 Av Louis Lépine - 83600 Fréjus\",IF(B903=\"PEINTURES\",\"Orédui - ZI Bois de Grasse - 06310 Grasse\",IF(B903=\"PRODUITS NON IDENTIFIES\",\"Orédui - ZI Bois de Grasse - 06310 Grasse\",IF(B903=\"AEROSOLS\",\"Orédui - ZI Bois de Grasse - 06310 Grasse\",IF(B903=\"FROIDS\",\"SEAS - 1079 Rte de Grasse - 06270 Villeneuve Loubet\",IF(B903=\"HORS FROIDS\",\"SEAS - 1079 Rte de Grasse - 06270 Villeneuve Loubet\",IF(B903=\"PAM\",\"SEAS - 1079 Rte de Grasse - 06270 Villeneuve Loubet\",IF(B903=\"ECRANS\",\"SEAS - 1079 Rte de Grasse - 06270 Villeneuve Loubet\",IF(B903=\"BOX HORS FROIDS\",\"SEAS - 1079 Rte de Grasse - 06270 Villeneuve Loubet\",IF(B903=\"PILES\",\"Corepile\",IF(B903=\"CUMULUS\",\"SEAS - 1079 Rte de Grasse - 06270 Villeneuve Loubet\",IF(B903=\"PNEUS\",\"TFM Pneus - 117 Ch Clausonnes - 06560 Valbonne\",IF(B903=\"HUILES VEGETALES\",\"Orédui - ZI Bois de Grasse - 06310 Grasse\",IF(B903=\"HUILES DE VIDANGE\",\"SERAHU - 68 Ch de la Campanette - 06800 Cagnes sur Mer\")))))))))))))))))))))","v":false},{"$f":"IF(OR(B903=\"TOUT VENANT\",B903=\"DECHETS VERTS\",B903=\"GRAVATS SALES\",B903=\"GRAVATS PROPRES\",B903=\"BOIS\"),\"SUEZ\",IF(OR(B903=\"PNEUS\"),\"TFM\",IF(OR(B903=\"FROIDS\",B903=\"HORS FROIDS\",B903=\"BOX HORS FROIDS\",B903=\"CUMULUS\",B903=\"PAM\",B903=\"ECRANS\"),\"SEAS\",IF(OR(B903=\"METAUX\",B903=\"BATTERIES\"),\"DERICHEBOURG\",IF(OR(B903=\"NEON\"),\"SOFOVAR\",IF(OR(B903=\"PEINTURES\",B903=\"PRODUITS NON IDENTIFIES\",B903=\"AEROSOLS\",B903=\"HUILES VEGETALES\"),\"OREDUI\",IF(OR(B903=\"HUILES DE VIDANGE\"),\"SERAHU\")))))))","v":false}]
[null,null,null,null,false,false]
[null,null,null,null,false,false]
[null,null,null,null,false,false]
[null,null,null,null,false,false]
[null,null,null,null,false,false]
[null,null,null,null,false,false]
[null,null,null,null,false,false]
[null,null,null,null,false,false]
[null,null,null,null,false,false]
[null,null,null,null,false,false]
[null,null,null,null,false,false]
[null,null,null,null,false,false]
[null,null,null,null,false,false]
[null,null,null,null,false,false]
[null,null,null,null,false,false]
[null,null,null,null,false,false]
[null,null,null,null,false,false]
[null,null,null,null,false,false]
[null,null,null,null,false,false]
[null,null,null,null,false,false]
[null,null,null,null,false,false]
[null,null,null,null,false,false]
[null,null,null,null,false,false]
[null,null,null,null,false,false]
[null,null,null,null,false,false]
[null,null,null,null,false,false]
[null,null,null,null,false,false]
[null,null,null,null,false,false]
[null,null,null,null,false,false]
[null,null,null,null,false,false]
[null,null,null,null,false,false]
[null,null,null,null,false,false]
[null,null,null,null,false,false]
[null,null,null,null,false,false]
[null,null,null,null,false,false]
[null,null,null,null,false,false]
[null,null,null,null,false,false]
[null,null,null,null,false,false]
[null,null,null,null,false,false]
[null,null,null,null,false,false]
[null,null,null,null,false,false]
[null,null,null,null,false,false]
[null,null,null,null,false,false]
[null,null,null,null,false,false]
[null,null,null,null,false,false]
[null,null,null,null,false,false]
[null,null,null,null,false,false]
[null,null,null,null,false,false]
[null,null,null,null,false,false]
[null,null,null,null,false,false]
[null,null,null,null,false,false]
[null,null,null,null,false,false]
[null,null,null,null,false,false]
[null,null,null,null,false,false]
[null,null,null,null,false,false]
[null,null,null,null,false,false]
[null,null,null,null,false,false]
[null,null,null,null,false,false]
[null,null,null,null,false,false]
[null,null,null,null,false,false]
[null,null,null,null,false,false]
[null,null,null,null,false,false]
[null,null,null,null,false,false]
[null,null,null,null,{"$f":"IF(B967=\"TOUT VENANT\",\"Véolia Nice Tri - Parc d'activité logistique\",IF(B967=\"DECHETS VERTS\",\"Orédui Carros Compostage - ZI de la Grave\",IF(B967=\"GRAVATS PROPRES\",\"La Gaude K3 Sita Sud - 5211 Rte de St Jeannet\",IF(B967=\"GRAVATS SALES\",\"Véolia Nice Tri - 20 Ch du Saquier\",IF(B967=\"BOIS\",\"SEAS La Glacière - 1019 Rte de la Grasse\",IF(B967=\"METAUX\",\"PURFER - ZI Carros 15ème Rue - 06517 Carros\",IF(B967=\"BATTERIES\",\"PURFER - ZI Carros 15ème Rue - 06517 Carros\",IF(B967=\"NEON\",\"Sofovar - 126 Av Louis Lépine - 83600 Fréjus\",IF(B967=\"PEINTURES\",\"Orédui - ZI Bois de Grasse - 06310 Grasse\",IF(B967=\"PRODUITS NON IDENTIFIES\",\"Orédui - ZI Bois de Grasse - 06310 Grasse\",IF(B967=\"AEROSOLS\",\"Orédui - ZI Bois de Grasse - 06310 Grasse\",IF(B967=\"FROIDS\",\"SEAS - 1079 Rte de Grasse - 06270 Villeneuve Loubet\",IF(B967=\"HORS FROIDS\",\"SEAS - 1079 Rte de Grasse - 06270 Villeneuve Loubet\",IF(B967=\"PAM\",\"SEAS - 1079 Rte de Grasse - 06270 Villeneuve Loubet\",IF(B967=\"ECRANS\",\"SEAS - 1079 Rte de Grasse - 06270 Villeneuve Loubet\",IF(B967=\"BOX HORS FROIDS\",\"SEAS - 1079 Rte de Grasse - 06270 Villeneuve Loubet\",IF(B967=\"PILES\",\"Corepile\",IF(B967=\"CUMULUS\",\"SEAS - 1079 Rte de Grasse - 06270 Villeneuve Loubet\",IF(B967=\"PNEUS\",\"TFM Pneus - 117 Ch Clausonnes - 06560 Valbonne\",IF(B967=\"HUILES VEGETALES\",\"Orédui - ZI Bois de Grasse - 06310 Grasse\",IF(B967=\"HUILES DE VIDANGE\",\"SERAHU - 68 Ch de la Campanette - 06800 Cagnes sur Mer\")))))))))))))))))))))","v":false},{"$f":"IF(OR(B967=\"TOUT VENANT\",B967=\"DECHETS VERTS\",B967=\"GRAVATS SALES\",B967=\"GRAVATS PROPRES\",B967=\"BOIS\"),\"SUEZ\",IF(OR(B967=\"PNEUS\"),\"TFM\",IF(OR(B967=\"FROIDS\",B967=\"HORS FROIDS\",B967=\"BOX HORS FROIDS\",B967=\"CUMULUS\",B967=\"PAM\",B967=\"ECRANS\"),\"SEAS\",IF(OR(B967=\"METAUX\",B967=\"BATTERIES\"),\"DERICHEBOURG\",IF(OR(B967=\"NEON\"),\"SOFOVAR\",IF(OR(B967=\"PEINTURES\",B967=\"PRODUITS NON IDENTIFIES\",B967=\"AEROSOLS\",B967=\"HUILES VEGETALES\"),\"OREDUI\",IF(OR(B967=\"HUILES DE VIDANGE\"),\"SERAHU\")))))))","v":false}]
[null,null,null,null,false,false]
[null,null,null,null,false,false]
[null,null,null,null,false,false]
[null,null,null,null,false,false]
[null,null,null,null,false,false]
[null,null,null,null,false,false]
[null,null,null,null,false,false]
[null,null,null,null,false,false]
[null,null,null,null,false,false]
[null,null,null,null,false,false]
[null,null,null,null,false,false]
[null,null,null,null,false,false]
[null,null,null,null,false,false]
[null,null,null,null,false,false]
[null,null,null,null,false,false]
[null,null,null,null,false,false]
[null,null,null,null,false,false]
[null,null,null,null,false,false]
[null,null,null,null,false,false]
[null,null,null,null,false,false]
[null,null,null,null,false,false]
[null,null,null,null,false,false]
[null,null,null,null,false,false]
[null,null,null,null,false,false]
[null,null,null,null,false,false]
[null,null,null,null,false,false]
[null,null,null,null,false,false]
[null,null,null,null,false,false]
[null,null,null,null,false,false]
[null,null,null,null,false,false]
[null,null,null,null,false,false]
[null,null,null,null,false,false]
[null,null,null,null,false,false]