{"text_format":"1","workbook":"xlsx","n_sheets":7,"sheets":["Datas","Trieur","Nbre du Jour","Bibli.","Résultats","DVK","Bibli,2"],"not_rendered":{"charts":0,"images":0,"macros":1,"external_links":0,"defined_names":6,"comments":0,"pivot_tables":0},"unopened":[],"bounds":{"document_bytes":16777216,"sheet_cells":100000,"rows_first":2000,"rows_last":500,"rows_between":2000,"halvings":0,"cell_chars":16384,"cell_head_chars":4096},"cells_cut":0,"cells_raw":0,"read":"whole","date_system":"1900"}

{"sheet":"Datas","index":0,"n_rows":63,"n_cols":9,"rows_kept":63,"cut":false,"hidden":false,"merged":[]}
["Date1","bun","Nom1","Nom2","Heure","Date2","Num","XZ","Résultat"]
["15.04.16","BUN","Pierre","David","02:00:00",{"$f":"IF(A2=0,\"\",DATEVALUE(SUBSTITUTE(A2,\".\",\"/\")))","v":"2016-04-15"},{"$f":"IF(F2=\"\",\"\",MOD(SUMPRODUCT(--MID(TEXT(F2,\"jjmmaaaa\"),ROW($1:$8),1))-1,9)+1)","v":1},{"$f":"IF(HOUR(E2)>MINUTE(E2),0,IF(HOUR(E2)<MINUTE(E2),1,\"DRAW\"))","v":0},{"$f":"IF(G2=G1,\"\",IFERROR(IF(COUNTIF(OFFSET(H2,,,COUNTIF(G:G,G2),),H2)=COUNTIF(G:G,G2),OFFSET(C2,,H2),\"N/A\"),\"NUL\"))","v":"Pierre"}]
["01.02.14","BUN","Pierre","David","03:01:00","2014-02-01",1,0,""]
["01.04.12","BUN","Pierre","David","02:01:00","2012-04-01",1,0,""]
["30.04.11","BUN","Pierre","David","00:01:00","2011-04-30",2,1,"N/A"]
["10.12.05","BUN","Pierre","David","01:00:00","2005-12-10",2,0,""]
["05.05.10","BUN","Pierre","David","01:01:00","2010-05-05",4,"DRAW","NUL"]
["05.05.10","BUN","Pierre","David","01:01:00","2010-05-05",4,"DRAW",""]
["14.09.08","BUN","Pierre","David","05:01:00","2008-09-14",6,0,"Pierre"]
["28.10.12","BUN","Pierre","David","02:03:00","2012-10-28",7,1,"David"]
["18.10.14","BUN","Pierre","David","00:03:00","2014-10-18",8,1,"N/A"]
["22.04.07","BUN","Pierre","David","01:00:00","2007-04-22",8,0,""]
["01.05.10","BUN","Pierre","David","06:01:00","2010-05-01",9,0,"Pierre"]
[null,null,null,null,null,"","","DRAW","N/A"]
[null,null,null,null,null,"","","DRAW",""]
[null,null,null,null,null,"","","DRAW",""]
[null,null,null,null,null,"","","DRAW",""]
[null,null,null,null,null,"","","DRAW",""]
[null,null,null,null,null,"","","DRAW",""]
[null,null,null,null,null,"","","DRAW",""]
[null,null,null,null,null,"","","DRAW",""]
[null,null,null,null,null,"","","DRAW",""]
[null,null,null,null,null,"","","DRAW",""]
[null,null,null,null,null,"","","DRAW",""]
[null,null,null,null,null,"","","DRAW",""]
[null,null,null,null,null,"","","DRAW",""]
[null,null,null,null,null,"","","DRAW",""]
[null,null,null,null,null,"","","DRAW",""]
[null,null,null,null,null,"","","DRAW",""]
[null,null,null,null,null,"","","DRAW",""]
[null,null,null,null,null,"","","DRAW",""]
[null,null,null,null,null,"","","DRAW",""]
[null,null,null,null,null,"","","DRAW",""]
[null,null,null,null,null,{"$f":"IF(A34=0,\"\",DATEVALUE(SUBSTITUTE(A34,\".\",\"/\")))","v":""},{"$f":"IF(F34=\"\",\"\",MOD(SUMPRODUCT(--MID(TEXT(F34,\"jjmmaaaa\"),ROW($1:$8),1))-1,9)+1)","v":""},{"$f":"IF(HOUR(E34)>MINUTE(E34),0,IF(HOUR(E34)<MINUTE(E34),1,\"DRAW\"))","v":"DRAW"},{"$f":"IF(G34=G33,\"\",IFERROR(IF(COUNTIF(OFFSET(H34,,,COUNTIF(G:G,G34),),H34)=COUNTIF(G:G,G34),OFFSET(C34,,H34),\"N/A\"),\"NUL\"))","v":""}]
[null,null,null,null,null,"","","DRAW",""]
[null,null,null,null,null,"","","DRAW",""]
[null,null,null,null,null,"","","DRAW",""]
[null,null,null,null,null,"","","DRAW",""]
[null,null,null,null,null,"","","DRAW",""]
[null,null,null,null,null,"","","DRAW",""]
[null,null,null,null,null,"","","DRAW",""]
[null,null,null,null,null,"","","DRAW",""]
[null,null,null,null,null,"","","DRAW",""]
[null,null,null,null,null,"","","DRAW",""]
[null,null,null,null,null,"","","DRAW",""]
[null,null,null,null,null,"","","DRAW",""]
[null,null,null,null,null,"","","DRAW",""]
[null,null,null,null,null,"","","DRAW",""]
[null,null,null,null,null,"","","DRAW",""]
[null,null,null,null,null,"","","DRAW",""]
[null,null,null,null,null,"","","DRAW",""]
[null,null,null,null,null,"","","DRAW",""]
[null,null,null,null,null,"","","DRAW",""]
[null,null,null,null,null,"","","DRAW",""]
[null,null,null,null,null,"","","DRAW",""]
[null,null,null,null,null,"","","DRAW",""]
[null,null,null,null,null,"","","DRAW",""]
[null,null,null,null,null,"","","DRAW",""]
[null,null,null,null,null,"","","DRAW",""]
[null,null,null,null,null,"","","DRAW",""]
[null,null,null,null,null,"","","DRAW",""]
[null,null,null,null,null,"","","DRAW",""]
[null,null,null,null,null,"","","DRAW",""]

{"sheet":"Trieur","index":1,"n_rows":199,"n_cols":82,"rows_kept":199,"cut":false,"hidden":false,"merged":[[193,26,195,26],[196,18,198,18],[196,20,198,20],[196,21,198,21],[196,22,198,22],[196,24,198,24],[196,25,198,25],[196,26,198,26],[193,18,195,18],[193,20,195,20],[193,21,195,21],[193,22,195,22],[193,24,195,24],[193,25,195,25],[187,26,189,26],[190,18,192,18],[190,20,192,20],[190,21,192,21],[190,22,192,22],[190,24,192,24],[190,25,192,25],[190,26,192,26],[187,18,189,18],[187,20,189,20],[187,21,189,21],[187,22,189,22],[187,24,189,24],[187,25,189,25],[181,26,183,26],[184,18,186,18],[184,20,186,20],[184,21,186,21],[184,22,186,22],[184,24,186,24],[184,25,186,25],[184,26,186,26],[181,18,183,18],[181,20,183,20],[181,21,183,21],[181,22,183,22],[181,24,183,24],[181,25,183,25],[175,26,177,26],[178,18,180,18],[178,20,180,20],[178,21,180,21],[178,22,180,22],[178,24,180,24],[178,25,180,25],[178,26,180,26],[175,18,177,18],[175,20,177,20],[175,21,177,21],[175,22,177,22],[175,24,177,24],[175,25,177,25],[169,26,171,26],[172,18,174,18],[172,20,174,20],[172,21,174,21],[172,22,174,22],[172,24,174,24],[172,25,174,25],[172,26,174,26],[169,18,171,18],[169,20,171,20],[169,21,171,21],[169,22,171,22],[169,24,171,24],[169,25,171,25],[163,26,165,26],[166,18,168,18],[166,20,168,20],[166,21,168,21],[166,22,168,22],[166,24,168,24],[166,25,168,25],[166,26,168,26],[163,18,165,18],[163,20,165,20],[163,21,165,21],[163,22,165,22],[163,24,165,24],[163,25,165,25],[157,26,159,26],[160,18,162,18],[160,20,162,20],[160,21,162,21],[160,22,162,22],[160,24,162,24],[160,25,162,25],[160,26,162,26],[157,18,159,18],[157,20,159,20],[157,21,159,21],[157,22,159,22],[157,24,159,24],[157,25,159,25],[151,26,153,26],[154,18,156,18],[154,20,156,20],[154,21,156,21],[154,22,156,22],[154,24,156,24],[154,25,156,25],[154,26,156,26],[151,18,153,18],[151,20,153,20],[151,21,153,21],[151,22,153,22],[151,24,153,24],[151,25,153,25],[145,26,147,26],[148,18,150,18],[148,20,150,20],[148,21,150,21],[148,22,150,22],[148,24,150,24],[148,25,150,25],[148,26,150,26],[145,18,147,18],[145,20,147,20],[145,21,147,21],[145,22,147,22],[145,24,147,24],[145,25,147,25],[139,26,141,26],[142,18,144,18],[142,20,144,20],[142,21,144,21],[142,22,144,22],[142,24,144,24],[142,25,144,25],[142,26,144,26],[139,18,141,18],[139,20,141,20],[139,21,141,21],[139,22,141,22],[139,24,141,24],[139,25,141,25],[133,26,135,26],[136,18,138,18],[136,20,138,20],[136,21,138,21],[136,22,138,22],[136,24,138,24],[136,25,138,25],[136,26,138,26],[133,18,135,18],[133,20,135,20],[133,21,135,21],[133,22,135,22],[133,24,135,24],[133,25,135,25],[127,26,129,26],[130,18,132,18],[130,20,132,20],[130,21,132,21],[130,22,132,22],[130,24,132,24],[130,25,132,25],[130,26,132,26],[127,18,129,18],[127,20,129,20],[127,21,129,21],[127,22,129,22],[127,24,129,24],[127,25,129,25],[121,26,123,26],[124,18,126,18],[124,20,126,20],[124,21,126,21],[124,22,126,22],[124,24,126,24],[124,25,126,25],[124,26,126,26],[121,18,123,18],[121,20,123,20],[121,21,123,21],[121,22,123,22],[121,24,123,24],[121,25,123,25],[115,26,117,26],[118,18,120,18],[118,20,120,20],[118,21,120,21],[118,22,120,22],[118,24,120,24],[118,25,120,25],[118,26,120,26],[115,18,117,18],[115,20,117,20],[115,21,117,21],[115,22,117,22],[115,24,117,24],[115,25,117,25],[109,26,111,26],[112,18,114,18],[112,20,114,20],[112,21,114,21],[112,22,114,22],[112,24,114,24],[112,25,114,25],[112,26,114,26],[109,18,111,18],[109,20,111,20],[109,21,111,21],[109,22,111,22],[109,24,111,24],[109,25,111,25],[103,26,105,26],[106,18,108,18],[106,20,108,20],[106,21,108,21],[106,22,108,22],[106,24,108,24],[106,25,108,25],[106,26,108,26],[103,18,105,18],[103,20,105,20],[103,21,105,21],[103,22,105,22],[103,24,105,24],[103,25,105,25],[97,26,99,26],[100,18,102,18],[100,20,102,20],[100,21,102,21],[100,22,102,22],[100,24,102,24],[100,25,102,25],[100,26,102,26],[97,18,99,18],[97,20,99,20],[97,21,99,21],[97,22,99,22],[97,24,99,24],[97,25,99,25],[91,26,93,26],[94,18,96,18],[94,20,96,20],[94,21,96,21],[94,22,96,22],[94,24,96,24],[94,25,96,25],[94,26,96,26],[91,18,93,18],[91,20,93,20],[91,21,93,21],[91,22,93,22],[91,24,93,24],[91,25,93,25],[85,26,87,26],[88,18,90,18],[88,20,90,20],[88,21,90,21],[88,22,90,22],[88,24,90,24],[88,25,90,25],[88,26,90,26],[85,18,87,18],[85,20,87,20],[85,21,87,21],[85,22,87,22],[85,24,87,24],[85,25,87,25],[79,26,81,26],[82,18,84,18],[82,20,84,20],[82,21,84,21],[82,22,84,22],[82,24,84,24],[82,25,84,25],[82,26,84,26],[79,18,81,18],[79,20,81,20],[79,21,81,21],[79,22,81,22],[79,24,81,24],[79,25,81,25],[73,26,75,26],[76,18,78,18],[76,20,78,20],[76,21,78,21],[76,22,78,22],[76,24,78,24],[76,25,78,25],[76,26,78,26],[73,18,75,18],[73,20,75,20],[73,21,75,21],[73,22,75,22],[73,24,75,24],[73,25,75,25],[67,26,69,26],[70,18,72,18],[70,20,72,20],[70,21,72,21],[70,22,72,22],[70,24,72,24],[70,25,72,25],[70,26,72,26],[67,18,69,18],[67,20,69,20],[67,21,69,21],[67,22,69,22],[67,24,69,24],[67,25,69,25],[61,26,63,26],[64,18,66,18],[64,20,66,20],[64,21,66,21],[64,22,66,22],[64,24,66,24],[64,25,66,25],[64,26,66,26],[61,18,63,18],[61,20,63,20],[61,21,63,21],[61,22,63,22],[61,24,63,24],[61,25,63,25],[55,26,57,26],[58,18,60,18],[58,20,60,20],[58,21,60,21],[58,22,60,22],[58,24,60,24],[58,25,60,25],[58,26,60,26],[55,18,57,18],[55,20,57,20],[55,21,57,21],[55,22,57,22],[55,24,57,24],[55,25,57,25],[49,26,51,26],[52,18,54,18],[52,20,54,20],[52,21,54,21],[52,22,54,22],[52,24,54,24],[52,25,54,25],[52,26,54,26],[49,18,51,18],[49,20,51,20],[49,21,51,21],[49,22,51,22],[49,24,51,24],[49,25,51,25],[43,26,45,26],[46,18,48,18],[46,20,48,20],[46,21,48,21],[46,22,48,22],[46,24,48,24],[46,25,48,25],[46,26,48,26],[43,18,45,18],[43,20,45,20],[43,21,45,21],[43,22,45,22],[43,24,45,24],[43,25,45,25],[37,26,39,26],[40,18,42,18],[40,20,42,20],[40,21,42,21],[40,22,42,22],[40,24,42,24],[40,25,42,25],[40,26,42,26],[37,18,39,18],[37,20,39,20],[37,21,39,21],[37,22,39,22],[37,24,39,24],[37,25,39,25],[31,26,33,26],[34,18,36,18],[34,20,36,20],[34,21,36,21],[34,22,36,22],[34,24,36,24],[34,25,36,25],[34,26,36,26],[31,18,33,18],[31,20,33,20],[31,21,33,21],[31,22,33,22],[31,24,33,24],[31,25,33,25],[25,26,27,26],[28,18,30,18],[28,20,30,20],[28,21,30,21],[28,22,30,22],[28,24,30,24],[28,25,30,25],[28,26,30,26],[25,18,27,18],[25,20,27,20],[25,21,27,21],[25,22,27,22],[25,24,27,24],[25,25,27,25],[19,26,21,26],[22,18,24,18],[22,20,24,20],[22,21,24,21],[22,22,24,22],[22,24,24,24],[22,25,24,25],[22,26,24,26],[19,18,21,18],[19,20,21,20],[19,21,21,21],[19,22,21,22],[19,24,21,24],[19,25,21,25],[13,26,15,26],[16,18,18,18],[16,20,18,20],[16,21,18,21],[16,22,18,22],[16,24,18,24],[16,25,18,25],[16,26,18,26],[13,18,15,18],[13,20,15,20],[13,21,15,21],[13,22,15,22],[13,24,15,24],[13,25,15,25],[7,26,9,26],[10,18,12,18],[10,20,12,20],[10,21,12,21],[10,22,12,22],[10,24,12,24],[10,25,12,25],[10,26,12,26],[7,18,9,18],[7,20,9,20],[7,21,9,21],[7,22,9,22],[7,24,9,24],[7,25,9,25],[1,26,3,26],[4,18,6,18],[4,20,6,20],[4,21,6,21],[4,22,6,22],[4,24,6,24],[4,25,6,25],[4,26,6,26],[0,24,0,25],[1,18,3,18],[1,20,3,20],[1,21,3,21],[1,22,3,22],[1,24,3,24],[1,25,3,25]]}
["Date",null,"Séparation",null,null,null,null,null,null,null,null,null,null,null,null,null,null,null,null,null,"X","Z","Score","_","Séparation de score",null,"_","_","Date","X","Z","Z",null,"Date","X","Z","Z",null,"Date","X","Z",1,null,"Date","X","Z",2,null,"Date","X","Z",3,null,"Date","X","Z",4,null,"Date","X","Z",5,null,"Date","X","Z",6,null,"Date","X","Z",7,null,"Date","X","Z",8,null,"Date","X","Z",9]
[{"$f":"(Datas!F2)","v":"2016-04-15"},null,"Jour",{"$f":"IF(A2=\"\",0,TEXT(DAY(A2),\"00\"))","v":"15"},{"$f":"MOD(SUMPRODUCT(--MID(TEXT(A2,\"jjmmaaaa\"),ROW($1:$8),1))-1,9)+1","v":1},null,{"$f":"D2","v":"15"},{"$f":"MOD(G2,10)","v":5},{"$f":"ROUNDDOWN(G2/10,0)","v":1},{"$f":"H2+I2","v":6},{"$f":"MOD(J2,10)","v":6},{"$f":"ROUNDDOWN(J2/10,0)","v":0},{"$f":"K2+L2","v":6},{"$f":"MOD(SUM(M2:M4),10)","v":9},{"$f":"ROUNDDOWN(SUM(M2:M4)/10,0)","v":1},{"$f":"N2+O2","v":10},{"$f":"MOD(SUM(P2:P4),10)","v":0},{"$f":"ROUNDDOWN(SUM(P2:P4)/10,0)","v":1},{"$f":"Q2+R2","v":1},null,{"$f":"Datas!C2","v":"Pierre"},{"$f":"Datas!D2","v":"David"},{"$f":"Datas!E2","v":"02:00:00"},null,{"$f":"TEXT(HOUR(W2),\"00\")","v":"02"},{"$f":"TEXT(MINUTE($W2),\"00\")","v":"00"},{"$f":"IF(Y2>Z2,$U$1,IF(Z2>Y2,$V$1,IF(Y2=Z2,\"DRAW\")))","v":"X"},null,{"$f":"INDIRECT(\"A\"&ROW())","v":"2016-04-15"},{"$f":"U2","v":"Pierre"},{"$f":"V2","v":"David"},{"$f":"IF(AD2=0,\"\",S2)","v":1},null,{"$f":"IF(AC2=0,\"\",OFFSET($AC$1,(ROW()-2)*3+1,))","v":"2016-04-15"},{"$f":"IF(AD2=0,\"\",OFFSET($AD$1,(ROW()-2)*3+1,))","v":"Pierre"},{"$f":"IF(AE2=0,\"\",OFFSET($AE$1,(ROW()-2)*3+1,))","v":"David"},{"$f":"IF(AF2=0,\"\",OFFSET($AF$1,(ROW()-2)*3+1,))","v":1},null,{"$f":"IF(COUNTIF($AK$2:$AK$97,AP$1)>=ROW()-1,LARGE(IF(($AK$2:$AK$97=AP$1)*($AH$2:$AH$97<>\"\"),$AH$2:$AH$97),ROW()-1),\"\")","v":"2016-04-15"},{"$f":"IF(AM2=\"\",\"\",VLOOKUP(AM2,$AH$2:$AK$97,2,0))","v":"Pierre"},{"$f":"IF(AM2=\"\",\"\",VLOOKUP(AM2,$AH$2:$AK$97,3,0))","v":"David"},{"$f":"IF(AM2=\"\",\"\",VLOOKUP(AM2,$AH$2:$AK$97,4,0))","v":1},null,{"$f":"IF(COUNTIF($AK$2:$AK$97,AU$1)>=ROW()-1,LARGE(IF(($AK$2:$AK$97=AU$1)*($AH$2:$AH$97<>\"\"),$AH$2:$AH$97),ROW()-1),\"\")","v":"2011-04-30"},{"$f":"IF(AR2=\"\",\"\",VLOOKUP(AR2,$AH$2:$AK$97,2,0))","v":"Pierre"},{"$f":"IF(AR2=\"\",\"\",VLOOKUP(AR2,$AH$2:$AK$97,3,0))","v":"David"},{"$f":"IF(AR2=\"\",\"\",VLOOKUP(AR2,$AH$2:$AK$97,4,0))","v":2},null,{"$f":"IF(COUNTIF($AK$2:$AK$97,AZ$1)>=ROW()-1,LARGE(IF(($AK$2:$AK$97=AZ$1)*($AH$2:$AH$97<>\"\"),$AH$2:$AH$97),ROW()-1),\"\")","v":""},{"$f":"IF(AW2=\"\",\"\",VLOOKUP(AW2,$AH$2:$AK$97,2,0))","v":""},{"$f":"IF(AW2=\"\",\"\",VLOOKUP(AW2,$AH$2:$AK$97,3,0))","v":""},{"$f":"IF(AW2=\"\",\"\",VLOOKUP(AW2,$AH$2:$AK$97,4,0))","v":""},null,{"$f":"IF(COUNTIF($AK$2:$AK$97,BE$1)>=ROW()-1,LARGE(IF(($AK$2:$AK$97=BE$1)*($AH$2:$AH$97<>\"\"),$AH$2:$AH$97),ROW()-1),\"\")","v":"2010-05-05"},{"$f":"IF(BB2=\"\",\"\",VLOOKUP(BB2,$AH$2:$AK$97,2,0))","v":"Pierre"},{"$f":"IF(BB2=\"\",\"\",VLOOKUP(BB2,$AH$2:$AK$97,3,0))","v":"David"},{"$f":"IF(BB2=\"\",\"\",VLOOKUP(BB2,$AH$2:$AK$97,4,0))","v":4},null,{"$f":"IF(COUNTIF($AK$2:$AK$97,BJ$1)>=ROW()-1,LARGE(IF(($AK$2:$AK$97=BJ$1)*($AH$2:$AH$97<>\"\"),$AH$2:$AH$97),ROW()-1),\"\")","v":""},{"$f":"IF(BG2=\"\",\"\",VLOOKUP(BG2,$AH$2:$AK$97,2,0))","v":""},{"$f":"IF(BG2=\"\",\"\",VLOOKUP(BG2,$AH$2:$AK$97,3,0))","v":""},{"$f":"IF(BG2=\"\",\"\",VLOOKUP(BG2,$AH$2:$AK$97,4,0))","v":""},null,{"$f":"IF(COUNTIF($AK$2:$AK$97,BO$1)>=ROW()-1,LARGE(IF(($AK$2:$AK$97=BO$1)*($AH$2:$AH$97<>\"\"),$AH$2:$AH$97),ROW()-1),\"\")","v":"2008-09-14"},{"$f":"IF(BL2=\"\",\"\",VLOOKUP(BL2,$AH$2:$AK$97,2,0))","v":"Pierre"},{"$f":"IF(BL2=\"\",\"\",VLOOKUP(BL2,$AH$2:$AK$97,3,0))","v":"David"},{"$f":"IF(BL2=\"\",\"\",VLOOKUP(BL2,$AH$2:$AK$97,4,0))","v":6},null,{"$f":"IF(COUNTIF($AK$2:$AK$97,BT$1)>=ROW()-1,LARGE(IF(($AK$2:$AK$97=BT$1)*($AH$2:$AH$97<>\"\"),$AH$2:$AH$97),ROW()-1),\"\")","v":"2012-10-28"},{"$f":"IF(BQ2=\"\",\"\",VLOOKUP(BQ2,$AH$2:$AK$97,2,0))","v":"Pierre"},{"$f":"IF(BQ2=\"\",\"\",VLOOKUP(BQ2,$AH$2:$AK$97,3,0))","v":"David"},{"$f":"IF(BQ2=\"\",\"\",VLOOKUP(BQ2,$AH$2:$AK$97,4,0))","v":7},null,{"$f":"IF(COUNTIF($AK$2:$AK$97,BY$1)>=ROW()-1,LARGE(IF(($AK$2:$AK$97=BY$1)*($AH$2:$AH$97<>\"\"),$AH$2:$AH$97),ROW()-1),\"\")","v":"2014-10-18"},{"$f":"IF(BV2=\"\",\"\",VLOOKUP(BV2,$AH$2:$AK$97,2,0))","v":"Pierre"},{"$f":"IF(BV2=\"\",\"\",VLOOKUP(BV2,$AH$2:$AK$97,3,0))","v":"David"},{"$f":"IF(BV2=\"\",\"\",VLOOKUP(BV2,$AH$2:$AK$97,4,0))","v":8},null,{"$f":"IF(COUNTIF($AK$2:$AK$97,CD$1)>=ROW()-1,LARGE(IF(($AK$2:$AK$97=CD$1)*($AH$2:$AH$97<>\"\"),$AH$2:$AH$97),ROW()-1),\"\")","v":""},{"$f":"IF(CA2=\"\",\"\",VLOOKUP(CA2,$AH$2:$AK$97,2,0))","v":""},{"$f":"IF(CA2=\"\",\"\",VLOOKUP(CA2,$AH$2:$AK$97,3,0))","v":""},{"$f":"IF(CA2=\"\",\"\",VLOOKUP(CA2,$AH$2:$AK$97,4,0))","v":""}]
[null,null,"Mois",{"$f":"IF(A2=\"\",0,TEXT(MONTH(A2),\"00\"))","v":"04"},null,null,{"$f":"D3","v":"04"},{"$f":"MOD(G3,10)","v":4},{"$f":"ROUNDDOWN(G3/10,0)","v":0},{"$f":"H3+I3","v":4},4,0,4,null,null,null,null,null,null,null,null,null,null,null,null,null,null,null,null,null,null,{"$f":"IF(AD3=0,\"\",S3)","v":""},null,{"$f":"IF(AC5=0,\"\",OFFSET($AC$1,(ROW()-2)*3+1,))","v":"2014-02-01"},{"$f":"IF(AD5=0,\"\",OFFSET($AD$1,(ROW()-2)*3+1,))","v":"Pierre"},{"$f":"IF(AE5=0,\"\",OFFSET($AE$1,(ROW()-2)*3+1,))","v":"David"},{"$f":"IF(AF5=0,\"\",OFFSET($AF$1,(ROW()-2)*3+1,))","v":1},null,{"$f":"IF(COUNTIF($AK$2:$AK$97,AP$1)>=ROW()-1,LARGE(IF(($AK$2:$AK$97=AP$1)*($AH$2:$AH$97<>\"\"),$AH$2:$AH$97),ROW()-1),\"\")","v":"2014-02-01"},{"$f":"IF(AM3=\"\",\"\",VLOOKUP(AM3,$AH$2:$AK$97,2,0))","v":"Pierre"},{"$f":"IF(AM3=\"\",\"\",VLOOKUP(AM3,$AH$2:$AK$97,3,0))","v":"David"},1,null,{"$f":"IF(COUNTIF($AK$2:$AK$97,AU$1)>=ROW()-1,LARGE(IF(($AK$2:$AK$97=AU$1)*($AH$2:$AH$97<>\"\"),$AH$2:$AH$97),ROW()-1),\"\")","v":"2005-12-10"},"Pierre","David",2,null,{"$f":"IF(COUNTIF($AK$2:$AK$97,AZ$1)>=ROW()-1,LARGE(IF(($AK$2:$AK$97=AZ$1)*($AH$2:$AH$97<>\"\"),$AH$2:$AH$97),ROW()-1),\"\")","v":""},"","","",null,{"$f":"IF(COUNTIF($AK$2:$AK$97,BE$1)>=ROW()-1,LARGE(IF(($AK$2:$AK$97=BE$1)*($AH$2:$AH$97<>\"\"),$AH$2:$AH$97),ROW()-1),\"\")","v":"2010-05-05"},"Pierre","David",4,null,{"$f":"IF(COUNTIF($AK$2:$AK$97,BJ$1)>=ROW()-1,LARGE(IF(($AK$2:$AK$97=BJ$1)*($AH$2:$AH$97<>\"\"),$AH$2:$AH$97),ROW()-1),\"\")","v":""},"","","",null,{"$f":"IF(COUNTIF($AK$2:$AK$97,BO$1)>=ROW()-1,LARGE(IF(($AK$2:$AK$97=BO$1)*($AH$2:$AH$97<>\"\"),$AH$2:$AH$97),ROW()-1),\"\")","v":""},"","","",null,{"$f":"IF(COUNTIF($AK$2:$AK$97,BT$1)>=ROW()-1,LARGE(IF(($AK$2:$AK$97=BT$1)*($AH$2:$AH$97<>\"\"),$AH$2:$AH$97),ROW()-1),\"\")","v":""},"","","",null,{"$f":"IF(COUNTIF($AK$2:$AK$97,BY$1)>=ROW()-1,LARGE(IF(($AK$2:$AK$97=BY$1)*($AH$2:$AH$97<>\"\"),$AH$2:$AH$97),ROW()-1),\"\")","v":""},"","","",null,{"$f":"IF(COUNTIF($AK$2:$AK$97,CD$1)>=ROW()-1,LARGE(IF(($AK$2:$AK$97=CD$1)*($AH$2:$AH$97<>\"\"),$AH$2:$AH$97),ROW()-1),\"\")","v":""},"","",""]
[null,null,"Année",{"$f":"IF(A2=\"\",0,TEXT(YEAR(A2),\"00\"))","v":"2016"},{"$f":"D4","v":"2016"},{"$f":"MOD(E4,10)","v":6},{"$f":"MOD(ROUNDDOWN(E4/1000,0),10)","v":2},{"$f":"MOD(ROUNDDOWN(E4/100,0),10)","v":0},{"$f":"MOD(ROUNDDOWN(E4/10,0),100)","v":1},{"$f":"F4+G4+H4+I4","v":9},9,0,9,null,null,null,null,null,null,null,null,null,null,null,null,null,null,null,null,null,null,"",null,{"$f":"IF(AC8=0,\"\",OFFSET($AC$1,(ROW()-2)*3+1,))","v":"2012-04-01"},{"$f":"IF(AD8=0,\"\",OFFSET($AD$1,(ROW()-2)*3+1,))","v":"Pierre"},{"$f":"IF(AE8=0,\"\",OFFSET($AE$1,(ROW()-2)*3+1,))","v":"David"},{"$f":"IF(AF8=0,\"\",OFFSET($AF$1,(ROW()-2)*3+1,))","v":1},null,{"$f":"IF(COUNTIF($AK$2:$AK$97,AP$1)>=ROW()-1,LARGE(IF(($AK$2:$AK$97=AP$1)*($AH$2:$AH$97<>\"\"),$AH$2:$AH$97),ROW()-1),\"\")","v":"2012-04-01"},"Pierre","David",1,null,{"$f":"IF(COUNTIF($AK$2:$AK$97,AU$1)>=ROW()-1,LARGE(IF(($AK$2:$AK$97=AU$1)*($AH$2:$AH$97<>\"\"),$AH$2:$AH$97),ROW()-1),\"\")","v":""},"","","",null,{"$f":"IF(COUNTIF($AK$2:$AK$97,AZ$1)>=ROW()-1,LARGE(IF(($AK$2:$AK$97=AZ$1)*($AH$2:$AH$97<>\"\"),$AH$2:$AH$97),ROW()-1),\"\")","v":""},"","","",null,{"$f":"IF(COUNTIF($AK$2:$AK$97,BE$1)>=ROW()-1,LARGE(IF(($AK$2:$AK$97=BE$1)*($AH$2:$AH$97<>\"\"),$AH$2:$AH$97),ROW()-1),\"\")","v":""},"","","",null,{"$f":"IF(COUNTIF($AK$2:$AK$97,BJ$1)>=ROW()-1,LARGE(IF(($AK$2:$AK$97=BJ$1)*($AH$2:$AH$97<>\"\"),$AH$2:$AH$97),ROW()-1),\"\")","v":""},"","","",null,{"$f":"IF(COUNTIF($AK$2:$AK$97,BO$1)>=ROW()-1,LARGE(IF(($AK$2:$AK$97=BO$1)*($AH$2:$AH$97<>\"\"),$AH$2:$AH$97),ROW()-1),\"\")","v":""},"","","",null,{"$f":"IF(COUNTIF($AK$2:$AK$97,BT$1)>=ROW()-1,LARGE(IF(($AK$2:$AK$97=BT$1)*($AH$2:$AH$97<>\"\"),$AH$2:$AH$97),ROW()-1),\"\")","v":""},"","","",null,{"$f":"IF(COUNTIF($AK$2:$AK$97,BY$1)>=ROW()-1,LARGE(IF(($AK$2:$AK$97=BY$1)*($AH$2:$AH$97<>\"\"),$AH$2:$AH$97),ROW()-1),\"\")","v":""},"","","",null,{"$f":"IF(COUNTIF($AK$2:$AK$97,CD$1)>=ROW()-1,LARGE(IF(($AK$2:$AK$97=CD$1)*($AH$2:$AH$97<>\"\"),$AH$2:$AH$97),ROW()-1),\"\")","v":""},"","",""]
[{"$f":"Datas!F3","v":"2014-02-01"},null,"Jour",{"$f":"IF(A5=\"\",0,TEXT(DAY(A5),\"00\"))","v":"01"},{"$f":"MOD(SUMPRODUCT(--MID(TEXT(A5,\"jjmmaaaa\"),ROW($1:$8),1))-1,9)+1","v":1},null,{"$f":"D5","v":"01"},{"$f":"MOD(G5,10)","v":1},{"$f":"ROUNDDOWN(G5/10,0)","v":0},{"$f":"H5+I5","v":1},1,0,1,{"$f":"MOD(SUM(M5:M7),10)","v":0},{"$f":"ROUNDDOWN(SUM(M5:M7)/10,0)","v":1},{"$f":"N5+O5","v":1},{"$f":"MOD(SUM(P5:P7),10)","v":1},{"$f":"ROUNDDOWN(SUM(P5:P7)/10,0)","v":0},{"$f":"Q5+R5","v":1},null,{"$f":"Datas!C3","v":"Pierre"},{"$f":"Datas!D3","v":"David"},{"$f":"Datas!E3","v":"03:01:00"},null,{"$f":"TEXT(HOUR(W5),\"00\")","v":"03"},{"$f":"TEXT(MINUTE($W5),\"00\")","v":"01"},{"$f":"IF(Y5>Z5,$U$1,IF(Z5>Y5,$V$1,IF(Y5=Z5,\"DRAW\")))","v":"X"},null,{"$f":"INDIRECT(\"A\"&ROW())","v":"2014-02-01"},{"$f":"U5","v":"Pierre"},{"$f":"V5","v":"David"},1,null,{"$f":"IF(AC11=0,\"\",OFFSET($AC$1,(ROW()-2)*3+1,))","v":"2011-04-30"},{"$f":"IF(AD11=0,\"\",OFFSET($AD$1,(ROW()-2)*3+1,))","v":"Pierre"},{"$f":"IF(AE11=0,\"\",OFFSET($AE$1,(ROW()-2)*3+1,))","v":"David"},{"$f":"IF(AF11=0,\"\",OFFSET($AF$1,(ROW()-2)*3+1,))","v":2},null,{"$f":"IF(COUNTIF($AK$2:$AK$97,AP$1)>=ROW()-1,LARGE(IF(($AK$2:$AK$97=AP$1)*($AH$2:$AH$97<>\"\"),$AH$2:$AH$97),ROW()-1),\"\")","v":""},"","","",null,{"$f":"IF(COUNTIF($AK$2:$AK$97,AU$1)>=ROW()-1,LARGE(IF(($AK$2:$AK$97=AU$1)*($AH$2:$AH$97<>\"\"),$AH$2:$AH$97),ROW()-1),\"\")","v":""},"","","",null,{"$f":"IF(COUNTIF($AK$2:$AK$97,AZ$1)>=ROW()-1,LARGE(IF(($AK$2:$AK$97=AZ$1)*($AH$2:$AH$97<>\"\"),$AH$2:$AH$97),ROW()-1),\"\")","v":""},"","","",null,{"$f":"IF(COUNTIF($AK$2:$AK$97,BE$1)>=ROW()-1,LARGE(IF(($AK$2:$AK$97=BE$1)*($AH$2:$AH$97<>\"\"),$AH$2:$AH$97),ROW()-1),\"\")","v":""},"","","",null,{"$f":"IF(COUNTIF($AK$2:$AK$97,BJ$1)>=ROW()-1,LARGE(IF(($AK$2:$AK$97=BJ$1)*($AH$2:$AH$97<>\"\"),$AH$2:$AH$97),ROW()-1),\"\")","v":""},"","","",null,{"$f":"IF(COUNTIF($AK$2:$AK$97,BO$1)>=ROW()-1,LARGE(IF(($AK$2:$AK$97=BO$1)*($AH$2:$AH$97<>\"\"),$AH$2:$AH$97),ROW()-1),\"\")","v":""},"","","",null,{"$f":"IF(COUNTIF($AK$2:$AK$97,BT$1)>=ROW()-1,LARGE(IF(($AK$2:$AK$97=BT$1)*($AH$2:$AH$97<>\"\"),$AH$2:$AH$97),ROW()-1),\"\")","v":""},"","","",null,{"$f":"IF(COUNTIF($AK$2:$AK$97,BY$1)>=ROW()-1,LARGE(IF(($AK$2:$AK$97=BY$1)*($AH$2:$AH$97<>\"\"),$AH$2:$AH$97),ROW()-1),\"\")","v":""},"","","",null,{"$f":"IF(COUNTIF($AK$2:$AK$97,CD$1)>=ROW()-1,LARGE(IF(($AK$2:$AK$97=CD$1)*($AH$2:$AH$97<>\"\"),$AH$2:$AH$97),ROW()-1),\"\")","v":""},"","",""]
[null,null,"Mois",{"$f":"IF(A5=\"\",0,TEXT(MONTH(A5),\"00\"))","v":"02"},null,null,{"$f":"D6","v":"02"},{"$f":"MOD(G6,10)","v":2},{"$f":"ROUNDDOWN(G6/10,0)","v":0},{"$f":"H6+I6","v":2},2,0,2,null,null,null,null,null,null,null,null,null,null,null,null,null,null,null,null,null,null,"",null,{"$f":"IF(AC14=0,\"\",OFFSET($AC$1,(ROW()-2)*3+1,))","v":"2005-12-10"},{"$f":"IF(AD14=0,\"\",OFFSET($AD$1,(ROW()-2)*3+1,))","v":"Pierre"},{"$f":"IF(AE14=0,\"\",OFFSET($AE$1,(ROW()-2)*3+1,))","v":"David"},{"$f":"IF(AF14=0,\"\",OFFSET($AF$1,(ROW()-2)*3+1,))","v":2},null,{"$f":"IF(COUNTIF($AK$2:$AK$97,AP$1)>=ROW()-1,LARGE(IF(($AK$2:$AK$97=AP$1)*($AH$2:$AH$97<>\"\"),$AH$2:$AH$97),ROW()-1),\"\")","v":""},"","","",null,{"$f":"IF(COUNTIF($AK$2:$AK$97,AU$1)>=ROW()-1,LARGE(IF(($AK$2:$AK$97=AU$1)*($AH$2:$AH$97<>\"\"),$AH$2:$AH$97),ROW()-1),\"\")","v":""},"","","",null,{"$f":"IF(COUNTIF($AK$2:$AK$97,AZ$1)>=ROW()-1,LARGE(IF(($AK$2:$AK$97=AZ$1)*($AH$2:$AH$97<>\"\"),$AH$2:$AH$97),ROW()-1),\"\")","v":""},"","","",null,{"$f":"IF(COUNTIF($AK$2:$AK$97,BE$1)>=ROW()-1,LARGE(IF(($AK$2:$AK$97=BE$1)*($AH$2:$AH$97<>\"\"),$AH$2:$AH$97),ROW()-1),\"\")","v":""},"","","",null,{"$f":"IF(COUNTIF($AK$2:$AK$97,BJ$1)>=ROW()-1,LARGE(IF(($AK$2:$AK$97=BJ$1)*($AH$2:$AH$97<>\"\"),$AH$2:$AH$97),ROW()-1),\"\")","v":""},"","","",null,{"$f":"IF(COUNTIF($AK$2:$AK$97,BO$1)>=ROW()-1,LARGE(IF(($AK$2:$AK$97=BO$1)*($AH$2:$AH$97<>\"\"),$AH$2:$AH$97),ROW()-1),\"\")","v":""},"","","",null,{"$f":"IF(COUNTIF($AK$2:$AK$97,BT$1)>=ROW()-1,LARGE(IF(($AK$2:$AK$97=BT$1)*($AH$2:$AH$97<>\"\"),$AH$2:$AH$97),ROW()-1),\"\")","v":""},"","","",null,{"$f":"IF(COUNTIF($AK$2:$AK$97,BY$1)>=ROW()-1,LARGE(IF(($AK$2:$AK$97=BY$1)*($AH$2:$AH$97<>\"\"),$AH$2:$AH$97),ROW()-1),\"\")","v":""},"","","",null,{"$f":"IF(COUNTIF($AK$2:$AK$97,CD$1)>=ROW()-1,LARGE(IF(($AK$2:$AK$97=CD$1)*($AH$2:$AH$97<>\"\"),$AH$2:$AH$97),ROW()-1),\"\")","v":""},"","",""]
[null,null,"Année",{"$f":"IF(A5=\"\",0,TEXT(YEAR(A5),\"00\"))","v":"2014"},{"$f":"D7","v":"2014"},{"$f":"MOD(E7,10)","v":4},{"$f":"MOD(ROUNDDOWN(E7/1000,0),10)","v":2},{"$f":"MOD(ROUNDDOWN(E7/100,0),10)","v":0},{"$f":"MOD(ROUNDDOWN(E7/10,0),100)","v":1},{"$f":"F7+G7+H7+I7","v":7},7,0,7,null,null,null,null,null,null,null,null,null,null,null,null,null,null,null,null,null,null,"",null,{"$f":"IF(AC17=0,\"\",OFFSET($AC$1,(ROW()-2)*3+1,))","v":"2010-05-05"},{"$f":"IF(AD17=0,\"\",OFFSET($AD$1,(ROW()-2)*3+1,))","v":"Pierre"},{"$f":"IF(AE17=0,\"\",OFFSET($AE$1,(ROW()-2)*3+1,))","v":"David"},{"$f":"IF(AF17=0,\"\",OFFSET($AF$1,(ROW()-2)*3+1,))","v":4},null,{"$f":"IF(COUNTIF($AK$2:$AK$97,AP$1)>=ROW()-1,LARGE(IF(($AK$2:$AK$97=AP$1)*($AH$2:$AH$97<>\"\"),$AH$2:$AH$97),ROW()-1),\"\")","v":""},"","","",null,{"$f":"IF(COUNTIF($AK$2:$AK$97,AU$1)>=ROW()-1,LARGE(IF(($AK$2:$AK$97=AU$1)*($AH$2:$AH$97<>\"\"),$AH$2:$AH$97),ROW()-1),\"\")","v":""},"","","",null,{"$f":"IF(COUNTIF($AK$2:$AK$97,AZ$1)>=ROW()-1,LARGE(IF(($AK$2:$AK$97=AZ$1)*($AH$2:$AH$97<>\"\"),$AH$2:$AH$97),ROW()-1),\"\")","v":""},"","","",null,{"$f":"IF(COUNTIF($AK$2:$AK$97,BE$1)>=ROW()-1,LARGE(IF(($AK$2:$AK$97=BE$1)*($AH$2:$AH$97<>\"\"),$AH$2:$AH$97),ROW()-1),\"\")","v":""},"","","",null,{"$f":"IF(COUNTIF($AK$2:$AK$97,BJ$1)>=ROW()-1,LARGE(IF(($AK$2:$AK$97=BJ$1)*($AH$2:$AH$97<>\"\"),$AH$2:$AH$97),ROW()-1),\"\")","v":""},"","","",null,{"$f":"IF(COUNTIF($AK$2:$AK$97,BO$1)>=ROW()-1,LARGE(IF(($AK$2:$AK$97=BO$1)*($AH$2:$AH$97<>\"\"),$AH$2:$AH$97),ROW()-1),\"\")","v":""},"","","",null,{"$f":"IF(COUNTIF($AK$2:$AK$97,BT$1)>=ROW()-1,LARGE(IF(($AK$2:$AK$97=BT$1)*($AH$2:$AH$97<>\"\"),$AH$2:$AH$97),ROW()-1),\"\")","v":""},"","","",null,{"$f":"IF(COUNTIF($AK$2:$AK$97,BY$1)>=ROW()-1,LARGE(IF(($AK$2:$AK$97=BY$1)*($AH$2:$AH$97<>\"\"),$AH$2:$AH$97),ROW()-1),\"\")","v":""},"","","",null,{"$f":"IF(COUNTIF($AK$2:$AK$97,CD$1)>=ROW()-1,LARGE(IF(($AK$2:$AK$97=CD$1)*($AH$2:$AH$97<>\"\"),$AH$2:$AH$97),ROW()-1),\"\")","v":""},"","",""]
[{"$f":"Datas!F4","v":"2012-04-01"},null,"Jour",{"$f":"IF(A8=\"\",0,TEXT(DAY(A8),\"00\"))","v":"01"},{"$f":"MOD(SUMPRODUCT(--MID(TEXT(A8,\"jjmmaaaa\"),ROW($1:$8),1))-1,9)+1","v":1},null,{"$f":"D8","v":"01"},{"$f":"MOD(G8,10)","v":1},{"$f":"ROUNDDOWN(G8/10,0)","v":0},{"$f":"H8+I8","v":1},1,0,1,{"$f":"MOD(SUM(M8:M10),10)","v":0},{"$f":"ROUNDDOWN(SUM(M8:M10)/10,0)","v":1},{"$f":"N8+O8","v":1},{"$f":"MOD(SUM(P8:P10),10)","v":1},{"$f":"ROUNDDOWN(SUM(P8:P10)/10,0)","v":0},{"$f":"Q8+R8","v":1},null,{"$f":"Datas!C4","v":"Pierre"},{"$f":"Datas!D4","v":"David"},{"$f":"Datas!E4","v":"02:01:00"},null,{"$f":"TEXT(HOUR(W8),\"00\")","v":"02"},{"$f":"TEXT(MINUTE($W8),\"00\")","v":"01"},{"$f":"IF(Y8>Z8,$U$1,IF(Z8>Y8,$V$1,IF(Y8=Z8,\"DRAW\")))","v":"X"},null,{"$f":"INDIRECT(\"A\"&ROW())","v":"2012-04-01"},{"$f":"U8","v":"Pierre"},{"$f":"V8","v":"David"},1,null,{"$f":"IF(AC20=0,\"\",OFFSET($AC$1,(ROW()-2)*3+1,))","v":"2010-05-05"},{"$f":"IF(AD20=0,\"\",OFFSET($AD$1,(ROW()-2)*3+1,))","v":"Pierre"},{"$f":"IF(AE20=0,\"\",OFFSET($AE$1,(ROW()-2)*3+1,))","v":"David"},{"$f":"IF(AF20=0,\"\",OFFSET($AF$1,(ROW()-2)*3+1,))","v":4},null,{"$f":"IF(COUNTIF($AK$2:$AK$97,AP$1)>=ROW()-1,LARGE(IF(($AK$2:$AK$97=AP$1)*($AH$2:$AH$97<>\"\"),$AH$2:$AH$97),ROW()-1),\"\")","v":""},"","","",null,{"$f":"IF(COUNTIF($AK$2:$AK$97,AU$1)>=ROW()-1,LARGE(IF(($AK$2:$AK$97=AU$1)*($AH$2:$AH$97<>\"\"),$AH$2:$AH$97),ROW()-1),\"\")","v":""},"","","",null,{"$f":"IF(COUNTIF($AK$2:$AK$97,AZ$1)>=ROW()-1,LARGE(IF(($AK$2:$AK$97=AZ$1)*($AH$2:$AH$97<>\"\"),$AH$2:$AH$97),ROW()-1),\"\")","v":""},"","","",null,{"$f":"IF(COUNTIF($AK$2:$AK$97,BE$1)>=ROW()-1,LARGE(IF(($AK$2:$AK$97=BE$1)*($AH$2:$AH$97<>\"\"),$AH$2:$AH$97),ROW()-1),\"\")","v":""},"","","",null,{"$f":"IF(COUNTIF($AK$2:$AK$97,BJ$1)>=ROW()-1,LARGE(IF(($AK$2:$AK$97=BJ$1)*($AH$2:$AH$97<>\"\"),$AH$2:$AH$97),ROW()-1),\"\")","v":""},"","","",null,{"$f":"IF(COUNTIF($AK$2:$AK$97,BO$1)>=ROW()-1,LARGE(IF(($AK$2:$AK$97=BO$1)*($AH$2:$AH$97<>\"\"),$AH$2:$AH$97),ROW()-1),\"\")","v":""},"","","",null,{"$f":"IF(COUNTIF($AK$2:$AK$97,BT$1)>=ROW()-1,LARGE(IF(($AK$2:$AK$97=BT$1)*($AH$2:$AH$97<>\"\"),$AH$2:$AH$97),ROW()-1),\"\")","v":""},"","","",null,{"$f":"IF(COUNTIF($AK$2:$AK$97,BY$1)>=ROW()-1,LARGE(IF(($AK$2:$AK$97=BY$1)*($AH$2:$AH$97<>\"\"),$AH$2:$AH$97),ROW()-1),\"\")","v":""},"","","",null,{"$f":"IF(COUNTIF($AK$2:$AK$97,CD$1)>=ROW()-1,LARGE(IF(($AK$2:$AK$97=CD$1)*($AH$2:$AH$97<>\"\"),$AH$2:$AH$97),ROW()-1),\"\")","v":""},"","",""]
[null,null,"Mois",{"$f":"IF(A8=\"\",0,TEXT(MONTH(A8),\"00\"))","v":"04"},null,null,{"$f":"D9","v":"04"},{"$f":"MOD(G9,10)","v":4},{"$f":"ROUNDDOWN(G9/10,0)","v":0},{"$f":"H9+I9","v":4},4,0,4,null,null,null,null,null,null,null,null,null,null,null,null,null,null,null,null,null,null,"",null,{"$f":"IF(AC23=0,\"\",OFFSET($AC$1,(ROW()-2)*3+1,))","v":"2008-09-14"},{"$f":"IF(AD23=0,\"\",OFFSET($AD$1,(ROW()-2)*3+1,))","v":"Pierre"},{"$f":"IF(AE23=0,\"\",OFFSET($AE$1,(ROW()-2)*3+1,))","v":"David"},{"$f":"IF(AF23=0,\"\",OFFSET($AF$1,(ROW()-2)*3+1,))","v":6},null,{"$f":"IF(COUNTIF($AK$2:$AK$97,AP$1)>=ROW()-1,LARGE(IF(($AK$2:$AK$97=AP$1)*($AH$2:$AH$97<>\"\"),$AH$2:$AH$97),ROW()-1),\"\")","v":""},"","","",null,{"$f":"IF(COUNTIF($AK$2:$AK$97,AU$1)>=ROW()-1,LARGE(IF(($AK$2:$AK$97=AU$1)*($AH$2:$AH$97<>\"\"),$AH$2:$AH$97),ROW()-1),\"\")","v":""},"","","",null,{"$f":"IF(COUNTIF($AK$2:$AK$97,AZ$1)>=ROW()-1,LARGE(IF(($AK$2:$AK$97=AZ$1)*($AH$2:$AH$97<>\"\"),$AH$2:$AH$97),ROW()-1),\"\")","v":""},"","","",null,{"$f":"IF(COUNTIF($AK$2:$AK$97,BE$1)>=ROW()-1,LARGE(IF(($AK$2:$AK$97=BE$1)*($AH$2:$AH$97<>\"\"),$AH$2:$AH$97),ROW()-1),\"\")","v":""},"","","",null,{"$f":"IF(COUNTIF($AK$2:$AK$97,BJ$1)>=ROW()-1,LARGE(IF(($AK$2:$AK$97=BJ$1)*($AH$2:$AH$97<>\"\"),$AH$2:$AH$97),ROW()-1),\"\")","v":""},"","","",null,{"$f":"IF(COUNTIF($AK$2:$AK$97,BO$1)>=ROW()-1,LARGE(IF(($AK$2:$AK$97=BO$1)*($AH$2:$AH$97<>\"\"),$AH$2:$AH$97),ROW()-1),\"\")","v":""},"","","",null,{"$f":"IF(COUNTIF($AK$2:$AK$97,BT$1)>=ROW()-1,LARGE(IF(($AK$2:$AK$97=BT$1)*($AH$2:$AH$97<>\"\"),$AH$2:$AH$97),ROW()-1),\"\")","v":""},"","","",null,{"$f":"IF(COUNTIF($AK$2:$AK$97,BY$1)>=ROW()-1,LARGE(IF(($AK$2:$AK$97=BY$1)*($AH$2:$AH$97<>\"\"),$AH$2:$AH$97),ROW()-1),\"\")","v":""},"","","",null,{"$f":"IF(COUNTIF($AK$2:$AK$97,CD$1)>=ROW()-1,LARGE(IF(($AK$2:$AK$97=CD$1)*($AH$2:$AH$97<>\"\"),$AH$2:$AH$97),ROW()-1),\"\")","v":""},"","",""]
[null,null,"Année",{"$f":"IF(A8=\"\",0,TEXT(YEAR(A8),\"00\"))","v":"2012"},{"$f":"D10","v":"2012"},{"$f":"MOD(E10,10)","v":2},{"$f":"MOD(ROUNDDOWN(E10/1000,0),10)","v":2},{"$f":"MOD(ROUNDDOWN(E10/100,0),10)","v":0},{"$f":"MOD(ROUNDDOWN(E10/10,0),100)","v":1},{"$f":"F10+G10+H10+I10","v":5},5,0,5,null,null,null,null,null,null,null,null,null,null,null,null,null,null,null,null,null,null,"",null,{"$f":"IF(AC26=0,\"\",OFFSET($AC$1,(ROW()-2)*3+1,))","v":"2012-10-28"},{"$f":"IF(AD26=0,\"\",OFFSET($AD$1,(ROW()-2)*3+1,))","v":"Pierre"},{"$f":"IF(AE26=0,\"\",OFFSET($AE$1,(ROW()-2)*3+1,))","v":"David"},{"$f":"IF(AF26=0,\"\",OFFSET($AF$1,(ROW()-2)*3+1,))","v":7},null,{"$f":"IF(COUNTIF($AK$2:$AK$97,AP$1)>=ROW()-1,LARGE(IF(($AK$2:$AK$97=AP$1)*($AH$2:$AH$97<>\"\"),$AH$2:$AH$97),ROW()-1),\"\")","v":""},"","","",null,{"$f":"IF(COUNTIF($AK$2:$AK$97,AU$1)>=ROW()-1,LARGE(IF(($AK$2:$AK$97=AU$1)*($AH$2:$AH$97<>\"\"),$AH$2:$AH$97),ROW()-1),\"\")","v":""},"","","",null,{"$f":"IF(COUNTIF($AK$2:$AK$97,AZ$1)>=ROW()-1,LARGE(IF(($AK$2:$AK$97=AZ$1)*($AH$2:$AH$97<>\"\"),$AH$2:$AH$97),ROW()-1),\"\")","v":""},"","","",null,{"$f":"IF(COUNTIF($AK$2:$AK$97,BE$1)>=ROW()-1,LARGE(IF(($AK$2:$AK$97=BE$1)*($AH$2:$AH$97<>\"\"),$AH$2:$AH$97),ROW()-1),\"\")","v":""},"","","",null,{"$f":"IF(COUNTIF($AK$2:$AK$97,BJ$1)>=ROW()-1,LARGE(IF(($AK$2:$AK$97=BJ$1)*($AH$2:$AH$97<>\"\"),$AH$2:$AH$97),ROW()-1),\"\")","v":""},"","","",null,{"$f":"IF(COUNTIF($AK$2:$AK$97,BO$1)>=ROW()-1,LARGE(IF(($AK$2:$AK$97=BO$1)*($AH$2:$AH$97<>\"\"),$AH$2:$AH$97),ROW()-1),\"\")","v":""},"","","",null,{"$f":"IF(COUNTIF($AK$2:$AK$97,BT$1)>=ROW()-1,LARGE(IF(($AK$2:$AK$97=BT$1)*($AH$2:$AH$97<>\"\"),$AH$2:$AH$97),ROW()-1),\"\")","v":""},"","","",null,{"$f":"IF(COUNTIF($AK$2:$AK$97,BY$1)>=ROW()-1,LARGE(IF(($AK$2:$AK$97=BY$1)*($AH$2:$AH$97<>\"\"),$AH$2:$AH$97),ROW()-1),\"\")","v":""},"","","",null,{"$f":"IF(COUNTIF($AK$2:$AK$97,CD$1)>=ROW()-1,LARGE(IF(($AK$2:$AK$97=CD$1)*($AH$2:$AH$97<>\"\"),$AH$2:$AH$97),ROW()-1),\"\")","v":""},"","",""]
[{"$f":"Datas!F5","v":"2011-04-30"},null,"Jour",{"$f":"IF(A11=\"\",0,TEXT(DAY(A11),\"00\"))","v":"30"},{"$f":"MOD(SUMPRODUCT(--MID(TEXT(A11,\"jjmmaaaa\"),ROW($1:$8),1))-1,9)+1","v":2},null,{"$f":"D11","v":"30"},{"$f":"MOD(G11,10)","v":0},{"$f":"ROUNDDOWN(G11/10,0)","v":3},{"$f":"H11+I11","v":3},3,0,3,{"$f":"MOD(SUM(M11:M13),10)","v":1},{"$f":"ROUNDDOWN(SUM(M11:M13)/10,0)","v":1},{"$f":"N11+O11","v":2},{"$f":"MOD(SUM(P11:P13),10)","v":2},{"$f":"ROUNDDOWN(SUM(P11:P13)/10,0)","v":0},{"$f":"Q11+R11","v":2},null,{"$f":"Datas!C5","v":"Pierre"},{"$f":"Datas!D5","v":"David"},{"$f":"Datas!E5","v":"00:01:00"},null,{"$f":"TEXT(HOUR(W11),\"00\")","v":"00"},{"$f":"TEXT(MINUTE($W11),\"00\")","v":"01"},{"$f":"IF(Y11>Z11,$U$1,IF(Z11>Y11,$V$1,IF(Y11=Z11,\"DRAW\")))","v":"Z"},null,{"$f":"INDIRECT(\"A\"&ROW())","v":"2011-04-30"},{"$f":"U11","v":"Pierre"},{"$f":"V11","v":"David"},2,null,{"$f":"IF(AC29=0,\"\",OFFSET($AC$1,(ROW()-2)*3+1,))","v":"2014-10-18"},{"$f":"IF(AD29=0,\"\",OFFSET($AD$1,(ROW()-2)*3+1,))","v":"Pierre"},{"$f":"IF(AE29=0,\"\",OFFSET($AE$1,(ROW()-2)*3+1,))","v":"David"},{"$f":"IF(AF29=0,\"\",OFFSET($AF$1,(ROW()-2)*3+1,))","v":8}]
[null,null,"Mois",{"$f":"IF(A11=\"\",0,TEXT(MONTH(A11),\"00\"))","v":"04"},null,null,{"$f":"D12","v":"04"},{"$f":"MOD(G12,10)","v":4},{"$f":"ROUNDDOWN(G12/10,0)","v":0},{"$f":"H12+I12","v":4},4,0,4,null,null,null,null,null,null,null,null,null,null,null,null,null,null,null,null,null,null,"",null,{"$f":"IF(AC32=0,\"\",OFFSET($AC$1,(ROW()-2)*3+1,))","v":""},{"$f":"IF(AD32=0,\"\",OFFSET($AD$1,(ROW()-2)*3+1,))","v":""},{"$f":"IF(AE32=0,\"\",OFFSET($AE$1,(ROW()-2)*3+1,))","v":""},{"$f":"IF(AF32=0,\"\",OFFSET($AF$1,(ROW()-2)*3+1,))","v":""},null,null,null,null,null,null,null,null,null,null,null,null,{"$f":"COUNTIF(AF:AF,3)","v":2},null,null,null,null,{"$f":"COUNTIF(AF:AF,4)","v":4}]
[null,null,"Année",{"$f":"IF(A11=\"\",0,TEXT(YEAR(A11),\"00\"))","v":"2011"},{"$f":"D13","v":"2011"},{"$f":"MOD(E13,10)","v":1},{"$f":"MOD(ROUNDDOWN(E13/1000,0),10)","v":2},{"$f":"MOD(ROUNDDOWN(E13/100,0),10)","v":0},{"$f":"MOD(ROUNDDOWN(E13/10,0),100)","v":1},{"$f":"F13+G13+H13+I13","v":4},4,0,4,null,null,null,null,null,null,null,null,null,null,null,null,null,null,null,null,null,null,"",null,{"$f":"IF(AC35=0,\"\",OFFSET($AC$1,(ROW()-2)*3+1,))","v":""},{"$f":"IF(AD35=0,\"\",OFFSET($AD$1,(ROW()-2)*3+1,))","v":""},{"$f":"IF(AE35=0,\"\",OFFSET($AE$1,(ROW()-2)*3+1,))","v":""},{"$f":"IF(AF35=0,\"\",OFFSET($AF$1,(ROW()-2)*3+1,))","v":""},null,"Résultat",{"$f":"truc(AN2:AO10)","v":"NUL"},null,null,null,"Résultat",{"$f":"truc(AS2:AT10)","v":"NUL"},null,null,null,"Résultat",{"$f":"truc(AX2:AY10)","v":"RIEN"},null,null,null,"Résultat",{"$f":"truc(BC2:BD10)","v":"NUL"},null,null,null,"Résultat",{"$f":"truc(BH2:BI10)","v":"RIEN"},null,null,null,"Résultat",{"$f":"truc(BM2:BN10)","v":"NUL"},null,null,null,"Résultat",{"$f":"truc(BR2:BS10)","v":"NUL"},null,null,null,"Résultat",{"$f":"truc(BW2:BX10)","v":"NUL"},null,null,null,"Résultat",{"$f":"truc(CB2:CC10)","v":"RIEN"}]
[{"$f":"Datas!F6","v":"2005-12-10"},null,"Jour",{"$f":"IF(A14=\"\",0,TEXT(DAY(A14),\"00\"))","v":"10"},{"$f":"MOD(SUMPRODUCT(--MID(TEXT(A14,\"jjmmaaaa\"),ROW($1:$8),1))-1,9)+1","v":2},null,{"$f":"D14","v":"10"},{"$f":"MOD(G14,10)","v":0},{"$f":"ROUNDDOWN(G14/10,0)","v":1},{"$f":"H14+I14","v":1},1,0,1,{"$f":"MOD(SUM(M14:M16),10)","v":1},{"$f":"ROUNDDOWN(SUM(M14:M16)/10,0)","v":1},{"$f":"N14+O14","v":2},{"$f":"MOD(SUM(P14:P16),10)","v":2},{"$f":"ROUNDDOWN(SUM(P14:P16)/10,0)","v":0},{"$f":"Q14+R14","v":2},null,{"$f":"Datas!C6","v":"Pierre"},{"$f":"Datas!D6","v":"David"},{"$f":"Datas!E6","v":"01:00:00"},null,{"$f":"TEXT(HOUR(W14),\"00\")","v":"01"},{"$f":"TEXT(MINUTE($W14),\"00\")","v":"00"},{"$f":"IF(Y14>Z14,$U$1,IF(Z14>Y14,$V$1,IF(Y14=Z14,\"DRAW\")))","v":"X"},null,{"$f":"INDIRECT(\"A\"&ROW())","v":"2005-12-10"},{"$f":"U14","v":"Pierre"},{"$f":"V14","v":"David"},2,null,{"$f":"IF(AC38=0,\"\",OFFSET($AC$1,(ROW()-2)*3+1,))","v":""},{"$f":"IF(AD38=0,\"\",OFFSET($AD$1,(ROW()-2)*3+1,))","v":""},{"$f":"IF(AE38=0,\"\",OFFSET($AE$1,(ROW()-2)*3+1,))","v":""},{"$f":"IF(AF38=0,\"\",OFFSET($AF$1,(ROW()-2)*3+1,))","v":""}]
[null,null,"Mois",{"$f":"IF(A14=\"\",0,TEXT(MONTH(A14),\"00\"))","v":"12"},null,null,{"$f":"D15","v":"12"},{"$f":"MOD(G15,10)","v":2},{"$f":"ROUNDDOWN(G15/10,0)","v":1},{"$f":"H15+I15","v":3},3,0,3,null,null,null,null,null,null,null,null,null,null,null,null,null,null,null,null,null,null,"",null,{"$f":"IF(AC41=0,\"\",OFFSET($AC$1,(ROW()-2)*3+1,))","v":""},{"$f":"IF(AD41=0,\"\",OFFSET($AD$1,(ROW()-2)*3+1,))","v":""},{"$f":"IF(AE41=0,\"\",OFFSET($AE$1,(ROW()-2)*3+1,))","v":""},{"$f":"IF(AF41=0,\"\",OFFSET($AF$1,(ROW()-2)*3+1,))","v":""},null,null,{"$f":"codecoul(AN2)","v":16777215},null,null,null,null,{"$f":"codecoul(AT2)","v":16777215}]
[null,null,"Année",{"$f":"IF(A14=\"\",0,TEXT(YEAR(A14),\"00\"))","v":"2005"},{"$f":"D16","v":"2005"},{"$f":"MOD(E16,10)","v":5},{"$f":"MOD(ROUNDDOWN(E16/1000,0),10)","v":2},{"$f":"MOD(ROUNDDOWN(E16/100,0),10)","v":0},{"$f":"MOD(ROUNDDOWN(E16/10,0),100)","v":0},{"$f":"F16+G16+H16+I16","v":7},7,0,7,null,null,null,null,null,null,null,null,null,null,null,null,null,null,null,null,null,null,"",null,{"$f":"IF(AC44=0,\"\",OFFSET($AC$1,(ROW()-2)*3+1,))","v":""},{"$f":"IF(AD44=0,\"\",OFFSET($AD$1,(ROW()-2)*3+1,))","v":""},{"$f":"IF(AE44=0,\"\",OFFSET($AE$1,(ROW()-2)*3+1,))","v":""},{"$f":"IF(AF44=0,\"\",OFFSET($AF$1,(ROW()-2)*3+1,))","v":""},null,null,"codecoul",null,null,null,null,"codecoul"]
[{"$f":"Datas!F7","v":"2010-05-05"},null,"Jour",{"$f":"IF(A17=\"\",0,TEXT(DAY(A17),\"00\"))","v":"05"},{"$f":"MOD(SUMPRODUCT(--MID(TEXT(A17,\"jjmmaaaa\"),ROW($1:$8),1))-1,9)+1","v":4},null,{"$f":"D17","v":"05"},{"$f":"MOD(G17,10)","v":5},{"$f":"ROUNDDOWN(G17/10,0)","v":0},{"$f":"H17+I17","v":5},5,0,5,{"$f":"MOD(SUM(M17:M19),10)","v":3},{"$f":"ROUNDDOWN(SUM(M17:M19)/10,0)","v":1},{"$f":"N17+O17","v":4},{"$f":"MOD(SUM(P17:P19),10)","v":4},{"$f":"ROUNDDOWN(SUM(P17:P19)/10,0)","v":0},{"$f":"Q17+R17","v":4},null,{"$f":"Datas!C7","v":"Pierre"},{"$f":"Datas!D7","v":"David"},{"$f":"Datas!E7","v":"01:01:00"},null,1,{"$f":"TEXT(MINUTE($W17),\"00\")","v":"01"},{"$f":"IF(Y17>Z17,$U$1,IF(Z17>Y17,$V$1,IF(Y17=Z17,\"DRAW\")))","v":"Z"},null,{"$f":"INDIRECT(\"A\"&ROW())","v":"2010-05-05"},{"$f":"U17","v":"Pierre"},{"$f":"V17","v":"David"},4,null,{"$f":"IF(AC47=0,\"\",OFFSET($AC$1,(ROW()-2)*3+1,))","v":""},{"$f":"IF(AD47=0,\"\",OFFSET($AD$1,(ROW()-2)*3+1,))","v":""},{"$f":"IF(AE47=0,\"\",OFFSET($AE$1,(ROW()-2)*3+1,))","v":""},{"$f":"IF(AF47=0,\"\",OFFSET($AF$1,(ROW()-2)*3+1,))","v":""}]
[null,null,"Mois",{"$f":"IF(A17=\"\",0,TEXT(MONTH(A17),\"00\"))","v":"05"},null,null,{"$f":"D18","v":"05"},{"$f":"MOD(G18,10)","v":5},{"$f":"ROUNDDOWN(G18/10,0)","v":0},{"$f":"H18+I18","v":5},5,0,5,null,null,null,null,null,null,null,null,null,null,null,null,null,null,null,null,null,null,"",null,{"$f":"IF(AC50=0,\"\",OFFSET($AC$1,(ROW()-2)*3+1,))","v":""},{"$f":"IF(AD50=0,\"\",OFFSET($AD$1,(ROW()-2)*3+1,))","v":""},{"$f":"IF(AE50=0,\"\",OFFSET($AE$1,(ROW()-2)*3+1,))","v":""},{"$f":"IF(AF50=0,\"\",OFFSET($AF$1,(ROW()-2)*3+1,))","v":""}]
[null,null,"Année",{"$f":"IF(A17=\"\",0,TEXT(YEAR(A17),\"00\"))","v":"2010"},{"$f":"D19","v":"2010"},{"$f":"MOD(E19,10)","v":0},{"$f":"MOD(ROUNDDOWN(E19/1000,0),10)","v":2},{"$f":"MOD(ROUNDDOWN(E19/100,0),10)","v":0},{"$f":"MOD(ROUNDDOWN(E19/10,0),100)","v":1},{"$f":"F19+G19+H19+I19","v":3},3,0,3,null,null,null,null,null,null,null,null,null,null,null,null,null,null,null,null,null,null,"",null,{"$f":"IF(AC53=0,\"\",OFFSET($AC$1,(ROW()-2)*3+1,))","v":""},{"$f":"IF(AD53=0,\"\",OFFSET($AD$1,(ROW()-2)*3+1,))","v":""},{"$f":"IF(AE53=0,\"\",OFFSET($AE$1,(ROW()-2)*3+1,))","v":""},{"$f":"IF(AF53=0,\"\",OFFSET($AF$1,(ROW()-2)*3+1,))","v":""}]
[{"$f":"Datas!F8","v":"2010-05-05"},null,"Jour",{"$f":"IF(A20=\"\",0,TEXT(DAY(A20),\"00\"))","v":"05"},{"$f":"MOD(SUMPRODUCT(--MID(TEXT(A20,\"jjmmaaaa\"),ROW($1:$8),1))-1,9)+1","v":4},null,{"$f":"D20","v":"05"},{"$f":"MOD(G20,10)","v":5},{"$f":"ROUNDDOWN(G20/10,0)","v":0},{"$f":"H20+I20","v":5},5,0,5,{"$f":"MOD(SUM(M20:M22),10)","v":3},{"$f":"ROUNDDOWN(SUM(M20:M22)/10,0)","v":1},{"$f":"N20+O20","v":4},{"$f":"MOD(SUM(P20:P22),10)","v":4},{"$f":"ROUNDDOWN(SUM(P20:P22)/10,0)","v":0},{"$f":"Q20+R20","v":4},null,{"$f":"Datas!C8","v":"Pierre"},{"$f":"Datas!D8","v":"David"},{"$f":"Datas!E8","v":"01:01:00"},null,{"$f":"TEXT(HOUR(W20),\"00\")","v":"01"},{"$f":"TEXT(MINUTE($W20),\"00\")","v":"01"},{"$f":"IF(Y20>Z20,$U$1,IF(Z20>Y20,$V$1,IF(Y20=Z20,\"DRAW\")))","v":"DRAW"},null,{"$f":"INDIRECT(\"A\"&ROW())","v":"2010-05-05"},{"$f":"U20","v":"Pierre"},{"$f":"V20","v":"David"},4,null,{"$f":"IF(AC56=0,\"\",OFFSET($AC$1,(ROW()-2)*3+1,))","v":""},{"$f":"IF(AD56=0,\"\",OFFSET($AD$1,(ROW()-2)*3+1,))","v":""},{"$f":"IF(AE56=0,\"\",OFFSET($AE$1,(ROW()-2)*3+1,))","v":""},{"$f":"IF(AF56=0,\"\",OFFSET($AF$1,(ROW()-2)*3+1,))","v":""}]
[null,null,"Mois",{"$f":"IF(A20=\"\",0,TEXT(MONTH(A20),\"00\"))","v":"05"},null,null,{"$f":"D21","v":"05"},{"$f":"MOD(G21,10)","v":5},{"$f":"ROUNDDOWN(G21/10,0)","v":0},{"$f":"H21+I21","v":5},5,0,5,null,null,null,null,null,null,null,null,null,null,null,null,null,null,null,null,null,null,"",null,{"$f":"IF(AC59=0,\"\",OFFSET($AC$1,(ROW()-2)*3+1,))","v":""},{"$f":"IF(AD59=0,\"\",OFFSET($AD$1,(ROW()-2)*3+1,))","v":""},{"$f":"IF(AE59=0,\"\",OFFSET($AE$1,(ROW()-2)*3+1,))","v":""},{"$f":"IF(AF59=0,\"\",OFFSET($AF$1,(ROW()-2)*3+1,))","v":""}]
[null,null,"Année",{"$f":"IF(A20=\"\",0,TEXT(YEAR(A20),\"00\"))","v":"2010"},{"$f":"D22","v":"2010"},{"$f":"MOD(E22,10)","v":0},{"$f":"MOD(ROUNDDOWN(E22/1000,0),10)","v":2},{"$f":"MOD(ROUNDDOWN(E22/100,0),10)","v":0},{"$f":"MOD(ROUNDDOWN(E22/10,0),100)","v":1},{"$f":"F22+G22+H22+I22","v":3},3,0,3,null,null,null,null,null,null,null,null,null,null,null,null,null,null,null,null,null,null,"",null,{"$f":"IF(AC62=0,\"\",OFFSET($AC$1,(ROW()-2)*3+1,))","v":""},{"$f":"IF(AD62=0,\"\",OFFSET($AD$1,(ROW()-2)*3+1,))","v":""},{"$f":"IF(AE62=0,\"\",OFFSET($AE$1,(ROW()-2)*3+1,))","v":""},{"$f":"IF(AF62=0,\"\",OFFSET($AF$1,(ROW()-2)*3+1,))","v":""}]
[{"$f":"Datas!F9","v":"2008-09-14"},null,"Jour",{"$f":"IF(A23=\"\",0,TEXT(DAY(A23),\"00\"))","v":"14"},{"$f":"MOD(SUMPRODUCT(--MID(TEXT(A23,\"jjmmaaaa\"),ROW($1:$8),1))-1,9)+1","v":6},null,{"$f":"D23","v":"14"},{"$f":"MOD(G23,10)","v":4},{"$f":"ROUNDDOWN(G23/10,0)","v":1},{"$f":"H23+I23","v":5},5,0,5,{"$f":"MOD(SUM(M23:M25),10)","v":5},{"$f":"ROUNDDOWN(SUM(M23:M25)/10,0)","v":1},{"$f":"N23+O23","v":6},{"$f":"MOD(SUM(P23:P25),10)","v":6},{"$f":"ROUNDDOWN(SUM(P23:P25)/10,0)","v":0},{"$f":"Q23+R23","v":6},null,{"$f":"Datas!C9","v":"Pierre"},{"$f":"Datas!D9","v":"David"},{"$f":"Datas!E9","v":"05:01:00"},null,{"$f":"TEXT(HOUR(W23),\"00\")","v":"05"},{"$f":"TEXT(MINUTE($W23),\"00\")","v":"01"},{"$f":"IF(Y23>Z23,$U$1,IF(Z23>Y23,$V$1,IF(Y23=Z23,\"DRAW\")))","v":"X"},null,{"$f":"INDIRECT(\"A\"&ROW())","v":"2008-09-14"},{"$f":"U23","v":"Pierre"},{"$f":"V23","v":"David"},6,null,{"$f":"IF(AC65=0,\"\",OFFSET($AC$1,(ROW()-2)*3+1,))","v":""},{"$f":"IF(AD65=0,\"\",OFFSET($AD$1,(ROW()-2)*3+1,))","v":""},{"$f":"IF(AE65=0,\"\",OFFSET($AE$1,(ROW()-2)*3+1,))","v":""},{"$f":"IF(AF65=0,\"\",OFFSET($AF$1,(ROW()-2)*3+1,))","v":""}]
[null,null,"Mois",{"$f":"IF(A23=\"\",0,TEXT(MONTH(A23),\"00\"))","v":"09"},null,null,{"$f":"D24","v":"09"},{"$f":"MOD(G24,10)","v":9},{"$f":"ROUNDDOWN(G24/10,0)","v":0},{"$f":"H24+I24","v":9},9,0,9,null,null,null,null,null,null,null,null,null,null,null,null,null,null,null,null,null,null,"",null,{"$f":"IF(AC68=0,\"\",OFFSET($AC$1,(ROW()-2)*3+1,))","v":""},{"$f":"IF(AD68=0,\"\",OFFSET($AD$1,(ROW()-2)*3+1,))","v":""},{"$f":"IF(AE68=0,\"\",OFFSET($AE$1,(ROW()-2)*3+1,))","v":""},{"$f":"IF(AF68=0,\"\",OFFSET($AF$1,(ROW()-2)*3+1,))","v":""}]
[null,null,"Année",{"$f":"IF(A23=\"\",0,TEXT(YEAR(A23),\"00\"))","v":"2008"},{"$f":"D25","v":"2008"},{"$f":"MOD(E25,10)","v":8},{"$f":"MOD(ROUNDDOWN(E25/1000,0),10)","v":2},{"$f":"MOD(ROUNDDOWN(E25/100,0),10)","v":0},{"$f":"MOD(ROUNDDOWN(E25/10,0),100)","v":0},{"$f":"F25+G25+H25+I25","v":10},0,1,1,null,null,null,null,null,null,null,null,null,null,null,null,null,null,null,null,null,null,"",null,{"$f":"IF(AC71=0,\"\",OFFSET($AC$1,(ROW()-2)*3+1,))","v":""},{"$f":"IF(AD71=0,\"\",OFFSET($AD$1,(ROW()-2)*3+1,))","v":""},{"$f":"IF(AE71=0,\"\",OFFSET($AE$1,(ROW()-2)*3+1,))","v":""},{"$f":"IF(AF71=0,\"\",OFFSET($AF$1,(ROW()-2)*3+1,))","v":""}]
[{"$f":"Datas!F10","v":"2012-10-28"},null,"Jour",{"$f":"IF(A26=\"\",0,TEXT(DAY(A26),\"00\"))","v":"28"},{"$f":"MOD(SUMPRODUCT(--MID(TEXT(A26,\"jjmmaaaa\"),ROW($1:$8),1))-1,9)+1","v":7},null,{"$f":"D26","v":"28"},{"$f":"MOD(G26,10)","v":8},{"$f":"ROUNDDOWN(G26/10,0)","v":2},{"$f":"H26+I26","v":10},0,1,1,{"$f":"MOD(SUM(M26:M28),10)","v":7},{"$f":"ROUNDDOWN(SUM(M26:M28)/10,0)","v":0},{"$f":"N26+O26","v":7},{"$f":"MOD(SUM(P26:P28),10)","v":7},{"$f":"ROUNDDOWN(SUM(P26:P28)/10,0)","v":0},{"$f":"Q26+R26","v":7},null,{"$f":"Datas!C10","v":"Pierre"},{"$f":"Datas!D10","v":"David"},{"$f":"Datas!E10","v":"02:03:00"},null,{"$f":"TEXT(HOUR(W26),\"00\")","v":"02"},{"$f":"TEXT(MINUTE($W26),\"00\")","v":"03"},{"$f":"IF(Y26>Z26,$U$1,IF(Z26>Y26,$V$1,IF(Y26=Z26,\"DRAW\")))","v":"Z"},null,{"$f":"INDIRECT(\"A\"&ROW())","v":"2012-10-28"},{"$f":"U26","v":"Pierre"},{"$f":"V26","v":"David"},7,null,{"$f":"IF(AC74=0,\"\",OFFSET($AC$1,(ROW()-2)*3+1,))","v":""},{"$f":"IF(AD74=0,\"\",OFFSET($AD$1,(ROW()-2)*3+1,))","v":""},{"$f":"IF(AE74=0,\"\",OFFSET($AE$1,(ROW()-2)*3+1,))","v":""},{"$f":"IF(AF74=0,\"\",OFFSET($AF$1,(ROW()-2)*3+1,))","v":""}]
[null,null,"Mois",{"$f":"IF(A26=\"\",0,TEXT(MONTH(A26),\"00\"))","v":"10"},null,null,{"$f":"D27","v":"10"},{"$f":"MOD(G27,10)","v":0},{"$f":"ROUNDDOWN(G27/10,0)","v":1},{"$f":"H27+I27","v":1},1,0,1,null,null,null,null,null,null,null,null,null,null,null,null,null,null,null,null,null,null,"",null,{"$f":"IF(AC77=0,\"\",OFFSET($AC$1,(ROW()-2)*3+1,))","v":""},{"$f":"IF(AD77=0,\"\",OFFSET($AD$1,(ROW()-2)*3+1,))","v":""},{"$f":"IF(AE77=0,\"\",OFFSET($AE$1,(ROW()-2)*3+1,))","v":""},{"$f":"IF(AF77=0,\"\",OFFSET($AF$1,(ROW()-2)*3+1,))","v":""}]
[null,null,"Année",{"$f":"IF(A26=\"\",0,TEXT(YEAR(A26),\"00\"))","v":"2012"},{"$f":"D28","v":"2012"},{"$f":"MOD(E28,10)","v":2},{"$f":"MOD(ROUNDDOWN(E28/1000,0),10)","v":2},{"$f":"MOD(ROUNDDOWN(E28/100,0),10)","v":0},{"$f":"MOD(ROUNDDOWN(E28/10,0),100)","v":1},{"$f":"F28+G28+H28+I28","v":5},5,0,5,null,null,null,null,null,null,null,null,null,null,null,null,null,null,null,null,null,null,"",null,{"$f":"IF(AC80=0,\"\",OFFSET($AC$1,(ROW()-2)*3+1,))","v":""},{"$f":"IF(AD80=0,\"\",OFFSET($AD$1,(ROW()-2)*3+1,))","v":""},{"$f":"IF(AE80=0,\"\",OFFSET($AE$1,(ROW()-2)*3+1,))","v":""},{"$f":"IF(AF80=0,\"\",OFFSET($AF$1,(ROW()-2)*3+1,))","v":""}]
[{"$f":"Datas!F11","v":"2014-10-18"},null,"Jour",{"$f":"IF(A29=\"\",0,TEXT(DAY(A29),\"00\"))","v":"18"},{"$f":"MOD(SUMPRODUCT(--MID(TEXT(A29,\"jjmmaaaa\"),ROW($1:$8),1))-1,9)+1","v":8},null,{"$f":"D29","v":"18"},{"$f":"MOD(G29,10)","v":8},{"$f":"ROUNDDOWN(G29/10,0)","v":1},{"$f":"H29+I29","v":9},9,0,9,{"$f":"MOD(SUM(M29:M31),10)","v":7},{"$f":"ROUNDDOWN(SUM(M29:M31)/10,0)","v":1},{"$f":"N29+O29","v":8},{"$f":"MOD(SUM(P29:P31),10)","v":8},{"$f":"ROUNDDOWN(SUM(P29:P31)/10,0)","v":0},{"$f":"Q29+R29","v":8},null,{"$f":"Datas!C11","v":"Pierre"},{"$f":"Datas!D11","v":"David"},{"$f":"Datas!E11","v":"00:03:00"},null,{"$f":"TEXT(HOUR(W29),\"00\")","v":"00"},{"$f":"TEXT(MINUTE($W29),\"00\")","v":"03"},{"$f":"IF(Y29>Z29,$U$1,IF(Z29>Y29,$V$1,IF(Y29=Z29,\"DRAW\")))","v":"Z"},null,{"$f":"INDIRECT(\"A\"&ROW())","v":"2014-10-18"},{"$f":"U29","v":"Pierre"},{"$f":"V29","v":"David"},8,null,{"$f":"IF(AC83=0,\"\",OFFSET($AC$1,(ROW()-2)*3+1,))","v":""},{"$f":"IF(AD83=0,\"\",OFFSET($AD$1,(ROW()-2)*3+1,))","v":""},{"$f":"IF(AE83=0,\"\",OFFSET($AE$1,(ROW()-2)*3+1,))","v":""},{"$f":"IF(AF83=0,\"\",OFFSET($AF$1,(ROW()-2)*3+1,))","v":""}]
[null,null,"Mois",{"$f":"IF(A29=\"\",0,TEXT(MONTH(A29),\"00\"))","v":"10"},null,null,{"$f":"D30","v":"10"},{"$f":"MOD(G30,10)","v":0},{"$f":"ROUNDDOWN(G30/10,0)","v":1},{"$f":"H30+I30","v":1},1,0,1,null,null,null,null,null,null,null,null,null,null,null,null,null,null,null,null,null,null,"",null,{"$f":"IF(AC86=0,\"\",OFFSET($AC$1,(ROW()-2)*3+1,))","v":""},{"$f":"IF(AD86=0,\"\",OFFSET($AD$1,(ROW()-2)*3+1,))","v":""},{"$f":"IF(AE86=0,\"\",OFFSET($AE$1,(ROW()-2)*3+1,))","v":""},{"$f":"IF(AF86=0,\"\",OFFSET($AF$1,(ROW()-2)*3+1,))","v":""}]
[null,null,"Année",{"$f":"IF(A29=\"\",0,TEXT(YEAR(A29),\"00\"))","v":"2014"},{"$f":"D31","v":"2014"},{"$f":"MOD(E31,10)","v":4},{"$f":"MOD(ROUNDDOWN(E31/1000,0),10)","v":2},{"$f":"MOD(ROUNDDOWN(E31/100,0),10)","v":0},{"$f":"MOD(ROUNDDOWN(E31/10,0),100)","v":1},{"$f":"F31+G31+H31+I31","v":7},7,0,7,null,null,null,null,null,null,null,null,null,null,null,null,null,null,null,null,null,null,"",null,{"$f":"IF(AC89=0,\"\",OFFSET($AC$1,(ROW()-2)*3+1,))","v":""},{"$f":"IF(AD89=0,\"\",OFFSET($AD$1,(ROW()-2)*3+1,))","v":""},{"$f":"IF(AE89=0,\"\",OFFSET($AE$1,(ROW()-2)*3+1,))","v":""},{"$f":"IF(AF89=0,\"\",OFFSET($AF$1,(ROW()-2)*3+1,))","v":""}]
["",null,"Jour",{"$f":"IF(A32=\"\",0,TEXT(DAY(A32),\"00\"))","v":0},{"$f":"MOD(SUMPRODUCT(--MID(TEXT(A32,\"jjmmaaaa\"),ROW($1:$8),1))-1,9)+1","v":{"$error":"#VALUE!"}},null,{"$f":"D32","v":0},{"$f":"MOD(G32,10)","v":0},{"$f":"ROUNDDOWN(G32/10,0)","v":0},{"$f":"H32+I32","v":0},0,0,0,{"$f":"MOD(SUM(M32:M34),10)","v":0},{"$f":"ROUNDDOWN(SUM(M32:M34)/10,0)","v":0},{"$f":"N32+O32","v":0},{"$f":"MOD(SUM(P32:P34),10)","v":0},{"$f":"ROUNDDOWN(SUM(P32:P34)/10,0)","v":0},{"$f":"Q32+R32","v":0},null,0,0,{"$f":"Datas!E32","v":"00:00:00"},null,{"$f":"TEXT(HOUR(W32),\"00\")","v":"00"},{"$f":"TEXT(MINUTE($W32),\"00\")","v":"00"},{"$f":"IF(Y32>Z32,$U$1,IF(Z32>Y32,$V$1,IF(Y32=Z32,\"DRAW\")))","v":"DRAW"},null,{"$f":"INDIRECT(\"A\"&ROW())","v":""},{"$f":"U32","v":0},{"$f":"V32","v":0},"",null,{"$f":"IF(AC92=0,\"\",OFFSET($AC$1,(ROW()-2)*3+1,))","v":""},{"$f":"IF(AD92=0,\"\",OFFSET($AD$1,(ROW()-2)*3+1,))","v":""},{"$f":"IF(AE92=0,\"\",OFFSET($AE$1,(ROW()-2)*3+1,))","v":""},{"$f":"IF(AF92=0,\"\",OFFSET($AF$1,(ROW()-2)*3+1,))","v":""}]
[null,null,"Mois",{"$f":"IF(A32=\"\",0,TEXT(MONTH(A32),\"00\"))","v":0},null,null,{"$f":"D33","v":0},{"$f":"MOD(G33,10)","v":0},{"$f":"ROUNDDOWN(G33/10,0)","v":0},{"$f":"H33+I33","v":0},0,0,0,null,null,null,null,null,null,null,null,null,null,null,null,null,null,null,null,null,null,"",null,{"$f":"IF(AC95=0,\"\",OFFSET($AC$1,(ROW()-2)*3+1,))","v":""},{"$f":"IF(AD95=0,\"\",OFFSET($AD$1,(ROW()-2)*3+1,))","v":""},{"$f":"IF(AE95=0,\"\",OFFSET($AE$1,(ROW()-2)*3+1,))","v":""},{"$f":"IF(AF95=0,\"\",OFFSET($AF$1,(ROW()-2)*3+1,))","v":""}]
[null,null,"Année",{"$f":"IF(A32=\"\",0,TEXT(YEAR(A32),\"00\"))","v":0},{"$f":"D34","v":0},{"$f":"MOD(E34,10)","v":0},{"$f":"MOD(ROUNDDOWN(E34/1000,0),10)","v":0},{"$f":"MOD(ROUNDDOWN(E34/100,0),10)","v":0},{"$f":"MOD(ROUNDDOWN(E34/10,0),100)","v":0},{"$f":"F34+G34+H34+I34","v":0},0,0,0,null,null,null,null,null,null,null,null,null,null,null,null,null,null,null,null,null,null,"",null,{"$f":"IF(AC98=0,\"\",OFFSET($AC$1,(ROW()-2)*3+1,))","v":""},{"$f":"IF(AD98=0,\"\",OFFSET($AD$1,(ROW()-2)*3+1,))","v":""},{"$f":"IF(AE98=0,\"\",OFFSET($AE$1,(ROW()-2)*3+1,))","v":""},{"$f":"IF(AF98=0,\"\",OFFSET($AF$1,(ROW()-2)*3+1,))","v":""}]
["",null,"Jour",{"$f":"IF(A35=\"\",0,TEXT(DAY(A35),\"00\"))","v":0},null,null,{"$f":"D35","v":0},{"$f":"MOD(G35,10)","v":0},{"$f":"ROUNDDOWN(G35/10,0)","v":0},{"$f":"H35+I35","v":0},0,0,0,{"$f":"MOD(SUM(M35:M37),10)","v":0},{"$f":"ROUNDDOWN(SUM(M35:M37)/10,0)","v":0},{"$f":"N35+O35","v":0},{"$f":"MOD(SUM(P35:P37),10)","v":0},{"$f":"ROUNDDOWN(SUM(P35:P37)/10,0)","v":0},{"$f":"Q35+R35","v":0},null,0,0,{"$f":"Datas!E35","v":"00:00:00"},null,{"$f":"TEXT(HOUR(W35),\"00\")","v":"00"},{"$f":"TEXT(MINUTE($W35),\"00\")","v":"00"},{"$f":"IF(Y35>Z35,$U$1,IF(Z35>Y35,$V$1,IF(Y35=Z35,\"DRAW\")))","v":"DRAW"},null,{"$f":"INDIRECT(\"A\"&ROW())","v":""},{"$f":"U35","v":0},{"$f":"V35","v":0},"",null,{"$f":"IF(AC101=0,\"\",OFFSET($AC$1,(ROW()-2)*3+1,))","v":""},{"$f":"IF(AD101=0,\"\",OFFSET($AD$1,(ROW()-2)*3+1,))","v":""},{"$f":"IF(AE101=0,\"\",OFFSET($AE$1,(ROW()-2)*3+1,))","v":""},{"$f":"IF(AF101=0,\"\",OFFSET($AF$1,(ROW()-2)*3+1,))","v":""}]
[null,null,"Mois",{"$f":"IF(A35=\"\",0,TEXT(MONTH(A35),\"00\"))","v":0},null,null,{"$f":"D36","v":0},{"$f":"MOD(G36,10)","v":0},{"$f":"ROUNDDOWN(G36/10,0)","v":0},{"$f":"H36+I36","v":0},0,0,0,null,null,null,null,null,null,null,null,null,null,null,null,null,null,null,null,null,null,"",null,{"$f":"IF(AC104=0,\"\",OFFSET($AC$1,(ROW()-2)*3+1,))","v":""},{"$f":"IF(AD104=0,\"\",OFFSET($AD$1,(ROW()-2)*3+1,))","v":""},{"$f":"IF(AE104=0,\"\",OFFSET($AE$1,(ROW()-2)*3+1,))","v":""},{"$f":"IF(AF104=0,\"\",OFFSET($AF$1,(ROW()-2)*3+1,))","v":""}]
[null,null,"Année",{"$f":"IF(A35=\"\",0,TEXT(YEAR(A35),\"00\"))","v":0},{"$f":"D37","v":0},{"$f":"MOD(E37,10)","v":0},{"$f":"MOD(ROUNDDOWN(E37/1000,0),10)","v":0},{"$f":"MOD(ROUNDDOWN(E37/100,0),10)","v":0},{"$f":"MOD(ROUNDDOWN(E37/10,0),100)","v":0},{"$f":"F37+G37+H37+I37","v":0},0,0,0,null,null,null,null,null,null,null,null,null,null,null,null,null,null,null,null,null,null,"",null,{"$f":"IF(AC107=0,\"\",OFFSET($AC$1,(ROW()-2)*3+1,))","v":""},{"$f":"IF(AD107=0,\"\",OFFSET($AD$1,(ROW()-2)*3+1,))","v":""},{"$f":"IF(AE107=0,\"\",OFFSET($AE$1,(ROW()-2)*3+1,))","v":""},{"$f":"IF(AF107=0,\"\",OFFSET($AF$1,(ROW()-2)*3+1,))","v":""}]
["",null,"Jour",{"$f":"IF(A38=\"\",0,TEXT(DAY(A38),\"00\"))","v":0},null,null,{"$f":"D38","v":0},{"$f":"MOD(G38,10)","v":0},{"$f":"ROUNDDOWN(G38/10,0)","v":0},{"$f":"H38+I38","v":0},0,0,0,{"$f":"MOD(SUM(M38:M40),10)","v":0},{"$f":"ROUNDDOWN(SUM(M38:M40)/10,0)","v":0},{"$f":"N38+O38","v":0},{"$f":"MOD(SUM(P38:P40),10)","v":0},{"$f":"ROUNDDOWN(SUM(P38:P40)/10,0)","v":0},{"$f":"Q38+R38","v":0},null,0,0,"00:00:00",null,{"$f":"TEXT(HOUR(W38),\"00\")","v":"00"},{"$f":"TEXT(MINUTE($W38),\"00\")","v":"00"},{"$f":"IF(Y38>Z38,$U$1,IF(Z38>Y38,$V$1,IF(Y38=Z38,\"DRAW\")))","v":"DRAW"},null,{"$f":"INDIRECT(\"A\"&ROW())","v":""},{"$f":"U38","v":0},{"$f":"V38","v":0},"",null,{"$f":"IF(AC110=0,\"\",OFFSET($AC$1,(ROW()-2)*3+1,))","v":""},{"$f":"IF(AD110=0,\"\",OFFSET($AD$1,(ROW()-2)*3+1,))","v":""},{"$f":"IF(AE110=0,\"\",OFFSET($AE$1,(ROW()-2)*3+1,))","v":""},{"$f":"IF(AF110=0,\"\",OFFSET($AF$1,(ROW()-2)*3+1,))","v":""}]
[null,null,"Mois",{"$f":"IF(A38=\"\",0,TEXT(MONTH(A38),\"00\"))","v":0},null,null,{"$f":"D39","v":0},{"$f":"MOD(G39,10)","v":0},{"$f":"ROUNDDOWN(G39/10,0)","v":0},{"$f":"H39+I39","v":0},0,0,0,null,null,null,null,null,null,null,null,null,null,null,null,null,null,null,null,null,null,"",null,{"$f":"IF(AC113=0,\"\",OFFSET($AC$1,(ROW()-2)*3+1,))","v":""},{"$f":"IF(AD113=0,\"\",OFFSET($AD$1,(ROW()-2)*3+1,))","v":""},{"$f":"IF(AE113=0,\"\",OFFSET($AE$1,(ROW()-2)*3+1,))","v":""},{"$f":"IF(AF113=0,\"\",OFFSET($AF$1,(ROW()-2)*3+1,))","v":""}]
[null,null,"Année",{"$f":"IF(A38=\"\",0,TEXT(YEAR(A38),\"00\"))","v":0},{"$f":"D40","v":0},{"$f":"MOD(E40,10)","v":0},{"$f":"MOD(ROUNDDOWN(E40/1000,0),10)","v":0},{"$f":"MOD(ROUNDDOWN(E40/100,0),10)","v":0},{"$f":"MOD(ROUNDDOWN(E40/10,0),100)","v":0},{"$f":"F40+G40+H40+I40","v":0},0,0,0,null,null,null,null,null,null,null,null,null,null,null,null,null,null,null,null,null,null,"",null,{"$f":"IF(AC116=0,\"\",OFFSET($AC$1,(ROW()-2)*3+1,))","v":""},{"$f":"IF(AD116=0,\"\",OFFSET($AD$1,(ROW()-2)*3+1,))","v":""},{"$f":"IF(AE116=0,\"\",OFFSET($AE$1,(ROW()-2)*3+1,))","v":""},{"$f":"IF(AF116=0,\"\",OFFSET($AF$1,(ROW()-2)*3+1,))","v":""}]
["",null,"Jour",{"$f":"IF(A41=\"\",0,TEXT(DAY(A41),\"00\"))","v":0},null,null,{"$f":"D41","v":0},{"$f":"MOD(G41,10)","v":0},{"$f":"ROUNDDOWN(G41/10,0)","v":0},{"$f":"H41+I41","v":0},0,0,0,{"$f":"MOD(SUM(M41:M43),10)","v":0},{"$f":"ROUNDDOWN(SUM(M41:M43)/10,0)","v":0},{"$f":"N41+O41","v":0},{"$f":"MOD(SUM(P41:P43),10)","v":0},{"$f":"ROUNDDOWN(SUM(P41:P43)/10,0)","v":0},{"$f":"Q41+R41","v":0},null,0,0,"00:00:00",null,{"$f":"TEXT(HOUR(W41),\"00\")","v":"00"},{"$f":"TEXT(MINUTE($W41),\"00\")","v":"00"},{"$f":"IF(Y41>Z41,$U$1,IF(Z41>Y41,$V$1,IF(Y41=Z41,\"DRAW\")))","v":"DRAW"},null,{"$f":"INDIRECT(\"A\"&ROW())","v":""},{"$f":"U41","v":0},{"$f":"V41","v":0},"",null,{"$f":"IF(AC119=0,\"\",OFFSET($AC$1,(ROW()-2)*3+1,))","v":""},{"$f":"IF(AD119=0,\"\",OFFSET($AD$1,(ROW()-2)*3+1,))","v":""},{"$f":"IF(AE119=0,\"\",OFFSET($AE$1,(ROW()-2)*3+1,))","v":""},{"$f":"IF(AF119=0,\"\",OFFSET($AF$1,(ROW()-2)*3+1,))","v":""}]
[null,null,"Mois",{"$f":"IF(A41=\"\",0,TEXT(MONTH(A41),\"00\"))","v":0},null,null,{"$f":"D42","v":0},{"$f":"MOD(G42,10)","v":0},{"$f":"ROUNDDOWN(G42/10,0)","v":0},{"$f":"H42+I42","v":0},0,0,0,null,null,null,null,null,null,null,null,null,null,null,null,null,null,null,null,null,null,""]
[null,null,"Année",{"$f":"IF(A41=\"\",0,TEXT(YEAR(A41),\"00\"))","v":0},{"$f":"D43","v":0},{"$f":"MOD(E43,10)","v":0},{"$f":"MOD(ROUNDDOWN(E43/1000,0),10)","v":0},{"$f":"MOD(ROUNDDOWN(E43/100,0),10)","v":0},{"$f":"MOD(ROUNDDOWN(E43/10,0),100)","v":0},{"$f":"F43+G43+H43+I43","v":0},0,0,0,null,null,null,null,null,null,null,null,null,null,null,null,null,null,null,null,null,null,""]
["",null,"Jour",{"$f":"IF(A44=\"\",0,TEXT(DAY(A44),\"00\"))","v":0},null,null,{"$f":"D44","v":0},{"$f":"MOD(G44,10)","v":0},{"$f":"ROUNDDOWN(G44/10,0)","v":0},{"$f":"H44+I44","v":0},0,0,0,{"$f":"MOD(SUM(M44:M46),10)","v":0},{"$f":"ROUNDDOWN(SUM(M44:M46)/10,0)","v":0},{"$f":"N44+O44","v":0},{"$f":"MOD(SUM(P44:P46),10)","v":0},{"$f":"ROUNDDOWN(SUM(P44:P46)/10,0)","v":0},{"$f":"Q44+R44","v":0},null,0,0,"00:00:00",null,{"$f":"TEXT(HOUR(W44),\"00\")","v":"00"},{"$f":"TEXT(MINUTE($W44),\"00\")","v":"00"},{"$f":"IF(Y44>Z44,$U$1,IF(Z44>Y44,$V$1,IF(Y44=Z44,\"DRAW\")))","v":"DRAW"},null,{"$f":"INDIRECT(\"A\"&ROW())","v":""},{"$f":"U44","v":0},{"$f":"V44","v":0},""]
[null,null,"Mois",{"$f":"IF(A44=\"\",0,TEXT(MONTH(A44),\"00\"))","v":0},null,null,{"$f":"D45","v":0},{"$f":"MOD(G45,10)","v":0},{"$f":"ROUNDDOWN(G45/10,0)","v":0},{"$f":"H45+I45","v":0},0,0,0,null,null,null,null,null,null,null,null,null,null,null,null,null,null,null,null,null,null,""]
[null,null,"Année",{"$f":"IF(A44=\"\",0,TEXT(YEAR(A44),\"00\"))","v":0},{"$f":"D46","v":0},{"$f":"MOD(E46,10)","v":0},{"$f":"MOD(ROUNDDOWN(E46/1000,0),10)","v":0},{"$f":"MOD(ROUNDDOWN(E46/100,0),10)","v":0},{"$f":"MOD(ROUNDDOWN(E46/10,0),100)","v":0},{"$f":"F46+G46+H46+I46","v":0},0,0,0,null,null,null,null,null,null,null,null,null,null,null,null,null,null,null,null,null,null,""]
["",null,"Jour",{"$f":"IF(A47=\"\",0,TEXT(DAY(A47),\"00\"))","v":0},null,null,{"$f":"D47","v":0},{"$f":"MOD(G47,10)","v":0},{"$f":"ROUNDDOWN(G47/10,0)","v":0},{"$f":"H47+I47","v":0},0,0,0,{"$f":"MOD(SUM(M47:M49),10)","v":0},{"$f":"ROUNDDOWN(SUM(M47:M49)/10,0)","v":0},{"$f":"N47+O47","v":0},{"$f":"MOD(SUM(P47:P49),10)","v":0},{"$f":"ROUNDDOWN(SUM(P47:P49)/10,0)","v":0},{"$f":"Q47+R47","v":0},null,0,0,"00:00:00",null,{"$f":"TEXT(HOUR(W47),\"00\")","v":"00"},{"$f":"TEXT(MINUTE($W47),\"00\")","v":"00"},{"$f":"IF(Y47>Z47,$U$1,IF(Z47>Y47,$V$1,IF(Y47=Z47,\"DRAW\")))","v":"DRAW"},null,{"$f":"INDIRECT(\"A\"&ROW())","v":""},{"$f":"U47","v":0},{"$f":"V47","v":0},""]
[null,null,"Mois",{"$f":"IF(A47=\"\",0,TEXT(MONTH(A47),\"00\"))","v":0},null,null,{"$f":"D48","v":0},{"$f":"MOD(G48,10)","v":0},{"$f":"ROUNDDOWN(G48/10,0)","v":0},{"$f":"H48+I48","v":0},0,0,0,null,null,null,null,null,null,null,null,null,null,null,null,null,null,null,null,null,null,""]
[null,null,"Année",{"$f":"IF(A47=\"\",0,TEXT(YEAR(A47),\"00\"))","v":0},{"$f":"D49","v":0},{"$f":"MOD(E49,10)","v":0},{"$f":"MOD(ROUNDDOWN(E49/1000,0),10)","v":0},{"$f":"MOD(ROUNDDOWN(E49/100,0),10)","v":0},{"$f":"MOD(ROUNDDOWN(E49/10,0),100)","v":0},{"$f":"F49+G49+H49+I49","v":0},0,0,0,null,null,null,null,null,null,null,null,null,null,null,null,null,null,null,null,null,null,""]
["",null,"Jour",{"$f":"IF(A50=\"\",0,TEXT(DAY(A50),\"00\"))","v":0},null,null,{"$f":"D50","v":0},{"$f":"MOD(G50,10)","v":0},{"$f":"ROUNDDOWN(G50/10,0)","v":0},{"$f":"H50+I50","v":0},0,0,0,{"$f":"MOD(SUM(M50:M52),10)","v":0},{"$f":"ROUNDDOWN(SUM(M50:M52)/10,0)","v":0},{"$f":"N50+O50","v":0},{"$f":"MOD(SUM(P50:P52),10)","v":0},{"$f":"ROUNDDOWN(SUM(P50:P52)/10,0)","v":0},{"$f":"Q50+R50","v":0},null,0,0,"00:00:00",null,{"$f":"TEXT(HOUR(W50),\"00\")","v":"00"},{"$f":"TEXT(MINUTE($W50),\"00\")","v":"00"},{"$f":"IF(Y50>Z50,$U$1,IF(Z50>Y50,$V$1,IF(Y50=Z50,\"DRAW\")))","v":"DRAW"},null,{"$f":"INDIRECT(\"A\"&ROW())","v":""},{"$f":"U50","v":0},{"$f":"V50","v":0},""]
[null,null,"Mois",{"$f":"IF(A50=\"\",0,TEXT(MONTH(A50),\"00\"))","v":0},null,null,{"$f":"D51","v":0},{"$f":"MOD(G51,10)","v":0},{"$f":"ROUNDDOWN(G51/10,0)","v":0},{"$f":"H51+I51","v":0},0,0,0,null,null,null,null,null,null,null,null,null,null,null,null,null,null,null,null,null,null,""]
[null,null,"Année",{"$f":"IF(A50=\"\",0,TEXT(YEAR(A50),\"00\"))","v":0},{"$f":"D52","v":0},{"$f":"MOD(E52,10)","v":0},{"$f":"MOD(ROUNDDOWN(E52/1000,0),10)","v":0},{"$f":"MOD(ROUNDDOWN(E52/100,0),10)","v":0},{"$f":"MOD(ROUNDDOWN(E52/10,0),100)","v":0},{"$f":"F52+G52+H52+I52","v":0},0,0,0,null,null,null,null,null,null,null,null,null,null,null,null,null,null,null,null,null,null,""]
["",null,"Jour",{"$f":"IF(A53=\"\",0,TEXT(DAY(A53),\"00\"))","v":0},null,null,{"$f":"D53","v":0},{"$f":"MOD(G53,10)","v":0},{"$f":"ROUNDDOWN(G53/10,0)","v":0},{"$f":"H53+I53","v":0},0,0,0,{"$f":"MOD(SUM(M53:M55),10)","v":0},{"$f":"ROUNDDOWN(SUM(M53:M55)/10,0)","v":0},{"$f":"N53+O53","v":0},{"$f":"MOD(SUM(P53:P55),10)","v":0},{"$f":"ROUNDDOWN(SUM(P53:P55)/10,0)","v":0},{"$f":"Q53+R53","v":0},null,0,0,"00:00:00",null,{"$f":"TEXT(HOUR(W53),\"00\")","v":"00"},{"$f":"TEXT(MINUTE($W53),\"00\")","v":"00"},{"$f":"IF(Y53>Z53,$U$1,IF(Z53>Y53,$V$1,IF(Y53=Z53,\"DRAW\")))","v":"DRAW"},null,{"$f":"INDIRECT(\"A\"&ROW())","v":""},{"$f":"U53","v":0},{"$f":"V53","v":0},""]
[null,null,"Mois",{"$f":"IF(A53=\"\",0,TEXT(MONTH(A53),\"00\"))","v":0},null,null,{"$f":"D54","v":0},{"$f":"MOD(G54,10)","v":0},{"$f":"ROUNDDOWN(G54/10,0)","v":0},{"$f":"H54+I54","v":0},0,0,0,null,null,null,null,null,null,null,null,null,null,null,null,null,null,null,null,null,null,""]
[null,null,"Année",{"$f":"IF(A53=\"\",0,TEXT(YEAR(A53),\"00\"))","v":0},{"$f":"D55","v":0},{"$f":"MOD(E55,10)","v":0},{"$f":"MOD(ROUNDDOWN(E55/1000,0),10)","v":0},{"$f":"MOD(ROUNDDOWN(E55/100,0),10)","v":0},{"$f":"MOD(ROUNDDOWN(E55/10,0),100)","v":0},{"$f":"F55+G55+H55+I55","v":0},0,0,0,null,null,null,null,null,null,null,null,null,null,null,null,null,null,null,null,null,null,""]
["",null,"Jour",{"$f":"IF(A56=\"\",0,TEXT(DAY(A56),\"00\"))","v":0},null,null,{"$f":"D56","v":0},{"$f":"MOD(G56,10)","v":0},{"$f":"ROUNDDOWN(G56/10,0)","v":0},{"$f":"H56+I56","v":0},0,0,0,{"$f":"MOD(SUM(M56:M58),10)","v":0},{"$f":"ROUNDDOWN(SUM(M56:M58)/10,0)","v":0},{"$f":"N56+O56","v":0},{"$f":"MOD(SUM(P56:P58),10)","v":0},{"$f":"ROUNDDOWN(SUM(P56:P58)/10,0)","v":0},{"$f":"Q56+R56","v":0},null,0,0,"00:00:00",null,{"$f":"TEXT(HOUR(W56),\"00\")","v":"00"},{"$f":"TEXT(MINUTE($W56),\"00\")","v":"00"},{"$f":"IF(Y56>Z56,$U$1,IF(Z56>Y56,$V$1,IF(Y56=Z56,\"DRAW\")))","v":"DRAW"},null,{"$f":"INDIRECT(\"A\"&ROW())","v":""},{"$f":"U56","v":0},{"$f":"V56","v":0},""]
[null,null,"Mois",{"$f":"IF(A56=\"\",0,TEXT(MONTH(A56),\"00\"))","v":0},null,null,{"$f":"D57","v":0},{"$f":"MOD(G57,10)","v":0},{"$f":"ROUNDDOWN(G57/10,0)","v":0},{"$f":"H57+I57","v":0},0,0,0,null,null,null,null,null,null,null,null,null,null,null,null,null,null,null,null,null,null,""]
[null,null,"Année",{"$f":"IF(A56=\"\",0,TEXT(YEAR(A56),\"00\"))","v":0},{"$f":"D58","v":0},{"$f":"MOD(E58,10)","v":0},{"$f":"MOD(ROUNDDOWN(E58/1000,0),10)","v":0},{"$f":"MOD(ROUNDDOWN(E58/100,0),10)","v":0},{"$f":"MOD(ROUNDDOWN(E58/10,0),100)","v":0},{"$f":"F58+G58+H58+I58","v":0},0,0,0,null,null,null,null,null,null,null,null,null,null,null,null,null,null,null,null,null,null,""]
["",null,"Jour",{"$f":"IF(A59=\"\",0,TEXT(DAY(A59),\"00\"))","v":0},null,null,{"$f":"D59","v":0},{"$f":"MOD(G59,10)","v":0},{"$f":"ROUNDDOWN(G59/10,0)","v":0},{"$f":"H59+I59","v":0},0,0,0,{"$f":"MOD(SUM(M59:M61),10)","v":0},{"$f":"ROUNDDOWN(SUM(M59:M61)/10,0)","v":0},{"$f":"N59+O59","v":0},{"$f":"MOD(SUM(P59:P61),10)","v":0},{"$f":"ROUNDDOWN(SUM(P59:P61)/10,0)","v":0},{"$f":"Q59+R59","v":0},null,0,0,"00:00:00",null,{"$f":"TEXT(HOUR(W59),\"00\")","v":"00"},{"$f":"TEXT(MINUTE($W59),\"00\")","v":"00"},{"$f":"IF(Y59>Z59,$U$1,IF(Z59>Y59,$V$1,IF(Y59=Z59,\"DRAW\")))","v":"DRAW"},null,{"$f":"INDIRECT(\"A\"&ROW())","v":""},{"$f":"U59","v":0},{"$f":"V59","v":0},""]
[null,null,"Mois",{"$f":"IF(A59=\"\",0,TEXT(MONTH(A59),\"00\"))","v":0},null,null,{"$f":"D60","v":0},{"$f":"MOD(G60,10)","v":0},{"$f":"ROUNDDOWN(G60/10,0)","v":0},{"$f":"H60+I60","v":0},0,0,0,null,null,null,null,null,null,null,null,null,null,null,null,null,null,null,null,null,null,""]
[null,null,"Année",{"$f":"IF(A59=\"\",0,TEXT(YEAR(A59),\"00\"))","v":0},{"$f":"D61","v":0},{"$f":"MOD(E61,10)","v":0},{"$f":"MOD(ROUNDDOWN(E61/1000,0),10)","v":0},{"$f":"MOD(ROUNDDOWN(E61/100,0),10)","v":0},{"$f":"MOD(ROUNDDOWN(E61/10,0),100)","v":0},{"$f":"F61+G61+H61+I61","v":0},0,0,0,null,null,null,null,null,null,null,null,null,null,null,null,null,null,null,null,null,null,""]
["",null,"Jour",{"$f":"IF(A62=\"\",0,TEXT(DAY(A62),\"00\"))","v":0},null,null,{"$f":"D62","v":0},{"$f":"MOD(G62,10)","v":0},{"$f":"ROUNDDOWN(G62/10,0)","v":0},{"$f":"H62+I62","v":0},0,0,0,{"$f":"MOD(SUM(M62:M64),10)","v":0},{"$f":"ROUNDDOWN(SUM(M62:M64)/10,0)","v":0},{"$f":"N62+O62","v":0},{"$f":"MOD(SUM(P62:P64),10)","v":0},{"$f":"ROUNDDOWN(SUM(P62:P64)/10,0)","v":0},{"$f":"Q62+R62","v":0},null,0,0,"00:00:00",null,{"$f":"TEXT(HOUR(W62),\"00\")","v":"00"},{"$f":"TEXT(MINUTE($W62),\"00\")","v":"00"},{"$f":"IF(Y62>Z62,$U$1,IF(Z62>Y62,$V$1,IF(Y62=Z62,\"DRAW\")))","v":"DRAW"},null,{"$f":"INDIRECT(\"A\"&ROW())","v":""},{"$f":"U62","v":0},{"$f":"V62","v":0},""]
[null,null,"Mois",{"$f":"IF(A62=\"\",0,TEXT(MONTH(A62),\"00\"))","v":0},null,null,{"$f":"D63","v":0},{"$f":"MOD(G63,10)","v":0},{"$f":"ROUNDDOWN(G63/10,0)","v":0},{"$f":"H63+I63","v":0},0,0,0,null,null,null,null,null,null,null,null,null,null,null,null,null,null,null,null,null,null,""]
[null,null,"Année",{"$f":"IF(A62=\"\",0,TEXT(YEAR(A62),\"00\"))","v":0},{"$f":"D64","v":0},{"$f":"MOD(E64,10)","v":0},{"$f":"MOD(ROUNDDOWN(E64/1000,0),10)","v":0},{"$f":"MOD(ROUNDDOWN(E64/100,0),10)","v":0},{"$f":"MOD(ROUNDDOWN(E64/10,0),100)","v":0},{"$f":"F64+G64+H64+I64","v":0},0,0,0,null,null,null,null,null,null,null,null,null,null,null,null,null,null,null,null,null,null,""]
["",null,"Jour",{"$f":"IF(A65=\"\",0,TEXT(DAY(A65),\"00\"))","v":0},null,null,{"$f":"D65","v":0},{"$f":"MOD(G65,10)","v":0},{"$f":"ROUNDDOWN(G65/10,0)","v":0},{"$f":"H65+I65","v":0},0,0,0,{"$f":"MOD(SUM(M65:M67),10)","v":0},{"$f":"ROUNDDOWN(SUM(M65:M67)/10,0)","v":0},{"$f":"N65+O65","v":0},{"$f":"MOD(SUM(P65:P67),10)","v":0},{"$f":"ROUNDDOWN(SUM(P65:P67)/10,0)","v":0},{"$f":"Q65+R65","v":0},null,0,0,"00:00:00",null,{"$f":"TEXT(HOUR(W65),\"00\")","v":"00"},{"$f":"TEXT(MINUTE($W65),\"00\")","v":"00"},{"$f":"IF(Y65>Z65,$U$1,IF(Z65>Y65,$V$1,IF(Y65=Z65,\"DRAW\")))","v":"DRAW"},null,{"$f":"INDIRECT(\"A\"&ROW())","v":""},{"$f":"U65","v":0},{"$f":"V65","v":0},""]
[null,null,"Mois",{"$f":"IF(A65=\"\",0,TEXT(MONTH(A65),\"00\"))","v":0},null,null,{"$f":"D66","v":0},{"$f":"MOD(G66,10)","v":0},{"$f":"ROUNDDOWN(G66/10,0)","v":0},{"$f":"H66+I66","v":0},{"$f":"MOD(J66,10)","v":0},{"$f":"ROUNDDOWN(J66/10,0)","v":0},{"$f":"K66+L66","v":0},null,null,null,null,null,null,null,null,null,null,null,null,null,null,null,null,null,null,""]
[null,null,"Année",{"$f":"IF(A65=\"\",0,TEXT(YEAR(A65),\"00\"))","v":0},{"$f":"D67","v":0},{"$f":"MOD(E67,10)","v":0},{"$f":"MOD(ROUNDDOWN(E67/1000,0),10)","v":0},{"$f":"MOD(ROUNDDOWN(E67/100,0),10)","v":0},{"$f":"MOD(ROUNDDOWN(E67/10,0),100)","v":0},{"$f":"F67+G67+H67+I67","v":0},0,0,0,null,null,null,null,null,null,null,null,null,null,null,null,null,null,null,null,null,null,{"$f":"IF(AD67=0,\"\",S67)","v":""}]
["",null,"Jour",{"$f":"IF(A68=\"\",0,TEXT(DAY(A68),\"00\"))","v":0},null,null,{"$f":"D68","v":0},{"$f":"MOD(G68,10)","v":0},{"$f":"ROUNDDOWN(G68/10,0)","v":0},{"$f":"H68+I68","v":0},0,0,0,{"$f":"MOD(SUM(M68:M70),10)","v":0},{"$f":"ROUNDDOWN(SUM(M68:M70)/10,0)","v":0},{"$f":"N68+O68","v":0},{"$f":"MOD(SUM(P68:P70),10)","v":0},{"$f":"ROUNDDOWN(SUM(P68:P70)/10,0)","v":0},{"$f":"Q68+R68","v":0},null,0,0,"00:00:00",null,{"$f":"TEXT(HOUR(W68),\"00\")","v":"00"},{"$f":"TEXT(MINUTE($W68),\"00\")","v":"00"},{"$f":"IF(Y68>Z68,$U$1,IF(Z68>Y68,$V$1,IF(Y68=Z68,\"DRAW\")))","v":"DRAW"},null,{"$f":"INDIRECT(\"A\"&ROW())","v":""},{"$f":"U68","v":0},{"$f":"V68","v":0},""]
[null,null,"Mois",{"$f":"IF(A68=\"\",0,TEXT(MONTH(A68),\"00\"))","v":0},null,null,{"$f":"D69","v":0},{"$f":"MOD(G69,10)","v":0},{"$f":"ROUNDDOWN(G69/10,0)","v":0},{"$f":"H69+I69","v":0},0,0,0,null,null,null,null,null,null,null,null,null,null,null,null,null,null,null,null,null,null,""]
[null,null,"Année",{"$f":"IF(A68=\"\",0,TEXT(YEAR(A68),\"00\"))","v":0},{"$f":"D70","v":0},{"$f":"MOD(E70,10)","v":0},{"$f":"MOD(ROUNDDOWN(E70/1000,0),10)","v":0},{"$f":"MOD(ROUNDDOWN(E70/100,0),10)","v":0},{"$f":"MOD(ROUNDDOWN(E70/10,0),100)","v":0},{"$f":"F70+G70+H70+I70","v":0},0,0,0,null,null,null,null,null,null,null,null,null,null,null,null,null,null,null,null,null,null,""]
["",null,"Jour",{"$f":"IF(A71=\"\",0,TEXT(DAY(A71),\"00\"))","v":0},null,null,{"$f":"D71","v":0},{"$f":"MOD(G71,10)","v":0},{"$f":"ROUNDDOWN(G71/10,0)","v":0},{"$f":"H71+I71","v":0},0,0,0,{"$f":"MOD(SUM(M71:M73),10)","v":0},{"$f":"ROUNDDOWN(SUM(M71:M73)/10,0)","v":0},{"$f":"N71+O71","v":0},{"$f":"MOD(SUM(P71:P73),10)","v":0},{"$f":"ROUNDDOWN(SUM(P71:P73)/10,0)","v":0},{"$f":"Q71+R71","v":0},null,0,0,"00:00:00",null,{"$f":"TEXT(HOUR(W71),\"00\")","v":"00"},{"$f":"TEXT(MINUTE($W71),\"00\")","v":"00"},{"$f":"IF(Y71>Z71,$U$1,IF(Z71>Y71,$V$1,IF(Y71=Z71,\"DRAW\")))","v":"DRAW"},null,{"$f":"INDIRECT(\"A\"&ROW())","v":""},{"$f":"U71","v":0},{"$f":"V71","v":0},""]
[null,null,"Mois",{"$f":"IF(A71=\"\",0,TEXT(MONTH(A71),\"00\"))","v":0},null,null,{"$f":"D72","v":0},{"$f":"MOD(G72,10)","v":0},{"$f":"ROUNDDOWN(G72/10,0)","v":0},{"$f":"H72+I72","v":0},0,0,0,null,null,null,null,null,null,null,null,null,null,null,null,null,null,null,null,null,null,""]
[null,null,"Année",{"$f":"IF(A71=\"\",0,TEXT(YEAR(A71),\"00\"))","v":0},{"$f":"D73","v":0},{"$f":"MOD(E73,10)","v":0},{"$f":"MOD(ROUNDDOWN(E73/1000,0),10)","v":0},{"$f":"MOD(ROUNDDOWN(E73/100,0),10)","v":0},{"$f":"MOD(ROUNDDOWN(E73/10,0),100)","v":0},{"$f":"F73+G73+H73+I73","v":0},0,0,0,null,null,null,null,null,null,null,null,null,null,null,null,null,null,null,null,null,null,""]
["",null,"Jour",{"$f":"IF(A74=\"\",0,TEXT(DAY(A74),\"00\"))","v":0},null,null,{"$f":"D74","v":0},{"$f":"MOD(G74,10)","v":0},{"$f":"ROUNDDOWN(G74/10,0)","v":0},{"$f":"H74+I74","v":0},0,0,0,{"$f":"MOD(SUM(M74:M76),10)","v":0},{"$f":"ROUNDDOWN(SUM(M74:M76)/10,0)","v":0},{"$f":"N74+O74","v":0},{"$f":"MOD(SUM(P74:P76),10)","v":0},{"$f":"ROUNDDOWN(SUM(P74:P76)/10,0)","v":0},{"$f":"Q74+R74","v":0},null,0,0,"00:00:00",null,{"$f":"TEXT(HOUR(W74),\"00\")","v":"00"},{"$f":"TEXT(MINUTE($W74),\"00\")","v":"00"},{"$f":"IF(Y74>Z74,$U$1,IF(Z74>Y74,$V$1,IF(Y74=Z74,\"DRAW\")))","v":"DRAW"},null,{"$f":"INDIRECT(\"A\"&ROW())","v":""},{"$f":"U74","v":0},{"$f":"V74","v":0},""]
[null,null,"Mois",{"$f":"IF(A74=\"\",0,TEXT(MONTH(A74),\"00\"))","v":0},null,null,{"$f":"D75","v":0},{"$f":"MOD(G75,10)","v":0},{"$f":"ROUNDDOWN(G75/10,0)","v":0},{"$f":"H75+I75","v":0},0,0,0,null,null,null,null,null,null,null,null,null,null,null,null,null,null,null,null,null,null,""]
[null,null,"Année",{"$f":"IF(A74=\"\",0,TEXT(YEAR(A74),\"00\"))","v":0},{"$f":"D76","v":0},{"$f":"MOD(E76,10)","v":0},{"$f":"MOD(ROUNDDOWN(E76/1000,0),10)","v":0},{"$f":"MOD(ROUNDDOWN(E76/100,0),10)","v":0},{"$f":"MOD(ROUNDDOWN(E76/10,0),100)","v":0},{"$f":"F76+G76+H76+I76","v":0},0,0,0,null,null,null,null,null,null,null,null,null,null,null,null,null,null,null,null,null,null,""]
["",null,"Jour",{"$f":"IF(A77=\"\",0,TEXT(DAY(A77),\"00\"))","v":0},null,null,{"$f":"D77","v":0},{"$f":"MOD(G77,10)","v":0},{"$f":"ROUNDDOWN(G77/10,0)","v":0},{"$f":"H77+I77","v":0},0,0,0,{"$f":"MOD(SUM(M77:M79),10)","v":0},{"$f":"ROUNDDOWN(SUM(M77:M79)/10,0)","v":0},{"$f":"N77+O77","v":0},{"$f":"MOD(SUM(P77:P79),10)","v":0},{"$f":"ROUNDDOWN(SUM(P77:P79)/10,0)","v":0},{"$f":"Q77+R77","v":0},null,0,0,"00:00:00",null,{"$f":"TEXT(HOUR(W77),\"00\")","v":"00"},{"$f":"TEXT(MINUTE($W77),\"00\")","v":"00"},{"$f":"IF(Y77>Z77,$U$1,IF(Z77>Y77,$V$1,IF(Y77=Z77,\"DRAW\")))","v":"DRAW"},null,{"$f":"INDIRECT(\"A\"&ROW())","v":""},{"$f":"U77","v":0},{"$f":"V77","v":0},""]
[null,null,"Mois",{"$f":"IF(A77=\"\",0,TEXT(MONTH(A77),\"00\"))","v":0},null,null,{"$f":"D78","v":0},{"$f":"MOD(G78,10)","v":0},{"$f":"ROUNDDOWN(G78/10,0)","v":0},{"$f":"H78+I78","v":0},0,0,0,null,null,null,null,null,null,null,null,null,null,null,null,null,null,null,null,null,null,""]
[null,null,"Année",{"$f":"IF(A77=\"\",0,TEXT(YEAR(A77),\"00\"))","v":0},{"$f":"D79","v":0},{"$f":"MOD(E79,10)","v":0},{"$f":"MOD(ROUNDDOWN(E79/1000,0),10)","v":0},{"$f":"MOD(ROUNDDOWN(E79/100,0),10)","v":0},{"$f":"MOD(ROUNDDOWN(E79/10,0),100)","v":0},{"$f":"F79+G79+H79+I79","v":0},0,0,0,null,null,null,null,null,null,null,null,null,null,null,null,null,null,null,null,null,null,""]
["",null,"Jour",{"$f":"IF(A80=\"\",0,TEXT(DAY(A80),\"00\"))","v":0},null,null,{"$f":"D80","v":0},{"$f":"MOD(G80,10)","v":0},{"$f":"ROUNDDOWN(G80/10,0)","v":0},{"$f":"H80+I80","v":0},0,0,0,{"$f":"MOD(SUM(M80:M82),10)","v":0},{"$f":"ROUNDDOWN(SUM(M80:M82)/10,0)","v":0},{"$f":"N80+O80","v":0},{"$f":"MOD(SUM(P80:P82),10)","v":0},{"$f":"ROUNDDOWN(SUM(P80:P82)/10,0)","v":0},{"$f":"Q80+R80","v":0},null,0,0,"00:00:00",null,{"$f":"TEXT(HOUR(W80),\"00\")","v":"00"},{"$f":"TEXT(MINUTE($W80),\"00\")","v":"00"},{"$f":"IF(Y80>Z80,$U$1,IF(Z80>Y80,$V$1,IF(Y80=Z80,\"DRAW\")))","v":"DRAW"},null,{"$f":"INDIRECT(\"A\"&ROW())","v":""},{"$f":"U80","v":0},{"$f":"V80","v":0},""]
[null,null,"Mois",{"$f":"IF(A80=\"\",0,TEXT(MONTH(A80),\"00\"))","v":0},null,null,{"$f":"D81","v":0},{"$f":"MOD(G81,10)","v":0},{"$f":"ROUNDDOWN(G81/10,0)","v":0},{"$f":"H81+I81","v":0},0,0,0,null,null,null,null,null,null,null,null,null,null,null,null,null,null,null,null,null,null,""]
[null,null,"Année",{"$f":"IF(A80=\"\",0,TEXT(YEAR(A80),\"00\"))","v":0},{"$f":"D82","v":0},{"$f":"MOD(E82,10)","v":0},{"$f":"MOD(ROUNDDOWN(E82/1000,0),10)","v":0},{"$f":"MOD(ROUNDDOWN(E82/100,0),10)","v":0},{"$f":"MOD(ROUNDDOWN(E82/10,0),100)","v":0},{"$f":"F82+G82+H82+I82","v":0},0,0,0,null,null,null,null,null,null,null,null,null,null,null,null,null,null,null,null,null,null,""]
["",null,"Jour",{"$f":"IF(A83=\"\",0,TEXT(DAY(A83),\"00\"))","v":0},null,null,{"$f":"D83","v":0},{"$f":"MOD(G83,10)","v":0},{"$f":"ROUNDDOWN(G83/10,0)","v":0},{"$f":"H83+I83","v":0},0,0,0,{"$f":"MOD(SUM(M83:M85),10)","v":0},{"$f":"ROUNDDOWN(SUM(M83:M85)/10,0)","v":0},{"$f":"N83+O83","v":0},{"$f":"MOD(SUM(P83:P85),10)","v":0},{"$f":"ROUNDDOWN(SUM(P83:P85)/10,0)","v":0},{"$f":"Q83+R83","v":0},null,0,0,"00:00:00",null,{"$f":"TEXT(HOUR(W83),\"00\")","v":"00"},{"$f":"TEXT(MINUTE($W83),\"00\")","v":"00"},{"$f":"IF(Y83>Z83,$U$1,IF(Z83>Y83,$V$1,IF(Y83=Z83,\"DRAW\")))","v":"DRAW"},null,{"$f":"INDIRECT(\"A\"&ROW())","v":""},{"$f":"U83","v":0},{"$f":"V83","v":0},""]
[null,null,"Mois",{"$f":"IF(A83=\"\",0,TEXT(MONTH(A83),\"00\"))","v":0},null,null,{"$f":"D84","v":0},{"$f":"MOD(G84,10)","v":0},{"$f":"ROUNDDOWN(G84/10,0)","v":0},{"$f":"H84+I84","v":0},0,0,0,null,null,null,null,null,null,null,null,null,null,null,null,null,null,null,null,null,null,""]
[null,null,"Année",{"$f":"IF(A83=\"\",0,TEXT(YEAR(A83),\"00\"))","v":0},{"$f":"D85","v":0},{"$f":"MOD(E85,10)","v":0},{"$f":"MOD(ROUNDDOWN(E85/1000,0),10)","v":0},{"$f":"MOD(ROUNDDOWN(E85/100,0),10)","v":0},{"$f":"MOD(ROUNDDOWN(E85/10,0),100)","v":0},{"$f":"F85+G85+H85+I85","v":0},0,0,0,null,null,null,null,null,null,null,null,null,null,null,null,null,null,null,null,null,null,""]
["",null,"Jour",{"$f":"IF(A86=\"\",0,TEXT(DAY(A86),\"00\"))","v":0},null,null,{"$f":"D86","v":0},{"$f":"MOD(G86,10)","v":0},{"$f":"ROUNDDOWN(G86/10,0)","v":0},{"$f":"H86+I86","v":0},0,0,0,{"$f":"MOD(SUM(M86:M88),10)","v":0},{"$f":"ROUNDDOWN(SUM(M86:M88)/10,0)","v":0},{"$f":"N86+O86","v":0},{"$f":"MOD(SUM(P86:P88),10)","v":0},{"$f":"ROUNDDOWN(SUM(P86:P88)/10,0)","v":0},{"$f":"Q86+R86","v":0},null,0,0,"00:00:00",null,{"$f":"TEXT(HOUR(W86),\"00\")","v":"00"},{"$f":"TEXT(MINUTE($W86),\"00\")","v":"00"},{"$f":"IF(Y86>Z86,$U$1,IF(Z86>Y86,$V$1,IF(Y86=Z86,\"DRAW\")))","v":"DRAW"},null,{"$f":"INDIRECT(\"A\"&ROW())","v":""},{"$f":"U86","v":0},{"$f":"V86","v":0},""]
[null,null,"Mois",{"$f":"IF(A86=\"\",0,TEXT(MONTH(A86),\"00\"))","v":0},null,null,{"$f":"D87","v":0},{"$f":"MOD(G87,10)","v":0},{"$f":"ROUNDDOWN(G87/10,0)","v":0},{"$f":"H87+I87","v":0},0,0,0,null,null,null,null,null,null,null,null,null,null,null,null,null,null,null,null,null,null,""]
[null,null,"Année",{"$f":"IF(A86=\"\",0,TEXT(YEAR(A86),\"00\"))","v":0},{"$f":"D88","v":0},{"$f":"MOD(E88,10)","v":0},{"$f":"MOD(ROUNDDOWN(E88/1000,0),10)","v":0},{"$f":"MOD(ROUNDDOWN(E88/100,0),10)","v":0},{"$f":"MOD(ROUNDDOWN(E88/10,0),100)","v":0},{"$f":"F88+G88+H88+I88","v":0},0,0,0,null,null,null,null,null,null,null,null,null,null,null,null,null,null,null,null,null,null,""]
["",null,"Jour",{"$f":"IF(A89=\"\",0,TEXT(DAY(A89),\"00\"))","v":0},null,null,{"$f":"D89","v":0},{"$f":"MOD(G89,10)","v":0},{"$f":"ROUNDDOWN(G89/10,0)","v":0},{"$f":"H89+I89","v":0},0,0,0,{"$f":"MOD(SUM(M89:M91),10)","v":0},{"$f":"ROUNDDOWN(SUM(M89:M91)/10,0)","v":0},{"$f":"N89+O89","v":0},{"$f":"MOD(SUM(P89:P91),10)","v":0},{"$f":"ROUNDDOWN(SUM(P89:P91)/10,0)","v":0},{"$f":"Q89+R89","v":0},null,0,0,"00:00:00",null,{"$f":"TEXT(HOUR(W89),\"00\")","v":"00"},{"$f":"TEXT(MINUTE($W89),\"00\")","v":"00"},{"$f":"IF(Y89>Z89,$U$1,IF(Z89>Y89,$V$1,IF(Y89=Z89,\"DRAW\")))","v":"DRAW"},null,{"$f":"INDIRECT(\"A\"&ROW())","v":""},{"$f":"U89","v":0},{"$f":"V89","v":0},""]
[null,null,"Mois",{"$f":"IF(A89=\"\",0,TEXT(MONTH(A89),\"00\"))","v":0},null,null,{"$f":"D90","v":0},{"$f":"MOD(G90,10)","v":0},{"$f":"ROUNDDOWN(G90/10,0)","v":0},{"$f":"H90+I90","v":0},0,0,0,null,null,null,null,null,null,null,null,null,null,null,null,null,null,null,null,null,null,""]
[null,null,"Année",{"$f":"IF(A89=\"\",0,TEXT(YEAR(A89),\"00\"))","v":0},{"$f":"D91","v":0},{"$f":"MOD(E91,10)","v":0},{"$f":"MOD(ROUNDDOWN(E91/1000,0),10)","v":0},{"$f":"MOD(ROUNDDOWN(E91/100,0),10)","v":0},{"$f":"MOD(ROUNDDOWN(E91/10,0),100)","v":0},{"$f":"F91+G91+H91+I91","v":0},0,0,0,null,null,null,null,null,null,null,null,null,null,null,null,null,null,null,null,null,null,""]
["",null,"Jour",{"$f":"IF(A92=\"\",0,TEXT(DAY(A92),\"00\"))","v":0},null,null,{"$f":"D92","v":0},{"$f":"MOD(G92,10)","v":0},{"$f":"ROUNDDOWN(G92/10,0)","v":0},{"$f":"H92+I92","v":0},0,0,0,{"$f":"MOD(SUM(M92:M94),10)","v":0},{"$f":"ROUNDDOWN(SUM(M92:M94)/10,0)","v":0},{"$f":"N92+O92","v":0},{"$f":"MOD(SUM(P92:P94),10)","v":0},{"$f":"ROUNDDOWN(SUM(P92:P94)/10,0)","v":0},{"$f":"Q92+R92","v":0},null,0,0,"00:00:00",null,{"$f":"TEXT(HOUR(W92),\"00\")","v":"00"},{"$f":"TEXT(MINUTE($W92),\"00\")","v":"00"},{"$f":"IF(Y92>Z92,$U$1,IF(Z92>Y92,$V$1,IF(Y92=Z92,\"DRAW\")))","v":"DRAW"},null,{"$f":"INDIRECT(\"A\"&ROW())","v":""},{"$f":"U92","v":0},{"$f":"V92","v":0},""]
[null,null,"Mois",{"$f":"IF(A92=\"\",0,TEXT(MONTH(A92),\"00\"))","v":0},null,null,{"$f":"D93","v":0},{"$f":"MOD(G93,10)","v":0},{"$f":"ROUNDDOWN(G93/10,0)","v":0},{"$f":"H93+I93","v":0},0,0,0,null,null,null,null,null,null,null,null,null,null,null,null,null,null,null,null,null,null,""]
[null,null,"Année",{"$f":"IF(A92=\"\",0,TEXT(YEAR(A92),\"00\"))","v":0},{"$f":"D94","v":0},{"$f":"MOD(E94,10)","v":0},{"$f":"MOD(ROUNDDOWN(E94/1000,0),10)","v":0},{"$f":"MOD(ROUNDDOWN(E94/100,0),10)","v":0},{"$f":"MOD(ROUNDDOWN(E94/10,0),100)","v":0},{"$f":"F94+G94+H94+I94","v":0},0,0,0,null,null,null,null,null,null,null,null,null,null,null,null,null,null,null,null,null,null,""]
["",null,"Jour",{"$f":"IF(A95=\"\",0,TEXT(DAY(A95),\"00\"))","v":0},null,null,{"$f":"D95","v":0},{"$f":"MOD(G95,10)","v":0},{"$f":"ROUNDDOWN(G95/10,0)","v":0},{"$f":"H95+I95","v":0},0,0,0,{"$f":"MOD(SUM(M95:M97),10)","v":0},{"$f":"ROUNDDOWN(SUM(M95:M97)/10,0)","v":0},{"$f":"N95+O95","v":0},{"$f":"MOD(SUM(P95:P97),10)","v":0},{"$f":"ROUNDDOWN(SUM(P95:P97)/10,0)","v":0},{"$f":"Q95+R95","v":0},null,0,0,"00:00:00",null,{"$f":"TEXT(HOUR(W95),\"00\")","v":"00"},{"$f":"TEXT(MINUTE($W95),\"00\")","v":"00"},{"$f":"IF(Y95>Z95,$U$1,IF(Z95>Y95,$V$1,IF(Y95=Z95,\"DRAW\")))","v":"DRAW"},null,{"$f":"INDIRECT(\"A\"&ROW())","v":""},{"$f":"U95","v":0},{"$f":"V95","v":0},""]
[null,null,"Mois",{"$f":"IF(A95=\"\",0,TEXT(MONTH(A95),\"00\"))","v":0},null,null,{"$f":"D96","v":0},{"$f":"MOD(G96,10)","v":0},{"$f":"ROUNDDOWN(G96/10,0)","v":0},{"$f":"H96+I96","v":0},0,0,0,null,null,null,null,null,null,null,null,null,null,null,null,null,null,null,null,null,null,""]
[null,null,"Année",{"$f":"IF(A95=\"\",0,TEXT(YEAR(A95),\"00\"))","v":0},{"$f":"D97","v":0},{"$f":"MOD(E97,10)","v":0},{"$f":"MOD(ROUNDDOWN(E97/1000,0),10)","v":0},{"$f":"MOD(ROUNDDOWN(E97/100,0),10)","v":0},{"$f":"MOD(ROUNDDOWN(E97/10,0),100)","v":0},{"$f":"F97+G97+H97+I97","v":0},0,0,0,null,null,null,null,null,null,null,null,null,null,null,null,null,null,null,null,null,null,""]
["",null,"Jour",{"$f":"IF(A98=\"\",0,TEXT(DAY(A98),\"00\"))","v":0},null,null,{"$f":"D98","v":0},{"$f":"MOD(G98,10)","v":0},{"$f":"ROUNDDOWN(G98/10,0)","v":0},{"$f":"H98+I98","v":0},0,0,0,{"$f":"MOD(SUM(M98:M100),10)","v":0},{"$f":"ROUNDDOWN(SUM(M98:M100)/10,0)","v":0},{"$f":"N98+O98","v":0},{"$f":"MOD(SUM(P98:P100),10)","v":0},{"$f":"ROUNDDOWN(SUM(P98:P100)/10,0)","v":0},{"$f":"Q98+R98","v":0},null,0,0,"00:00:00",null,{"$f":"TEXT(HOUR(W98),\"00\")","v":"00"},{"$f":"TEXT(MINUTE($W98),\"00\")","v":"00"},{"$f":"IF(Y98>Z98,$U$1,IF(Z98>Y98,$V$1,IF(Y98=Z98,\"DRAW\")))","v":"DRAW"},null,{"$f":"INDIRECT(\"A\"&ROW())","v":""},{"$f":"U98","v":0},{"$f":"V98","v":0},""]
[null,null,"Mois",{"$f":"IF(A98=\"\",0,TEXT(MONTH(A98),\"00\"))","v":0},null,null,{"$f":"D99","v":0},{"$f":"MOD(G99,10)","v":0},{"$f":"ROUNDDOWN(G99/10,0)","v":0},{"$f":"H99+I99","v":0},0,0,0,null,null,null,null,null,null,null,null,null,null,null,null,null,null,null,null,null,null,""]
[null,null,"Année",{"$f":"IF(A98=\"\",0,TEXT(YEAR(A98),\"00\"))","v":0},{"$f":"D100","v":0},{"$f":"MOD(E100,10)","v":0},{"$f":"MOD(ROUNDDOWN(E100/1000,0),10)","v":0},{"$f":"MOD(ROUNDDOWN(E100/100,0),10)","v":0},{"$f":"MOD(ROUNDDOWN(E100/10,0),100)","v":0},{"$f":"F100+G100+H100+I100","v":0},0,0,0,null,null,null,null,null,null,null,null,null,null,null,null,null,null,null,null,null,null,""]
["",null,"Jour",{"$f":"IF(A101=\"\",0,TEXT(DAY(A101),\"00\"))","v":0},null,null,{"$f":"D101","v":0},{"$f":"MOD(G101,10)","v":0},{"$f":"ROUNDDOWN(G101/10,0)","v":0},{"$f":"H101+I101","v":0},0,0,0,{"$f":"MOD(SUM(M101:M103),10)","v":0},{"$f":"ROUNDDOWN(SUM(M101:M103)/10,0)","v":0},{"$f":"N101+O101","v":0},{"$f":"MOD(SUM(P101:P103),10)","v":0},{"$f":"ROUNDDOWN(SUM(P101:P103)/10,0)","v":0},{"$f":"Q101+R101","v":0},null,0,0,"00:00:00",null,{"$f":"TEXT(HOUR(W101),\"00\")","v":"00"},{"$f":"TEXT(MINUTE($W101),\"00\")","v":"00"},{"$f":"IF(Y101>Z101,$U$1,IF(Z101>Y101,$V$1,IF(Y101=Z101,\"DRAW\")))","v":"DRAW"},null,{"$f":"INDIRECT(\"A\"&ROW())","v":""},{"$f":"U101","v":0},{"$f":"V101","v":0},""]
[null,null,"Mois",{"$f":"IF(A101=\"\",0,TEXT(MONTH(A101),\"00\"))","v":0},null,null,{"$f":"D102","v":0},{"$f":"MOD(G102,10)","v":0},{"$f":"ROUNDDOWN(G102/10,0)","v":0},{"$f":"H102+I102","v":0},0,0,0,null,null,null,null,null,null,null,null,null,null,null,null,null,null,null,null,null,null,""]
[null,null,"Année",{"$f":"IF(A101=\"\",0,TEXT(YEAR(A101),\"00\"))","v":0},{"$f":"D103","v":0},{"$f":"MOD(E103,10)","v":0},{"$f":"MOD(ROUNDDOWN(E103/1000,0),10)","v":0},{"$f":"MOD(ROUNDDOWN(E103/100,0),10)","v":0},{"$f":"MOD(ROUNDDOWN(E103/10,0),100)","v":0},{"$f":"F103+G103+H103+I103","v":0},0,0,0,null,null,null,null,null,null,null,null,null,null,null,null,null,null,null,null,null,null,""]
["",null,"Jour",{"$f":"IF(A104=\"\",0,TEXT(DAY(A104),\"00\"))","v":0},null,null,{"$f":"D104","v":0},{"$f":"MOD(G104,10)","v":0},{"$f":"ROUNDDOWN(G104/10,0)","v":0},{"$f":"H104+I104","v":0},0,0,0,{"$f":"MOD(SUM(M104:M106),10)","v":0},{"$f":"ROUNDDOWN(SUM(M104:M106)/10,0)","v":0},{"$f":"N104+O104","v":0},{"$f":"MOD(SUM(P104:P106),10)","v":0},{"$f":"ROUNDDOWN(SUM(P104:P106)/10,0)","v":0},{"$f":"Q104+R104","v":0},null,0,0,"00:00:00",null,{"$f":"TEXT(HOUR(W104),\"00\")","v":"00"},{"$f":"TEXT(MINUTE($W104),\"00\")","v":"00"},{"$f":"IF(Y104>Z104,$U$1,IF(Z104>Y104,$V$1,IF(Y104=Z104,\"DRAW\")))","v":"DRAW"},null,{"$f":"INDIRECT(\"A\"&ROW())","v":""},{"$f":"U104","v":0},{"$f":"V104","v":0},""]
[null,null,"Mois",{"$f":"IF(A104=\"\",0,TEXT(MONTH(A104),\"00\"))","v":0},null,null,{"$f":"D105","v":0},{"$f":"MOD(G105,10)","v":0},{"$f":"ROUNDDOWN(G105/10,0)","v":0},{"$f":"H105+I105","v":0},0,0,0,null,null,null,null,null,null,null,null,null,null,null,null,null,null,null,null,null,null,""]
[null,null,"Année",{"$f":"IF(A104=\"\",0,TEXT(YEAR(A104),\"00\"))","v":0},{"$f":"D106","v":0},{"$f":"MOD(E106,10)","v":0},{"$f":"MOD(ROUNDDOWN(E106/1000,0),10)","v":0},{"$f":"MOD(ROUNDDOWN(E106/100,0),10)","v":0},{"$f":"MOD(ROUNDDOWN(E106/10,0),100)","v":0},{"$f":"F106+G106+H106+I106","v":0},0,0,0,null,null,null,null,null,null,null,null,null,null,null,null,null,null,null,null,null,null,""]
["",null,"Jour",{"$f":"IF(A107=\"\",0,TEXT(DAY(A107),\"00\"))","v":0},null,null,{"$f":"D107","v":0},{"$f":"MOD(G107,10)","v":0},{"$f":"ROUNDDOWN(G107/10,0)","v":0},{"$f":"H107+I107","v":0},0,0,0,{"$f":"MOD(SUM(M107:M109),10)","v":0},{"$f":"ROUNDDOWN(SUM(M107:M109)/10,0)","v":0},{"$f":"N107+O107","v":0},{"$f":"MOD(SUM(P107:P109),10)","v":0},{"$f":"ROUNDDOWN(SUM(P107:P109)/10,0)","v":0},{"$f":"Q107+R107","v":0},null,0,0,"00:00:00",null,{"$f":"TEXT(HOUR(W107),\"00\")","v":"00"},{"$f":"TEXT(MINUTE($W107),\"00\")","v":"00"},{"$f":"IF(Y107>Z107,$U$1,IF(Z107>Y107,$V$1,IF(Y107=Z107,\"DRAW\")))","v":"DRAW"},null,{"$f":"INDIRECT(\"A\"&ROW())","v":""},{"$f":"U107","v":0},{"$f":"V107","v":0},""]
[null,null,"Mois",{"$f":"IF(A107=\"\",0,TEXT(MONTH(A107),\"00\"))","v":0},null,null,{"$f":"D108","v":0},{"$f":"MOD(G108,10)","v":0},{"$f":"ROUNDDOWN(G108/10,0)","v":0},{"$f":"H108+I108","v":0},0,0,0,null,null,null,null,null,null,null,null,null,null,null,null,null,null,null,null,null,null,""]
[null,null,"Année",{"$f":"IF(A107=\"\",0,TEXT(YEAR(A107),\"00\"))","v":0},{"$f":"D109","v":0},{"$f":"MOD(E109,10)","v":0},{"$f":"MOD(ROUNDDOWN(E109/1000,0),10)","v":0},{"$f":"MOD(ROUNDDOWN(E109/100,0),10)","v":0},{"$f":"MOD(ROUNDDOWN(E109/10,0),100)","v":0},{"$f":"F109+G109+H109+I109","v":0},0,0,0,null,null,null,null,null,null,null,null,null,null,null,null,null,null,null,null,null,null,""]
["",null,"Jour",{"$f":"IF(A110=\"\",0,TEXT(DAY(A110),\"00\"))","v":0},null,null,{"$f":"D110","v":0},{"$f":"MOD(G110,10)","v":0},{"$f":"ROUNDDOWN(G110/10,0)","v":0},{"$f":"H110+I110","v":0},0,0,0,{"$f":"MOD(SUM(M110:M112),10)","v":0},{"$f":"ROUNDDOWN(SUM(M110:M112)/10,0)","v":0},{"$f":"N110+O110","v":0},{"$f":"MOD(SUM(P110:P112),10)","v":0},{"$f":"ROUNDDOWN(SUM(P110:P112)/10,0)","v":0},{"$f":"Q110+R110","v":0},null,0,0,"00:00:00",null,{"$f":"TEXT(HOUR(W110),\"00\")","v":"00"},{"$f":"TEXT(MINUTE($W110),\"00\")","v":"00"},{"$f":"IF(Y110>Z110,$U$1,IF(Z110>Y110,$V$1,IF(Y110=Z110,\"DRAW\")))","v":"DRAW"},null,{"$f":"INDIRECT(\"A\"&ROW())","v":""},{"$f":"U110","v":0},{"$f":"V110","v":0},""]
[null,null,"Mois",{"$f":"IF(A110=\"\",0,TEXT(MONTH(A110),\"00\"))","v":0},null,null,{"$f":"D111","v":0},{"$f":"MOD(G111,10)","v":0},{"$f":"ROUNDDOWN(G111/10,0)","v":0},{"$f":"H111+I111","v":0},0,0,0,null,null,null,null,null,null,null,null,null,null,null,null,null,null,null,null,null,null,""]
[null,null,"Année",{"$f":"IF(A110=\"\",0,TEXT(YEAR(A110),\"00\"))","v":0},{"$f":"D112","v":0},{"$f":"MOD(E112,10)","v":0},{"$f":"MOD(ROUNDDOWN(E112/1000,0),10)","v":0},{"$f":"MOD(ROUNDDOWN(E112/100,0),10)","v":0},{"$f":"MOD(ROUNDDOWN(E112/10,0),100)","v":0},{"$f":"F112+G112+H112+I112","v":0},0,0,0,null,null,null,null,null,null,null,null,null,null,null,null,null,null,null,null,null,null,""]
["",null,"Jour",{"$f":"IF(A113=\"\",0,TEXT(DAY(A113),\"00\"))","v":0},null,null,{"$f":"D113","v":0},{"$f":"MOD(G113,10)","v":0},{"$f":"ROUNDDOWN(G113/10,0)","v":0},{"$f":"H113+I113","v":0},0,0,0,{"$f":"MOD(SUM(M113:M115),10)","v":0},{"$f":"ROUNDDOWN(SUM(M113:M115)/10,0)","v":0},{"$f":"N113+O113","v":0},{"$f":"MOD(SUM(P113:P115),10)","v":0},{"$f":"ROUNDDOWN(SUM(P113:P115)/10,0)","v":0},{"$f":"Q113+R113","v":0},null,0,0,"00:00:00",null,{"$f":"TEXT(HOUR(W113),\"00\")","v":"00"},{"$f":"TEXT(MINUTE($W113),\"00\")","v":"00"},{"$f":"IF(Y113>Z113,$U$1,IF(Z113>Y113,$V$1,IF(Y113=Z113,\"DRAW\")))","v":"DRAW"},null,{"$f":"INDIRECT(\"A\"&ROW())","v":""},{"$f":"U113","v":0},{"$f":"V113","v":0},""]
[null,null,"Mois",{"$f":"IF(A113=\"\",0,TEXT(MONTH(A113),\"00\"))","v":0},null,null,{"$f":"D114","v":0},{"$f":"MOD(G114,10)","v":0},{"$f":"ROUNDDOWN(G114/10,0)","v":0},{"$f":"H114+I114","v":0},0,0,0,null,null,null,null,null,null,null,null,null,null,null,null,null,null,null,null,null,null,""]
[null,null,"Année",{"$f":"IF(A113=\"\",0,TEXT(YEAR(A113),\"00\"))","v":0},{"$f":"D115","v":0},{"$f":"MOD(E115,10)","v":0},{"$f":"MOD(ROUNDDOWN(E115/1000,0),10)","v":0},{"$f":"MOD(ROUNDDOWN(E115/100,0),10)","v":0},{"$f":"MOD(ROUNDDOWN(E115/10,0),100)","v":0},{"$f":"F115+G115+H115+I115","v":0},0,0,0,null,null,null,null,null,null,null,null,null,null,null,null,null,null,null,null,null,null,""]
["",null,"Jour",{"$f":"IF(A116=\"\",0,TEXT(DAY(A116),\"00\"))","v":0},null,null,{"$f":"D116","v":0},{"$f":"MOD(G116,10)","v":0},{"$f":"ROUNDDOWN(G116/10,0)","v":0},{"$f":"H116+I116","v":0},0,0,0,{"$f":"MOD(SUM(M116:M118),10)","v":0},{"$f":"ROUNDDOWN(SUM(M116:M118)/10,0)","v":0},{"$f":"N116+O116","v":0},{"$f":"MOD(SUM(P116:P118),10)","v":0},{"$f":"ROUNDDOWN(SUM(P116:P118)/10,0)","v":0},{"$f":"Q116+R116","v":0},null,0,0,"00:00:00",null,{"$f":"TEXT(HOUR(W116),\"00\")","v":"00"},{"$f":"TEXT(MINUTE($W116),\"00\")","v":"00"},{"$f":"IF(Y116>Z116,$U$1,IF(Z116>Y116,$V$1,IF(Y116=Z116,\"DRAW\")))","v":"DRAW"},null,{"$f":"INDIRECT(\"A\"&ROW())","v":""},{"$f":"U116","v":0},{"$f":"V116","v":0},""]
[null,null,"Mois",{"$f":"IF(A116=\"\",0,TEXT(MONTH(A116),\"00\"))","v":0},null,null,{"$f":"D117","v":0},{"$f":"MOD(G117,10)","v":0},{"$f":"ROUNDDOWN(G117/10,0)","v":0},{"$f":"H117+I117","v":0},0,0,0,null,null,null,null,null,null,null,null,null,null,null,null,null,null,null,null,null,null,""]
[null,null,"Année",{"$f":"IF(A116=\"\",0,TEXT(YEAR(A116),\"00\"))","v":0},{"$f":"D118","v":0},{"$f":"MOD(E118,10)","v":0},{"$f":"MOD(ROUNDDOWN(E118/1000,0),10)","v":0},{"$f":"MOD(ROUNDDOWN(E118/100,0),10)","v":0},{"$f":"MOD(ROUNDDOWN(E118/10,0),100)","v":0},{"$f":"F118+G118+H118+I118","v":0},0,0,0,null,null,null,null,null,null,null,null,null,null,null,null,null,null,null,null,null,null,""]
["",null,"Jour",{"$f":"IF(A119=\"\",0,TEXT(DAY(A119),\"00\"))","v":0},null,null,{"$f":"D119","v":0},{"$f":"MOD(G119,10)","v":0},{"$f":"ROUNDDOWN(G119/10,0)","v":0},{"$f":"H119+I119","v":0},0,0,0,{"$f":"MOD(SUM(M119:M121),10)","v":0},{"$f":"ROUNDDOWN(SUM(M119:M121)/10,0)","v":0},{"$f":"N119+O119","v":0},{"$f":"MOD(SUM(P119:P121),10)","v":0},{"$f":"ROUNDDOWN(SUM(P119:P121)/10,0)","v":0},{"$f":"Q119+R119","v":0},null,0,0,"00:00:00",null,{"$f":"TEXT(HOUR(W119),\"00\")","v":"00"},{"$f":"TEXT(MINUTE($W119),\"00\")","v":"00"},{"$f":"IF(Y119>Z119,$U$1,IF(Z119>Y119,$V$1,IF(Y119=Z119,\"DRAW\")))","v":"DRAW"},null,{"$f":"INDIRECT(\"A\"&ROW())","v":""},{"$f":"U119","v":0},{"$f":"V119","v":0},""]
[null,null,"Mois",{"$f":"IF(A119=\"\",0,TEXT(MONTH(A119),\"00\"))","v":0},null,null,{"$f":"D120","v":0},{"$f":"MOD(G120,10)","v":0},{"$f":"ROUNDDOWN(G120/10,0)","v":0},{"$f":"H120+I120","v":0},0,0,0,null,null,null,null,null,null,null,null,null,null,null,null,null,null,null,null,null,null,""]
[null,null,"Année",{"$f":"IF(A119=\"\",0,TEXT(YEAR(A119),\"00\"))","v":0},{"$f":"D121","v":0},{"$f":"MOD(E121,10)","v":0},{"$f":"MOD(ROUNDDOWN(E121/1000,0),10)","v":0},{"$f":"MOD(ROUNDDOWN(E121/100,0),10)","v":0},{"$f":"MOD(ROUNDDOWN(E121/10,0),100)","v":0},{"$f":"F121+G121+H121+I121","v":0},0,0,0,null,null,null,null,null,null,null,null,null,null,null,null,null,null,null,null,null,null,""]
["",null,"Jour",{"$f":"IF(A122=\"\",0,TEXT(DAY(A122),\"00\"))","v":0},null,null,{"$f":"D122","v":0},{"$f":"MOD(G122,10)","v":0},{"$f":"ROUNDDOWN(G122/10,0)","v":0},{"$f":"H122+I122","v":0},0,{"$f":"ROUNDDOWN(J122/10,0)","v":0},{"$f":"K122+L122","v":0},{"$f":"MOD(SUM(M122:M124),10)","v":0},{"$f":"ROUNDDOWN(SUM(M122:M124)/10,0)","v":0},{"$f":"N122+O122","v":0},{"$f":"MOD(SUM(P122:P124),10)","v":0},{"$f":"ROUNDDOWN(SUM(P122:P124)/10,0)","v":0},{"$f":"Q122+R122","v":0},null,0,0,"00:00:00",null,{"$f":"TEXT(HOUR(W122),\"00\")","v":"00"},{"$f":"TEXT(MINUTE($W122),\"00\")","v":"00"},{"$f":"IF(Y122>Z122,$U$1,IF(Z122>Y122,$V$1,IF(Y122=Z122,\"DRAW\")))","v":"DRAW"},null,{"$f":"INDIRECT(\"A\"&ROW())","v":""},{"$f":"U122","v":0},{"$f":"V122","v":0},""]
[null,null,"Mois",{"$f":"IF(A122=\"\",0,TEXT(MONTH(A122),\"00\"))","v":0},null,null,{"$f":"D123","v":0},{"$f":"MOD(G123,10)","v":0},{"$f":"ROUNDDOWN(G123/10,0)","v":0},{"$f":"H123+I123","v":0},0,{"$f":"ROUNDDOWN(J123/10,0)","v":0},{"$f":"K123+L123","v":0},null,null,null,null,null,null,null,null,null,null,null,null,null,null,null,null,null,null,""]
[null,null,"Année",{"$f":"IF(A122=\"\",0,TEXT(YEAR(A122),\"00\"))","v":0},{"$f":"D124","v":0},{"$f":"MOD(E124,10)","v":0},{"$f":"MOD(ROUNDDOWN(E124/1000,0),10)","v":0},{"$f":"MOD(ROUNDDOWN(E124/100,0),10)","v":0},{"$f":"MOD(ROUNDDOWN(E124/10,0),100)","v":0},{"$f":"F124+G124+H124+I124","v":0},0,{"$f":"ROUNDDOWN(J124/10,0)","v":0},{"$f":"K124+L124","v":0},null,null,null,null,null,null,null,null,null,null,null,null,null,null,null,null,null,null,""]
["",null,"Jour",{"$f":"IF(A125=\"\",0,TEXT(DAY(A125),\"00\"))","v":0},null,null,{"$f":"D125","v":0},{"$f":"MOD(G125,10)","v":0},{"$f":"ROUNDDOWN(G125/10,0)","v":0},{"$f":"H125+I125","v":0},0,{"$f":"ROUNDDOWN(J125/10,0)","v":0},{"$f":"K125+L125","v":0},{"$f":"MOD(SUM(M125:M127),10)","v":0},{"$f":"ROUNDDOWN(SUM(M125:M127)/10,0)","v":0},{"$f":"N125+O125","v":0},{"$f":"MOD(SUM(P125:P127),10)","v":0},{"$f":"ROUNDDOWN(SUM(P125:P127)/10,0)","v":0},{"$f":"Q125+R125","v":0},null,0,0,"00:00:00",null,{"$f":"TEXT(HOUR(W125),\"00\")","v":"00"},{"$f":"TEXT(MINUTE($W125),\"00\")","v":"00"},{"$f":"IF(Y125>Z125,$U$1,IF(Z125>Y125,$V$1,IF(Y125=Z125,\"DRAW\")))","v":"DRAW"},null,{"$f":"INDIRECT(\"A\"&ROW())","v":""},{"$f":"U125","v":0},{"$f":"V125","v":0},""]
[null,null,"Mois",{"$f":"IF(A125=\"\",0,TEXT(MONTH(A125),\"00\"))","v":0},null,null,{"$f":"D126","v":0},{"$f":"MOD(G126,10)","v":0},{"$f":"ROUNDDOWN(G126/10,0)","v":0},{"$f":"H126+I126","v":0},0,0,0,null,null,null,null,null,null,null,null,null,null,null,null,null,null,null,null,null,null,""]
[null,null,"Année",{"$f":"IF(A125=\"\",0,TEXT(YEAR(A125),\"00\"))","v":0},{"$f":"D127","v":0},{"$f":"MOD(E127,10)","v":0},{"$f":"MOD(ROUNDDOWN(E127/1000,0),10)","v":0},{"$f":"MOD(ROUNDDOWN(E127/100,0),10)","v":0},{"$f":"MOD(ROUNDDOWN(E127/10,0),100)","v":0},{"$f":"F127+G127+H127+I127","v":0},0,0,0,null,null,null,null,null,null,null,null,null,null,null,null,null,null,null,null,null,null,""]
["",null,"Jour",{"$f":"IF(A128=\"\",0,TEXT(DAY(A128),\"00\"))","v":0},null,null,{"$f":"D128","v":0},{"$f":"MOD(G128,10)","v":0},{"$f":"ROUNDDOWN(G128/10,0)","v":0},{"$f":"H128+I128","v":0},0,0,0,{"$f":"MOD(SUM(M128:M130),10)","v":0},{"$f":"ROUNDDOWN(SUM(M128:M130)/10,0)","v":0},{"$f":"N128+O128","v":0},{"$f":"MOD(SUM(P128:P130),10)","v":0},{"$f":"ROUNDDOWN(SUM(P128:P130)/10,0)","v":0},{"$f":"Q128+R128","v":0},null,0,0,"00:00:00",null,{"$f":"TEXT(HOUR(W128),\"00\")","v":"00"},{"$f":"TEXT(MINUTE($W128),\"00\")","v":"00"},{"$f":"IF(Y128>Z128,$U$1,IF(Z128>Y128,$V$1,IF(Y128=Z128,\"DRAW\")))","v":"DRAW"},null,{"$f":"INDIRECT(\"A\"&ROW())","v":""},{"$f":"U128","v":0},{"$f":"V128","v":0},""]
[null,null,"Mois",{"$f":"IF(A128=\"\",0,TEXT(MONTH(A128),\"00\"))","v":0},null,null,{"$f":"D129","v":0},{"$f":"MOD(G129,10)","v":0},{"$f":"ROUNDDOWN(G129/10,0)","v":0},{"$f":"H129+I129","v":0},0,0,0,null,null,null,null,null,null,null,null,null,null,null,null,null,null,null,null,null,null,""]
[null,null,"Année",{"$f":"IF(A128=\"\",0,TEXT(YEAR(A128),\"00\"))","v":0},{"$f":"D130","v":0},{"$f":"MOD(E130,10)","v":0},{"$f":"MOD(ROUNDDOWN(E130/1000,0),10)","v":0},{"$f":"MOD(ROUNDDOWN(E130/100,0),10)","v":0},{"$f":"MOD(ROUNDDOWN(E130/10,0),100)","v":0},{"$f":"F130+G130+H130+I130","v":0},{"$f":"MOD(J130,10)","v":0},0,0,null,null,null,null,null,null,null,null,null,null,null,null,null,null,null,null,null,null,""]
["",null,"Jour",{"$f":"IF(A131=\"\",0,TEXT(DAY(A131),\"00\"))","v":0},null,null,{"$f":"D131","v":0},{"$f":"MOD(G131,10)","v":0},{"$f":"ROUNDDOWN(G131/10,0)","v":0},{"$f":"H131+I131","v":0},0,0,0,{"$f":"MOD(SUM(M131:M133),10)","v":0},{"$f":"ROUNDDOWN(SUM(M131:M133)/10,0)","v":0},{"$f":"N131+O131","v":0},{"$f":"MOD(SUM(P131:P133),10)","v":0},{"$f":"ROUNDDOWN(SUM(P131:P133)/10,0)","v":0},{"$f":"Q131+R131","v":0},null,0,0,"00:00:00",null,{"$f":"TEXT(HOUR(W131),\"00\")","v":"00"},{"$f":"TEXT(MINUTE($W131),\"00\")","v":"00"},{"$f":"IF(Y131>Z131,$U$1,IF(Z131>Y131,$V$1,IF(Y131=Z131,\"DRAW\")))","v":"DRAW"},null,{"$f":"INDIRECT(\"A\"&ROW())","v":""},{"$f":"U131","v":0},{"$f":"V131","v":0},{"$f":"IF(AD131=0,\"\",S131)","v":""}]
[null,null,"Mois",{"$f":"IF(A131=\"\",0,TEXT(MONTH(A131),\"00\"))","v":0},null,null,{"$f":"D132","v":0},{"$f":"MOD(G132,10)","v":0},{"$f":"ROUNDDOWN(G132/10,0)","v":0},{"$f":"H132+I132","v":0},0,0,0,null,null,null,null,null,null,null,null,null,null,null,null,null,null,null,null,null,null,""]
[null,null,"Année",{"$f":"IF(A131=\"\",0,TEXT(YEAR(A131),\"00\"))","v":0},{"$f":"D133","v":0},{"$f":"MOD(E133,10)","v":0},{"$f":"MOD(ROUNDDOWN(E133/1000,0),10)","v":0},{"$f":"MOD(ROUNDDOWN(E133/100,0),10)","v":0},{"$f":"MOD(ROUNDDOWN(E133/10,0),100)","v":0},{"$f":"F133+G133+H133+I133","v":0},0,0,0,null,null,null,null,null,null,null,null,null,null,null,null,null,null,null,null,null,null,""]
["",null,"Jour",{"$f":"IF(A134=\"\",0,TEXT(DAY(A134),\"00\"))","v":0},null,null,{"$f":"D134","v":0},{"$f":"MOD(G134,10)","v":0},{"$f":"ROUNDDOWN(G134/10,0)","v":0},{"$f":"H134+I134","v":0},0,0,0,{"$f":"MOD(SUM(M134:M136),10)","v":0},{"$f":"ROUNDDOWN(SUM(M134:M136)/10,0)","v":0},{"$f":"N134+O134","v":0},{"$f":"MOD(SUM(P134:P136),10)","v":0},{"$f":"ROUNDDOWN(SUM(P134:P136)/10,0)","v":0},{"$f":"Q134+R134","v":0},null,0,0,"00:00:00",null,{"$f":"TEXT(HOUR(W134),\"00\")","v":"00"},{"$f":"TEXT(MINUTE($W134),\"00\")","v":"00"},{"$f":"IF(Y134>Z134,$U$1,IF(Z134>Y134,$V$1,IF(Y134=Z134,\"DRAW\")))","v":"DRAW"},null,{"$f":"INDIRECT(\"A\"&ROW())","v":""},{"$f":"U134","v":0},{"$f":"V134","v":0},""]
[null,null,"Mois",{"$f":"IF(A134=\"\",0,TEXT(MONTH(A134),\"00\"))","v":0},null,null,{"$f":"D135","v":0},{"$f":"MOD(G135,10)","v":0},{"$f":"ROUNDDOWN(G135/10,0)","v":0},{"$f":"H135+I135","v":0},0,0,0,null,null,null,null,null,null,null,null,null,null,null,null,null,null,null,null,null,null,""]
[null,null,"Année",{"$f":"IF(A134=\"\",0,TEXT(YEAR(A134),\"00\"))","v":0},{"$f":"D136","v":0},{"$f":"MOD(E136,10)","v":0},{"$f":"MOD(ROUNDDOWN(E136/1000,0),10)","v":0},{"$f":"MOD(ROUNDDOWN(E136/100,0),10)","v":0},{"$f":"MOD(ROUNDDOWN(E136/10,0),100)","v":0},{"$f":"F136+G136+H136+I136","v":0},0,0,0,null,null,null,null,null,null,null,null,null,null,null,null,null,null,null,null,null,null,""]
["",null,"Jour",{"$f":"IF(A137=\"\",0,TEXT(DAY(A137),\"00\"))","v":0},null,null,{"$f":"D137","v":0},{"$f":"MOD(G137,10)","v":0},{"$f":"ROUNDDOWN(G137/10,0)","v":0},{"$f":"H137+I137","v":0},0,0,0,{"$f":"MOD(SUM(M137:M139),10)","v":0},{"$f":"ROUNDDOWN(SUM(M137:M139)/10,0)","v":0},{"$f":"N137+O137","v":0},{"$f":"MOD(SUM(P137:P139),10)","v":0},{"$f":"ROUNDDOWN(SUM(P137:P139)/10,0)","v":0},{"$f":"Q137+R137","v":0},null,0,0,"00:00:00",null,{"$f":"TEXT(HOUR(W137),\"00\")","v":"00"},{"$f":"TEXT(MINUTE($W137),\"00\")","v":"00"},{"$f":"IF(Y137>Z137,$U$1,IF(Z137>Y137,$V$1,IF(Y137=Z137,\"DRAW\")))","v":"DRAW"},null,{"$f":"INDIRECT(\"A\"&ROW())","v":""},{"$f":"U137","v":0},{"$f":"V137","v":0},""]
[null,null,"Mois",{"$f":"IF(A137=\"\",0,TEXT(MONTH(A137),\"00\"))","v":0},null,null,{"$f":"D138","v":0},{"$f":"MOD(G138,10)","v":0},{"$f":"ROUNDDOWN(G138/10,0)","v":0},{"$f":"H138+I138","v":0},0,0,0,null,null,null,null,null,null,null,null,null,null,null,null,null,null,null,null,null,null,""]
[null,null,"Année",{"$f":"IF(A137=\"\",0,TEXT(YEAR(A137),\"00\"))","v":0},{"$f":"D139","v":0},{"$f":"MOD(E139,10)","v":0},{"$f":"MOD(ROUNDDOWN(E139/1000,0),10)","v":0},{"$f":"MOD(ROUNDDOWN(E139/100,0),10)","v":0},{"$f":"MOD(ROUNDDOWN(E139/10,0),100)","v":0},{"$f":"F139+G139+H139+I139","v":0},0,0,0,null,null,null,null,null,null,null,null,null,null,null,null,null,null,null,null,null,null,""]
["",null,"Jour",{"$f":"IF(A140=\"\",0,TEXT(DAY(A140),\"00\"))","v":0},null,null,{"$f":"D140","v":0},{"$f":"MOD(G140,10)","v":0},{"$f":"ROUNDDOWN(G140/10,0)","v":0},{"$f":"H140+I140","v":0},0,0,0,{"$f":"MOD(SUM(M140:M142),10)","v":0},{"$f":"ROUNDDOWN(SUM(M140:M142)/10,0)","v":0},{"$f":"N140+O140","v":0},{"$f":"MOD(SUM(P140:P142),10)","v":0},{"$f":"ROUNDDOWN(SUM(P140:P142)/10,0)","v":0},{"$f":"Q140+R140","v":0},null,0,0,"00:00:00",null,{"$f":"TEXT(HOUR(W140),\"00\")","v":"00"},{"$f":"TEXT(MINUTE($W140),\"00\")","v":"00"},{"$f":"IF(Y140>Z140,$U$1,IF(Z140>Y140,$V$1,IF(Y140=Z140,\"DRAW\")))","v":"DRAW"},null,{"$f":"INDIRECT(\"A\"&ROW())","v":""},{"$f":"U140","v":0},{"$f":"V140","v":0},""]
[null,null,"Mois",{"$f":"IF(A140=\"\",0,TEXT(MONTH(A140),\"00\"))","v":0},null,null,{"$f":"D141","v":0},{"$f":"MOD(G141,10)","v":0},{"$f":"ROUNDDOWN(G141/10,0)","v":0},{"$f":"H141+I141","v":0},0,0,0,null,null,null,null,null,null,null,null,null,null,null,null,null,null,null,null,null,null,""]
[null,null,"Année",{"$f":"IF(A140=\"\",0,TEXT(YEAR(A140),\"00\"))","v":0},{"$f":"D142","v":0},{"$f":"MOD(E142,10)","v":0},{"$f":"MOD(ROUNDDOWN(E142/1000,0),10)","v":0},{"$f":"MOD(ROUNDDOWN(E142/100,0),10)","v":0},{"$f":"MOD(ROUNDDOWN(E142/10,0),100)","v":0},{"$f":"F142+G142+H142+I142","v":0},0,0,0,null,null,null,null,null,null,null,null,null,null,null,null,null,null,null,null,null,null,""]
["",null,"Jour",{"$f":"IF(A143=\"\",0,TEXT(DAY(A143),\"00\"))","v":0},null,null,{"$f":"D143","v":0},{"$f":"MOD(G143,10)","v":0},{"$f":"ROUNDDOWN(G143/10,0)","v":0},{"$f":"H143+I143","v":0},0,0,0,{"$f":"MOD(SUM(M143:M145),10)","v":0},{"$f":"ROUNDDOWN(SUM(M143:M145)/10,0)","v":0},{"$f":"N143+O143","v":0},{"$f":"MOD(SUM(P143:P145),10)","v":0},{"$f":"ROUNDDOWN(SUM(P143:P145)/10,0)","v":0},{"$f":"Q143+R143","v":0},null,0,0,"00:00:00",null,{"$f":"TEXT(HOUR(W143),\"00\")","v":"00"},{"$f":"TEXT(MINUTE($W143),\"00\")","v":"00"},{"$f":"IF(Y143>Z143,$U$1,IF(Z143>Y143,$V$1,IF(Y143=Z143,\"DRAW\")))","v":"DRAW"},null,{"$f":"INDIRECT(\"A\"&ROW())","v":""},{"$f":"U143","v":0},{"$f":"V143","v":0},""]
[null,null,"Mois",{"$f":"IF(A143=\"\",0,TEXT(MONTH(A143),\"00\"))","v":0},null,null,{"$f":"D144","v":0},{"$f":"MOD(G144,10)","v":0},{"$f":"ROUNDDOWN(G144/10,0)","v":0},{"$f":"H144+I144","v":0},0,0,0,null,null,null,null,null,null,null,null,null,null,null,null,null,null,null,null,null,null,""]
[null,null,"Année",{"$f":"IF(A143=\"\",0,TEXT(YEAR(A143),\"00\"))","v":0},{"$f":"D145","v":0},{"$f":"MOD(E145,10)","v":0},{"$f":"MOD(ROUNDDOWN(E145/1000,0),10)","v":0},{"$f":"MOD(ROUNDDOWN(E145/100,0),10)","v":0},{"$f":"MOD(ROUNDDOWN(E145/10,0),100)","v":0},{"$f":"F145+G145+H145+I145","v":0},0,0,0,null,null,null,null,null,null,null,null,null,null,null,null,null,null,null,null,null,null,""]
[null,null,null,null,null,null,null,null,null,null,null,null,null,null,null,null,null,null,null,null,null,null,null,null,null,null,null,null,null,null,null,""]
[null,null,null,null,null,null,null,null,null,null,null,null,null,null,null,null,null,null,null,null,null,null,null,null,null,null,null,null,null,null,null,""]
[null,null,null,null,null,null,null,null,null,null,null,null,null,null,null,null,null,null,null,null,null,null,null,null,null,null,null,null,null,null,null,""]
["2007-09-18",null,"Jour",{"$f":"IF(A149=\"\",0,TEXT(DAY(A149),\"00\"))","v":"18"},null,null,{"$f":"D149","v":"18"},{"$f":"MOD(G149,10)","v":8},{"$f":"ROUNDDOWN(G149/10,0)","v":1},{"$f":"H149+I149","v":9},9,0,9,{"$f":"MOD(SUM(M149:M151),10)","v":7},{"$f":"ROUNDDOWN(SUM(M149:M151)/10,0)","v":2},{"$f":"N149+O149","v":9},{"$f":"MOD(SUM(P149:P151),10)","v":9},{"$f":"ROUNDDOWN(SUM(P149:P151)/10,0)","v":0},{"$f":"Q149+R149","v":9},null,"Marseille","Besiktas","00:00:00",null,{"$f":"TEXT(HOUR(W149),\"00\")","v":"00"},{"$f":"TEXT(MINUTE($W149),\"00\")","v":"00"},{"$f":"IF(Y149>Z149,$U$1,IF(Z149>Y149,$V$1,IF(Y149=Z149,\"DRAW\")))","v":"DRAW"},null,{"$f":"INDIRECT(\"A\"&ROW())","v":"2007-09-18"},{"$f":"U149","v":"Marseille"},{"$f":"V149","v":"Besiktas"},9]
[null,null,"Mois",{"$f":"IF(A149=\"\",0,TEXT(MONTH(A149),\"00\"))","v":"09"},null,null,{"$f":"D150","v":"09"},{"$f":"MOD(G150,10)","v":9},{"$f":"ROUNDDOWN(G150/10,0)","v":0},{"$f":"H150+I150","v":9},9,0,9,null,null,null,null,null,null,null,null,null,null,null,null,null,null,null,null,null,null,""]
[null,null,"Année",{"$f":"IF(A149=\"\",0,TEXT(YEAR(A149),\"00\"))","v":"2007"},{"$f":"D151","v":"2007"},{"$f":"MOD(E151,10)","v":7},{"$f":"MOD(ROUNDDOWN(E151/1000,0),10)","v":2},{"$f":"MOD(ROUNDDOWN(E151/100,0),10)","v":0},{"$f":"MOD(ROUNDDOWN(E151/10,0),100)","v":0},{"$f":"F151+G151+H151+I151","v":9},9,0,9,null,null,null,null,null,null,null,null,null,null,null,null,null,null,null,null,null,null,""]
["2007-09-18",null,"Jour",{"$f":"IF(A152=\"\",0,TEXT(DAY(A152),\"00\"))","v":"18"},null,null,{"$f":"D152","v":"18"},{"$f":"MOD(G152,10)","v":8},{"$f":"ROUNDDOWN(G152/10,0)","v":1},{"$f":"H152+I152","v":9},9,0,9,{"$f":"MOD(SUM(M152:M154),10)","v":7},{"$f":"ROUNDDOWN(SUM(M152:M154)/10,0)","v":2},{"$f":"N152+O152","v":9},{"$f":"MOD(SUM(P152:P154),10)","v":9},{"$f":"ROUNDDOWN(SUM(P152:P154)/10,0)","v":0},{"$f":"Q152+R152","v":9},null,"Porto","Liverpool","00:00:00",null,{"$f":"TEXT(HOUR(W152),\"00\")","v":"00"},{"$f":"TEXT(MINUTE($W152),\"00\")","v":"00"},{"$f":"IF(Y152>Z152,$U$1,IF(Z152>Y152,$V$1,IF(Y152=Z152,\"DRAW\")))","v":"DRAW"},null,{"$f":"INDIRECT(\"A\"&ROW())","v":"2007-09-18"},{"$f":"U152","v":"Porto"},{"$f":"V152","v":"Liverpool"},9]
[null,null,"Mois",{"$f":"IF(A152=\"\",0,TEXT(MONTH(A152),\"00\"))","v":"09"},null,null,{"$f":"D153","v":"09"},{"$f":"MOD(G153,10)","v":9},{"$f":"ROUNDDOWN(G153/10,0)","v":0},{"$f":"H153+I153","v":9},9,0,9,null,null,null,null,null,null,null,null,null,null,null,null,null,null,null,null,null,null,""]
[null,null,"Année",{"$f":"IF(A152=\"\",0,TEXT(YEAR(A152),\"00\"))","v":"2007"},{"$f":"D154","v":"2007"},{"$f":"MOD(E154,10)","v":7},{"$f":"MOD(ROUNDDOWN(E154/1000,0),10)","v":2},{"$f":"MOD(ROUNDDOWN(E154/100,0),10)","v":0},{"$f":"MOD(ROUNDDOWN(E154/10,0),100)","v":0},{"$f":"F154+G154+H154+I154","v":9},9,0,9,null,null,null,null,null,null,null,null,null,null,null,null,null,null,null,null,null,null,""]
["2007-10-03",null,"Jour",{"$f":"IF(A155=\"\",0,TEXT(DAY(A155),\"00\"))","v":"03"},null,null,{"$f":"D155","v":"03"},{"$f":"MOD(G155,10)","v":3},{"$f":"ROUNDDOWN(G155/10,0)","v":0},{"$f":"H155+I155","v":3},3,0,3,{"$f":"MOD(SUM(M155:M157),10)","v":3},{"$f":"ROUNDDOWN(SUM(M155:M157)/10,0)","v":1},{"$f":"N155+O155","v":4},{"$f":"MOD(SUM(P155:P157),10)","v":4},{"$f":"ROUNDDOWN(SUM(P155:P157)/10,0)","v":0},{"$f":"Q155+R155","v":4},null,"Besiktas","Porto","00:00:00",null,{"$f":"TEXT(HOUR(W155),\"00\")","v":"00"},{"$f":"TEXT(MINUTE($W155),\"00\")","v":"00"},{"$f":"IF(Y155>Z155,$U$1,IF(Z155>Y155,$V$1,IF(Y155=Z155,\"DRAW\")))","v":"DRAW"},null,{"$f":"INDIRECT(\"A\"&ROW())","v":"2007-10-03"},{"$f":"U155","v":"Besiktas"},{"$f":"V155","v":"Porto"},4]
[null,null,"Mois",{"$f":"IF(A155=\"\",0,TEXT(MONTH(A155),\"00\"))","v":"10"},null,null,{"$f":"D156","v":"10"},{"$f":"MOD(G156,10)","v":0},{"$f":"ROUNDDOWN(G156/10,0)","v":1},{"$f":"H156+I156","v":1},1,0,1,null,null,null,null,null,null,null,null,null,null,null,null,null,null,null,null,null,null,""]
[null,null,"Année",{"$f":"IF(A155=\"\",0,TEXT(YEAR(A155),\"00\"))","v":"2007"},{"$f":"D157","v":"2007"},{"$f":"MOD(E157,10)","v":7},{"$f":"MOD(ROUNDDOWN(E157/1000,0),10)","v":2},{"$f":"MOD(ROUNDDOWN(E157/100,0),10)","v":0},{"$f":"MOD(ROUNDDOWN(E157/10,0),100)","v":0},{"$f":"F157+G157+H157+I157","v":9},9,0,9,null,null,null,null,null,null,null,null,null,null,null,null,null,null,null,null,null,null,""]
["2007-10-03",null,"Jour",{"$f":"IF(A158=\"\",0,TEXT(DAY(A158),\"00\"))","v":"03"},null,null,{"$f":"D158","v":"03"},{"$f":"MOD(G158,10)","v":3},{"$f":"ROUNDDOWN(G158/10,0)","v":0},{"$f":"H158+I158","v":3},3,0,3,{"$f":"MOD(SUM(M158:M160),10)","v":3},{"$f":"ROUNDDOWN(SUM(M158:M160)/10,0)","v":1},{"$f":"N158+O158","v":4},{"$f":"MOD(SUM(P158:P160),10)","v":4},{"$f":"ROUNDDOWN(SUM(P158:P160)/10,0)","v":0},{"$f":"Q158+R158","v":4},null,"Liverpool","Marseille","00:00:00",null,{"$f":"TEXT(HOUR(W158),\"00\")","v":"00"},{"$f":"TEXT(MINUTE($W158),\"00\")","v":"00"},{"$f":"IF(Y158>Z158,$U$1,IF(Z158>Y158,$V$1,IF(Y158=Z158,\"DRAW\")))","v":"DRAW"},null,{"$f":"INDIRECT(\"A\"&ROW())","v":"2007-10-03"},{"$f":"U158","v":"Liverpool"},{"$f":"V158","v":"Marseille"},4]
[null,null,"Mois",{"$f":"IF(A158=\"\",0,TEXT(MONTH(A158),\"00\"))","v":"10"},null,null,{"$f":"D159","v":"10"},{"$f":"MOD(G159,10)","v":0},{"$f":"ROUNDDOWN(G159/10,0)","v":1},{"$f":"H159+I159","v":1},1,0,1,null,null,null,null,null,null,null,null,null,null,null,null,null,null,null,null,null,null,""]
[null,null,"Année",{"$f":"IF(A158=\"\",0,TEXT(YEAR(A158),\"00\"))","v":"2007"},{"$f":"D160","v":"2007"},{"$f":"MOD(E160,10)","v":7},{"$f":"MOD(ROUNDDOWN(E160/1000,0),10)","v":2},{"$f":"MOD(ROUNDDOWN(E160/100,0),10)","v":0},{"$f":"MOD(ROUNDDOWN(E160/10,0),100)","v":0},{"$f":"F160+G160+H160+I160","v":9},9,0,9,null,null,null,null,null,null,null,null,null,null,null,null,null,null,null,null,null,null,""]
["2007-10-24",null,"Jour",{"$f":"IF(A161=\"\",0,TEXT(DAY(A161),\"00\"))","v":"24"},null,null,{"$f":"D161","v":"24"},{"$f":"MOD(G161,10)","v":4},{"$f":"ROUNDDOWN(G161/10,0)","v":2},{"$f":"H161+I161","v":6},6,0,6,{"$f":"MOD(SUM(M161:M163),10)","v":6},{"$f":"ROUNDDOWN(SUM(M161:M163)/10,0)","v":1},{"$f":"N161+O161","v":7},{"$f":"MOD(SUM(P161:P163),10)","v":7},{"$f":"ROUNDDOWN(SUM(P161:P163)/10,0)","v":0},{"$f":"Q161+R161","v":7},null,"Besiktas","Liverpool","00:00:00",null,{"$f":"TEXT(HOUR(W161),\"00\")","v":"00"},{"$f":"TEXT(MINUTE($W161),\"00\")","v":"00"},{"$f":"IF(Y161>Z161,$U$1,IF(Z161>Y161,$V$1,IF(Y161=Z161,\"DRAW\")))","v":"DRAW"},null,{"$f":"INDIRECT(\"A\"&ROW())","v":"2007-10-24"},{"$f":"U161","v":"Besiktas"},{"$f":"V161","v":"Liverpool"},7]
[null,null,"Mois",{"$f":"IF(A161=\"\",0,TEXT(MONTH(A161),\"00\"))","v":"10"},null,null,{"$f":"D162","v":"10"},{"$f":"MOD(G162,10)","v":0},{"$f":"ROUNDDOWN(G162/10,0)","v":1},{"$f":"H162+I162","v":1},1,0,1,null,null,null,null,null,null,null,null,null,null,null,null,null,null,null,null,null,null,""]
[null,null,"Année",{"$f":"IF(A161=\"\",0,TEXT(YEAR(A161),\"00\"))","v":"2007"},{"$f":"D163","v":"2007"},{"$f":"MOD(E163,10)","v":7},{"$f":"MOD(ROUNDDOWN(E163/1000,0),10)","v":2},{"$f":"MOD(ROUNDDOWN(E163/100,0),10)","v":0},{"$f":"MOD(ROUNDDOWN(E163/10,0),100)","v":0},{"$f":"F163+G163+H163+I163","v":9},9,0,9,null,null,null,null,null,null,null,null,null,null,null,null,null,null,null,null,null,null,""]
["2007-10-24",null,"Jour",{"$f":"IF(A164=\"\",0,TEXT(DAY(A164),\"00\"))","v":"24"},null,null,{"$f":"D164","v":"24"},{"$f":"MOD(G164,10)","v":4},{"$f":"ROUNDDOWN(G164/10,0)","v":2},{"$f":"H164+I164","v":6},6,0,6,{"$f":"MOD(SUM(M164:M166),10)","v":6},{"$f":"ROUNDDOWN(SUM(M164:M166)/10,0)","v":1},{"$f":"N164+O164","v":7},{"$f":"MOD(SUM(P164:P166),10)","v":7},{"$f":"ROUNDDOWN(SUM(P164:P166)/10,0)","v":0},{"$f":"Q164+R164","v":7},null,"Marseille","Porto","00:00:00",null,{"$f":"TEXT(HOUR(W164),\"00\")","v":"00"},{"$f":"TEXT(MINUTE($W164),\"00\")","v":"00"},{"$f":"IF(Y164>Z164,$U$1,IF(Z164>Y164,$V$1,IF(Y164=Z164,\"DRAW\")))","v":"DRAW"},null,{"$f":"INDIRECT(\"A\"&ROW())","v":"2007-10-24"},{"$f":"U164","v":"Marseille"},{"$f":"V164","v":"Porto"},7]
[null,null,"Mois",{"$f":"IF(A164=\"\",0,TEXT(MONTH(A164),\"00\"))","v":"10"},null,null,{"$f":"D165","v":"10"},{"$f":"MOD(G165,10)","v":0},{"$f":"ROUNDDOWN(G165/10,0)","v":1},{"$f":"H165+I165","v":1},1,0,1,null,null,null,null,null,null,null,null,null,null,null,null,null,null,null,null,null,null,""]
[null,null,"Année",{"$f":"IF(A164=\"\",0,TEXT(YEAR(A164),\"00\"))","v":"2007"},{"$f":"D166","v":"2007"},{"$f":"MOD(E166,10)","v":7},{"$f":"MOD(ROUNDDOWN(E166/1000,0),10)","v":2},{"$f":"MOD(ROUNDDOWN(E166/100,0),10)","v":0},{"$f":"MOD(ROUNDDOWN(E166/10,0),100)","v":0},{"$f":"F166+G166+H166+I166","v":9},9,0,9,null,null,null,null,null,null,null,null,null,null,null,null,null,null,null,null,null,null,""]
["2007-11-06",null,"Jour",{"$f":"IF(A167=\"\",0,TEXT(DAY(A167),\"00\"))","v":"06"},null,null,{"$f":"D167","v":"06"},{"$f":"MOD(G167,10)","v":6},{"$f":"ROUNDDOWN(G167/10,0)","v":0},{"$f":"H167+I167","v":6},6,0,6,{"$f":"MOD(SUM(M167:M169),10)","v":7},{"$f":"ROUNDDOWN(SUM(M167:M169)/10,0)","v":1},{"$f":"N167+O167","v":8},{"$f":"MOD(SUM(P167:P169),10)","v":8},{"$f":"ROUNDDOWN(SUM(P167:P169)/10,0)","v":0},{"$f":"Q167+R167","v":8},null,"Liverpool","Besiktas","00:00:00",null,{"$f":"TEXT(HOUR(W167),\"00\")","v":"00"},{"$f":"TEXT(MINUTE($W167),\"00\")","v":"00"},{"$f":"IF(Y167>Z167,$U$1,IF(Z167>Y167,$V$1,IF(Y167=Z167,\"DRAW\")))","v":"DRAW"},null,{"$f":"INDIRECT(\"A\"&ROW())","v":"2007-11-06"},{"$f":"U167","v":"Liverpool"},{"$f":"V167","v":"Besiktas"},8]
[null,null,"Mois",{"$f":"IF(A167=\"\",0,TEXT(MONTH(A167),\"00\"))","v":"11"},null,null,{"$f":"D168","v":"11"},{"$f":"MOD(G168,10)","v":1},{"$f":"ROUNDDOWN(G168/10,0)","v":1},{"$f":"H168+I168","v":2},2,0,2,null,null,null,null,null,null,null,null,null,null,null,null,null,null,null,null,null,null,""]
[null,null,"Année",{"$f":"IF(A167=\"\",0,TEXT(YEAR(A167),\"00\"))","v":"2007"},{"$f":"D169","v":"2007"},{"$f":"MOD(E169,10)","v":7},{"$f":"MOD(ROUNDDOWN(E169/1000,0),10)","v":2},{"$f":"MOD(ROUNDDOWN(E169/100,0),10)","v":0},{"$f":"MOD(ROUNDDOWN(E169/10,0),100)","v":0},{"$f":"F169+G169+H169+I169","v":9},9,0,9,null,null,null,null,null,null,null,null,null,null,null,null,null,null,null,null,null,null,""]
["2007-11-06",null,"Jour",{"$f":"IF(A170=\"\",0,TEXT(DAY(A170),\"00\"))","v":"06"},null,null,{"$f":"D170","v":"06"},{"$f":"MOD(G170,10)","v":6},{"$f":"ROUNDDOWN(G170/10,0)","v":0},{"$f":"H170+I170","v":6},6,0,6,{"$f":"MOD(SUM(M170:M172),10)","v":7},{"$f":"ROUNDDOWN(SUM(M170:M172)/10,0)","v":1},{"$f":"N170+O170","v":8},{"$f":"MOD(SUM(P170:P172),10)","v":8},{"$f":"ROUNDDOWN(SUM(P170:P172)/10,0)","v":0},{"$f":"Q170+R170","v":8},null,"Porto","Marseille","00:00:00",null,{"$f":"TEXT(HOUR(W170),\"00\")","v":"00"},{"$f":"TEXT(MINUTE($W170),\"00\")","v":"00"},{"$f":"IF(Y170>Z170,$U$1,IF(Z170>Y170,$V$1,IF(Y170=Z170,\"DRAW\")))","v":"DRAW"},null,{"$f":"INDIRECT(\"A\"&ROW())","v":"2007-11-06"},{"$f":"U170","v":"Porto"},{"$f":"V170","v":"Marseille"},8]
[null,null,"Mois",{"$f":"IF(A170=\"\",0,TEXT(MONTH(A170),\"00\"))","v":"11"},null,null,{"$f":"D171","v":"11"},{"$f":"MOD(G171,10)","v":1},{"$f":"ROUNDDOWN(G171/10,0)","v":1},{"$f":"H171+I171","v":2},2,0,2,null,null,null,null,null,null,null,null,null,null,null,null,null,null,null,null,null,null,""]
[null,null,"Année",{"$f":"IF(A170=\"\",0,TEXT(YEAR(A170),\"00\"))","v":"2007"},{"$f":"D172","v":"2007"},{"$f":"MOD(E172,10)","v":7},{"$f":"MOD(ROUNDDOWN(E172/1000,0),10)","v":2},{"$f":"MOD(ROUNDDOWN(E172/100,0),10)","v":0},{"$f":"MOD(ROUNDDOWN(E172/10,0),100)","v":0},{"$f":"F172+G172+H172+I172","v":9},9,0,9,null,null,null,null,null,null,null,null,null,null,null,null,null,null,null,null,null,null,""]
["2007-11-28",null,"Jour",{"$f":"IF(A173=\"\",0,TEXT(DAY(A173),\"00\"))","v":"28"},null,null,{"$f":"D173","v":"28"},{"$f":"MOD(G173,10)","v":8},{"$f":"ROUNDDOWN(G173/10,0)","v":2},{"$f":"H173+I173","v":10},0,1,1,{"$f":"MOD(SUM(M173:M175),10)","v":2},{"$f":"ROUNDDOWN(SUM(M173:M175)/10,0)","v":1},{"$f":"N173+O173","v":3},{"$f":"MOD(SUM(P173:P175),10)","v":3},{"$f":"ROUNDDOWN(SUM(P173:P175)/10,0)","v":0},{"$f":"Q173+R173","v":3},null,"Liverpool","Porto","00:00:00",null,{"$f":"TEXT(HOUR(W173),\"00\")","v":"00"},{"$f":"TEXT(MINUTE($W173),\"00\")","v":"00"},{"$f":"IF(Y173>Z173,$U$1,IF(Z173>Y173,$V$1,IF(Y173=Z173,\"DRAW\")))","v":"DRAW"},null,{"$f":"INDIRECT(\"A\"&ROW())","v":"2007-11-28"},{"$f":"U173","v":"Liverpool"},{"$f":"V173","v":"Porto"},3]
[null,null,"Mois",{"$f":"IF(A173=\"\",0,TEXT(MONTH(A173),\"00\"))","v":"11"},null,null,{"$f":"D174","v":"11"},{"$f":"MOD(G174,10)","v":1},{"$f":"ROUNDDOWN(G174/10,0)","v":1},{"$f":"H174+I174","v":2},2,0,2,null,null,null,null,null,null,null,null,null,null,null,null,null,null,null,null,null,null,""]
[null,null,"Année",{"$f":"IF(A173=\"\",0,TEXT(YEAR(A173),\"00\"))","v":"2007"},{"$f":"D175","v":"2007"},{"$f":"MOD(E175,10)","v":7},{"$f":"MOD(ROUNDDOWN(E175/1000,0),10)","v":2},{"$f":"MOD(ROUNDDOWN(E175/100,0),10)","v":0},{"$f":"MOD(ROUNDDOWN(E175/10,0),100)","v":0},{"$f":"F175+G175+H175+I175","v":9},9,0,9,null,null,null,null,null,null,null,null,null,null,null,null,null,null,null,null,null,null,""]
["2007-11-28",null,"Jour",{"$f":"IF(A176=\"\",0,TEXT(DAY(A176),\"00\"))","v":"28"},null,null,{"$f":"D176","v":"28"},{"$f":"MOD(G176,10)","v":8},{"$f":"ROUNDDOWN(G176/10,0)","v":2},{"$f":"H176+I176","v":10},0,1,1,{"$f":"MOD(SUM(M176:M178),10)","v":2},{"$f":"ROUNDDOWN(SUM(M176:M178)/10,0)","v":1},{"$f":"N176+O176","v":3},{"$f":"MOD(SUM(P176:P178),10)","v":3},{"$f":"ROUNDDOWN(SUM(P176:P178)/10,0)","v":0},{"$f":"Q176+R176","v":3},null,"Besiktas","Marseille","00:00:00",null,{"$f":"TEXT(HOUR(W176),\"00\")","v":"00"},{"$f":"TEXT(MINUTE($W176),\"00\")","v":"00"},{"$f":"IF(Y176>Z176,$U$1,IF(Z176>Y176,$V$1,IF(Y176=Z176,\"DRAW\")))","v":"DRAW"},null,{"$f":"INDIRECT(\"A\"&ROW())","v":"2007-11-28"},{"$f":"U176","v":"Besiktas"},{"$f":"V176","v":"Marseille"},3]
[null,null,"Mois",{"$f":"IF(A176=\"\",0,TEXT(MONTH(A176),\"00\"))","v":"11"},null,null,{"$f":"D177","v":"11"},{"$f":"MOD(G177,10)","v":1},{"$f":"ROUNDDOWN(G177/10,0)","v":1},{"$f":"H177+I177","v":2},2,0,2,null,null,null,null,null,null,null,null,null,null,null,null,null,null,null,null,null,null,""]
[null,null,"Année",{"$f":"IF(A176=\"\",0,TEXT(YEAR(A176),\"00\"))","v":"2007"},{"$f":"D178","v":"2007"},{"$f":"MOD(E178,10)","v":7},{"$f":"MOD(ROUNDDOWN(E178/1000,0),10)","v":2},{"$f":"MOD(ROUNDDOWN(E178/100,0),10)","v":0},{"$f":"MOD(ROUNDDOWN(E178/10,0),100)","v":0},{"$f":"F178+G178+H178+I178","v":9},9,0,9,null,null,null,null,null,null,null,null,null,null,null,null,null,null,null,null,null,null,""]
["2007-12-11",null,"Jour",{"$f":"IF(A179=\"\",0,TEXT(DAY(A179),\"00\"))","v":"11"},null,null,{"$f":"D179","v":"11"},{"$f":"MOD(G179,10)","v":1},{"$f":"ROUNDDOWN(G179/10,0)","v":1},{"$f":"H179+I179","v":2},2,0,2,{"$f":"MOD(SUM(M179:M181),10)","v":4},{"$f":"ROUNDDOWN(SUM(M179:M181)/10,0)","v":1},{"$f":"N179+O179","v":5},{"$f":"MOD(SUM(P179:P181),10)","v":5},{"$f":"ROUNDDOWN(SUM(P179:P181)/10,0)","v":0},{"$f":"Q179+R179","v":5},null,"Marseille","Liverpool","00:00:00",null,{"$f":"TEXT(HOUR(W179),\"00\")","v":"00"},{"$f":"TEXT(MINUTE($W179),\"00\")","v":"00"},{"$f":"IF(Y179>Z179,$U$1,IF(Z179>Y179,$V$1,IF(Y179=Z179,\"DRAW\")))","v":"DRAW"},null,{"$f":"INDIRECT(\"A\"&ROW())","v":"2007-12-11"},{"$f":"U179","v":"Marseille"},{"$f":"V179","v":"Liverpool"},5]
[null,null,"Mois",{"$f":"IF(A179=\"\",0,TEXT(MONTH(A179),\"00\"))","v":"12"},null,null,{"$f":"D180","v":"12"},{"$f":"MOD(G180,10)","v":2},{"$f":"ROUNDDOWN(G180/10,0)","v":1},{"$f":"H180+I180","v":3},3,0,3,null,null,null,null,null,null,null,null,null,null,null,null,null,null,null,null,null,null,""]
[null,null,"Année",{"$f":"IF(A179=\"\",0,TEXT(YEAR(A179),\"00\"))","v":"2007"},{"$f":"D181","v":"2007"},{"$f":"MOD(E181,10)","v":7},{"$f":"MOD(ROUNDDOWN(E181/1000,0),10)","v":2},{"$f":"MOD(ROUNDDOWN(E181/100,0),10)","v":0},{"$f":"MOD(ROUNDDOWN(E181/10,0),100)","v":0},{"$f":"F181+G181+H181+I181","v":9},9,0,9,null,null,null,null,null,null,null,null,null,null,null,null,null,null,null,null,null,null,""]
["2007-12-11",null,"Jour",{"$f":"IF(A182=\"\",0,TEXT(DAY(A182),\"00\"))","v":"11"},null,null,{"$f":"D182","v":"11"},{"$f":"MOD(G182,10)","v":1},{"$f":"ROUNDDOWN(G182/10,0)","v":1},{"$f":"H182+I182","v":2},2,0,2,{"$f":"MOD(SUM(M182:M184),10)","v":4},{"$f":"ROUNDDOWN(SUM(M182:M184)/10,0)","v":1},{"$f":"N182+O182","v":5},{"$f":"MOD(SUM(P182:P184),10)","v":5},{"$f":"ROUNDDOWN(SUM(P182:P184)/10,0)","v":0},{"$f":"Q182+R182","v":5},null,"Porto","Besiktas","00:00:00",null,{"$f":"TEXT(HOUR(W182),\"00\")","v":"00"},{"$f":"TEXT(MINUTE($W182),\"00\")","v":"00"},{"$f":"IF(Y182>Z182,$U$1,IF(Z182>Y182,$V$1,IF(Y182=Z182,\"DRAW\")))","v":"DRAW"},null,{"$f":"INDIRECT(\"A\"&ROW())","v":"2007-12-11"},{"$f":"U182","v":"Porto"},{"$f":"V182","v":"Besiktas"},5]
[null,null,"Mois",{"$f":"IF(A182=\"\",0,TEXT(MONTH(A182),\"00\"))","v":"12"},null,null,{"$f":"D183","v":"12"},{"$f":"MOD(G183,10)","v":2},{"$f":"ROUNDDOWN(G183/10,0)","v":1},{"$f":"H183+I183","v":3},3,0,3,null,null,null,null,null,null,null,null,null,null,null,null,null,null,null,null,null,null,""]
[null,null,"Année",{"$f":"IF(A182=\"\",0,TEXT(YEAR(A182),\"00\"))","v":"2007"},{"$f":"D184","v":"2007"},{"$f":"MOD(E184,10)","v":7},{"$f":"MOD(ROUNDDOWN(E184/1000,0),10)","v":2},{"$f":"MOD(ROUNDDOWN(E184/100,0),10)","v":0},{"$f":"MOD(ROUNDDOWN(E184/10,0),100)","v":0},{"$f":"F184+G184+H184+I184","v":9},9,0,9,null,null,null,null,null,null,null,null,null,null,null,null,null,null,null,null,null,null,""]
["00:00:00",null,"Jour",{"$f":"IF(A185=\"\",0,TEXT(DAY(A185),\"00\"))","v":"00"},null,null,{"$f":"D185","v":"00"},{"$f":"MOD(G185,10)","v":0},{"$f":"ROUNDDOWN(G185/10,0)","v":0},{"$f":"H185+I185","v":0},0,0,0,{"$f":"MOD(SUM(M185:M187),10)","v":1},{"$f":"ROUNDDOWN(SUM(M185:M187)/10,0)","v":1},{"$f":"N185+O185","v":2},{"$f":"MOD(SUM(P185:P187),10)","v":2},{"$f":"ROUNDDOWN(SUM(P185:P187)/10,0)","v":0},{"$f":"Q185+R185","v":2},null,0,0,"00:00:00",null,{"$f":"TEXT(HOUR(W185),\"00\")","v":"00"},{"$f":"TEXT(MINUTE($W185),\"00\")","v":"00"},{"$f":"IF(Y185>Z185,$U$1,IF(Z185>Y185,$V$1,IF(Y185=Z185,\"DRAW\")))","v":"DRAW"},null,{"$f":"INDIRECT(\"A\"&ROW())","v":"00:00:00"},{"$f":"U185","v":0},{"$f":"V185","v":0},""]
[null,null,"Mois",{"$f":"IF(A185=\"\",0,TEXT(MONTH(A185),\"00\"))","v":"01"},null,null,{"$f":"D186","v":"01"},{"$f":"MOD(G186,10)","v":1},{"$f":"ROUNDDOWN(G186/10,0)","v":0},{"$f":"H186+I186","v":1},1,0,1,null,null,null,null,null,null,null,null,null,null,null,null,null,null,null,null,null,null,""]
[null,null,"Année",{"$f":"IF(A185=\"\",0,TEXT(YEAR(A185),\"00\"))","v":"1900"},{"$f":"D187","v":"1900"},{"$f":"MOD(E187,10)","v":0},{"$f":"MOD(ROUNDDOWN(E187/1000,0),10)","v":1},{"$f":"MOD(ROUNDDOWN(E187/100,0),10)","v":9},{"$f":"MOD(ROUNDDOWN(E187/10,0),100)","v":90},{"$f":"F187+G187+H187+I187","v":100},0,10,10,null,null,null,null,null,null,null,null,null,null,null,null,null,null,null,null,null,null,""]
["00:00:00",null,"Jour",{"$f":"IF(A188=\"\",0,TEXT(DAY(A188),\"00\"))","v":"00"},null,null,{"$f":"D188","v":"00"},{"$f":"MOD(G188,10)","v":0},{"$f":"ROUNDDOWN(G188/10,0)","v":0},{"$f":"H188+I188","v":0},0,0,0,{"$f":"MOD(SUM(M188:M190),10)","v":1},{"$f":"ROUNDDOWN(SUM(M188:M190)/10,0)","v":1},{"$f":"N188+O188","v":2},{"$f":"MOD(SUM(P188:P190),10)","v":2},{"$f":"ROUNDDOWN(SUM(P188:P190)/10,0)","v":0},{"$f":"Q188+R188","v":2},null,0,0,"00:00:00",null,{"$f":"TEXT(HOUR(W188),\"00\")","v":"00"},{"$f":"TEXT(MINUTE($W188),\"00\")","v":"00"},{"$f":"IF(Y188>Z188,$U$1,IF(Z188>Y188,$V$1,IF(Y188=Z188,\"DRAW\")))","v":"DRAW"},null,{"$f":"INDIRECT(\"A\"&ROW())","v":"00:00:00"},{"$f":"U188","v":0},{"$f":"V188","v":0},""]
[null,null,"Mois",{"$f":"IF(A188=\"\",0,TEXT(MONTH(A188),\"00\"))","v":"01"},null,null,{"$f":"D189","v":"01"},{"$f":"MOD(G189,10)","v":1},{"$f":"ROUNDDOWN(G189/10,0)","v":0},{"$f":"H189+I189","v":1},1,{"$f":"ROUNDDOWN(J189/10,0)","v":0},{"$f":"K189+L189","v":1},null,null,null,null,null,null,null,null,null,null,null,null,null,null,null,null,null,null,""]
[null,null,"Année",{"$f":"IF(A188=\"\",0,TEXT(YEAR(A188),\"00\"))","v":"1900"},{"$f":"D190","v":"1900"},{"$f":"MOD(E190,10)","v":0},{"$f":"MOD(ROUNDDOWN(E190/1000,0),10)","v":1},{"$f":"MOD(ROUNDDOWN(E190/100,0),10)","v":9},{"$f":"MOD(ROUNDDOWN(E190/10,0),100)","v":90},{"$f":"F190+G190+H190+I190","v":100},0,10,10,null,null,null,null,null,null,null,null,null,null,null,null,null,null,null,null,null,null,""]
["00:00:00",null,"Jour",{"$f":"IF(A191=\"\",0,TEXT(DAY(A191),\"00\"))","v":"00"},null,null,{"$f":"D191","v":"00"},{"$f":"MOD(G191,10)","v":0},{"$f":"ROUNDDOWN(G191/10,0)","v":0},{"$f":"H191+I191","v":0},0,0,0,{"$f":"MOD(SUM(M191:M193),10)","v":1},{"$f":"ROUNDDOWN(SUM(M191:M193)/10,0)","v":1},{"$f":"N191+O191","v":2},{"$f":"MOD(SUM(P191:P193),10)","v":2},{"$f":"ROUNDDOWN(SUM(P191:P193)/10,0)","v":0},{"$f":"Q191+R191","v":2},null,0,0,"00:00:00",null,{"$f":"TEXT(HOUR(W191),\"00\")","v":"00"},{"$f":"TEXT(MINUTE($W191),\"00\")","v":"00"},{"$f":"IF(Y191>Z191,$U$1,IF(Z191>Y191,$V$1,IF(Y191=Z191,\"DRAW\")))","v":"DRAW"},null,{"$f":"INDIRECT(\"A\"&ROW())","v":"00:00:00"},{"$f":"U191","v":0},{"$f":"V191","v":0},""]
[null,null,"Mois",{"$f":"IF(A191=\"\",0,TEXT(MONTH(A191),\"00\"))","v":"01"},null,null,{"$f":"D192","v":"01"},{"$f":"MOD(G192,10)","v":1},{"$f":"ROUNDDOWN(G192/10,0)","v":0},{"$f":"H192+I192","v":1},1,0,1,null,null,null,null,null,null,null,null,null,null,null,null,null,null,null,null,null,null,""]
[null,null,"Année",{"$f":"IF(A191=\"\",0,TEXT(YEAR(A191),\"00\"))","v":"1900"},{"$f":"D193","v":"1900"},{"$f":"MOD(E193,10)","v":0},{"$f":"MOD(ROUNDDOWN(E193/1000,0),10)","v":1},{"$f":"MOD(ROUNDDOWN(E193/100,0),10)","v":9},{"$f":"MOD(ROUNDDOWN(E193/10,0),100)","v":90},{"$f":"F193+G193+H193+I193","v":100},0,10,10,null,null,null,null,null,null,null,null,null,null,null,null,null,null,null,null,null,null,""]
["00:00:00",null,"Jour",{"$f":"IF(A194=\"\",0,TEXT(DAY(A194),\"00\"))","v":"00"},null,null,{"$f":"D194","v":"00"},{"$f":"MOD(G194,10)","v":0},{"$f":"ROUNDDOWN(G194/10,0)","v":0},{"$f":"H194+I194","v":0},{"$f":"MOD(J194,10)","v":0},0,0,{"$f":"MOD(SUM(M194:M196),10)","v":1},{"$f":"ROUNDDOWN(SUM(M194:M196)/10,0)","v":1},{"$f":"N194+O194","v":2},{"$f":"MOD(SUM(P194:P196),10)","v":2},{"$f":"ROUNDDOWN(SUM(P194:P196)/10,0)","v":0},{"$f":"Q194+R194","v":2},null,0,0,"00:00:00",null,{"$f":"TEXT(HOUR(W194),\"00\")","v":"00"},{"$f":"TEXT(MINUTE($W194),\"00\")","v":"00"},{"$f":"IF(Y194>Z194,$U$1,IF(Z194>Y194,$V$1,IF(Y194=Z194,\"DRAW\")))","v":"DRAW"},null,{"$f":"INDIRECT(\"A\"&ROW())","v":"00:00:00"},{"$f":"U194","v":0},{"$f":"V194","v":0},""]
[null,null,"Mois",{"$f":"IF(A194=\"\",0,TEXT(MONTH(A194),\"00\"))","v":"01"},null,null,{"$f":"D195","v":"01"},{"$f":"MOD(G195,10)","v":1},{"$f":"ROUNDDOWN(G195/10,0)","v":0},{"$f":"H195+I195","v":1},1,0,1,null,null,null,null,null,null,null,null,null,null,null,null,null,null,null,null,null,null,{"$f":"IF(AD195=0,\"\",S195)","v":""}]
[null,null,"Année",{"$f":"IF(A194=\"\",0,TEXT(YEAR(A194),\"00\"))","v":"1900"},{"$f":"D196","v":"1900"},{"$f":"MOD(E196,10)","v":0},{"$f":"MOD(ROUNDDOWN(E196/1000,0),10)","v":1},{"$f":"MOD(ROUNDDOWN(E196/100,0),10)","v":9},{"$f":"MOD(ROUNDDOWN(E196/10,0),100)","v":90},{"$f":"F196+G196+H196+I196","v":100},0,10,10,null,null,null,null,null,null,null,null,null,null,null,null,null,null,null,null,null,null,{"$f":"IF(AD196=0,\"\",S196)","v":""}]
["00:00:00",null,"Jour",{"$f":"IF(A197=\"\",0,TEXT(DAY(A197),\"00\"))","v":"00"},null,null,{"$f":"D197","v":"00"},{"$f":"MOD(G197,10)","v":0},{"$f":"ROUNDDOWN(G197/10,0)","v":0},{"$f":"H197+I197","v":0},0,0,0,{"$f":"MOD(SUM(M197:M199),10)","v":1},{"$f":"ROUNDDOWN(SUM(M197:M199)/10,0)","v":1},{"$f":"N197+O197","v":2},{"$f":"MOD(SUM(P197:P199),10)","v":2},{"$f":"ROUNDDOWN(SUM(P197:P199)/10,0)","v":0},{"$f":"Q197+R197","v":2},null,0,0,"00:00:00",null,{"$f":"TEXT(HOUR(W197),\"00\")","v":"00"},{"$f":"TEXT(MINUTE($W197),\"00\")","v":"00"},{"$f":"IF(Y197>Z197,$U$1,IF(Z197>Y197,$V$1,IF(Y197=Z197,\"DRAW\")))","v":"DRAW"},null,{"$f":"INDIRECT(\"A\"&ROW())","v":"00:00:00"},{"$f":"U197","v":0},{"$f":"V197","v":0},{"$f":"IF(AD197=0,\"\",S197)","v":""}]
[null,null,"Mois",{"$f":"IF(A197=\"\",0,TEXT(MONTH(A197),\"00\"))","v":"01"},null,null,{"$f":"D198","v":"01"},{"$f":"MOD(G198,10)","v":1},{"$f":"ROUNDDOWN(G198/10,0)","v":0},{"$f":"H198+I198","v":1},1,0,1,null,null,null,null,null,null,null,null,null,null,null,null,null,null,null,null,null,null,{"$f":"IF(AD198=0,\"\",S198)","v":""}]
[null,null,"Année",{"$f":"IF(A197=\"\",0,TEXT(YEAR(A197),\"00\"))","v":"1900"},{"$f":"D199","v":"1900"},{"$f":"MOD(E199,10)","v":0},{"$f":"MOD(ROUNDDOWN(E199/1000,0),10)","v":1},{"$f":"MOD(ROUNDDOWN(E199/100,0),10)","v":9},{"$f":"MOD(ROUNDDOWN(E199/10,0),100)","v":90},{"$f":"F199+G199+H199+I199","v":100},0,10,10,null,null,null,null,null,null,null,null,null,null,null,null,null,null,null,null,null,null,{"$f":"IF(AD199=0,\"\",S199)","v":""}]

{"sheet":"Nbre du Jour","index":2,"n_rows":11,"n_cols":22,"rows_kept":11,"cut":false,"hidden":true,"merged":[[10,21,26,25]]}
[{"$f":"TODAY()","v":"2018-02-27"},null,"Jour",{"$f":"IF(A1=\"\",0,TEXT(DAY(A1),\"00\"))","v":"27"},null,null,{"$f":"D1","v":"27"},{"$f":"MOD(G1,10)","v":7},{"$f":"ROUNDDOWN(G1/10,0)","v":2},{"$f":"H1+I1","v":9},{"$f":"MOD(J1,10)","v":9},{"$f":"ROUNDDOWN(J1/10,0)","v":0},{"$f":"K1+L1","v":9},{"$f":"MOD(SUM(M1:M3),10)","v":3},{"$f":"ROUNDDOWN(SUM(M1:M3)/10,0)","v":1},{"$f":"N1+O1","v":4},{"$f":"MOD(SUM(P1:P3),10)","v":4},{"$f":"ROUNDDOWN(SUM(P1:P3)/10,0)","v":0},{"$f":"Q1+R1","v":4}]
[null,null,"Mois",{"$f":"IF(A1=\"\",0,TEXT(MONTH(A1),\"00\"))","v":"02"},null,null,{"$f":"D2","v":"02"},{"$f":"MOD(G2,10)","v":2},{"$f":"ROUNDDOWN(G2/10,0)","v":0},{"$f":"H2+I2","v":2},{"$f":"MOD(J2,10)","v":2},{"$f":"ROUNDDOWN(J2/10,0)","v":0},{"$f":"K2+L2","v":2}]
[null,null,"Année",{"$f":"IF(A1=\"\",0,TEXT(YEAR(A1),\"00\"))","v":"2018"},{"$f":"D3","v":"2018"},{"$f":"MOD(E3,10)","v":8},{"$f":"MOD(ROUNDDOWN(E3/1000,0),10)","v":2},{"$f":"MOD(ROUNDDOWN(E3/100,0),10)","v":0},{"$f":"MOD(ROUNDDOWN(E3/10,0),100)","v":1},{"$f":"F3+G3+H3+I3","v":11},{"$f":"MOD(J3,10)","v":1},{"$f":"ROUNDDOWN(J3/10,0)","v":1},{"$f":"K3+L3","v":2}]
[]
[]
[]
[]
[]
[]
[]
[null,null,null,null,null,null,null,null,null,null,null,null,null,null,null,null,null,null,null,null,null,{"$f":"S1","v":4}]

{"sheet":"Bibli.","index":3,"n_rows":731,"n_cols":9,"rows_kept":731,"cut":false,"hidden":true,"merged":[]}
[null,null,"Z/Chiffre","ZONE",null,"X","Y","Z","ZONE"]
["PSG","Chelsea",1,"X",null,"X","Z","Chiffre ","ZONE"]
["PSG","Chelsea",6,"X",null,1,1,1,"Y"]
[null,null,null,null,null,2,2,2,"Y"]
[null,null,null,null,null,3,3,3,"Y"]
[null,null,null,null,null,4,4,4,"Y"]
[null,null,null,null,null,5,5,5,"Y"]
[null,null,null,null,null,6,6,6,"Y"]
[null,null,null,null,null,7,7,7,"Y"]
[null,null,null,null,null,8,8,8,"Y"]
[null,null,null,null,null,9,9,9,"Y"]
[null,null,null,null,null,1,1,2,"Y"]
[null,null,null,null,null,1,1,3,"X"]
[null,null,null,null,null,1,1,4,"Z"]
[null,null,null,null,null,1,1,5,"X"]
[null,null,null,null,null,1,1,6,"X"]
[null,null,null,"X",null,1,1,7,"Z"]
[null,null,null,"Y",null,1,1,8,"X"]
[null,null,null,"Z",null,1,1,9,"Y"]
[null,null,null,null,null,1,2,1,"X"]
[null,null,null,null,null,1,2,2,"X"]
[null,null,null,null,null,1,2,3,"X"]
[null,null,null,null,null,1,2,4,"X"]
[null,null,null,null,null,1,2,5,"X"]
["Augsburg",null,null,null,null,1,2,6,"Y"]
[null,null,null,null,null,1,2,7,"X"]
[null,null,null,null,null,1,2,8,"X"]
[null,null,null,null,null,1,2,9,"X"]
[null,null,null,null,null,1,3,1,"X"]
[null,null,null,null,null,1,3,2,"Y"]
[null,null,null,null,null,1,3,3,"Z"]
[null,null,null,null,null,1,3,4,"Z"]
[null,null,null,null,null,1,3,5,"Y"]
[null,null,null,null,null,1,3,6,"X"]
[null,null,null,null,null,1,3,7,"Y"]
[null,null,null,null,null,1,3,8,"X"]
[null,null,null,null,null,1,3,9,"X"]
[null,null,null,null,null,1,4,1,"X"]
[null,null,null,null,null,1,4,2,"X"]
[null,null,null,null,null,1,4,3,"Z"]
[null,null,null,null,null,1,4,4,"Z"]
[null,null,null,null,null,1,4,5,"Z"]
[null,null,null,null,null,1,4,6,"Z"]
[null,null,null,null,null,1,4,7,"Y"]
[null,null,null,null,null,1,4,8,"X"]
[null,null,null,null,null,1,4,9,"X"]
[null,null,null,null,null,1,5,1,"X"]
[null,null,null,null,null,1,5,2,"X"]
[null,null,null,null,null,1,5,3,"Y"]
[null,null,null,null,null,1,5,4,"Z"]
[null,null,null,null,null,1,5,5,"Z"]
[null,null,null,null,null,1,5,6,"Z"]
[null,null,null,null,null,1,5,7,"Z"]
[null,null,null,null,null,1,5,8,"X"]
[null,null,null,null,null,1,5,9,"X"]
[null,null,null,null,null,1,6,1,"X"]
[null,null,null,null,null,1,6,2,"X"]
[null,null,null,null,null,1,6,3,"X"]
[null,null,null,null,null,1,6,4,"Z"]
[null,null,null,null,null,1,6,5,"Z"]
[null,null,null,null,null,1,6,6,"Z"]
[null,null,null,null,null,1,6,7,"Z"]
[null,null,null,null,null,1,6,8,"Z"]
[null,null,null,null,null,1,6,9,"Z"]
[null,null,null,null,null,1,7,1,"X"]
[null,null,null,null,null,1,7,2,"X"]
[null,null,null,null,null,1,7,3,"X"]
[null,null,null,null,null,1,7,4,"Y"]
[null,null,null,null,null,1,7,5,"Z"]
[null,null,null,null,null,1,7,6,"Z"]
[null,null,null,null,null,1,7,7,"Z"]
[null,null,null,null,null,1,7,8,"Z"]
[null,null,null,null,null,1,7,9,"Z"]
[null,null,null,null,null,1,8,1,"X"]
[null,null,null,null,null,1,8,2,"X"]
[null,null,null,null,null,1,8,3,"X"]
[null,null,null,null,null,1,8,4,"X"]
[null,null,null,null,null,1,8,5,"Y"]
[null,null,null,null,null,1,8,6,"Z"]
[null,null,null,null,null,1,8,7,"Z"]
[null,null,null,null,null,1,8,8,"Z"]
[null,null,null,null,null,1,8,9,"Y"]
[null,null,null,null,null,1,9,1,"X"]
[null,null,null,null,null,1,9,2,"X"]
[null,null,null,null,null,1,9,3,"X"]
[null,null,null,null,null,1,9,4,"X"]
[null,null,null,null,null,1,9,5,"Y"]
[null,null,null,null,null,1,9,6,"Z"]
[null,null,null,null,null,1,9,7,"Z"]
[null,null,null,null,null,1,9,8,"Z"]
[null,null,null,null,null,1,9,9,"Z"]
[null,null,null,null,null,2,1,1,"Z"]
[null,null,null,null,null,2,1,2,"X"]
[null,null,null,null,null,2,1,3,"X"]
[null,null,null,null,null,2,1,4,"X"]
[null,null,null,null,null,2,1,5,"X"]
[null,null,null,null,null,2,1,6,"Y"]
[null,null,null,null,null,2,1,7,"Z"]
[null,null,null,null,null,2,1,8,"Z"]
[null,null,null,null,null,2,1,9,"Z"]
[null,null,null,null,null,2,2,1,"Y"]
[null,null,null,null,null,2,2,3,"Y"]
[null,null,null,null,null,2,2,4,"X"]
[null,null,null,null,null,2,2,5,"Z"]
[null,null,null,null,null,2,2,6,"X"]
[null,null,null,null,null,2,2,7,"X"]
[null,null,null,null,null,2,2,8,"Z"]
[null,null,null,null,null,2,2,9,"X"]
[null,null,null,null,null,2,3,1,"X"]
[null,null,null,null,null,2,3,2,"X"]
[null,null,null,null,null,2,3,3,"Z"]
[null,null,null,null,null,2,3,4,"Z"]
[null,null,null,null,null,2,3,5,"Z"]
[null,null,null,null,null,2,3,6,"Z"]
[null,null,null,null,null,2,3,7,"Y"]
[null,null,null,null,null,2,3,8,"X"]
[null,null,null,null,null,2,3,9,"X"]
[null,null,null,null,null,2,4,1,"X"]
[null,null,null,null,null,2,4,2,"X"]
[null,null,null,null,null,2,4,3,"Y"]
[null,null,null,null,null,2,4,4,"Z"]
[null,null,null,null,null,2,4,5,"Z"]
[null,null,null,null,null,2,4,6,"Z"]
[null,null,null,null,null,2,4,7,"Z"]
[null,null,null,null,null,2,4,8,"X"]
[null,null,null,null,null,2,4,9,"X"]
[null,null,null,null,null,2,5,1,"X"]
[null,null,null,null,null,2,5,2,"X"]
[null,null,null,null,null,2,5,3,"X"]
[null,null,null,null,null,2,5,4,"Z"]
[null,null,null,null,null,2,5,5,"Z"]
[null,null,null,null,null,2,5,6,"Z"]
[null,null,null,null,null,2,5,7,"Z"]
[null,null,null,null,null,2,5,8,"Y"]
[null,null,null,null,null,2,5,9,"X"]
[null,null,null,null,null,2,6,1,"X"]
[null,null,null,null,null,2,6,2,"X"]
[null,null,null,null,null,2,6,3,"X"]
[null,null,null,null,null,2,6,4,"Y"]
[null,null,null,null,null,2,6,5,"Z"]
[null,null,null,null,null,2,6,6,"Z"]
[null,null,null,null,null,2,6,7,"Z"]
[null,null,null,null,null,2,6,8,"Z"]
[null,null,null,null,null,2,6,9,"Z"]
[null,null,null,null,null,2,7,1,"X"]
[null,null,null,null,null,2,7,2,"X"]
[null,null,null,null,null,2,7,3,"X"]
[null,null,null,null,null,2,7,4,"X"]
[null,null,null,null,null,2,7,5,"Z"]
[null,null,null,null,null,2,7,6,"Z"]
[null,null,null,null,null,2,7,7,"Z"]
[null,null,null,null,null,2,7,8,"Z"]
[null,null,null,null,null,2,7,9,"Y"]
[null,null,null,null,null,2,8,1,"X"]
[null,null,null,null,null,2,8,2,"X"]
[null,null,null,null,null,2,8,3,"X"]
[null,null,null,null,null,2,8,4,"X"]
[null,null,null,null,null,2,8,5,"Y"]
[null,null,null,null,null,2,8,6,"Z"]
[null,null,null,null,null,2,8,7,"Z"]
[null,null,null,null,null,2,8,8,"Z"]
[null,null,null,null,null,2,8,9,"Z"]
[null,null,null,null,null,2,9,1,"Y"]
[null,null,null,null,null,2,9,2,"X"]
[null,null,null,null,null,2,9,3,"X"]
[null,null,null,null,null,2,9,4,"X"]
[null,null,null,null,null,2,9,5,"X"]
[null,null,null,null,null,2,9,6,"Z"]
[null,null,null,null,null,2,9,7,"Z"]
[null,null,null,null,null,2,9,8,"Z"]
[null,null,null,null,null,2,9,9,"Z"]
[null,null,null,null,null,3,1,1,"Z"]
[null,null,null,null,null,3,1,2,"Y"]
[null,null,null,null,null,3,1,3,"X"]
[null,null,null,null,null,3,1,4,"X"]
[null,null,null,null,null,3,1,5,"X"]
[null,null,null,null,null,3,1,6,"X"]
[null,null,null,null,null,3,1,7,"Z"]
[null,null,null,null,null,3,1,8,"Z"]
[null,null,null,null,null,3,1,9,"Z"]
[null,null,null,null,null,3,2,1,"Z"]
[null,null,null,null,null,3,2,2,"Z"]
[null,null,null,null,null,3,2,3,"X"]
[null,null,null,null,null,3,2,4,"X"]
[null,null,null,null,null,3,2,5,"X"]
[null,null,null,null,null,3,2,6,"X"]
[null,null,null,null,null,3,2,7,"Y"]
[null,null,null,null,null,3,2,8,"Z"]
[null,null,null,null,null,3,2,9,"Z"]
[null,null,null,null,null,3,3,1,"X"]
[null,null,null,null,null,3,3,2,"Y"]
[null,null,null,null,null,3,3,4,"Y"]
[null,null,null,null,null,3,3,5,"X"]
[null,null,null,null,null,3,3,6,"Z"]
[null,null,null,null,null,3,3,7,"X"]
[null,null,null,null,null,3,3,8,"X"]
[null,null,null,null,null,3,3,9,"Z"]
[null,null,null,null,null,3,4,1,"X"]
[null,null,null,null,null,3,4,2,"X"]
[null,null,null,null,null,3,4,3,"X"]
[null,null,null,null,null,3,4,4,"Z"]
[null,null,null,null,null,3,4,5,"Z"]
[null,null,null,null,null,3,4,6,"Z"]
[null,null,null,null,null,3,4,7,"Z"]
[null,null,null,null,null,3,4,8,"Y"]
[null,null,null,null,null,3,4,9,"X"]
[null,null,null,null,null,3,5,1,"X"]
[null,null,null,null,null,3,5,2,"X"]
[null,null,null,null,null,3,5,3,"X"]
[null,null,null,null,null,3,5,4,"Y"]
[null,null,null,null,null,3,5,5,"Z"]
[null,null,null,null,null,3,5,6,"Z"]
[null,null,null,null,null,3,5,7,"Z"]
[null,null,null,null,null,3,5,8,"Z"]
[null,null,null,null,null,3,5,9,"X"]
[null,null,null,null,null,3,6,1,"X"]
[null,null,null,null,null,3,6,2,"X"]
[null,null,null,null,null,3,6,3,"X"]
[null,null,null,null,null,3,6,4,"X"]
[null,null,null,null,null,3,6,5,"Z"]
[null,null,null,null,null,3,6,6,"Z"]
[null,null,null,null,null,3,6,7,"Z"]
[null,null,null,null,null,3,6,8,"Z"]
[null,null,null,null,null,3,6,9,"Y"]
[null,null,null,null,null,3,7,1,"X"]
[null,null,null,null,null,3,7,2,"X"]
[null,null,null,null,null,3,7,3,"X"]
[null,null,null,null,null,3,7,4,"X"]
[null,null,null,null,null,3,7,5,"Y"]
[null,null,null,null,null,3,7,6,"Z"]
[null,null,null,null,null,3,7,7,"Z"]
[null,null,null,null,null,3,7,8,"Z"]
[null,null,null,null,null,3,7,9,"Z"]
[null,null,null,null,null,3,8,1,"Y"]
[null,null,null,null,null,3,8,2,"X"]
[null,null,null,null,null,3,8,3,"X"]
[null,null,null,null,null,3,8,4,"X"]
[null,null,null,null,null,3,8,5,"X"]
[null,null,null,null,null,3,8,6,"Z"]
[null,null,null,null,null,3,8,7,"Z"]
[null,null,null,null,null,3,8,8,"Z"]
[null,null,null,null,null,3,8,9,"Z"]
[null,null,null,null,null,3,9,1,"Z"]
[null,null,null,null,null,3,9,2,"Z"]
[null,null,null,null,null,3,9,3,"X"]
[null,null,null,null,null,3,9,4,"X"]
[null,null,null,null,null,3,9,5,"X"]
[null,null,null,null,null,3,9,6,"Y"]
[null,null,null,null,null,3,9,7,"Z"]
[null,null,null,null,null,3,9,8,"Z"]
[null,null,null,null,null,3,9,9,"Z"]
[null,null,null,null,null,4,1,1,"Z"]
[null,null,null,null,null,4,1,2,"Z"]
[null,null,null,null,null,4,1,3,"Z"]
[null,null,null,null,null,4,1,4,"X"]
[null,null,null,null,null,4,1,5,"X"]
[null,null,null,null,null,4,1,6,"X"]
[null,null,null,null,null,4,1,7,"Y"]
[null,null,null,null,null,4,1,8,"Z"]
[null,null,null,null,null,4,1,9,"Z"]
[null,null,null,null,null,4,2,1,"Z"]
[null,null,null,null,null,4,2,2,"Z"]
[null,null,null,null,null,4,2,3,"Y"]
[null,null,null,null,null,4,2,4,"X"]
[null,null,null,null,null,4,2,5,"X"]
[null,null,null,null,null,4,2,6,"X"]
[null,null,null,null,null,4,2,7,"X"]
[null,null,null,null,null,4,2,8,"Z"]
[null,null,null,null,null,4,2,9,"Z"]
[null,null,null,null,null,4,3,1,"Z"]
[null,null,null,null,null,4,3,2,"Z"]
[null,null,null,null,null,4,3,3,"Z"]
[null,null,null,null,null,4,3,4,"X"]
[null,null,null,null,null,4,3,5,"X"]
[null,null,null,null,null,4,3,6,"X"]
[null,null,null,null,null,4,3,7,"X"]
[null,null,null,null,null,4,3,8,"Y"]
[null,null,null,null,null,4,3,9,"Z"]
[null,null,null,null,null,4,4,1,"X"]
[null,null,null,null,null,4,4,2,"X"]
[null,null,null,null,null,4,4,3,"Y"]
[null,null,null,null,null,4,4,5,"Y"]
[null,null,null,null,null,4,4,6,"X"]
[null,null,null,null,null,4,4,7,"Z"]
[null,null,null,null,null,4,4,8,"X"]
[null,null,null,null,null,4,4,9,"X"]
[null,null,null,null,null,4,5,1,"X"]
[null,null,null,null,null,4,5,2,"X"]
[null,null,null,null,null,4,5,3,"X"]
[null,null,null,null,null,4,5,4,"X"]
[null,null,null,null,null,4,5,5,"Z"]
[null,null,null,null,null,4,5,6,"Z"]
[null,null,null,null,null,4,5,7,"Z"]
[null,null,null,null,null,4,5,8,"Z"]
[null,null,null,null,null,4,5,9,"Y"]
[null,null,null,null,null,4,6,1,"X"]
[null,null,null,null,null,4,6,2,"X"]
[null,null,null,null,null,4,6,3,"X"]
[null,null,null,null,null,4,6,4,"X"]
[null,null,null,null,null,4,6,5,"Y"]
[null,null,null,null,null,4,6,6,"Z"]
[null,null,null,null,null,4,6,7,"Z"]
[null,null,null,null,null,4,6,8,"Z"]
[null,null,null,null,null,4,6,9,"Z"]
[null,null,null,null,null,4,7,1,"Y"]
[null,null,null,null,null,4,7,2,"X"]
[null,null,null,null,null,4,7,3,"X"]
[null,null,null,null,null,4,7,4,"X"]
[null,null,null,null,null,4,7,5,"Z"]
[null,null,null,null,null,4,7,6,"Z"]
[null,null,null,null,null,4,7,7,"Z"]
[null,null,null,null,null,4,7,8,"Z"]
[null,null,null,null,null,4,7,9,"Z"]
[null,null,null,null,null,4,8,1,"Z"]
[null,null,null,null,null,4,8,2,"X"]
[null,null,null,null,null,4,8,3,"X"]
[null,null,null,null,null,4,8,4,"X"]
[null,null,null,null,null,4,8,5,"X"]
[null,null,null,null,null,4,8,6,"Y"]
[null,null,null,null,null,4,8,7,"Z"]
[null,null,null,null,null,4,8,8,"Z"]
[null,null,null,null,null,4,8,9,"Z"]
[null,null,null,null,null,4,9,1,"Z"]
[null,null,null,null,null,4,9,2,"Y"]
[null,null,null,null,null,4,9,3,"X"]
[null,null,null,null,null,4,9,4,"X"]
[null,null,null,null,null,4,9,5,"X"]
[null,null,null,null,null,4,9,6,"X"]
[null,null,null,null,null,4,9,7,"Z"]
[null,null,null,null,null,4,9,8,"Z"]
[null,null,null,null,null,4,9,9,"Z"]
[null,null,null,null,null,5,1,1,"Z"]
[null,null,null,null,null,5,1,2,"Z"]
[null,null,null,null,null,5,1,3,"Y"]
[null,null,null,null,null,5,1,4,"X"]
[null,null,null,null,null,5,1,5,"X"]
[null,null,null,null,null,5,1,6,"X"]
[null,null,null,null,null,5,1,7,"X"]
[null,null,null,null,null,5,1,8,"Z"]
[null,null,null,null,null,5,1,9,"Z"]
[null,null,null,null,null,5,2,1,"Z"]
[null,null,null,null,null,5,2,2,"Z"]
[null,null,null,null,null,5,2,3,"Z"]
[null,null,null,null,null,5,2,4,"X"]
[null,null,null,null,null,5,2,5,"X"]
[null,null,null,null,null,5,2,6,"X"]
[null,null,null,null,null,5,2,7,"X"]
[null,null,null,null,null,5,2,8,"Y"]
[null,null,null,null,null,5,2,9,"Z"]
[null,null,null,null,null,5,3,1,"Z"]
[null,null,null,null,null,5,3,2,"Z"]
[null,null,null,null,null,5,3,3,"Z"]
[null,null,null,null,null,5,3,4,"Y"]
[null,null,null,null,null,5,3,5,"X"]
[null,null,null,null,null,5,3,6,"X"]
[null,null,null,null,null,5,3,7,"X"]
[null,null,null,null,null,5,3,8,"X"]
[null,null,null,null,null,5,3,9,"Z"]
[null,null,null,null,null,5,4,1,"Z"]
[null,null,null,null,null,5,4,2,"Z"]
[null,null,null,null,null,5,4,3,"Z"]
[null,null,null,null,null,5,4,4,"Z"]
[null,null,null,null,null,5,4,5,"X"]
[null,null,null,null,null,5,4,6,"X"]
[null,null,null,null,null,5,4,7,"X"]
[null,null,null,null,null,5,4,8,"X"]
[null,null,null,null,null,5,4,9,"Y"]
[null,null,null,null,null,5,5,1,"X"]
[null,null,null,null,null,5,5,2,"X"]
[null,null,null,null,null,5,5,3,"X"]
[null,null,null,null,null,5,5,4,"Y"]
[null,null,null,null,null,5,5,6,"Y"]
[null,null,null,null,null,5,5,7,"X"]
[null,null,null,null,null,5,5,8,"Z"]
[null,null,null,null,null,5,5,9,"X"]
[null,null,null,null,null,5,6,1,"Y"]
[null,null,null,null,null,5,6,2,"X"]
[null,null,null,null,null,5,6,3,"X"]
[null,null,null,null,null,5,6,4,"X"]
[null,null,null,null,null,5,6,5,"X"]
[null,null,null,null,null,5,6,6,"Z"]
[null,null,null,null,null,5,6,7,"Z"]
[null,null,null,null,null,5,6,8,"Z"]
[null,null,null,null,null,5,6,9,"Z"]
[null,null,null,null,null,5,7,1,"Z"]
[null,null,null,null,null,5,7,2,"X"]
[null,null,null,null,null,5,7,3,"X"]
[null,null,null,null,null,5,7,4,"X"]
[null,null,null,null,null,5,7,5,"X"]
[null,null,null,null,null,5,7,6,"Y"]
[null,null,null,null,null,5,7,7,"Z"]
[null,null,null,null,null,5,7,8,"Z"]
[null,null,null,null,null,5,7,9,"Z"]
[null,null,null,null,null,5,8,1,"Z"]
[null,null,null,null,null,5,8,2,"Y"]
[null,null,null,null,null,5,8,3,"X"]
[null,null,null,null,null,5,8,4,"X"]
[null,null,null,null,null,5,8,5,"X"]
[null,null,null,null,null,5,8,6,"X"]
[null,null,null,null,null,5,8,7,"Z"]
[null,null,null,null,null,5,8,8,"Z"]
[null,null,null,null,null,5,8,9,"Z"]
[null,null,null,null,null,5,9,1,"Z"]
[null,null,null,null,null,5,9,2,"Z"]
[null,null,null,null,null,5,9,3,"X"]
[null,null,null,null,null,5,9,4,"X"]
[null,null,null,null,null,5,9,5,"X"]
[null,null,null,null,null,5,9,6,"X"]
[null,null,null,null,null,5,9,7,"Y"]
[null,null,null,null,null,5,9,8,"X"]
[null,null,null,null,null,5,9,9,"X"]
[null,null,null,null,null,6,1,1,"X"]
[null,null,null,null,null,6,1,2,"X"]
[null,null,null,null,null,6,1,3,"X"]
[null,null,null,null,null,6,1,4,"X"]
[null,null,null,null,null,6,1,5,"X"]
[null,null,null,null,null,6,1,6,"X"]
[null,null,null,null,null,6,1,7,"X"]
[null,null,null,null,null,6,1,8,"Y"]
[null,null,null,null,null,6,1,9,"Z"]
[null,null,null,null,null,6,2,1,"Z"]
[null,null,null,null,null,6,2,2,"Z"]
[null,null,null,null,null,6,2,3,"Z"]
[null,null,null,null,null,6,2,4,"Y"]
[null,null,null,null,null,6,2,5,"X"]
[null,null,null,null,null,6,2,6,"X"]
[null,null,null,null,null,6,2,7,"X"]
[null,null,null,null,null,6,2,8,"X"]
[null,null,null,null,null,6,2,9,"X"]
[null,null,null,null,null,6,3,1,"Z"]
[null,null,null,null,null,6,3,2,"Z"]
[null,null,null,null,null,6,3,3,"Z"]
[null,null,null,null,null,6,3,4,"Z"]
[null,null,null,null,null,6,3,5,"X"]
[null,null,null,null,null,6,3,6,"X"]
[null,null,null,null,null,6,3,7,"X"]
[null,null,null,null,null,6,3,8,"X"]
[null,null,null,null,null,6,3,9,"Y"]
[null,null,null,null,null,6,4,1,"Z"]
[null,null,null,null,null,6,4,2,"Z"]
[null,null,null,null,null,6,4,3,"Z"]
[null,null,null,null,null,6,4,4,"Z"]
[null,null,null,null,null,6,4,5,"Y"]
[null,null,null,null,null,6,4,6,"X"]
[null,null,null,null,null,6,4,7,"X"]
[null,null,null,null,null,6,4,8,"X"]
[null,null,null,null,null,6,4,9,"X"]
[null,null,null,null,null,6,5,1,"Y"]
[null,null,null,null,null,6,5,2,"Z"]
[null,null,null,null,null,6,5,3,"Z"]
[null,null,null,null,null,6,5,4,"Z"]
[null,null,null,null,null,6,5,5,"Z"]
[null,null,null,null,null,6,5,6,"X"]
[null,null,null,null,null,6,5,7,"X"]
[null,null,null,null,null,6,5,8,"X"]
[null,null,null,null,null,6,5,9,"X"]
[null,null,null,null,null,6,6,1,"X"]
[null,null,null,null,null,6,6,2,"X"]
[null,null,null,null,null,6,6,3,"X"]
[null,null,null,null,null,6,6,4,"X"]
[null,null,null,null,null,6,6,5,"Y"]
[null,null,null,null,null,6,6,7,"Y"]
[null,null,null,null,null,6,6,8,"X"]
[null,null,null,null,null,6,6,9,"Z"]
[null,null,null,null,null,6,7,1,"Z"]
[null,null,null,null,null,6,7,2,"Y"]
[null,null,null,null,null,6,7,3,"X"]
[null,null,null,null,null,6,7,4,"X"]
[null,null,null,null,null,6,7,5,"X"]
[null,null,null,null,null,6,7,6,"X"]
[null,null,null,null,null,6,7,7,"Z"]
[null,null,null,null,null,6,7,8,"Z"]
[null,null,null,null,null,6,7,9,"Z"]
[null,null,null,null,null,6,8,1,"Z"]
[null,null,null,null,null,6,8,2,"Z"]
[null,null,null,null,null,6,8,3,"X"]
[null,null,null,null,null,6,8,4,"X"]
[null,null,null,null,null,6,8,5,"X"]
[null,null,null,null,null,6,8,6,"X"]
[null,null,null,null,null,6,8,7,"Y"]
[null,null,null,null,null,6,8,8,"Z"]
[null,null,null,null,null,6,8,9,"Z"]
[null,null,null,null,null,6,9,1,"Z"]
[null,null,null,null,null,6,9,2,"Z"]
[null,null,null,null,null,6,9,3,"Y"]
[null,null,null,null,null,6,9,4,"X"]
[null,null,null,null,null,6,9,5,"X"]
[null,null,null,null,null,6,9,6,"X"]
[null,null,null,null,null,6,9,7,"X"]
[null,null,null,null,null,6,9,8,"Z"]
[null,null,null,null,null,6,9,9,"Z"]
[null,null,null,null,null,7,1,1,"Z"]
[null,null,null,null,null,7,1,2,"Z"]
[null,null,null,null,null,7,1,3,"Z"]
[null,null,null,null,null,7,1,4,"Y"]
[null,null,null,null,null,7,1,5,"X"]
[null,null,null,null,null,7,1,6,"X"]
[null,null,null,null,null,7,1,7,"X"]
[null,null,null,null,null,7,1,8,"X"]
[null,null,null,null,null,7,1,9,"Z"]
[null,null,null,null,null,7,2,1,"Z"]
[null,null,null,null,null,7,2,2,"Z"]
[null,null,null,null,null,7,2,3,"Z"]
[null,null,null,null,null,7,2,4,"Z"]
[null,null,null,null,null,7,2,5,"Z"]
[null,null,null,null,null,7,2,6,"X"]
[null,null,null,null,null,7,2,7,"X"]
[null,null,null,null,null,7,2,8,"X"]
[null,null,null,null,null,7,2,9,"Y"]
[null,null,null,null,null,7,3,1,"Z"]
[null,null,null,null,null,7,3,2,"Z"]
[null,null,null,null,null,7,3,3,"Z"]
[null,null,null,null,null,7,3,4,"Z"]
[null,null,null,null,null,7,3,5,"Y"]
[null,null,null,null,null,7,3,6,"X"]
[null,null,null,null,null,7,3,7,"X"]
[null,null,null,null,null,7,3,8,"X"]
[null,null,null,null,null,7,3,9,"X"]
[null,null,null,null,null,7,4,1,"Y"]
[null,null,null,null,null,7,4,2,"Z"]
[null,null,null,null,null,7,4,3,"Z"]
[null,null,null,null,null,7,4,4,"Z"]
[null,null,null,null,null,7,4,5,"Z"]
[null,null,null,null,null,7,4,6,"X"]
[null,null,null,null,null,7,4,7,"X"]
[null,null,null,null,null,7,4,8,"X"]
[null,null,null,null,null,7,4,9,"X"]
[null,null,null,null,null,7,5,1,"X"]
[null,null,null,null,null,7,5,2,"Z"]
[null,null,null,null,null,7,5,3,"Z"]
[null,null,null,null,null,7,5,4,"Z"]
[null,null,null,null,null,7,5,5,"Z"]
[null,null,null,null,null,7,5,6,"Y"]
[null,null,null,null,null,7,5,7,"X"]
[null,null,null,null,null,7,5,8,"X"]
[null,null,null,null,null,7,5,9,"X"]
[null,null,null,null,null,7,6,1,"X"]
[null,null,null,null,null,7,6,2,"Y"]
[null,null,null,null,null,7,6,3,"Z"]
[null,null,null,null,null,7,6,4,"Z"]
[null,null,null,null,null,7,6,5,"Z"]
[null,null,null,null,null,7,6,6,"Z"]
[null,null,null,null,null,7,6,7,"X"]
[null,null,null,null,null,7,6,8,"X"]
[null,null,null,null,null,7,6,9,"X"]
[null,null,null,null,null,7,7,1,"X"]
[null,null,null,null,null,7,7,2,"X"]
[null,null,null,null,null,7,7,3,"X"]
[null,null,null,null,null,7,7,4,"X"]
[null,null,null,null,null,7,7,5,"X"]
[null,null,null,null,null,7,7,6,"Y"]
[null,null,null,null,null,7,7,8,"Y"]
[null,null,null,null,null,7,7,9,"X"]
[null,null,null,null,null,7,8,1,"Z"]
[null,null,null,null,null,7,8,2,"Z"]
[null,null,null,null,null,7,8,3,"Y"]
[null,null,null,null,null,7,8,4,"X"]
[null,null,null,null,null,7,8,5,"X"]
[null,null,null,null,null,7,8,6,"X"]
[null,null,null,null,null,7,8,7,"X"]
[null,null,null,null,null,7,8,8,"Z"]
[null,null,null,null,null,7,8,9,"Z"]
[null,null,null,null,null,7,9,1,"Z"]
[null,null,null,null,null,7,9,2,"Z"]
[null,null,null,null,null,7,9,3,"Z"]
[null,null,null,null,null,7,9,4,"X"]
[null,null,null,null,null,7,9,5,"X"]
[null,null,null,null,null,7,9,6,"X"]
[null,null,null,null,null,7,9,7,"X"]
[null,null,null,null,null,7,9,8,"Y"]
[null,null,null,null,null,7,9,9,"Z"]
[null,null,null,null,null,8,1,1,"Z"]
[null,null,null,null,null,8,1,2,"Z"]
[null,null,null,null,null,8,1,3,"Z"]
[null,null,null,null,null,8,1,4,"Z"]
[null,null,null,null,null,8,1,5,"X"]
[null,null,null,null,null,8,1,6,"X"]
[null,null,null,null,null,8,1,7,"X"]
[null,null,null,null,null,8,1,8,"X"]
[null,null,null,null,null,8,1,9,"Y"]
[null,null,null,null,null,8,2,1,"Z"]
[null,null,null,null,null,8,2,2,"Z"]
[null,null,null,null,null,8,2,3,"Z"]
[null,null,null,null,null,8,2,4,"Z"]
[null,null,null,null,null,8,2,5,"Y"]
[null,null,null,null,null,8,2,6,"X"]
[null,null,null,null,null,8,2,7,"X"]
[null,null,null,null,null,8,2,8,"X"]
[null,null,null,null,null,8,2,9,"X"]
[null,null,null,null,null,8,3,1,"Y"]
[null,null,null,null,null,8,3,2,"Z"]
[null,null,null,null,null,8,3,3,"Z"]
[null,null,null,null,null,8,3,4,"Z"]
[null,null,null,null,null,8,3,5,"Z"]
[null,null,null,null,null,8,3,6,"X"]
[null,null,null,null,null,8,3,7,"X"]
[null,null,null,null,null,8,3,8,"X"]
[null,null,null,null,null,8,3,9,"X"]
[null,null,null,null,null,8,4,1,"X"]
[null,null,null,null,null,8,4,2,"Z"]
[null,null,null,null,null,8,4,3,"Z"]
[null,null,null,null,null,8,4,4,"Z"]
[null,null,null,null,null,8,4,5,"Z"]
[null,null,null,null,null,8,4,6,"Y"]
[null,null,null,null,null,8,4,7,"X"]
[null,null,null,null,null,8,4,8,"X"]
[null,null,null,null,null,8,4,9,"X"]
[null,null,null,null,null,8,5,1,"X"]
[null,null,null,null,null,8,5,2,"Y"]
[null,null,null,null,null,8,5,3,"Z"]
[null,null,null,null,null,8,5,4,"Z"]
[null,null,null,null,null,8,5,5,"Z"]
[null,null,null,null,null,8,5,6,"Z"]
[null,null,null,null,null,8,5,7,"X"]
[null,null,null,null,null,8,5,8,"X"]
[null,null,null,null,null,8,5,9,"X"]
[null,null,null,null,null,8,6,1,"X"]
[null,null,null,null,null,8,6,2,"X"]
[null,null,null,null,null,8,6,3,"Z"]
[null,null,null,null,null,8,6,4,"Z"]
[null,null,null,null,null,8,6,5,"Z"]
[null,null,null,null,null,8,6,6,"Z"]
[null,null,null,null,null,8,6,7,"Y"]
[null,null,null,null,null,8,6,8,"X"]
[null,null,null,null,null,8,6,9,"X"]
[null,null,null,null,null,8,7,1,"X"]
[null,null,null,null,null,8,7,2,"X"]
[null,null,null,null,null,8,7,3,"Y"]
[null,null,null,null,null,8,7,4,"Z"]
[null,null,null,null,null,8,7,5,"Z"]
[null,null,null,null,null,8,7,6,"Z"]
[null,null,null,null,null,8,7,7,"Z"]
[null,null,null,null,null,8,7,8,"X"]
[null,null,null,null,null,8,7,9,"X"]
[null,null,null,null,null,8,8,1,"X"]
[null,null,null,null,null,8,8,2,"X"]
[null,null,null,null,null,8,8,3,"X"]
[null,null,null,null,null,8,8,4,"X"]
[null,null,null,null,null,8,8,5,"X"]
[null,null,null,null,null,8,8,6,"X"]
[null,null,null,null,null,8,8,7,"Y"]
[null,null,null,null,null,8,8,9,"Y"]
[null,null,null,null,null,8,9,1,"Z"]
[null,null,null,null,null,8,9,2,"Z"]
[null,null,null,null,null,8,9,3,"Z"]
[null,null,null,null,null,8,9,4,"Y"]
[null,null,null,null,null,8,9,5,"X"]
[null,null,null,null,null,8,9,6,"X"]
[null,null,null,null,null,8,9,7,"X"]
[null,null,null,null,null,8,9,8,"X"]
[null,null,null,null,null,8,9,9,"Z"]
[null,null,null,null,null,9,1,1,"Z"]
[null,null,null,null,null,9,1,2,"Z"]
[null,null,null,null,null,9,1,3,"Z"]
[null,null,null,null,null,9,1,4,"Z"]
[null,null,null,null,null,9,1,5,"Y"]
[null,null,null,null,null,9,1,6,"X"]
[null,null,null,null,null,9,1,7,"X"]
[null,null,null,null,null,9,1,8,"X"]
[null,null,null,null,null,9,1,9,"X"]
[null,null,null,null,null,9,2,1,"Y"]
[null,null,null,null,null,9,2,2,"Z"]
[null,null,null,null,null,9,2,3,"Z"]
[null,null,null,null,null,9,2,4,"Z"]
[null,null,null,null,null,9,2,5,"Z"]
[null,null,null,null,null,9,2,6,"X"]
[null,null,null,null,null,9,2,7,"X"]
[null,null,null,null,null,9,2,8,"X"]
[null,null,null,null,null,9,2,9,"X"]
[null,null,null,null,null,9,3,1,"X"]
[null,null,null,null,null,9,3,2,"Z"]
[null,null,null,null,null,9,3,3,"Z"]
[null,null,null,null,null,9,3,4,"Z"]
[null,null,null,null,null,9,3,5,"Z"]
[null,null,null,null,null,9,3,6,"Y"]
[null,null,null,null,null,9,3,7,"X"]
[null,null,null,null,null,9,3,8,"X"]
[null,null,null,null,null,9,3,9,"X"]
[null,null,null,null,null,9,4,1,"X"]
[null,null,null,null,null,9,4,2,"Y"]
[null,null,null,null,null,9,4,3,"Z"]
[null,null,null,null,null,9,4,4,"Z"]
[null,null,null,null,null,9,4,5,"Z"]
[null,null,null,null,null,9,4,6,"Z"]
[null,null,null,null,null,9,4,7,"X"]
[null,null,null,null,null,9,4,8,"X"]
[null,null,null,null,null,9,4,9,"X"]
[null,null,null,null,null,9,5,1,"X"]
[null,null,null,null,null,9,5,2,"X"]
[null,null,null,null,null,9,5,3,"Z"]
[null,null,null,null,null,9,5,4,"Z"]
[null,null,null,null,null,9,5,5,"Z"]
[null,null,null,null,null,9,5,6,"Z"]
[null,null,null,null,null,9,5,7,"Y"]
[null,null,null,null,null,9,5,8,"X"]
[null,null,null,null,null,9,5,9,"X"]
[null,null,null,null,null,9,6,1,"X"]
[null,null,null,null,null,9,6,2,"X"]
[null,null,null,null,null,9,6,3,"Y"]
[null,null,null,null,null,9,6,4,"Z"]
[null,null,null,null,null,9,6,5,"Z"]
[null,null,null,null,null,9,6,6,"Z"]
[null,null,null,null,null,9,6,7,"Z"]
[null,null,null,null,null,9,6,8,"X"]
[null,null,null,null,null,9,6,9,"X"]
[null,null,null,null,null,9,7,1,"X"]
[null,null,null,null,null,9,7,2,"X"]
[null,null,null,null,null,9,7,3,"X"]
[null,null,null,null,null,9,7,4,"Z"]
[null,null,null,null,null,9,7,5,"Z"]
[null,null,null,null,null,9,7,6,"Z"]
[null,null,null,null,null,9,7,7,"Z"]
[null,null,null,null,null,9,7,8,"Y"]
[null,null,null,null,null,9,7,9,"X"]
[null,null,null,null,null,9,8,1,"X"]
[null,null,null,null,null,9,8,2,"X"]
[null,null,null,null,null,9,8,3,"X"]
[null,null,null,null,null,9,8,4,"Y"]
[null,null,null,null,null,9,8,5,"Z"]
[null,null,null,null,null,9,8,6,"Z"]
[null,null,null,null,null,9,8,7,"Z"]
[null,null,null,null,null,9,8,8,"Z"]
[null,null,null,null,null,9,8,9,"X"]
[null,null,null,null,null,9,9,1,"Y"]
[null,null,null,null,null,9,9,2,"X"]
[null,null,null,null,null,9,9,3,"X"]
[null,null,null,null,null,9,9,4,"X"]
[null,null,null,null,null,9,9,5,"X"]
[null,null,null,null,null,9,9,6,"X"]
[null,null,null,null,null,9,9,7,"X"]
[null,null,null,null,null,9,9,8,"Y"]

{"sheet":"Résultats","index":4,"n_rows":50,"n_cols":10,"rows_kept":50,"cut":false,"hidden":true,"merged":[]}
["Liste des doublons:",null,null,null,"Extrait de Bibli2 :",null,null,null,"Comparaison :"]
[1,1,null,null,5,5,null,null,1,1]
[1,2,null,null,1,1,null,null,1,2]
[1,2,null,null,1,2,null,null,1,2]
[1,8,null,null,1,3,null,null,1,8]
[1,9,null,null,1,8,null,null,1,9]
[2,1,null,null,1,9,null,null,2,1]
[2,7,null,null,2,1,null,null,2,8]
[2,8,null,null,2,8,null,null,2,9]
[2,9,null,null,2,9,null,null,3,1]
[3,1,null,null,3,1,null,null,3,2]
[3,2,null,null,3,2,null,null,3,7]
[3,6,null,null,3,3,null,null,3,8]
[3,7,null,null,3,7,null,null,3,9]
[3,8,null,null,3,8,null,null,4,6]
[3,9,null,null,3,9,null,null,4,8]
[4,5,null,null,4,1,null,null,4,9]
[4,6,null,null,4,2,null,null,5,6]
[4,7,null,null,4,3,null,null,5,7]
[4,8,null,null,4,4,null,null,5,8]
[4,9,null,null,4,6,null,null,5,9]
[5,6,null,null,4,8,null,null,5,9]
[5,7,null,null,4,9,null,null,6,1]
[5,8,null,null,5,1,null,null,6,6]
[5,9,null,null,5,2,null,null,6,6]
[5,9,null,null,5,3,null,null,6,7]
[6,1,null,null,5,4,null,null,6,8]
[6,6,null,null,5,6,null,null,7,7]
[6,6,null,null,5,7,null,null,8,8]
[6,7,null,null,5,8,null,null,9,9]
[6,8,null,null,5,9]
[7,7,null,null,6,1]
[8,8,null,null,6,2]
[9,9,null,null,6,3]
[null,null,null,null,6,4]
[null,null,null,null,6,6]
[null,null,null,null,6,7]
[null,null,null,null,6,8]
[null,null,null,null,6,9]
[null,null,null,null,7,1]
[null,null,null,null,7,3]
[null,null,null,null,7,7]
[null,null,null,null,7,8]
[null,null,null,null,7,9]
[null,null,null,null,8,1]
[null,null,null,null,8,2]
[null,null,null,null,8,8]
[null,null,null,null,8,9]
[null,null,null,null,9,1]
[null,null,null,null,9,9]

{"sheet":"DVK","index":5,"n_rows":730,"n_cols":35,"rows_kept":730,"cut":false,"hidden":true,"merged":[[1,32,1,34]]}
[null,null,null,null,null,null,null,null,null,null,null,null,null,null,null,null,null,null,null,null,null,null,null,null,null,"CONCATENER","CONCATENER","Domicile","Visiteur","Chiffre ","ZONE"]
[null,null,null,"A =",8,null,null,null,null,null,null,null,null,null,"B =",8,null,null,null,null,null,{"$f":"Datas!C2","v":"Pierre"},{"$f":"Datas!D2","v":"David"},"Jour","Résultat",null,{"$f":"CONCATENATE(AB2,AC2,AD2)","v":"111"},1,1,1,"NUL",null,"Stats"]
[null,null,null,null,null,null,null,null,null,null,null,null,null,null,null,null,null,null,null,null,null,1,3,{"$f":"IF(V3=0,\"\",'Nbre du Jour'!$V$11)","v":4},{"$f":"VLOOKUP(Z3,$AA$2:$AE$1000,5,FALSE)","v":"David"},{"$f":"CONCATENATE(V3,W3,X3)","v":"134"},{"$f":"CONCATENATE(AB3,AC3,AD3)","v":"222"},2,2,2,"NUL",null,{"$f":"V2","v":"Pierre"},{"$f":"W2","v":"David"},"NUL"]
[null,null,null,null,null,null,null,null,null,null,null,null,null,null,null,null,null,null,null,null,null,1,6,{"$f":"IF(V4=0,\"\",'Nbre du Jour'!$V$11)","v":4},{"$f":"VLOOKUP(Z4,$AA$2:$AE$1000,5,FALSE)","v":"David"},{"$f":"CONCATENATE(V4,W4,X4)","v":"164"},"333",3,3,3,"NUL",null,{"$f":"COUNTIF($Y$3:$Y$50,AG3)/COUNTIF($Y$3:$Y$50,\"><\")","v":0.35294117647058826},{"$f":"COUNTIF($Y$3:$Y$50,AH3)/COUNTIF($Y$3:$Y$50,\"><\")","v":0.58823529411764708},{"$f":"COUNTIF($Y$3:$Y$50,AI3)/COUNTIF($Y$3:$Y$50,\"><\")","v":5.8823529411764705E-2}]
[null,null,null,null,null,null,null,null,null,null,null,null,null,null,null,null,null,null,null,null,null,2,4,{"$f":"IF(V5=0,\"\",'Nbre du Jour'!$V$11)","v":4},{"$f":"VLOOKUP(Z5,$AA$2:$AE$1000,5,FALSE)","v":"David"},{"$f":"CONCATENATE(V5,W5,X5)","v":"244"},"444",4,4,4,"NUL"]
[null,null,null,null,null,null,null,null,null,null,null,null,null,null,null,null,null,null,null,null,null,2,5,{"$f":"IF(V6=0,\"\",'Nbre du Jour'!$V$11)","v":4},"David",{"$f":"CONCATENATE(V6,W6,X6)","v":"254"},"555",5,5,5,"NUL"]
[null,null,null,null,null,null,null,null,null,null,null,null,null,null,null,null,null,null,null,null,null,3,4,{"$f":"IF(V7=0,\"\",'Nbre du Jour'!$V$11)","v":4},"David",{"$f":"CONCATENATE(V7,W7,X7)","v":"344"},"666",6,6,6,"NUL"]
[null,null,null,null,null,null,null,null,null,null,null,null,null,null,null,null,null,null,null,null,null,3,5,{"$f":"IF(V8=0,\"\",'Nbre du Jour'!$V$11)","v":4},{"$f":"VLOOKUP(Z8,$AA$2:$AE$1000,5,FALSE)","v":"NUL"},{"$f":"CONCATENATE(V8,W8,X8)","v":"354"},"777",7,7,7,"NUL"]
[null,null,null,null,null,null,null,null,null,null,null,null,null,null,null,null,null,null,null,null,null,4,3,{"$f":"IF(V9=0,\"\",'Nbre du Jour'!$V$11)","v":4},{"$f":"VLOOKUP(Z9,$AA$2:$AE$1000,5,FALSE)","v":"Pierre"},"434","888",8,8,8,"NUL"]
[null,null,null,null,1,2,3,4,5,6,7,8,9,"M",{"$f":"V2","v":"Pierre"},null,null,null,null,null,null,4,6,{"$f":"IF(V10=0,\"\",'Nbre du Jour'!$V$11)","v":4},"Pierre",{"$f":"CONCATENATE(V10,W10,X10)","v":"464"},"999",9,9,9,"NUL"]
[null,null,null,1,{"$f":"NBRèglesVraies(E$10,$D11,$E$2,$P$2)","v":{"$error":"#VALUE!"}},{"$f":"NBRèglesVraies(F$10,$D11,$E$2,$P$2)","v":{"$error":"#VALUE!"}},{"$error":"#VALUE!"},{"$f":"NBRèglesVraies(H$10,$D11,$E$2,$P$2)","v":{"$error":"#VALUE!"}},{"$error":"#VALUE!"},{"$error":"#VALUE!"},{"$error":"#VALUE!"},{"$error":"#VALUE!"},{"$error":"#VALUE!"},null,null,null,null,null,null,null,null,5,2,{"$f":"IF(V11=0,\"\",'Nbre du Jour'!$V$11)","v":4},"David","524","112",1,1,2,"NUL"]
[null,null,null,2,{"$f":"NBRèglesVraies(E$10,$D12,$E$2,$P$2)","v":{"$error":"#VALUE!"}},{"$error":"#VALUE!"},{"$error":"#VALUE!"},{"$f":"NBRèglesVraies(H$10,$D12,$E$2,$P$2)","v":{"$error":"#VALUE!"}},{"$error":"#VALUE!"},{"$error":"#VALUE!"},{"$error":"#VALUE!"},{"$error":"#VALUE!"},{"$error":"#VALUE!"},null,null,null,null,null,null,null,null,5,7,{"$f":"IF(V12=0,\"\",'Nbre du Jour'!$V$11)","v":4},"Pierre","574","113",1,1,3,{"$f":"V2","v":"Pierre"}]
[null,null,null,3,{"$error":"#VALUE!"},{"$error":"#VALUE!"},{"$error":"#VALUE!"},{"$error":"#VALUE!"},{"$error":"#VALUE!"},{"$error":"#VALUE!"},{"$error":"#VALUE!"},{"$error":"#VALUE!"},{"$error":"#VALUE!"},null,null,null,null,null,null,null,null,6,1,{"$f":"IF(V13=0,\"\",'Nbre du Jour'!$V$11)","v":4},"David","614","114",1,1,4,{"$f":"W2","v":"David"}]
[null,null,null,4,{"$error":"#VALUE!"},{"$error":"#VALUE!"},{"$error":"#VALUE!"},{"$error":"#VALUE!"},{"$error":"#VALUE!"},{"$error":"#VALUE!"},{"$error":"#VALUE!"},{"$error":"#VALUE!"},{"$error":"#VALUE!"},null,null,null,null,null,null,null,null,6,8,{"$f":"IF(V14=0,\"\",'Nbre du Jour'!$V$11)","v":4},"Pierre","684","115",1,1,5,{"$f":"V2","v":"Pierre"}]
[null,null,null,5,{"$error":"#VALUE!"},{"$error":"#VALUE!"},{"$error":"#VALUE!"},{"$error":"#VALUE!"},{"$error":"#VALUE!"},{"$error":"#VALUE!"},{"$error":"#VALUE!"},{"$error":"#VALUE!"},{"$error":"#VALUE!"},null,null,null,null,null,null,null,null,7,9,{"$f":"IF(V15=0,\"\",'Nbre du Jour'!$V$11)","v":4},"Pierre","794","116",1,1,6,{"$f":"V2","v":"Pierre"}]
[null,null,null,6,{"$error":"#VALUE!"},{"$error":"#VALUE!"},{"$error":"#VALUE!"},{"$error":"#VALUE!"},{"$error":"#VALUE!"},{"$error":"#VALUE!"},{"$error":"#VALUE!"},{"$error":"#VALUE!"},{"$error":"#VALUE!"},null,null,null,null,null,null,null,null,8,1,{"$f":"IF(V16=0,\"\",'Nbre du Jour'!$V$11)","v":4},"David","814","117",1,1,7,{"$f":"W2","v":"David"}]
[null,null,null,7,{"$error":"#VALUE!"},{"$error":"#VALUE!"},{"$error":"#VALUE!"},{"$error":"#VALUE!"},{"$error":"#VALUE!"},{"$error":"#VALUE!"},{"$error":"#VALUE!"},{"$error":"#VALUE!"},{"$error":"#VALUE!"},null,null,null,null,null,null,null,null,8,8,{"$f":"IF(V17=0,\"\",'Nbre du Jour'!$V$11)","v":4},"Pierre","884","118",1,1,8,{"$f":"W2","v":"David"}]
[null,null,null,8,{"$error":"#VALUE!"},{"$error":"#VALUE!"},{"$error":"#VALUE!"},{"$error":"#VALUE!"},{"$error":"#VALUE!"},{"$error":"#VALUE!"},{"$error":"#VALUE!"},{"$error":"#VALUE!"},{"$error":"#VALUE!"},null,null,null,null,null,null,null,null,9,2,{"$f":"IF(V18=0,\"\",'Nbre du Jour'!$V$11)","v":4},"David","924","119",1,1,9,"NUL"]
[null,null,null,9,{"$error":"#VALUE!"},{"$error":"#VALUE!"},{"$error":"#VALUE!"},{"$error":"#VALUE!"},{"$error":"#VALUE!"},{"$error":"#VALUE!"},{"$error":"#VALUE!"},{"$error":"#VALUE!"},{"$error":"#VALUE!"},null,null,null,null,null,null,null,null,9,7,{"$f":"IF(V19=0,\"\",'Nbre du Jour'!$V$11)","v":4},{"$f":"VLOOKUP(Z19,$AA$2:$AE$1000,5,FALSE)","v":"David"},"974","121",1,2,1,{"$f":"V2","v":"Pierre"}]
[null,null,null,"N",null,{"$f":"W2","v":"David"},null,null,null,null,null,null,null,null,null,null,null,null,null,null,null,null,null,{"$f":"IF(V20=0,\"\",'Nbre du Jour'!$V$11)","v":""},{"$f":"VLOOKUP(Z20,$AA$2:$AE$1000,5,FALSE)","v":{"$error":"#N/A"}},"","122",1,2,2,{"$f":"V2","v":"Pierre"}]
[null,null,null,null,null,null,null,null,null,null,null,null,null,null,null,null,null,null,null,null,null,null,null,{"$f":"IF(V21=0,\"\",'Nbre du Jour'!$V$11)","v":""},{"$f":"VLOOKUP(Z21,$AA$2:$AE$1000,5,FALSE)","v":{"$error":"#N/A"}},"","123",1,2,3,{"$f":"V2","v":"Pierre"}]
[null,null,null,null,null,null,null,null,null,null,null,null,null,null,null,null,null,null,null,null,null,null,null,{"$f":"IF(V22=0,\"\",'Nbre du Jour'!$V$11)","v":""},{"$error":"#N/A"},"","124",1,2,4,{"$f":"V2","v":"Pierre"}]
[null,null,null,null,null,null,null,null,null,null,null,null,null,null,null,null,null,null,null,null,null,null,null,{"$f":"IF(V23=0,\"\",'Nbre du Jour'!$V$11)","v":""},{"$error":"#N/A"},"","125",1,2,5,{"$f":"V2","v":"Pierre"}]
[null,null,null,null,null,null,null,null,null,null,null,null,null,null,null,null,null,null,null,null,null,null,null,{"$f":"IF(V24=0,\"\",'Nbre du Jour'!$V$11)","v":""},{"$error":"#N/A"},"","126",1,2,6,"NUL"]
[null,null,null,null,null,null,null,null,null,null,null,null,null,null,null,null,null,null,null,null,null,null,null,{"$f":"IF(V25=0,\"\",'Nbre du Jour'!$V$11)","v":""},{"$error":"#N/A"},"","127",1,2,7,{"$f":"V2","v":"Pierre"}]
[null,null,null,null,null,null,null,null,null,null,null,null,null,null,null,null,null,null,null,null,null,null,null,{"$f":"IF(V26=0,\"\",'Nbre du Jour'!$V$11)","v":""},{"$error":"#N/A"},"","128",1,2,8,{"$f":"V2","v":"Pierre"}]
[null,null,null,null,null,null,null,null,null,null,null,null,null,null,null,null,null,null,null,null,null,null,null,{"$f":"IF(V27=0,\"\",'Nbre du Jour'!$V$11)","v":""},{"$error":"#N/A"},"","129",1,2,9,{"$f":"V2","v":"Pierre"}]
[null,null,null,null,null,null,null,null,null,null,null,null,null,null,null,null,null,null,null,null,null,null,null,{"$f":"IF(V28=0,\"\",'Nbre du Jour'!$V$11)","v":""},{"$error":"#N/A"},"","131",1,3,1,{"$f":"V2","v":"Pierre"}]
[null,null,null,null,null,null,null,null,null,null,null,null,null,null,null,null,null,null,null,null,null,null,null,{"$f":"IF(V29=0,\"\",'Nbre du Jour'!$V$11)","v":""},{"$error":"#N/A"},"","132",1,3,2,"NUL"]
[null,null,null,null,null,null,null,null,null,null,null,null,null,null,null,null,null,null,null,null,null,null,null,{"$f":"IF(V30=0,\"\",'Nbre du Jour'!$V$11)","v":""},{"$error":"#N/A"},"","133",1,3,3,{"$f":"W2","v":"David"}]
[null,null,null,null,null,null,null,null,null,null,null,null,null,null,null,null,null,null,null,null,null,null,null,{"$f":"IF(V31=0,\"\",'Nbre du Jour'!$V$11)","v":""},{"$f":"VLOOKUP(Z31,$AA$2:$AE$1000,5,FALSE)","v":{"$error":"#N/A"}},"","134",1,3,4,{"$f":"W2","v":"David"}]
[null,null,null,null,null,null,null,null,null,null,null,null,null,null,null,null,null,null,null,null,null,null,null,{"$f":"IF(V32=0,\"\",'Nbre du Jour'!$V$11)","v":""},{"$f":"VLOOKUP(Z32,$AA$2:$AE$1000,5,FALSE)","v":{"$error":"#N/A"}},"","135",1,3,5,"NUL"]
[null,null,null,null,null,null,null,null,null,null,null,null,null,null,null,null,null,null,null,null,null,null,null,{"$f":"IF(V33=0,\"\",'Nbre du Jour'!$V$11)","v":""},{"$error":"#N/A"},"","136",1,3,6,{"$f":"V2","v":"Pierre"}]
[null,null,null,null,null,null,null,null,null,null,null,null,null,null,null,null,null,null,null,null,null,null,null,{"$f":"IF(V34=0,\"\",'Nbre du Jour'!$V$11)","v":""},{"$error":"#N/A"},"","137",1,3,7,"NUL"]
[null,null,null,null,null,null,null,null,null,null,null,null,null,null,null,null,null,null,null,null,null,null,null,null,null,null,"138",1,3,8,{"$f":"V2","v":"Pierre"}]
[null,null,null,null,null,null,null,null,null,null,null,null,null,null,null,null,null,null,null,null,null,null,null,null,null,null,"139",1,3,9,{"$f":"V2","v":"Pierre"}]
[null,null,null,null,null,null,null,null,null,null,null,null,null,null,null,null,null,null,null,null,null,null,null,null,null,null,"141",1,4,1,{"$f":"V2","v":"Pierre"}]
[null,null,null,null,null,null,null,null,null,null,null,null,null,null,null,null,null,null,null,null,null,null,null,null,null,null,"142",1,4,2,{"$f":"V2","v":"Pierre"}]
[null,null,null,null,null,null,null,null,null,null,null,null,null,null,null,null,null,null,null,null,null,null,null,null,null,null,"143",1,4,3,{"$f":"W2","v":"David"}]
[null,null,null,null,null,null,null,null,null,null,null,null,null,null,null,null,null,null,null,null,null,null,null,null,null,null,"144",1,4,4,{"$f":"W2","v":"David"}]
[null,null,null,null,null,null,null,null,null,null,null,null,null,null,null,null,null,null,null,null,null,null,null,null,null,null,"145",1,4,5,{"$f":"W2","v":"David"}]
[null,null,null,null,null,null,null,null,null,null,null,null,null,null,null,null,null,null,null,null,null,null,null,null,null,null,"146",1,4,6,{"$f":"W2","v":"David"}]
[null,null,null,null,null,null,null,null,null,null,null,null,null,null,null,null,null,null,null,null,null,null,null,null,null,null,"147",1,4,7,"NUL"]
[null,null,null,null,null,null,null,null,null,null,null,null,null,null,null,null,null,null,null,null,null,null,null,null,null,null,"148",1,4,8,{"$f":"V2","v":"Pierre"}]
[null,null,null,null,null,null,null,null,null,null,null,null,null,null,null,null,null,null,null,null,null,null,null,null,null,null,"149",1,4,9,{"$f":"V2","v":"Pierre"}]
[null,null,null,null,null,null,null,null,null,null,null,null,null,null,null,null,null,null,null,null,null,null,null,null,null,null,"151",1,5,1,{"$f":"V2","v":"Pierre"}]
[null,null,null,null,null,null,null,null,null,null,null,null,null,null,null,null,null,null,null,null,null,null,null,null,null,null,"152",1,5,2,{"$f":"V2","v":"Pierre"}]
[null,null,null,null,null,null,null,null,null,null,null,null,null,null,null,null,null,null,null,null,null,null,null,null,null,null,"153",1,5,3,"NUL"]
[null,null,null,null,null,null,null,null,null,null,null,null,null,null,null,null,null,null,null,null,null,null,null,null,null,null,"154",1,5,4,{"$f":"W2","v":"David"}]
[null,null,null,null,null,null,null,null,null,null,null,null,null,null,null,null,null,null,null,null,null,null,null,null,null,null,"155",1,5,5,{"$f":"W2","v":"David"}]
[null,null,null,null,null,null,null,null,null,null,null,null,null,null,null,null,null,null,null,null,null,null,null,null,null,null,"156",1,5,6,{"$f":"W2","v":"David"}]
[null,null,null,null,null,null,null,null,null,null,null,null,null,null,null,null,null,null,null,null,null,null,null,null,null,null,"157",1,5,7,{"$f":"W2","v":"David"}]
[null,null,null,null,null,null,null,null,null,null,null,null,null,null,null,null,null,null,null,null,null,null,null,null,null,null,"158",1,5,8,{"$f":"V2","v":"Pierre"}]
[null,null,null,null,null,null,null,null,null,null,null,null,null,null,null,null,null,null,null,null,null,null,null,null,null,null,"159",1,5,9,{"$f":"V2","v":"Pierre"}]
[null,null,null,null,null,null,null,null,null,null,null,null,null,null,null,null,null,null,null,null,null,null,null,null,null,null,"161",1,6,1,{"$f":"V2","v":"Pierre"}]
[null,null,null,null,null,null,null,null,null,null,null,null,null,null,null,null,null,null,null,null,null,null,null,null,null,null,"162",1,6,2,{"$f":"V2","v":"Pierre"}]
[null,null,null,null,null,null,null,null,null,null,null,null,null,null,null,null,null,null,null,null,null,null,null,null,null,null,"163",1,6,3,{"$f":"V2","v":"Pierre"}]
[null,null,null,null,null,null,null,null,null,null,null,null,null,null,null,null,null,null,null,null,null,null,null,null,null,null,"164",1,6,4,{"$f":"W2","v":"David"}]
[null,null,null,null,null,null,null,null,null,null,null,null,null,null,null,null,null,null,null,null,null,null,null,null,null,null,"165",1,6,5,{"$f":"W2","v":"David"}]
[null,null,null,null,null,null,null,null,null,null,null,null,null,null,null,null,null,null,null,null,null,null,null,null,null,null,"166",1,6,6,{"$f":"W2","v":"David"}]
[null,null,null,null,null,null,null,null,null,null,null,null,null,null,null,null,null,null,null,null,null,null,null,null,null,null,"167",1,6,7,{"$f":"W2","v":"David"}]
[null,null,null,null,null,null,null,null,null,null,null,null,null,null,null,null,null,null,null,null,null,null,null,null,null,null,"168",1,6,8,{"$f":"W2","v":"David"}]
[null,null,null,null,null,null,null,null,null,null,null,null,null,null,null,null,null,null,null,null,null,null,null,null,null,null,"169",1,6,9,{"$f":"W2","v":"David"}]
[null,null,null,null,null,null,null,null,null,null,null,null,null,null,null,null,null,null,null,null,null,null,null,null,null,null,"171",1,7,1,{"$f":"V2","v":"Pierre"}]
[null,null,null,null,null,null,null,null,null,null,null,null,null,null,null,null,null,null,null,null,null,null,null,null,null,null,"172",1,7,2,{"$f":"V2","v":"Pierre"}]
[null,null,null,null,null,null,null,null,null,null,null,null,null,null,null,null,null,null,null,null,null,null,null,null,null,null,"173",1,7,3,{"$f":"V2","v":"Pierre"}]
[null,null,null,null,null,null,null,null,null,null,null,null,null,null,null,null,null,null,null,null,null,null,null,null,null,null,{"$f":"CONCATENATE(AB67,AC67,AD67)","v":"174"},1,7,4,"NUL"]
[null,null,null,null,null,null,null,null,null,null,null,null,null,null,null,null,null,null,null,null,null,null,null,null,null,null,"175",1,7,5,{"$f":"W2","v":"David"}]
[null,null,null,null,null,null,null,null,null,null,null,null,null,null,null,null,null,null,null,null,null,null,null,null,null,null,"176",1,7,6,{"$f":"W2","v":"David"}]
[null,null,null,null,null,null,null,null,null,null,null,null,null,null,null,null,null,null,null,null,null,null,null,null,null,null,"177",1,7,7,{"$f":"W2","v":"David"}]
[null,null,null,null,null,null,null,null,null,null,null,null,null,null,null,null,null,null,null,null,null,null,null,null,null,null,"178",1,7,8,{"$f":"W2","v":"David"}]
[null,null,null,null,null,null,null,null,null,null,null,null,null,null,null,null,null,null,null,null,null,null,null,null,null,null,"179",1,7,9,{"$f":"W2","v":"David"}]
[null,null,null,null,null,null,null,null,null,null,null,null,null,null,null,null,null,null,null,null,null,null,null,null,null,null,"181",1,8,1,{"$f":"V2","v":"Pierre"}]
[null,null,null,null,null,null,null,null,null,null,null,null,null,null,null,null,null,null,null,null,null,null,null,null,null,null,"182",1,8,2,{"$f":"V2","v":"Pierre"}]
[null,null,null,null,null,null,null,null,null,null,null,null,null,null,null,null,null,null,null,null,null,null,null,null,null,null,"183",1,8,3,{"$f":"V2","v":"Pierre"}]
[null,null,null,null,null,null,null,null,null,null,null,null,null,null,null,null,null,null,null,null,null,null,null,null,null,null,"184",1,8,4,{"$f":"V2","v":"Pierre"}]
[null,null,null,null,null,null,null,null,null,null,null,null,null,null,null,null,null,null,null,null,null,null,null,null,null,null,"185",1,8,5,"NUL"]
[null,null,null,null,null,null,null,null,null,null,null,null,null,null,null,null,null,null,null,null,null,null,null,null,null,null,"186",1,8,6,{"$f":"W2","v":"David"}]
[null,null,null,null,null,null,null,null,null,null,null,null,null,null,null,null,null,null,null,null,null,null,null,null,null,null,"187",1,8,7,{"$f":"W2","v":"David"}]
[null,null,null,null,null,null,null,null,null,null,null,null,null,null,null,null,null,null,null,null,null,null,null,null,null,null,"188",1,8,8,{"$f":"W2","v":"David"}]
[null,null,null,null,null,null,null,null,null,null,null,null,null,null,null,null,null,null,null,null,null,null,null,null,null,null,"189",1,8,9,"NUL"]
[null,null,null,null,null,null,null,null,null,null,null,null,null,null,null,null,null,null,null,null,null,null,null,null,null,null,"191",1,9,1,{"$f":"V2","v":"Pierre"}]
[null,null,null,null,null,null,null,null,null,null,null,null,null,null,null,null,null,null,null,null,null,null,null,null,null,null,"192",1,9,2,{"$f":"V2","v":"Pierre"}]
[null,null,null,null,null,null,null,null,null,null,null,null,null,null,null,null,null,null,null,null,null,null,null,null,null,null,"193",1,9,3,{"$f":"V2","v":"Pierre"}]
[null,null,null,null,null,null,null,null,null,null,null,null,null,null,null,null,null,null,null,null,null,null,null,null,null,null,"194",1,9,4,{"$f":"V2","v":"Pierre"}]
[null,null,null,null,null,null,null,null,null,null,null,null,null,null,null,null,null,null,null,null,null,null,null,null,null,null,"195",1,9,5,"NUL"]
[null,null,null,null,null,null,null,null,null,null,null,null,null,null,null,null,null,null,null,null,null,null,null,null,null,null,"196",1,9,6,{"$f":"W2","v":"David"}]
[null,null,null,null,null,null,null,null,null,null,null,null,null,null,null,null,null,null,null,null,null,null,null,null,null,null,"197",1,9,7,{"$f":"W2","v":"David"}]
[null,null,null,null,null,null,null,null,null,null,null,null,null,null,null,null,null,null,null,null,null,null,null,null,null,null,"198",1,9,8,{"$f":"W2","v":"David"}]
[null,null,null,null,null,null,null,null,null,null,null,null,null,null,null,null,null,null,null,null,null,null,null,null,null,null,"199",1,9,9,{"$f":"W2","v":"David"}]
[null,null,null,null,null,null,null,null,null,null,null,null,null,null,null,null,null,null,null,null,null,null,null,null,null,null,"211",2,1,1,{"$f":"W2","v":"David"}]
[null,null,null,null,null,null,null,null,null,null,null,null,null,null,null,null,null,null,null,null,null,null,null,null,null,null,"212",2,1,2,{"$f":"V2","v":"Pierre"}]
[null,null,null,null,null,null,null,null,null,null,null,null,null,null,null,null,null,null,null,null,null,null,null,null,null,null,"213",2,1,3,{"$f":"V2","v":"Pierre"}]
[null,null,null,null,null,null,null,null,null,null,null,null,null,null,null,null,null,null,null,null,null,null,null,null,null,null,"214",2,1,4,{"$f":"V2","v":"Pierre"}]
[null,null,null,null,null,null,null,null,null,null,null,null,null,null,null,null,null,null,null,null,null,null,null,null,null,null,"215",2,1,5,{"$f":"V2","v":"Pierre"}]
[null,null,null,null,null,null,null,null,null,null,null,null,null,null,null,null,null,null,null,null,null,null,null,null,null,null,"216",2,1,6,"NUL"]
[null,null,null,null,null,null,null,null,null,null,null,null,null,null,null,null,null,null,null,null,null,null,null,null,null,null,"217",2,1,7,{"$f":"W2","v":"David"}]
[null,null,null,null,null,null,null,null,null,null,null,null,null,null,null,null,null,null,null,null,null,null,null,null,null,null,"218",2,1,8,{"$f":"W2","v":"David"}]
[null,null,null,null,null,null,null,null,null,null,null,null,null,null,null,null,null,null,null,null,null,null,null,null,null,null,"219",2,1,9,{"$f":"W2","v":"David"}]
[null,null,null,null,null,null,null,null,null,null,null,null,null,null,null,null,null,null,null,null,null,null,null,null,null,null,"221",2,2,1,"NUL"]
[null,null,null,null,null,null,null,null,null,null,null,null,null,null,null,null,null,null,null,null,null,null,null,null,null,null,"223",2,2,3,"NUL"]
[null,null,null,null,null,null,null,null,null,null,null,null,null,null,null,null,null,null,null,null,null,null,null,null,null,null,"224",2,2,4,{"$f":"V2","v":"Pierre"}]
[null,null,null,null,null,null,null,null,null,null,null,null,null,null,null,null,null,null,null,null,null,null,null,null,null,null,"225",2,2,5,{"$f":"W2","v":"David"}]
[null,null,null,null,null,null,null,null,null,null,null,null,null,null,null,null,null,null,null,null,null,null,null,null,null,null,"226",2,2,6,{"$f":"V2","v":"Pierre"}]
[null,null,null,null,null,null,null,null,null,null,null,null,null,null,null,null,null,null,null,null,null,null,null,null,null,null,"227",2,2,7,{"$f":"V2","v":"Pierre"}]
[null,null,null,null,null,null,null,null,null,null,null,null,null,null,null,null,null,null,null,null,null,null,null,null,null,null,"228",2,2,8,{"$f":"W2","v":"David"}]
[null,null,null,null,null,null,null,null,null,null,null,null,null,null,null,null,null,null,null,null,null,null,null,null,null,null,"229",2,2,9,{"$f":"V2","v":"Pierre"}]
[null,null,null,null,null,null,null,null,null,null,null,null,null,null,null,null,null,null,null,null,null,null,null,null,null,null,"231",2,3,1,{"$f":"V2","v":"Pierre"}]
[null,null,null,null,null,null,null,null,null,null,null,null,null,null,null,null,null,null,null,null,null,null,null,null,null,null,"232",2,3,2,{"$f":"V2","v":"Pierre"}]
[null,null,null,null,null,null,null,null,null,null,null,null,null,null,null,null,null,null,null,null,null,null,null,null,null,null,"233",2,3,3,{"$f":"W2","v":"David"}]
[null,null,null,null,null,null,null,null,null,null,null,null,null,null,null,null,null,null,null,null,null,null,null,null,null,null,"234",2,3,4,{"$f":"W2","v":"David"}]
[null,null,null,null,null,null,null,null,null,null,null,null,null,null,null,null,null,null,null,null,null,null,null,null,null,null,"235",2,3,5,{"$f":"W2","v":"David"}]
[null,null,null,null,null,null,null,null,null,null,null,null,null,null,null,null,null,null,null,null,null,null,null,null,null,null,"236",2,3,6,{"$f":"W2","v":"David"}]
[null,null,null,null,null,null,null,null,null,null,null,null,null,null,null,null,null,null,null,null,null,null,null,null,null,null,"237",2,3,7,"NUL"]
[null,null,null,null,null,null,null,null,null,null,null,null,null,null,null,null,null,null,null,null,null,null,null,null,null,null,"238",2,3,8,{"$f":"V2","v":"Pierre"}]
[null,null,null,null,null,null,null,null,null,null,null,null,null,null,null,null,null,null,null,null,null,null,null,null,null,null,"239",2,3,9,{"$f":"V2","v":"Pierre"}]
[null,null,null,null,null,null,null,null,null,null,null,null,null,null,null,null,null,null,null,null,null,null,null,null,null,null,"241",2,4,1,{"$f":"V2","v":"Pierre"}]
[null,null,null,null,null,null,null,null,null,null,null,null,null,null,null,null,null,null,null,null,null,null,null,null,null,null,"242",2,4,2,{"$f":"V2","v":"Pierre"}]
[null,null,null,null,null,null,null,null,null,null,null,null,null,null,null,null,null,null,null,null,null,null,null,null,null,null,"243",2,4,3,"NUL"]
[null,null,null,null,null,null,null,null,null,null,null,null,null,null,null,null,null,null,null,null,null,null,null,null,null,null,"244",2,4,4,{"$f":"W2","v":"David"}]
[null,null,null,null,null,null,null,null,null,null,null,null,null,null,null,null,null,null,null,null,null,null,null,null,null,null,"245",2,4,5,{"$f":"W2","v":"David"}]
[null,null,null,null,null,null,null,null,null,null,null,null,null,null,null,null,null,null,null,null,null,null,null,null,null,null,"246",2,4,6,{"$f":"W2","v":"David"}]
[null,null,null,null,null,null,null,null,null,null,null,null,null,null,null,null,null,null,null,null,null,null,null,null,null,null,"247",2,4,7,{"$f":"W2","v":"David"}]
[null,null,null,null,null,null,null,null,null,null,null,null,null,null,null,null,null,null,null,null,null,null,null,null,null,null,"248",2,4,8,{"$f":"V2","v":"Pierre"}]
[null,null,null,null,null,null,null,null,null,null,null,null,null,null,null,null,null,null,null,null,null,null,null,null,null,null,"249",2,4,9,{"$f":"V2","v":"Pierre"}]
[null,null,null,null,null,null,null,null,null,null,null,null,null,null,null,null,null,null,null,null,null,null,null,null,null,null,"251",2,5,1,{"$f":"V2","v":"Pierre"}]
[null,null,null,null,null,null,null,null,null,null,null,null,null,null,null,null,null,null,null,null,null,null,null,null,null,null,"252",2,5,2,{"$f":"V2","v":"Pierre"}]
[null,null,null,null,null,null,null,null,null,null,null,null,null,null,null,null,null,null,null,null,null,null,null,null,null,null,"253",2,5,3,{"$f":"V2","v":"Pierre"}]
[null,null,null,null,null,null,null,null,null,null,null,null,null,null,null,null,null,null,null,null,null,null,null,null,null,null,"254",2,5,4,{"$f":"W2","v":"David"}]
[null,null,null,null,null,null,null,null,null,null,null,null,null,null,null,null,null,null,null,null,null,null,null,null,null,null,"255",2,5,5,{"$f":"W2","v":"David"}]
[null,null,null,null,null,null,null,null,null,null,null,null,null,null,null,null,null,null,null,null,null,null,null,null,null,null,{"$f":"CONCATENATE(AB131,AC131,AD131)","v":"256"},2,5,6,{"$f":"W2","v":"David"}]
[null,null,null,null,null,null,null,null,null,null,null,null,null,null,null,null,null,null,null,null,null,null,null,null,null,null,"257",2,5,7,{"$f":"W2","v":"David"}]
[null,null,null,null,null,null,null,null,null,null,null,null,null,null,null,null,null,null,null,null,null,null,null,null,null,null,"258",2,5,8,"NUL"]
[null,null,null,null,null,null,null,null,null,null,null,null,null,null,null,null,null,null,null,null,null,null,null,null,null,null,"259",2,5,9,{"$f":"V2","v":"Pierre"}]
[null,null,null,null,null,null,null,null,null,null,null,null,null,null,null,null,null,null,null,null,null,null,null,null,null,null,"261",2,6,1,{"$f":"V2","v":"Pierre"}]
[null,null,null,null,null,null,null,null,null,null,null,null,null,null,null,null,null,null,null,null,null,null,null,null,null,null,"262",2,6,2,{"$f":"V2","v":"Pierre"}]
[null,null,null,null,null,null,null,null,null,null,null,null,null,null,null,null,null,null,null,null,null,null,null,null,null,null,"263",2,6,3,{"$f":"V2","v":"Pierre"}]
[null,null,null,null,null,null,null,null,null,null,null,null,null,null,null,null,null,null,null,null,null,null,null,null,null,null,"264",2,6,4,"NUL"]
[null,null,null,null,null,null,null,null,null,null,null,null,null,null,null,null,null,null,null,null,null,null,null,null,null,null,"265",2,6,5,{"$f":"W2","v":"David"}]
[null,null,null,null,null,null,null,null,null,null,null,null,null,null,null,null,null,null,null,null,null,null,null,null,null,null,"266",2,6,6,{"$f":"W2","v":"David"}]
[null,null,null,null,null,null,null,null,null,null,null,null,null,null,null,null,null,null,null,null,null,null,null,null,null,null,"267",2,6,7,{"$f":"W2","v":"David"}]
[null,null,null,null,null,null,null,null,null,null,null,null,null,null,null,null,null,null,null,null,null,null,null,null,null,null,"268",2,6,8,{"$f":"W2","v":"David"}]
[null,null,null,null,null,null,null,null,null,null,null,null,null,null,null,null,null,null,null,null,null,null,null,null,null,null,"269",2,6,9,{"$f":"W2","v":"David"}]
[null,null,null,null,null,null,null,null,null,null,null,null,null,null,null,null,null,null,null,null,null,null,null,null,null,null,"271",2,7,1,{"$f":"V2","v":"Pierre"}]
[null,null,null,null,null,null,null,null,null,null,null,null,null,null,null,null,null,null,null,null,null,null,null,null,null,null,"272",2,7,2,{"$f":"V2","v":"Pierre"}]
[null,null,null,null,null,null,null,null,null,null,null,null,null,null,null,null,null,null,null,null,null,null,null,null,null,null,"273",2,7,3,{"$f":"V2","v":"Pierre"}]
[null,null,null,null,null,null,null,null,null,null,null,null,null,null,null,null,null,null,null,null,null,null,null,null,null,null,"274",2,7,4,{"$f":"V2","v":"Pierre"}]
[null,null,null,null,null,null,null,null,null,null,null,null,null,null,null,null,null,null,null,null,null,null,null,null,null,null,"275",2,7,5,{"$f":"W2","v":"David"}]
[null,null,null,null,null,null,null,null,null,null,null,null,null,null,null,null,null,null,null,null,null,null,null,null,null,null,"276",2,7,6,{"$f":"W2","v":"David"}]
[null,null,null,null,null,null,null,null,null,null,null,null,null,null,null,null,null,null,null,null,null,null,null,null,null,null,"277",2,7,7,{"$f":"W2","v":"David"}]
[null,null,null,null,null,null,null,null,null,null,null,null,null,null,null,null,null,null,null,null,null,null,null,null,null,null,"278",2,7,8,{"$f":"W2","v":"David"}]
[null,null,null,null,null,null,null,null,null,null,null,null,null,null,null,null,null,null,null,null,null,null,null,null,null,null,"279",2,7,9,"NUL"]
[null,null,null,null,null,null,null,null,null,null,null,null,null,null,null,null,null,null,null,null,null,null,null,null,null,null,"281",2,8,1,{"$f":"V2","v":"Pierre"}]
[null,null,null,null,null,null,null,null,null,null,null,null,null,null,null,null,null,null,null,null,null,null,null,null,null,null,"282",2,8,2,{"$f":"V2","v":"Pierre"}]
[null,null,null,null,null,null,null,null,null,null,null,null,null,null,null,null,null,null,null,null,null,null,null,null,null,null,"283",2,8,3,{"$f":"V2","v":"Pierre"}]
[null,null,null,null,null,null,null,null,null,null,null,null,null,null,null,null,null,null,null,null,null,null,null,null,null,null,"284",2,8,4,{"$f":"V2","v":"Pierre"}]
[null,null,null,null,null,null,null,null,null,null,null,null,null,null,null,null,null,null,null,null,null,null,null,null,null,null,"285",2,8,5,"NUL"]
[null,null,null,null,null,null,null,null,null,null,null,null,null,null,null,null,null,null,null,null,null,null,null,null,null,null,"286",2,8,6,{"$f":"W2","v":"David"}]
[null,null,null,null,null,null,null,null,null,null,null,null,null,null,null,null,null,null,null,null,null,null,null,null,null,null,"287",2,8,7,{"$f":"W2","v":"David"}]
[null,null,null,null,null,null,null,null,null,null,null,null,null,null,null,null,null,null,null,null,null,null,null,null,null,null,"288",2,8,8,{"$f":"W2","v":"David"}]
[null,null,null,null,null,null,null,null,null,null,null,null,null,null,null,null,null,null,null,null,null,null,null,null,null,null,"289",2,8,9,{"$f":"W2","v":"David"}]
[null,null,null,null,null,null,null,null,null,null,null,null,null,null,null,null,null,null,null,null,null,null,null,null,null,null,"291",2,9,1,"NUL"]
[null,null,null,null,null,null,null,null,null,null,null,null,null,null,null,null,null,null,null,null,null,null,null,null,null,null,"292",2,9,2,{"$f":"V2","v":"Pierre"}]
[null,null,null,null,null,null,null,null,null,null,null,null,null,null,null,null,null,null,null,null,null,null,null,null,null,null,"293",2,9,3,{"$f":"V2","v":"Pierre"}]
[null,null,null,null,null,null,null,null,null,null,null,null,null,null,null,null,null,null,null,null,null,null,null,null,null,null,"294",2,9,4,{"$f":"V2","v":"Pierre"}]
[null,null,null,null,null,null,null,null,null,null,null,null,null,null,null,null,null,null,null,null,null,null,null,null,null,null,"295",2,9,5,{"$f":"V2","v":"Pierre"}]
[null,null,null,null,null,null,null,null,null,null,null,null,null,null,null,null,null,null,null,null,null,null,null,null,null,null,"296",2,9,6,{"$f":"W2","v":"David"}]
[null,null,null,null,null,null,null,null,null,null,null,null,null,null,null,null,null,null,null,null,null,null,null,null,null,null,"297",2,9,7,{"$f":"W2","v":"David"}]
[null,null,null,null,null,null,null,null,null,null,null,null,null,null,null,null,null,null,null,null,null,null,null,null,null,null,"298",2,9,8,{"$f":"W2","v":"David"}]
[null,null,null,null,null,null,null,null,null,null,null,null,null,null,null,null,null,null,null,null,null,null,null,null,null,null,"299",2,9,9,{"$f":"W2","v":"David"}]
[null,null,null,null,null,null,null,null,null,null,null,null,null,null,null,null,null,null,null,null,null,null,null,null,null,null,"311",3,1,1,{"$f":"W2","v":"David"}]
[null,null,null,null,null,null,null,null,null,null,null,null,null,null,null,null,null,null,null,null,null,null,null,null,null,null,"312",3,1,2,"NUL"]
[null,null,null,null,null,null,null,null,null,null,null,null,null,null,null,null,null,null,null,null,null,null,null,null,null,null,"313",3,1,3,{"$f":"V2","v":"Pierre"}]
[null,null,null,null,null,null,null,null,null,null,null,null,null,null,null,null,null,null,null,null,null,null,null,null,null,null,"314",3,1,4,{"$f":"V2","v":"Pierre"}]
[null,null,null,null,null,null,null,null,null,null,null,null,null,null,null,null,null,null,null,null,null,null,null,null,null,null,"315",3,1,5,{"$f":"V2","v":"Pierre"}]
[null,null,null,null,null,null,null,null,null,null,null,null,null,null,null,null,null,null,null,null,null,null,null,null,null,null,"316",3,1,6,{"$f":"V2","v":"Pierre"}]
[null,null,null,null,null,null,null,null,null,null,null,null,null,null,null,null,null,null,null,null,null,null,null,null,null,null,"317",3,1,7,{"$f":"W2","v":"David"}]
[null,null,null,null,null,null,null,null,null,null,null,null,null,null,null,null,null,null,null,null,null,null,null,null,null,null,"318",3,1,8,{"$f":"W2","v":"David"}]
[null,null,null,null,null,null,null,null,null,null,null,null,null,null,null,null,null,null,null,null,null,null,null,null,null,null,"319",3,1,9,{"$f":"W2","v":"David"}]
[null,null,null,null,null,null,null,null,null,null,null,null,null,null,null,null,null,null,null,null,null,null,null,null,null,null,"321",3,2,1,{"$f":"W2","v":"David"}]
[null,null,null,null,null,null,null,null,null,null,null,null,null,null,null,null,null,null,null,null,null,null,null,null,null,null,"322",3,2,2,{"$f":"W2","v":"David"}]
[null,null,null,null,null,null,null,null,null,null,null,null,null,null,null,null,null,null,null,null,null,null,null,null,null,null,"323",3,2,3,{"$f":"V2","v":"Pierre"}]
[null,null,null,null,null,null,null,null,null,null,null,null,null,null,null,null,null,null,null,null,null,null,null,null,null,null,"324",3,2,4,{"$f":"V2","v":"Pierre"}]
[null,null,null,null,null,null,null,null,null,null,null,null,null,null,null,null,null,null,null,null,null,null,null,null,null,null,"325",3,2,5,{"$f":"V2","v":"Pierre"}]
[null,null,null,null,null,null,null,null,null,null,null,null,null,null,null,null,null,null,null,null,null,null,null,null,null,null,"326",3,2,6,{"$f":"V2","v":"Pierre"}]
[null,null,null,null,null,null,null,null,null,null,null,null,null,null,null,null,null,null,null,null,null,null,null,null,null,null,"327",3,2,7,"NUL"]
[null,null,null,null,null,null,null,null,null,null,null,null,null,null,null,null,null,null,null,null,null,null,null,null,null,null,"328",3,2,8,{"$f":"W2","v":"David"}]
[null,null,null,null,null,null,null,null,null,null,null,null,null,null,null,null,null,null,null,null,null,null,null,null,null,null,"329",3,2,9,{"$f":"W2","v":"David"}]
[null,null,null,null,null,null,null,null,null,null,null,null,null,null,null,null,null,null,null,null,null,null,null,null,null,null,"331",3,3,1,{"$f":"V2","v":"Pierre"}]
[null,null,null,null,null,null,null,null,null,null,null,null,null,null,null,null,null,null,null,null,null,null,null,null,null,null,"332",3,3,2,"NUL"]
[null,null,null,null,null,null,null,null,null,null,null,null,null,null,null,null,null,null,null,null,null,null,null,null,null,null,"334",3,3,4,"NUL"]
[null,null,null,null,null,null,null,null,null,null,null,null,null,null,null,null,null,null,null,null,null,null,null,null,null,null,"335",3,3,5,{"$f":"V2","v":"Pierre"}]
[null,null,null,null,null,null,null,null,null,null,null,null,null,null,null,null,null,null,null,null,null,null,null,null,null,null,"336",3,3,6,{"$f":"W2","v":"David"}]
[null,null,null,null,null,null,null,null,null,null,null,null,null,null,null,null,null,null,null,null,null,null,null,null,null,null,"337",3,3,7,{"$f":"V2","v":"Pierre"}]
[null,null,null,null,null,null,null,null,null,null,null,null,null,null,null,null,null,null,null,null,null,null,null,null,null,null,{"$f":"CONCATENATE(AB195,AC195,AD195)","v":"338"},3,3,8,{"$f":"V2","v":"Pierre"}]
[null,null,null,null,null,null,null,null,null,null,null,null,null,null,null,null,null,null,null,null,null,null,null,null,null,null,"339",3,3,9,{"$f":"W2","v":"David"}]
[null,null,null,null,null,null,null,null,null,null,null,null,null,null,null,null,null,null,null,null,null,null,null,null,null,null,"341",3,4,1,{"$f":"V2","v":"Pierre"}]
[null,null,null,null,null,null,null,null,null,null,null,null,null,null,null,null,null,null,null,null,null,null,null,null,null,null,"342",3,4,2,{"$f":"V2","v":"Pierre"}]
[null,null,null,null,null,null,null,null,null,null,null,null,null,null,null,null,null,null,null,null,null,null,null,null,null,null,"343",3,4,3,{"$f":"V2","v":"Pierre"}]
[null,null,null,null,null,null,null,null,null,null,null,null,null,null,null,null,null,null,null,null,null,null,null,null,null,null,"344",3,4,4,{"$f":"W2","v":"David"}]
[null,null,null,null,null,null,null,null,null,null,null,null,null,null,null,null,null,null,null,null,null,null,null,null,null,null,"345",3,4,5,{"$f":"W2","v":"David"}]
[null,null,null,null,null,null,null,null,null,null,null,null,null,null,null,null,null,null,null,null,null,null,null,null,null,null,"346",3,4,6,{"$f":"W2","v":"David"}]
[null,null,null,null,null,null,null,null,null,null,null,null,null,null,null,null,null,null,null,null,null,null,null,null,null,null,"347",3,4,7,{"$f":"W2","v":"David"}]
[null,null,null,null,null,null,null,null,null,null,null,null,null,null,null,null,null,null,null,null,null,null,null,null,null,null,"348",3,4,8,"NUL"]
[null,null,null,null,null,null,null,null,null,null,null,null,null,null,null,null,null,null,null,null,null,null,null,null,null,null,"349",3,4,9,{"$f":"V2","v":"Pierre"}]
[null,null,null,null,null,null,null,null,null,null,null,null,null,null,null,null,null,null,null,null,null,null,null,null,null,null,"351",3,5,1,{"$f":"V2","v":"Pierre"}]
[null,null,null,null,null,null,null,null,null,null,null,null,null,null,null,null,null,null,null,null,null,null,null,null,null,null,"352",3,5,2,{"$f":"V2","v":"Pierre"}]
[null,null,null,null,null,null,null,null,null,null,null,null,null,null,null,null,null,null,null,null,null,null,null,null,null,null,"353",3,5,3,{"$f":"V2","v":"Pierre"}]
[null,null,null,null,null,null,null,null,null,null,null,null,null,null,null,null,null,null,null,null,null,null,null,null,null,null,"354",3,5,4,"NUL"]
[null,null,null,null,null,null,null,null,null,null,null,null,null,null,null,null,null,null,null,null,null,null,null,null,null,null,"355",3,5,5,{"$f":"W2","v":"David"}]
[null,null,null,null,null,null,null,null,null,null,null,null,null,null,null,null,null,null,null,null,null,null,null,null,null,null,"356",3,5,6,{"$f":"W2","v":"David"}]
[null,null,null,null,null,null,null,null,null,null,null,null,null,null,null,null,null,null,null,null,null,null,null,null,null,null,"357",3,5,7,{"$f":"W2","v":"David"}]
[null,null,null,null,null,null,null,null,null,null,null,null,null,null,null,null,null,null,null,null,null,null,null,null,null,null,"358",3,5,8,{"$f":"W2","v":"David"}]
[null,null,null,null,null,null,null,null,null,null,null,null,null,null,null,null,null,null,null,null,null,null,null,null,null,null,"359",3,5,9,{"$f":"V2","v":"Pierre"}]
[null,null,null,null,null,null,null,null,null,null,null,null,null,null,null,null,null,null,null,null,null,null,null,null,null,null,"361",3,6,1,{"$f":"V2","v":"Pierre"}]
[null,null,null,null,null,null,null,null,null,null,null,null,null,null,null,null,null,null,null,null,null,null,null,null,null,null,"362",3,6,2,{"$f":"V2","v":"Pierre"}]
[null,null,null,null,null,null,null,null,null,null,null,null,null,null,null,null,null,null,null,null,null,null,null,null,null,null,"363",3,6,3,{"$f":"V2","v":"Pierre"}]
[null,null,null,null,null,null,null,null,null,null,null,null,null,null,null,null,null,null,null,null,null,null,null,null,null,null,"364",3,6,4,{"$f":"V2","v":"Pierre"}]
[null,null,null,null,null,null,null,null,null,null,null,null,null,null,null,null,null,null,null,null,null,null,null,null,null,null,"365",3,6,5,{"$f":"W2","v":"David"}]
[null,null,null,null,null,null,null,null,null,null,null,null,null,null,null,null,null,null,null,null,null,null,null,null,null,null,"366",3,6,6,{"$f":"W2","v":"David"}]
[null,null,null,null,null,null,null,null,null,null,null,null,null,null,null,null,null,null,null,null,null,null,null,null,null,null,"367",3,6,7,{"$f":"W2","v":"David"}]
[null,null,null,null,null,null,null,null,null,null,null,null,null,null,null,null,null,null,null,null,null,null,null,null,null,null,"368",3,6,8,{"$f":"W2","v":"David"}]
[null,null,null,null,null,null,null,null,null,null,null,null,null,null,null,null,null,null,null,null,null,null,null,null,null,null,"369",3,6,9,"NUL"]
[null,null,null,null,null,null,null,null,null,null,null,null,null,null,null,null,null,null,null,null,null,null,null,null,null,null,"371",3,7,1,{"$f":"V2","v":"Pierre"}]
[null,null,null,null,null,null,null,null,null,null,null,null,null,null,null,null,null,null,null,null,null,null,null,null,null,null,"372",3,7,2,{"$f":"V2","v":"Pierre"}]
[null,null,null,null,null,null,null,null,null,null,null,null,null,null,null,null,null,null,null,null,null,null,null,null,null,null,"373",3,7,3,{"$f":"V2","v":"Pierre"}]
[null,null,null,null,null,null,null,null,null,null,null,null,null,null,null,null,null,null,null,null,null,null,null,null,null,null,"374",3,7,4,{"$f":"V2","v":"Pierre"}]
[null,null,null,null,null,null,null,null,null,null,null,null,null,null,null,null,null,null,null,null,null,null,null,null,null,null,"375",3,7,5,"NUL"]
[null,null,null,null,null,null,null,null,null,null,null,null,null,null,null,null,null,null,null,null,null,null,null,null,null,null,"376",3,7,6,{"$f":"W2","v":"David"}]
[null,null,null,null,null,null,null,null,null,null,null,null,null,null,null,null,null,null,null,null,null,null,null,null,null,null,"377",3,7,7,{"$f":"W2","v":"David"}]
[null,null,null,null,null,null,null,null,null,null,null,null,null,null,null,null,null,null,null,null,null,null,null,null,null,null,"378",3,7,8,{"$f":"W2","v":"David"}]
[null,null,null,null,null,null,null,null,null,null,null,null,null,null,null,null,null,null,null,null,null,null,null,null,null,null,"379",3,7,9,{"$f":"W2","v":"David"}]
[null,null,null,null,null,null,null,null,null,null,null,null,null,null,null,null,null,null,null,null,null,null,null,null,null,null,"381",3,8,1,"NUL"]
[null,null,null,null,null,null,null,null,null,null,null,null,null,null,null,null,null,null,null,null,null,null,null,null,null,null,"382",3,8,2,{"$f":"V2","v":"Pierre"}]
[null,null,null,null,null,null,null,null,null,null,null,null,null,null,null,null,null,null,null,null,null,null,null,null,null,null,"383",3,8,3,{"$f":"V2","v":"Pierre"}]
[null,null,null,null,null,null,null,null,null,null,null,null,null,null,null,null,null,null,null,null,null,null,null,null,null,null,"384",3,8,4,{"$f":"V2","v":"Pierre"}]
[null,null,null,null,null,null,null,null,null,null,null,null,null,null,null,null,null,null,null,null,null,null,null,null,null,null,"385",3,8,5,{"$f":"V2","v":"Pierre"}]
[null,null,null,null,null,null,null,null,null,null,null,null,null,null,null,null,null,null,null,null,null,null,null,null,null,null,"386",3,8,6,{"$f":"W2","v":"David"}]
[null,null,null,null,null,null,null,null,null,null,null,null,null,null,null,null,null,null,null,null,null,null,null,null,null,null,"387",3,8,7,{"$f":"W2","v":"David"}]
[null,null,null,null,null,null,null,null,null,null,null,null,null,null,null,null,null,null,null,null,null,null,null,null,null,null,"388",3,8,8,{"$f":"W2","v":"David"}]
[null,null,null,null,null,null,null,null,null,null,null,null,null,null,null,null,null,null,null,null,null,null,null,null,null,null,"389",3,8,9,{"$f":"W2","v":"David"}]
[null,null,null,null,null,null,null,null,null,null,null,null,null,null,null,null,null,null,null,null,null,null,null,null,null,null,"391",3,9,1,{"$f":"W2","v":"David"}]
[null,null,null,null,null,null,null,null,null,null,null,null,null,null,null,null,null,null,null,null,null,null,null,null,null,null,"392",3,9,2,{"$f":"W2","v":"David"}]
[null,null,null,null,null,null,null,null,null,null,null,null,null,null,null,null,null,null,null,null,null,null,null,null,null,null,"393",3,9,3,{"$f":"V2","v":"Pierre"}]
[null,null,null,null,null,null,null,null,null,null,null,null,null,null,null,null,null,null,null,null,null,null,null,null,null,null,"394",3,9,4,{"$f":"V2","v":"Pierre"}]
[null,null,null,null,null,null,null,null,null,null,null,null,null,null,null,null,null,null,null,null,null,null,null,null,null,null,"395",3,9,5,{"$f":"V2","v":"Pierre"}]
[null,null,null,null,null,null,null,null,null,null,null,null,null,null,null,null,null,null,null,null,null,null,null,null,null,null,"396",3,9,6,"NUL"]
[null,null,null,null,null,null,null,null,null,null,null,null,null,null,null,null,null,null,null,null,null,null,null,null,null,null,"397",3,9,7,{"$f":"W2","v":"David"}]
[null,null,null,null,null,null,null,null,null,null,null,null,null,null,null,null,null,null,null,null,null,null,null,null,null,null,"398",3,9,8,{"$f":"W2","v":"David"}]
[null,null,null,null,null,null,null,null,null,null,null,null,null,null,null,null,null,null,null,null,null,null,null,null,null,null,"399",3,9,9,{"$f":"W2","v":"David"}]
[null,null,null,null,null,null,null,null,null,null,null,null,null,null,null,null,null,null,null,null,null,null,null,null,null,null,"411",4,1,1,{"$f":"W2","v":"David"}]
[null,null,null,null,null,null,null,null,null,null,null,null,null,null,null,null,null,null,null,null,null,null,null,null,null,null,"412",4,1,2,{"$f":"W2","v":"David"}]
[null,null,null,null,null,null,null,null,null,null,null,null,null,null,null,null,null,null,null,null,null,null,null,null,null,null,"413",4,1,3,{"$f":"W2","v":"David"}]
[null,null,null,null,null,null,null,null,null,null,null,null,null,null,null,null,null,null,null,null,null,null,null,null,null,null,"414",4,1,4,{"$f":"V2","v":"Pierre"}]
[null,null,null,null,null,null,null,null,null,null,null,null,null,null,null,null,null,null,null,null,null,null,null,null,null,null,"415",4,1,5,{"$f":"V2","v":"Pierre"}]
[null,null,null,null,null,null,null,null,null,null,null,null,null,null,null,null,null,null,null,null,null,null,null,null,null,null,"416",4,1,6,{"$f":"V2","v":"Pierre"}]
[null,null,null,null,null,null,null,null,null,null,null,null,null,null,null,null,null,null,null,null,null,null,null,null,null,null,"417",4,1,7,"NUL"]
[null,null,null,null,null,null,null,null,null,null,null,null,null,null,null,null,null,null,null,null,null,null,null,null,null,null,"418",4,1,8,{"$f":"W2","v":"David"}]
[null,null,null,null,null,null,null,null,null,null,null,null,null,null,null,null,null,null,null,null,null,null,null,null,null,null,{"$f":"CONCATENATE(AB259,AC259,AD259)","v":"419"},4,1,9,{"$f":"W2","v":"David"}]
[null,null,null,null,null,null,null,null,null,null,null,null,null,null,null,null,null,null,null,null,null,null,null,null,null,null,"421",4,2,1,{"$f":"W2","v":"David"}]
[null,null,null,null,null,null,null,null,null,null,null,null,null,null,null,null,null,null,null,null,null,null,null,null,null,null,"422",4,2,2,{"$f":"W2","v":"David"}]
[null,null,null,null,null,null,null,null,null,null,null,null,null,null,null,null,null,null,null,null,null,null,null,null,null,null,"423",4,2,3,"NUL"]
[null,null,null,null,null,null,null,null,null,null,null,null,null,null,null,null,null,null,null,null,null,null,null,null,null,null,"424",4,2,4,{"$f":"V2","v":"Pierre"}]
[null,null,null,null,null,null,null,null,null,null,null,null,null,null,null,null,null,null,null,null,null,null,null,null,null,null,"425",4,2,5,{"$f":"V2","v":"Pierre"}]
[null,null,null,null,null,null,null,null,null,null,null,null,null,null,null,null,null,null,null,null,null,null,null,null,null,null,"426",4,2,6,{"$f":"V2","v":"Pierre"}]
[null,null,null,null,null,null,null,null,null,null,null,null,null,null,null,null,null,null,null,null,null,null,null,null,null,null,"427",4,2,7,{"$f":"V2","v":"Pierre"}]
[null,null,null,null,null,null,null,null,null,null,null,null,null,null,null,null,null,null,null,null,null,null,null,null,null,null,"428",4,2,8,{"$f":"W2","v":"David"}]
[null,null,null,null,null,null,null,null,null,null,null,null,null,null,null,null,null,null,null,null,null,null,null,null,null,null,"429",4,2,9,{"$f":"W2","v":"David"}]
[null,null,null,null,null,null,null,null,null,null,null,null,null,null,null,null,null,null,null,null,null,null,null,null,null,null,"431",4,3,1,{"$f":"W2","v":"David"}]
[null,null,null,null,null,null,null,null,null,null,null,null,null,null,null,null,null,null,null,null,null,null,null,null,null,null,"432",4,3,2,{"$f":"W2","v":"David"}]
[null,null,null,null,null,null,null,null,null,null,null,null,null,null,null,null,null,null,null,null,null,null,null,null,null,null,"433",4,3,3,{"$f":"W2","v":"David"}]
[null,null,null,null,null,null,null,null,null,null,null,null,null,null,null,null,null,null,null,null,null,null,null,null,null,null,"434",4,3,4,{"$f":"V2","v":"Pierre"}]
[null,null,null,null,null,null,null,null,null,null,null,null,null,null,null,null,null,null,null,null,null,null,null,null,null,null,"435",4,3,5,{"$f":"V2","v":"Pierre"}]
[null,null,null,null,null,null,null,null,null,null,null,null,null,null,null,null,null,null,null,null,null,null,null,null,null,null,"436",4,3,6,{"$f":"V2","v":"Pierre"}]
[null,null,null,null,null,null,null,null,null,null,null,null,null,null,null,null,null,null,null,null,null,null,null,null,null,null,"437",4,3,7,{"$f":"V2","v":"Pierre"}]
[null,null,null,null,null,null,null,null,null,null,null,null,null,null,null,null,null,null,null,null,null,null,null,null,null,null,"438",4,3,8,"NUL"]
[null,null,null,null,null,null,null,null,null,null,null,null,null,null,null,null,null,null,null,null,null,null,null,null,null,null,"439",4,3,9,{"$f":"W2","v":"David"}]
[null,null,null,null,null,null,null,null,null,null,null,null,null,null,null,null,null,null,null,null,null,null,null,null,null,null,"441",4,4,1,{"$f":"V2","v":"Pierre"}]
[null,null,null,null,null,null,null,null,null,null,null,null,null,null,null,null,null,null,null,null,null,null,null,null,null,null,"442",4,4,2,{"$f":"V2","v":"Pierre"}]
[null,null,null,null,null,null,null,null,null,null,null,null,null,null,null,null,null,null,null,null,null,null,null,null,null,null,"443",4,4,3,"NUL"]
[null,null,null,null,null,null,null,null,null,null,null,null,null,null,null,null,null,null,null,null,null,null,null,null,null,null,"445",4,4,5,"NUL"]
[null,null,null,null,null,null,null,null,null,null,null,null,null,null,null,null,null,null,null,null,null,null,null,null,null,null,"446",4,4,6,{"$f":"V2","v":"Pierre"}]
[null,null,null,null,null,null,null,null,null,null,null,null,null,null,null,null,null,null,null,null,null,null,null,null,null,null,"447",4,4,7,{"$f":"W2","v":"David"}]
[null,null,null,null,null,null,null,null,null,null,null,null,null,null,null,null,null,null,null,null,null,null,null,null,null,null,"448",4,4,8,{"$f":"V2","v":"Pierre"}]
[null,null,null,null,null,null,null,null,null,null,null,null,null,null,null,null,null,null,null,null,null,null,null,null,null,null,"449",4,4,9,{"$f":"V2","v":"Pierre"}]
[null,null,null,null,null,null,null,null,null,null,null,null,null,null,null,null,null,null,null,null,null,null,null,null,null,null,"451",4,5,1,{"$f":"V2","v":"Pierre"}]
[null,null,null,null,null,null,null,null,null,null,null,null,null,null,null,null,null,null,null,null,null,null,null,null,null,null,"452",4,5,2,{"$f":"V2","v":"Pierre"}]
[null,null,null,null,null,null,null,null,null,null,null,null,null,null,null,null,null,null,null,null,null,null,null,null,null,null,"453",4,5,3,{"$f":"V2","v":"Pierre"}]
[null,null,null,null,null,null,null,null,null,null,null,null,null,null,null,null,null,null,null,null,null,null,null,null,null,null,"454",4,5,4,{"$f":"V2","v":"Pierre"}]
[null,null,null,null,null,null,null,null,null,null,null,null,null,null,null,null,null,null,null,null,null,null,null,null,null,null,"455",4,5,5,{"$f":"W2","v":"David"}]
[null,null,null,null,null,null,null,null,null,null,null,null,null,null,null,null,null,null,null,null,null,null,null,null,null,null,"456",4,5,6,{"$f":"W2","v":"David"}]
[null,null,null,null,null,null,null,null,null,null,null,null,null,null,null,null,null,null,null,null,null,null,null,null,null,null,"457",4,5,7,{"$f":"W2","v":"David"}]
[null,null,null,null,null,null,null,null,null,null,null,null,null,null,null,null,null,null,null,null,null,null,null,null,null,null,"458",4,5,8,{"$f":"W2","v":"David"}]
[null,null,null,null,null,null,null,null,null,null,null,null,null,null,null,null,null,null,null,null,null,null,null,null,null,null,"459",4,5,9,"NUL"]
[null,null,null,null,null,null,null,null,null,null,null,null,null,null,null,null,null,null,null,null,null,null,null,null,null,null,"461",4,6,1,{"$f":"V2","v":"Pierre"}]
[null,null,null,null,null,null,null,null,null,null,null,null,null,null,null,null,null,null,null,null,null,null,null,null,null,null,"462",4,6,2,{"$f":"V2","v":"Pierre"}]
[null,null,null,null,null,null,null,null,null,null,null,null,null,null,null,null,null,null,null,null,null,null,null,null,null,null,"463",4,6,3,{"$f":"V2","v":"Pierre"}]
[null,null,null,null,null,null,null,null,null,null,null,null,null,null,null,null,null,null,null,null,null,null,null,null,null,null,"464",4,6,4,{"$f":"V2","v":"Pierre"}]
[null,null,null,null,null,null,null,null,null,null,null,null,null,null,null,null,null,null,null,null,null,null,null,null,null,null,"465",4,6,5,"NUL"]
[null,null,null,null,null,null,null,null,null,null,null,null,null,null,null,null,null,null,null,null,null,null,null,null,null,null,"466",4,6,6,{"$f":"W2","v":"David"}]
[null,null,null,null,null,null,null,null,null,null,null,null,null,null,null,null,null,null,null,null,null,null,null,null,null,null,"467",4,6,7,{"$f":"W2","v":"David"}]
[null,null,null,null,null,null,null,null,null,null,null,null,null,null,null,null,null,null,null,null,null,null,null,null,null,null,"468",4,6,8,{"$f":"W2","v":"David"}]
[null,null,null,null,null,null,null,null,null,null,null,null,null,null,null,null,null,null,null,null,null,null,null,null,null,null,"469",4,6,9,{"$f":"W2","v":"David"}]
[null,null,null,null,null,null,null,null,null,null,null,null,null,null,null,null,null,null,null,null,null,null,null,null,null,null,"471",4,7,1,"NUL"]
[null,null,null,null,null,null,null,null,null,null,null,null,null,null,null,null,null,null,null,null,null,null,null,null,null,null,"472",4,7,2,{"$f":"V2","v":"Pierre"}]
[null,null,null,null,null,null,null,null,null,null,null,null,null,null,null,null,null,null,null,null,null,null,null,null,null,null,"473",4,7,3,{"$f":"V2","v":"Pierre"}]
[null,null,null,null,null,null,null,null,null,null,null,null,null,null,null,null,null,null,null,null,null,null,null,null,null,null,"474",4,7,4,{"$f":"V2","v":"Pierre"}]
[null,null,null,null,null,null,null,null,null,null,null,null,null,null,null,null,null,null,null,null,null,null,null,null,null,null,"475",4,7,5,{"$f":"W2","v":"David"}]
[null,null,null,null,null,null,null,null,null,null,null,null,null,null,null,null,null,null,null,null,null,null,null,null,null,null,"476",4,7,6,{"$f":"W2","v":"David"}]
[null,null,null,null,null,null,null,null,null,null,null,null,null,null,null,null,null,null,null,null,null,null,null,null,null,null,"477",4,7,7,{"$f":"W2","v":"David"}]
[null,null,null,null,null,null,null,null,null,null,null,null,null,null,null,null,null,null,null,null,null,null,null,null,null,null,"478",4,7,8,{"$f":"W2","v":"David"}]
[null,null,null,null,null,null,null,null,null,null,null,null,null,null,null,null,null,null,null,null,null,null,null,null,null,null,"479",4,7,9,{"$f":"W2","v":"David"}]
[null,null,null,null,null,null,null,null,null,null,null,null,null,null,null,null,null,null,null,null,null,null,null,null,null,null,"481",4,8,1,{"$f":"W2","v":"David"}]
[null,null,null,null,null,null,null,null,null,null,null,null,null,null,null,null,null,null,null,null,null,null,null,null,null,null,"482",4,8,2,{"$f":"V2","v":"Pierre"}]
[null,null,null,null,null,null,null,null,null,null,null,null,null,null,null,null,null,null,null,null,null,null,null,null,null,null,"483",4,8,3,{"$f":"V2","v":"Pierre"}]
[null,null,null,null,null,null,null,null,null,null,null,null,null,null,null,null,null,null,null,null,null,null,null,null,null,null,"484",4,8,4,{"$f":"V2","v":"Pierre"}]
[null,null,null,null,null,null,null,null,null,null,null,null,null,null,null,null,null,null,null,null,null,null,null,null,null,null,"485",4,8,5,{"$f":"V2","v":"Pierre"}]
[null,null,null,null,null,null,null,null,null,null,null,null,null,null,null,null,null,null,null,null,null,null,null,null,null,null,"486",4,8,6,"NUL"]
[null,null,null,null,null,null,null,null,null,null,null,null,null,null,null,null,null,null,null,null,null,null,null,null,null,null,"487",4,8,7,{"$f":"W2","v":"David"}]
[null,null,null,null,null,null,null,null,null,null,null,null,null,null,null,null,null,null,null,null,null,null,null,null,null,null,"488",4,8,8,{"$f":"W2","v":"David"}]
[null,null,null,null,null,null,null,null,null,null,null,null,null,null,null,null,null,null,null,null,null,null,null,null,null,null,"489",4,8,9,{"$f":"W2","v":"David"}]
[null,null,null,null,null,null,null,null,null,null,null,null,null,null,null,null,null,null,null,null,null,null,null,null,null,null,"491",4,9,1,{"$f":"W2","v":"David"}]
[null,null,null,null,null,null,null,null,null,null,null,null,null,null,null,null,null,null,null,null,null,null,null,null,null,null,{"$f":"CONCATENATE(AB323,AC323,AD323)","v":"492"},4,9,2,"NUL"]
[null,null,null,null,null,null,null,null,null,null,null,null,null,null,null,null,null,null,null,null,null,null,null,null,null,null,"493",4,9,3,{"$f":"V2","v":"Pierre"}]
[null,null,null,null,null,null,null,null,null,null,null,null,null,null,null,null,null,null,null,null,null,null,null,null,null,null,"494",4,9,4,{"$f":"V2","v":"Pierre"}]
[null,null,null,null,null,null,null,null,null,null,null,null,null,null,null,null,null,null,null,null,null,null,null,null,null,null,"495",4,9,5,{"$f":"V2","v":"Pierre"}]
[null,null,null,null,null,null,null,null,null,null,null,null,null,null,null,null,null,null,null,null,null,null,null,null,null,null,"496",4,9,6,{"$f":"V2","v":"Pierre"}]
[null,null,null,null,null,null,null,null,null,null,null,null,null,null,null,null,null,null,null,null,null,null,null,null,null,null,"497",4,9,7,{"$f":"W2","v":"David"}]
[null,null,null,null,null,null,null,null,null,null,null,null,null,null,null,null,null,null,null,null,null,null,null,null,null,null,"498",4,9,8,{"$f":"W2","v":"David"}]
[null,null,null,null,null,null,null,null,null,null,null,null,null,null,null,null,null,null,null,null,null,null,null,null,null,null,"499",4,9,9,{"$f":"W2","v":"David"}]
[null,null,null,null,null,null,null,null,null,null,null,null,null,null,null,null,null,null,null,null,null,null,null,null,null,null,"511",5,1,1,{"$f":"W2","v":"David"}]
[null,null,null,null,null,null,null,null,null,null,null,null,null,null,null,null,null,null,null,null,null,null,null,null,null,null,"512",5,1,2,{"$f":"W2","v":"David"}]
[null,null,null,null,null,null,null,null,null,null,null,null,null,null,null,null,null,null,null,null,null,null,null,null,null,null,"513",5,1,3,"NUL"]
[null,null,null,null,null,null,null,null,null,null,null,null,null,null,null,null,null,null,null,null,null,null,null,null,null,null,"514",5,1,4,{"$f":"V2","v":"Pierre"}]
[null,null,null,null,null,null,null,null,null,null,null,null,null,null,null,null,null,null,null,null,null,null,null,null,null,null,"515",5,1,5,{"$f":"V2","v":"Pierre"}]
[null,null,null,null,null,null,null,null,null,null,null,null,null,null,null,null,null,null,null,null,null,null,null,null,null,null,"516",5,1,6,{"$f":"V2","v":"Pierre"}]
[null,null,null,null,null,null,null,null,null,null,null,null,null,null,null,null,null,null,null,null,null,null,null,null,null,null,"517",5,1,7,{"$f":"V2","v":"Pierre"}]
[null,null,null,null,null,null,null,null,null,null,null,null,null,null,null,null,null,null,null,null,null,null,null,null,null,null,"518",5,1,8,{"$f":"W2","v":"David"}]
[null,null,null,null,null,null,null,null,null,null,null,null,null,null,null,null,null,null,null,null,null,null,null,null,null,null,"519",5,1,9,{"$f":"W2","v":"David"}]
[null,null,null,null,null,null,null,null,null,null,null,null,null,null,null,null,null,null,null,null,null,null,null,null,null,null,"521",5,2,1,{"$f":"W2","v":"David"}]
[null,null,null,null,null,null,null,null,null,null,null,null,null,null,null,null,null,null,null,null,null,null,null,null,null,null,"522",5,2,2,{"$f":"W2","v":"David"}]
[null,null,null,null,null,null,null,null,null,null,null,null,null,null,null,null,null,null,null,null,null,null,null,null,null,null,"523",5,2,3,{"$f":"W2","v":"David"}]
[null,null,null,null,null,null,null,null,null,null,null,null,null,null,null,null,null,null,null,null,null,null,null,null,null,null,"524",5,2,4,{"$f":"W2","v":"David"}]
[null,null,null,null,null,null,null,null,null,null,null,null,null,null,null,null,null,null,null,null,null,null,null,null,null,null,"525",5,2,5,{"$f":"V2","v":"Pierre"}]
[null,null,null,null,null,null,null,null,null,null,null,null,null,null,null,null,null,null,null,null,null,null,null,null,null,null,"526",5,2,6,{"$f":"V2","v":"Pierre"}]
[null,null,null,null,null,null,null,null,null,null,null,null,null,null,null,null,null,null,null,null,null,null,null,null,null,null,"527",5,2,7,{"$f":"V2","v":"Pierre"}]
[null,null,null,null,null,null,null,null,null,null,null,null,null,null,null,null,null,null,null,null,null,null,null,null,null,null,"528",5,2,8,"NUL"]
[null,null,null,null,null,null,null,null,null,null,null,null,null,null,null,null,null,null,null,null,null,null,null,null,null,null,"529",5,2,9,{"$f":"W2","v":"David"}]
[null,null,null,null,null,null,null,null,null,null,null,null,null,null,null,null,null,null,null,null,null,null,null,null,null,null,"531",5,3,1,{"$f":"W2","v":"David"}]
[null,null,null,null,null,null,null,null,null,null,null,null,null,null,null,null,null,null,null,null,null,null,null,null,null,null,"532",5,3,2,{"$f":"W2","v":"David"}]
[null,null,null,null,null,null,null,null,null,null,null,null,null,null,null,null,null,null,null,null,null,null,null,null,null,null,"533",5,3,3,{"$f":"W2","v":"David"}]
[null,null,null,null,null,null,null,null,null,null,null,null,null,null,null,null,null,null,null,null,null,null,null,null,null,null,"534",5,3,4,"NUL"]
[null,null,null,null,null,null,null,null,null,null,null,null,null,null,null,null,null,null,null,null,null,null,null,null,null,null,"535",5,3,5,{"$f":"V2","v":"Pierre"}]
[null,null,null,null,null,null,null,null,null,null,null,null,null,null,null,null,null,null,null,null,null,null,null,null,null,null,"536",5,3,6,{"$f":"V2","v":"Pierre"}]
[null,null,null,null,null,null,null,null,null,null,null,null,null,null,null,null,null,null,null,null,null,null,null,null,null,null,"537",5,3,7,{"$f":"V2","v":"Pierre"}]
[null,null,null,null,null,null,null,null,null,null,null,null,null,null,null,null,null,null,null,null,null,null,null,null,null,null,"538",5,3,8,{"$f":"V2","v":"Pierre"}]
[null,null,null,null,null,null,null,null,null,null,null,null,null,null,null,null,null,null,null,null,null,null,null,null,null,null,"539",5,3,9,{"$f":"W2","v":"David"}]
[null,null,null,null,null,null,null,null,null,null,null,null,null,null,null,null,null,null,null,null,null,null,null,null,null,null,"541",5,4,1,{"$f":"W2","v":"David"}]
[null,null,null,null,null,null,null,null,null,null,null,null,null,null,null,null,null,null,null,null,null,null,null,null,null,null,"542",5,4,2,{"$f":"W2","v":"David"}]
[null,null,null,null,null,null,null,null,null,null,null,null,null,null,null,null,null,null,null,null,null,null,null,null,null,null,"543",5,4,3,{"$f":"W2","v":"David"}]
[null,null,null,null,null,null,null,null,null,null,null,null,null,null,null,null,null,null,null,null,null,null,null,null,null,null,"544",5,4,4,{"$f":"W2","v":"David"}]
[null,null,null,null,null,null,null,null,null,null,null,null,null,null,null,null,null,null,null,null,null,null,null,null,null,null,"545",5,4,5,{"$f":"V2","v":"Pierre"}]
[null,null,null,null,null,null,null,null,null,null,null,null,null,null,null,null,null,null,null,null,null,null,null,null,null,null,"546",5,4,6,{"$f":"V2","v":"Pierre"}]
[null,null,null,null,null,null,null,null,null,null,null,null,null,null,null,null,null,null,null,null,null,null,null,null,null,null,"547",5,4,7,{"$f":"V2","v":"Pierre"}]
[null,null,null,null,null,null,null,null,null,null,null,null,null,null,null,null,null,null,null,null,null,null,null,null,null,null,"548",5,4,8,{"$f":"V2","v":"Pierre"}]
[null,null,null,null,null,null,null,null,null,null,null,null,null,null,null,null,null,null,null,null,null,null,null,null,null,null,"549",5,4,9,"NUL"]
[null,null,null,null,null,null,null,null,null,null,null,null,null,null,null,null,null,null,null,null,null,null,null,null,null,null,"551",5,5,1,{"$f":"V2","v":"Pierre"}]
[null,null,null,null,null,null,null,null,null,null,null,null,null,null,null,null,null,null,null,null,null,null,null,null,null,null,"552",5,5,2,{"$f":"V2","v":"Pierre"}]
[null,null,null,null,null,null,null,null,null,null,null,null,null,null,null,null,null,null,null,null,null,null,null,null,null,null,"553",5,5,3,{"$f":"V2","v":"Pierre"}]
[null,null,null,null,null,null,null,null,null,null,null,null,null,null,null,null,null,null,null,null,null,null,null,null,null,null,"554",5,5,4,"NUL"]
[null,null,null,null,null,null,null,null,null,null,null,null,null,null,null,null,null,null,null,null,null,null,null,null,null,null,"556",5,5,6,"NUL"]
[null,null,null,null,null,null,null,null,null,null,null,null,null,null,null,null,null,null,null,null,null,null,null,null,null,null,"557",5,5,7,{"$f":"V2","v":"Pierre"}]
[null,null,null,null,null,null,null,null,null,null,null,null,null,null,null,null,null,null,null,null,null,null,null,null,null,null,"558",5,5,8,{"$f":"W2","v":"David"}]
[null,null,null,null,null,null,null,null,null,null,null,null,null,null,null,null,null,null,null,null,null,null,null,null,null,null,"559",5,5,9,{"$f":"V2","v":"Pierre"}]
[null,null,null,null,null,null,null,null,null,null,null,null,null,null,null,null,null,null,null,null,null,null,null,null,null,null,"561",5,6,1,"NUL"]
[null,null,null,null,null,null,null,null,null,null,null,null,null,null,null,null,null,null,null,null,null,null,null,null,null,null,"562",5,6,2,{"$f":"V2","v":"Pierre"}]
[null,null,null,null,null,null,null,null,null,null,null,null,null,null,null,null,null,null,null,null,null,null,null,null,null,null,"563",5,6,3,{"$f":"V2","v":"Pierre"}]
[null,null,null,null,null,null,null,null,null,null,null,null,null,null,null,null,null,null,null,null,null,null,null,null,null,null,"564",5,6,4,{"$f":"V2","v":"Pierre"}]
[null,null,null,null,null,null,null,null,null,null,null,null,null,null,null,null,null,null,null,null,null,null,null,null,null,null,"565",5,6,5,{"$f":"V2","v":"Pierre"}]
[null,null,null,null,null,null,null,null,null,null,null,null,null,null,null,null,null,null,null,null,null,null,null,null,null,null,"566",5,6,6,{"$f":"W2","v":"David"}]
[null,null,null,null,null,null,null,null,null,null,null,null,null,null,null,null,null,null,null,null,null,null,null,null,null,null,"567",5,6,7,{"$f":"W2","v":"David"}]
[null,null,null,null,null,null,null,null,null,null,null,null,null,null,null,null,null,null,null,null,null,null,null,null,null,null,"568",5,6,8,{"$f":"W2","v":"David"}]
[null,null,null,null,null,null,null,null,null,null,null,null,null,null,null,null,null,null,null,null,null,null,null,null,null,null,"569",5,6,9,{"$f":"W2","v":"David"}]
[null,null,null,null,null,null,null,null,null,null,null,null,null,null,null,null,null,null,null,null,null,null,null,null,null,null,"571",5,7,1,{"$f":"W2","v":"David"}]
[null,null,null,null,null,null,null,null,null,null,null,null,null,null,null,null,null,null,null,null,null,null,null,null,null,null,"572",5,7,2,{"$f":"V2","v":"Pierre"}]
[null,null,null,null,null,null,null,null,null,null,null,null,null,null,null,null,null,null,null,null,null,null,null,null,null,null,"573",5,7,3,{"$f":"V2","v":"Pierre"}]
[null,null,null,null,null,null,null,null,null,null,null,null,null,null,null,null,null,null,null,null,null,null,null,null,null,null,{"$f":"CONCATENATE(AB387,AC387,AD387)","v":"574"},5,7,4,{"$f":"V2","v":"Pierre"}]
[null,null,null,null,null,null,null,null,null,null,null,null,null,null,null,null,null,null,null,null,null,null,null,null,null,null,"575",5,7,5,{"$f":"V2","v":"Pierre"}]
[null,null,null,null,null,null,null,null,null,null,null,null,null,null,null,null,null,null,null,null,null,null,null,null,null,null,"576",5,7,6,"NUL"]
[null,null,null,null,null,null,null,null,null,null,null,null,null,null,null,null,null,null,null,null,null,null,null,null,null,null,"577",5,7,7,{"$f":"W2","v":"David"}]
[null,null,null,null,null,null,null,null,null,null,null,null,null,null,null,null,null,null,null,null,null,null,null,null,null,null,"578",5,7,8,{"$f":"W2","v":"David"}]
[null,null,null,null,null,null,null,null,null,null,null,null,null,null,null,null,null,null,null,null,null,null,null,null,null,null,"579",5,7,9,{"$f":"W2","v":"David"}]
[null,null,null,null,null,null,null,null,null,null,null,null,null,null,null,null,null,null,null,null,null,null,null,null,null,null,"581",5,8,1,{"$f":"W2","v":"David"}]
[null,null,null,null,null,null,null,null,null,null,null,null,null,null,null,null,null,null,null,null,null,null,null,null,null,null,"582",5,8,2,"NUL"]
[null,null,null,null,null,null,null,null,null,null,null,null,null,null,null,null,null,null,null,null,null,null,null,null,null,null,"583",5,8,3,{"$f":"V2","v":"Pierre"}]
[null,null,null,null,null,null,null,null,null,null,null,null,null,null,null,null,null,null,null,null,null,null,null,null,null,null,"584",5,8,4,{"$f":"V2","v":"Pierre"}]
[null,null,null,null,null,null,null,null,null,null,null,null,null,null,null,null,null,null,null,null,null,null,null,null,null,null,"585",5,8,5,{"$f":"V2","v":"Pierre"}]
[null,null,null,null,null,null,null,null,null,null,null,null,null,null,null,null,null,null,null,null,null,null,null,null,null,null,"586",5,8,6,{"$f":"V2","v":"Pierre"}]
[null,null,null,null,null,null,null,null,null,null,null,null,null,null,null,null,null,null,null,null,null,null,null,null,null,null,"587",5,8,7,{"$f":"W2","v":"David"}]
[null,null,null,null,null,null,null,null,null,null,null,null,null,null,null,null,null,null,null,null,null,null,null,null,null,null,"588",5,8,8,{"$f":"W2","v":"David"}]
[null,null,null,null,null,null,null,null,null,null,null,null,null,null,null,null,null,null,null,null,null,null,null,null,null,null,"589",5,8,9,{"$f":"W2","v":"David"}]
[null,null,null,null,null,null,null,null,null,null,null,null,null,null,null,null,null,null,null,null,null,null,null,null,null,null,"591",5,9,1,{"$f":"W2","v":"David"}]
[null,null,null,null,null,null,null,null,null,null,null,null,null,null,null,null,null,null,null,null,null,null,null,null,null,null,"592",5,9,2,{"$f":"W2","v":"David"}]
[null,null,null,null,null,null,null,null,null,null,null,null,null,null,null,null,null,null,null,null,null,null,null,null,null,null,"593",5,9,3,{"$f":"V2","v":"Pierre"}]
[null,null,null,null,null,null,null,null,null,null,null,null,null,null,null,null,null,null,null,null,null,null,null,null,null,null,"594",5,9,4,{"$f":"V2","v":"Pierre"}]
[null,null,null,null,null,null,null,null,null,null,null,null,null,null,null,null,null,null,null,null,null,null,null,null,null,null,"595",5,9,5,{"$f":"V2","v":"Pierre"}]
[null,null,null,null,null,null,null,null,null,null,null,null,null,null,null,null,null,null,null,null,null,null,null,null,null,null,"596",5,9,6,{"$f":"V2","v":"Pierre"}]
[null,null,null,null,null,null,null,null,null,null,null,null,null,null,null,null,null,null,null,null,null,null,null,null,null,null,"597",5,9,7,"NUL"]
[null,null,null,null,null,null,null,null,null,null,null,null,null,null,null,null,null,null,null,null,null,null,null,null,null,null,"598",5,9,8,{"$f":"V2","v":"Pierre"}]
[null,null,null,null,null,null,null,null,null,null,null,null,null,null,null,null,null,null,null,null,null,null,null,null,null,null,"599",5,9,9,{"$f":"V2","v":"Pierre"}]
[null,null,null,null,null,null,null,null,null,null,null,null,null,null,null,null,null,null,null,null,null,null,null,null,null,null,"611",6,1,1,{"$f":"W2","v":"David"}]
[null,null,null,null,null,null,null,null,null,null,null,null,null,null,null,null,null,null,null,null,null,null,null,null,null,null,"612",6,1,2,{"$f":"W2","v":"David"}]
[null,null,null,null,null,null,null,null,null,null,null,null,null,null,null,null,null,null,null,null,null,null,null,null,null,null,"613",6,1,3,{"$f":"W2","v":"David"}]
[null,null,null,null,null,null,null,null,null,null,null,null,null,null,null,null,null,null,null,null,null,null,null,null,null,null,"614",6,1,4,{"$f":"W2","v":"David"}]
[null,null,null,null,null,null,null,null,null,null,null,null,null,null,null,null,null,null,null,null,null,null,null,null,null,null,"615",6,1,5,{"$f":"V2","v":"Pierre"}]
[null,null,null,null,null,null,null,null,null,null,null,null,null,null,null,null,null,null,null,null,null,null,null,null,null,null,"616",6,1,6,{"$f":"V2","v":"Pierre"}]
[null,null,null,null,null,null,null,null,null,null,null,null,null,null,null,null,null,null,null,null,null,null,null,null,null,null,"617",6,1,7,{"$f":"V2","v":"Pierre"}]
[null,null,null,null,null,null,null,null,null,null,null,null,null,null,null,null,null,null,null,null,null,null,null,null,null,null,"618",6,1,8,"NUL"]
[null,null,null,null,null,null,null,null,null,null,null,null,null,null,null,null,null,null,null,null,null,null,null,null,null,null,"619",6,1,9,{"$f":"W2","v":"David"}]
[null,null,null,null,null,null,null,null,null,null,null,null,null,null,null,null,null,null,null,null,null,null,null,null,null,null,"621",6,2,1,{"$f":"W2","v":"David"}]
[null,null,null,null,null,null,null,null,null,null,null,null,null,null,null,null,null,null,null,null,null,null,null,null,null,null,"622",6,2,2,{"$f":"W2","v":"David"}]
[null,null,null,null,null,null,null,null,null,null,null,null,null,null,null,null,null,null,null,null,null,null,null,null,null,null,"623",6,2,3,{"$f":"W2","v":"David"}]
[null,null,null,null,null,null,null,null,null,null,null,null,null,null,null,null,null,null,null,null,null,null,null,null,null,null,"624",6,2,4,"NUL"]
[null,null,null,null,null,null,null,null,null,null,null,null,null,null,null,null,null,null,null,null,null,null,null,null,null,null,"625",6,2,5,{"$f":"V2","v":"Pierre"}]
[null,null,null,null,null,null,null,null,null,null,null,null,null,null,null,null,null,null,null,null,null,null,null,null,null,null,"626",6,2,6,{"$f":"V2","v":"Pierre"}]
[null,null,null,null,null,null,null,null,null,null,null,null,null,null,null,null,null,null,null,null,null,null,null,null,null,null,"627",6,2,7,{"$f":"V2","v":"Pierre"}]
[null,null,null,null,null,null,null,null,null,null,null,null,null,null,null,null,null,null,null,null,null,null,null,null,null,null,"628",6,2,8,{"$f":"V2","v":"Pierre"}]
[null,null,null,null,null,null,null,null,null,null,null,null,null,null,null,null,null,null,null,null,null,null,null,null,null,null,"629",6,2,9,{"$f":"V2","v":"Pierre"}]
[null,null,null,null,null,null,null,null,null,null,null,null,null,null,null,null,null,null,null,null,null,null,null,null,null,null,"631",6,3,1,{"$f":"W2","v":"David"}]
[null,null,null,null,null,null,null,null,null,null,null,null,null,null,null,null,null,null,null,null,null,null,null,null,null,null,"632",6,3,2,{"$f":"W2","v":"David"}]
[null,null,null,null,null,null,null,null,null,null,null,null,null,null,null,null,null,null,null,null,null,null,null,null,null,null,"633",6,3,3,{"$f":"W2","v":"David"}]
[null,null,null,null,null,null,null,null,null,null,null,null,null,null,null,null,null,null,null,null,null,null,null,null,null,null,"634",6,3,4,{"$f":"W2","v":"David"}]
[null,null,null,null,null,null,null,null,null,null,null,null,null,null,null,null,null,null,null,null,null,null,null,null,null,null,"635",6,3,5,{"$f":"V2","v":"Pierre"}]
[null,null,null,null,null,null,null,null,null,null,null,null,null,null,null,null,null,null,null,null,null,null,null,null,null,null,"636",6,3,6,{"$f":"V2","v":"Pierre"}]
[null,null,null,null,null,null,null,null,null,null,null,null,null,null,null,null,null,null,null,null,null,null,null,null,null,null,"637",6,3,7,{"$f":"V2","v":"Pierre"}]
[null,null,null,null,null,null,null,null,null,null,null,null,null,null,null,null,null,null,null,null,null,null,null,null,null,null,"638",6,3,8,{"$f":"V2","v":"Pierre"}]
[null,null,null,null,null,null,null,null,null,null,null,null,null,null,null,null,null,null,null,null,null,null,null,null,null,null,"639",6,3,9,"NUL"]
[null,null,null,null,null,null,null,null,null,null,null,null,null,null,null,null,null,null,null,null,null,null,null,null,null,null,"641",6,4,1,{"$f":"W2","v":"David"}]
[null,null,null,null,null,null,null,null,null,null,null,null,null,null,null,null,null,null,null,null,null,null,null,null,null,null,"642",6,4,2,{"$f":"W2","v":"David"}]
[null,null,null,null,null,null,null,null,null,null,null,null,null,null,null,null,null,null,null,null,null,null,null,null,null,null,"643",6,4,3,{"$f":"W2","v":"David"}]
[null,null,null,null,null,null,null,null,null,null,null,null,null,null,null,null,null,null,null,null,null,null,null,null,null,null,"644",6,4,4,{"$f":"W2","v":"David"}]
[null,null,null,null,null,null,null,null,null,null,null,null,null,null,null,null,null,null,null,null,null,null,null,null,null,null,"645",6,4,5,"NUL"]
[null,null,null,null,null,null,null,null,null,null,null,null,null,null,null,null,null,null,null,null,null,null,null,null,null,null,"646",6,4,6,{"$f":"V2","v":"Pierre"}]
[null,null,null,null,null,null,null,null,null,null,null,null,null,null,null,null,null,null,null,null,null,null,null,null,null,null,"647",6,4,7,{"$f":"V2","v":"Pierre"}]
[null,null,null,null,null,null,null,null,null,null,null,null,null,null,null,null,null,null,null,null,null,null,null,null,null,null,"648",6,4,8,{"$f":"V2","v":"Pierre"}]
[null,null,null,null,null,null,null,null,null,null,null,null,null,null,null,null,null,null,null,null,null,null,null,null,null,null,"649",6,4,9,{"$f":"V2","v":"Pierre"}]
[null,null,null,null,null,null,null,null,null,null,null,null,null,null,null,null,null,null,null,null,null,null,null,null,null,null,"651",6,5,1,"NUL"]
[null,null,null,null,null,null,null,null,null,null,null,null,null,null,null,null,null,null,null,null,null,null,null,null,null,null,"652",6,5,2,{"$f":"W2","v":"David"}]
[null,null,null,null,null,null,null,null,null,null,null,null,null,null,null,null,null,null,null,null,null,null,null,null,null,null,"653",6,5,3,{"$f":"W2","v":"David"}]
[null,null,null,null,null,null,null,null,null,null,null,null,null,null,null,null,null,null,null,null,null,null,null,null,null,null,"654",6,5,4,{"$f":"W2","v":"David"}]
[null,null,null,null,null,null,null,null,null,null,null,null,null,null,null,null,null,null,null,null,null,null,null,null,null,null,{"$f":"CONCATENATE(AB451,AC451,AD451)","v":"655"},6,5,5,{"$f":"W2","v":"David"}]
[null,null,null,null,null,null,null,null,null,null,null,null,null,null,null,null,null,null,null,null,null,null,null,null,null,null,"656",6,5,6,{"$f":"V2","v":"Pierre"}]
[null,null,null,null,null,null,null,null,null,null,null,null,null,null,null,null,null,null,null,null,null,null,null,null,null,null,"657",6,5,7,{"$f":"V2","v":"Pierre"}]
[null,null,null,null,null,null,null,null,null,null,null,null,null,null,null,null,null,null,null,null,null,null,null,null,null,null,"658",6,5,8,{"$f":"V2","v":"Pierre"}]
[null,null,null,null,null,null,null,null,null,null,null,null,null,null,null,null,null,null,null,null,null,null,null,null,null,null,"659",6,5,9,{"$f":"V2","v":"Pierre"}]
[null,null,null,null,null,null,null,null,null,null,null,null,null,null,null,null,null,null,null,null,null,null,null,null,null,null,"661",6,6,1,{"$f":"V2","v":"Pierre"}]
[null,null,null,null,null,null,null,null,null,null,null,null,null,null,null,null,null,null,null,null,null,null,null,null,null,null,"662",6,6,2,{"$f":"V2","v":"Pierre"}]
[null,null,null,null,null,null,null,null,null,null,null,null,null,null,null,null,null,null,null,null,null,null,null,null,null,null,"663",6,6,3,{"$f":"V2","v":"Pierre"}]
[null,null,null,null,null,null,null,null,null,null,null,null,null,null,null,null,null,null,null,null,null,null,null,null,null,null,"664",6,6,4,{"$f":"V2","v":"Pierre"}]
[null,null,null,null,null,null,null,null,null,null,null,null,null,null,null,null,null,null,null,null,null,null,null,null,null,null,"665",6,6,5,"NUL"]
[null,null,null,null,null,null,null,null,null,null,null,null,null,null,null,null,null,null,null,null,null,null,null,null,null,null,"667",6,6,7,"NUL"]
[null,null,null,null,null,null,null,null,null,null,null,null,null,null,null,null,null,null,null,null,null,null,null,null,null,null,"668",6,6,8,{"$f":"V2","v":"Pierre"}]
[null,null,null,null,null,null,null,null,null,null,null,null,null,null,null,null,null,null,null,null,null,null,null,null,null,null,"669",6,6,9,{"$f":"W2","v":"David"}]
[null,null,null,null,null,null,null,null,null,null,null,null,null,null,null,null,null,null,null,null,null,null,null,null,null,null,"671",6,7,1,{"$f":"W2","v":"David"}]
[null,null,null,null,null,null,null,null,null,null,null,null,null,null,null,null,null,null,null,null,null,null,null,null,null,null,"672",6,7,2,"NUL"]
[null,null,null,null,null,null,null,null,null,null,null,null,null,null,null,null,null,null,null,null,null,null,null,null,null,null,"673",6,7,3,{"$f":"V2","v":"Pierre"}]
[null,null,null,null,null,null,null,null,null,null,null,null,null,null,null,null,null,null,null,null,null,null,null,null,null,null,"674",6,7,4,{"$f":"V2","v":"Pierre"}]
[null,null,null,null,null,null,null,null,null,null,null,null,null,null,null,null,null,null,null,null,null,null,null,null,null,null,"675",6,7,5,{"$f":"V2","v":"Pierre"}]
[null,null,null,null,null,null,null,null,null,null,null,null,null,null,null,null,null,null,null,null,null,null,null,null,null,null,"676",6,7,6,{"$f":"V2","v":"Pierre"}]
[null,null,null,null,null,null,null,null,null,null,null,null,null,null,null,null,null,null,null,null,null,null,null,null,null,null,"677",6,7,7,{"$f":"W2","v":"David"}]
[null,null,null,null,null,null,null,null,null,null,null,null,null,null,null,null,null,null,null,null,null,null,null,null,null,null,"678",6,7,8,{"$f":"W2","v":"David"}]
[null,null,null,null,null,null,null,null,null,null,null,null,null,null,null,null,null,null,null,null,null,null,null,null,null,null,"679",6,7,9,{"$f":"W2","v":"David"}]
[null,null,null,null,null,null,null,null,null,null,null,null,null,null,null,null,null,null,null,null,null,null,null,null,null,null,"681",6,8,1,{"$f":"W2","v":"David"}]
[null,null,null,null,null,null,null,null,null,null,null,null,null,null,null,null,null,null,null,null,null,null,null,null,null,null,"682",6,8,2,{"$f":"W2","v":"David"}]
[null,null,null,null,null,null,null,null,null,null,null,null,null,null,null,null,null,null,null,null,null,null,null,null,null,null,"683",6,8,3,{"$f":"V2","v":"Pierre"}]
[null,null,null,null,null,null,null,null,null,null,null,null,null,null,null,null,null,null,null,null,null,null,null,null,null,null,"684",6,8,4,{"$f":"V2","v":"Pierre"}]
[null,null,null,null,null,null,null,null,null,null,null,null,null,null,null,null,null,null,null,null,null,null,null,null,null,null,"685",6,8,5,{"$f":"V2","v":"Pierre"}]
[null,null,null,null,null,null,null,null,null,null,null,null,null,null,null,null,null,null,null,null,null,null,null,null,null,null,"686",6,8,6,{"$f":"V2","v":"Pierre"}]
[null,null,null,null,null,null,null,null,null,null,null,null,null,null,null,null,null,null,null,null,null,null,null,null,null,null,"687",6,8,7,"NUL"]
[null,null,null,null,null,null,null,null,null,null,null,null,null,null,null,null,null,null,null,null,null,null,null,null,null,null,"688",6,8,8,{"$f":"W2","v":"David"}]
[null,null,null,null,null,null,null,null,null,null,null,null,null,null,null,null,null,null,null,null,null,null,null,null,null,null,"689",6,8,9,{"$f":"W2","v":"David"}]
[null,null,null,null,null,null,null,null,null,null,null,null,null,null,null,null,null,null,null,null,null,null,null,null,null,null,"691",6,9,1,{"$f":"W2","v":"David"}]
[null,null,null,null,null,null,null,null,null,null,null,null,null,null,null,null,null,null,null,null,null,null,null,null,null,null,"692",6,9,2,{"$f":"W2","v":"David"}]
[null,null,null,null,null,null,null,null,null,null,null,null,null,null,null,null,null,null,null,null,null,null,null,null,null,null,"693",6,9,3,"NUL"]
[null,null,null,null,null,null,null,null,null,null,null,null,null,null,null,null,null,null,null,null,null,null,null,null,null,null,"694",6,9,4,{"$f":"V2","v":"Pierre"}]
[null,null,null,null,null,null,null,null,null,null,null,null,null,null,null,null,null,null,null,null,null,null,null,null,null,null,"695",6,9,5,{"$f":"V2","v":"Pierre"}]
[null,null,null,null,null,null,null,null,null,null,null,null,null,null,null,null,null,null,null,null,null,null,null,null,null,null,"696",6,9,6,{"$f":"V2","v":"Pierre"}]
[null,null,null,null,null,null,null,null,null,null,null,null,null,null,null,null,null,null,null,null,null,null,null,null,null,null,"697",6,9,7,{"$f":"V2","v":"Pierre"}]
[null,null,null,null,null,null,null,null,null,null,null,null,null,null,null,null,null,null,null,null,null,null,null,null,null,null,"698",6,9,8,{"$f":"W2","v":"David"}]
[null,null,null,null,null,null,null,null,null,null,null,null,null,null,null,null,null,null,null,null,null,null,null,null,null,null,"699",6,9,9,{"$f":"W2","v":"David"}]
[null,null,null,null,null,null,null,null,null,null,null,null,null,null,null,null,null,null,null,null,null,null,null,null,null,null,"711",7,1,1,{"$f":"W2","v":"David"}]
[null,null,null,null,null,null,null,null,null,null,null,null,null,null,null,null,null,null,null,null,null,null,null,null,null,null,"712",7,1,2,{"$f":"W2","v":"David"}]
[null,null,null,null,null,null,null,null,null,null,null,null,null,null,null,null,null,null,null,null,null,null,null,null,null,null,"713",7,1,3,{"$f":"W2","v":"David"}]
[null,null,null,null,null,null,null,null,null,null,null,null,null,null,null,null,null,null,null,null,null,null,null,null,null,null,"714",7,1,4,"NUL"]
[null,null,null,null,null,null,null,null,null,null,null,null,null,null,null,null,null,null,null,null,null,null,null,null,null,null,"715",7,1,5,{"$f":"V2","v":"Pierre"}]
[null,null,null,null,null,null,null,null,null,null,null,null,null,null,null,null,null,null,null,null,null,null,null,null,null,null,"716",7,1,6,{"$f":"V2","v":"Pierre"}]
[null,null,null,null,null,null,null,null,null,null,null,null,null,null,null,null,null,null,null,null,null,null,null,null,null,null,"717",7,1,7,{"$f":"V2","v":"Pierre"}]
[null,null,null,null,null,null,null,null,null,null,null,null,null,null,null,null,null,null,null,null,null,null,null,null,null,null,"718",7,1,8,{"$f":"V2","v":"Pierre"}]
[null,null,null,null,null,null,null,null,null,null,null,null,null,null,null,null,null,null,null,null,null,null,null,null,null,null,"719",7,1,9,{"$f":"W2","v":"David"}]
[null,null,null,null,null,null,null,null,null,null,null,null,null,null,null,null,null,null,null,null,null,null,null,null,null,null,"721",7,2,1,{"$f":"W2","v":"David"}]
[null,null,null,null,null,null,null,null,null,null,null,null,null,null,null,null,null,null,null,null,null,null,null,null,null,null,"722",7,2,2,{"$f":"W2","v":"David"}]
[null,null,null,null,null,null,null,null,null,null,null,null,null,null,null,null,null,null,null,null,null,null,null,null,null,null,"723",7,2,3,{"$f":"W2","v":"David"}]
[null,null,null,null,null,null,null,null,null,null,null,null,null,null,null,null,null,null,null,null,null,null,null,null,null,null,"724",7,2,4,{"$f":"W2","v":"David"}]
[null,null,null,null,null,null,null,null,null,null,null,null,null,null,null,null,null,null,null,null,null,null,null,null,null,null,"725",7,2,5,{"$f":"W2","v":"David"}]
[null,null,null,null,null,null,null,null,null,null,null,null,null,null,null,null,null,null,null,null,null,null,null,null,null,null,"726",7,2,6,{"$f":"V2","v":"Pierre"}]
[null,null,null,null,null,null,null,null,null,null,null,null,null,null,null,null,null,null,null,null,null,null,null,null,null,null,"727",7,2,7,{"$f":"V2","v":"Pierre"}]
[null,null,null,null,null,null,null,null,null,null,null,null,null,null,null,null,null,null,null,null,null,null,null,null,null,null,"728",7,2,8,{"$f":"V2","v":"Pierre"}]
[null,null,null,null,null,null,null,null,null,null,null,null,null,null,null,null,null,null,null,null,null,null,null,null,null,null,"729",7,2,9,"NUL"]
[null,null,null,null,null,null,null,null,null,null,null,null,null,null,null,null,null,null,null,null,null,null,null,null,null,null,"731",7,3,1,{"$f":"W2","v":"David"}]
[null,null,null,null,null,null,null,null,null,null,null,null,null,null,null,null,null,null,null,null,null,null,null,null,null,null,"732",7,3,2,{"$f":"W2","v":"David"}]
[null,null,null,null,null,null,null,null,null,null,null,null,null,null,null,null,null,null,null,null,null,null,null,null,null,null,"733",7,3,3,{"$f":"W2","v":"David"}]
[null,null,null,null,null,null,null,null,null,null,null,null,null,null,null,null,null,null,null,null,null,null,null,null,null,null,"734",7,3,4,{"$f":"W2","v":"David"}]
[null,null,null,null,null,null,null,null,null,null,null,null,null,null,null,null,null,null,null,null,null,null,null,null,null,null,"735",7,3,5,"NUL"]
[null,null,null,null,null,null,null,null,null,null,null,null,null,null,null,null,null,null,null,null,null,null,null,null,null,null,"736",7,3,6,{"$f":"V2","v":"Pierre"}]
[null,null,null,null,null,null,null,null,null,null,null,null,null,null,null,null,null,null,null,null,null,null,null,null,null,null,{"$f":"CONCATENATE(AB515,AC515,AD515)","v":"737"},7,3,7,{"$f":"V2","v":"Pierre"}]
[null,null,null,null,null,null,null,null,null,null,null,null,null,null,null,null,null,null,null,null,null,null,null,null,null,null,"738",7,3,8,{"$f":"V2","v":"Pierre"}]
[null,null,null,null,null,null,null,null,null,null,null,null,null,null,null,null,null,null,null,null,null,null,null,null,null,null,"739",7,3,9,{"$f":"V2","v":"Pierre"}]
[null,null,null,null,null,null,null,null,null,null,null,null,null,null,null,null,null,null,null,null,null,null,null,null,null,null,"741",7,4,1,"NUL"]
[null,null,null,null,null,null,null,null,null,null,null,null,null,null,null,null,null,null,null,null,null,null,null,null,null,null,"742",7,4,2,{"$f":"W2","v":"David"}]
[null,null,null,null,null,null,null,null,null,null,null,null,null,null,null,null,null,null,null,null,null,null,null,null,null,null,"743",7,4,3,{"$f":"W2","v":"David"}]
[null,null,null,null,null,null,null,null,null,null,null,null,null,null,null,null,null,null,null,null,null,null,null,null,null,null,"744",7,4,4,{"$f":"W2","v":"David"}]
[null,null,null,null,null,null,null,null,null,null,null,null,null,null,null,null,null,null,null,null,null,null,null,null,null,null,"745",7,4,5,{"$f":"W2","v":"David"}]
[null,null,null,null,null,null,null,null,null,null,null,null,null,null,null,null,null,null,null,null,null,null,null,null,null,null,"746",7,4,6,{"$f":"V2","v":"Pierre"}]
[null,null,null,null,null,null,null,null,null,null,null,null,null,null,null,null,null,null,null,null,null,null,null,null,null,null,"747",7,4,7,{"$f":"V2","v":"Pierre"}]
[null,null,null,null,null,null,null,null,null,null,null,null,null,null,null,null,null,null,null,null,null,null,null,null,null,null,"748",7,4,8,{"$f":"V2","v":"Pierre"}]
[null,null,null,null,null,null,null,null,null,null,null,null,null,null,null,null,null,null,null,null,null,null,null,null,null,null,"749",7,4,9,{"$f":"V2","v":"Pierre"}]
[null,null,null,null,null,null,null,null,null,null,null,null,null,null,null,null,null,null,null,null,null,null,null,null,null,null,"751",7,5,1,{"$f":"V2","v":"Pierre"}]
[null,null,null,null,null,null,null,null,null,null,null,null,null,null,null,null,null,null,null,null,null,null,null,null,null,null,"752",7,5,2,{"$f":"W2","v":"David"}]
[null,null,null,null,null,null,null,null,null,null,null,null,null,null,null,null,null,null,null,null,null,null,null,null,null,null,"753",7,5,3,{"$f":"W2","v":"David"}]
[null,null,null,null,null,null,null,null,null,null,null,null,null,null,null,null,null,null,null,null,null,null,null,null,null,null,"754",7,5,4,{"$f":"W2","v":"David"}]
[null,null,null,null,null,null,null,null,null,null,null,null,null,null,null,null,null,null,null,null,null,null,null,null,null,null,"755",7,5,5,{"$f":"W2","v":"David"}]
[null,null,null,null,null,null,null,null,null,null,null,null,null,null,null,null,null,null,null,null,null,null,null,null,null,null,"756",7,5,6,"NUL"]
[null,null,null,null,null,null,null,null,null,null,null,null,null,null,null,null,null,null,null,null,null,null,null,null,null,null,"757",7,5,7,{"$f":"V2","v":"Pierre"}]
[null,null,null,null,null,null,null,null,null,null,null,null,null,null,null,null,null,null,null,null,null,null,null,null,null,null,"758",7,5,8,{"$f":"V2","v":"Pierre"}]
[null,null,null,null,null,null,null,null,null,null,null,null,null,null,null,null,null,null,null,null,null,null,null,null,null,null,"759",7,5,9,{"$f":"V2","v":"Pierre"}]
[null,null,null,null,null,null,null,null,null,null,null,null,null,null,null,null,null,null,null,null,null,null,null,null,null,null,"761",7,6,1,{"$f":"V2","v":"Pierre"}]
[null,null,null,null,null,null,null,null,null,null,null,null,null,null,null,null,null,null,null,null,null,null,null,null,null,null,"762",7,6,2,"NUL"]
[null,null,null,null,null,null,null,null,null,null,null,null,null,null,null,null,null,null,null,null,null,null,null,null,null,null,"763",7,6,3,{"$f":"W2","v":"David"}]
[null,null,null,null,null,null,null,null,null,null,null,null,null,null,null,null,null,null,null,null,null,null,null,null,null,null,"764",7,6,4,{"$f":"W2","v":"David"}]
[null,null,null,null,null,null,null,null,null,null,null,null,null,null,null,null,null,null,null,null,null,null,null,null,null,null,"765",7,6,5,{"$f":"W2","v":"David"}]
[null,null,null,null,null,null,null,null,null,null,null,null,null,null,null,null,null,null,null,null,null,null,null,null,null,null,"766",7,6,6,{"$f":"W2","v":"David"}]
[null,null,null,null,null,null,null,null,null,null,null,null,null,null,null,null,null,null,null,null,null,null,null,null,null,null,"767",7,6,7,{"$f":"V2","v":"Pierre"}]
[null,null,null,null,null,null,null,null,null,null,null,null,null,null,null,null,null,null,null,null,null,null,null,null,null,null,"768",7,6,8,{"$f":"V2","v":"Pierre"}]
[null,null,null,null,null,null,null,null,null,null,null,null,null,null,null,null,null,null,null,null,null,null,null,null,null,null,"769",7,6,9,{"$f":"V2","v":"Pierre"}]
[null,null,null,null,null,null,null,null,null,null,null,null,null,null,null,null,null,null,null,null,null,null,null,null,null,null,"771",7,7,1,{"$f":"V2","v":"Pierre"}]
[null,null,null,null,null,null,null,null,null,null,null,null,null,null,null,null,null,null,null,null,null,null,null,null,null,null,"772",7,7,2,{"$f":"V2","v":"Pierre"}]
[null,null,null,null,null,null,null,null,null,null,null,null,null,null,null,null,null,null,null,null,null,null,null,null,null,null,"773",7,7,3,{"$f":"V2","v":"Pierre"}]
[null,null,null,null,null,null,null,null,null,null,null,null,null,null,null,null,null,null,null,null,null,null,null,null,null,null,"774",7,7,4,{"$f":"V2","v":"Pierre"}]
[null,null,null,null,null,null,null,null,null,null,null,null,null,null,null,null,null,null,null,null,null,null,null,null,null,null,"775",7,7,5,{"$f":"V2","v":"Pierre"}]
[null,null,null,null,null,null,null,null,null,null,null,null,null,null,null,null,null,null,null,null,null,null,null,null,null,null,"776",7,7,6,"NUL"]
[null,null,null,null,null,null,null,null,null,null,null,null,null,null,null,null,null,null,null,null,null,null,null,null,null,null,"778",7,7,8,"NUL"]
[null,null,null,null,null,null,null,null,null,null,null,null,null,null,null,null,null,null,null,null,null,null,null,null,null,null,"779",7,7,9,{"$f":"V2","v":"Pierre"}]
[null,null,null,null,null,null,null,null,null,null,null,null,null,null,null,null,null,null,null,null,null,null,null,null,null,null,"781",7,8,1,{"$f":"W2","v":"David"}]
[null,null,null,null,null,null,null,null,null,null,null,null,null,null,null,null,null,null,null,null,null,null,null,null,null,null,"782",7,8,2,{"$f":"W2","v":"David"}]
[null,null,null,null,null,null,null,null,null,null,null,null,null,null,null,null,null,null,null,null,null,null,null,null,null,null,"783",7,8,3,"NUL"]
[null,null,null,null,null,null,null,null,null,null,null,null,null,null,null,null,null,null,null,null,null,null,null,null,null,null,"784",7,8,4,{"$f":"V2","v":"Pierre"}]
[null,null,null,null,null,null,null,null,null,null,null,null,null,null,null,null,null,null,null,null,null,null,null,null,null,null,"785",7,8,5,{"$f":"V2","v":"Pierre"}]
[null,null,null,null,null,null,null,null,null,null,null,null,null,null,null,null,null,null,null,null,null,null,null,null,null,null,"786",7,8,6,{"$f":"V2","v":"Pierre"}]
[null,null,null,null,null,null,null,null,null,null,null,null,null,null,null,null,null,null,null,null,null,null,null,null,null,null,"787",7,8,7,{"$f":"V2","v":"Pierre"}]
[null,null,null,null,null,null,null,null,null,null,null,null,null,null,null,null,null,null,null,null,null,null,null,null,null,null,"788",7,8,8,{"$f":"W2","v":"David"}]
[null,null,null,null,null,null,null,null,null,null,null,null,null,null,null,null,null,null,null,null,null,null,null,null,null,null,"789",7,8,9,{"$f":"W2","v":"David"}]
[null,null,null,null,null,null,null,null,null,null,null,null,null,null,null,null,null,null,null,null,null,null,null,null,null,null,"791",7,9,1,{"$f":"W2","v":"David"}]
[null,null,null,null,null,null,null,null,null,null,null,null,null,null,null,null,null,null,null,null,null,null,null,null,null,null,"792",7,9,2,{"$f":"W2","v":"David"}]
[null,null,null,null,null,null,null,null,null,null,null,null,null,null,null,null,null,null,null,null,null,null,null,null,null,null,"793",7,9,3,{"$f":"W2","v":"David"}]
[null,null,null,null,null,null,null,null,null,null,null,null,null,null,null,null,null,null,null,null,null,null,null,null,null,null,"794",7,9,4,{"$f":"V2","v":"Pierre"}]
[null,null,null,null,null,null,null,null,null,null,null,null,null,null,null,null,null,null,null,null,null,null,null,null,null,null,"795",7,9,5,{"$f":"V2","v":"Pierre"}]
[null,null,null,null,null,null,null,null,null,null,null,null,null,null,null,null,null,null,null,null,null,null,null,null,null,null,"796",7,9,6,{"$f":"V2","v":"Pierre"}]
[null,null,null,null,null,null,null,null,null,null,null,null,null,null,null,null,null,null,null,null,null,null,null,null,null,null,"797",7,9,7,{"$f":"V2","v":"Pierre"}]
[null,null,null,null,null,null,null,null,null,null,null,null,null,null,null,null,null,null,null,null,null,null,null,null,null,null,"798",7,9,8,"NUL"]
[null,null,null,null,null,null,null,null,null,null,null,null,null,null,null,null,null,null,null,null,null,null,null,null,null,null,"799",7,9,9,{"$f":"W2","v":"David"}]
[null,null,null,null,null,null,null,null,null,null,null,null,null,null,null,null,null,null,null,null,null,null,null,null,null,null,"811",8,1,1,{"$f":"W2","v":"David"}]
[null,null,null,null,null,null,null,null,null,null,null,null,null,null,null,null,null,null,null,null,null,null,null,null,null,null,"812",8,1,2,{"$f":"W2","v":"David"}]
[null,null,null,null,null,null,null,null,null,null,null,null,null,null,null,null,null,null,null,null,null,null,null,null,null,null,"813",8,1,3,{"$f":"W2","v":"David"}]
[null,null,null,null,null,null,null,null,null,null,null,null,null,null,null,null,null,null,null,null,null,null,null,null,null,null,"814",8,1,4,{"$f":"W2","v":"David"}]
[null,null,null,null,null,null,null,null,null,null,null,null,null,null,null,null,null,null,null,null,null,null,null,null,null,null,"815",8,1,5,{"$f":"V2","v":"Pierre"}]
[null,null,null,null,null,null,null,null,null,null,null,null,null,null,null,null,null,null,null,null,null,null,null,null,null,null,"816",8,1,6,{"$f":"V2","v":"Pierre"}]
[null,null,null,null,null,null,null,null,null,null,null,null,null,null,null,null,null,null,null,null,null,null,null,null,null,null,"817",8,1,7,{"$f":"V2","v":"Pierre"}]
[null,null,null,null,null,null,null,null,null,null,null,null,null,null,null,null,null,null,null,null,null,null,null,null,null,null,"818",8,1,8,{"$f":"V2","v":"Pierre"}]
[null,null,null,null,null,null,null,null,null,null,null,null,null,null,null,null,null,null,null,null,null,null,null,null,null,null,{"$f":"CONCATENATE(AB579,AC579,AD579)","v":"819"},8,1,9,"NUL"]
[null,null,null,null,null,null,null,null,null,null,null,null,null,null,null,null,null,null,null,null,null,null,null,null,null,null,"821",8,2,1,{"$f":"W2","v":"David"}]
[null,null,null,null,null,null,null,null,null,null,null,null,null,null,null,null,null,null,null,null,null,null,null,null,null,null,"822",8,2,2,{"$f":"W2","v":"David"}]
[null,null,null,null,null,null,null,null,null,null,null,null,null,null,null,null,null,null,null,null,null,null,null,null,null,null,"823",8,2,3,{"$f":"W2","v":"David"}]
[null,null,null,null,null,null,null,null,null,null,null,null,null,null,null,null,null,null,null,null,null,null,null,null,null,null,"824",8,2,4,{"$f":"W2","v":"David"}]
[null,null,null,null,null,null,null,null,null,null,null,null,null,null,null,null,null,null,null,null,null,null,null,null,null,null,"825",8,2,5,"NUL"]
[null,null,null,null,null,null,null,null,null,null,null,null,null,null,null,null,null,null,null,null,null,null,null,null,null,null,"826",8,2,6,{"$f":"V2","v":"Pierre"}]
[null,null,null,null,null,null,null,null,null,null,null,null,null,null,null,null,null,null,null,null,null,null,null,null,null,null,"827",8,2,7,{"$f":"V2","v":"Pierre"}]
[null,null,null,null,null,null,null,null,null,null,null,null,null,null,null,null,null,null,null,null,null,null,null,null,null,null,"828",8,2,8,{"$f":"V2","v":"Pierre"}]
[null,null,null,null,null,null,null,null,null,null,null,null,null,null,null,null,null,null,null,null,null,null,null,null,null,null,"829",8,2,9,{"$f":"V2","v":"Pierre"}]
[null,null,null,null,null,null,null,null,null,null,null,null,null,null,null,null,null,null,null,null,null,null,null,null,null,null,"831",8,3,1,"NUL"]
[null,null,null,null,null,null,null,null,null,null,null,null,null,null,null,null,null,null,null,null,null,null,null,null,null,null,"832",8,3,2,{"$f":"W2","v":"David"}]
[null,null,null,null,null,null,null,null,null,null,null,null,null,null,null,null,null,null,null,null,null,null,null,null,null,null,"833",8,3,3,{"$f":"W2","v":"David"}]
[null,null,null,null,null,null,null,null,null,null,null,null,null,null,null,null,null,null,null,null,null,null,null,null,null,null,"834",8,3,4,{"$f":"W2","v":"David"}]
[null,null,null,null,null,null,null,null,null,null,null,null,null,null,null,null,null,null,null,null,null,null,null,null,null,null,"835",8,3,5,{"$f":"W2","v":"David"}]
[null,null,null,null,null,null,null,null,null,null,null,null,null,null,null,null,null,null,null,null,null,null,null,null,null,null,"836",8,3,6,{"$f":"V2","v":"Pierre"}]
[null,null,null,null,null,null,null,null,null,null,null,null,null,null,null,null,null,null,null,null,null,null,null,null,null,null,"837",8,3,7,{"$f":"V2","v":"Pierre"}]
[null,null,null,null,null,null,null,null,null,null,null,null,null,null,null,null,null,null,null,null,null,null,null,null,null,null,"838",8,3,8,{"$f":"V2","v":"Pierre"}]
[null,null,null,null,null,null,null,null,null,null,null,null,null,null,null,null,null,null,null,null,null,null,null,null,null,null,"839",8,3,9,{"$f":"V2","v":"Pierre"}]
[null,null,null,null,null,null,null,null,null,null,null,null,null,null,null,null,null,null,null,null,null,null,null,null,null,null,"841",8,4,1,{"$f":"V2","v":"Pierre"}]
[null,null,null,null,null,null,null,null,null,null,null,null,null,null,null,null,null,null,null,null,null,null,null,null,null,null,"842",8,4,2,{"$f":"W2","v":"David"}]
[null,null,null,null,null,null,null,null,null,null,null,null,null,null,null,null,null,null,null,null,null,null,null,null,null,null,"843",8,4,3,{"$f":"W2","v":"David"}]
[null,null,null,null,null,null,null,null,null,null,null,null,null,null,null,null,null,null,null,null,null,null,null,null,null,null,"844",8,4,4,{"$f":"W2","v":"David"}]
[null,null,null,null,null,null,null,null,null,null,null,null,null,null,null,null,null,null,null,null,null,null,null,null,null,null,"845",8,4,5,{"$f":"W2","v":"David"}]
[null,null,null,null,null,null,null,null,null,null,null,null,null,null,null,null,null,null,null,null,null,null,null,null,null,null,"846",8,4,6,"NUL"]
[null,null,null,null,null,null,null,null,null,null,null,null,null,null,null,null,null,null,null,null,null,null,null,null,null,null,"847",8,4,7,{"$f":"V2","v":"Pierre"}]
[null,null,null,null,null,null,null,null,null,null,null,null,null,null,null,null,null,null,null,null,null,null,null,null,null,null,"848",8,4,8,{"$f":"V2","v":"Pierre"}]
[null,null,null,null,null,null,null,null,null,null,null,null,null,null,null,null,null,null,null,null,null,null,null,null,null,null,"849",8,4,9,{"$f":"V2","v":"Pierre"}]
[null,null,null,null,null,null,null,null,null,null,null,null,null,null,null,null,null,null,null,null,null,null,null,null,null,null,"851",8,5,1,{"$f":"V2","v":"Pierre"}]
[null,null,null,null,null,null,null,null,null,null,null,null,null,null,null,null,null,null,null,null,null,null,null,null,null,null,"852",8,5,2,"NUL"]
[null,null,null,null,null,null,null,null,null,null,null,null,null,null,null,null,null,null,null,null,null,null,null,null,null,null,"853",8,5,3,{"$f":"W2","v":"David"}]
[null,null,null,null,null,null,null,null,null,null,null,null,null,null,null,null,null,null,null,null,null,null,null,null,null,null,"854",8,5,4,{"$f":"W2","v":"David"}]
[null,null,null,null,null,null,null,null,null,null,null,null,null,null,null,null,null,null,null,null,null,null,null,null,null,null,"855",8,5,5,{"$f":"W2","v":"David"}]
[null,null,null,null,null,null,null,null,null,null,null,null,null,null,null,null,null,null,null,null,null,null,null,null,null,null,"856",8,5,6,{"$f":"W2","v":"David"}]
[null,null,null,null,null,null,null,null,null,null,null,null,null,null,null,null,null,null,null,null,null,null,null,null,null,null,"857",8,5,7,{"$f":"V2","v":"Pierre"}]
[null,null,null,null,null,null,null,null,null,null,null,null,null,null,null,null,null,null,null,null,null,null,null,null,null,null,"858",8,5,8,{"$f":"V2","v":"Pierre"}]
[null,null,null,null,null,null,null,null,null,null,null,null,null,null,null,null,null,null,null,null,null,null,null,null,null,null,"859",8,5,9,{"$f":"V2","v":"Pierre"}]
[null,null,null,null,null,null,null,null,null,null,null,null,null,null,null,null,null,null,null,null,null,null,null,null,null,null,"861",8,6,1,{"$f":"V2","v":"Pierre"}]
[null,null,null,null,null,null,null,null,null,null,null,null,null,null,null,null,null,null,null,null,null,null,null,null,null,null,"862",8,6,2,{"$f":"V2","v":"Pierre"}]
[null,null,null,null,null,null,null,null,null,null,null,null,null,null,null,null,null,null,null,null,null,null,null,null,null,null,"863",8,6,3,{"$f":"W2","v":"David"}]
[null,null,null,null,null,null,null,null,null,null,null,null,null,null,null,null,null,null,null,null,null,null,null,null,null,null,"864",8,6,4,{"$f":"W2","v":"David"}]
[null,null,null,null,null,null,null,null,null,null,null,null,null,null,null,null,null,null,null,null,null,null,null,null,null,null,"865",8,6,5,{"$f":"W2","v":"David"}]
[null,null,null,null,null,null,null,null,null,null,null,null,null,null,null,null,null,null,null,null,null,null,null,null,null,null,"866",8,6,6,{"$f":"W2","v":"David"}]
[null,null,null,null,null,null,null,null,null,null,null,null,null,null,null,null,null,null,null,null,null,null,null,null,null,null,"867",8,6,7,"NUL"]
[null,null,null,null,null,null,null,null,null,null,null,null,null,null,null,null,null,null,null,null,null,null,null,null,null,null,"868",8,6,8,{"$f":"V2","v":"Pierre"}]
[null,null,null,null,null,null,null,null,null,null,null,null,null,null,null,null,null,null,null,null,null,null,null,null,null,null,"869",8,6,9,{"$f":"V2","v":"Pierre"}]
[null,null,null,null,null,null,null,null,null,null,null,null,null,null,null,null,null,null,null,null,null,null,null,null,null,null,"871",8,7,1,{"$f":"V2","v":"Pierre"}]
[null,null,null,null,null,null,null,null,null,null,null,null,null,null,null,null,null,null,null,null,null,null,null,null,null,null,"872",8,7,2,{"$f":"V2","v":"Pierre"}]
[null,null,null,null,null,null,null,null,null,null,null,null,null,null,null,null,null,null,null,null,null,null,null,null,null,null,"873",8,7,3,"NUL"]
[null,null,null,null,null,null,null,null,null,null,null,null,null,null,null,null,null,null,null,null,null,null,null,null,null,null,"874",8,7,4,{"$f":"W2","v":"David"}]
[null,null,null,null,null,null,null,null,null,null,null,null,null,null,null,null,null,null,null,null,null,null,null,null,null,null,"875",8,7,5,{"$f":"W2","v":"David"}]
[null,null,null,null,null,null,null,null,null,null,null,null,null,null,null,null,null,null,null,null,null,null,null,null,null,null,"876",8,7,6,{"$f":"W2","v":"David"}]
[null,null,null,null,null,null,null,null,null,null,null,null,null,null,null,null,null,null,null,null,null,null,null,null,null,null,"877",8,7,7,{"$f":"W2","v":"David"}]
[null,null,null,null,null,null,null,null,null,null,null,null,null,null,null,null,null,null,null,null,null,null,null,null,null,null,"878",8,7,8,{"$f":"V2","v":"Pierre"}]
[null,null,null,null,null,null,null,null,null,null,null,null,null,null,null,null,null,null,null,null,null,null,null,null,null,null,"879",8,7,9,{"$f":"V2","v":"Pierre"}]
[null,null,null,null,null,null,null,null,null,null,null,null,null,null,null,null,null,null,null,null,null,null,null,null,null,null,"881",8,8,1,{"$f":"V2","v":"Pierre"}]
[null,null,null,null,null,null,null,null,null,null,null,null,null,null,null,null,null,null,null,null,null,null,null,null,null,null,"882",8,8,2,{"$f":"V2","v":"Pierre"}]
[null,null,null,null,null,null,null,null,null,null,null,null,null,null,null,null,null,null,null,null,null,null,null,null,null,null,"883",8,8,3,{"$f":"V2","v":"Pierre"}]
[null,null,null,null,null,null,null,null,null,null,null,null,null,null,null,null,null,null,null,null,null,null,null,null,null,null,"884",8,8,4,{"$f":"V2","v":"Pierre"}]
[null,null,null,null,null,null,null,null,null,null,null,null,null,null,null,null,null,null,null,null,null,null,null,null,null,null,"885",8,8,5,{"$f":"V2","v":"Pierre"}]
[null,null,null,null,null,null,null,null,null,null,null,null,null,null,null,null,null,null,null,null,null,null,null,null,null,null,"886",8,8,6,{"$f":"V2","v":"Pierre"}]
[null,null,null,null,null,null,null,null,null,null,null,null,null,null,null,null,null,null,null,null,null,null,null,null,null,null,"887",8,8,7,"NUL"]
[null,null,null,null,null,null,null,null,null,null,null,null,null,null,null,null,null,null,null,null,null,null,null,null,null,null,"889",8,8,9,"NUL"]
[null,null,null,null,null,null,null,null,null,null,null,null,null,null,null,null,null,null,null,null,null,null,null,null,null,null,"891",8,9,1,{"$f":"W2","v":"David"}]
[null,null,null,null,null,null,null,null,null,null,null,null,null,null,null,null,null,null,null,null,null,null,null,null,null,null,{"$f":"CONCATENATE(AB643,AC643,AD643)","v":"892"},8,9,2,{"$f":"W2","v":"David"}]
[null,null,null,null,null,null,null,null,null,null,null,null,null,null,null,null,null,null,null,null,null,null,null,null,null,null,"893",8,9,3,{"$f":"W2","v":"David"}]
[null,null,null,null,null,null,null,null,null,null,null,null,null,null,null,null,null,null,null,null,null,null,null,null,null,null,"894",8,9,4,"NUL"]
[null,null,null,null,null,null,null,null,null,null,null,null,null,null,null,null,null,null,null,null,null,null,null,null,null,null,"895",8,9,5,{"$f":"V2","v":"Pierre"}]
[null,null,null,null,null,null,null,null,null,null,null,null,null,null,null,null,null,null,null,null,null,null,null,null,null,null,"896",8,9,6,{"$f":"V2","v":"Pierre"}]
[null,null,null,null,null,null,null,null,null,null,null,null,null,null,null,null,null,null,null,null,null,null,null,null,null,null,"897",8,9,7,{"$f":"V2","v":"Pierre"}]
[null,null,null,null,null,null,null,null,null,null,null,null,null,null,null,null,null,null,null,null,null,null,null,null,null,null,"898",8,9,8,{"$f":"V2","v":"Pierre"}]
[null,null,null,null,null,null,null,null,null,null,null,null,null,null,null,null,null,null,null,null,null,null,null,null,null,null,"899",8,9,9,{"$f":"W2","v":"David"}]
[null,null,null,null,null,null,null,null,null,null,null,null,null,null,null,null,null,null,null,null,null,null,null,null,null,null,"911",9,1,1,{"$f":"W2","v":"David"}]
[null,null,null,null,null,null,null,null,null,null,null,null,null,null,null,null,null,null,null,null,null,null,null,null,null,null,"912",9,1,2,{"$f":"W2","v":"David"}]
[null,null,null,null,null,null,null,null,null,null,null,null,null,null,null,null,null,null,null,null,null,null,null,null,null,null,"913",9,1,3,{"$f":"W2","v":"David"}]
[null,null,null,null,null,null,null,null,null,null,null,null,null,null,null,null,null,null,null,null,null,null,null,null,null,null,"914",9,1,4,{"$f":"W2","v":"David"}]
[null,null,null,null,null,null,null,null,null,null,null,null,null,null,null,null,null,null,null,null,null,null,null,null,null,null,"915",9,1,5,"NUL"]
[null,null,null,null,null,null,null,null,null,null,null,null,null,null,null,null,null,null,null,null,null,null,null,null,null,null,"916",9,1,6,{"$f":"V2","v":"Pierre"}]
[null,null,null,null,null,null,null,null,null,null,null,null,null,null,null,null,null,null,null,null,null,null,null,null,null,null,"917",9,1,7,{"$f":"V2","v":"Pierre"}]
[null,null,null,null,null,null,null,null,null,null,null,null,null,null,null,null,null,null,null,null,null,null,null,null,null,null,"918",9,1,8,{"$f":"V2","v":"Pierre"}]
[null,null,null,null,null,null,null,null,null,null,null,null,null,null,null,null,null,null,null,null,null,null,null,null,null,null,"919",9,1,9,{"$f":"V2","v":"Pierre"}]
[null,null,null,null,null,null,null,null,null,null,null,null,null,null,null,null,null,null,null,null,null,null,null,null,null,null,"921",9,2,1,"NUL"]
[null,null,null,null,null,null,null,null,null,null,null,null,null,null,null,null,null,null,null,null,null,null,null,null,null,null,"922",9,2,2,{"$f":"W2","v":"David"}]
[null,null,null,null,null,null,null,null,null,null,null,null,null,null,null,null,null,null,null,null,null,null,null,null,null,null,"923",9,2,3,{"$f":"W2","v":"David"}]
[null,null,null,null,null,null,null,null,null,null,null,null,null,null,null,null,null,null,null,null,null,null,null,null,null,null,"924",9,2,4,{"$f":"W2","v":"David"}]
[null,null,null,null,null,null,null,null,null,null,null,null,null,null,null,null,null,null,null,null,null,null,null,null,null,null,"925",9,2,5,{"$f":"W2","v":"David"}]
[null,null,null,null,null,null,null,null,null,null,null,null,null,null,null,null,null,null,null,null,null,null,null,null,null,null,"926",9,2,6,{"$f":"V2","v":"Pierre"}]
[null,null,null,null,null,null,null,null,null,null,null,null,null,null,null,null,null,null,null,null,null,null,null,null,null,null,"927",9,2,7,{"$f":"V2","v":"Pierre"}]
[null,null,null,null,null,null,null,null,null,null,null,null,null,null,null,null,null,null,null,null,null,null,null,null,null,null,"928",9,2,8,{"$f":"V2","v":"Pierre"}]
[null,null,null,null,null,null,null,null,null,null,null,null,null,null,null,null,null,null,null,null,null,null,null,null,null,null,"929",9,2,9,{"$f":"V2","v":"Pierre"}]
[null,null,null,null,null,null,null,null,null,null,null,null,null,null,null,null,null,null,null,null,null,null,null,null,null,null,"931",9,3,1,{"$f":"V2","v":"Pierre"}]
[null,null,null,null,null,null,null,null,null,null,null,null,null,null,null,null,null,null,null,null,null,null,null,null,null,null,"932",9,3,2,{"$f":"W2","v":"David"}]
[null,null,null,null,null,null,null,null,null,null,null,null,null,null,null,null,null,null,null,null,null,null,null,null,null,null,"933",9,3,3,{"$f":"W2","v":"David"}]
[null,null,null,null,null,null,null,null,null,null,null,null,null,null,null,null,null,null,null,null,null,null,null,null,null,null,"934",9,3,4,{"$f":"W2","v":"David"}]
[null,null,null,null,null,null,null,null,null,null,null,null,null,null,null,null,null,null,null,null,null,null,null,null,null,null,"935",9,3,5,{"$f":"W2","v":"David"}]
[null,null,null,null,null,null,null,null,null,null,null,null,null,null,null,null,null,null,null,null,null,null,null,null,null,null,"936",9,3,6,"NUL"]
[null,null,null,null,null,null,null,null,null,null,null,null,null,null,null,null,null,null,null,null,null,null,null,null,null,null,"937",9,3,7,{"$f":"V2","v":"Pierre"}]
[null,null,null,null,null,null,null,null,null,null,null,null,null,null,null,null,null,null,null,null,null,null,null,null,null,null,"938",9,3,8,{"$f":"V2","v":"Pierre"}]
[null,null,null,null,null,null,null,null,null,null,null,null,null,null,null,null,null,null,null,null,null,null,null,null,null,null,"939",9,3,9,{"$f":"V2","v":"Pierre"}]
[null,null,null,null,null,null,null,null,null,null,null,null,null,null,null,null,null,null,null,null,null,null,null,null,null,null,"941",9,4,1,{"$f":"V2","v":"Pierre"}]
[null,null,null,null,null,null,null,null,null,null,null,null,null,null,null,null,null,null,null,null,null,null,null,null,null,null,"942",9,4,2,"NUL"]
[null,null,null,null,null,null,null,null,null,null,null,null,null,null,null,null,null,null,null,null,null,null,null,null,null,null,"943",9,4,3,{"$f":"W2","v":"David"}]
[null,null,null,null,null,null,null,null,null,null,null,null,null,null,null,null,null,null,null,null,null,null,null,null,null,null,"944",9,4,4,{"$f":"W2","v":"David"}]
[null,null,null,null,null,null,null,null,null,null,null,null,null,null,null,null,null,null,null,null,null,null,null,null,null,null,"945",9,4,5,{"$f":"W2","v":"David"}]
[null,null,null,null,null,null,null,null,null,null,null,null,null,null,null,null,null,null,null,null,null,null,null,null,null,null,"946",9,4,6,{"$f":"W2","v":"David"}]
[null,null,null,null,null,null,null,null,null,null,null,null,null,null,null,null,null,null,null,null,null,null,null,null,null,null,"947",9,4,7,{"$f":"V2","v":"Pierre"}]
[null,null,null,null,null,null,null,null,null,null,null,null,null,null,null,null,null,null,null,null,null,null,null,null,null,null,"948",9,4,8,{"$f":"V2","v":"Pierre"}]
[null,null,null,null,null,null,null,null,null,null,null,null,null,null,null,null,null,null,null,null,null,null,null,null,null,null,"949",9,4,9,{"$f":"V2","v":"Pierre"}]
[null,null,null,null,null,null,null,null,null,null,null,null,null,null,null,null,null,null,null,null,null,null,null,null,null,null,"951",9,5,1,{"$f":"V2","v":"Pierre"}]
[null,null,null,null,null,null,null,null,null,null,null,null,null,null,null,null,null,null,null,null,null,null,null,null,null,null,"952",9,5,2,{"$f":"V2","v":"Pierre"}]
[null,null,null,null,null,null,null,null,null,null,null,null,null,null,null,null,null,null,null,null,null,null,null,null,null,null,"953",9,5,3,{"$f":"W2","v":"David"}]
[null,null,null,null,null,null,null,null,null,null,null,null,null,null,null,null,null,null,null,null,null,null,null,null,null,null,"954",9,5,4,{"$f":"W2","v":"David"}]
[null,null,null,null,null,null,null,null,null,null,null,null,null,null,null,null,null,null,null,null,null,null,null,null,null,null,"955",9,5,5,{"$f":"W2","v":"David"}]
[null,null,null,null,null,null,null,null,null,null,null,null,null,null,null,null,null,null,null,null,null,null,null,null,null,null,"956",9,5,6,{"$f":"W2","v":"David"}]
[null,null,null,null,null,null,null,null,null,null,null,null,null,null,null,null,null,null,null,null,null,null,null,null,null,null,"957",9,5,7,"NUL"]
[null,null,null,null,null,null,null,null,null,null,null,null,null,null,null,null,null,null,null,null,null,null,null,null,null,null,"958",9,5,8,{"$f":"V2","v":"Pierre"}]
[null,null,null,null,null,null,null,null,null,null,null,null,null,null,null,null,null,null,null,null,null,null,null,null,null,null,"959",9,5,9,{"$f":"V2","v":"Pierre"}]
[null,null,null,null,null,null,null,null,null,null,null,null,null,null,null,null,null,null,null,null,null,null,null,null,null,null,"961",9,6,1,{"$f":"V2","v":"Pierre"}]
[null,null,null,null,null,null,null,null,null,null,null,null,null,null,null,null,null,null,null,null,null,null,null,null,null,null,"962",9,6,2,{"$f":"V2","v":"Pierre"}]
[null,null,null,null,null,null,null,null,null,null,null,null,null,null,null,null,null,null,null,null,null,null,null,null,null,null,"963",9,6,3,"NUL"]
[null,null,null,null,null,null,null,null,null,null,null,null,null,null,null,null,null,null,null,null,null,null,null,null,null,null,"964",9,6,4,{"$f":"W2","v":"David"}]
[null,null,null,null,null,null,null,null,null,null,null,null,null,null,null,null,null,null,null,null,null,null,null,null,null,null,"965",9,6,5,{"$f":"W2","v":"David"}]
[null,null,null,null,null,null,null,null,null,null,null,null,null,null,null,null,null,null,null,null,null,null,null,null,null,null,"966",9,6,6,{"$f":"W2","v":"David"}]
[null,null,null,null,null,null,null,null,null,null,null,null,null,null,null,null,null,null,null,null,null,null,null,null,null,null,"967",9,6,7,{"$f":"W2","v":"David"}]
[null,null,null,null,null,null,null,null,null,null,null,null,null,null,null,null,null,null,null,null,null,null,null,null,null,null,"968",9,6,8,{"$f":"V2","v":"Pierre"}]
[null,null,null,null,null,null,null,null,null,null,null,null,null,null,null,null,null,null,null,null,null,null,null,null,null,null,"969",9,6,9,{"$f":"V2","v":"Pierre"}]
[null,null,null,null,null,null,null,null,null,null,null,null,null,null,null,null,null,null,null,null,null,null,null,null,null,null,"971",9,7,1,{"$f":"V2","v":"Pierre"}]
[null,null,null,null,null,null,null,null,null,null,null,null,null,null,null,null,null,null,null,null,null,null,null,null,null,null,"972",9,7,2,{"$f":"V2","v":"Pierre"}]
[null,null,null,null,null,null,null,null,null,null,null,null,null,null,null,null,null,null,null,null,null,null,null,null,null,null,{"$f":"CONCATENATE(AB707,AC707,AD707)","v":"973"},9,7,3,{"$f":"V2","v":"Pierre"}]
[null,null,null,null,null,null,null,null,null,null,null,null,null,null,null,null,null,null,null,null,null,null,null,null,null,null,"974",9,7,4,{"$f":"W2","v":"David"}]
[null,null,null,null,null,null,null,null,null,null,null,null,null,null,null,null,null,null,null,null,null,null,null,null,null,null,"975",9,7,5,{"$f":"W2","v":"David"}]
[null,null,null,null,null,null,null,null,null,null,null,null,null,null,null,null,null,null,null,null,null,null,null,null,null,null,"976",9,7,6,{"$f":"W2","v":"David"}]
[null,null,null,null,null,null,null,null,null,null,null,null,null,null,null,null,null,null,null,null,null,null,null,null,null,null,"977",9,7,7,{"$f":"W2","v":"David"}]
[null,null,null,null,null,null,null,null,null,null,null,null,null,null,null,null,null,null,null,null,null,null,null,null,null,null,"978",9,7,8,"NUL"]
[null,null,null,null,null,null,null,null,null,null,null,null,null,null,null,null,null,null,null,null,null,null,null,null,null,null,"979",9,7,9,{"$f":"V2","v":"Pierre"}]
[null,null,null,null,null,null,null,null,null,null,null,null,null,null,null,null,null,null,null,null,null,null,null,null,null,null,"981",9,8,1,{"$f":"V2","v":"Pierre"}]
[null,null,null,null,null,null,null,null,null,null,null,null,null,null,null,null,null,null,null,null,null,null,null,null,null,null,"982",9,8,2,{"$f":"V2","v":"Pierre"}]
[null,null,null,null,null,null,null,null,null,null,null,null,null,null,null,null,null,null,null,null,null,null,null,null,null,null,"983",9,8,3,{"$f":"V2","v":"Pierre"}]
[null,null,null,null,null,null,null,null,null,null,null,null,null,null,null,null,null,null,null,null,null,null,null,null,null,null,"984",9,8,4,"NUL"]
[null,null,null,null,null,null,null,null,null,null,null,null,null,null,null,null,null,null,null,null,null,null,null,null,null,null,"985",9,8,5,{"$f":"W2","v":"David"}]
[null,null,null,null,null,null,null,null,null,null,null,null,null,null,null,null,null,null,null,null,null,null,null,null,null,null,"986",9,8,6,{"$f":"W2","v":"David"}]
[null,null,null,null,null,null,null,null,null,null,null,null,null,null,null,null,null,null,null,null,null,null,null,null,null,null,"987",9,8,7,{"$f":"W2","v":"David"}]
[null,null,null,null,null,null,null,null,null,null,null,null,null,null,null,null,null,null,null,null,null,null,null,null,null,null,"988",9,8,8,{"$f":"W2","v":"David"}]
[null,null,null,null,null,null,null,null,null,null,null,null,null,null,null,null,null,null,null,null,null,null,null,null,null,null,"989",9,8,9,{"$f":"V2","v":"Pierre"}]
[null,null,null,null,null,null,null,null,null,null,null,null,null,null,null,null,null,null,null,null,null,null,null,null,null,null,"991",9,9,1,"NUL"]
[null,null,null,null,null,null,null,null,null,null,null,null,null,null,null,null,null,null,null,null,null,null,null,null,null,null,"992",9,9,2,{"$f":"V2","v":"Pierre"}]
[null,null,null,null,null,null,null,null,null,null,null,null,null,null,null,null,null,null,null,null,null,null,null,null,null,null,"993",9,9,3,{"$f":"V2","v":"Pierre"}]
[null,null,null,null,null,null,null,null,null,null,null,null,null,null,null,null,null,null,null,null,null,null,null,null,null,null,"994",9,9,4,{"$f":"V2","v":"Pierre"}]
[null,null,null,null,null,null,null,null,null,null,null,null,null,null,null,null,null,null,null,null,null,null,null,null,null,null,"995",9,9,5,{"$f":"V2","v":"Pierre"}]
[null,null,null,null,null,null,null,null,null,null,null,null,null,null,null,null,null,null,null,null,null,null,null,null,null,null,"996",9,9,6,{"$f":"V2","v":"Pierre"}]
[null,null,null,null,null,null,null,null,null,null,null,null,null,null,null,null,null,null,null,null,null,null,null,null,null,null,"997",9,9,7,{"$f":"V2","v":"Pierre"}]
[null,null,null,null,null,null,null,null,null,null,null,null,null,null,null,null,null,null,null,null,null,null,null,null,null,null,"998",9,9,8,"NUL"]

{"sheet":"Bibli,2","index":6,"n_rows":730,"n_cols":5,"rows_kept":730,"cut":false,"hidden":true,"merged":[]}
[null,"X","Z","Chiffre ","ZONE"]
[null,1,1,1,"Y"]
[null,2,2,2,"Y"]
[null,3,3,3,"Y"]
[null,4,4,4,"Y"]
[null,5,5,5,"Y"]
[null,6,6,6,"Y"]
[null,7,7,7,"Y"]
[null,8,8,8,"Y"]
[null,9,9,9,"Y"]
[null,1,1,2,"Y"]
[null,1,1,3,"X"]
[null,1,1,4,"Z"]
[null,1,1,5,"X"]
[null,1,1,6,"X"]
[null,1,1,7,"Z"]
[null,1,1,8,"X"]
[null,1,1,9,"Y"]
[null,1,2,1,"X"]
[null,1,2,2,"X"]
[null,1,2,3,"X"]
[null,1,2,4,"X"]
[null,1,2,5,"X"]
[null,1,2,6,"Y"]
[null,1,2,7,"X"]
[null,1,2,8,"X"]
[null,1,2,9,"X"]
[null,1,3,1,"X"]
[null,1,3,2,"Y"]
[null,1,3,3,"Z"]
[null,1,3,4,"Z"]
[null,1,3,5,"Y"]
[null,1,3,6,"X"]
[null,1,3,7,"Y"]
[null,1,3,8,"X"]
[null,1,3,9,"X"]
[null,1,4,1,"X"]
[null,1,4,2,"X"]
[null,1,4,3,"Z"]
[null,1,4,4,"Z"]
[null,1,4,5,"Z"]
[null,1,4,6,"Z"]
[null,1,4,7,"Y"]
[null,1,4,8,"X"]
[null,1,4,9,"X"]
[null,1,5,1,"X"]
[null,1,5,2,"X"]
[null,1,5,3,"Y"]
[null,1,5,4,"Z"]
[null,1,5,5,"Z"]
[null,1,5,6,"Z"]
[null,1,5,7,"Z"]
[null,1,5,8,"X"]
[null,1,5,9,"X"]
[null,1,6,1,"X"]
[null,1,6,2,"X"]
[null,1,6,3,"X"]
[null,1,6,4,"Z"]
[null,1,6,5,"Z"]
[null,1,6,6,"Z"]
[null,1,6,7,"Z"]
[null,1,6,8,"Z"]
[null,1,6,9,"Z"]
[null,1,7,1,"X"]
[null,1,7,2,"X"]
[null,1,7,3,"X"]
[null,1,7,4,"Y"]
[null,1,7,5,"Z"]
[null,1,7,6,"Z"]
[null,1,7,7,"Z"]
[null,1,7,8,"Z"]
[null,1,7,9,"Z"]
[null,1,8,1,"X"]
[null,1,8,2,"X"]
[null,1,8,3,"X"]
[null,1,8,4,"X"]
[null,1,8,5,"Y"]
[null,1,8,6,"Z"]
[null,1,8,7,"Z"]
[null,1,8,8,"Z"]
[null,1,8,9,"Y"]
[null,1,9,1,"X"]
[null,1,9,2,"X"]
[null,1,9,3,"X"]
[null,1,9,4,"X"]
[null,1,9,5,"Y"]
[null,1,9,6,"Z"]
[null,1,9,7,"Z"]
[null,1,9,8,"Z"]
[null,1,9,9,"Z"]
[null,2,1,1,"Z"]
[null,2,1,2,"X"]
[null,2,1,3,"X"]
[null,2,1,4,"X"]
[null,2,1,5,"X"]
[null,2,1,6,"Y"]
[null,2,1,7,"Z"]
[null,2,1,8,"Z"]
[null,2,1,9,"Z"]
[null,2,2,1,"Y"]
[null,2,2,3,"Y"]
[null,2,2,4,"X"]
[null,2,2,5,"Z"]
[null,2,2,6,"X"]
[null,2,2,7,"X"]
[null,2,2,8,"Z"]
[null,2,2,9,"X"]
[null,2,3,1,"X"]
[null,2,3,2,"X"]
[null,2,3,3,"Z"]
[null,2,3,4,"Z"]
[null,2,3,5,"Z"]
[null,2,3,6,"Z"]
[null,2,3,7,"Y"]
[null,2,3,8,"X"]
[null,2,3,9,"X"]
[null,2,4,1,"X"]
[null,2,4,2,"X"]
[null,2,4,3,"Y"]
[null,2,4,4,"Z"]
[null,2,4,5,"Z"]
[null,2,4,6,"Z"]
[null,2,4,7,"Z"]
[null,2,4,8,"X"]
[null,2,4,9,"X"]
[null,2,5,1,"X"]
[null,2,5,2,"X"]
[null,2,5,3,"X"]
[null,2,5,4,"Z"]
[null,2,5,5,"Z"]
[null,2,5,6,"Z"]
[null,2,5,7,"Z"]
[null,2,5,8,"Y"]
[null,2,5,9,"X"]
[null,2,6,1,"X"]
[null,2,6,2,"X"]
[null,2,6,3,"X"]
[null,2,6,4,"Y"]
[null,2,6,5,"Z"]
[null,2,6,6,"Z"]
[null,2,6,7,"Z"]
[null,2,6,8,"Z"]
[null,2,6,9,"Z"]
[null,2,7,1,"X"]
[null,2,7,2,"X"]
[null,2,7,3,"X"]
[null,2,7,4,"X"]
[null,2,7,5,"Z"]
[null,2,7,6,"Z"]
[null,2,7,7,"Z"]
[null,2,7,8,"Z"]
[null,2,7,9,"Y"]
[null,2,8,1,"X"]
[null,2,8,2,"X"]
[null,2,8,3,"X"]
[null,2,8,4,"X"]
[null,2,8,5,"Y"]
[null,2,8,6,"Z"]
[null,2,8,7,"Z"]
[null,2,8,8,"Z"]
[null,2,8,9,"Z"]
[null,2,9,1,"Y"]
[null,2,9,2,"X"]
[null,2,9,3,"X"]
[null,2,9,4,"X"]
[null,2,9,5,"X"]
[null,2,9,6,"Z"]
[null,2,9,7,"Z"]
[null,2,9,8,"Z"]
[null,2,9,9,"Z"]
[null,3,1,1,"Z"]
[null,3,1,2,"Y"]
[null,3,1,3,"X"]
[null,3,1,4,"X"]
[null,3,1,5,"X"]
[null,3,1,6,"X"]
[null,3,1,7,"Z"]
[null,3,1,8,"Z"]
[null,3,1,9,"Z"]
[null,3,2,1,"Z"]
[null,3,2,2,"Z"]
[null,3,2,3,"X"]
[null,3,2,4,"X"]
[null,3,2,5,"X"]
[null,3,2,6,"X"]
[null,3,2,7,"Y"]
[null,3,2,8,"Z"]
[null,3,2,9,"Z"]
[null,3,3,1,"X"]
[null,3,3,2,"Y"]
[null,3,3,4,"Y"]
[null,3,3,5,"X"]
[null,3,3,6,"Z"]
[null,3,3,7,"X"]
[null,3,3,8,"X"]
[null,3,3,9,"Z"]
[null,3,4,1,"X"]
[null,3,4,2,"X"]
[null,3,4,3,"X"]
[null,3,4,4,"Z"]
[null,3,4,5,"Z"]
[null,3,4,6,"Z"]
[null,3,4,7,"Z"]
[null,3,4,8,"Y"]
[null,3,4,9,"X"]
[null,3,5,1,"X"]
[null,3,5,2,"X"]
[null,3,5,3,"X"]
[null,3,5,4,"Y"]
[null,3,5,5,"Z"]
[null,3,5,6,"Z"]
[null,3,5,7,"Z"]
[null,3,5,8,"Z"]
[null,3,5,9,"X"]
[null,3,6,1,"X"]
[null,3,6,2,"X"]
[null,3,6,3,"X"]
[null,3,6,4,"X"]
[null,3,6,5,"Z"]
[null,3,6,6,"Z"]
[null,3,6,7,"Z"]
[null,3,6,8,"Z"]
[null,3,6,9,"Y"]
[null,3,7,1,"X"]
[null,3,7,2,"X"]
[null,3,7,3,"X"]
[null,3,7,4,"X"]
[null,3,7,5,"Y"]
[null,3,7,6,"Z"]
[null,3,7,7,"Z"]
[null,3,7,8,"Z"]
[null,3,7,9,"Z"]
[null,3,8,1,"Y"]
[null,3,8,2,"X"]
[null,3,8,3,"X"]
[null,3,8,4,"X"]
[null,3,8,5,"X"]
[null,3,8,6,"Z"]
[null,3,8,7,"Z"]
[null,3,8,8,"Z"]
[null,3,8,9,"Z"]
[null,3,9,1,"Z"]
[null,3,9,2,"Z"]
[null,3,9,3,"X"]
[null,3,9,4,"X"]
[null,3,9,5,"X"]
[null,3,9,6,"Y"]
[null,3,9,7,"Z"]
[null,3,9,8,"Z"]
[null,3,9,9,"Z"]
[null,4,1,1,"Z"]
[null,4,1,2,"Z"]
[null,4,1,3,"Z"]
[null,4,1,4,"X"]
[null,4,1,5,"X"]
[null,4,1,6,"X"]
[null,4,1,7,"Y"]
[null,4,1,8,"Z"]
[null,4,1,9,"Z"]
[null,4,2,1,"Z"]
[null,4,2,2,"Z"]
[null,4,2,3,"Y"]
[null,4,2,4,"X"]
[null,4,2,5,"X"]
[null,4,2,6,"X"]
[null,4,2,7,"X"]
[null,4,2,8,"Z"]
[null,4,2,9,"Z"]
[null,4,3,1,"Z"]
[null,4,3,2,"Z"]
[null,4,3,3,"Z"]
[null,4,3,4,"X"]
[null,4,3,5,"X"]
[null,4,3,6,"X"]
[null,4,3,7,"X"]
[null,4,3,8,"Y"]
[null,4,3,9,"Z"]
[null,4,4,1,"X"]
[null,4,4,2,"X"]
[null,4,4,3,"Y"]
[null,4,4,5,"Y"]
[null,4,4,6,"X"]
[null,4,4,7,"Z"]
[null,4,4,8,"X"]
[null,4,4,9,"X"]
[null,4,5,1,"X"]
[null,4,5,2,"X"]
[null,4,5,3,"X"]
[null,4,5,4,"X"]
[null,4,5,5,"Z"]
[null,4,5,6,"Z"]
[null,4,5,7,"Z"]
[null,4,5,8,"Z"]
[null,4,5,9,"Y"]
[null,4,6,1,"X"]
[null,4,6,2,"X"]
[null,4,6,3,"X"]
[null,4,6,4,"X"]
[null,4,6,5,"Y"]
[null,4,6,6,"Z"]
[null,4,6,7,"Z"]
[null,4,6,8,"Z"]
[null,4,6,9,"Z"]
[null,4,7,1,"Y"]
[null,4,7,2,"X"]
[null,4,7,3,"X"]
[null,4,7,4,"X"]
[null,4,7,5,"Z"]
[null,4,7,6,"Z"]
[null,4,7,7,"Z"]
[null,4,7,8,"Z"]
[null,4,7,9,"Z"]
[null,4,8,1,"Z"]
[null,4,8,2,"X"]
[null,4,8,3,"X"]
[null,4,8,4,"X"]
[null,4,8,5,"X"]
[null,4,8,6,"Y"]
[null,4,8,7,"Z"]
[null,4,8,8,"Z"]
[null,4,8,9,"Z"]
[null,4,9,1,"Z"]
[null,4,9,2,"Y"]
[null,4,9,3,"X"]
[null,4,9,4,"X"]
[null,4,9,5,"X"]
[null,4,9,6,"X"]
[null,4,9,7,"Z"]
[null,4,9,8,"Z"]
[null,4,9,9,"Z"]
[null,5,1,1,"Z"]
[null,5,1,2,"Z"]
[null,5,1,3,"Y"]
[null,5,1,4,"X"]
[null,5,1,5,"X"]
[null,5,1,6,"X"]
[null,5,1,7,"X"]
[null,5,1,8,"Z"]
[null,5,1,9,"Z"]
[null,5,2,1,"Z"]
[null,5,2,2,"Z"]
[null,5,2,3,"Z"]
[null,5,2,4,"X"]
[null,5,2,5,"X"]
[null,5,2,6,"X"]
[null,5,2,7,"X"]
[null,5,2,8,"Y"]
[null,5,2,9,"Z"]
[null,5,3,1,"Z"]
[null,5,3,2,"Z"]
[null,5,3,3,"Z"]
[null,5,3,4,"Y"]
[null,5,3,5,"X"]
[null,5,3,6,"X"]
[null,5,3,7,"X"]
[null,5,3,8,"X"]
[null,5,3,9,"Z"]
[null,5,4,1,"Z"]
[null,5,4,2,"Z"]
[null,5,4,3,"Z"]
[null,5,4,4,"Z"]
[null,5,4,5,"X"]
[null,5,4,6,"X"]
[null,5,4,7,"X"]
[null,5,4,8,"X"]
[null,5,4,9,"Y"]
[null,5,5,1,"X"]
[null,5,5,2,"X"]
[null,5,5,3,"X"]
[null,5,5,4,"Y"]
[null,5,5,6,"Y"]
[null,5,5,7,"X"]
[null,5,5,8,"Z"]
[null,5,5,9,"X"]
[null,5,6,1,"Y"]
[null,5,6,2,"X"]
[null,5,6,3,"X"]
[null,5,6,4,"X"]
[null,5,6,5,"X"]
[null,5,6,6,"Z"]
[null,5,6,7,"Z"]
[null,5,6,8,"Z"]
[null,5,6,9,"Z"]
[null,5,7,1,"Z"]
[null,5,7,2,"X"]
[null,5,7,3,"X"]
[null,5,7,4,"X"]
[null,5,7,5,"X"]
[null,5,7,6,"Y"]
[null,5,7,7,"Z"]
[null,5,7,8,"Z"]
[null,5,7,9,"Z"]
[null,5,8,1,"Z"]
[null,5,8,2,"Y"]
[null,5,8,3,"X"]
[null,5,8,4,"X"]
[null,5,8,5,"X"]
[null,5,8,6,"X"]
[null,5,8,7,"Z"]
[null,5,8,8,"Z"]
[null,5,8,9,"Z"]
[null,5,9,1,"Z"]
[null,5,9,2,"Z"]
[null,5,9,3,"X"]
[null,5,9,4,"X"]
[null,5,9,5,"X"]
[null,5,9,6,"X"]
[null,5,9,7,"Y"]
[null,5,9,8,"X"]
[null,5,9,9,"X"]
[null,6,1,1,"X"]
[null,6,1,2,"X"]
[null,6,1,3,"X"]
[null,6,1,4,"X"]
[null,6,1,5,"X"]
[null,6,1,6,"X"]
[null,6,1,7,"X"]
[null,6,1,8,"Y"]
[null,6,1,9,"Z"]
[null,6,2,1,"Z"]
[null,6,2,2,"Z"]
[null,6,2,3,"Z"]
[null,6,2,4,"Y"]
[null,6,2,5,"X"]
[null,6,2,6,"X"]
[null,6,2,7,"X"]
[null,6,2,8,"X"]
[null,6,2,9,"X"]
[null,6,3,1,"Z"]
[null,6,3,2,"Z"]
[null,6,3,3,"Z"]
[null,6,3,4,"Z"]
[null,6,3,5,"X"]
[null,6,3,6,"X"]
[null,6,3,7,"X"]
[null,6,3,8,"X"]
[null,6,3,9,"Y"]
[null,6,4,1,"Z"]
[null,6,4,2,"Z"]
[null,6,4,3,"Z"]
[null,6,4,4,"Z"]
[null,6,4,5,"Y"]
[null,6,4,6,"X"]
[null,6,4,7,"X"]
[null,6,4,8,"X"]
[null,6,4,9,"X"]
[null,6,5,1,"Y"]
[null,6,5,2,"Z"]
[null,6,5,3,"Z"]
[null,6,5,4,"Z"]
[null,6,5,5,"Z"]
[null,6,5,6,"X"]
[null,6,5,7,"X"]
[null,6,5,8,"X"]
[null,6,5,9,"X"]
[null,6,6,1,"X"]
[null,6,6,2,"X"]
[null,6,6,3,"X"]
[null,6,6,4,"X"]
[null,6,6,5,"Y"]
[null,6,6,7,"Y"]
[null,6,6,8,"X"]
[null,6,6,9,"Z"]
[null,6,7,1,"Z"]
[null,6,7,2,"Y"]
[null,6,7,3,"X"]
[null,6,7,4,"X"]
[null,6,7,5,"X"]
[null,6,7,6,"X"]
[null,6,7,7,"Z"]
[null,6,7,8,"Z"]
[null,6,7,9,"Z"]
[null,6,8,1,"Z"]
[null,6,8,2,"Z"]
[null,6,8,3,"X"]
[null,6,8,4,"X"]
[null,6,8,5,"X"]
[null,6,8,6,"X"]
[null,6,8,7,"Y"]
[null,6,8,8,"Z"]
[null,6,8,9,"Z"]
[null,6,9,1,"Z"]
[null,6,9,2,"Z"]
[null,6,9,3,"Y"]
[null,6,9,4,"X"]
[null,6,9,5,"X"]
[null,6,9,6,"X"]
[null,6,9,7,"X"]
[null,6,9,8,"Z"]
[null,6,9,9,"Z"]
[null,7,1,1,"Z"]
[null,7,1,2,"Z"]
[null,7,1,3,"Z"]
[null,7,1,4,"Y"]
[null,7,1,5,"X"]
[null,7,1,6,"X"]
[null,7,1,7,"X"]
[null,7,1,8,"X"]
[null,7,1,9,"Z"]
[null,7,2,1,"Z"]
[null,7,2,2,"Z"]
[null,7,2,3,"Z"]
[null,7,2,4,"Z"]
[null,7,2,5,"Z"]
[null,7,2,6,"X"]
[null,7,2,7,"X"]
[null,7,2,8,"X"]
[null,7,2,9,"Y"]
[null,7,3,1,"Z"]
[null,7,3,2,"Z"]
[null,7,3,3,"Z"]
[null,7,3,4,"Z"]
[null,7,3,5,"Y"]
[null,7,3,6,"X"]
[null,7,3,7,"X"]
[null,7,3,8,"X"]
[null,7,3,9,"X"]
[null,7,4,1,"Y"]
[null,7,4,2,"Z"]
[null,7,4,3,"Z"]
[null,7,4,4,"Z"]
[null,7,4,5,"Z"]
[null,7,4,6,"X"]
[null,7,4,7,"X"]
[null,7,4,8,"X"]
[null,7,4,9,"X"]
[null,7,5,1,"X"]
[null,7,5,2,"Z"]
[null,7,5,3,"Z"]
[null,7,5,4,"Z"]
[null,7,5,5,"Z"]
[null,7,5,6,"Y"]
[null,7,5,7,"X"]
[null,7,5,8,"X"]
[null,7,5,9,"X"]
[null,7,6,1,"X"]
[null,7,6,2,"Y"]
[null,7,6,3,"Z"]
[null,7,6,4,"Z"]
[null,7,6,5,"Z"]
[null,7,6,6,"Z"]
[null,7,6,7,"X"]
[null,7,6,8,"X"]
[null,7,6,9,"X"]
[null,7,7,1,"X"]
[null,7,7,2,"X"]
[null,7,7,3,"X"]
[null,7,7,4,"X"]
[null,7,7,5,"X"]
[null,7,7,6,"Y"]
[null,7,7,8,"Y"]
[null,7,7,9,"X"]
[null,7,8,1,"Z"]
[null,7,8,2,"Z"]
[null,7,8,3,"Y"]
[null,7,8,4,"X"]
[null,7,8,5,"X"]
[null,7,8,6,"X"]
[null,7,8,7,"X"]
[null,7,8,8,"Z"]
[null,7,8,9,"Z"]
[null,7,9,1,"Z"]
[null,7,9,2,"Z"]
[null,7,9,3,"Z"]
[null,7,9,4,"X"]
[null,7,9,5,"X"]
[null,7,9,6,"X"]
[null,7,9,7,"X"]
[null,7,9,8,"Y"]
[null,7,9,9,"Z"]
[null,8,1,1,"Z"]
[null,8,1,2,"Z"]
[null,8,1,3,"Z"]
[null,8,1,4,"Z"]
[null,8,1,5,"X"]
[null,8,1,6,"X"]
[null,8,1,7,"X"]
[null,8,1,8,"X"]
[null,8,1,9,"Y"]
[null,8,2,1,"Z"]
[null,8,2,2,"Z"]
[null,8,2,3,"Z"]
[null,8,2,4,"Z"]
[null,8,2,5,"Y"]
[null,8,2,6,"X"]
[null,8,2,7,"X"]
[null,8,2,8,"X"]
[null,8,2,9,"X"]
[null,8,3,1,"Y"]
[null,8,3,2,"Z"]
[null,8,3,3,"Z"]
[null,8,3,4,"Z"]
[null,8,3,5,"Z"]
[null,8,3,6,"X"]
[null,8,3,7,"X"]
[null,8,3,8,"X"]
[null,8,3,9,"X"]
[null,8,4,1,"X"]
[null,8,4,2,"Z"]
[null,8,4,3,"Z"]
[null,8,4,4,"Z"]
[null,8,4,5,"Z"]
[null,8,4,6,"Y"]
[null,8,4,7,"X"]
[null,8,4,8,"X"]
[null,8,4,9,"X"]
[null,8,5,1,"X"]
[null,8,5,2,"Y"]
[null,8,5,3,"Z"]
[null,8,5,4,"Z"]
[null,8,5,5,"Z"]
[null,8,5,6,"Z"]
[null,8,5,7,"X"]
[null,8,5,8,"X"]
[null,8,5,9,"X"]
[null,8,6,1,"X"]
[null,8,6,2,"X"]
[null,8,6,3,"Z"]
[null,8,6,4,"Z"]
[null,8,6,5,"Z"]
[null,8,6,6,"Z"]
[null,8,6,7,"Y"]
[null,8,6,8,"X"]
[null,8,6,9,"X"]
[null,8,7,1,"X"]
[null,8,7,2,"X"]
[null,8,7,3,"Y"]
[null,8,7,4,"Z"]
[null,8,7,5,"Z"]
[null,8,7,6,"Z"]
[null,8,7,7,"Z"]
[null,8,7,8,"X"]
[null,8,7,9,"X"]
[null,8,8,1,"X"]
[null,8,8,2,"X"]
[null,8,8,3,"X"]
[null,8,8,4,"X"]
[null,8,8,5,"X"]
[null,8,8,6,"X"]
[null,8,8,7,"Y"]
[null,8,8,9,"Y"]
[null,8,9,1,"Z"]
[null,8,9,2,"Z"]
[null,8,9,3,"Z"]
[null,8,9,4,"Y"]
[null,8,9,5,"X"]
[null,8,9,6,"X"]
[null,8,9,7,"X"]
[null,8,9,8,"X"]
[null,8,9,9,"Z"]
[null,9,1,1,"Z"]
[null,9,1,2,"Z"]
[null,9,1,3,"Z"]
[null,9,1,4,"Z"]
[null,9,1,5,"Y"]
[null,9,1,6,"X"]
[null,9,1,7,"X"]
[null,9,1,8,"X"]
[null,9,1,9,"X"]
[null,9,2,1,"Y"]
[null,9,2,2,"Z"]
[null,9,2,3,"Z"]
[null,9,2,4,"Z"]
[null,9,2,5,"Z"]
[null,9,2,6,"X"]
[null,9,2,7,"X"]
[null,9,2,8,"X"]
[null,9,2,9,"X"]
[null,9,3,1,"X"]
[null,9,3,2,"Z"]
[null,9,3,3,"Z"]
[null,9,3,4,"Z"]
[null,9,3,5,"Z"]
[null,9,3,6,"Y"]
[null,9,3,7,"X"]
[null,9,3,8,"X"]
[null,9,3,9,"X"]
[null,9,4,1,"X"]
[null,9,4,2,"Y"]
[null,9,4,3,"Z"]
[null,9,4,4,"Z"]
[null,9,4,5,"Z"]
[null,9,4,6,"Z"]
[null,9,4,7,"X"]
[null,9,4,8,"X"]
[null,9,4,9,"X"]
[null,9,5,1,"X"]
[null,9,5,2,"X"]
[null,9,5,3,"Z"]
[null,9,5,4,"Z"]
[null,9,5,5,"Z"]
[null,9,5,6,"Z"]
[null,9,5,7,"Y"]
[null,9,5,8,"X"]
[null,9,5,9,"X"]
[null,9,6,1,"X"]
[null,9,6,2,"X"]
[null,9,6,3,"Y"]
[null,9,6,4,"Z"]
[null,9,6,5,"Z"]
[null,9,6,6,"Z"]
[null,9,6,7,"Z"]
[null,9,6,8,"X"]
[null,9,6,9,"X"]
[null,9,7,1,"X"]
[null,9,7,2,"X"]
[null,9,7,3,"X"]
[null,9,7,4,"Z"]
[null,9,7,5,"Z"]
[null,9,7,6,"Z"]
[null,9,7,7,"Z"]
[null,9,7,8,"Y"]
[null,9,7,9,"X"]
[null,9,8,1,"X"]
[null,9,8,2,"X"]
[null,9,8,3,"X"]
[null,9,8,4,"Y"]
[null,9,8,5,"Z"]
[null,9,8,6,"Z"]
[null,9,8,7,"Z"]
[null,9,8,8,"Z"]
[null,9,8,9,"X"]
[null,9,9,1,"Y"]
[null,9,9,2,"X"]
[null,9,9,3,"X"]
[null,9,9,4,"X"]
[null,9,9,5,"X"]
[null,9,9,6,"X"]
[null,9,9,7,"X"]
[null,9,9,8,"Y"]