{"text_format":"1","workbook":"xlsx","n_sheets":3,"sheets":["Feuil1","Feuil2","Feuil3"],"not_rendered":{"charts":0,"images":0,"macros":1,"external_links":0,"defined_names":3,"comments":0,"pivot_tables":0},"unopened":[],"bounds":{"document_bytes":16777216,"sheet_cells":100000,"rows_first":2000,"rows_last":500,"rows_between":2000,"halvings":0,"cell_chars":16384,"cell_head_chars":4096},"cells_cut":0,"cells_raw":0,"read":"whole","date_system":"1900"}

{"sheet":"Feuil1","index":0,"n_rows":35,"n_cols":23,"rows_kept":35,"cut":false,"hidden":false,"merged":[[0,0,0,21],[1,3,1,21],[2,3,2,5],[2,12,2,14],[2,15,2,17],[2,6,2,8],[2,9,2,11]]}
["  PETANQUE"]
[null,null,"concours du "]
[null,null,null,"PARTIE 1",null,null,"PARTIE 2",null,null,"PARTIE 3",null,null,"PARTIE 4",null,null,"PARTIE 5",null,null,"G","PTS +","PTS -","POINTS"]
[null,null,"NOM","N","E","G","N","E","G","N","E","G","N","E","G","N","E","G"]
[1,1,null,null,0,{"$f":"IF(AND(D5:D35=13,E4:E35<>13),1,0)","v":0},null,null,{"$f":"IF(AND(G5:G35=13,H4:H35<>13),1,0)","v":0},null,null,{"$f":"IF(AND(J5:J35=13,K4:K35<>13),1,0)","v":0},null,null,{"$f":"IF(AND(M5:M35=13,N5:N35<>13),1,0)","v":0},null,null,{"$f":"IF(AND(P5:P35=13,Q5:Q35<>13),1,0)","v":0},{"$f":"R5:R35+O5:O35+L5:L35+I5:I35+F5:F35","v":0},{"$f":"P5:P35+M5:M35+J5:J35+G5:G35+D5:D35","v":0},{"$f":"Q5:Q35+N5+K5:K35+H5:H35+E5:E35","v":0},{"$f":"T5:T35-U5:U35","v":0}]
[1,1,"JOELLE",13,11,{"$f":"IF(AND(D6:D35=13,E5:E35<>13),1,0)","v":1},4,13,{"$f":"IF(AND(G6:G35=13,H5:H35<>13),1,0)","v":0},13,5,{"$f":"IF(AND(J6:J35=13,K5:K35<>13),1,0)","v":1},11,13,{"$f":"IF(AND(M6:M35=13,N6:N35<>13),1,0)","v":0},null,null,{"$f":"IF(AND(P6:P35=13,Q6:Q35<>13),1,0)","v":0},{"$f":"R6:R35+O6:O35+L6:L35+I6:I35+F6:F35","v":2},{"$f":"P6:P35+M6:M35+J6:J35+G6:G35+D6:D35","v":41},{"$f":"Q6:Q35+N6+K6:K35+H6:H35+E6:E35","v":42},{"$f":"T6:T35-U6:U35","v":-1},{"$f":"S6+(V6/100)","v":1.99}]
[2,2,"DANIEL FLAHAUT",13,0,{"$f":"IF(AND(D7:D35=13,E6:E35<>13),1,0)","v":1},5,13,{"$f":"IF(AND(G7:G35=13,H6:H35<>13),1,0)","v":0},13,4,{"$f":"IF(AND(J7:J35=13,K6:K35<>13),1,0)","v":1},4,13,{"$f":"IF(AND(M7:M35=13,N7:N35<>13),1,0)","v":0},null,null,{"$f":"IF(AND(P6:P35=13,Q7:Q35<>13),1,0)","v":0},{"$f":"R7:R35+O7:O35+L7:L35+I7:I35+F7:F35","v":2},{"$f":"P7:P35+M7:M35+J7:J35+G7:G35+D7:D35","v":35},{"$f":"Q7:Q35+N7+K7:K35+H7:H35+E7:E35","v":30},{"$f":"T7:T35-U7:U35","v":5},{"$f":"S7+(V7/100)","v":2.0499999999999998}]
[3,3,"BRAYAN",6,13,{"$f":"IF(AND(D8:D35=13,E7:E35<>13),1,0)","v":0},13,11,{"$f":"IF(AND(G8:G35=13,H7:H35<>13),1,0)","v":1},13,7,{"$f":"IF(AND(J8:J35=13,K7:K35<>13),1,0)","v":1},9,13,{"$f":"IF(AND(M8:M35=13,N8:N35<>13),1,0)","v":0},null,null,{"$f":"IF(AND(P8:P35=13,Q8:Q35<>13),1,0)","v":0},{"$f":"R8:R35+O8:O35+L8:L35+I8:I35+F8:F35","v":2},{"$f":"P8:P35+M8:M35+J8:J35+G8:G35+D8:D35","v":41},{"$f":"Q8:Q35+N8+K8:K35+H8:H35+E8:E35","v":44},{"$f":"T8:T35-U8:U35","v":-3},1.97]
[4,4,"ERIC",6,13,{"$f":"IF(AND(D9:D35=13,E8:E35<>13),1,0)","v":0},13,7,{"$f":"IF(AND(G9:G35=13,H8:H35<>13),1,0)","v":1},13,9,{"$f":"IF(AND(J9:J35=13,K8:K35<>13),1,0)","v":1},12,13,{"$f":"IF(AND(M9:M35=13,N9:N35<>13),1,0)","v":0},null,null,{"$f":"IF(AND(P9:P35=13,Q9:Q35<>13),1,0)","v":0},2,44,42,{"$f":"T9:T35-U9:U35","v":2},2.02]
[5,5,"DIDIER SAISON",3,13,{"$f":"IF(AND(D10:D35=13,E9:E35<>13),1,0)","v":0},11,13,{"$f":"IF(AND(G10:G35=13,H9:H35<>13),1,0)","v":0},13,7,{"$f":"IF(AND(J10:J35=13,K9:K35<>13),1,0)","v":1},11,13,{"$f":"IF(AND(M10:M35=13,N10:N35<>13),1,0)","v":0},null,null,{"$f":"IF(AND(P10:P35=13,Q10:Q35<>13),1,0)","v":0},1,38,46,{"$f":"T10:T35-U10:U35","v":-8},0.92]
[6,6,"LILIANE",5,13,{"$f":"IF(AND(D11:D35=13,E10:E35<>13),1,0)","v":0},3,13,{"$f":"IF(AND(G11:G35=13,H10:H35<>13),1,0)","v":0},7,13,{"$f":"IF(AND(J11:J35=13,K10:K35<>13),1,0)","v":0},13,7,{"$f":"IF(AND(M11:M35=13,N11:N35<>13),1,0)","v":1},null,null,{"$f":"IF(AND(P11:P35=13,Q11:Q35<>13),1,0)","v":0},1,28,46,{"$f":"T11:T35-U11:U35","v":-18},0.82000000000000006]
[7,7,"FABRICE",7,13,{"$f":"IF(AND(D12:D35=13,E11:E35<>13),1,0)","v":0},13,11,{"$f":"IF(AND(G12:G35=13,H11:H35<>13),1,0)","v":1},8,13,{"$f":"IF(AND(J12:J35=13,K11:K35<>13),1,0)","v":0},13,10,{"$f":"IF(AND(M12:M35=13,N12:N35<>13),1,0)","v":1},null,null,{"$f":"IF(AND(P12:P35=13,Q12:Q35<>13),1,0)","v":0},2,41,47,{"$f":"T12:T35-U12:U35","v":-6},{"$f":"S12+(V12/100)+(ROW()/1000)","v":1.952}]
[8,8,"DANY",13,7,{"$f":"IF(AND(D13:D35=13,E12:E35<>13),1,0)","v":1},5,13,{"$f":"IF(AND(G13:G35=13,H12:H35<>13),1,0)","v":0},7,13,{"$f":"IF(AND(J13:J35=13,K12:K35<>13),1,0)","v":0},13,11,{"$f":"IF(AND(M13:M35=13,N13:N35<>13),1,0)","v":1},null,null,{"$f":"IF(AND(P13:P35=13,Q13:Q35<>13),1,0)","v":0},2,38,44,{"$f":"T13:T35-U13:U35","v":-6},{"$f":"S13+(V13/100)+(ROW()/1000)","v":1.9529999999999998}]
[9,9,"JULIEN",13,12,{"$f":"IF(AND(D14:D35=13,E13:E35<>13),1,0)","v":1},13,11,{"$f":"IF(AND(G14:G35=13,H13:H35<>13),1,0)","v":1},13,4,{"$f":"IF(AND(J14:J35=13,K13:K35<>13),1,0)","v":1},2,13,{"$f":"IF(AND(M14:M35=13,N14:N35<>13),1,0)","v":0},null,null,{"$f":"IF(AND(P14:P35=13,Q14:Q35<>13),1,0)","v":0},3,41,40,{"$f":"T14:T35-U14:U35","v":1},3.0239999999999996]
[10,10,"MICHEL MAUGER",11,13,{"$f":"IF(AND(D15:D35=13,E14:E35<>13),1,0)","v":0},7,13,{"$f":"IF(AND(G15:G35=13,H14:H35<>13),1,0)","v":0},13,7,{"$f":"IF(AND(J15:J35=13,K14:K35<>13),1,0)","v":1},13,8,{"$f":"IF(AND(M15:M35=13,N15:N35<>13),1,0)","v":1},null,null,{"$f":"IF(AND(P15:P35=13,Q15:Q35<>13),1,0)","v":0},2,44,41,{"$f":"T15:T35-U15:U35","v":3},2.0449999999999999]
[11,11,"KEVIN",3,13,{"$f":"IF(AND(D16:D35=13,E15:E35<>13),1,0)","v":0},7,13,{"$f":"IF(AND(G16:G35=13,H15:H35<>13),1,0)","v":0},13,10,{"$f":"IF(AND(J16:J35=13,K15:K35<>13),1,0)","v":1},13,7,{"$f":"IF(AND(M16:M35=13,N16:N35<>13),1,0)","v":1},null,null,{"$f":"IF(AND(P16:P35=13,Q16:Q35<>13),1,0)","v":0},2,36,43,{"$f":"T16:T35-U16:U35","v":-7},1.946]
[12,12,"PASCAL",13,5,{"$f":"IF(AND(D17:D35=13,E16:E35<>13),1,0)","v":1},13,9,{"$f":"IF(AND(G17:G35=13,H16:H35<>13),1,0)","v":1},10,13,{"$f":"IF(AND(J17:J35=13,K16:K35<>13),1,0)","v":0},13,4,{"$f":"IF(AND(M17:M35=13,N17:N35<>13),1,0)","v":1},null,null,{"$f":"IF(AND(P17:P35=13,Q17:Q35<>13),1,0)","v":0},3,49,31,{"$f":"T17:T35-U17:U35","v":18},3.1970000000000001]
[13,13,"ANNIE",13,12,{"$f":"IF(AND(D18:D35=13,E17:E35<>13),1,0)","v":1},7,13,{"$f":"IF(AND(G18:G35=13,H17:H35<>13),1,0)","v":0},9,13,{"$f":"IF(AND(J18:J35=13,K17:K35<>13),1,0)","v":0},10,13,{"$f":"IF(AND(M18:M35=13,N18:N35<>13),1,0)","v":0},null,null,{"$f":"IF(AND(P18:P35=13,Q18:Q35<>13),1,0)","v":0},1,39,51,{"$f":"T18:T35-U18:U35","v":-12},0.89800000000000002]
[14,14,"BRUNO",13,7,{"$f":"IF(AND(D19:D35=13,E18:E35<>13),1,0)","v":1},9,13,{"$f":"IF(AND(G19:G35=13,H18:H35<>13),1,0)","v":0},13,9,{"$f":"IF(AND(J19:J35=13,K18:K35<>13),1,0)","v":1},13,9,{"$f":"IF(AND(M19:M35=13,N19:N35<>13),1,0)","v":1},null,null,{"$f":"IF(AND(P19:P35=13,Q19:Q35<>13),1,0)","v":0},3,48,38,{"$f":"T19:T35-U19:U35","v":10},3.1190000000000002]
[15,15,"CYRIL",13,3,{"$f":"IF(AND(D20:D35=13,E19:E35<>13),1,0)","v":1},13,5,{"$f":"IF(AND(G20:G35=13,H19:H35<>13),1,0)","v":1},13,4,{"$f":"IF(AND(J20:J35=13,K19:K35<>13),1,0)","v":1},7,13,{"$f":"IF(AND(M20:M35=13,N20:N35<>13),1,0)","v":0},null,null,{"$f":"IF(AND(P20:P35=13,Q20:Q35<>13),1,0)","v":0},3,46,25,{"$f":"T20:T35-U20:U35","v":21},3.23]
[16,16,"JEROME",4,13,{"$f":"IF(AND(D21:D35=13,E20:E35<>13),1,0)","v":0},6,13,{"$f":"IF(AND(G21:G35=13,H20:H35<>13),1,0)","v":0},7,13,{"$f":"IF(AND(J21:J35=13,K20:K35<>13),1,0)","v":0},6,13,{"$f":"IF(AND(M21:M35=13,N21:N35<>13),1,0)","v":0},null,null,{"$f":"IF(AND(P21:P35=13,Q21:Q35<>13),1,0)","v":0},0,23,52,{"$f":"T21:T35-U21:U35","v":-29},-0.26899999999999996]
[17,17,"BENJAMIN",13,6,{"$f":"IF(AND(D22:D35=13,E21:E35<>13),1,0)","v":1},13,7,{"$f":"IF(AND(G22:G35=13,H21:H35<>13),1,0)","v":1},4,13,{"$f":"IF(AND(J22:J35=13,K21:K35<>13),1,0)","v":0},8,13,{"$f":"IF(AND(M22:M35=13,N22:N35<>13),1,0)","v":0},null,null,{"$f":"IF(AND(P22:P35=13,Q22:Q35<>13),1,0)","v":0},2,38,39,{"$f":"T22:T35-U22:U35","v":-1},2.012]
[18,18,"STEPHANE",7,13,{"$f":"IF(AND(D23:D35=13,E22:E35<>13),1,0)","v":0},13,6,{"$f":"IF(AND(G23:G35=13,H22:H35<>13),1,0)","v":1},9,13,{"$f":"IF(AND(J23:J35=13,K22:K35<>13),1,0)","v":0},13,12,{"$f":"IF(AND(M23:M35=13,N23:N35<>13),1,0)","v":1},null,null,{"$f":"IF(AND(P23:P35=13,Q23:Q35<>13),1,0)","v":0},2,42,44,{"$f":"T23:T35-U23:U35","v":-2},2.0030000000000001]
[19,19,"DOMINIQUE",12,13,{"$f":"IF(AND(D24:D35=13,E23:E35<>13),1,0)","v":0},13,7,{"$f":"IF(AND(G24:G35=13,H23:H35<>13),1,0)","v":1},4,13,{"$f":"IF(AND(J24:J35=13,K23:K35<>13),1,0)","v":0},10,13,{"$f":"IF(AND(M24:M35=13,N24:N35<>13),1,0)","v":0},null,null,{"$f":"IF(AND(P24:P35=13,Q24:Q35<>13),1,0)","v":0},1,39,46,{"$f":"T24:T35-U24:U35","v":-7},0.95399999999999996]
[20,20,"LUDO",13,4,{"$f":"IF(AND(D25:D35=13,E24:E35<>13),1,0)","v":1},13,5,{"$f":"IF(AND(G25:G35=13,H24:H35<>13),1,0)","v":1},13,8,{"$f":"IF(AND(J25:J35=13,K24:K35<>13),1,0)","v":1},13,2,{"$f":"IF(AND(M25:M35=13,N25:N35<>13),1,0)","v":1},null,null,{"$f":"IF(AND(P25:P35=13,Q25:Q35<>13),1,0)","v":0},4,52,19,{"$f":"T25:T35-U25:U35","v":33},4.3550000000000004]
[21,21,"GEORGET",13,6,{"$f":"IF(AND(D26:D35=13,E25:E35<>13),1,0)","v":1},5,13,{"$f":"IF(AND(G26:G35=13,H25:H35<>13),1,0)","v":0},5,13,{"$f":"IF(AND(J26:J35=13,K25:K35<>13),1,0)","v":0},8,13,{"$f":"IF(AND(M26:M35=13,N26:N35<>13),1,0)","v":0},null,null,{"$f":"IF(AND(P26:P35=13,Q26:Q35<>13),1,0)","v":0},1,31,45,{"$f":"T26:T35-U26:U35","v":-14},0.88600000000000001]
[22,22,"MATHIEU",13,7,{"$f":"IF(AND(D27:D35=13,E26:E35<>13),1,0)","v":1},13,5,{"$f":"IF(AND(G27:G35=13,H26:H35<>13),1,0)","v":1},4,13,{"$f":"IF(AND(J27:J35=13,K26:K35<>13),1,0)","v":0},13,12,{"$f":"IF(AND(M27:M35=13,N27:N35<>13),1,0)","v":1},null,null,{"$f":"IF(AND(P27:P35=13,Q27:Q35<>13),1,0)","v":0},3,43,37,{"$f":"T27:T35-U27:U35","v":6},3.0870000000000002]
[23,23,"HENRI",0,13,{"$f":"IF(AND(D28:D35=13,E27:E35<>13),1,0)","v":0},7,13,{"$f":"IF(AND(G28:G35=13,H27:H35<>13),1,0)","v":0},13,7,{"$f":"IF(AND(J28:J35=13,K27:K35<>13),1,0)","v":1},7,13,{"$f":"IF(AND(M28:M35=13,N28:N35<>13),1,0)","v":0},null,null,{"$f":"IF(AND(P28:P35=13,Q28:Q35<>13),1,0)","v":0},1,27,46,{"$f":"T28:T35-U28:U35","v":-19},0.83800000000000008]
[24,24,"BENOIT",13,6,{"$f":"IF(AND(D29:D35=13,E28:E35<>13),1,0)","v":1},13,7,{"$f":"IF(AND(G29:G35=13,H28:H35<>13),1,0)","v":1},8,13,{"$f":"IF(AND(J29:J35=13,K28:K35<>13),1,0)","v":0},13,11,{"$f":"IF(AND(M29:M35=13,N29:N35<>13),1,0)","v":1},null,null,{"$f":"IF(AND(P29:P35=13,Q29:Q35<>13),1,0)","v":0},3,47,37,{"$f":"T29:T35-U29:U35","v":10},3.129]
[25,25,"DIDIER MONROY",6,13,{"$f":"IF(AND(D30:D35=13,E29:E35<>13),1,0)","v":0},2,13,{"$f":"IF(AND(G30:G35=13,H29:H35<>13),1,0)","v":0},10,13,{"$f":"IF(AND(J30:J35=13,K29:K35<>13),1,0)","v":0},13,6,{"$f":"IF(AND(M30:M35=13,N30:N35<>13),1,0)","v":1},null,null,{"$f":"IF(AND(P30:P35=13,Q30:Q35<>13),1,0)","v":0},1,31,45,{"$f":"T30:T35-U30:U35","v":-14},0.89]
[26,26,"CHRISTO",8,13,{"$f":"IF(AND(D31:D35=13,E30:E35<>13),1,0)","v":0},13,2,{"$f":"IF(AND(G31:G35=13,H30:H35<>13),1,0)","v":1},13,8,{"$f":"IF(AND(J31:J35=13,K30:K35<>13),1,0)","v":1},13,8,{"$f":"IF(AND(M31:M35=13,N31:N35<>13),1,0)","v":1},null,null,{"$f":"IF(AND(P31:P35=13,Q31:Q35<>13),1,0)","v":0},3,47,31,{"$f":"T31:T35-U31:U35","v":16},3.1910000000000003]
[27,27,"PÈRE NOEL",13,8,{"$f":"IF(AND(D32:D35=13,E31:E35<>13),1,0)","v":1},13,4,{"$f":"IF(AND(G32:G35=13,H31:H35<>13),1,0)","v":1},13,10,{"$f":"IF(AND(J32:J35=13,K31:K35<>13),1,0)","v":1},13,7,{"$f":"IF(AND(M32:M35=13,N32:N35<>13),1,0)","v":1},null,null,{"$f":"IF(AND(P32:P35=13,Q32:Q35<>13),1,0)","v":0},4,52,29,{"$f":"T32:T35-U32:U35","v":23},4.2620000000000005]
[28,28,"CHRISTOPHE",12,13,{"$f":"IF(AND(D33:D35=13,E32:E35<>13),1,0)","v":0},13,3,{"$f":"IF(AND(G33:G35=13,H32:H35<>13),1,0)","v":1},13,10,{"$f":"IF(AND(J33:J35=13,K32:K35<>13),1,0)","v":1},12,13,{"$f":"IF(AND(M33:M35=13,N33:N35<>13),1,0)","v":0},null,null,{"$f":"IF(AND(P33:P35=13,Q33:Q35<>13),1,0)","v":0},2,50,39,{"$f":"T33:T35-U33:U35","v":11},2.1429999999999998]
[29,29,"FRANCIS",13,3,{"$f":"IF(AND(D34:D35=13,E33:E35<>13),1,0)","v":1},11,13,{"$f":"IF(AND(G34:G35=13,H33:H35<>13),1,0)","v":0},10,13,{"$f":"IF(AND(J34:J35=13,K33:K35<>13),1,0)","v":0},13,10,{"$f":"IF(AND(M34:M35=13,N34:N35<>13),1,0)","v":1},null,null,{"$f":"IF(AND(P34:P35=13,Q34:Q35<>13),1,0)","v":0},2,47,39,{"$f":"T34:T35-U34:U35","v":8},2.1139999999999999]
[31,31,null,null,null,{"$f":"IF(AND(D35:D35=13,E34:E35<>13),1,0)","v":0},null,null,{"$f":"IF(AND(G35:G35=13,H34:H35<>13),1,0)","v":0},null,null,{"$f":"IF(AND(J35:J35=13,K34:K35<>13),1,0)","v":0},null,null,{"$f":"IF(AND(M35:M35=13,N35:N35<>13),1,0)","v":0},null,null,{"$f":"IF(AND(P35:P35=13,Q35:Q35<>13),1,0)","v":0},0,0,0,{"$f":"T35:T35-U35:U35","v":0},3.5000000000000003E-2]

{"sheet":"Feuil2","index":1,"n_rows":31,"n_cols":8,"rows_kept":31,"cut":false,"hidden":false,"merged":[[0,0,0,6]]}
["CONCOURS  DU "]
[null,"N°",{"$f":"Feuil1!C4","v":"NOM"},"G","P+","P-","TOTAL"]
[1,{"$f":"Feuil1!B6","v":1},{"$f":"INDEX(données,MATCH(LARGE(class,$B3),class,0),COLUMN()-2)","v":"LUDO"},{"$f":"INDEX(données,MATCH(LARGE(class,$B3),class,0),COLUMN()+13)","v":4},{"$f":"INDEX(données,MATCH(LARGE(class,$B3),class,0),COLUMN()+13)","v":52},{"$f":"INDEX(données,MATCH(LARGE(class,$B3),class,0),COLUMN()+13)","v":19},{"$f":"INDEX(données,MATCH(LARGE(class,$B3),class,0),COLUMN()+13)","v":33},{"$f":"INDEX(données,MATCH(LARGE(class,$B3),class,0),COLUMN()+13)","v":4.3550000000000004}]
[2,{"$f":"Feuil1!B7","v":2},{"$f":"INDEX(données,MATCH(LARGE(class,$B4),class,0),COLUMN()-2)","v":"PÈRE NOEL"},{"$f":"INDEX(données,MATCH(LARGE(class,$B4),class,0),COLUMN()+13)","v":4},{"$f":"INDEX(données,MATCH(LARGE(class,$B4),class,0),COLUMN()+13)","v":52},{"$f":"INDEX(données,MATCH(LARGE(class,$B4),class,0),COLUMN()+13)","v":29},{"$f":"INDEX(données,MATCH(LARGE(class,$B4),class,0),COLUMN()+13)","v":23},{"$f":"Feuil1!B35","v":31}]
[3,{"$f":"Feuil1!B8","v":3},{"$f":"INDEX(données,MATCH(LARGE(class,$B5),class,0),COLUMN()-2)","v":"CYRIL"},{"$f":"INDEX(données,MATCH(LARGE(class,$B5),class,0),COLUMN()+13)","v":3},{"$f":"INDEX(données,MATCH(LARGE(class,$B5),class,0),COLUMN()+13)","v":46},{"$f":"INDEX(données,MATCH(LARGE(class,$B5),class,0),COLUMN()+13)","v":25},{"$f":"INDEX(données,MATCH(LARGE(class,$B5),class,0),COLUMN()+13)","v":21},{"$f":"Feuil1!B25","v":20}]
[4,{"$f":"Feuil1!B9","v":4},{"$f":"INDEX(données,MATCH(LARGE(class,$B6),class,0),COLUMN()-2)","v":"PASCAL"},{"$f":"INDEX(données,MATCH(LARGE(class,$B6),class,0),COLUMN()+13)","v":3},{"$f":"INDEX(données,MATCH(LARGE(class,$B6),class,0),COLUMN()+13)","v":49},{"$f":"INDEX(données,MATCH(LARGE(class,$B6),class,0),COLUMN()+13)","v":31},{"$f":"INDEX(données,MATCH(LARGE(class,$B6),class,0),COLUMN()+13)","v":18},{"$f":"Feuil1!B20","v":15}]
[5,{"$f":"Feuil1!B10","v":5},{"$f":"INDEX(données,MATCH(LARGE(class,$B7),class,0),COLUMN()-2)","v":"CHRISTO"},{"$f":"INDEX(données,MATCH(LARGE(class,$B7),class,0),COLUMN()+13)","v":3},{"$f":"INDEX(données,MATCH(LARGE(class,$B7),class,0),COLUMN()+13)","v":47},{"$f":"INDEX(données,MATCH(LARGE(class,$B7),class,0),COLUMN()+13)","v":31},{"$f":"INDEX(données,MATCH(LARGE(class,$B7),class,0),COLUMN()+13)","v":16},{"$f":"Feuil1!B16","v":11}]
[6,{"$f":"Feuil1!B11","v":6},{"$f":"INDEX(données,MATCH(LARGE(class,$B8),class,0),COLUMN()-2)","v":"BENOIT"},{"$f":"INDEX(données,MATCH(LARGE(class,$B8),class,0),COLUMN()+13)","v":3},{"$f":"INDEX(données,MATCH(LARGE(class,$B8),class,0),COLUMN()+13)","v":47},{"$f":"INDEX(données,MATCH(LARGE(class,$B8),class,0),COLUMN()+13)","v":37},{"$f":"INDEX(données,MATCH(LARGE(class,$B8),class,0),COLUMN()+13)","v":10},{"$f":"Feuil1!B15","v":10}]
[7,{"$f":"Feuil1!B12","v":7},{"$f":"INDEX(données,MATCH(LARGE(class,$B9),class,0),COLUMN()-2)","v":"BRUNO"},{"$f":"INDEX(données,MATCH(LARGE(class,$B9),class,0),COLUMN()+13)","v":3},{"$f":"INDEX(données,MATCH(LARGE(class,$B9),class,0),COLUMN()+13)","v":48},{"$f":"INDEX(données,MATCH(LARGE(class,$B9),class,0),COLUMN()+13)","v":38},{"$f":"INDEX(données,MATCH(LARGE(class,$B9),class,0),COLUMN()+13)","v":10},{"$f":"Feuil1!B24","v":19}]
[8,{"$f":"Feuil1!B13","v":8},{"$f":"INDEX(données,MATCH(LARGE(class,$B10),class,0),COLUMN()-2)","v":"MATHIEU"},{"$f":"INDEX(données,MATCH(LARGE(class,$B10),class,0),COLUMN()+13)","v":3},{"$f":"INDEX(données,MATCH(LARGE(class,$B10),class,0),COLUMN()+13)","v":43},{"$f":"INDEX(données,MATCH(LARGE(class,$B10),class,0),COLUMN()+13)","v":37},{"$f":"INDEX(données,MATCH(LARGE(class,$B10),class,0),COLUMN()+13)","v":6},{"$f":"Feuil1!B30","v":25}]
[9,{"$f":"Feuil1!B14","v":9},{"$f":"INDEX(données,MATCH(LARGE(class,$B11),class,0),COLUMN()-2)","v":"JULIEN"},{"$f":"INDEX(données,MATCH(LARGE(class,$B11),class,0),COLUMN()+13)","v":3},{"$f":"INDEX(données,MATCH(LARGE(class,$B11),class,0),COLUMN()+13)","v":41},{"$f":"INDEX(données,MATCH(LARGE(class,$B11),class,0),COLUMN()+13)","v":40},{"$f":"INDEX(données,MATCH(LARGE(class,$B11),class,0),COLUMN()+13)","v":1},{"$f":"Feuil1!#REF!","v":{"$error":"#REF!"}}]
[10,{"$f":"Feuil1!B15","v":10},{"$f":"INDEX(données,MATCH(LARGE(class,$B12),class,0),COLUMN()-2)","v":"CHRISTOPHE"},{"$f":"INDEX(données,MATCH(LARGE(class,$B12),class,0),COLUMN()+13)","v":2},{"$f":"INDEX(données,MATCH(LARGE(class,$B12),class,0),COLUMN()+13)","v":50},{"$f":"INDEX(données,MATCH(LARGE(class,$B12),class,0),COLUMN()+13)","v":39},{"$f":"INDEX(données,MATCH(LARGE(class,$B12),class,0),COLUMN()+13)","v":11},{"$f":"Feuil1!B26","v":21}]
[11,{"$f":"Feuil1!B16","v":11},{"$f":"INDEX(données,MATCH(LARGE(class,$B13),class,0),COLUMN()-2)","v":"FRANCIS"},{"$f":"INDEX(données,MATCH(LARGE(class,$B13),class,0),COLUMN()+13)","v":2},{"$f":"INDEX(données,MATCH(LARGE(class,$B13),class,0),COLUMN()+13)","v":47},{"$f":"INDEX(données,MATCH(LARGE(class,$B13),class,0),COLUMN()+13)","v":39},{"$f":"INDEX(données,MATCH(LARGE(class,$B13),class,0),COLUMN()+13)","v":8},{"$f":"Feuil1!B17","v":12}]
[12,{"$f":"Feuil1!B17","v":12},{"$f":"INDEX(données,MATCH(LARGE(class,$B14),class,0),COLUMN()-2)","v":"DANIEL FLAHAUT"},{"$f":"INDEX(données,MATCH(LARGE(class,$B14),class,0),COLUMN()+13)","v":2},{"$f":"INDEX(données,MATCH(LARGE(class,$B14),class,0),COLUMN()+13)","v":35},{"$f":"INDEX(données,MATCH(LARGE(class,$B14),class,0),COLUMN()+13)","v":30},{"$f":"INDEX(données,MATCH(LARGE(class,$B14),class,0),COLUMN()+13)","v":5},{"$f":"Feuil1!B7","v":2}]
[13,{"$f":"Feuil1!B18","v":13},{"$f":"INDEX(données,MATCH(LARGE(class,$B15),class,0),COLUMN()-2)","v":"MICHEL MAUGER"},{"$f":"INDEX(données,MATCH(LARGE(class,$B15),class,0),COLUMN()+13)","v":2},{"$f":"INDEX(données,MATCH(LARGE(class,$B15),class,0),COLUMN()+13)","v":44},{"$f":"INDEX(données,MATCH(LARGE(class,$B15),class,0),COLUMN()+13)","v":41},{"$f":"INDEX(données,MATCH(LARGE(class,$B15),class,0),COLUMN()+13)","v":3},{"$f":"Feuil1!#REF!","v":{"$error":"#REF!"}}]
[14,{"$f":"Feuil1!B19","v":14},{"$f":"INDEX(données,MATCH(LARGE(class,$B16),class,0),COLUMN()-2)","v":"ERIC"},{"$f":"INDEX(données,MATCH(LARGE(class,$B16),class,0),COLUMN()+13)","v":2},{"$f":"INDEX(données,MATCH(LARGE(class,$B16),class,0),COLUMN()+13)","v":44},{"$f":"INDEX(données,MATCH(LARGE(class,$B16),class,0),COLUMN()+13)","v":42},{"$f":"INDEX(données,MATCH(LARGE(class,$B16),class,0),COLUMN()+13)","v":2},{"$f":"Feuil1!B29","v":24}]
[15,{"$f":"Feuil1!B20","v":15},{"$f":"INDEX(données,MATCH(LARGE(class,$B17),class,0),COLUMN()-2)","v":"BENJAMIN"},{"$f":"INDEX(données,MATCH(LARGE(class,$B17),class,0),COLUMN()+13)","v":2},{"$f":"INDEX(données,MATCH(LARGE(class,$B17),class,0),COLUMN()+13)","v":38},{"$f":"INDEX(données,MATCH(LARGE(class,$B17),class,0),COLUMN()+13)","v":39},{"$f":"INDEX(données,MATCH(LARGE(class,$B17),class,0),COLUMN()+13)","v":-1},{"$f":"Feuil1!#REF!","v":{"$error":"#REF!"}}]
[16,{"$f":"Feuil1!B21","v":16},{"$f":"INDEX(données,MATCH(LARGE(class,$B18),class,0),COLUMN()-2)","v":"STEPHANE"},{"$f":"INDEX(données,MATCH(LARGE(class,$B18),class,0),COLUMN()+13)","v":2},{"$f":"INDEX(données,MATCH(LARGE(class,$B18),class,0),COLUMN()+13)","v":42},{"$f":"INDEX(données,MATCH(LARGE(class,$B18),class,0),COLUMN()+13)","v":44},{"$f":"INDEX(données,MATCH(LARGE(class,$B18),class,0),COLUMN()+13)","v":-2},{"$f":"Feuil1!#REF!","v":{"$error":"#REF!"}}]
[17,{"$f":"Feuil1!B22","v":17},{"$f":"INDEX(données,MATCH(LARGE(class,$B19),class,0),COLUMN()-2)","v":"JOELLE"},{"$f":"INDEX(données,MATCH(LARGE(class,$B19),class,0),COLUMN()+13)","v":2},{"$f":"INDEX(données,MATCH(LARGE(class,$B19),class,0),COLUMN()+13)","v":41},{"$f":"INDEX(données,MATCH(LARGE(class,$B19),class,0),COLUMN()+13)","v":42},{"$f":"INDEX(données,MATCH(LARGE(class,$B19),class,0),COLUMN()+13)","v":-1},{"$f":"Feuil1!B14","v":9}]
[18,{"$f":"Feuil1!B23","v":18},{"$f":"INDEX(données,MATCH(LARGE(class,$B20),class,0),COLUMN()-2)","v":"BRAYAN"},{"$f":"INDEX(données,MATCH(LARGE(class,$B20),class,0),COLUMN()+13)","v":2},{"$f":"INDEX(données,MATCH(LARGE(class,$B20),class,0),COLUMN()+13)","v":41},{"$f":"INDEX(données,MATCH(LARGE(class,$B20),class,0),COLUMN()+13)","v":44},{"$f":"INDEX(données,MATCH(LARGE(class,$B20),class,0),COLUMN()+13)","v":-3},{"$f":"Feuil1!B34","v":29}]
[19,{"$f":"Feuil1!B24","v":19},{"$f":"INDEX(données,MATCH(LARGE(class,$B21),class,0),COLUMN()-2)","v":"DANY"},{"$f":"INDEX(données,MATCH(LARGE(class,$B21),class,0),COLUMN()+13)","v":2},{"$f":"INDEX(données,MATCH(LARGE(class,$B21),class,0),COLUMN()+13)","v":38},{"$f":"INDEX(données,MATCH(LARGE(class,$B21),class,0),COLUMN()+13)","v":44},{"$f":"INDEX(données,MATCH(LARGE(class,$B21),class,0),COLUMN()+13)","v":-6},{"$f":"Feuil1!B13","v":8}]
[20,{"$f":"Feuil1!B25","v":20},{"$f":"INDEX(données,MATCH(LARGE(class,$B22),class,0),COLUMN()-2)","v":"FABRICE"},{"$f":"INDEX(données,MATCH(LARGE(class,$B22),class,0),COLUMN()+13)","v":2},{"$f":"INDEX(données,MATCH(LARGE(class,$B22),class,0),COLUMN()+13)","v":41},{"$f":"INDEX(données,MATCH(LARGE(class,$B22),class,0),COLUMN()+13)","v":47},{"$f":"INDEX(données,MATCH(LARGE(class,$B22),class,0),COLUMN()+13)","v":-6},{"$f":"Feuil1!B27","v":22}]
[21,{"$f":"Feuil1!B26","v":21},{"$f":"INDEX(données,MATCH(LARGE(class,$B23),class,0),COLUMN()-2)","v":"KEVIN"},{"$f":"INDEX(données,MATCH(LARGE(class,$B23),class,0),COLUMN()+13)","v":2},{"$f":"INDEX(données,MATCH(LARGE(class,$B23),class,0),COLUMN()+13)","v":36},{"$f":"INDEX(données,MATCH(LARGE(class,$B23),class,0),COLUMN()+13)","v":43},{"$f":"INDEX(données,MATCH(LARGE(class,$B23),class,0),COLUMN()+13)","v":-7},{"$f":"Feuil1!#REF!","v":{"$error":"#REF!"}}]
[22,{"$f":"Feuil1!B27","v":22},{"$f":"INDEX(données,MATCH(LARGE(class,$B24),class,0),COLUMN()-2)","v":"DOMINIQUE"},{"$f":"INDEX(données,MATCH(LARGE(class,$B24),class,0),COLUMN()+13)","v":1},{"$f":"INDEX(données,MATCH(LARGE(class,$B24),class,0),COLUMN()+13)","v":39},{"$f":"INDEX(données,MATCH(LARGE(class,$B24),class,0),COLUMN()+13)","v":46},{"$f":"INDEX(données,MATCH(LARGE(class,$B24),class,0),COLUMN()+13)","v":-7},{"$f":"Feuil1!B8","v":3}]
[23,{"$f":"Feuil1!B28","v":23},{"$f":"INDEX(données,MATCH(LARGE(class,$B25),class,0),COLUMN()-2)","v":"DIDIER SAISON"},{"$f":"INDEX(données,MATCH(LARGE(class,$B25),class,0),COLUMN()+13)","v":1},{"$f":"INDEX(données,MATCH(LARGE(class,$B25),class,0),COLUMN()+13)","v":38},{"$f":"INDEX(données,MATCH(LARGE(class,$B25),class,0),COLUMN()+13)","v":46},{"$f":"INDEX(données,MATCH(LARGE(class,$B25),class,0),COLUMN()+13)","v":-8},{"$f":"Feuil1!#REF!","v":{"$error":"#REF!"}}]
[24,{"$f":"Feuil1!B29","v":24},{"$f":"INDEX(données,MATCH(LARGE(class,$B26),class,0),COLUMN()-2)","v":"ANNIE"},{"$f":"INDEX(données,MATCH(LARGE(class,$B26),class,0),COLUMN()+13)","v":1},{"$f":"INDEX(données,MATCH(LARGE(class,$B26),class,0),COLUMN()+13)","v":39},{"$f":"INDEX(données,MATCH(LARGE(class,$B26),class,0),COLUMN()+13)","v":51},{"$f":"INDEX(données,MATCH(LARGE(class,$B26),class,0),COLUMN()+13)","v":-12},{"$f":"Feuil1!B19","v":14}]
[25,{"$f":"Feuil1!B30","v":25},{"$f":"INDEX(données,MATCH(LARGE(class,$B27),class,0),COLUMN()-2)","v":"DIDIER MONROY"},{"$f":"INDEX(données,MATCH(LARGE(class,$B27),class,0),COLUMN()+13)","v":1},{"$f":"INDEX(données,MATCH(LARGE(class,$B27),class,0),COLUMN()+13)","v":31},{"$f":"INDEX(données,MATCH(LARGE(class,$B27),class,0),COLUMN()+13)","v":45},{"$f":"INDEX(données,MATCH(LARGE(class,$B27),class,0),COLUMN()+13)","v":-14},{"$f":"Feuil1!B31","v":26}]
[26,{"$f":"Feuil1!B31","v":26},{"$f":"INDEX(données,MATCH(LARGE(class,$B28),class,0),COLUMN()-2)","v":"GEORGET"},{"$f":"INDEX(données,MATCH(LARGE(class,$B28),class,0),COLUMN()+13)","v":1},{"$f":"INDEX(données,MATCH(LARGE(class,$B28),class,0),COLUMN()+13)","v":31},{"$f":"INDEX(données,MATCH(LARGE(class,$B28),class,0),COLUMN()+13)","v":45},{"$f":"INDEX(données,MATCH(LARGE(class,$B28),class,0),COLUMN()+13)","v":-14},{"$f":"Feuil1!B22","v":17}]
[27,{"$f":"Feuil1!B32","v":27},{"$f":"INDEX(données,MATCH(LARGE(class,$B29),class,0),COLUMN()-2)","v":"HENRI"},{"$f":"INDEX(données,MATCH(LARGE(class,$B29),class,0),COLUMN()+13)","v":1},{"$f":"INDEX(données,MATCH(LARGE(class,$B29),class,0),COLUMN()+13)","v":27},{"$f":"INDEX(données,MATCH(LARGE(class,$B29),class,0),COLUMN()+13)","v":46},{"$f":"INDEX(données,MATCH(LARGE(class,$B29),class,0),COLUMN()+13)","v":-19},{"$f":"Feuil1!B21","v":16}]
[28,{"$f":"Feuil1!B33","v":28},{"$f":"INDEX(données,MATCH(LARGE(class,$B30),class,0),COLUMN()-2)","v":"LILIANE"},{"$f":"INDEX(données,MATCH(LARGE(class,$B30),class,0),COLUMN()+13)","v":1},{"$f":"INDEX(données,MATCH(LARGE(class,$B30),class,0),COLUMN()+13)","v":28},{"$f":"INDEX(données,MATCH(LARGE(class,$B30),class,0),COLUMN()+13)","v":46},{"$f":"INDEX(données,MATCH(LARGE(class,$B30),class,0),COLUMN()+13)","v":-18},{"$f":"Feuil1!B32","v":27}]
[29,{"$f":"Feuil1!B34","v":29},{"$f":"INDEX(données,MATCH(LARGE(class,$B31),class,0),COLUMN()-2)","v":0},{"$f":"INDEX(données,MATCH(LARGE(class,$B31),class,0),COLUMN()+13)","v":0},{"$f":"INDEX(données,MATCH(LARGE(class,$B31),class,0),COLUMN()+13)","v":0},{"$f":"INDEX(données,MATCH(LARGE(class,$B31),class,0),COLUMN()+13)","v":0},{"$f":"INDEX(données,MATCH(LARGE(class,$B31),class,0),COLUMN()+13)","v":0},{"$f":"Feuil1!#REF!","v":{"$error":"#REF!"}}]

{"sheet":"Feuil3","index":2,"n_rows":0,"n_cols":0,"rows_kept":0,"cut":false,"hidden":false,"merged":[]}