{"text_format":"1","workbook":"xlsx","n_sheets":16,"sheets":["Mode d'emploi","Menu principal","Tableau de suivi","Base","Autorisation d'établissement","Constitution","Demande inscription TVA","Dissolution","Fusion","Scission","Changements statutaires","Autres","Suivi des documents_OLD","Dossiers clôturés","Liste notaires","Sources"],"not_rendered":{"charts":0,"images":0,"macros":1,"external_links":0,"defined_names":31,"comments":0,"pivot_tables":0},"unopened":[],"bounds":{"document_bytes":16777216,"sheet_cells":100000,"rows_first":2000,"rows_last":500,"rows_between":2000,"halvings":0,"cell_chars":16384,"cell_head_chars":4096},"cells_cut":0,"cells_raw":0,"read":"whole","date_system":"1900"}

{"sheet":"Mode d'emploi","index":0,"n_rows":10,"n_cols":2,"rows_kept":10,"cut":false,"hidden":false,"merged":[]}
["Mode d'emploi"]
[1,"Logique de l'application :\nUn onglet \"Tableau de suivi\" permet d'enregistrer les différents actes à suivre en précisant les paramètres de bases de l'affaire à traiter.  Cet onglet a été créé sous forme de \"Tableau\".  C.à.d. qu'Excel se chargera de l'adapter dès qu'une ligne supplémentaire sera ajoutée à l'aide de la macro lancée à partir du Bouton \"Ajouter une ligne\".  La macro a été adaptée et on peut maintenant avoir le curseur n'importe où dans le tableau et la ligne supplémentaire se mettra en place.\nUn certain nombre de paramètres sont pré codifiés et peuvent être saisis grâce aux listes déroulantes se trouvant dans les cellules correspondantes (Personne en charge ; Type d'acte ;Notaire ; Publication de l'acte ; Clôturé).  Les listes se trouvent dans les onglets \"Liste notaires\" et \"Sources\".  Ces listes ont été nommées afin de faciliter leur mise en place et leur usage dans les formules.  La liste des noms utilisés a été implantée dans l'onglet \"Sources\".\nUne gestion du calendrier est implantée qui permet, sur base de la date de passage de l'acte par rapport à la date du jour, de distinguer les cas à traiter le plus rapidement possible.\nLes lignes dont les cellules dans la colonne \"Clôturé\" contiennent  \"OUI\" se mettront en surbrillance verte\nA partir de cet onglet, le classeur permet de développer les informations de suivis particulières pour chaque \"Type d'acte\" dans des onglets spécifiques"]
[2,"Traitement des onglets spécifiques par \"Type d'acte"]
[2.1,"Les onglets spécifiques sont de structure identique et on une structure TABLEAU.  Il remplace le tableau unique \"Suivi des documents\" difficile à gérer étant donné la largeur nécessaire pour mettre tous les traitements pour tous les types d'actes. Le tableau unique est toujours présent dans le classeur mais peut être éliminé dès la mise en route effective du classeur sera faite.\nPour les distinguer, il suffit de se positionner dans la cellule B1 et de choisir dans la liste déroulante, l'acte à traiter.  Automatiquement les titres des colonnes s'adapteront grâce au signalétique \"Types d'actes\" se trouvant dans l'onglet \"Sources\".  \nA noter qu'un certain nombre d'acte ne contiennent toujours pas de libellés de colonne : il faudra donc les compléter pour que les nouveaux onglets à créer puissent se mettrent à jour.\nUne fois que le type d'acte aura été attribué à un onglet, il ne faudra plus en changer car le contenu des colonnes est différent pour chaque Type d'acte et donc, dès que l'on aura commencé à introduire les renseignements, ceux ci n'auront plus de sens si on change le titre des colonnes. "]
[2.2000000000000002,"Pour créer un nouvel onglet, il suffit de se positionner sur l'onglet \"Base\" et de cliquer droit sur l'onglet et de choisir \"Déplacer ou copier\" - ensuite on coche \"Créer une copie\" et on choisit l'endroit où on désire voir le nouvel onglet et enfin OK\nQuand l'onglet est créé, on se positonne dans la cellule B1 et on choisit le type d'acte à l'aide de la liste déroulante.\nAutomatiquement le titre des colonnes s'adaptent (il faudra probablement ajuster la largeur pour certaines)  et les noms des affaires concernant le type d'acte choisi apparaissent.\nLes onglets spécifiques sont prévus pour 100 affaires mais il est facile d'augementer la capacité du tableau"]
[null,"Attention : il a été choisi de travailler avec la structure \"TABLEAU\" car Excel gère automatiquement le contenu des cellules dès que l'on ajoute des lignes (il replace les formules dans les cellules qui en contiennent dans les lignes précédentes)"]
[null,"Donc il faut impérativement rester sous cette structure si on a besoin de lignes supplémentaires et gérer l'augmentation de ligne grâce aux outils appropriés à la gestion des TABLEAUX"]
[2.2999999999999998,"Dossiers Clôturés\nCet onglet est la reproduction de l'onglet \"Tableau de suivi\" et se complète automatiquement avec les renseignements en provenance de cet onglet dès que la dolonne \"Clôturé\" contient OUI.\nIl a été choisi de ne pas éliminer les lignes du \"Tableau de suivi\" car ainsi on maintient l'archivage de tous les autres renseignements se trouvant dans les onglets spécifiques."]
[2.4,"Suggestion : ne faudrait-il pas compléter les onglets spécifiques en ramenant la colonne \"Clôturé\".  Ainsi on pourrait aussi les surlignés en vert quand une affaire est terminée."]
[2.5,"Remarque : le type d'acte \"Autre\" pose un problème à partir du moment que les colonnes ne seront plus identiques entre les types d'actes \"Autre\".  Soit il y a moyen d'avoir des colonnes \"universelles\" pour tous les types d'actes \"Autre\" soit il faudra créer un type d'acte spécifique et abandonner le vocable \"Autre\" "]

{"sheet":"Menu principal","index":1,"n_rows":2,"n_cols":9,"rows_kept":2,"cut":false,"hidden":false,"merged":[]}
[]
[null,"Colonne1","Colonne2","Colonne3","Colonne4","Colonne5","Colonne6","Colonne7","Colonne8"]

{"sheet":"Tableau de suivi","index":2,"n_rows":28,"n_cols":22,"rows_kept":28,"cut":false,"hidden":false,"merged":[]}
["TABLEAU DE SUIVI"]
["N°","Nom/Désignation","Personne en charge","Colonne1","Type d'acte","Colonne2","Nom contact","Notaire ","Personne de contact","Email","Téléphone","Date échéance","Date passage de l'acte","Échéance (Jours)","Priorité","Date rappel client","Colonne3","Publication de l'acte","Commentaires","Facturation","Colonne4","Clôturé"]
[{"$f":"ROW()-2","v":1},"Tartempion","XHONNEUX D.",null,"Autorisation d'établissement",null,null,"BADEN Joëlle",{"$f":"IFERROR(IF(VLOOKUP('Tableau de suivi'!$H3,'Liste notaires'!$B$7:$K$41,3,FALSE)=0,\" \",VLOOKUP('Tableau de suivi'!$H3,'Liste notaires'!$B$7:$K$41,3,FALSE)),\" \")","v":" "},{"$f":"IFERROR(IF(VLOOKUP('Tableau de suivi'!$H3,'Liste notaires'!$B$7:$K$41,3,FALSE)=0,\" \",VLOOKUP('Tableau de suivi'!$H3,'Liste notaires'!$B$7:$K$41,4,FALSE)),\" \")","v":" "},{"$f":"IFERROR(IF(VLOOKUP('Tableau de suivi'!$H3,'Liste notaires'!$B$7:$K$41,3,FALSE)=0,\" \",VLOOKUP('Tableau de suivi'!$H3,'Liste notaires'!$B$7:$K$41,6,FALSE)),\" \")","v":" "},null,"2018-01-31",{"$f":"IF($M3= \"\", \"\", $M3-TODAY())","v":9},{"$f":"IF($N3 = \"\", \" \", IF($N3<5,\"Urgent\",IF(AND($N3<15,$N3>5),\"Normal\",\"Non-urgent\")))","v":"Normal"},null,{"$f":"IF($P3=\"\",\"\", IF((TODAY()-$P3)>=14, \"Attention !\", IF((TODAY()-$P3)>=7, \"A vérifier\", \" \")))","v":""},"OUI",null,null,{"$f":"IF($T3=\"\", \"\", IF((($T3+30)<=TODAY()), \"Rappel\", \"\"))","v":""},"NON"]
[{"$f":"ROW()-2","v":2},"Machin","DEVILLET N.",null,"Constitution ",null,null,"ARRENSDORFF Roger",null,null,null,null,"2018-02-12",21,{"$f":"IF($N4 = \"\", \" \", IF($N4<5,\"Urgent\",IF(AND($N4<15,$N4>5),\"Normal\",\"Non-urgent\")))","v":"Non-urgent"},null,null,"NON",null,null,null,"NON"]
[3,"Truc","BOURDIN C.",null,"Autorisation d'établissement",null,null,"BETTINGEN Paul",null,null,null,null,"2018-02-01",10,"Normal",null,null,"OUI",null,null,null,"OUI"]
[4,"Bazar","BRADFER F.",null,"Fusion",null,null,"DELOSCH Edouard",null,null,null,null,"2018-02-08",17,"Non-urgent",null,null,"NON",null,null,null,"NON"]
[5,"Michel","LAMBERTY C.",null,"Demande inscription TVA ",null,null,"LECUIT Marc",null,null,null,null,"2018-01-28",6,"Normal",null,null,"NON",null,null,null,"OUI"]
[6,null,null,null,null,null,null,null,null,null,null,null,null,""," "]
[7,null,null,null,null,null,null,null,null,null,null,null,null,""," "]
[8,null,null,null,null,null,null,null,null,null,null,null,null,""," "]
[9,null,null,null,null,null,null,null,null,null,null,null,null,""," "]
[{"$f":"ROW()-2","v":10},null,null,null,null,null,null,null,null,null,null,null,null,""," "]
[11,null,null,null,null,null,null,null,null,null,null,null,null,""," "]
[12,null,null,null,null,null,null,null,null,null,null,null,null,""," "]
[13,null,null,null,null,null,null,null,null,null,null,null,null,""," "]
[14,null,null,null,null,null,null,null,null,null,null,null,null,""," "]
[15,null,null,null,null,null,null,null,null,null,null,null,null,""," "]
[16,null,null,null,null,null,null,null,null,null,null,null,null,""," "]
[17,null,null,null,null,null,null,null,null,null,null,null,null,""," "]
[18,null,null,null,null,null,null,null,null,null,null,null,null,""," "]
[19,null,null,null,null,null,null,null,null,null,null,null,null,""," "]
[20,null,null,null,null,null,null,null,null,null,null,null,null,""," "]
[21,null,null,null,null,null,null,null,null,null,null,null,null,""," "]
[22,null,null,null,null,null,null,null,null,null,null,null,null,""," "]
[23,null,null,null,null,null,null,null,null,null,null,null,null,""," "]
[{"$f":"ROW()-2","v":24},null,null,null,null,null,null,null,null,null,null,null,null,{"$f":"IF($M26= \"\", \"\", $M26-TODAY())","v":""},{"$f":"IF($N26 = \"\", \" \", IF($N26<5,\"Urgent\",IF(AND($N26<15,$N26>5),\"Normal\",\"Non-urgent\")))","v":" "}]
[{"$f":"ROW()-2","v":25},null,null,null,null,null,null,null,null,null,null,null,null,{"$f":"IF($M27= \"\", \"\", $M27-TODAY())","v":""},{"$f":"IF($N27 = \"\", \" \", IF($N27<5,\"Urgent\",IF(AND($N27<15,$N27>5),\"Normal\",\"Non-urgent\")))","v":" "}]
[{"$f":"ROW()-2","v":26},null,null,null,null,null,null,null,null,null,null,null,null,{"$f":"IF($M28= \"\", \"\", $M28-TODAY())","v":""},{"$f":"IF($N28 = \"\", \" \", IF($N28<5,\"Urgent\",IF(AND($N28<15,$N28>5),\"Normal\",\"Non-urgent\")))","v":" "}]

{"sheet":"Base","index":3,"n_rows":100,"n_cols":12,"rows_kept":100,"cut":false,"hidden":false,"merged":[[0,1,0,11]]}
[null,"Base"]
[{"$f":"VLOOKUP($B$1,Sources!$F$3:$R$19,COLUMN()+1,FALSE)","v":"NOM"},{"$f":"VLOOKUP($B$1,Sources!$F$3:$R$19,COLUMN()+1,FALSE)","v":0},{"$f":"VLOOKUP($B$1,Sources!$F$3:$R$19,COLUMN()+1,FALSE)","v":0},{"$f":"VLOOKUP($B$1,Sources!$F$3:$R$19,COLUMN()+1,FALSE)","v":0},{"$f":"VLOOKUP($B$1,Sources!$F$3:$R$19,COLUMN()+1,FALSE)","v":0},{"$f":"VLOOKUP($B$1,Sources!$F$3:$R$19,COLUMN()+1,FALSE)","v":0},{"$f":"VLOOKUP($B$1,Sources!$F$3:$R$19,COLUMN()+1,FALSE)","v":0},{"$f":"VLOOKUP($B$1,Sources!$F$3:$R$19,COLUMN()+1,FALSE)","v":0},{"$f":"VLOOKUP($B$1,Sources!$F$3:$R$19,COLUMN()+1,FALSE)","v":0},{"$f":"VLOOKUP($B$1,Sources!$F$3:$R$19,COLUMN()+1,FALSE)","v":0},{"$f":"VLOOKUP($B$1,Sources!$F$3:$R$19,COLUMN()+1,FALSE)","v":0},{"$f":"VLOOKUP($B$1,Sources!$F$3:$R$19,COLUMN()+1,FALSE)","v":0}]
["Colonne1","Colonne2","Colonne3","Colonne4","Colonne5","Colonne6","Colonne7","Colonne8","Colonne9","Colonne10","Colonne11","Colonne12"]
[{"$f":"IFERROR(INDEX(Tableau_de_suivi[[Nom/Désignation]:[Clôturé]],SMALL(IF(Tableau_de_suivi[Type d''acte]=$B$1,ROW(Tableau_de_suivi[N°])-2),ROWS($1:1)),1),\"\")","v":""}]
[{"$f":"IFERROR(INDEX(Tableau_de_suivi[[Nom/Désignation]:[Clôturé]],SMALL(IF(Tableau_de_suivi[Type d''acte]=$B$1,ROW(Tableau_de_suivi[N°])-2),ROWS($1:2)),1),\"\")","v":""}]
[{"$f":"IFERROR(INDEX(Tableau_de_suivi[[Nom/Désignation]:[Clôturé]],SMALL(IF(Tableau_de_suivi[Type d''acte]=$B$1,ROW(Tableau_de_suivi[N°])-2),ROWS($1:3)),1),\"\")","v":""}]
[{"$f":"IFERROR(INDEX(Tableau_de_suivi[[Nom/Désignation]:[Clôturé]],SMALL(IF(Tableau_de_suivi[Type d''acte]=$B$1,ROW(Tableau_de_suivi[N°])-2),ROWS($1:4)),1),\"\")","v":""}]
[{"$f":"IFERROR(INDEX(Tableau_de_suivi[[Nom/Désignation]:[Clôturé]],SMALL(IF(Tableau_de_suivi[Type d''acte]=$B$1,ROW(Tableau_de_suivi[N°])-2),ROWS($1:5)),1),\"\")","v":""}]
[{"$f":"IFERROR(INDEX(Tableau_de_suivi[[Nom/Désignation]:[Clôturé]],SMALL(IF(Tableau_de_suivi[Type d''acte]=$B$1,ROW(Tableau_de_suivi[N°])-2),ROWS($1:6)),1),\"\")","v":""}]
[{"$f":"IFERROR(INDEX(Tableau_de_suivi[[Nom/Désignation]:[Clôturé]],SMALL(IF(Tableau_de_suivi[Type d''acte]=$B$1,ROW(Tableau_de_suivi[N°])-2),ROWS($1:7)),1),\"\")","v":""}]
[{"$f":"IFERROR(INDEX(Tableau_de_suivi[[Nom/Désignation]:[Clôturé]],SMALL(IF(Tableau_de_suivi[Type d''acte]=$B$1,ROW(Tableau_de_suivi[N°])-2),ROWS($1:8)),1),\"\")","v":""}]
[{"$f":"IFERROR(INDEX(Tableau_de_suivi[[Nom/Désignation]:[Clôturé]],SMALL(IF(Tableau_de_suivi[Type d''acte]=$B$1,ROW(Tableau_de_suivi[N°])-2),ROWS($1:9)),1),\"\")","v":""}]
[{"$f":"IFERROR(INDEX(Tableau_de_suivi[[Nom/Désignation]:[Clôturé]],SMALL(IF(Tableau_de_suivi[Type d''acte]=$B$1,ROW(Tableau_de_suivi[N°])-2),ROWS($1:10)),1),\"\")","v":""}]
[{"$f":"IFERROR(INDEX(Tableau_de_suivi[[Nom/Désignation]:[Clôturé]],SMALL(IF(Tableau_de_suivi[Type d''acte]=$B$1,ROW(Tableau_de_suivi[N°])-2),ROWS($1:11)),1),\"\")","v":""}]
[{"$f":"IFERROR(INDEX(Tableau_de_suivi[[Nom/Désignation]:[Clôturé]],SMALL(IF(Tableau_de_suivi[Type d''acte]=$B$1,ROW(Tableau_de_suivi[N°])-2),ROWS($1:12)),1),\"\")","v":""}]
[{"$f":"IFERROR(INDEX(Tableau_de_suivi[[Nom/Désignation]:[Clôturé]],SMALL(IF(Tableau_de_suivi[Type d''acte]=$B$1,ROW(Tableau_de_suivi[N°])-2),ROWS($1:13)),1),\"\")","v":""}]
[{"$f":"IFERROR(INDEX(Tableau_de_suivi[[Nom/Désignation]:[Clôturé]],SMALL(IF(Tableau_de_suivi[Type d''acte]=$B$1,ROW(Tableau_de_suivi[N°])-2),ROWS($1:14)),1),\"\")","v":""}]
[{"$f":"IFERROR(INDEX(Tableau_de_suivi[[Nom/Désignation]:[Clôturé]],SMALL(IF(Tableau_de_suivi[Type d''acte]=$B$1,ROW(Tableau_de_suivi[N°])-2),ROWS($1:15)),1),\"\")","v":""}]
[{"$f":"IFERROR(INDEX(Tableau_de_suivi[[Nom/Désignation]:[Clôturé]],SMALL(IF(Tableau_de_suivi[Type d''acte]=$B$1,ROW(Tableau_de_suivi[N°])-2),ROWS($1:16)),1),\"\")","v":""}]
[{"$f":"IFERROR(INDEX(Tableau_de_suivi[[Nom/Désignation]:[Clôturé]],SMALL(IF(Tableau_de_suivi[Type d''acte]=$B$1,ROW(Tableau_de_suivi[N°])-2),ROWS($1:17)),1),\"\")","v":""}]
[{"$f":"IFERROR(INDEX(Tableau_de_suivi[[Nom/Désignation]:[Clôturé]],SMALL(IF(Tableau_de_suivi[Type d''acte]=$B$1,ROW(Tableau_de_suivi[N°])-2),ROWS($1:18)),1),\"\")","v":""}]
[{"$f":"IFERROR(INDEX(Tableau_de_suivi[[Nom/Désignation]:[Clôturé]],SMALL(IF(Tableau_de_suivi[Type d''acte]=$B$1,ROW(Tableau_de_suivi[N°])-2),ROWS($1:19)),1),\"\")","v":""}]
[{"$f":"IFERROR(INDEX(Tableau_de_suivi[[Nom/Désignation]:[Clôturé]],SMALL(IF(Tableau_de_suivi[Type d''acte]=$B$1,ROW(Tableau_de_suivi[N°])-2),ROWS($1:20)),1),\"\")","v":""}]
[{"$f":"IFERROR(INDEX(Tableau_de_suivi[[Nom/Désignation]:[Clôturé]],SMALL(IF(Tableau_de_suivi[Type d''acte]=$B$1,ROW(Tableau_de_suivi[N°])-2),ROWS($1:21)),1),\"\")","v":""}]
[{"$f":"IFERROR(INDEX(Tableau_de_suivi[[Nom/Désignation]:[Clôturé]],SMALL(IF(Tableau_de_suivi[Type d''acte]=$B$1,ROW(Tableau_de_suivi[N°])-2),ROWS($1:22)),1),\"\")","v":""}]
[{"$f":"IFERROR(INDEX(Tableau_de_suivi[[Nom/Désignation]:[Clôturé]],SMALL(IF(Tableau_de_suivi[Type d''acte]=$B$1,ROW(Tableau_de_suivi[N°])-2),ROWS($1:23)),1),\"\")","v":""}]
[{"$f":"IFERROR(INDEX(Tableau_de_suivi[[Nom/Désignation]:[Clôturé]],SMALL(IF(Tableau_de_suivi[Type d''acte]=$B$1,ROW(Tableau_de_suivi[N°])-2),ROWS($1:24)),1),\"\")","v":""}]
[{"$f":"IFERROR(INDEX(Tableau_de_suivi[[Nom/Désignation]:[Clôturé]],SMALL(IF(Tableau_de_suivi[Type d''acte]=$B$1,ROW(Tableau_de_suivi[N°])-2),ROWS($1:25)),1),\"\")","v":""}]
[{"$f":"IFERROR(INDEX(Tableau_de_suivi[[Nom/Désignation]:[Clôturé]],SMALL(IF(Tableau_de_suivi[Type d''acte]=$B$1,ROW(Tableau_de_suivi[N°])-2),ROWS($1:26)),1),\"\")","v":""}]
[{"$f":"IFERROR(INDEX(Tableau_de_suivi[[Nom/Désignation]:[Clôturé]],SMALL(IF(Tableau_de_suivi[Type d''acte]=$B$1,ROW(Tableau_de_suivi[N°])-2),ROWS($1:27)),1),\"\")","v":""}]
[{"$f":"IFERROR(INDEX(Tableau_de_suivi[[Nom/Désignation]:[Clôturé]],SMALL(IF(Tableau_de_suivi[Type d''acte]=$B$1,ROW(Tableau_de_suivi[N°])-2),ROWS($1:28)),1),\"\")","v":""}]
[{"$f":"IFERROR(INDEX(Tableau_de_suivi[[Nom/Désignation]:[Clôturé]],SMALL(IF(Tableau_de_suivi[Type d''acte]=$B$1,ROW(Tableau_de_suivi[N°])-2),ROWS($1:29)),1),\"\")","v":""}]
[{"$f":"IFERROR(INDEX(Tableau_de_suivi[[Nom/Désignation]:[Clôturé]],SMALL(IF(Tableau_de_suivi[Type d''acte]=$B$1,ROW(Tableau_de_suivi[N°])-2),ROWS($1:30)),1),\"\")","v":""}]
[{"$f":"IFERROR(INDEX(Tableau_de_suivi[[Nom/Désignation]:[Clôturé]],SMALL(IF(Tableau_de_suivi[Type d''acte]=$B$1,ROW(Tableau_de_suivi[N°])-2),ROWS($1:31)),1),\"\")","v":""}]
[{"$f":"IFERROR(INDEX(Tableau_de_suivi[[Nom/Désignation]:[Clôturé]],SMALL(IF(Tableau_de_suivi[Type d''acte]=$B$1,ROW(Tableau_de_suivi[N°])-2),ROWS($1:32)),1),\"\")","v":""}]
[{"$f":"IFERROR(INDEX(Tableau_de_suivi[[Nom/Désignation]:[Clôturé]],SMALL(IF(Tableau_de_suivi[Type d''acte]=$B$1,ROW(Tableau_de_suivi[N°])-2),ROWS($1:33)),1),\"\")","v":""}]
[{"$f":"IFERROR(INDEX(Tableau_de_suivi[[Nom/Désignation]:[Clôturé]],SMALL(IF(Tableau_de_suivi[Type d''acte]=$B$1,ROW(Tableau_de_suivi[N°])-2),ROWS($1:34)),1),\"\")","v":""}]
[{"$f":"IFERROR(INDEX(Tableau_de_suivi[[Nom/Désignation]:[Clôturé]],SMALL(IF(Tableau_de_suivi[Type d''acte]=$B$1,ROW(Tableau_de_suivi[N°])-2),ROWS($1:35)),1),\"\")","v":""}]
[{"$f":"IFERROR(INDEX(Tableau_de_suivi[[Nom/Désignation]:[Clôturé]],SMALL(IF(Tableau_de_suivi[Type d''acte]=$B$1,ROW(Tableau_de_suivi[N°])-2),ROWS($1:36)),1),\"\")","v":""}]
[{"$f":"IFERROR(INDEX(Tableau_de_suivi[[Nom/Désignation]:[Clôturé]],SMALL(IF(Tableau_de_suivi[Type d''acte]=$B$1,ROW(Tableau_de_suivi[N°])-2),ROWS($1:37)),1),\"\")","v":""}]
[{"$f":"IFERROR(INDEX(Tableau_de_suivi[[Nom/Désignation]:[Clôturé]],SMALL(IF(Tableau_de_suivi[Type d''acte]=$B$1,ROW(Tableau_de_suivi[N°])-2),ROWS($1:38)),1),\"\")","v":""}]
[{"$f":"IFERROR(INDEX(Tableau_de_suivi[[Nom/Désignation]:[Clôturé]],SMALL(IF(Tableau_de_suivi[Type d''acte]=$B$1,ROW(Tableau_de_suivi[N°])-2),ROWS($1:39)),1),\"\")","v":""}]
[{"$f":"IFERROR(INDEX(Tableau_de_suivi[[Nom/Désignation]:[Clôturé]],SMALL(IF(Tableau_de_suivi[Type d''acte]=$B$1,ROW(Tableau_de_suivi[N°])-2),ROWS($1:40)),1),\"\")","v":""}]
[{"$f":"IFERROR(INDEX(Tableau_de_suivi[[Nom/Désignation]:[Clôturé]],SMALL(IF(Tableau_de_suivi[Type d''acte]=$B$1,ROW(Tableau_de_suivi[N°])-2),ROWS($1:41)),1),\"\")","v":""}]
[{"$f":"IFERROR(INDEX(Tableau_de_suivi[[Nom/Désignation]:[Clôturé]],SMALL(IF(Tableau_de_suivi[Type d''acte]=$B$1,ROW(Tableau_de_suivi[N°])-2),ROWS($1:42)),1),\"\")","v":""}]
[{"$f":"IFERROR(INDEX(Tableau_de_suivi[[Nom/Désignation]:[Clôturé]],SMALL(IF(Tableau_de_suivi[Type d''acte]=$B$1,ROW(Tableau_de_suivi[N°])-2),ROWS($1:43)),1),\"\")","v":""}]
[{"$f":"IFERROR(INDEX(Tableau_de_suivi[[Nom/Désignation]:[Clôturé]],SMALL(IF(Tableau_de_suivi[Type d''acte]=$B$1,ROW(Tableau_de_suivi[N°])-2),ROWS($1:44)),1),\"\")","v":""}]
[{"$f":"IFERROR(INDEX(Tableau_de_suivi[[Nom/Désignation]:[Clôturé]],SMALL(IF(Tableau_de_suivi[Type d''acte]=$B$1,ROW(Tableau_de_suivi[N°])-2),ROWS($1:45)),1),\"\")","v":""}]
[{"$f":"IFERROR(INDEX(Tableau_de_suivi[[Nom/Désignation]:[Clôturé]],SMALL(IF(Tableau_de_suivi[Type d''acte]=$B$1,ROW(Tableau_de_suivi[N°])-2),ROWS($1:46)),1),\"\")","v":""}]
[{"$f":"IFERROR(INDEX(Tableau_de_suivi[[Nom/Désignation]:[Clôturé]],SMALL(IF(Tableau_de_suivi[Type d''acte]=$B$1,ROW(Tableau_de_suivi[N°])-2),ROWS($1:47)),1),\"\")","v":""}]
[{"$f":"IFERROR(INDEX(Tableau_de_suivi[[Nom/Désignation]:[Clôturé]],SMALL(IF(Tableau_de_suivi[Type d''acte]=$B$1,ROW(Tableau_de_suivi[N°])-2),ROWS($1:48)),1),\"\")","v":""}]
[{"$f":"IFERROR(INDEX(Tableau_de_suivi[[Nom/Désignation]:[Clôturé]],SMALL(IF(Tableau_de_suivi[Type d''acte]=$B$1,ROW(Tableau_de_suivi[N°])-2),ROWS($1:49)),1),\"\")","v":""}]
[{"$f":"IFERROR(INDEX(Tableau_de_suivi[[Nom/Désignation]:[Clôturé]],SMALL(IF(Tableau_de_suivi[Type d''acte]=$B$1,ROW(Tableau_de_suivi[N°])-2),ROWS($1:50)),1),\"\")","v":""}]
[{"$f":"IFERROR(INDEX(Tableau_de_suivi[[Nom/Désignation]:[Clôturé]],SMALL(IF(Tableau_de_suivi[Type d''acte]=$B$1,ROW(Tableau_de_suivi[N°])-2),ROWS($1:51)),1),\"\")","v":""}]
[{"$f":"IFERROR(INDEX(Tableau_de_suivi[[Nom/Désignation]:[Clôturé]],SMALL(IF(Tableau_de_suivi[Type d''acte]=$B$1,ROW(Tableau_de_suivi[N°])-2),ROWS($1:52)),1),\"\")","v":""}]
[{"$f":"IFERROR(INDEX(Tableau_de_suivi[[Nom/Désignation]:[Clôturé]],SMALL(IF(Tableau_de_suivi[Type d''acte]=$B$1,ROW(Tableau_de_suivi[N°])-2),ROWS($1:53)),1),\"\")","v":""}]
[{"$f":"IFERROR(INDEX(Tableau_de_suivi[[Nom/Désignation]:[Clôturé]],SMALL(IF(Tableau_de_suivi[Type d''acte]=$B$1,ROW(Tableau_de_suivi[N°])-2),ROWS($1:54)),1),\"\")","v":""}]
[{"$f":"IFERROR(INDEX(Tableau_de_suivi[[Nom/Désignation]:[Clôturé]],SMALL(IF(Tableau_de_suivi[Type d''acte]=$B$1,ROW(Tableau_de_suivi[N°])-2),ROWS($1:55)),1),\"\")","v":""}]
[{"$f":"IFERROR(INDEX(Tableau_de_suivi[[Nom/Désignation]:[Clôturé]],SMALL(IF(Tableau_de_suivi[Type d''acte]=$B$1,ROW(Tableau_de_suivi[N°])-2),ROWS($1:56)),1),\"\")","v":""}]
[{"$f":"IFERROR(INDEX(Tableau_de_suivi[[Nom/Désignation]:[Clôturé]],SMALL(IF(Tableau_de_suivi[Type d''acte]=$B$1,ROW(Tableau_de_suivi[N°])-2),ROWS($1:57)),1),\"\")","v":""}]
[{"$f":"IFERROR(INDEX(Tableau_de_suivi[[Nom/Désignation]:[Clôturé]],SMALL(IF(Tableau_de_suivi[Type d''acte]=$B$1,ROW(Tableau_de_suivi[N°])-2),ROWS($1:58)),1),\"\")","v":""}]
[{"$f":"IFERROR(INDEX(Tableau_de_suivi[[Nom/Désignation]:[Clôturé]],SMALL(IF(Tableau_de_suivi[Type d''acte]=$B$1,ROW(Tableau_de_suivi[N°])-2),ROWS($1:59)),1),\"\")","v":""}]
[{"$f":"IFERROR(INDEX(Tableau_de_suivi[[Nom/Désignation]:[Clôturé]],SMALL(IF(Tableau_de_suivi[Type d''acte]=$B$1,ROW(Tableau_de_suivi[N°])-2),ROWS($1:60)),1),\"\")","v":""}]
[{"$f":"IFERROR(INDEX(Tableau_de_suivi[[Nom/Désignation]:[Clôturé]],SMALL(IF(Tableau_de_suivi[Type d''acte]=$B$1,ROW(Tableau_de_suivi[N°])-2),ROWS($1:61)),1),\"\")","v":""}]
[{"$f":"IFERROR(INDEX(Tableau_de_suivi[[Nom/Désignation]:[Clôturé]],SMALL(IF(Tableau_de_suivi[Type d''acte]=$B$1,ROW(Tableau_de_suivi[N°])-2),ROWS($1:62)),1),\"\")","v":""}]
[{"$f":"IFERROR(INDEX(Tableau_de_suivi[[Nom/Désignation]:[Clôturé]],SMALL(IF(Tableau_de_suivi[Type d''acte]=$B$1,ROW(Tableau_de_suivi[N°])-2),ROWS($1:63)),1),\"\")","v":""}]
[{"$f":"IFERROR(INDEX(Tableau_de_suivi[[Nom/Désignation]:[Clôturé]],SMALL(IF(Tableau_de_suivi[Type d''acte]=$B$1,ROW(Tableau_de_suivi[N°])-2),ROWS($1:64)),1),\"\")","v":""}]
[{"$f":"IFERROR(INDEX(Tableau_de_suivi[[Nom/Désignation]:[Clôturé]],SMALL(IF(Tableau_de_suivi[Type d''acte]=$B$1,ROW(Tableau_de_suivi[N°])-2),ROWS($1:65)),1),\"\")","v":""}]
[{"$f":"IFERROR(INDEX(Tableau_de_suivi[[Nom/Désignation]:[Clôturé]],SMALL(IF(Tableau_de_suivi[Type d''acte]=$B$1,ROW(Tableau_de_suivi[N°])-2),ROWS($1:66)),1),\"\")","v":""}]
[{"$f":"IFERROR(INDEX(Tableau_de_suivi[[Nom/Désignation]:[Clôturé]],SMALL(IF(Tableau_de_suivi[Type d''acte]=$B$1,ROW(Tableau_de_suivi[N°])-2),ROWS($1:67)),1),\"\")","v":""}]
[{"$f":"IFERROR(INDEX(Tableau_de_suivi[[Nom/Désignation]:[Clôturé]],SMALL(IF(Tableau_de_suivi[Type d''acte]=$B$1,ROW(Tableau_de_suivi[N°])-2),ROWS($1:68)),1),\"\")","v":""}]
[{"$f":"IFERROR(INDEX(Tableau_de_suivi[[Nom/Désignation]:[Clôturé]],SMALL(IF(Tableau_de_suivi[Type d''acte]=$B$1,ROW(Tableau_de_suivi[N°])-2),ROWS($1:69)),1),\"\")","v":""}]
[{"$f":"IFERROR(INDEX(Tableau_de_suivi[[Nom/Désignation]:[Clôturé]],SMALL(IF(Tableau_de_suivi[Type d''acte]=$B$1,ROW(Tableau_de_suivi[N°])-2),ROWS($1:70)),1),\"\")","v":""}]
[{"$f":"IFERROR(INDEX(Tableau_de_suivi[[Nom/Désignation]:[Clôturé]],SMALL(IF(Tableau_de_suivi[Type d''acte]=$B$1,ROW(Tableau_de_suivi[N°])-2),ROWS($1:71)),1),\"\")","v":""}]
[{"$f":"IFERROR(INDEX(Tableau_de_suivi[[Nom/Désignation]:[Clôturé]],SMALL(IF(Tableau_de_suivi[Type d''acte]=$B$1,ROW(Tableau_de_suivi[N°])-2),ROWS($1:72)),1),\"\")","v":""}]
[{"$f":"IFERROR(INDEX(Tableau_de_suivi[[Nom/Désignation]:[Clôturé]],SMALL(IF(Tableau_de_suivi[Type d''acte]=$B$1,ROW(Tableau_de_suivi[N°])-2),ROWS($1:73)),1),\"\")","v":""}]
[{"$f":"IFERROR(INDEX(Tableau_de_suivi[[Nom/Désignation]:[Clôturé]],SMALL(IF(Tableau_de_suivi[Type d''acte]=$B$1,ROW(Tableau_de_suivi[N°])-2),ROWS($1:74)),1),\"\")","v":""}]
[{"$f":"IFERROR(INDEX(Tableau_de_suivi[[Nom/Désignation]:[Clôturé]],SMALL(IF(Tableau_de_suivi[Type d''acte]=$B$1,ROW(Tableau_de_suivi[N°])-2),ROWS($1:75)),1),\"\")","v":""}]
[{"$f":"IFERROR(INDEX(Tableau_de_suivi[[Nom/Désignation]:[Clôturé]],SMALL(IF(Tableau_de_suivi[Type d''acte]=$B$1,ROW(Tableau_de_suivi[N°])-2),ROWS($1:76)),1),\"\")","v":""}]
[{"$f":"IFERROR(INDEX(Tableau_de_suivi[[Nom/Désignation]:[Clôturé]],SMALL(IF(Tableau_de_suivi[Type d''acte]=$B$1,ROW(Tableau_de_suivi[N°])-2),ROWS($1:77)),1),\"\")","v":""}]
[{"$f":"IFERROR(INDEX(Tableau_de_suivi[[Nom/Désignation]:[Clôturé]],SMALL(IF(Tableau_de_suivi[Type d''acte]=$B$1,ROW(Tableau_de_suivi[N°])-2),ROWS($1:78)),1),\"\")","v":""}]
[{"$f":"IFERROR(INDEX(Tableau_de_suivi[[Nom/Désignation]:[Clôturé]],SMALL(IF(Tableau_de_suivi[Type d''acte]=$B$1,ROW(Tableau_de_suivi[N°])-2),ROWS($1:79)),1),\"\")","v":""}]
[{"$f":"IFERROR(INDEX(Tableau_de_suivi[[Nom/Désignation]:[Clôturé]],SMALL(IF(Tableau_de_suivi[Type d''acte]=$B$1,ROW(Tableau_de_suivi[N°])-2),ROWS($1:80)),1),\"\")","v":""}]
[{"$f":"IFERROR(INDEX(Tableau_de_suivi[[Nom/Désignation]:[Clôturé]],SMALL(IF(Tableau_de_suivi[Type d''acte]=$B$1,ROW(Tableau_de_suivi[N°])-2),ROWS($1:81)),1),\"\")","v":""}]
[{"$f":"IFERROR(INDEX(Tableau_de_suivi[[Nom/Désignation]:[Clôturé]],SMALL(IF(Tableau_de_suivi[Type d''acte]=$B$1,ROW(Tableau_de_suivi[N°])-2),ROWS($1:82)),1),\"\")","v":""}]
[{"$f":"IFERROR(INDEX(Tableau_de_suivi[[Nom/Désignation]:[Clôturé]],SMALL(IF(Tableau_de_suivi[Type d''acte]=$B$1,ROW(Tableau_de_suivi[N°])-2),ROWS($1:83)),1),\"\")","v":""}]
[{"$f":"IFERROR(INDEX(Tableau_de_suivi[[Nom/Désignation]:[Clôturé]],SMALL(IF(Tableau_de_suivi[Type d''acte]=$B$1,ROW(Tableau_de_suivi[N°])-2),ROWS($1:84)),1),\"\")","v":""}]
[{"$f":"IFERROR(INDEX(Tableau_de_suivi[[Nom/Désignation]:[Clôturé]],SMALL(IF(Tableau_de_suivi[Type d''acte]=$B$1,ROW(Tableau_de_suivi[N°])-2),ROWS($1:85)),1),\"\")","v":""}]
[{"$f":"IFERROR(INDEX(Tableau_de_suivi[[Nom/Désignation]:[Clôturé]],SMALL(IF(Tableau_de_suivi[Type d''acte]=$B$1,ROW(Tableau_de_suivi[N°])-2),ROWS($1:86)),1),\"\")","v":""}]
[{"$f":"IFERROR(INDEX(Tableau_de_suivi[[Nom/Désignation]:[Clôturé]],SMALL(IF(Tableau_de_suivi[Type d''acte]=$B$1,ROW(Tableau_de_suivi[N°])-2),ROWS($1:87)),1),\"\")","v":""}]
[{"$f":"IFERROR(INDEX(Tableau_de_suivi[[Nom/Désignation]:[Clôturé]],SMALL(IF(Tableau_de_suivi[Type d''acte]=$B$1,ROW(Tableau_de_suivi[N°])-2),ROWS($1:88)),1),\"\")","v":""}]
[{"$f":"IFERROR(INDEX(Tableau_de_suivi[[Nom/Désignation]:[Clôturé]],SMALL(IF(Tableau_de_suivi[Type d''acte]=$B$1,ROW(Tableau_de_suivi[N°])-2),ROWS($1:89)),1),\"\")","v":""}]
[{"$f":"IFERROR(INDEX(Tableau_de_suivi[[Nom/Désignation]:[Clôturé]],SMALL(IF(Tableau_de_suivi[Type d''acte]=$B$1,ROW(Tableau_de_suivi[N°])-2),ROWS($1:90)),1),\"\")","v":""}]
[{"$f":"IFERROR(INDEX(Tableau_de_suivi[[Nom/Désignation]:[Clôturé]],SMALL(IF(Tableau_de_suivi[Type d''acte]=$B$1,ROW(Tableau_de_suivi[N°])-2),ROWS($1:91)),1),\"\")","v":""}]
[{"$f":"IFERROR(INDEX(Tableau_de_suivi[[Nom/Désignation]:[Clôturé]],SMALL(IF(Tableau_de_suivi[Type d''acte]=$B$1,ROW(Tableau_de_suivi[N°])-2),ROWS($1:92)),1),\"\")","v":""}]
[{"$f":"IFERROR(INDEX(Tableau_de_suivi[[Nom/Désignation]:[Clôturé]],SMALL(IF(Tableau_de_suivi[Type d''acte]=$B$1,ROW(Tableau_de_suivi[N°])-2),ROWS($1:93)),1),\"\")","v":""}]
[{"$f":"IFERROR(INDEX(Tableau_de_suivi[[Nom/Désignation]:[Clôturé]],SMALL(IF(Tableau_de_suivi[Type d''acte]=$B$1,ROW(Tableau_de_suivi[N°])-2),ROWS($1:94)),1),\"\")","v":""}]
[{"$f":"IFERROR(INDEX(Tableau_de_suivi[[Nom/Désignation]:[Clôturé]],SMALL(IF(Tableau_de_suivi[Type d''acte]=$B$1,ROW(Tableau_de_suivi[N°])-2),ROWS($1:95)),1),\"\")","v":""}]
[{"$f":"IFERROR(INDEX(Tableau_de_suivi[[Nom/Désignation]:[Clôturé]],SMALL(IF(Tableau_de_suivi[Type d''acte]=$B$1,ROW(Tableau_de_suivi[N°])-2),ROWS($1:96)),1),\"\")","v":""}]
[{"$f":"IFERROR(INDEX(Tableau_de_suivi[[Nom/Désignation]:[Clôturé]],SMALL(IF(Tableau_de_suivi[Type d''acte]=$B$1,ROW(Tableau_de_suivi[N°])-2),ROWS($1:97)),1),\"\")","v":""}]

{"sheet":"Autorisation d'établissement","index":4,"n_rows":100,"n_cols":12,"rows_kept":100,"cut":false,"hidden":false,"merged":[[0,1,0,11]]}
[null,"Autorisation d'établissement"]
[{"$f":"VLOOKUP($B$1,Sources!$F$3:$R$19,COLUMN()+1,FALSE)","v":"NOM"},{"$f":"VLOOKUP($B$1,Sources!$F$3:$R$19,COLUMN()+1,FALSE)","v":"Formulaire de demande "},{"$f":"VLOOKUP($B$1,Sources!$F$3:$R$19,COLUMN()+1,FALSE)","v":"Déclaration sur l'honneur"},{"$f":"VLOOKUP($B$1,Sources!$F$3:$R$19,COLUMN()+1,FALSE)","v":"Diplôme(s)"},{"$f":"VLOOKUP($B$1,Sources!$F$3:$R$19,COLUMN()+1,FALSE)","v":"Certificat relevé carrière prof. "},{"$f":"VLOOKUP($B$1,Sources!$F$3:$R$19,COLUMN()+1,FALSE)","v":"Autres preuves de qualifications prof."},{"$f":"VLOOKUP($B$1,Sources!$F$3:$R$19,COLUMN()+1,FALSE)","v":"Extrait de casier judiciaire "},{"$f":"VLOOKUP($B$1,Sources!$F$3:$R$19,COLUMN()+1,FALSE)","v":"Attestation de non-faillite"},{"$f":"VLOOKUP($B$1,Sources!$F$3:$R$19,COLUMN()+1,FALSE)","v":"(Projet de) Statuts"},{"$f":"VLOOKUP($B$1,Sources!$F$3:$R$19,COLUMN()+1,FALSE)","v":"Contrat de bail "},{"$f":"VLOOKUP($B$1,Sources!$F$3:$R$19,COLUMN()+1,FALSE)","v":"Carte ID "},{"$f":"VLOOKUP($B$1,Sources!$F$3:$R$19,COLUMN()+1,FALSE)","v":0}]
["Colonne1","Colonne2","Colonne3","Colonne4","Colonne5","Colonne6","Colonne7","Colonne8","Colonne9","Colonne10","Colonne11","Colonne12"]
[{"$f":"IFERROR(INDEX(Tableau_de_suivi[[Nom/Désignation]:[Clôturé]],SMALL(IF(Tableau_de_suivi[Type d''acte]=$B$1,ROW(Tableau_de_suivi[N°])-2),ROWS($1:1)),1),\"\")","v":"Tartempion"}]
[{"$f":"IFERROR(INDEX(Tableau_de_suivi[[Nom/Désignation]:[Clôturé]],SMALL(IF(Tableau_de_suivi[Type d''acte]=$B$1,ROW(Tableau_de_suivi[N°])-2),ROWS($1:2)),1),\"\")","v":"Truc"}]
[{"$f":"IFERROR(INDEX(Tableau_de_suivi[[Nom/Désignation]:[Clôturé]],SMALL(IF(Tableau_de_suivi[Type d''acte]=$B$1,ROW(Tableau_de_suivi[N°])-2),ROWS($1:3)),1),\"\")","v":""}]
[{"$f":"IFERROR(INDEX(Tableau_de_suivi[[Nom/Désignation]:[Clôturé]],SMALL(IF(Tableau_de_suivi[Type d''acte]=$B$1,ROW(Tableau_de_suivi[N°])-2),ROWS($1:4)),1),\"\")","v":""}]
[{"$f":"IFERROR(INDEX(Tableau_de_suivi[[Nom/Désignation]:[Clôturé]],SMALL(IF(Tableau_de_suivi[Type d''acte]=$B$1,ROW(Tableau_de_suivi[N°])-2),ROWS($1:5)),1),\"\")","v":""}]
[{"$f":"IFERROR(INDEX(Tableau_de_suivi[[Nom/Désignation]:[Clôturé]],SMALL(IF(Tableau_de_suivi[Type d''acte]=$B$1,ROW(Tableau_de_suivi[N°])-2),ROWS($1:6)),1),\"\")","v":""}]
[{"$f":"IFERROR(INDEX(Tableau_de_suivi[[Nom/Désignation]:[Clôturé]],SMALL(IF(Tableau_de_suivi[Type d''acte]=$B$1,ROW(Tableau_de_suivi[N°])-2),ROWS($1:7)),1),\"\")","v":""}]
[{"$f":"IFERROR(INDEX(Tableau_de_suivi[[Nom/Désignation]:[Clôturé]],SMALL(IF(Tableau_de_suivi[Type d''acte]=$B$1,ROW(Tableau_de_suivi[N°])-2),ROWS($1:8)),1),\"\")","v":""}]
[{"$f":"IFERROR(INDEX(Tableau_de_suivi[[Nom/Désignation]:[Clôturé]],SMALL(IF(Tableau_de_suivi[Type d''acte]=$B$1,ROW(Tableau_de_suivi[N°])-2),ROWS($1:9)),1),\"\")","v":""}]
[{"$f":"IFERROR(INDEX(Tableau_de_suivi[[Nom/Désignation]:[Clôturé]],SMALL(IF(Tableau_de_suivi[Type d''acte]=$B$1,ROW(Tableau_de_suivi[N°])-2),ROWS($1:10)),1),\"\")","v":""}]
[{"$f":"IFERROR(INDEX(Tableau_de_suivi[[Nom/Désignation]:[Clôturé]],SMALL(IF(Tableau_de_suivi[Type d''acte]=$B$1,ROW(Tableau_de_suivi[N°])-2),ROWS($1:11)),1),\"\")","v":""}]
[{"$f":"IFERROR(INDEX(Tableau_de_suivi[[Nom/Désignation]:[Clôturé]],SMALL(IF(Tableau_de_suivi[Type d''acte]=$B$1,ROW(Tableau_de_suivi[N°])-2),ROWS($1:12)),1),\"\")","v":""}]
[{"$f":"IFERROR(INDEX(Tableau_de_suivi[[Nom/Désignation]:[Clôturé]],SMALL(IF(Tableau_de_suivi[Type d''acte]=$B$1,ROW(Tableau_de_suivi[N°])-2),ROWS($1:13)),1),\"\")","v":""}]
[{"$f":"IFERROR(INDEX(Tableau_de_suivi[[Nom/Désignation]:[Clôturé]],SMALL(IF(Tableau_de_suivi[Type d''acte]=$B$1,ROW(Tableau_de_suivi[N°])-2),ROWS($1:14)),1),\"\")","v":""}]
[{"$f":"IFERROR(INDEX(Tableau_de_suivi[[Nom/Désignation]:[Clôturé]],SMALL(IF(Tableau_de_suivi[Type d''acte]=$B$1,ROW(Tableau_de_suivi[N°])-2),ROWS($1:15)),1),\"\")","v":""}]
[{"$f":"IFERROR(INDEX(Tableau_de_suivi[[Nom/Désignation]:[Clôturé]],SMALL(IF(Tableau_de_suivi[Type d''acte]=$B$1,ROW(Tableau_de_suivi[N°])-2),ROWS($1:16)),1),\"\")","v":""}]
[{"$f":"IFERROR(INDEX(Tableau_de_suivi[[Nom/Désignation]:[Clôturé]],SMALL(IF(Tableau_de_suivi[Type d''acte]=$B$1,ROW(Tableau_de_suivi[N°])-2),ROWS($1:17)),1),\"\")","v":""}]
[{"$f":"IFERROR(INDEX(Tableau_de_suivi[[Nom/Désignation]:[Clôturé]],SMALL(IF(Tableau_de_suivi[Type d''acte]=$B$1,ROW(Tableau_de_suivi[N°])-2),ROWS($1:18)),1),\"\")","v":""}]
[{"$f":"IFERROR(INDEX(Tableau_de_suivi[[Nom/Désignation]:[Clôturé]],SMALL(IF(Tableau_de_suivi[Type d''acte]=$B$1,ROW(Tableau_de_suivi[N°])-2),ROWS($1:19)),1),\"\")","v":""}]
[{"$f":"IFERROR(INDEX(Tableau_de_suivi[[Nom/Désignation]:[Clôturé]],SMALL(IF(Tableau_de_suivi[Type d''acte]=$B$1,ROW(Tableau_de_suivi[N°])-2),ROWS($1:20)),1),\"\")","v":""}]
[{"$f":"IFERROR(INDEX(Tableau_de_suivi[[Nom/Désignation]:[Clôturé]],SMALL(IF(Tableau_de_suivi[Type d''acte]=$B$1,ROW(Tableau_de_suivi[N°])-2),ROWS($1:21)),1),\"\")","v":""}]
[{"$f":"IFERROR(INDEX(Tableau_de_suivi[[Nom/Désignation]:[Clôturé]],SMALL(IF(Tableau_de_suivi[Type d''acte]=$B$1,ROW(Tableau_de_suivi[N°])-2),ROWS($1:22)),1),\"\")","v":""}]
[{"$f":"IFERROR(INDEX(Tableau_de_suivi[[Nom/Désignation]:[Clôturé]],SMALL(IF(Tableau_de_suivi[Type d''acte]=$B$1,ROW(Tableau_de_suivi[N°])-2),ROWS($1:23)),1),\"\")","v":""}]
[{"$f":"IFERROR(INDEX(Tableau_de_suivi[[Nom/Désignation]:[Clôturé]],SMALL(IF(Tableau_de_suivi[Type d''acte]=$B$1,ROW(Tableau_de_suivi[N°])-2),ROWS($1:24)),1),\"\")","v":""}]
[{"$f":"IFERROR(INDEX(Tableau_de_suivi[[Nom/Désignation]:[Clôturé]],SMALL(IF(Tableau_de_suivi[Type d''acte]=$B$1,ROW(Tableau_de_suivi[N°])-2),ROWS($1:25)),1),\"\")","v":""}]
[{"$f":"IFERROR(INDEX(Tableau_de_suivi[[Nom/Désignation]:[Clôturé]],SMALL(IF(Tableau_de_suivi[Type d''acte]=$B$1,ROW(Tableau_de_suivi[N°])-2),ROWS($1:26)),1),\"\")","v":""}]
[{"$f":"IFERROR(INDEX(Tableau_de_suivi[[Nom/Désignation]:[Clôturé]],SMALL(IF(Tableau_de_suivi[Type d''acte]=$B$1,ROW(Tableau_de_suivi[N°])-2),ROWS($1:27)),1),\"\")","v":""}]
[{"$f":"IFERROR(INDEX(Tableau_de_suivi[[Nom/Désignation]:[Clôturé]],SMALL(IF(Tableau_de_suivi[Type d''acte]=$B$1,ROW(Tableau_de_suivi[N°])-2),ROWS($1:28)),1),\"\")","v":""}]
[{"$f":"IFERROR(INDEX(Tableau_de_suivi[[Nom/Désignation]:[Clôturé]],SMALL(IF(Tableau_de_suivi[Type d''acte]=$B$1,ROW(Tableau_de_suivi[N°])-2),ROWS($1:29)),1),\"\")","v":""}]
[{"$f":"IFERROR(INDEX(Tableau_de_suivi[[Nom/Désignation]:[Clôturé]],SMALL(IF(Tableau_de_suivi[Type d''acte]=$B$1,ROW(Tableau_de_suivi[N°])-2),ROWS($1:30)),1),\"\")","v":""}]
[{"$f":"IFERROR(INDEX(Tableau_de_suivi[[Nom/Désignation]:[Clôturé]],SMALL(IF(Tableau_de_suivi[Type d''acte]=$B$1,ROW(Tableau_de_suivi[N°])-2),ROWS($1:31)),1),\"\")","v":""}]
[{"$f":"IFERROR(INDEX(Tableau_de_suivi[[Nom/Désignation]:[Clôturé]],SMALL(IF(Tableau_de_suivi[Type d''acte]=$B$1,ROW(Tableau_de_suivi[N°])-2),ROWS($1:32)),1),\"\")","v":""}]
[{"$f":"IFERROR(INDEX(Tableau_de_suivi[[Nom/Désignation]:[Clôturé]],SMALL(IF(Tableau_de_suivi[Type d''acte]=$B$1,ROW(Tableau_de_suivi[N°])-2),ROWS($1:33)),1),\"\")","v":""}]
[{"$f":"IFERROR(INDEX(Tableau_de_suivi[[Nom/Désignation]:[Clôturé]],SMALL(IF(Tableau_de_suivi[Type d''acte]=$B$1,ROW(Tableau_de_suivi[N°])-2),ROWS($1:34)),1),\"\")","v":""}]
[{"$f":"IFERROR(INDEX(Tableau_de_suivi[[Nom/Désignation]:[Clôturé]],SMALL(IF(Tableau_de_suivi[Type d''acte]=$B$1,ROW(Tableau_de_suivi[N°])-2),ROWS($1:35)),1),\"\")","v":""}]
[{"$f":"IFERROR(INDEX(Tableau_de_suivi[[Nom/Désignation]:[Clôturé]],SMALL(IF(Tableau_de_suivi[Type d''acte]=$B$1,ROW(Tableau_de_suivi[N°])-2),ROWS($1:36)),1),\"\")","v":""}]
[{"$f":"IFERROR(INDEX(Tableau_de_suivi[[Nom/Désignation]:[Clôturé]],SMALL(IF(Tableau_de_suivi[Type d''acte]=$B$1,ROW(Tableau_de_suivi[N°])-2),ROWS($1:37)),1),\"\")","v":""}]
[{"$f":"IFERROR(INDEX(Tableau_de_suivi[[Nom/Désignation]:[Clôturé]],SMALL(IF(Tableau_de_suivi[Type d''acte]=$B$1,ROW(Tableau_de_suivi[N°])-2),ROWS($1:38)),1),\"\")","v":""}]
[{"$f":"IFERROR(INDEX(Tableau_de_suivi[[Nom/Désignation]:[Clôturé]],SMALL(IF(Tableau_de_suivi[Type d''acte]=$B$1,ROW(Tableau_de_suivi[N°])-2),ROWS($1:39)),1),\"\")","v":""}]
[{"$f":"IFERROR(INDEX(Tableau_de_suivi[[Nom/Désignation]:[Clôturé]],SMALL(IF(Tableau_de_suivi[Type d''acte]=$B$1,ROW(Tableau_de_suivi[N°])-2),ROWS($1:40)),1),\"\")","v":""}]
[{"$f":"IFERROR(INDEX(Tableau_de_suivi[[Nom/Désignation]:[Clôturé]],SMALL(IF(Tableau_de_suivi[Type d''acte]=$B$1,ROW(Tableau_de_suivi[N°])-2),ROWS($1:41)),1),\"\")","v":""}]
[{"$f":"IFERROR(INDEX(Tableau_de_suivi[[Nom/Désignation]:[Clôturé]],SMALL(IF(Tableau_de_suivi[Type d''acte]=$B$1,ROW(Tableau_de_suivi[N°])-2),ROWS($1:42)),1),\"\")","v":""}]
[{"$f":"IFERROR(INDEX(Tableau_de_suivi[[Nom/Désignation]:[Clôturé]],SMALL(IF(Tableau_de_suivi[Type d''acte]=$B$1,ROW(Tableau_de_suivi[N°])-2),ROWS($1:43)),1),\"\")","v":""}]
[{"$f":"IFERROR(INDEX(Tableau_de_suivi[[Nom/Désignation]:[Clôturé]],SMALL(IF(Tableau_de_suivi[Type d''acte]=$B$1,ROW(Tableau_de_suivi[N°])-2),ROWS($1:44)),1),\"\")","v":""}]
[{"$f":"IFERROR(INDEX(Tableau_de_suivi[[Nom/Désignation]:[Clôturé]],SMALL(IF(Tableau_de_suivi[Type d''acte]=$B$1,ROW(Tableau_de_suivi[N°])-2),ROWS($1:45)),1),\"\")","v":""}]
[{"$f":"IFERROR(INDEX(Tableau_de_suivi[[Nom/Désignation]:[Clôturé]],SMALL(IF(Tableau_de_suivi[Type d''acte]=$B$1,ROW(Tableau_de_suivi[N°])-2),ROWS($1:46)),1),\"\")","v":""}]
[{"$f":"IFERROR(INDEX(Tableau_de_suivi[[Nom/Désignation]:[Clôturé]],SMALL(IF(Tableau_de_suivi[Type d''acte]=$B$1,ROW(Tableau_de_suivi[N°])-2),ROWS($1:47)),1),\"\")","v":""}]
[{"$f":"IFERROR(INDEX(Tableau_de_suivi[[Nom/Désignation]:[Clôturé]],SMALL(IF(Tableau_de_suivi[Type d''acte]=$B$1,ROW(Tableau_de_suivi[N°])-2),ROWS($1:48)),1),\"\")","v":""}]
[{"$f":"IFERROR(INDEX(Tableau_de_suivi[[Nom/Désignation]:[Clôturé]],SMALL(IF(Tableau_de_suivi[Type d''acte]=$B$1,ROW(Tableau_de_suivi[N°])-2),ROWS($1:49)),1),\"\")","v":""}]
[{"$f":"IFERROR(INDEX(Tableau_de_suivi[[Nom/Désignation]:[Clôturé]],SMALL(IF(Tableau_de_suivi[Type d''acte]=$B$1,ROW(Tableau_de_suivi[N°])-2),ROWS($1:50)),1),\"\")","v":""}]
[{"$f":"IFERROR(INDEX(Tableau_de_suivi[[Nom/Désignation]:[Clôturé]],SMALL(IF(Tableau_de_suivi[Type d''acte]=$B$1,ROW(Tableau_de_suivi[N°])-2),ROWS($1:51)),1),\"\")","v":""}]
[{"$f":"IFERROR(INDEX(Tableau_de_suivi[[Nom/Désignation]:[Clôturé]],SMALL(IF(Tableau_de_suivi[Type d''acte]=$B$1,ROW(Tableau_de_suivi[N°])-2),ROWS($1:52)),1),\"\")","v":""}]
[{"$f":"IFERROR(INDEX(Tableau_de_suivi[[Nom/Désignation]:[Clôturé]],SMALL(IF(Tableau_de_suivi[Type d''acte]=$B$1,ROW(Tableau_de_suivi[N°])-2),ROWS($1:53)),1),\"\")","v":""}]
[{"$f":"IFERROR(INDEX(Tableau_de_suivi[[Nom/Désignation]:[Clôturé]],SMALL(IF(Tableau_de_suivi[Type d''acte]=$B$1,ROW(Tableau_de_suivi[N°])-2),ROWS($1:54)),1),\"\")","v":""}]
[{"$f":"IFERROR(INDEX(Tableau_de_suivi[[Nom/Désignation]:[Clôturé]],SMALL(IF(Tableau_de_suivi[Type d''acte]=$B$1,ROW(Tableau_de_suivi[N°])-2),ROWS($1:55)),1),\"\")","v":""}]
[{"$f":"IFERROR(INDEX(Tableau_de_suivi[[Nom/Désignation]:[Clôturé]],SMALL(IF(Tableau_de_suivi[Type d''acte]=$B$1,ROW(Tableau_de_suivi[N°])-2),ROWS($1:56)),1),\"\")","v":""}]
[{"$f":"IFERROR(INDEX(Tableau_de_suivi[[Nom/Désignation]:[Clôturé]],SMALL(IF(Tableau_de_suivi[Type d''acte]=$B$1,ROW(Tableau_de_suivi[N°])-2),ROWS($1:57)),1),\"\")","v":""}]
[{"$f":"IFERROR(INDEX(Tableau_de_suivi[[Nom/Désignation]:[Clôturé]],SMALL(IF(Tableau_de_suivi[Type d''acte]=$B$1,ROW(Tableau_de_suivi[N°])-2),ROWS($1:58)),1),\"\")","v":""}]
[{"$f":"IFERROR(INDEX(Tableau_de_suivi[[Nom/Désignation]:[Clôturé]],SMALL(IF(Tableau_de_suivi[Type d''acte]=$B$1,ROW(Tableau_de_suivi[N°])-2),ROWS($1:59)),1),\"\")","v":""}]
[{"$f":"IFERROR(INDEX(Tableau_de_suivi[[Nom/Désignation]:[Clôturé]],SMALL(IF(Tableau_de_suivi[Type d''acte]=$B$1,ROW(Tableau_de_suivi[N°])-2),ROWS($1:60)),1),\"\")","v":""}]
[{"$f":"IFERROR(INDEX(Tableau_de_suivi[[Nom/Désignation]:[Clôturé]],SMALL(IF(Tableau_de_suivi[Type d''acte]=$B$1,ROW(Tableau_de_suivi[N°])-2),ROWS($1:61)),1),\"\")","v":""}]
[{"$f":"IFERROR(INDEX(Tableau_de_suivi[[Nom/Désignation]:[Clôturé]],SMALL(IF(Tableau_de_suivi[Type d''acte]=$B$1,ROW(Tableau_de_suivi[N°])-2),ROWS($1:62)),1),\"\")","v":""}]
[{"$f":"IFERROR(INDEX(Tableau_de_suivi[[Nom/Désignation]:[Clôturé]],SMALL(IF(Tableau_de_suivi[Type d''acte]=$B$1,ROW(Tableau_de_suivi[N°])-2),ROWS($1:63)),1),\"\")","v":""}]
[{"$f":"IFERROR(INDEX(Tableau_de_suivi[[Nom/Désignation]:[Clôturé]],SMALL(IF(Tableau_de_suivi[Type d''acte]=$B$1,ROW(Tableau_de_suivi[N°])-2),ROWS($1:64)),1),\"\")","v":""}]
[{"$f":"IFERROR(INDEX(Tableau_de_suivi[[Nom/Désignation]:[Clôturé]],SMALL(IF(Tableau_de_suivi[Type d''acte]=$B$1,ROW(Tableau_de_suivi[N°])-2),ROWS($1:65)),1),\"\")","v":""}]
[{"$f":"IFERROR(INDEX(Tableau_de_suivi[[Nom/Désignation]:[Clôturé]],SMALL(IF(Tableau_de_suivi[Type d''acte]=$B$1,ROW(Tableau_de_suivi[N°])-2),ROWS($1:66)),1),\"\")","v":""}]
[{"$f":"IFERROR(INDEX(Tableau_de_suivi[[Nom/Désignation]:[Clôturé]],SMALL(IF(Tableau_de_suivi[Type d''acte]=$B$1,ROW(Tableau_de_suivi[N°])-2),ROWS($1:67)),1),\"\")","v":""}]
[{"$f":"IFERROR(INDEX(Tableau_de_suivi[[Nom/Désignation]:[Clôturé]],SMALL(IF(Tableau_de_suivi[Type d''acte]=$B$1,ROW(Tableau_de_suivi[N°])-2),ROWS($1:68)),1),\"\")","v":""}]
[{"$f":"IFERROR(INDEX(Tableau_de_suivi[[Nom/Désignation]:[Clôturé]],SMALL(IF(Tableau_de_suivi[Type d''acte]=$B$1,ROW(Tableau_de_suivi[N°])-2),ROWS($1:69)),1),\"\")","v":""}]
[{"$f":"IFERROR(INDEX(Tableau_de_suivi[[Nom/Désignation]:[Clôturé]],SMALL(IF(Tableau_de_suivi[Type d''acte]=$B$1,ROW(Tableau_de_suivi[N°])-2),ROWS($1:70)),1),\"\")","v":""}]
[{"$f":"IFERROR(INDEX(Tableau_de_suivi[[Nom/Désignation]:[Clôturé]],SMALL(IF(Tableau_de_suivi[Type d''acte]=$B$1,ROW(Tableau_de_suivi[N°])-2),ROWS($1:71)),1),\"\")","v":""}]
[{"$f":"IFERROR(INDEX(Tableau_de_suivi[[Nom/Désignation]:[Clôturé]],SMALL(IF(Tableau_de_suivi[Type d''acte]=$B$1,ROW(Tableau_de_suivi[N°])-2),ROWS($1:72)),1),\"\")","v":""}]
[{"$f":"IFERROR(INDEX(Tableau_de_suivi[[Nom/Désignation]:[Clôturé]],SMALL(IF(Tableau_de_suivi[Type d''acte]=$B$1,ROW(Tableau_de_suivi[N°])-2),ROWS($1:73)),1),\"\")","v":""}]
[{"$f":"IFERROR(INDEX(Tableau_de_suivi[[Nom/Désignation]:[Clôturé]],SMALL(IF(Tableau_de_suivi[Type d''acte]=$B$1,ROW(Tableau_de_suivi[N°])-2),ROWS($1:74)),1),\"\")","v":""}]
[{"$f":"IFERROR(INDEX(Tableau_de_suivi[[Nom/Désignation]:[Clôturé]],SMALL(IF(Tableau_de_suivi[Type d''acte]=$B$1,ROW(Tableau_de_suivi[N°])-2),ROWS($1:75)),1),\"\")","v":""}]
[{"$f":"IFERROR(INDEX(Tableau_de_suivi[[Nom/Désignation]:[Clôturé]],SMALL(IF(Tableau_de_suivi[Type d''acte]=$B$1,ROW(Tableau_de_suivi[N°])-2),ROWS($1:76)),1),\"\")","v":""}]
[{"$f":"IFERROR(INDEX(Tableau_de_suivi[[Nom/Désignation]:[Clôturé]],SMALL(IF(Tableau_de_suivi[Type d''acte]=$B$1,ROW(Tableau_de_suivi[N°])-2),ROWS($1:77)),1),\"\")","v":""}]
[{"$f":"IFERROR(INDEX(Tableau_de_suivi[[Nom/Désignation]:[Clôturé]],SMALL(IF(Tableau_de_suivi[Type d''acte]=$B$1,ROW(Tableau_de_suivi[N°])-2),ROWS($1:78)),1),\"\")","v":""}]
[{"$f":"IFERROR(INDEX(Tableau_de_suivi[[Nom/Désignation]:[Clôturé]],SMALL(IF(Tableau_de_suivi[Type d''acte]=$B$1,ROW(Tableau_de_suivi[N°])-2),ROWS($1:79)),1),\"\")","v":""}]
[{"$f":"IFERROR(INDEX(Tableau_de_suivi[[Nom/Désignation]:[Clôturé]],SMALL(IF(Tableau_de_suivi[Type d''acte]=$B$1,ROW(Tableau_de_suivi[N°])-2),ROWS($1:80)),1),\"\")","v":""}]
[{"$f":"IFERROR(INDEX(Tableau_de_suivi[[Nom/Désignation]:[Clôturé]],SMALL(IF(Tableau_de_suivi[Type d''acte]=$B$1,ROW(Tableau_de_suivi[N°])-2),ROWS($1:81)),1),\"\")","v":""}]
[{"$f":"IFERROR(INDEX(Tableau_de_suivi[[Nom/Désignation]:[Clôturé]],SMALL(IF(Tableau_de_suivi[Type d''acte]=$B$1,ROW(Tableau_de_suivi[N°])-2),ROWS($1:82)),1),\"\")","v":""}]
[{"$f":"IFERROR(INDEX(Tableau_de_suivi[[Nom/Désignation]:[Clôturé]],SMALL(IF(Tableau_de_suivi[Type d''acte]=$B$1,ROW(Tableau_de_suivi[N°])-2),ROWS($1:83)),1),\"\")","v":""}]
[{"$f":"IFERROR(INDEX(Tableau_de_suivi[[Nom/Désignation]:[Clôturé]],SMALL(IF(Tableau_de_suivi[Type d''acte]=$B$1,ROW(Tableau_de_suivi[N°])-2),ROWS($1:84)),1),\"\")","v":""}]
[{"$f":"IFERROR(INDEX(Tableau_de_suivi[[Nom/Désignation]:[Clôturé]],SMALL(IF(Tableau_de_suivi[Type d''acte]=$B$1,ROW(Tableau_de_suivi[N°])-2),ROWS($1:85)),1),\"\")","v":""}]
[{"$f":"IFERROR(INDEX(Tableau_de_suivi[[Nom/Désignation]:[Clôturé]],SMALL(IF(Tableau_de_suivi[Type d''acte]=$B$1,ROW(Tableau_de_suivi[N°])-2),ROWS($1:86)),1),\"\")","v":""}]
[{"$f":"IFERROR(INDEX(Tableau_de_suivi[[Nom/Désignation]:[Clôturé]],SMALL(IF(Tableau_de_suivi[Type d''acte]=$B$1,ROW(Tableau_de_suivi[N°])-2),ROWS($1:87)),1),\"\")","v":""}]
[{"$f":"IFERROR(INDEX(Tableau_de_suivi[[Nom/Désignation]:[Clôturé]],SMALL(IF(Tableau_de_suivi[Type d''acte]=$B$1,ROW(Tableau_de_suivi[N°])-2),ROWS($1:88)),1),\"\")","v":""}]
[{"$f":"IFERROR(INDEX(Tableau_de_suivi[[Nom/Désignation]:[Clôturé]],SMALL(IF(Tableau_de_suivi[Type d''acte]=$B$1,ROW(Tableau_de_suivi[N°])-2),ROWS($1:89)),1),\"\")","v":""}]
[{"$f":"IFERROR(INDEX(Tableau_de_suivi[[Nom/Désignation]:[Clôturé]],SMALL(IF(Tableau_de_suivi[Type d''acte]=$B$1,ROW(Tableau_de_suivi[N°])-2),ROWS($1:90)),1),\"\")","v":""}]
[{"$f":"IFERROR(INDEX(Tableau_de_suivi[[Nom/Désignation]:[Clôturé]],SMALL(IF(Tableau_de_suivi[Type d''acte]=$B$1,ROW(Tableau_de_suivi[N°])-2),ROWS($1:91)),1),\"\")","v":""}]
[{"$f":"IFERROR(INDEX(Tableau_de_suivi[[Nom/Désignation]:[Clôturé]],SMALL(IF(Tableau_de_suivi[Type d''acte]=$B$1,ROW(Tableau_de_suivi[N°])-2),ROWS($1:92)),1),\"\")","v":""}]
[{"$f":"IFERROR(INDEX(Tableau_de_suivi[[Nom/Désignation]:[Clôturé]],SMALL(IF(Tableau_de_suivi[Type d''acte]=$B$1,ROW(Tableau_de_suivi[N°])-2),ROWS($1:93)),1),\"\")","v":""}]
[{"$f":"IFERROR(INDEX(Tableau_de_suivi[[Nom/Désignation]:[Clôturé]],SMALL(IF(Tableau_de_suivi[Type d''acte]=$B$1,ROW(Tableau_de_suivi[N°])-2),ROWS($1:94)),1),\"\")","v":""}]
[{"$f":"IFERROR(INDEX(Tableau_de_suivi[[Nom/Désignation]:[Clôturé]],SMALL(IF(Tableau_de_suivi[Type d''acte]=$B$1,ROW(Tableau_de_suivi[N°])-2),ROWS($1:95)),1),\"\")","v":""}]
[{"$f":"IFERROR(INDEX(Tableau_de_suivi[[Nom/Désignation]:[Clôturé]],SMALL(IF(Tableau_de_suivi[Type d''acte]=$B$1,ROW(Tableau_de_suivi[N°])-2),ROWS($1:96)),1),\"\")","v":""}]
[{"$f":"IFERROR(INDEX(Tableau_de_suivi[[Nom/Désignation]:[Clôturé]],SMALL(IF(Tableau_de_suivi[Type d''acte]=$B$1,ROW(Tableau_de_suivi[N°])-2),ROWS($1:97)),1),\"\")","v":""}]

{"sheet":"Constitution","index":5,"n_rows":103,"n_cols":12,"rows_kept":103,"cut":false,"hidden":false,"merged":[[0,1,0,11]]}
[null,"Constitution "]
[{"$f":"VLOOKUP($B$1,Sources!$F$3:$R$19,COLUMN()+1,FALSE)","v":"NOM"},{"$f":"VLOOKUP($B$1,Sources!$F$3:$R$19,COLUMN()+1,FALSE)","v":"Déclaration BE AFC "},{"$f":"VLOOKUP($B$1,Sources!$F$3:$R$19,COLUMN()+1,FALSE)","v":"Déclaration BE notaire "},{"$f":"VLOOKUP($B$1,Sources!$F$3:$R$19,COLUMN()+1,FALSE)","v":"Copie ID(s) "},{"$f":"VLOOKUP($B$1,Sources!$F$3:$R$19,COLUMN()+1,FALSE)","v":"Certificat blocage de fonds "},{"$f":"VLOOKUP($B$1,Sources!$F$3:$R$19,COLUMN()+1,FALSE)","v":"Contrat de bail "},{"$f":"VLOOKUP($B$1,Sources!$F$3:$R$19,COLUMN()+1,FALSE)","v":"Certificat d'évaluation "},{"$f":"VLOOKUP($B$1,Sources!$F$3:$R$19,COLUMN()+1,FALSE)","v":"Mandat acceptation gérance"},{"$f":"VLOOKUP($B$1,Sources!$F$3:$R$19,COLUMN()+1,FALSE)","v":"Copie ID gérant"},{"$f":"VLOOKUP($B$1,Sources!$F$3:$R$19,COLUMN()+1,FALSE)","v":"Procuration "},{"$f":"VLOOKUP($B$1,Sources!$F$3:$R$19,COLUMN()+1,FALSE)","v":0},{"$f":"VLOOKUP($B$1,Sources!$F$3:$R$19,COLUMN()+1,FALSE)","v":0}]
["Colonne1","Colonne2","Colonne3","Colonne4","Colonne5","Colonne6","Colonne7","Colonne8","Colonne9","Colonne10","Colonne11","Colonne12"]
[{"$f":"IFERROR(INDEX(Tableau_de_suivi[[Nom/Désignation]:[Clôturé]],SMALL(IF(Tableau_de_suivi[Type d''acte]=$B$1,ROW(Tableau_de_suivi[N°])-2),ROWS($1:1)),1),\"\")","v":"Machin"}]
[{"$f":"IFERROR(INDEX(Tableau_de_suivi[[Nom/Désignation]:[Clôturé]],SMALL(IF(Tableau_de_suivi[Type d''acte]=$B$1,ROW(Tableau_de_suivi[N°])-2),ROWS($1:2)),1),\"\")","v":""}]
[{"$f":"IFERROR(INDEX(Tableau_de_suivi[[Nom/Désignation]:[Clôturé]],SMALL(IF(Tableau_de_suivi[Type d''acte]=$B$1,ROW(Tableau_de_suivi[N°])-2),ROWS($1:3)),1),\"\")","v":""}]
[{"$f":"IFERROR(INDEX(Tableau_de_suivi[[Nom/Désignation]:[Clôturé]],SMALL(IF(Tableau_de_suivi[Type d''acte]=$B$1,ROW(Tableau_de_suivi[N°])-2),ROWS($1:4)),1),\"\")","v":""}]
[{"$f":"IFERROR(INDEX(Tableau_de_suivi[[Nom/Désignation]:[Clôturé]],SMALL(IF(Tableau_de_suivi[Type d''acte]=$B$1,ROW(Tableau_de_suivi[N°])-2),ROWS($1:5)),1),\"\")","v":""}]
[{"$f":"IFERROR(INDEX(Tableau_de_suivi[[Nom/Désignation]:[Clôturé]],SMALL(IF(Tableau_de_suivi[Type d''acte]=$B$1,ROW(Tableau_de_suivi[N°])-2),ROWS($1:6)),1),\"\")","v":""}]
[{"$f":"IFERROR(INDEX(Tableau_de_suivi[[Nom/Désignation]:[Clôturé]],SMALL(IF(Tableau_de_suivi[Type d''acte]=$B$1,ROW(Tableau_de_suivi[N°])-2),ROWS($1:7)),1),\"\")","v":""}]
[{"$f":"IFERROR(INDEX(Tableau_de_suivi[[Nom/Désignation]:[Clôturé]],SMALL(IF(Tableau_de_suivi[Type d''acte]=$B$1,ROW(Tableau_de_suivi[N°])-2),ROWS($1:8)),1),\"\")","v":""}]
[{"$f":"IFERROR(INDEX(Tableau_de_suivi[[Nom/Désignation]:[Clôturé]],SMALL(IF(Tableau_de_suivi[Type d''acte]=$B$1,ROW(Tableau_de_suivi[N°])-2),ROWS($1:9)),1),\"\")","v":""}]
[{"$f":"IFERROR(INDEX(Tableau_de_suivi[[Nom/Désignation]:[Clôturé]],SMALL(IF(Tableau_de_suivi[Type d''acte]=$B$1,ROW(Tableau_de_suivi[N°])-2),ROWS($1:10)),1),\"\")","v":""}]
[{"$f":"IFERROR(INDEX(Tableau_de_suivi[[Nom/Désignation]:[Clôturé]],SMALL(IF(Tableau_de_suivi[Type d''acte]=$B$1,ROW(Tableau_de_suivi[N°])-2),ROWS($1:11)),1),\"\")","v":""}]
[{"$f":"IFERROR(INDEX(Tableau_de_suivi[[Nom/Désignation]:[Clôturé]],SMALL(IF(Tableau_de_suivi[Type d''acte]=$B$1,ROW(Tableau_de_suivi[N°])-2),ROWS($1:12)),1),\"\")","v":""}]
[{"$f":"IFERROR(INDEX(Tableau_de_suivi[[Nom/Désignation]:[Clôturé]],SMALL(IF(Tableau_de_suivi[Type d''acte]=$B$1,ROW(Tableau_de_suivi[N°])-2),ROWS($1:13)),1),\"\")","v":""}]
[{"$f":"IFERROR(INDEX(Tableau_de_suivi[[Nom/Désignation]:[Clôturé]],SMALL(IF(Tableau_de_suivi[Type d''acte]=$B$1,ROW(Tableau_de_suivi[N°])-2),ROWS($1:14)),1),\"\")","v":""}]
[{"$f":"IFERROR(INDEX(Tableau_de_suivi[[Nom/Désignation]:[Clôturé]],SMALL(IF(Tableau_de_suivi[Type d''acte]=$B$1,ROW(Tableau_de_suivi[N°])-2),ROWS($1:15)),1),\"\")","v":""}]
[{"$f":"IFERROR(INDEX(Tableau_de_suivi[[Nom/Désignation]:[Clôturé]],SMALL(IF(Tableau_de_suivi[Type d''acte]=$B$1,ROW(Tableau_de_suivi[N°])-2),ROWS($1:16)),1),\"\")","v":""}]
[{"$f":"IFERROR(INDEX(Tableau_de_suivi[[Nom/Désignation]:[Clôturé]],SMALL(IF(Tableau_de_suivi[Type d''acte]=$B$1,ROW(Tableau_de_suivi[N°])-2),ROWS($1:17)),1),\"\")","v":""}]
[{"$f":"IFERROR(INDEX(Tableau_de_suivi[[Nom/Désignation]:[Clôturé]],SMALL(IF(Tableau_de_suivi[Type d''acte]=$B$1,ROW(Tableau_de_suivi[N°])-2),ROWS($1:18)),1),\"\")","v":""}]
[{"$f":"IFERROR(INDEX(Tableau_de_suivi[[Nom/Désignation]:[Clôturé]],SMALL(IF(Tableau_de_suivi[Type d''acte]=$B$1,ROW(Tableau_de_suivi[N°])-2),ROWS($1:19)),1),\"\")","v":""}]
[{"$f":"IFERROR(INDEX(Tableau_de_suivi[[Nom/Désignation]:[Clôturé]],SMALL(IF(Tableau_de_suivi[Type d''acte]=$B$1,ROW(Tableau_de_suivi[N°])-2),ROWS($1:20)),1),\"\")","v":""}]
[{"$f":"IFERROR(INDEX(Tableau_de_suivi[[Nom/Désignation]:[Clôturé]],SMALL(IF(Tableau_de_suivi[Type d''acte]=$B$1,ROW(Tableau_de_suivi[N°])-2),ROWS($1:21)),1),\"\")","v":""}]
[{"$f":"IFERROR(INDEX(Tableau_de_suivi[[Nom/Désignation]:[Clôturé]],SMALL(IF(Tableau_de_suivi[Type d''acte]=$B$1,ROW(Tableau_de_suivi[N°])-2),ROWS($1:22)),1),\"\")","v":""}]
[{"$f":"IFERROR(INDEX(Tableau_de_suivi[[Nom/Désignation]:[Clôturé]],SMALL(IF(Tableau_de_suivi[Type d''acte]=$B$1,ROW(Tableau_de_suivi[N°])-2),ROWS($1:23)),1),\"\")","v":""}]
[{"$f":"IFERROR(INDEX(Tableau_de_suivi[[Nom/Désignation]:[Clôturé]],SMALL(IF(Tableau_de_suivi[Type d''acte]=$B$1,ROW(Tableau_de_suivi[N°])-2),ROWS($1:24)),1),\"\")","v":""}]
[{"$f":"IFERROR(INDEX(Tableau_de_suivi[[Nom/Désignation]:[Clôturé]],SMALL(IF(Tableau_de_suivi[Type d''acte]=$B$1,ROW(Tableau_de_suivi[N°])-2),ROWS($1:25)),1),\"\")","v":""}]
[{"$f":"IFERROR(INDEX(Tableau_de_suivi[[Nom/Désignation]:[Clôturé]],SMALL(IF(Tableau_de_suivi[Type d''acte]=$B$1,ROW(Tableau_de_suivi[N°])-2),ROWS($1:26)),1),\"\")","v":""}]
[{"$f":"IFERROR(INDEX(Tableau_de_suivi[[Nom/Désignation]:[Clôturé]],SMALL(IF(Tableau_de_suivi[Type d''acte]=$B$1,ROW(Tableau_de_suivi[N°])-2),ROWS($1:27)),1),\"\")","v":""}]
[{"$f":"IFERROR(INDEX(Tableau_de_suivi[[Nom/Désignation]:[Clôturé]],SMALL(IF(Tableau_de_suivi[Type d''acte]=$B$1,ROW(Tableau_de_suivi[N°])-2),ROWS($1:28)),1),\"\")","v":""}]
[{"$f":"IFERROR(INDEX(Tableau_de_suivi[[Nom/Désignation]:[Clôturé]],SMALL(IF(Tableau_de_suivi[Type d''acte]=$B$1,ROW(Tableau_de_suivi[N°])-2),ROWS($1:29)),1),\"\")","v":""}]
[{"$f":"IFERROR(INDEX(Tableau_de_suivi[[Nom/Désignation]:[Clôturé]],SMALL(IF(Tableau_de_suivi[Type d''acte]=$B$1,ROW(Tableau_de_suivi[N°])-2),ROWS($1:30)),1),\"\")","v":""}]
[{"$f":"IFERROR(INDEX(Tableau_de_suivi[[Nom/Désignation]:[Clôturé]],SMALL(IF(Tableau_de_suivi[Type d''acte]=$B$1,ROW(Tableau_de_suivi[N°])-2),ROWS($1:31)),1),\"\")","v":""}]
[{"$f":"IFERROR(INDEX(Tableau_de_suivi[[Nom/Désignation]:[Clôturé]],SMALL(IF(Tableau_de_suivi[Type d''acte]=$B$1,ROW(Tableau_de_suivi[N°])-2),ROWS($1:32)),1),\"\")","v":""}]
[{"$f":"IFERROR(INDEX(Tableau_de_suivi[[Nom/Désignation]:[Clôturé]],SMALL(IF(Tableau_de_suivi[Type d''acte]=$B$1,ROW(Tableau_de_suivi[N°])-2),ROWS($1:33)),1),\"\")","v":""}]
[{"$f":"IFERROR(INDEX(Tableau_de_suivi[[Nom/Désignation]:[Clôturé]],SMALL(IF(Tableau_de_suivi[Type d''acte]=$B$1,ROW(Tableau_de_suivi[N°])-2),ROWS($1:34)),1),\"\")","v":""}]
[{"$f":"IFERROR(INDEX(Tableau_de_suivi[[Nom/Désignation]:[Clôturé]],SMALL(IF(Tableau_de_suivi[Type d''acte]=$B$1,ROW(Tableau_de_suivi[N°])-2),ROWS($1:35)),1),\"\")","v":""}]
[{"$f":"IFERROR(INDEX(Tableau_de_suivi[[Nom/Désignation]:[Clôturé]],SMALL(IF(Tableau_de_suivi[Type d''acte]=$B$1,ROW(Tableau_de_suivi[N°])-2),ROWS($1:36)),1),\"\")","v":""}]
[{"$f":"IFERROR(INDEX(Tableau_de_suivi[[Nom/Désignation]:[Clôturé]],SMALL(IF(Tableau_de_suivi[Type d''acte]=$B$1,ROW(Tableau_de_suivi[N°])-2),ROWS($1:37)),1),\"\")","v":""}]
[{"$f":"IFERROR(INDEX(Tableau_de_suivi[[Nom/Désignation]:[Clôturé]],SMALL(IF(Tableau_de_suivi[Type d''acte]=$B$1,ROW(Tableau_de_suivi[N°])-2),ROWS($1:38)),1),\"\")","v":""}]
[{"$f":"IFERROR(INDEX(Tableau_de_suivi[[Nom/Désignation]:[Clôturé]],SMALL(IF(Tableau_de_suivi[Type d''acte]=$B$1,ROW(Tableau_de_suivi[N°])-2),ROWS($1:39)),1),\"\")","v":""}]
[{"$f":"IFERROR(INDEX(Tableau_de_suivi[[Nom/Désignation]:[Clôturé]],SMALL(IF(Tableau_de_suivi[Type d''acte]=$B$1,ROW(Tableau_de_suivi[N°])-2),ROWS($1:40)),1),\"\")","v":""}]
[{"$f":"IFERROR(INDEX(Tableau_de_suivi[[Nom/Désignation]:[Clôturé]],SMALL(IF(Tableau_de_suivi[Type d''acte]=$B$1,ROW(Tableau_de_suivi[N°])-2),ROWS($1:41)),1),\"\")","v":""}]
[{"$f":"IFERROR(INDEX(Tableau_de_suivi[[Nom/Désignation]:[Clôturé]],SMALL(IF(Tableau_de_suivi[Type d''acte]=$B$1,ROW(Tableau_de_suivi[N°])-2),ROWS($1:42)),1),\"\")","v":""}]
[{"$f":"IFERROR(INDEX(Tableau_de_suivi[[Nom/Désignation]:[Clôturé]],SMALL(IF(Tableau_de_suivi[Type d''acte]=$B$1,ROW(Tableau_de_suivi[N°])-2),ROWS($1:43)),1),\"\")","v":""}]
[{"$f":"IFERROR(INDEX(Tableau_de_suivi[[Nom/Désignation]:[Clôturé]],SMALL(IF(Tableau_de_suivi[Type d''acte]=$B$1,ROW(Tableau_de_suivi[N°])-2),ROWS($1:44)),1),\"\")","v":""}]
[{"$f":"IFERROR(INDEX(Tableau_de_suivi[[Nom/Désignation]:[Clôturé]],SMALL(IF(Tableau_de_suivi[Type d''acte]=$B$1,ROW(Tableau_de_suivi[N°])-2),ROWS($1:45)),1),\"\")","v":""}]
[{"$f":"IFERROR(INDEX(Tableau_de_suivi[[Nom/Désignation]:[Clôturé]],SMALL(IF(Tableau_de_suivi[Type d''acte]=$B$1,ROW(Tableau_de_suivi[N°])-2),ROWS($1:46)),1),\"\")","v":""}]
[{"$f":"IFERROR(INDEX(Tableau_de_suivi[[Nom/Désignation]:[Clôturé]],SMALL(IF(Tableau_de_suivi[Type d''acte]=$B$1,ROW(Tableau_de_suivi[N°])-2),ROWS($1:47)),1),\"\")","v":""}]
[{"$f":"IFERROR(INDEX(Tableau_de_suivi[[Nom/Désignation]:[Clôturé]],SMALL(IF(Tableau_de_suivi[Type d''acte]=$B$1,ROW(Tableau_de_suivi[N°])-2),ROWS($1:48)),1),\"\")","v":""}]
[{"$f":"IFERROR(INDEX(Tableau_de_suivi[[Nom/Désignation]:[Clôturé]],SMALL(IF(Tableau_de_suivi[Type d''acte]=$B$1,ROW(Tableau_de_suivi[N°])-2),ROWS($1:49)),1),\"\")","v":""}]
[{"$f":"IFERROR(INDEX(Tableau_de_suivi[[Nom/Désignation]:[Clôturé]],SMALL(IF(Tableau_de_suivi[Type d''acte]=$B$1,ROW(Tableau_de_suivi[N°])-2),ROWS($1:50)),1),\"\")","v":""}]
[{"$f":"IFERROR(INDEX(Tableau_de_suivi[[Nom/Désignation]:[Clôturé]],SMALL(IF(Tableau_de_suivi[Type d''acte]=$B$1,ROW(Tableau_de_suivi[N°])-2),ROWS($1:51)),1),\"\")","v":""}]
[{"$f":"IFERROR(INDEX(Tableau_de_suivi[[Nom/Désignation]:[Clôturé]],SMALL(IF(Tableau_de_suivi[Type d''acte]=$B$1,ROW(Tableau_de_suivi[N°])-2),ROWS($1:52)),1),\"\")","v":""}]
[{"$f":"IFERROR(INDEX(Tableau_de_suivi[[Nom/Désignation]:[Clôturé]],SMALL(IF(Tableau_de_suivi[Type d''acte]=$B$1,ROW(Tableau_de_suivi[N°])-2),ROWS($1:53)),1),\"\")","v":""}]
[{"$f":"IFERROR(INDEX(Tableau_de_suivi[[Nom/Désignation]:[Clôturé]],SMALL(IF(Tableau_de_suivi[Type d''acte]=$B$1,ROW(Tableau_de_suivi[N°])-2),ROWS($1:54)),1),\"\")","v":""}]
[{"$f":"IFERROR(INDEX(Tableau_de_suivi[[Nom/Désignation]:[Clôturé]],SMALL(IF(Tableau_de_suivi[Type d''acte]=$B$1,ROW(Tableau_de_suivi[N°])-2),ROWS($1:55)),1),\"\")","v":""}]
[{"$f":"IFERROR(INDEX(Tableau_de_suivi[[Nom/Désignation]:[Clôturé]],SMALL(IF(Tableau_de_suivi[Type d''acte]=$B$1,ROW(Tableau_de_suivi[N°])-2),ROWS($1:56)),1),\"\")","v":""}]
[{"$f":"IFERROR(INDEX(Tableau_de_suivi[[Nom/Désignation]:[Clôturé]],SMALL(IF(Tableau_de_suivi[Type d''acte]=$B$1,ROW(Tableau_de_suivi[N°])-2),ROWS($1:57)),1),\"\")","v":""}]
[{"$f":"IFERROR(INDEX(Tableau_de_suivi[[Nom/Désignation]:[Clôturé]],SMALL(IF(Tableau_de_suivi[Type d''acte]=$B$1,ROW(Tableau_de_suivi[N°])-2),ROWS($1:58)),1),\"\")","v":""}]
[{"$f":"IFERROR(INDEX(Tableau_de_suivi[[Nom/Désignation]:[Clôturé]],SMALL(IF(Tableau_de_suivi[Type d''acte]=$B$1,ROW(Tableau_de_suivi[N°])-2),ROWS($1:59)),1),\"\")","v":""}]
[{"$f":"IFERROR(INDEX(Tableau_de_suivi[[Nom/Désignation]:[Clôturé]],SMALL(IF(Tableau_de_suivi[Type d''acte]=$B$1,ROW(Tableau_de_suivi[N°])-2),ROWS($1:60)),1),\"\")","v":""}]
[{"$f":"IFERROR(INDEX(Tableau_de_suivi[[Nom/Désignation]:[Clôturé]],SMALL(IF(Tableau_de_suivi[Type d''acte]=$B$1,ROW(Tableau_de_suivi[N°])-2),ROWS($1:61)),1),\"\")","v":""}]
[{"$f":"IFERROR(INDEX(Tableau_de_suivi[[Nom/Désignation]:[Clôturé]],SMALL(IF(Tableau_de_suivi[Type d''acte]=$B$1,ROW(Tableau_de_suivi[N°])-2),ROWS($1:62)),1),\"\")","v":""}]
[{"$f":"IFERROR(INDEX(Tableau_de_suivi[[Nom/Désignation]:[Clôturé]],SMALL(IF(Tableau_de_suivi[Type d''acte]=$B$1,ROW(Tableau_de_suivi[N°])-2),ROWS($1:63)),1),\"\")","v":""}]
[{"$f":"IFERROR(INDEX(Tableau_de_suivi[[Nom/Désignation]:[Clôturé]],SMALL(IF(Tableau_de_suivi[Type d''acte]=$B$1,ROW(Tableau_de_suivi[N°])-2),ROWS($1:64)),1),\"\")","v":""}]
[{"$f":"IFERROR(INDEX(Tableau_de_suivi[[Nom/Désignation]:[Clôturé]],SMALL(IF(Tableau_de_suivi[Type d''acte]=$B$1,ROW(Tableau_de_suivi[N°])-2),ROWS($1:65)),1),\"\")","v":""}]
[{"$f":"IFERROR(INDEX(Tableau_de_suivi[[Nom/Désignation]:[Clôturé]],SMALL(IF(Tableau_de_suivi[Type d''acte]=$B$1,ROW(Tableau_de_suivi[N°])-2),ROWS($1:66)),1),\"\")","v":""}]
[{"$f":"IFERROR(INDEX(Tableau_de_suivi[[Nom/Désignation]:[Clôturé]],SMALL(IF(Tableau_de_suivi[Type d''acte]=$B$1,ROW(Tableau_de_suivi[N°])-2),ROWS($1:67)),1),\"\")","v":""}]
[{"$f":"IFERROR(INDEX(Tableau_de_suivi[[Nom/Désignation]:[Clôturé]],SMALL(IF(Tableau_de_suivi[Type d''acte]=$B$1,ROW(Tableau_de_suivi[N°])-2),ROWS($1:68)),1),\"\")","v":""}]
[{"$f":"IFERROR(INDEX(Tableau_de_suivi[[Nom/Désignation]:[Clôturé]],SMALL(IF(Tableau_de_suivi[Type d''acte]=$B$1,ROW(Tableau_de_suivi[N°])-2),ROWS($1:69)),1),\"\")","v":""}]
[{"$f":"IFERROR(INDEX(Tableau_de_suivi[[Nom/Désignation]:[Clôturé]],SMALL(IF(Tableau_de_suivi[Type d''acte]=$B$1,ROW(Tableau_de_suivi[N°])-2),ROWS($1:70)),1),\"\")","v":""}]
[{"$f":"IFERROR(INDEX(Tableau_de_suivi[[Nom/Désignation]:[Clôturé]],SMALL(IF(Tableau_de_suivi[Type d''acte]=$B$1,ROW(Tableau_de_suivi[N°])-2),ROWS($1:71)),1),\"\")","v":""}]
[{"$f":"IFERROR(INDEX(Tableau_de_suivi[[Nom/Désignation]:[Clôturé]],SMALL(IF(Tableau_de_suivi[Type d''acte]=$B$1,ROW(Tableau_de_suivi[N°])-2),ROWS($1:72)),1),\"\")","v":""}]
[{"$f":"IFERROR(INDEX(Tableau_de_suivi[[Nom/Désignation]:[Clôturé]],SMALL(IF(Tableau_de_suivi[Type d''acte]=$B$1,ROW(Tableau_de_suivi[N°])-2),ROWS($1:73)),1),\"\")","v":""}]
[{"$f":"IFERROR(INDEX(Tableau_de_suivi[[Nom/Désignation]:[Clôturé]],SMALL(IF(Tableau_de_suivi[Type d''acte]=$B$1,ROW(Tableau_de_suivi[N°])-2),ROWS($1:74)),1),\"\")","v":""}]
[{"$f":"IFERROR(INDEX(Tableau_de_suivi[[Nom/Désignation]:[Clôturé]],SMALL(IF(Tableau_de_suivi[Type d''acte]=$B$1,ROW(Tableau_de_suivi[N°])-2),ROWS($1:75)),1),\"\")","v":""}]
[{"$f":"IFERROR(INDEX(Tableau_de_suivi[[Nom/Désignation]:[Clôturé]],SMALL(IF(Tableau_de_suivi[Type d''acte]=$B$1,ROW(Tableau_de_suivi[N°])-2),ROWS($1:76)),1),\"\")","v":""}]
[{"$f":"IFERROR(INDEX(Tableau_de_suivi[[Nom/Désignation]:[Clôturé]],SMALL(IF(Tableau_de_suivi[Type d''acte]=$B$1,ROW(Tableau_de_suivi[N°])-2),ROWS($1:77)),1),\"\")","v":""}]
[{"$f":"IFERROR(INDEX(Tableau_de_suivi[[Nom/Désignation]:[Clôturé]],SMALL(IF(Tableau_de_suivi[Type d''acte]=$B$1,ROW(Tableau_de_suivi[N°])-2),ROWS($1:78)),1),\"\")","v":""}]
[{"$f":"IFERROR(INDEX(Tableau_de_suivi[[Nom/Désignation]:[Clôturé]],SMALL(IF(Tableau_de_suivi[Type d''acte]=$B$1,ROW(Tableau_de_suivi[N°])-2),ROWS($1:79)),1),\"\")","v":""}]
[{"$f":"IFERROR(INDEX(Tableau_de_suivi[[Nom/Désignation]:[Clôturé]],SMALL(IF(Tableau_de_suivi[Type d''acte]=$B$1,ROW(Tableau_de_suivi[N°])-2),ROWS($1:80)),1),\"\")","v":""}]
[{"$f":"IFERROR(INDEX(Tableau_de_suivi[[Nom/Désignation]:[Clôturé]],SMALL(IF(Tableau_de_suivi[Type d''acte]=$B$1,ROW(Tableau_de_suivi[N°])-2),ROWS($1:81)),1),\"\")","v":""}]
[{"$f":"IFERROR(INDEX(Tableau_de_suivi[[Nom/Désignation]:[Clôturé]],SMALL(IF(Tableau_de_suivi[Type d''acte]=$B$1,ROW(Tableau_de_suivi[N°])-2),ROWS($1:82)),1),\"\")","v":""}]
[{"$f":"IFERROR(INDEX(Tableau_de_suivi[[Nom/Désignation]:[Clôturé]],SMALL(IF(Tableau_de_suivi[Type d''acte]=$B$1,ROW(Tableau_de_suivi[N°])-2),ROWS($1:83)),1),\"\")","v":""}]
[{"$f":"IFERROR(INDEX(Tableau_de_suivi[[Nom/Désignation]:[Clôturé]],SMALL(IF(Tableau_de_suivi[Type d''acte]=$B$1,ROW(Tableau_de_suivi[N°])-2),ROWS($1:84)),1),\"\")","v":""}]
[{"$f":"IFERROR(INDEX(Tableau_de_suivi[[Nom/Désignation]:[Clôturé]],SMALL(IF(Tableau_de_suivi[Type d''acte]=$B$1,ROW(Tableau_de_suivi[N°])-2),ROWS($1:85)),1),\"\")","v":""}]
[{"$f":"IFERROR(INDEX(Tableau_de_suivi[[Nom/Désignation]:[Clôturé]],SMALL(IF(Tableau_de_suivi[Type d''acte]=$B$1,ROW(Tableau_de_suivi[N°])-2),ROWS($1:86)),1),\"\")","v":""}]
[{"$f":"IFERROR(INDEX(Tableau_de_suivi[[Nom/Désignation]:[Clôturé]],SMALL(IF(Tableau_de_suivi[Type d''acte]=$B$1,ROW(Tableau_de_suivi[N°])-2),ROWS($1:87)),1),\"\")","v":""}]
[{"$f":"IFERROR(INDEX(Tableau_de_suivi[[Nom/Désignation]:[Clôturé]],SMALL(IF(Tableau_de_suivi[Type d''acte]=$B$1,ROW(Tableau_de_suivi[N°])-2),ROWS($1:88)),1),\"\")","v":""}]
[{"$f":"IFERROR(INDEX(Tableau_de_suivi[[Nom/Désignation]:[Clôturé]],SMALL(IF(Tableau_de_suivi[Type d''acte]=$B$1,ROW(Tableau_de_suivi[N°])-2),ROWS($1:89)),1),\"\")","v":""}]
[{"$f":"IFERROR(INDEX(Tableau_de_suivi[[Nom/Désignation]:[Clôturé]],SMALL(IF(Tableau_de_suivi[Type d''acte]=$B$1,ROW(Tableau_de_suivi[N°])-2),ROWS($1:90)),1),\"\")","v":""}]
[{"$f":"IFERROR(INDEX(Tableau_de_suivi[[Nom/Désignation]:[Clôturé]],SMALL(IF(Tableau_de_suivi[Type d''acte]=$B$1,ROW(Tableau_de_suivi[N°])-2),ROWS($1:91)),1),\"\")","v":""}]
[{"$f":"IFERROR(INDEX(Tableau_de_suivi[[Nom/Désignation]:[Clôturé]],SMALL(IF(Tableau_de_suivi[Type d''acte]=$B$1,ROW(Tableau_de_suivi[N°])-2),ROWS($1:92)),1),\"\")","v":""}]
[{"$f":"IFERROR(INDEX(Tableau_de_suivi[[Nom/Désignation]:[Clôturé]],SMALL(IF(Tableau_de_suivi[Type d''acte]=$B$1,ROW(Tableau_de_suivi[N°])-2),ROWS($1:93)),1),\"\")","v":""}]
[{"$f":"IFERROR(INDEX(Tableau_de_suivi[[Nom/Désignation]:[Clôturé]],SMALL(IF(Tableau_de_suivi[Type d''acte]=$B$1,ROW(Tableau_de_suivi[N°])-2),ROWS($1:94)),1),\"\")","v":""}]
[{"$f":"IFERROR(INDEX(Tableau_de_suivi[[Nom/Désignation]:[Clôturé]],SMALL(IF(Tableau_de_suivi[Type d''acte]=$B$1,ROW(Tableau_de_suivi[N°])-2),ROWS($1:95)),1),\"\")","v":""}]
[{"$f":"IFERROR(INDEX(Tableau_de_suivi[[Nom/Désignation]:[Clôturé]],SMALL(IF(Tableau_de_suivi[Type d''acte]=$B$1,ROW(Tableau_de_suivi[N°])-2),ROWS($1:96)),1),\"\")","v":""}]
[{"$f":"IFERROR(INDEX(Tableau_de_suivi[[Nom/Désignation]:[Clôturé]],SMALL(IF(Tableau_de_suivi[Type d''acte]=$B$1,ROW(Tableau_de_suivi[N°])-2),ROWS($1:97)),1),\"\")","v":""}]
[{"$f":"IFERROR(INDEX(Tableau_de_suivi[[Nom/Désignation]:[Clôturé]],SMALL(IF(Tableau_de_suivi[Type d''acte]=$B$1,ROW(Tableau_de_suivi[N°])-2),ROWS($1:98)),1),\"\")","v":""}]
[{"$f":"IFERROR(INDEX(Tableau_de_suivi[[Nom/Désignation]:[Clôturé]],SMALL(IF(Tableau_de_suivi[Type d''acte]=$B$1,ROW(Tableau_de_suivi[N°])-2),ROWS($1:99)),1),\"\")","v":""}]
[{"$f":"IFERROR(INDEX(Tableau_de_suivi[[Nom/Désignation]:[Clôturé]],SMALL(IF(Tableau_de_suivi[Type d''acte]=$B$1,ROW(Tableau_de_suivi[N°])-2),ROWS($1:100)),1),\"\")","v":""}]

{"sheet":"Demande inscription TVA","index":6,"n_rows":100,"n_cols":12,"rows_kept":100,"cut":false,"hidden":false,"merged":[[0,1,0,11]]}
[null,"Demande inscription TVA "]
[{"$f":"VLOOKUP($B$1,Sources!$F$3:$R$19,COLUMN()+1,FALSE)","v":"NOM"},{"$f":"VLOOKUP($B$1,Sources!$F$3:$R$19,COLUMN()+1,FALSE)","v":"Formulaire de demande "},{"$f":"VLOOKUP($B$1,Sources!$F$3:$R$19,COLUMN()+1,FALSE)","v":"Copie statuts "},{"$f":"VLOOKUP($B$1,Sources!$F$3:$R$19,COLUMN()+1,FALSE)","v":"Contrat de bail"},{"$f":"VLOOKUP($B$1,Sources!$F$3:$R$19,COLUMN()+1,FALSE)","v":"ID gérant"},{"$f":"VLOOKUP($B$1,Sources!$F$3:$R$19,COLUMN()+1,FALSE)","v":"Copie autorisation établissement "},{"$f":"VLOOKUP($B$1,Sources!$F$3:$R$19,COLUMN()+1,FALSE)","v":"Relevé d'identité bancaire "},{"$f":"VLOOKUP($B$1,Sources!$F$3:$R$19,COLUMN()+1,FALSE)","v":0},{"$f":"VLOOKUP($B$1,Sources!$F$3:$R$19,COLUMN()+1,FALSE)","v":0},{"$f":"VLOOKUP($B$1,Sources!$F$3:$R$19,COLUMN()+1,FALSE)","v":0},{"$f":"VLOOKUP($B$1,Sources!$F$3:$R$19,COLUMN()+1,FALSE)","v":0},{"$f":"VLOOKUP($B$1,Sources!$F$3:$R$19,COLUMN()+1,FALSE)","v":0}]
["Colonne1","Colonne2","Colonne3","Colonne4","Colonne5","Colonne6","Colonne7","Colonne8","Colonne9","Colonne10","Colonne11","Colonne12"]
[{"$f":"IFERROR(INDEX(Tableau_de_suivi[[Nom/Désignation]:[Clôturé]],SMALL(IF(Tableau_de_suivi[Type d''acte]=$B$1,ROW(Tableau_de_suivi[N°])-2),ROWS($1:1)),1),\"\")","v":"Michel"}]
[{"$f":"IFERROR(INDEX(Tableau_de_suivi[[Nom/Désignation]:[Clôturé]],SMALL(IF(Tableau_de_suivi[Type d''acte]=$B$1,ROW(Tableau_de_suivi[N°])-2),ROWS($1:2)),1),\"\")","v":""}]
[{"$f":"IFERROR(INDEX(Tableau_de_suivi[[Nom/Désignation]:[Clôturé]],SMALL(IF(Tableau_de_suivi[Type d''acte]=$B$1,ROW(Tableau_de_suivi[N°])-2),ROWS($1:3)),1),\"\")","v":""}]
[{"$f":"IFERROR(INDEX(Tableau_de_suivi[[Nom/Désignation]:[Clôturé]],SMALL(IF(Tableau_de_suivi[Type d''acte]=$B$1,ROW(Tableau_de_suivi[N°])-2),ROWS($1:4)),1),\"\")","v":""}]
[{"$f":"IFERROR(INDEX(Tableau_de_suivi[[Nom/Désignation]:[Clôturé]],SMALL(IF(Tableau_de_suivi[Type d''acte]=$B$1,ROW(Tableau_de_suivi[N°])-2),ROWS($1:5)),1),\"\")","v":""}]
[{"$f":"IFERROR(INDEX(Tableau_de_suivi[[Nom/Désignation]:[Clôturé]],SMALL(IF(Tableau_de_suivi[Type d''acte]=$B$1,ROW(Tableau_de_suivi[N°])-2),ROWS($1:6)),1),\"\")","v":""}]
[{"$f":"IFERROR(INDEX(Tableau_de_suivi[[Nom/Désignation]:[Clôturé]],SMALL(IF(Tableau_de_suivi[Type d''acte]=$B$1,ROW(Tableau_de_suivi[N°])-2),ROWS($1:7)),1),\"\")","v":""}]
[{"$f":"IFERROR(INDEX(Tableau_de_suivi[[Nom/Désignation]:[Clôturé]],SMALL(IF(Tableau_de_suivi[Type d''acte]=$B$1,ROW(Tableau_de_suivi[N°])-2),ROWS($1:8)),1),\"\")","v":""}]
[{"$f":"IFERROR(INDEX(Tableau_de_suivi[[Nom/Désignation]:[Clôturé]],SMALL(IF(Tableau_de_suivi[Type d''acte]=$B$1,ROW(Tableau_de_suivi[N°])-2),ROWS($1:9)),1),\"\")","v":""}]
[{"$f":"IFERROR(INDEX(Tableau_de_suivi[[Nom/Désignation]:[Clôturé]],SMALL(IF(Tableau_de_suivi[Type d''acte]=$B$1,ROW(Tableau_de_suivi[N°])-2),ROWS($1:10)),1),\"\")","v":""}]
[{"$f":"IFERROR(INDEX(Tableau_de_suivi[[Nom/Désignation]:[Clôturé]],SMALL(IF(Tableau_de_suivi[Type d''acte]=$B$1,ROW(Tableau_de_suivi[N°])-2),ROWS($1:11)),1),\"\")","v":""}]
[{"$f":"IFERROR(INDEX(Tableau_de_suivi[[Nom/Désignation]:[Clôturé]],SMALL(IF(Tableau_de_suivi[Type d''acte]=$B$1,ROW(Tableau_de_suivi[N°])-2),ROWS($1:12)),1),\"\")","v":""}]
[{"$f":"IFERROR(INDEX(Tableau_de_suivi[[Nom/Désignation]:[Clôturé]],SMALL(IF(Tableau_de_suivi[Type d''acte]=$B$1,ROW(Tableau_de_suivi[N°])-2),ROWS($1:13)),1),\"\")","v":""}]
[{"$f":"IFERROR(INDEX(Tableau_de_suivi[[Nom/Désignation]:[Clôturé]],SMALL(IF(Tableau_de_suivi[Type d''acte]=$B$1,ROW(Tableau_de_suivi[N°])-2),ROWS($1:14)),1),\"\")","v":""}]
[{"$f":"IFERROR(INDEX(Tableau_de_suivi[[Nom/Désignation]:[Clôturé]],SMALL(IF(Tableau_de_suivi[Type d''acte]=$B$1,ROW(Tableau_de_suivi[N°])-2),ROWS($1:15)),1),\"\")","v":""}]
[{"$f":"IFERROR(INDEX(Tableau_de_suivi[[Nom/Désignation]:[Clôturé]],SMALL(IF(Tableau_de_suivi[Type d''acte]=$B$1,ROW(Tableau_de_suivi[N°])-2),ROWS($1:16)),1),\"\")","v":""}]
[{"$f":"IFERROR(INDEX(Tableau_de_suivi[[Nom/Désignation]:[Clôturé]],SMALL(IF(Tableau_de_suivi[Type d''acte]=$B$1,ROW(Tableau_de_suivi[N°])-2),ROWS($1:17)),1),\"\")","v":""}]
[{"$f":"IFERROR(INDEX(Tableau_de_suivi[[Nom/Désignation]:[Clôturé]],SMALL(IF(Tableau_de_suivi[Type d''acte]=$B$1,ROW(Tableau_de_suivi[N°])-2),ROWS($1:18)),1),\"\")","v":""}]
[{"$f":"IFERROR(INDEX(Tableau_de_suivi[[Nom/Désignation]:[Clôturé]],SMALL(IF(Tableau_de_suivi[Type d''acte]=$B$1,ROW(Tableau_de_suivi[N°])-2),ROWS($1:19)),1),\"\")","v":""}]
[{"$f":"IFERROR(INDEX(Tableau_de_suivi[[Nom/Désignation]:[Clôturé]],SMALL(IF(Tableau_de_suivi[Type d''acte]=$B$1,ROW(Tableau_de_suivi[N°])-2),ROWS($1:20)),1),\"\")","v":""}]
[{"$f":"IFERROR(INDEX(Tableau_de_suivi[[Nom/Désignation]:[Clôturé]],SMALL(IF(Tableau_de_suivi[Type d''acte]=$B$1,ROW(Tableau_de_suivi[N°])-2),ROWS($1:21)),1),\"\")","v":""}]
[{"$f":"IFERROR(INDEX(Tableau_de_suivi[[Nom/Désignation]:[Clôturé]],SMALL(IF(Tableau_de_suivi[Type d''acte]=$B$1,ROW(Tableau_de_suivi[N°])-2),ROWS($1:22)),1),\"\")","v":""}]
[{"$f":"IFERROR(INDEX(Tableau_de_suivi[[Nom/Désignation]:[Clôturé]],SMALL(IF(Tableau_de_suivi[Type d''acte]=$B$1,ROW(Tableau_de_suivi[N°])-2),ROWS($1:23)),1),\"\")","v":""}]
[{"$f":"IFERROR(INDEX(Tableau_de_suivi[[Nom/Désignation]:[Clôturé]],SMALL(IF(Tableau_de_suivi[Type d''acte]=$B$1,ROW(Tableau_de_suivi[N°])-2),ROWS($1:24)),1),\"\")","v":""}]
[{"$f":"IFERROR(INDEX(Tableau_de_suivi[[Nom/Désignation]:[Clôturé]],SMALL(IF(Tableau_de_suivi[Type d''acte]=$B$1,ROW(Tableau_de_suivi[N°])-2),ROWS($1:25)),1),\"\")","v":""}]
[{"$f":"IFERROR(INDEX(Tableau_de_suivi[[Nom/Désignation]:[Clôturé]],SMALL(IF(Tableau_de_suivi[Type d''acte]=$B$1,ROW(Tableau_de_suivi[N°])-2),ROWS($1:26)),1),\"\")","v":""}]
[{"$f":"IFERROR(INDEX(Tableau_de_suivi[[Nom/Désignation]:[Clôturé]],SMALL(IF(Tableau_de_suivi[Type d''acte]=$B$1,ROW(Tableau_de_suivi[N°])-2),ROWS($1:27)),1),\"\")","v":""}]
[{"$f":"IFERROR(INDEX(Tableau_de_suivi[[Nom/Désignation]:[Clôturé]],SMALL(IF(Tableau_de_suivi[Type d''acte]=$B$1,ROW(Tableau_de_suivi[N°])-2),ROWS($1:28)),1),\"\")","v":""}]
[{"$f":"IFERROR(INDEX(Tableau_de_suivi[[Nom/Désignation]:[Clôturé]],SMALL(IF(Tableau_de_suivi[Type d''acte]=$B$1,ROW(Tableau_de_suivi[N°])-2),ROWS($1:29)),1),\"\")","v":""}]
[{"$f":"IFERROR(INDEX(Tableau_de_suivi[[Nom/Désignation]:[Clôturé]],SMALL(IF(Tableau_de_suivi[Type d''acte]=$B$1,ROW(Tableau_de_suivi[N°])-2),ROWS($1:30)),1),\"\")","v":""}]
[{"$f":"IFERROR(INDEX(Tableau_de_suivi[[Nom/Désignation]:[Clôturé]],SMALL(IF(Tableau_de_suivi[Type d''acte]=$B$1,ROW(Tableau_de_suivi[N°])-2),ROWS($1:31)),1),\"\")","v":""}]
[{"$f":"IFERROR(INDEX(Tableau_de_suivi[[Nom/Désignation]:[Clôturé]],SMALL(IF(Tableau_de_suivi[Type d''acte]=$B$1,ROW(Tableau_de_suivi[N°])-2),ROWS($1:32)),1),\"\")","v":""}]
[{"$f":"IFERROR(INDEX(Tableau_de_suivi[[Nom/Désignation]:[Clôturé]],SMALL(IF(Tableau_de_suivi[Type d''acte]=$B$1,ROW(Tableau_de_suivi[N°])-2),ROWS($1:33)),1),\"\")","v":""}]
[{"$f":"IFERROR(INDEX(Tableau_de_suivi[[Nom/Désignation]:[Clôturé]],SMALL(IF(Tableau_de_suivi[Type d''acte]=$B$1,ROW(Tableau_de_suivi[N°])-2),ROWS($1:34)),1),\"\")","v":""}]
[{"$f":"IFERROR(INDEX(Tableau_de_suivi[[Nom/Désignation]:[Clôturé]],SMALL(IF(Tableau_de_suivi[Type d''acte]=$B$1,ROW(Tableau_de_suivi[N°])-2),ROWS($1:35)),1),\"\")","v":""}]
[{"$f":"IFERROR(INDEX(Tableau_de_suivi[[Nom/Désignation]:[Clôturé]],SMALL(IF(Tableau_de_suivi[Type d''acte]=$B$1,ROW(Tableau_de_suivi[N°])-2),ROWS($1:36)),1),\"\")","v":""}]
[{"$f":"IFERROR(INDEX(Tableau_de_suivi[[Nom/Désignation]:[Clôturé]],SMALL(IF(Tableau_de_suivi[Type d''acte]=$B$1,ROW(Tableau_de_suivi[N°])-2),ROWS($1:37)),1),\"\")","v":""}]
[{"$f":"IFERROR(INDEX(Tableau_de_suivi[[Nom/Désignation]:[Clôturé]],SMALL(IF(Tableau_de_suivi[Type d''acte]=$B$1,ROW(Tableau_de_suivi[N°])-2),ROWS($1:38)),1),\"\")","v":""}]
[{"$f":"IFERROR(INDEX(Tableau_de_suivi[[Nom/Désignation]:[Clôturé]],SMALL(IF(Tableau_de_suivi[Type d''acte]=$B$1,ROW(Tableau_de_suivi[N°])-2),ROWS($1:39)),1),\"\")","v":""}]
[{"$f":"IFERROR(INDEX(Tableau_de_suivi[[Nom/Désignation]:[Clôturé]],SMALL(IF(Tableau_de_suivi[Type d''acte]=$B$1,ROW(Tableau_de_suivi[N°])-2),ROWS($1:40)),1),\"\")","v":""}]
[{"$f":"IFERROR(INDEX(Tableau_de_suivi[[Nom/Désignation]:[Clôturé]],SMALL(IF(Tableau_de_suivi[Type d''acte]=$B$1,ROW(Tableau_de_suivi[N°])-2),ROWS($1:41)),1),\"\")","v":""}]
[{"$f":"IFERROR(INDEX(Tableau_de_suivi[[Nom/Désignation]:[Clôturé]],SMALL(IF(Tableau_de_suivi[Type d''acte]=$B$1,ROW(Tableau_de_suivi[N°])-2),ROWS($1:42)),1),\"\")","v":""}]
[{"$f":"IFERROR(INDEX(Tableau_de_suivi[[Nom/Désignation]:[Clôturé]],SMALL(IF(Tableau_de_suivi[Type d''acte]=$B$1,ROW(Tableau_de_suivi[N°])-2),ROWS($1:43)),1),\"\")","v":""}]
[{"$f":"IFERROR(INDEX(Tableau_de_suivi[[Nom/Désignation]:[Clôturé]],SMALL(IF(Tableau_de_suivi[Type d''acte]=$B$1,ROW(Tableau_de_suivi[N°])-2),ROWS($1:44)),1),\"\")","v":""}]
[{"$f":"IFERROR(INDEX(Tableau_de_suivi[[Nom/Désignation]:[Clôturé]],SMALL(IF(Tableau_de_suivi[Type d''acte]=$B$1,ROW(Tableau_de_suivi[N°])-2),ROWS($1:45)),1),\"\")","v":""}]
[{"$f":"IFERROR(INDEX(Tableau_de_suivi[[Nom/Désignation]:[Clôturé]],SMALL(IF(Tableau_de_suivi[Type d''acte]=$B$1,ROW(Tableau_de_suivi[N°])-2),ROWS($1:46)),1),\"\")","v":""}]
[{"$f":"IFERROR(INDEX(Tableau_de_suivi[[Nom/Désignation]:[Clôturé]],SMALL(IF(Tableau_de_suivi[Type d''acte]=$B$1,ROW(Tableau_de_suivi[N°])-2),ROWS($1:47)),1),\"\")","v":""}]
[{"$f":"IFERROR(INDEX(Tableau_de_suivi[[Nom/Désignation]:[Clôturé]],SMALL(IF(Tableau_de_suivi[Type d''acte]=$B$1,ROW(Tableau_de_suivi[N°])-2),ROWS($1:48)),1),\"\")","v":""}]
[{"$f":"IFERROR(INDEX(Tableau_de_suivi[[Nom/Désignation]:[Clôturé]],SMALL(IF(Tableau_de_suivi[Type d''acte]=$B$1,ROW(Tableau_de_suivi[N°])-2),ROWS($1:49)),1),\"\")","v":""}]
[{"$f":"IFERROR(INDEX(Tableau_de_suivi[[Nom/Désignation]:[Clôturé]],SMALL(IF(Tableau_de_suivi[Type d''acte]=$B$1,ROW(Tableau_de_suivi[N°])-2),ROWS($1:50)),1),\"\")","v":""}]
[{"$f":"IFERROR(INDEX(Tableau_de_suivi[[Nom/Désignation]:[Clôturé]],SMALL(IF(Tableau_de_suivi[Type d''acte]=$B$1,ROW(Tableau_de_suivi[N°])-2),ROWS($1:51)),1),\"\")","v":""}]
[{"$f":"IFERROR(INDEX(Tableau_de_suivi[[Nom/Désignation]:[Clôturé]],SMALL(IF(Tableau_de_suivi[Type d''acte]=$B$1,ROW(Tableau_de_suivi[N°])-2),ROWS($1:52)),1),\"\")","v":""}]
[{"$f":"IFERROR(INDEX(Tableau_de_suivi[[Nom/Désignation]:[Clôturé]],SMALL(IF(Tableau_de_suivi[Type d''acte]=$B$1,ROW(Tableau_de_suivi[N°])-2),ROWS($1:53)),1),\"\")","v":""}]
[{"$f":"IFERROR(INDEX(Tableau_de_suivi[[Nom/Désignation]:[Clôturé]],SMALL(IF(Tableau_de_suivi[Type d''acte]=$B$1,ROW(Tableau_de_suivi[N°])-2),ROWS($1:54)),1),\"\")","v":""}]
[{"$f":"IFERROR(INDEX(Tableau_de_suivi[[Nom/Désignation]:[Clôturé]],SMALL(IF(Tableau_de_suivi[Type d''acte]=$B$1,ROW(Tableau_de_suivi[N°])-2),ROWS($1:55)),1),\"\")","v":""}]
[{"$f":"IFERROR(INDEX(Tableau_de_suivi[[Nom/Désignation]:[Clôturé]],SMALL(IF(Tableau_de_suivi[Type d''acte]=$B$1,ROW(Tableau_de_suivi[N°])-2),ROWS($1:56)),1),\"\")","v":""}]
[{"$f":"IFERROR(INDEX(Tableau_de_suivi[[Nom/Désignation]:[Clôturé]],SMALL(IF(Tableau_de_suivi[Type d''acte]=$B$1,ROW(Tableau_de_suivi[N°])-2),ROWS($1:57)),1),\"\")","v":""}]
[{"$f":"IFERROR(INDEX(Tableau_de_suivi[[Nom/Désignation]:[Clôturé]],SMALL(IF(Tableau_de_suivi[Type d''acte]=$B$1,ROW(Tableau_de_suivi[N°])-2),ROWS($1:58)),1),\"\")","v":""}]
[{"$f":"IFERROR(INDEX(Tableau_de_suivi[[Nom/Désignation]:[Clôturé]],SMALL(IF(Tableau_de_suivi[Type d''acte]=$B$1,ROW(Tableau_de_suivi[N°])-2),ROWS($1:59)),1),\"\")","v":""}]
[{"$f":"IFERROR(INDEX(Tableau_de_suivi[[Nom/Désignation]:[Clôturé]],SMALL(IF(Tableau_de_suivi[Type d''acte]=$B$1,ROW(Tableau_de_suivi[N°])-2),ROWS($1:60)),1),\"\")","v":""}]
[{"$f":"IFERROR(INDEX(Tableau_de_suivi[[Nom/Désignation]:[Clôturé]],SMALL(IF(Tableau_de_suivi[Type d''acte]=$B$1,ROW(Tableau_de_suivi[N°])-2),ROWS($1:61)),1),\"\")","v":""}]
[{"$f":"IFERROR(INDEX(Tableau_de_suivi[[Nom/Désignation]:[Clôturé]],SMALL(IF(Tableau_de_suivi[Type d''acte]=$B$1,ROW(Tableau_de_suivi[N°])-2),ROWS($1:62)),1),\"\")","v":""}]
[{"$f":"IFERROR(INDEX(Tableau_de_suivi[[Nom/Désignation]:[Clôturé]],SMALL(IF(Tableau_de_suivi[Type d''acte]=$B$1,ROW(Tableau_de_suivi[N°])-2),ROWS($1:63)),1),\"\")","v":""}]
[{"$f":"IFERROR(INDEX(Tableau_de_suivi[[Nom/Désignation]:[Clôturé]],SMALL(IF(Tableau_de_suivi[Type d''acte]=$B$1,ROW(Tableau_de_suivi[N°])-2),ROWS($1:64)),1),\"\")","v":""}]
[{"$f":"IFERROR(INDEX(Tableau_de_suivi[[Nom/Désignation]:[Clôturé]],SMALL(IF(Tableau_de_suivi[Type d''acte]=$B$1,ROW(Tableau_de_suivi[N°])-2),ROWS($1:65)),1),\"\")","v":""}]
[{"$f":"IFERROR(INDEX(Tableau_de_suivi[[Nom/Désignation]:[Clôturé]],SMALL(IF(Tableau_de_suivi[Type d''acte]=$B$1,ROW(Tableau_de_suivi[N°])-2),ROWS($1:66)),1),\"\")","v":""}]
[{"$f":"IFERROR(INDEX(Tableau_de_suivi[[Nom/Désignation]:[Clôturé]],SMALL(IF(Tableau_de_suivi[Type d''acte]=$B$1,ROW(Tableau_de_suivi[N°])-2),ROWS($1:67)),1),\"\")","v":""}]
[{"$f":"IFERROR(INDEX(Tableau_de_suivi[[Nom/Désignation]:[Clôturé]],SMALL(IF(Tableau_de_suivi[Type d''acte]=$B$1,ROW(Tableau_de_suivi[N°])-2),ROWS($1:68)),1),\"\")","v":""}]
[{"$f":"IFERROR(INDEX(Tableau_de_suivi[[Nom/Désignation]:[Clôturé]],SMALL(IF(Tableau_de_suivi[Type d''acte]=$B$1,ROW(Tableau_de_suivi[N°])-2),ROWS($1:69)),1),\"\")","v":""}]
[{"$f":"IFERROR(INDEX(Tableau_de_suivi[[Nom/Désignation]:[Clôturé]],SMALL(IF(Tableau_de_suivi[Type d''acte]=$B$1,ROW(Tableau_de_suivi[N°])-2),ROWS($1:70)),1),\"\")","v":""}]
[{"$f":"IFERROR(INDEX(Tableau_de_suivi[[Nom/Désignation]:[Clôturé]],SMALL(IF(Tableau_de_suivi[Type d''acte]=$B$1,ROW(Tableau_de_suivi[N°])-2),ROWS($1:71)),1),\"\")","v":""}]
[{"$f":"IFERROR(INDEX(Tableau_de_suivi[[Nom/Désignation]:[Clôturé]],SMALL(IF(Tableau_de_suivi[Type d''acte]=$B$1,ROW(Tableau_de_suivi[N°])-2),ROWS($1:72)),1),\"\")","v":""}]
[{"$f":"IFERROR(INDEX(Tableau_de_suivi[[Nom/Désignation]:[Clôturé]],SMALL(IF(Tableau_de_suivi[Type d''acte]=$B$1,ROW(Tableau_de_suivi[N°])-2),ROWS($1:73)),1),\"\")","v":""}]
[{"$f":"IFERROR(INDEX(Tableau_de_suivi[[Nom/Désignation]:[Clôturé]],SMALL(IF(Tableau_de_suivi[Type d''acte]=$B$1,ROW(Tableau_de_suivi[N°])-2),ROWS($1:74)),1),\"\")","v":""}]
[{"$f":"IFERROR(INDEX(Tableau_de_suivi[[Nom/Désignation]:[Clôturé]],SMALL(IF(Tableau_de_suivi[Type d''acte]=$B$1,ROW(Tableau_de_suivi[N°])-2),ROWS($1:75)),1),\"\")","v":""}]
[{"$f":"IFERROR(INDEX(Tableau_de_suivi[[Nom/Désignation]:[Clôturé]],SMALL(IF(Tableau_de_suivi[Type d''acte]=$B$1,ROW(Tableau_de_suivi[N°])-2),ROWS($1:76)),1),\"\")","v":""}]
[{"$f":"IFERROR(INDEX(Tableau_de_suivi[[Nom/Désignation]:[Clôturé]],SMALL(IF(Tableau_de_suivi[Type d''acte]=$B$1,ROW(Tableau_de_suivi[N°])-2),ROWS($1:77)),1),\"\")","v":""}]
[{"$f":"IFERROR(INDEX(Tableau_de_suivi[[Nom/Désignation]:[Clôturé]],SMALL(IF(Tableau_de_suivi[Type d''acte]=$B$1,ROW(Tableau_de_suivi[N°])-2),ROWS($1:78)),1),\"\")","v":""}]
[{"$f":"IFERROR(INDEX(Tableau_de_suivi[[Nom/Désignation]:[Clôturé]],SMALL(IF(Tableau_de_suivi[Type d''acte]=$B$1,ROW(Tableau_de_suivi[N°])-2),ROWS($1:79)),1),\"\")","v":""}]
[{"$f":"IFERROR(INDEX(Tableau_de_suivi[[Nom/Désignation]:[Clôturé]],SMALL(IF(Tableau_de_suivi[Type d''acte]=$B$1,ROW(Tableau_de_suivi[N°])-2),ROWS($1:80)),1),\"\")","v":""}]
[{"$f":"IFERROR(INDEX(Tableau_de_suivi[[Nom/Désignation]:[Clôturé]],SMALL(IF(Tableau_de_suivi[Type d''acte]=$B$1,ROW(Tableau_de_suivi[N°])-2),ROWS($1:81)),1),\"\")","v":""}]
[{"$f":"IFERROR(INDEX(Tableau_de_suivi[[Nom/Désignation]:[Clôturé]],SMALL(IF(Tableau_de_suivi[Type d''acte]=$B$1,ROW(Tableau_de_suivi[N°])-2),ROWS($1:82)),1),\"\")","v":""}]
[{"$f":"IFERROR(INDEX(Tableau_de_suivi[[Nom/Désignation]:[Clôturé]],SMALL(IF(Tableau_de_suivi[Type d''acte]=$B$1,ROW(Tableau_de_suivi[N°])-2),ROWS($1:83)),1),\"\")","v":""}]
[{"$f":"IFERROR(INDEX(Tableau_de_suivi[[Nom/Désignation]:[Clôturé]],SMALL(IF(Tableau_de_suivi[Type d''acte]=$B$1,ROW(Tableau_de_suivi[N°])-2),ROWS($1:84)),1),\"\")","v":""}]
[{"$f":"IFERROR(INDEX(Tableau_de_suivi[[Nom/Désignation]:[Clôturé]],SMALL(IF(Tableau_de_suivi[Type d''acte]=$B$1,ROW(Tableau_de_suivi[N°])-2),ROWS($1:85)),1),\"\")","v":""}]
[{"$f":"IFERROR(INDEX(Tableau_de_suivi[[Nom/Désignation]:[Clôturé]],SMALL(IF(Tableau_de_suivi[Type d''acte]=$B$1,ROW(Tableau_de_suivi[N°])-2),ROWS($1:86)),1),\"\")","v":""}]
[{"$f":"IFERROR(INDEX(Tableau_de_suivi[[Nom/Désignation]:[Clôturé]],SMALL(IF(Tableau_de_suivi[Type d''acte]=$B$1,ROW(Tableau_de_suivi[N°])-2),ROWS($1:87)),1),\"\")","v":""}]
[{"$f":"IFERROR(INDEX(Tableau_de_suivi[[Nom/Désignation]:[Clôturé]],SMALL(IF(Tableau_de_suivi[Type d''acte]=$B$1,ROW(Tableau_de_suivi[N°])-2),ROWS($1:88)),1),\"\")","v":""}]
[{"$f":"IFERROR(INDEX(Tableau_de_suivi[[Nom/Désignation]:[Clôturé]],SMALL(IF(Tableau_de_suivi[Type d''acte]=$B$1,ROW(Tableau_de_suivi[N°])-2),ROWS($1:89)),1),\"\")","v":""}]
[{"$f":"IFERROR(INDEX(Tableau_de_suivi[[Nom/Désignation]:[Clôturé]],SMALL(IF(Tableau_de_suivi[Type d''acte]=$B$1,ROW(Tableau_de_suivi[N°])-2),ROWS($1:90)),1),\"\")","v":""}]
[{"$f":"IFERROR(INDEX(Tableau_de_suivi[[Nom/Désignation]:[Clôturé]],SMALL(IF(Tableau_de_suivi[Type d''acte]=$B$1,ROW(Tableau_de_suivi[N°])-2),ROWS($1:91)),1),\"\")","v":""}]
[{"$f":"IFERROR(INDEX(Tableau_de_suivi[[Nom/Désignation]:[Clôturé]],SMALL(IF(Tableau_de_suivi[Type d''acte]=$B$1,ROW(Tableau_de_suivi[N°])-2),ROWS($1:92)),1),\"\")","v":""}]
[{"$f":"IFERROR(INDEX(Tableau_de_suivi[[Nom/Désignation]:[Clôturé]],SMALL(IF(Tableau_de_suivi[Type d''acte]=$B$1,ROW(Tableau_de_suivi[N°])-2),ROWS($1:93)),1),\"\")","v":""}]
[{"$f":"IFERROR(INDEX(Tableau_de_suivi[[Nom/Désignation]:[Clôturé]],SMALL(IF(Tableau_de_suivi[Type d''acte]=$B$1,ROW(Tableau_de_suivi[N°])-2),ROWS($1:94)),1),\"\")","v":""}]
[{"$f":"IFERROR(INDEX(Tableau_de_suivi[[Nom/Désignation]:[Clôturé]],SMALL(IF(Tableau_de_suivi[Type d''acte]=$B$1,ROW(Tableau_de_suivi[N°])-2),ROWS($1:95)),1),\"\")","v":""}]
[{"$f":"IFERROR(INDEX(Tableau_de_suivi[[Nom/Désignation]:[Clôturé]],SMALL(IF(Tableau_de_suivi[Type d''acte]=$B$1,ROW(Tableau_de_suivi[N°])-2),ROWS($1:96)),1),\"\")","v":""}]
[{"$f":"IFERROR(INDEX(Tableau_de_suivi[[Nom/Désignation]:[Clôturé]],SMALL(IF(Tableau_de_suivi[Type d''acte]=$B$1,ROW(Tableau_de_suivi[N°])-2),ROWS($1:97)),1),\"\")","v":""}]

{"sheet":"Dissolution","index":7,"n_rows":100,"n_cols":12,"rows_kept":100,"cut":false,"hidden":false,"merged":[[0,1,0,11]]}
[null,"Dissolution"]
[{"$f":"VLOOKUP($B$1,Sources!$F$3:$R$19,COLUMN()+1,FALSE)","v":"NOM"},{"$f":"VLOOKUP($B$1,Sources!$F$3:$R$19,COLUMN()+1,FALSE)","v":"Déclaration BE notaire "},{"$f":"VLOOKUP($B$1,Sources!$F$3:$R$19,COLUMN()+1,FALSE)","v":"Copie ID "},{"$f":"VLOOKUP($B$1,Sources!$F$3:$R$19,COLUMN()+1,FALSE)","v":"Attestation AED"},{"$f":"VLOOKUP($B$1,Sources!$F$3:$R$19,COLUMN()+1,FALSE)","v":"Attestation ACD "},{"$f":"VLOOKUP($B$1,Sources!$F$3:$R$19,COLUMN()+1,FALSE)","v":"Attestation CCSS"},{"$f":"VLOOKUP($B$1,Sources!$F$3:$R$19,COLUMN()+1,FALSE)","v":"Copie des statuts "},{"$f":"VLOOKUP($B$1,Sources!$F$3:$R$19,COLUMN()+1,FALSE)","v":"Extrait RCSL"},{"$f":"VLOOKUP($B$1,Sources!$F$3:$R$19,COLUMN()+1,FALSE)","v":"Comptes annuels"},{"$f":"VLOOKUP($B$1,Sources!$F$3:$R$19,COLUMN()+1,FALSE)","v":"Situation arrêtée "},{"$f":"VLOOKUP($B$1,Sources!$F$3:$R$19,COLUMN()+1,FALSE)","v":"Registre des actionnaires "},{"$f":"VLOOKUP($B$1,Sources!$F$3:$R$19,COLUMN()+1,FALSE)","v":"Organigramme signé"}]
["Colonne1","Colonne2","Colonne3","Colonne4","Colonne5","Colonne6","Colonne7","Colonne8","Colonne9","Colonne10","Colonne11","Colonne12"]
[{"$f":"IFERROR(INDEX(Tableau_de_suivi[[Nom/Désignation]:[Clôturé]],SMALL(IF(Tableau_de_suivi[Type d''acte]=$B$1,ROW(Tableau_de_suivi[N°])-2),ROWS($1:1)),1),\"\")","v":""}]
[{"$f":"IFERROR(INDEX(Tableau_de_suivi[[Nom/Désignation]:[Clôturé]],SMALL(IF(Tableau_de_suivi[Type d''acte]=$B$1,ROW(Tableau_de_suivi[N°])-2),ROWS($1:2)),1),\"\")","v":""}]
[{"$f":"IFERROR(INDEX(Tableau_de_suivi[[Nom/Désignation]:[Clôturé]],SMALL(IF(Tableau_de_suivi[Type d''acte]=$B$1,ROW(Tableau_de_suivi[N°])-2),ROWS($1:3)),1),\"\")","v":""}]
[{"$f":"IFERROR(INDEX(Tableau_de_suivi[[Nom/Désignation]:[Clôturé]],SMALL(IF(Tableau_de_suivi[Type d''acte]=$B$1,ROW(Tableau_de_suivi[N°])-2),ROWS($1:4)),1),\"\")","v":""}]
[{"$f":"IFERROR(INDEX(Tableau_de_suivi[[Nom/Désignation]:[Clôturé]],SMALL(IF(Tableau_de_suivi[Type d''acte]=$B$1,ROW(Tableau_de_suivi[N°])-2),ROWS($1:5)),1),\"\")","v":""}]
[{"$f":"IFERROR(INDEX(Tableau_de_suivi[[Nom/Désignation]:[Clôturé]],SMALL(IF(Tableau_de_suivi[Type d''acte]=$B$1,ROW(Tableau_de_suivi[N°])-2),ROWS($1:6)),1),\"\")","v":""}]
[{"$f":"IFERROR(INDEX(Tableau_de_suivi[[Nom/Désignation]:[Clôturé]],SMALL(IF(Tableau_de_suivi[Type d''acte]=$B$1,ROW(Tableau_de_suivi[N°])-2),ROWS($1:7)),1),\"\")","v":""}]
[{"$f":"IFERROR(INDEX(Tableau_de_suivi[[Nom/Désignation]:[Clôturé]],SMALL(IF(Tableau_de_suivi[Type d''acte]=$B$1,ROW(Tableau_de_suivi[N°])-2),ROWS($1:8)),1),\"\")","v":""}]
[{"$f":"IFERROR(INDEX(Tableau_de_suivi[[Nom/Désignation]:[Clôturé]],SMALL(IF(Tableau_de_suivi[Type d''acte]=$B$1,ROW(Tableau_de_suivi[N°])-2),ROWS($1:9)),1),\"\")","v":""}]
[{"$f":"IFERROR(INDEX(Tableau_de_suivi[[Nom/Désignation]:[Clôturé]],SMALL(IF(Tableau_de_suivi[Type d''acte]=$B$1,ROW(Tableau_de_suivi[N°])-2),ROWS($1:10)),1),\"\")","v":""}]
[{"$f":"IFERROR(INDEX(Tableau_de_suivi[[Nom/Désignation]:[Clôturé]],SMALL(IF(Tableau_de_suivi[Type d''acte]=$B$1,ROW(Tableau_de_suivi[N°])-2),ROWS($1:11)),1),\"\")","v":""}]
[{"$f":"IFERROR(INDEX(Tableau_de_suivi[[Nom/Désignation]:[Clôturé]],SMALL(IF(Tableau_de_suivi[Type d''acte]=$B$1,ROW(Tableau_de_suivi[N°])-2),ROWS($1:12)),1),\"\")","v":""}]
[{"$f":"IFERROR(INDEX(Tableau_de_suivi[[Nom/Désignation]:[Clôturé]],SMALL(IF(Tableau_de_suivi[Type d''acte]=$B$1,ROW(Tableau_de_suivi[N°])-2),ROWS($1:13)),1),\"\")","v":""}]
[{"$f":"IFERROR(INDEX(Tableau_de_suivi[[Nom/Désignation]:[Clôturé]],SMALL(IF(Tableau_de_suivi[Type d''acte]=$B$1,ROW(Tableau_de_suivi[N°])-2),ROWS($1:14)),1),\"\")","v":""}]
[{"$f":"IFERROR(INDEX(Tableau_de_suivi[[Nom/Désignation]:[Clôturé]],SMALL(IF(Tableau_de_suivi[Type d''acte]=$B$1,ROW(Tableau_de_suivi[N°])-2),ROWS($1:15)),1),\"\")","v":""}]
[{"$f":"IFERROR(INDEX(Tableau_de_suivi[[Nom/Désignation]:[Clôturé]],SMALL(IF(Tableau_de_suivi[Type d''acte]=$B$1,ROW(Tableau_de_suivi[N°])-2),ROWS($1:16)),1),\"\")","v":""}]
[{"$f":"IFERROR(INDEX(Tableau_de_suivi[[Nom/Désignation]:[Clôturé]],SMALL(IF(Tableau_de_suivi[Type d''acte]=$B$1,ROW(Tableau_de_suivi[N°])-2),ROWS($1:17)),1),\"\")","v":""}]
[{"$f":"IFERROR(INDEX(Tableau_de_suivi[[Nom/Désignation]:[Clôturé]],SMALL(IF(Tableau_de_suivi[Type d''acte]=$B$1,ROW(Tableau_de_suivi[N°])-2),ROWS($1:18)),1),\"\")","v":""}]
[{"$f":"IFERROR(INDEX(Tableau_de_suivi[[Nom/Désignation]:[Clôturé]],SMALL(IF(Tableau_de_suivi[Type d''acte]=$B$1,ROW(Tableau_de_suivi[N°])-2),ROWS($1:19)),1),\"\")","v":""}]
[{"$f":"IFERROR(INDEX(Tableau_de_suivi[[Nom/Désignation]:[Clôturé]],SMALL(IF(Tableau_de_suivi[Type d''acte]=$B$1,ROW(Tableau_de_suivi[N°])-2),ROWS($1:20)),1),\"\")","v":""}]
[{"$f":"IFERROR(INDEX(Tableau_de_suivi[[Nom/Désignation]:[Clôturé]],SMALL(IF(Tableau_de_suivi[Type d''acte]=$B$1,ROW(Tableau_de_suivi[N°])-2),ROWS($1:21)),1),\"\")","v":""}]
[{"$f":"IFERROR(INDEX(Tableau_de_suivi[[Nom/Désignation]:[Clôturé]],SMALL(IF(Tableau_de_suivi[Type d''acte]=$B$1,ROW(Tableau_de_suivi[N°])-2),ROWS($1:22)),1),\"\")","v":""}]
[{"$f":"IFERROR(INDEX(Tableau_de_suivi[[Nom/Désignation]:[Clôturé]],SMALL(IF(Tableau_de_suivi[Type d''acte]=$B$1,ROW(Tableau_de_suivi[N°])-2),ROWS($1:23)),1),\"\")","v":""}]
[{"$f":"IFERROR(INDEX(Tableau_de_suivi[[Nom/Désignation]:[Clôturé]],SMALL(IF(Tableau_de_suivi[Type d''acte]=$B$1,ROW(Tableau_de_suivi[N°])-2),ROWS($1:24)),1),\"\")","v":""}]
[{"$f":"IFERROR(INDEX(Tableau_de_suivi[[Nom/Désignation]:[Clôturé]],SMALL(IF(Tableau_de_suivi[Type d''acte]=$B$1,ROW(Tableau_de_suivi[N°])-2),ROWS($1:25)),1),\"\")","v":""}]
[{"$f":"IFERROR(INDEX(Tableau_de_suivi[[Nom/Désignation]:[Clôturé]],SMALL(IF(Tableau_de_suivi[Type d''acte]=$B$1,ROW(Tableau_de_suivi[N°])-2),ROWS($1:26)),1),\"\")","v":""}]
[{"$f":"IFERROR(INDEX(Tableau_de_suivi[[Nom/Désignation]:[Clôturé]],SMALL(IF(Tableau_de_suivi[Type d''acte]=$B$1,ROW(Tableau_de_suivi[N°])-2),ROWS($1:27)),1),\"\")","v":""}]
[{"$f":"IFERROR(INDEX(Tableau_de_suivi[[Nom/Désignation]:[Clôturé]],SMALL(IF(Tableau_de_suivi[Type d''acte]=$B$1,ROW(Tableau_de_suivi[N°])-2),ROWS($1:28)),1),\"\")","v":""}]
[{"$f":"IFERROR(INDEX(Tableau_de_suivi[[Nom/Désignation]:[Clôturé]],SMALL(IF(Tableau_de_suivi[Type d''acte]=$B$1,ROW(Tableau_de_suivi[N°])-2),ROWS($1:29)),1),\"\")","v":""}]
[{"$f":"IFERROR(INDEX(Tableau_de_suivi[[Nom/Désignation]:[Clôturé]],SMALL(IF(Tableau_de_suivi[Type d''acte]=$B$1,ROW(Tableau_de_suivi[N°])-2),ROWS($1:30)),1),\"\")","v":""}]
[{"$f":"IFERROR(INDEX(Tableau_de_suivi[[Nom/Désignation]:[Clôturé]],SMALL(IF(Tableau_de_suivi[Type d''acte]=$B$1,ROW(Tableau_de_suivi[N°])-2),ROWS($1:31)),1),\"\")","v":""}]
[{"$f":"IFERROR(INDEX(Tableau_de_suivi[[Nom/Désignation]:[Clôturé]],SMALL(IF(Tableau_de_suivi[Type d''acte]=$B$1,ROW(Tableau_de_suivi[N°])-2),ROWS($1:32)),1),\"\")","v":""}]
[{"$f":"IFERROR(INDEX(Tableau_de_suivi[[Nom/Désignation]:[Clôturé]],SMALL(IF(Tableau_de_suivi[Type d''acte]=$B$1,ROW(Tableau_de_suivi[N°])-2),ROWS($1:33)),1),\"\")","v":""}]
[{"$f":"IFERROR(INDEX(Tableau_de_suivi[[Nom/Désignation]:[Clôturé]],SMALL(IF(Tableau_de_suivi[Type d''acte]=$B$1,ROW(Tableau_de_suivi[N°])-2),ROWS($1:34)),1),\"\")","v":""}]
[{"$f":"IFERROR(INDEX(Tableau_de_suivi[[Nom/Désignation]:[Clôturé]],SMALL(IF(Tableau_de_suivi[Type d''acte]=$B$1,ROW(Tableau_de_suivi[N°])-2),ROWS($1:35)),1),\"\")","v":""}]
[{"$f":"IFERROR(INDEX(Tableau_de_suivi[[Nom/Désignation]:[Clôturé]],SMALL(IF(Tableau_de_suivi[Type d''acte]=$B$1,ROW(Tableau_de_suivi[N°])-2),ROWS($1:36)),1),\"\")","v":""}]
[{"$f":"IFERROR(INDEX(Tableau_de_suivi[[Nom/Désignation]:[Clôturé]],SMALL(IF(Tableau_de_suivi[Type d''acte]=$B$1,ROW(Tableau_de_suivi[N°])-2),ROWS($1:37)),1),\"\")","v":""}]
[{"$f":"IFERROR(INDEX(Tableau_de_suivi[[Nom/Désignation]:[Clôturé]],SMALL(IF(Tableau_de_suivi[Type d''acte]=$B$1,ROW(Tableau_de_suivi[N°])-2),ROWS($1:38)),1),\"\")","v":""}]
[{"$f":"IFERROR(INDEX(Tableau_de_suivi[[Nom/Désignation]:[Clôturé]],SMALL(IF(Tableau_de_suivi[Type d''acte]=$B$1,ROW(Tableau_de_suivi[N°])-2),ROWS($1:39)),1),\"\")","v":""}]
[{"$f":"IFERROR(INDEX(Tableau_de_suivi[[Nom/Désignation]:[Clôturé]],SMALL(IF(Tableau_de_suivi[Type d''acte]=$B$1,ROW(Tableau_de_suivi[N°])-2),ROWS($1:40)),1),\"\")","v":""}]
[{"$f":"IFERROR(INDEX(Tableau_de_suivi[[Nom/Désignation]:[Clôturé]],SMALL(IF(Tableau_de_suivi[Type d''acte]=$B$1,ROW(Tableau_de_suivi[N°])-2),ROWS($1:41)),1),\"\")","v":""}]
[{"$f":"IFERROR(INDEX(Tableau_de_suivi[[Nom/Désignation]:[Clôturé]],SMALL(IF(Tableau_de_suivi[Type d''acte]=$B$1,ROW(Tableau_de_suivi[N°])-2),ROWS($1:42)),1),\"\")","v":""}]
[{"$f":"IFERROR(INDEX(Tableau_de_suivi[[Nom/Désignation]:[Clôturé]],SMALL(IF(Tableau_de_suivi[Type d''acte]=$B$1,ROW(Tableau_de_suivi[N°])-2),ROWS($1:43)),1),\"\")","v":""}]
[{"$f":"IFERROR(INDEX(Tableau_de_suivi[[Nom/Désignation]:[Clôturé]],SMALL(IF(Tableau_de_suivi[Type d''acte]=$B$1,ROW(Tableau_de_suivi[N°])-2),ROWS($1:44)),1),\"\")","v":""}]
[{"$f":"IFERROR(INDEX(Tableau_de_suivi[[Nom/Désignation]:[Clôturé]],SMALL(IF(Tableau_de_suivi[Type d''acte]=$B$1,ROW(Tableau_de_suivi[N°])-2),ROWS($1:45)),1),\"\")","v":""}]
[{"$f":"IFERROR(INDEX(Tableau_de_suivi[[Nom/Désignation]:[Clôturé]],SMALL(IF(Tableau_de_suivi[Type d''acte]=$B$1,ROW(Tableau_de_suivi[N°])-2),ROWS($1:46)),1),\"\")","v":""}]
[{"$f":"IFERROR(INDEX(Tableau_de_suivi[[Nom/Désignation]:[Clôturé]],SMALL(IF(Tableau_de_suivi[Type d''acte]=$B$1,ROW(Tableau_de_suivi[N°])-2),ROWS($1:47)),1),\"\")","v":""}]
[{"$f":"IFERROR(INDEX(Tableau_de_suivi[[Nom/Désignation]:[Clôturé]],SMALL(IF(Tableau_de_suivi[Type d''acte]=$B$1,ROW(Tableau_de_suivi[N°])-2),ROWS($1:48)),1),\"\")","v":""}]
[{"$f":"IFERROR(INDEX(Tableau_de_suivi[[Nom/Désignation]:[Clôturé]],SMALL(IF(Tableau_de_suivi[Type d''acte]=$B$1,ROW(Tableau_de_suivi[N°])-2),ROWS($1:49)),1),\"\")","v":""}]
[{"$f":"IFERROR(INDEX(Tableau_de_suivi[[Nom/Désignation]:[Clôturé]],SMALL(IF(Tableau_de_suivi[Type d''acte]=$B$1,ROW(Tableau_de_suivi[N°])-2),ROWS($1:50)),1),\"\")","v":""}]
[{"$f":"IFERROR(INDEX(Tableau_de_suivi[[Nom/Désignation]:[Clôturé]],SMALL(IF(Tableau_de_suivi[Type d''acte]=$B$1,ROW(Tableau_de_suivi[N°])-2),ROWS($1:51)),1),\"\")","v":""}]
[{"$f":"IFERROR(INDEX(Tableau_de_suivi[[Nom/Désignation]:[Clôturé]],SMALL(IF(Tableau_de_suivi[Type d''acte]=$B$1,ROW(Tableau_de_suivi[N°])-2),ROWS($1:52)),1),\"\")","v":""}]
[{"$f":"IFERROR(INDEX(Tableau_de_suivi[[Nom/Désignation]:[Clôturé]],SMALL(IF(Tableau_de_suivi[Type d''acte]=$B$1,ROW(Tableau_de_suivi[N°])-2),ROWS($1:53)),1),\"\")","v":""}]
[{"$f":"IFERROR(INDEX(Tableau_de_suivi[[Nom/Désignation]:[Clôturé]],SMALL(IF(Tableau_de_suivi[Type d''acte]=$B$1,ROW(Tableau_de_suivi[N°])-2),ROWS($1:54)),1),\"\")","v":""}]
[{"$f":"IFERROR(INDEX(Tableau_de_suivi[[Nom/Désignation]:[Clôturé]],SMALL(IF(Tableau_de_suivi[Type d''acte]=$B$1,ROW(Tableau_de_suivi[N°])-2),ROWS($1:55)),1),\"\")","v":""}]
[{"$f":"IFERROR(INDEX(Tableau_de_suivi[[Nom/Désignation]:[Clôturé]],SMALL(IF(Tableau_de_suivi[Type d''acte]=$B$1,ROW(Tableau_de_suivi[N°])-2),ROWS($1:56)),1),\"\")","v":""}]
[{"$f":"IFERROR(INDEX(Tableau_de_suivi[[Nom/Désignation]:[Clôturé]],SMALL(IF(Tableau_de_suivi[Type d''acte]=$B$1,ROW(Tableau_de_suivi[N°])-2),ROWS($1:57)),1),\"\")","v":""}]
[{"$f":"IFERROR(INDEX(Tableau_de_suivi[[Nom/Désignation]:[Clôturé]],SMALL(IF(Tableau_de_suivi[Type d''acte]=$B$1,ROW(Tableau_de_suivi[N°])-2),ROWS($1:58)),1),\"\")","v":""}]
[{"$f":"IFERROR(INDEX(Tableau_de_suivi[[Nom/Désignation]:[Clôturé]],SMALL(IF(Tableau_de_suivi[Type d''acte]=$B$1,ROW(Tableau_de_suivi[N°])-2),ROWS($1:59)),1),\"\")","v":""}]
[{"$f":"IFERROR(INDEX(Tableau_de_suivi[[Nom/Désignation]:[Clôturé]],SMALL(IF(Tableau_de_suivi[Type d''acte]=$B$1,ROW(Tableau_de_suivi[N°])-2),ROWS($1:60)),1),\"\")","v":""}]
[{"$f":"IFERROR(INDEX(Tableau_de_suivi[[Nom/Désignation]:[Clôturé]],SMALL(IF(Tableau_de_suivi[Type d''acte]=$B$1,ROW(Tableau_de_suivi[N°])-2),ROWS($1:61)),1),\"\")","v":""}]
[{"$f":"IFERROR(INDEX(Tableau_de_suivi[[Nom/Désignation]:[Clôturé]],SMALL(IF(Tableau_de_suivi[Type d''acte]=$B$1,ROW(Tableau_de_suivi[N°])-2),ROWS($1:62)),1),\"\")","v":""}]
[{"$f":"IFERROR(INDEX(Tableau_de_suivi[[Nom/Désignation]:[Clôturé]],SMALL(IF(Tableau_de_suivi[Type d''acte]=$B$1,ROW(Tableau_de_suivi[N°])-2),ROWS($1:63)),1),\"\")","v":""}]
[{"$f":"IFERROR(INDEX(Tableau_de_suivi[[Nom/Désignation]:[Clôturé]],SMALL(IF(Tableau_de_suivi[Type d''acte]=$B$1,ROW(Tableau_de_suivi[N°])-2),ROWS($1:64)),1),\"\")","v":""}]
[{"$f":"IFERROR(INDEX(Tableau_de_suivi[[Nom/Désignation]:[Clôturé]],SMALL(IF(Tableau_de_suivi[Type d''acte]=$B$1,ROW(Tableau_de_suivi[N°])-2),ROWS($1:65)),1),\"\")","v":""}]
[{"$f":"IFERROR(INDEX(Tableau_de_suivi[[Nom/Désignation]:[Clôturé]],SMALL(IF(Tableau_de_suivi[Type d''acte]=$B$1,ROW(Tableau_de_suivi[N°])-2),ROWS($1:66)),1),\"\")","v":""}]
[{"$f":"IFERROR(INDEX(Tableau_de_suivi[[Nom/Désignation]:[Clôturé]],SMALL(IF(Tableau_de_suivi[Type d''acte]=$B$1,ROW(Tableau_de_suivi[N°])-2),ROWS($1:67)),1),\"\")","v":""}]
[{"$f":"IFERROR(INDEX(Tableau_de_suivi[[Nom/Désignation]:[Clôturé]],SMALL(IF(Tableau_de_suivi[Type d''acte]=$B$1,ROW(Tableau_de_suivi[N°])-2),ROWS($1:68)),1),\"\")","v":""}]
[{"$f":"IFERROR(INDEX(Tableau_de_suivi[[Nom/Désignation]:[Clôturé]],SMALL(IF(Tableau_de_suivi[Type d''acte]=$B$1,ROW(Tableau_de_suivi[N°])-2),ROWS($1:69)),1),\"\")","v":""}]
[{"$f":"IFERROR(INDEX(Tableau_de_suivi[[Nom/Désignation]:[Clôturé]],SMALL(IF(Tableau_de_suivi[Type d''acte]=$B$1,ROW(Tableau_de_suivi[N°])-2),ROWS($1:70)),1),\"\")","v":""}]
[{"$f":"IFERROR(INDEX(Tableau_de_suivi[[Nom/Désignation]:[Clôturé]],SMALL(IF(Tableau_de_suivi[Type d''acte]=$B$1,ROW(Tableau_de_suivi[N°])-2),ROWS($1:71)),1),\"\")","v":""}]
[{"$f":"IFERROR(INDEX(Tableau_de_suivi[[Nom/Désignation]:[Clôturé]],SMALL(IF(Tableau_de_suivi[Type d''acte]=$B$1,ROW(Tableau_de_suivi[N°])-2),ROWS($1:72)),1),\"\")","v":""}]
[{"$f":"IFERROR(INDEX(Tableau_de_suivi[[Nom/Désignation]:[Clôturé]],SMALL(IF(Tableau_de_suivi[Type d''acte]=$B$1,ROW(Tableau_de_suivi[N°])-2),ROWS($1:73)),1),\"\")","v":""}]
[{"$f":"IFERROR(INDEX(Tableau_de_suivi[[Nom/Désignation]:[Clôturé]],SMALL(IF(Tableau_de_suivi[Type d''acte]=$B$1,ROW(Tableau_de_suivi[N°])-2),ROWS($1:74)),1),\"\")","v":""}]
[{"$f":"IFERROR(INDEX(Tableau_de_suivi[[Nom/Désignation]:[Clôturé]],SMALL(IF(Tableau_de_suivi[Type d''acte]=$B$1,ROW(Tableau_de_suivi[N°])-2),ROWS($1:75)),1),\"\")","v":""}]
[{"$f":"IFERROR(INDEX(Tableau_de_suivi[[Nom/Désignation]:[Clôturé]],SMALL(IF(Tableau_de_suivi[Type d''acte]=$B$1,ROW(Tableau_de_suivi[N°])-2),ROWS($1:76)),1),\"\")","v":""}]
[{"$f":"IFERROR(INDEX(Tableau_de_suivi[[Nom/Désignation]:[Clôturé]],SMALL(IF(Tableau_de_suivi[Type d''acte]=$B$1,ROW(Tableau_de_suivi[N°])-2),ROWS($1:77)),1),\"\")","v":""}]
[{"$f":"IFERROR(INDEX(Tableau_de_suivi[[Nom/Désignation]:[Clôturé]],SMALL(IF(Tableau_de_suivi[Type d''acte]=$B$1,ROW(Tableau_de_suivi[N°])-2),ROWS($1:78)),1),\"\")","v":""}]
[{"$f":"IFERROR(INDEX(Tableau_de_suivi[[Nom/Désignation]:[Clôturé]],SMALL(IF(Tableau_de_suivi[Type d''acte]=$B$1,ROW(Tableau_de_suivi[N°])-2),ROWS($1:79)),1),\"\")","v":""}]
[{"$f":"IFERROR(INDEX(Tableau_de_suivi[[Nom/Désignation]:[Clôturé]],SMALL(IF(Tableau_de_suivi[Type d''acte]=$B$1,ROW(Tableau_de_suivi[N°])-2),ROWS($1:80)),1),\"\")","v":""}]
[{"$f":"IFERROR(INDEX(Tableau_de_suivi[[Nom/Désignation]:[Clôturé]],SMALL(IF(Tableau_de_suivi[Type d''acte]=$B$1,ROW(Tableau_de_suivi[N°])-2),ROWS($1:81)),1),\"\")","v":""}]
[{"$f":"IFERROR(INDEX(Tableau_de_suivi[[Nom/Désignation]:[Clôturé]],SMALL(IF(Tableau_de_suivi[Type d''acte]=$B$1,ROW(Tableau_de_suivi[N°])-2),ROWS($1:82)),1),\"\")","v":""}]
[{"$f":"IFERROR(INDEX(Tableau_de_suivi[[Nom/Désignation]:[Clôturé]],SMALL(IF(Tableau_de_suivi[Type d''acte]=$B$1,ROW(Tableau_de_suivi[N°])-2),ROWS($1:83)),1),\"\")","v":""}]
[{"$f":"IFERROR(INDEX(Tableau_de_suivi[[Nom/Désignation]:[Clôturé]],SMALL(IF(Tableau_de_suivi[Type d''acte]=$B$1,ROW(Tableau_de_suivi[N°])-2),ROWS($1:84)),1),\"\")","v":""}]
[{"$f":"IFERROR(INDEX(Tableau_de_suivi[[Nom/Désignation]:[Clôturé]],SMALL(IF(Tableau_de_suivi[Type d''acte]=$B$1,ROW(Tableau_de_suivi[N°])-2),ROWS($1:85)),1),\"\")","v":""}]
[{"$f":"IFERROR(INDEX(Tableau_de_suivi[[Nom/Désignation]:[Clôturé]],SMALL(IF(Tableau_de_suivi[Type d''acte]=$B$1,ROW(Tableau_de_suivi[N°])-2),ROWS($1:86)),1),\"\")","v":""}]
[{"$f":"IFERROR(INDEX(Tableau_de_suivi[[Nom/Désignation]:[Clôturé]],SMALL(IF(Tableau_de_suivi[Type d''acte]=$B$1,ROW(Tableau_de_suivi[N°])-2),ROWS($1:87)),1),\"\")","v":""}]
[{"$f":"IFERROR(INDEX(Tableau_de_suivi[[Nom/Désignation]:[Clôturé]],SMALL(IF(Tableau_de_suivi[Type d''acte]=$B$1,ROW(Tableau_de_suivi[N°])-2),ROWS($1:88)),1),\"\")","v":""}]
[{"$f":"IFERROR(INDEX(Tableau_de_suivi[[Nom/Désignation]:[Clôturé]],SMALL(IF(Tableau_de_suivi[Type d''acte]=$B$1,ROW(Tableau_de_suivi[N°])-2),ROWS($1:89)),1),\"\")","v":""}]
[{"$f":"IFERROR(INDEX(Tableau_de_suivi[[Nom/Désignation]:[Clôturé]],SMALL(IF(Tableau_de_suivi[Type d''acte]=$B$1,ROW(Tableau_de_suivi[N°])-2),ROWS($1:90)),1),\"\")","v":""}]
[{"$f":"IFERROR(INDEX(Tableau_de_suivi[[Nom/Désignation]:[Clôturé]],SMALL(IF(Tableau_de_suivi[Type d''acte]=$B$1,ROW(Tableau_de_suivi[N°])-2),ROWS($1:91)),1),\"\")","v":""}]
[{"$f":"IFERROR(INDEX(Tableau_de_suivi[[Nom/Désignation]:[Clôturé]],SMALL(IF(Tableau_de_suivi[Type d''acte]=$B$1,ROW(Tableau_de_suivi[N°])-2),ROWS($1:92)),1),\"\")","v":""}]
[{"$f":"IFERROR(INDEX(Tableau_de_suivi[[Nom/Désignation]:[Clôturé]],SMALL(IF(Tableau_de_suivi[Type d''acte]=$B$1,ROW(Tableau_de_suivi[N°])-2),ROWS($1:93)),1),\"\")","v":""}]
[{"$f":"IFERROR(INDEX(Tableau_de_suivi[[Nom/Désignation]:[Clôturé]],SMALL(IF(Tableau_de_suivi[Type d''acte]=$B$1,ROW(Tableau_de_suivi[N°])-2),ROWS($1:94)),1),\"\")","v":""}]
[{"$f":"IFERROR(INDEX(Tableau_de_suivi[[Nom/Désignation]:[Clôturé]],SMALL(IF(Tableau_de_suivi[Type d''acte]=$B$1,ROW(Tableau_de_suivi[N°])-2),ROWS($1:95)),1),\"\")","v":""}]
[{"$f":"IFERROR(INDEX(Tableau_de_suivi[[Nom/Désignation]:[Clôturé]],SMALL(IF(Tableau_de_suivi[Type d''acte]=$B$1,ROW(Tableau_de_suivi[N°])-2),ROWS($1:96)),1),\"\")","v":""}]
[{"$f":"IFERROR(INDEX(Tableau_de_suivi[[Nom/Désignation]:[Clôturé]],SMALL(IF(Tableau_de_suivi[Type d''acte]=$B$1,ROW(Tableau_de_suivi[N°])-2),ROWS($1:97)),1),\"\")","v":""}]

{"sheet":"Fusion","index":8,"n_rows":100,"n_cols":12,"rows_kept":100,"cut":false,"hidden":false,"merged":[[0,1,0,11]]}
[null,"Fusion"]
[{"$f":"VLOOKUP($B$1,Sources!$F$3:$R$19,COLUMN()+1,FALSE)","v":"NOM"},{"$f":"VLOOKUP($B$1,Sources!$F$3:$R$19,COLUMN()+1,FALSE)","v":"Déclaration BE notaire "},{"$f":"VLOOKUP($B$1,Sources!$F$3:$R$19,COLUMN()+1,FALSE)","v":"Copie ID "},{"$f":"VLOOKUP($B$1,Sources!$F$3:$R$19,COLUMN()+1,FALSE)","v":"Copie des statuts "},{"$f":"VLOOKUP($B$1,Sources!$F$3:$R$19,COLUMN()+1,FALSE)","v":"Extrait RCSL"},{"$f":"VLOOKUP($B$1,Sources!$F$3:$R$19,COLUMN()+1,FALSE)","v":"Comptes annuels"},{"$f":"VLOOKUP($B$1,Sources!$F$3:$R$19,COLUMN()+1,FALSE)","v":"Situation arrêtée "},{"$f":"VLOOKUP($B$1,Sources!$F$3:$R$19,COLUMN()+1,FALSE)","v":"Registre des actionnaires "},{"$f":"VLOOKUP($B$1,Sources!$F$3:$R$19,COLUMN()+1,FALSE)","v":"Organigramme signé"},{"$f":"VLOOKUP($B$1,Sources!$F$3:$R$19,COLUMN()+1,FALSE)","v":0},{"$f":"VLOOKUP($B$1,Sources!$F$3:$R$19,COLUMN()+1,FALSE)","v":0},{"$f":"VLOOKUP($B$1,Sources!$F$3:$R$19,COLUMN()+1,FALSE)","v":0}]
["Colonne1","Colonne2","Colonne3","Colonne4","Colonne5","Colonne6","Colonne7","Colonne8","Colonne9","Colonne10","Colonne11","Colonne12"]
[{"$f":"IFERROR(INDEX(Tableau_de_suivi[[Nom/Désignation]:[Clôturé]],SMALL(IF(Tableau_de_suivi[Type d''acte]=$B$1,ROW(Tableau_de_suivi[N°])-2),ROWS($1:1)),1),\"\")","v":"Bazar"}]
[{"$f":"IFERROR(INDEX(Tableau_de_suivi[[Nom/Désignation]:[Clôturé]],SMALL(IF(Tableau_de_suivi[Type d''acte]=$B$1,ROW(Tableau_de_suivi[N°])-2),ROWS($1:2)),1),\"\")","v":""}]
[{"$f":"IFERROR(INDEX(Tableau_de_suivi[[Nom/Désignation]:[Clôturé]],SMALL(IF(Tableau_de_suivi[Type d''acte]=$B$1,ROW(Tableau_de_suivi[N°])-2),ROWS($1:3)),1),\"\")","v":""}]
[{"$f":"IFERROR(INDEX(Tableau_de_suivi[[Nom/Désignation]:[Clôturé]],SMALL(IF(Tableau_de_suivi[Type d''acte]=$B$1,ROW(Tableau_de_suivi[N°])-2),ROWS($1:4)),1),\"\")","v":""}]
[{"$f":"IFERROR(INDEX(Tableau_de_suivi[[Nom/Désignation]:[Clôturé]],SMALL(IF(Tableau_de_suivi[Type d''acte]=$B$1,ROW(Tableau_de_suivi[N°])-2),ROWS($1:5)),1),\"\")","v":""}]
[{"$f":"IFERROR(INDEX(Tableau_de_suivi[[Nom/Désignation]:[Clôturé]],SMALL(IF(Tableau_de_suivi[Type d''acte]=$B$1,ROW(Tableau_de_suivi[N°])-2),ROWS($1:6)),1),\"\")","v":""}]
[{"$f":"IFERROR(INDEX(Tableau_de_suivi[[Nom/Désignation]:[Clôturé]],SMALL(IF(Tableau_de_suivi[Type d''acte]=$B$1,ROW(Tableau_de_suivi[N°])-2),ROWS($1:7)),1),\"\")","v":""}]
[{"$f":"IFERROR(INDEX(Tableau_de_suivi[[Nom/Désignation]:[Clôturé]],SMALL(IF(Tableau_de_suivi[Type d''acte]=$B$1,ROW(Tableau_de_suivi[N°])-2),ROWS($1:8)),1),\"\")","v":""}]
[{"$f":"IFERROR(INDEX(Tableau_de_suivi[[Nom/Désignation]:[Clôturé]],SMALL(IF(Tableau_de_suivi[Type d''acte]=$B$1,ROW(Tableau_de_suivi[N°])-2),ROWS($1:9)),1),\"\")","v":""}]
[{"$f":"IFERROR(INDEX(Tableau_de_suivi[[Nom/Désignation]:[Clôturé]],SMALL(IF(Tableau_de_suivi[Type d''acte]=$B$1,ROW(Tableau_de_suivi[N°])-2),ROWS($1:10)),1),\"\")","v":""}]
[{"$f":"IFERROR(INDEX(Tableau_de_suivi[[Nom/Désignation]:[Clôturé]],SMALL(IF(Tableau_de_suivi[Type d''acte]=$B$1,ROW(Tableau_de_suivi[N°])-2),ROWS($1:11)),1),\"\")","v":""}]
[{"$f":"IFERROR(INDEX(Tableau_de_suivi[[Nom/Désignation]:[Clôturé]],SMALL(IF(Tableau_de_suivi[Type d''acte]=$B$1,ROW(Tableau_de_suivi[N°])-2),ROWS($1:12)),1),\"\")","v":""}]
[{"$f":"IFERROR(INDEX(Tableau_de_suivi[[Nom/Désignation]:[Clôturé]],SMALL(IF(Tableau_de_suivi[Type d''acte]=$B$1,ROW(Tableau_de_suivi[N°])-2),ROWS($1:13)),1),\"\")","v":""}]
[{"$f":"IFERROR(INDEX(Tableau_de_suivi[[Nom/Désignation]:[Clôturé]],SMALL(IF(Tableau_de_suivi[Type d''acte]=$B$1,ROW(Tableau_de_suivi[N°])-2),ROWS($1:14)),1),\"\")","v":""}]
[{"$f":"IFERROR(INDEX(Tableau_de_suivi[[Nom/Désignation]:[Clôturé]],SMALL(IF(Tableau_de_suivi[Type d''acte]=$B$1,ROW(Tableau_de_suivi[N°])-2),ROWS($1:15)),1),\"\")","v":""}]
[{"$f":"IFERROR(INDEX(Tableau_de_suivi[[Nom/Désignation]:[Clôturé]],SMALL(IF(Tableau_de_suivi[Type d''acte]=$B$1,ROW(Tableau_de_suivi[N°])-2),ROWS($1:16)),1),\"\")","v":""}]
[{"$f":"IFERROR(INDEX(Tableau_de_suivi[[Nom/Désignation]:[Clôturé]],SMALL(IF(Tableau_de_suivi[Type d''acte]=$B$1,ROW(Tableau_de_suivi[N°])-2),ROWS($1:17)),1),\"\")","v":""}]
[{"$f":"IFERROR(INDEX(Tableau_de_suivi[[Nom/Désignation]:[Clôturé]],SMALL(IF(Tableau_de_suivi[Type d''acte]=$B$1,ROW(Tableau_de_suivi[N°])-2),ROWS($1:18)),1),\"\")","v":""}]
[{"$f":"IFERROR(INDEX(Tableau_de_suivi[[Nom/Désignation]:[Clôturé]],SMALL(IF(Tableau_de_suivi[Type d''acte]=$B$1,ROW(Tableau_de_suivi[N°])-2),ROWS($1:19)),1),\"\")","v":""}]
[{"$f":"IFERROR(INDEX(Tableau_de_suivi[[Nom/Désignation]:[Clôturé]],SMALL(IF(Tableau_de_suivi[Type d''acte]=$B$1,ROW(Tableau_de_suivi[N°])-2),ROWS($1:20)),1),\"\")","v":""}]
[{"$f":"IFERROR(INDEX(Tableau_de_suivi[[Nom/Désignation]:[Clôturé]],SMALL(IF(Tableau_de_suivi[Type d''acte]=$B$1,ROW(Tableau_de_suivi[N°])-2),ROWS($1:21)),1),\"\")","v":""}]
[{"$f":"IFERROR(INDEX(Tableau_de_suivi[[Nom/Désignation]:[Clôturé]],SMALL(IF(Tableau_de_suivi[Type d''acte]=$B$1,ROW(Tableau_de_suivi[N°])-2),ROWS($1:22)),1),\"\")","v":""}]
[{"$f":"IFERROR(INDEX(Tableau_de_suivi[[Nom/Désignation]:[Clôturé]],SMALL(IF(Tableau_de_suivi[Type d''acte]=$B$1,ROW(Tableau_de_suivi[N°])-2),ROWS($1:23)),1),\"\")","v":""}]
[{"$f":"IFERROR(INDEX(Tableau_de_suivi[[Nom/Désignation]:[Clôturé]],SMALL(IF(Tableau_de_suivi[Type d''acte]=$B$1,ROW(Tableau_de_suivi[N°])-2),ROWS($1:24)),1),\"\")","v":""}]
[{"$f":"IFERROR(INDEX(Tableau_de_suivi[[Nom/Désignation]:[Clôturé]],SMALL(IF(Tableau_de_suivi[Type d''acte]=$B$1,ROW(Tableau_de_suivi[N°])-2),ROWS($1:25)),1),\"\")","v":""}]
[{"$f":"IFERROR(INDEX(Tableau_de_suivi[[Nom/Désignation]:[Clôturé]],SMALL(IF(Tableau_de_suivi[Type d''acte]=$B$1,ROW(Tableau_de_suivi[N°])-2),ROWS($1:26)),1),\"\")","v":""}]
[{"$f":"IFERROR(INDEX(Tableau_de_suivi[[Nom/Désignation]:[Clôturé]],SMALL(IF(Tableau_de_suivi[Type d''acte]=$B$1,ROW(Tableau_de_suivi[N°])-2),ROWS($1:27)),1),\"\")","v":""}]
[{"$f":"IFERROR(INDEX(Tableau_de_suivi[[Nom/Désignation]:[Clôturé]],SMALL(IF(Tableau_de_suivi[Type d''acte]=$B$1,ROW(Tableau_de_suivi[N°])-2),ROWS($1:28)),1),\"\")","v":""}]
[{"$f":"IFERROR(INDEX(Tableau_de_suivi[[Nom/Désignation]:[Clôturé]],SMALL(IF(Tableau_de_suivi[Type d''acte]=$B$1,ROW(Tableau_de_suivi[N°])-2),ROWS($1:29)),1),\"\")","v":""}]
[{"$f":"IFERROR(INDEX(Tableau_de_suivi[[Nom/Désignation]:[Clôturé]],SMALL(IF(Tableau_de_suivi[Type d''acte]=$B$1,ROW(Tableau_de_suivi[N°])-2),ROWS($1:30)),1),\"\")","v":""}]
[{"$f":"IFERROR(INDEX(Tableau_de_suivi[[Nom/Désignation]:[Clôturé]],SMALL(IF(Tableau_de_suivi[Type d''acte]=$B$1,ROW(Tableau_de_suivi[N°])-2),ROWS($1:31)),1),\"\")","v":""}]
[{"$f":"IFERROR(INDEX(Tableau_de_suivi[[Nom/Désignation]:[Clôturé]],SMALL(IF(Tableau_de_suivi[Type d''acte]=$B$1,ROW(Tableau_de_suivi[N°])-2),ROWS($1:32)),1),\"\")","v":""}]
[{"$f":"IFERROR(INDEX(Tableau_de_suivi[[Nom/Désignation]:[Clôturé]],SMALL(IF(Tableau_de_suivi[Type d''acte]=$B$1,ROW(Tableau_de_suivi[N°])-2),ROWS($1:33)),1),\"\")","v":""}]
[{"$f":"IFERROR(INDEX(Tableau_de_suivi[[Nom/Désignation]:[Clôturé]],SMALL(IF(Tableau_de_suivi[Type d''acte]=$B$1,ROW(Tableau_de_suivi[N°])-2),ROWS($1:34)),1),\"\")","v":""}]
[{"$f":"IFERROR(INDEX(Tableau_de_suivi[[Nom/Désignation]:[Clôturé]],SMALL(IF(Tableau_de_suivi[Type d''acte]=$B$1,ROW(Tableau_de_suivi[N°])-2),ROWS($1:35)),1),\"\")","v":""}]
[{"$f":"IFERROR(INDEX(Tableau_de_suivi[[Nom/Désignation]:[Clôturé]],SMALL(IF(Tableau_de_suivi[Type d''acte]=$B$1,ROW(Tableau_de_suivi[N°])-2),ROWS($1:36)),1),\"\")","v":""}]
[{"$f":"IFERROR(INDEX(Tableau_de_suivi[[Nom/Désignation]:[Clôturé]],SMALL(IF(Tableau_de_suivi[Type d''acte]=$B$1,ROW(Tableau_de_suivi[N°])-2),ROWS($1:37)),1),\"\")","v":""}]
[{"$f":"IFERROR(INDEX(Tableau_de_suivi[[Nom/Désignation]:[Clôturé]],SMALL(IF(Tableau_de_suivi[Type d''acte]=$B$1,ROW(Tableau_de_suivi[N°])-2),ROWS($1:38)),1),\"\")","v":""}]
[{"$f":"IFERROR(INDEX(Tableau_de_suivi[[Nom/Désignation]:[Clôturé]],SMALL(IF(Tableau_de_suivi[Type d''acte]=$B$1,ROW(Tableau_de_suivi[N°])-2),ROWS($1:39)),1),\"\")","v":""}]
[{"$f":"IFERROR(INDEX(Tableau_de_suivi[[Nom/Désignation]:[Clôturé]],SMALL(IF(Tableau_de_suivi[Type d''acte]=$B$1,ROW(Tableau_de_suivi[N°])-2),ROWS($1:40)),1),\"\")","v":""}]
[{"$f":"IFERROR(INDEX(Tableau_de_suivi[[Nom/Désignation]:[Clôturé]],SMALL(IF(Tableau_de_suivi[Type d''acte]=$B$1,ROW(Tableau_de_suivi[N°])-2),ROWS($1:41)),1),\"\")","v":""}]
[{"$f":"IFERROR(INDEX(Tableau_de_suivi[[Nom/Désignation]:[Clôturé]],SMALL(IF(Tableau_de_suivi[Type d''acte]=$B$1,ROW(Tableau_de_suivi[N°])-2),ROWS($1:42)),1),\"\")","v":""}]
[{"$f":"IFERROR(INDEX(Tableau_de_suivi[[Nom/Désignation]:[Clôturé]],SMALL(IF(Tableau_de_suivi[Type d''acte]=$B$1,ROW(Tableau_de_suivi[N°])-2),ROWS($1:43)),1),\"\")","v":""}]
[{"$f":"IFERROR(INDEX(Tableau_de_suivi[[Nom/Désignation]:[Clôturé]],SMALL(IF(Tableau_de_suivi[Type d''acte]=$B$1,ROW(Tableau_de_suivi[N°])-2),ROWS($1:44)),1),\"\")","v":""}]
[{"$f":"IFERROR(INDEX(Tableau_de_suivi[[Nom/Désignation]:[Clôturé]],SMALL(IF(Tableau_de_suivi[Type d''acte]=$B$1,ROW(Tableau_de_suivi[N°])-2),ROWS($1:45)),1),\"\")","v":""}]
[{"$f":"IFERROR(INDEX(Tableau_de_suivi[[Nom/Désignation]:[Clôturé]],SMALL(IF(Tableau_de_suivi[Type d''acte]=$B$1,ROW(Tableau_de_suivi[N°])-2),ROWS($1:46)),1),\"\")","v":""}]
[{"$f":"IFERROR(INDEX(Tableau_de_suivi[[Nom/Désignation]:[Clôturé]],SMALL(IF(Tableau_de_suivi[Type d''acte]=$B$1,ROW(Tableau_de_suivi[N°])-2),ROWS($1:47)),1),\"\")","v":""}]
[{"$f":"IFERROR(INDEX(Tableau_de_suivi[[Nom/Désignation]:[Clôturé]],SMALL(IF(Tableau_de_suivi[Type d''acte]=$B$1,ROW(Tableau_de_suivi[N°])-2),ROWS($1:48)),1),\"\")","v":""}]
[{"$f":"IFERROR(INDEX(Tableau_de_suivi[[Nom/Désignation]:[Clôturé]],SMALL(IF(Tableau_de_suivi[Type d''acte]=$B$1,ROW(Tableau_de_suivi[N°])-2),ROWS($1:49)),1),\"\")","v":""}]
[{"$f":"IFERROR(INDEX(Tableau_de_suivi[[Nom/Désignation]:[Clôturé]],SMALL(IF(Tableau_de_suivi[Type d''acte]=$B$1,ROW(Tableau_de_suivi[N°])-2),ROWS($1:50)),1),\"\")","v":""}]
[{"$f":"IFERROR(INDEX(Tableau_de_suivi[[Nom/Désignation]:[Clôturé]],SMALL(IF(Tableau_de_suivi[Type d''acte]=$B$1,ROW(Tableau_de_suivi[N°])-2),ROWS($1:51)),1),\"\")","v":""}]
[{"$f":"IFERROR(INDEX(Tableau_de_suivi[[Nom/Désignation]:[Clôturé]],SMALL(IF(Tableau_de_suivi[Type d''acte]=$B$1,ROW(Tableau_de_suivi[N°])-2),ROWS($1:52)),1),\"\")","v":""}]
[{"$f":"IFERROR(INDEX(Tableau_de_suivi[[Nom/Désignation]:[Clôturé]],SMALL(IF(Tableau_de_suivi[Type d''acte]=$B$1,ROW(Tableau_de_suivi[N°])-2),ROWS($1:53)),1),\"\")","v":""}]
[{"$f":"IFERROR(INDEX(Tableau_de_suivi[[Nom/Désignation]:[Clôturé]],SMALL(IF(Tableau_de_suivi[Type d''acte]=$B$1,ROW(Tableau_de_suivi[N°])-2),ROWS($1:54)),1),\"\")","v":""}]
[{"$f":"IFERROR(INDEX(Tableau_de_suivi[[Nom/Désignation]:[Clôturé]],SMALL(IF(Tableau_de_suivi[Type d''acte]=$B$1,ROW(Tableau_de_suivi[N°])-2),ROWS($1:55)),1),\"\")","v":""}]
[{"$f":"IFERROR(INDEX(Tableau_de_suivi[[Nom/Désignation]:[Clôturé]],SMALL(IF(Tableau_de_suivi[Type d''acte]=$B$1,ROW(Tableau_de_suivi[N°])-2),ROWS($1:56)),1),\"\")","v":""}]
[{"$f":"IFERROR(INDEX(Tableau_de_suivi[[Nom/Désignation]:[Clôturé]],SMALL(IF(Tableau_de_suivi[Type d''acte]=$B$1,ROW(Tableau_de_suivi[N°])-2),ROWS($1:57)),1),\"\")","v":""}]
[{"$f":"IFERROR(INDEX(Tableau_de_suivi[[Nom/Désignation]:[Clôturé]],SMALL(IF(Tableau_de_suivi[Type d''acte]=$B$1,ROW(Tableau_de_suivi[N°])-2),ROWS($1:58)),1),\"\")","v":""}]
[{"$f":"IFERROR(INDEX(Tableau_de_suivi[[Nom/Désignation]:[Clôturé]],SMALL(IF(Tableau_de_suivi[Type d''acte]=$B$1,ROW(Tableau_de_suivi[N°])-2),ROWS($1:59)),1),\"\")","v":""}]
[{"$f":"IFERROR(INDEX(Tableau_de_suivi[[Nom/Désignation]:[Clôturé]],SMALL(IF(Tableau_de_suivi[Type d''acte]=$B$1,ROW(Tableau_de_suivi[N°])-2),ROWS($1:60)),1),\"\")","v":""}]
[{"$f":"IFERROR(INDEX(Tableau_de_suivi[[Nom/Désignation]:[Clôturé]],SMALL(IF(Tableau_de_suivi[Type d''acte]=$B$1,ROW(Tableau_de_suivi[N°])-2),ROWS($1:61)),1),\"\")","v":""}]
[{"$f":"IFERROR(INDEX(Tableau_de_suivi[[Nom/Désignation]:[Clôturé]],SMALL(IF(Tableau_de_suivi[Type d''acte]=$B$1,ROW(Tableau_de_suivi[N°])-2),ROWS($1:62)),1),\"\")","v":""}]
[{"$f":"IFERROR(INDEX(Tableau_de_suivi[[Nom/Désignation]:[Clôturé]],SMALL(IF(Tableau_de_suivi[Type d''acte]=$B$1,ROW(Tableau_de_suivi[N°])-2),ROWS($1:63)),1),\"\")","v":""}]
[{"$f":"IFERROR(INDEX(Tableau_de_suivi[[Nom/Désignation]:[Clôturé]],SMALL(IF(Tableau_de_suivi[Type d''acte]=$B$1,ROW(Tableau_de_suivi[N°])-2),ROWS($1:64)),1),\"\")","v":""}]
[{"$f":"IFERROR(INDEX(Tableau_de_suivi[[Nom/Désignation]:[Clôturé]],SMALL(IF(Tableau_de_suivi[Type d''acte]=$B$1,ROW(Tableau_de_suivi[N°])-2),ROWS($1:65)),1),\"\")","v":""}]
[{"$f":"IFERROR(INDEX(Tableau_de_suivi[[Nom/Désignation]:[Clôturé]],SMALL(IF(Tableau_de_suivi[Type d''acte]=$B$1,ROW(Tableau_de_suivi[N°])-2),ROWS($1:66)),1),\"\")","v":""}]
[{"$f":"IFERROR(INDEX(Tableau_de_suivi[[Nom/Désignation]:[Clôturé]],SMALL(IF(Tableau_de_suivi[Type d''acte]=$B$1,ROW(Tableau_de_suivi[N°])-2),ROWS($1:67)),1),\"\")","v":""}]
[{"$f":"IFERROR(INDEX(Tableau_de_suivi[[Nom/Désignation]:[Clôturé]],SMALL(IF(Tableau_de_suivi[Type d''acte]=$B$1,ROW(Tableau_de_suivi[N°])-2),ROWS($1:68)),1),\"\")","v":""}]
[{"$f":"IFERROR(INDEX(Tableau_de_suivi[[Nom/Désignation]:[Clôturé]],SMALL(IF(Tableau_de_suivi[Type d''acte]=$B$1,ROW(Tableau_de_suivi[N°])-2),ROWS($1:69)),1),\"\")","v":""}]
[{"$f":"IFERROR(INDEX(Tableau_de_suivi[[Nom/Désignation]:[Clôturé]],SMALL(IF(Tableau_de_suivi[Type d''acte]=$B$1,ROW(Tableau_de_suivi[N°])-2),ROWS($1:70)),1),\"\")","v":""}]
[{"$f":"IFERROR(INDEX(Tableau_de_suivi[[Nom/Désignation]:[Clôturé]],SMALL(IF(Tableau_de_suivi[Type d''acte]=$B$1,ROW(Tableau_de_suivi[N°])-2),ROWS($1:71)),1),\"\")","v":""}]
[{"$f":"IFERROR(INDEX(Tableau_de_suivi[[Nom/Désignation]:[Clôturé]],SMALL(IF(Tableau_de_suivi[Type d''acte]=$B$1,ROW(Tableau_de_suivi[N°])-2),ROWS($1:72)),1),\"\")","v":""}]
[{"$f":"IFERROR(INDEX(Tableau_de_suivi[[Nom/Désignation]:[Clôturé]],SMALL(IF(Tableau_de_suivi[Type d''acte]=$B$1,ROW(Tableau_de_suivi[N°])-2),ROWS($1:73)),1),\"\")","v":""}]
[{"$f":"IFERROR(INDEX(Tableau_de_suivi[[Nom/Désignation]:[Clôturé]],SMALL(IF(Tableau_de_suivi[Type d''acte]=$B$1,ROW(Tableau_de_suivi[N°])-2),ROWS($1:74)),1),\"\")","v":""}]
[{"$f":"IFERROR(INDEX(Tableau_de_suivi[[Nom/Désignation]:[Clôturé]],SMALL(IF(Tableau_de_suivi[Type d''acte]=$B$1,ROW(Tableau_de_suivi[N°])-2),ROWS($1:75)),1),\"\")","v":""}]
[{"$f":"IFERROR(INDEX(Tableau_de_suivi[[Nom/Désignation]:[Clôturé]],SMALL(IF(Tableau_de_suivi[Type d''acte]=$B$1,ROW(Tableau_de_suivi[N°])-2),ROWS($1:76)),1),\"\")","v":""}]
[{"$f":"IFERROR(INDEX(Tableau_de_suivi[[Nom/Désignation]:[Clôturé]],SMALL(IF(Tableau_de_suivi[Type d''acte]=$B$1,ROW(Tableau_de_suivi[N°])-2),ROWS($1:77)),1),\"\")","v":""}]
[{"$f":"IFERROR(INDEX(Tableau_de_suivi[[Nom/Désignation]:[Clôturé]],SMALL(IF(Tableau_de_suivi[Type d''acte]=$B$1,ROW(Tableau_de_suivi[N°])-2),ROWS($1:78)),1),\"\")","v":""}]
[{"$f":"IFERROR(INDEX(Tableau_de_suivi[[Nom/Désignation]:[Clôturé]],SMALL(IF(Tableau_de_suivi[Type d''acte]=$B$1,ROW(Tableau_de_suivi[N°])-2),ROWS($1:79)),1),\"\")","v":""}]
[{"$f":"IFERROR(INDEX(Tableau_de_suivi[[Nom/Désignation]:[Clôturé]],SMALL(IF(Tableau_de_suivi[Type d''acte]=$B$1,ROW(Tableau_de_suivi[N°])-2),ROWS($1:80)),1),\"\")","v":""}]
[{"$f":"IFERROR(INDEX(Tableau_de_suivi[[Nom/Désignation]:[Clôturé]],SMALL(IF(Tableau_de_suivi[Type d''acte]=$B$1,ROW(Tableau_de_suivi[N°])-2),ROWS($1:81)),1),\"\")","v":""}]
[{"$f":"IFERROR(INDEX(Tableau_de_suivi[[Nom/Désignation]:[Clôturé]],SMALL(IF(Tableau_de_suivi[Type d''acte]=$B$1,ROW(Tableau_de_suivi[N°])-2),ROWS($1:82)),1),\"\")","v":""}]
[{"$f":"IFERROR(INDEX(Tableau_de_suivi[[Nom/Désignation]:[Clôturé]],SMALL(IF(Tableau_de_suivi[Type d''acte]=$B$1,ROW(Tableau_de_suivi[N°])-2),ROWS($1:83)),1),\"\")","v":""}]
[{"$f":"IFERROR(INDEX(Tableau_de_suivi[[Nom/Désignation]:[Clôturé]],SMALL(IF(Tableau_de_suivi[Type d''acte]=$B$1,ROW(Tableau_de_suivi[N°])-2),ROWS($1:84)),1),\"\")","v":""}]
[{"$f":"IFERROR(INDEX(Tableau_de_suivi[[Nom/Désignation]:[Clôturé]],SMALL(IF(Tableau_de_suivi[Type d''acte]=$B$1,ROW(Tableau_de_suivi[N°])-2),ROWS($1:85)),1),\"\")","v":""}]
[{"$f":"IFERROR(INDEX(Tableau_de_suivi[[Nom/Désignation]:[Clôturé]],SMALL(IF(Tableau_de_suivi[Type d''acte]=$B$1,ROW(Tableau_de_suivi[N°])-2),ROWS($1:86)),1),\"\")","v":""}]
[{"$f":"IFERROR(INDEX(Tableau_de_suivi[[Nom/Désignation]:[Clôturé]],SMALL(IF(Tableau_de_suivi[Type d''acte]=$B$1,ROW(Tableau_de_suivi[N°])-2),ROWS($1:87)),1),\"\")","v":""}]
[{"$f":"IFERROR(INDEX(Tableau_de_suivi[[Nom/Désignation]:[Clôturé]],SMALL(IF(Tableau_de_suivi[Type d''acte]=$B$1,ROW(Tableau_de_suivi[N°])-2),ROWS($1:88)),1),\"\")","v":""}]
[{"$f":"IFERROR(INDEX(Tableau_de_suivi[[Nom/Désignation]:[Clôturé]],SMALL(IF(Tableau_de_suivi[Type d''acte]=$B$1,ROW(Tableau_de_suivi[N°])-2),ROWS($1:89)),1),\"\")","v":""}]
[{"$f":"IFERROR(INDEX(Tableau_de_suivi[[Nom/Désignation]:[Clôturé]],SMALL(IF(Tableau_de_suivi[Type d''acte]=$B$1,ROW(Tableau_de_suivi[N°])-2),ROWS($1:90)),1),\"\")","v":""}]
[{"$f":"IFERROR(INDEX(Tableau_de_suivi[[Nom/Désignation]:[Clôturé]],SMALL(IF(Tableau_de_suivi[Type d''acte]=$B$1,ROW(Tableau_de_suivi[N°])-2),ROWS($1:91)),1),\"\")","v":""}]
[{"$f":"IFERROR(INDEX(Tableau_de_suivi[[Nom/Désignation]:[Clôturé]],SMALL(IF(Tableau_de_suivi[Type d''acte]=$B$1,ROW(Tableau_de_suivi[N°])-2),ROWS($1:92)),1),\"\")","v":""}]
[{"$f":"IFERROR(INDEX(Tableau_de_suivi[[Nom/Désignation]:[Clôturé]],SMALL(IF(Tableau_de_suivi[Type d''acte]=$B$1,ROW(Tableau_de_suivi[N°])-2),ROWS($1:93)),1),\"\")","v":""}]
[{"$f":"IFERROR(INDEX(Tableau_de_suivi[[Nom/Désignation]:[Clôturé]],SMALL(IF(Tableau_de_suivi[Type d''acte]=$B$1,ROW(Tableau_de_suivi[N°])-2),ROWS($1:94)),1),\"\")","v":""}]
[{"$f":"IFERROR(INDEX(Tableau_de_suivi[[Nom/Désignation]:[Clôturé]],SMALL(IF(Tableau_de_suivi[Type d''acte]=$B$1,ROW(Tableau_de_suivi[N°])-2),ROWS($1:95)),1),\"\")","v":""}]
[{"$f":"IFERROR(INDEX(Tableau_de_suivi[[Nom/Désignation]:[Clôturé]],SMALL(IF(Tableau_de_suivi[Type d''acte]=$B$1,ROW(Tableau_de_suivi[N°])-2),ROWS($1:96)),1),\"\")","v":""}]
[{"$f":"IFERROR(INDEX(Tableau_de_suivi[[Nom/Désignation]:[Clôturé]],SMALL(IF(Tableau_de_suivi[Type d''acte]=$B$1,ROW(Tableau_de_suivi[N°])-2),ROWS($1:97)),1),\"\")","v":""}]

{"sheet":"Scission","index":9,"n_rows":100,"n_cols":12,"rows_kept":100,"cut":false,"hidden":false,"merged":[[0,1,0,11]]}
[null,"Scission "]
[{"$f":"VLOOKUP($B$1,Sources!$F$3:$R$19,COLUMN()+1,FALSE)","v":"NOM"},{"$f":"VLOOKUP($B$1,Sources!$F$3:$R$19,COLUMN()+1,FALSE)","v":"Déclaration BE notaire "},{"$f":"VLOOKUP($B$1,Sources!$F$3:$R$19,COLUMN()+1,FALSE)","v":"Copie ID "},{"$f":"VLOOKUP($B$1,Sources!$F$3:$R$19,COLUMN()+1,FALSE)","v":"Copie des statuts "},{"$f":"VLOOKUP($B$1,Sources!$F$3:$R$19,COLUMN()+1,FALSE)","v":"Extrait RCSL"},{"$f":"VLOOKUP($B$1,Sources!$F$3:$R$19,COLUMN()+1,FALSE)","v":"Comptes annuels"},{"$f":"VLOOKUP($B$1,Sources!$F$3:$R$19,COLUMN()+1,FALSE)","v":"Situation arrêtée "},{"$f":"VLOOKUP($B$1,Sources!$F$3:$R$19,COLUMN()+1,FALSE)","v":"Registre des actionnaires "},{"$f":"VLOOKUP($B$1,Sources!$F$3:$R$19,COLUMN()+1,FALSE)","v":"Organigramme signé"},{"$f":"VLOOKUP($B$1,Sources!$F$3:$R$19,COLUMN()+1,FALSE)","v":0},{"$f":"VLOOKUP($B$1,Sources!$F$3:$R$19,COLUMN()+1,FALSE)","v":0},{"$f":"VLOOKUP($B$1,Sources!$F$3:$R$19,COLUMN()+1,FALSE)","v":0}]
["Colonne1","Colonne2","Colonne3","Colonne4","Colonne5","Colonne6","Colonne7","Colonne8","Colonne9","Colonne10","Colonne11","Colonne12"]
[{"$f":"IFERROR(INDEX(Tableau_de_suivi[[Nom/Désignation]:[Clôturé]],SMALL(IF(Tableau_de_suivi[Type d''acte]=$B$1,ROW(Tableau_de_suivi[N°])-2),ROWS($1:1)),1),\"\")","v":""}]
[{"$f":"IFERROR(INDEX(Tableau_de_suivi[[Nom/Désignation]:[Clôturé]],SMALL(IF(Tableau_de_suivi[Type d''acte]=$B$1,ROW(Tableau_de_suivi[N°])-2),ROWS($1:2)),1),\"\")","v":""}]
[{"$f":"IFERROR(INDEX(Tableau_de_suivi[[Nom/Désignation]:[Clôturé]],SMALL(IF(Tableau_de_suivi[Type d''acte]=$B$1,ROW(Tableau_de_suivi[N°])-2),ROWS($1:3)),1),\"\")","v":""}]
[{"$f":"IFERROR(INDEX(Tableau_de_suivi[[Nom/Désignation]:[Clôturé]],SMALL(IF(Tableau_de_suivi[Type d''acte]=$B$1,ROW(Tableau_de_suivi[N°])-2),ROWS($1:4)),1),\"\")","v":""}]
[{"$f":"IFERROR(INDEX(Tableau_de_suivi[[Nom/Désignation]:[Clôturé]],SMALL(IF(Tableau_de_suivi[Type d''acte]=$B$1,ROW(Tableau_de_suivi[N°])-2),ROWS($1:5)),1),\"\")","v":""}]
[{"$f":"IFERROR(INDEX(Tableau_de_suivi[[Nom/Désignation]:[Clôturé]],SMALL(IF(Tableau_de_suivi[Type d''acte]=$B$1,ROW(Tableau_de_suivi[N°])-2),ROWS($1:6)),1),\"\")","v":""}]
[{"$f":"IFERROR(INDEX(Tableau_de_suivi[[Nom/Désignation]:[Clôturé]],SMALL(IF(Tableau_de_suivi[Type d''acte]=$B$1,ROW(Tableau_de_suivi[N°])-2),ROWS($1:7)),1),\"\")","v":""}]
[{"$f":"IFERROR(INDEX(Tableau_de_suivi[[Nom/Désignation]:[Clôturé]],SMALL(IF(Tableau_de_suivi[Type d''acte]=$B$1,ROW(Tableau_de_suivi[N°])-2),ROWS($1:8)),1),\"\")","v":""}]
[{"$f":"IFERROR(INDEX(Tableau_de_suivi[[Nom/Désignation]:[Clôturé]],SMALL(IF(Tableau_de_suivi[Type d''acte]=$B$1,ROW(Tableau_de_suivi[N°])-2),ROWS($1:9)),1),\"\")","v":""}]
[{"$f":"IFERROR(INDEX(Tableau_de_suivi[[Nom/Désignation]:[Clôturé]],SMALL(IF(Tableau_de_suivi[Type d''acte]=$B$1,ROW(Tableau_de_suivi[N°])-2),ROWS($1:10)),1),\"\")","v":""}]
[{"$f":"IFERROR(INDEX(Tableau_de_suivi[[Nom/Désignation]:[Clôturé]],SMALL(IF(Tableau_de_suivi[Type d''acte]=$B$1,ROW(Tableau_de_suivi[N°])-2),ROWS($1:11)),1),\"\")","v":""}]
[{"$f":"IFERROR(INDEX(Tableau_de_suivi[[Nom/Désignation]:[Clôturé]],SMALL(IF(Tableau_de_suivi[Type d''acte]=$B$1,ROW(Tableau_de_suivi[N°])-2),ROWS($1:12)),1),\"\")","v":""}]
[{"$f":"IFERROR(INDEX(Tableau_de_suivi[[Nom/Désignation]:[Clôturé]],SMALL(IF(Tableau_de_suivi[Type d''acte]=$B$1,ROW(Tableau_de_suivi[N°])-2),ROWS($1:13)),1),\"\")","v":""}]
[{"$f":"IFERROR(INDEX(Tableau_de_suivi[[Nom/Désignation]:[Clôturé]],SMALL(IF(Tableau_de_suivi[Type d''acte]=$B$1,ROW(Tableau_de_suivi[N°])-2),ROWS($1:14)),1),\"\")","v":""}]
[{"$f":"IFERROR(INDEX(Tableau_de_suivi[[Nom/Désignation]:[Clôturé]],SMALL(IF(Tableau_de_suivi[Type d''acte]=$B$1,ROW(Tableau_de_suivi[N°])-2),ROWS($1:15)),1),\"\")","v":""}]
[{"$f":"IFERROR(INDEX(Tableau_de_suivi[[Nom/Désignation]:[Clôturé]],SMALL(IF(Tableau_de_suivi[Type d''acte]=$B$1,ROW(Tableau_de_suivi[N°])-2),ROWS($1:16)),1),\"\")","v":""}]
[{"$f":"IFERROR(INDEX(Tableau_de_suivi[[Nom/Désignation]:[Clôturé]],SMALL(IF(Tableau_de_suivi[Type d''acte]=$B$1,ROW(Tableau_de_suivi[N°])-2),ROWS($1:17)),1),\"\")","v":""}]
[{"$f":"IFERROR(INDEX(Tableau_de_suivi[[Nom/Désignation]:[Clôturé]],SMALL(IF(Tableau_de_suivi[Type d''acte]=$B$1,ROW(Tableau_de_suivi[N°])-2),ROWS($1:18)),1),\"\")","v":""}]
[{"$f":"IFERROR(INDEX(Tableau_de_suivi[[Nom/Désignation]:[Clôturé]],SMALL(IF(Tableau_de_suivi[Type d''acte]=$B$1,ROW(Tableau_de_suivi[N°])-2),ROWS($1:19)),1),\"\")","v":""}]
[{"$f":"IFERROR(INDEX(Tableau_de_suivi[[Nom/Désignation]:[Clôturé]],SMALL(IF(Tableau_de_suivi[Type d''acte]=$B$1,ROW(Tableau_de_suivi[N°])-2),ROWS($1:20)),1),\"\")","v":""}]
[{"$f":"IFERROR(INDEX(Tableau_de_suivi[[Nom/Désignation]:[Clôturé]],SMALL(IF(Tableau_de_suivi[Type d''acte]=$B$1,ROW(Tableau_de_suivi[N°])-2),ROWS($1:21)),1),\"\")","v":""}]
[{"$f":"IFERROR(INDEX(Tableau_de_suivi[[Nom/Désignation]:[Clôturé]],SMALL(IF(Tableau_de_suivi[Type d''acte]=$B$1,ROW(Tableau_de_suivi[N°])-2),ROWS($1:22)),1),\"\")","v":""}]
[{"$f":"IFERROR(INDEX(Tableau_de_suivi[[Nom/Désignation]:[Clôturé]],SMALL(IF(Tableau_de_suivi[Type d''acte]=$B$1,ROW(Tableau_de_suivi[N°])-2),ROWS($1:23)),1),\"\")","v":""}]
[{"$f":"IFERROR(INDEX(Tableau_de_suivi[[Nom/Désignation]:[Clôturé]],SMALL(IF(Tableau_de_suivi[Type d''acte]=$B$1,ROW(Tableau_de_suivi[N°])-2),ROWS($1:24)),1),\"\")","v":""}]
[{"$f":"IFERROR(INDEX(Tableau_de_suivi[[Nom/Désignation]:[Clôturé]],SMALL(IF(Tableau_de_suivi[Type d''acte]=$B$1,ROW(Tableau_de_suivi[N°])-2),ROWS($1:25)),1),\"\")","v":""}]
[{"$f":"IFERROR(INDEX(Tableau_de_suivi[[Nom/Désignation]:[Clôturé]],SMALL(IF(Tableau_de_suivi[Type d''acte]=$B$1,ROW(Tableau_de_suivi[N°])-2),ROWS($1:26)),1),\"\")","v":""}]
[{"$f":"IFERROR(INDEX(Tableau_de_suivi[[Nom/Désignation]:[Clôturé]],SMALL(IF(Tableau_de_suivi[Type d''acte]=$B$1,ROW(Tableau_de_suivi[N°])-2),ROWS($1:27)),1),\"\")","v":""}]
[{"$f":"IFERROR(INDEX(Tableau_de_suivi[[Nom/Désignation]:[Clôturé]],SMALL(IF(Tableau_de_suivi[Type d''acte]=$B$1,ROW(Tableau_de_suivi[N°])-2),ROWS($1:28)),1),\"\")","v":""}]
[{"$f":"IFERROR(INDEX(Tableau_de_suivi[[Nom/Désignation]:[Clôturé]],SMALL(IF(Tableau_de_suivi[Type d''acte]=$B$1,ROW(Tableau_de_suivi[N°])-2),ROWS($1:29)),1),\"\")","v":""}]
[{"$f":"IFERROR(INDEX(Tableau_de_suivi[[Nom/Désignation]:[Clôturé]],SMALL(IF(Tableau_de_suivi[Type d''acte]=$B$1,ROW(Tableau_de_suivi[N°])-2),ROWS($1:30)),1),\"\")","v":""}]
[{"$f":"IFERROR(INDEX(Tableau_de_suivi[[Nom/Désignation]:[Clôturé]],SMALL(IF(Tableau_de_suivi[Type d''acte]=$B$1,ROW(Tableau_de_suivi[N°])-2),ROWS($1:31)),1),\"\")","v":""}]
[{"$f":"IFERROR(INDEX(Tableau_de_suivi[[Nom/Désignation]:[Clôturé]],SMALL(IF(Tableau_de_suivi[Type d''acte]=$B$1,ROW(Tableau_de_suivi[N°])-2),ROWS($1:32)),1),\"\")","v":""}]
[{"$f":"IFERROR(INDEX(Tableau_de_suivi[[Nom/Désignation]:[Clôturé]],SMALL(IF(Tableau_de_suivi[Type d''acte]=$B$1,ROW(Tableau_de_suivi[N°])-2),ROWS($1:33)),1),\"\")","v":""}]
[{"$f":"IFERROR(INDEX(Tableau_de_suivi[[Nom/Désignation]:[Clôturé]],SMALL(IF(Tableau_de_suivi[Type d''acte]=$B$1,ROW(Tableau_de_suivi[N°])-2),ROWS($1:34)),1),\"\")","v":""}]
[{"$f":"IFERROR(INDEX(Tableau_de_suivi[[Nom/Désignation]:[Clôturé]],SMALL(IF(Tableau_de_suivi[Type d''acte]=$B$1,ROW(Tableau_de_suivi[N°])-2),ROWS($1:35)),1),\"\")","v":""}]
[{"$f":"IFERROR(INDEX(Tableau_de_suivi[[Nom/Désignation]:[Clôturé]],SMALL(IF(Tableau_de_suivi[Type d''acte]=$B$1,ROW(Tableau_de_suivi[N°])-2),ROWS($1:36)),1),\"\")","v":""}]
[{"$f":"IFERROR(INDEX(Tableau_de_suivi[[Nom/Désignation]:[Clôturé]],SMALL(IF(Tableau_de_suivi[Type d''acte]=$B$1,ROW(Tableau_de_suivi[N°])-2),ROWS($1:37)),1),\"\")","v":""}]
[{"$f":"IFERROR(INDEX(Tableau_de_suivi[[Nom/Désignation]:[Clôturé]],SMALL(IF(Tableau_de_suivi[Type d''acte]=$B$1,ROW(Tableau_de_suivi[N°])-2),ROWS($1:38)),1),\"\")","v":""}]
[{"$f":"IFERROR(INDEX(Tableau_de_suivi[[Nom/Désignation]:[Clôturé]],SMALL(IF(Tableau_de_suivi[Type d''acte]=$B$1,ROW(Tableau_de_suivi[N°])-2),ROWS($1:39)),1),\"\")","v":""}]
[{"$f":"IFERROR(INDEX(Tableau_de_suivi[[Nom/Désignation]:[Clôturé]],SMALL(IF(Tableau_de_suivi[Type d''acte]=$B$1,ROW(Tableau_de_suivi[N°])-2),ROWS($1:40)),1),\"\")","v":""}]
[{"$f":"IFERROR(INDEX(Tableau_de_suivi[[Nom/Désignation]:[Clôturé]],SMALL(IF(Tableau_de_suivi[Type d''acte]=$B$1,ROW(Tableau_de_suivi[N°])-2),ROWS($1:41)),1),\"\")","v":""}]
[{"$f":"IFERROR(INDEX(Tableau_de_suivi[[Nom/Désignation]:[Clôturé]],SMALL(IF(Tableau_de_suivi[Type d''acte]=$B$1,ROW(Tableau_de_suivi[N°])-2),ROWS($1:42)),1),\"\")","v":""}]
[{"$f":"IFERROR(INDEX(Tableau_de_suivi[[Nom/Désignation]:[Clôturé]],SMALL(IF(Tableau_de_suivi[Type d''acte]=$B$1,ROW(Tableau_de_suivi[N°])-2),ROWS($1:43)),1),\"\")","v":""}]
[{"$f":"IFERROR(INDEX(Tableau_de_suivi[[Nom/Désignation]:[Clôturé]],SMALL(IF(Tableau_de_suivi[Type d''acte]=$B$1,ROW(Tableau_de_suivi[N°])-2),ROWS($1:44)),1),\"\")","v":""}]
[{"$f":"IFERROR(INDEX(Tableau_de_suivi[[Nom/Désignation]:[Clôturé]],SMALL(IF(Tableau_de_suivi[Type d''acte]=$B$1,ROW(Tableau_de_suivi[N°])-2),ROWS($1:45)),1),\"\")","v":""}]
[{"$f":"IFERROR(INDEX(Tableau_de_suivi[[Nom/Désignation]:[Clôturé]],SMALL(IF(Tableau_de_suivi[Type d''acte]=$B$1,ROW(Tableau_de_suivi[N°])-2),ROWS($1:46)),1),\"\")","v":""}]
[{"$f":"IFERROR(INDEX(Tableau_de_suivi[[Nom/Désignation]:[Clôturé]],SMALL(IF(Tableau_de_suivi[Type d''acte]=$B$1,ROW(Tableau_de_suivi[N°])-2),ROWS($1:47)),1),\"\")","v":""}]
[{"$f":"IFERROR(INDEX(Tableau_de_suivi[[Nom/Désignation]:[Clôturé]],SMALL(IF(Tableau_de_suivi[Type d''acte]=$B$1,ROW(Tableau_de_suivi[N°])-2),ROWS($1:48)),1),\"\")","v":""}]
[{"$f":"IFERROR(INDEX(Tableau_de_suivi[[Nom/Désignation]:[Clôturé]],SMALL(IF(Tableau_de_suivi[Type d''acte]=$B$1,ROW(Tableau_de_suivi[N°])-2),ROWS($1:49)),1),\"\")","v":""}]
[{"$f":"IFERROR(INDEX(Tableau_de_suivi[[Nom/Désignation]:[Clôturé]],SMALL(IF(Tableau_de_suivi[Type d''acte]=$B$1,ROW(Tableau_de_suivi[N°])-2),ROWS($1:50)),1),\"\")","v":""}]
[{"$f":"IFERROR(INDEX(Tableau_de_suivi[[Nom/Désignation]:[Clôturé]],SMALL(IF(Tableau_de_suivi[Type d''acte]=$B$1,ROW(Tableau_de_suivi[N°])-2),ROWS($1:51)),1),\"\")","v":""}]
[{"$f":"IFERROR(INDEX(Tableau_de_suivi[[Nom/Désignation]:[Clôturé]],SMALL(IF(Tableau_de_suivi[Type d''acte]=$B$1,ROW(Tableau_de_suivi[N°])-2),ROWS($1:52)),1),\"\")","v":""}]
[{"$f":"IFERROR(INDEX(Tableau_de_suivi[[Nom/Désignation]:[Clôturé]],SMALL(IF(Tableau_de_suivi[Type d''acte]=$B$1,ROW(Tableau_de_suivi[N°])-2),ROWS($1:53)),1),\"\")","v":""}]
[{"$f":"IFERROR(INDEX(Tableau_de_suivi[[Nom/Désignation]:[Clôturé]],SMALL(IF(Tableau_de_suivi[Type d''acte]=$B$1,ROW(Tableau_de_suivi[N°])-2),ROWS($1:54)),1),\"\")","v":""}]
[{"$f":"IFERROR(INDEX(Tableau_de_suivi[[Nom/Désignation]:[Clôturé]],SMALL(IF(Tableau_de_suivi[Type d''acte]=$B$1,ROW(Tableau_de_suivi[N°])-2),ROWS($1:55)),1),\"\")","v":""}]
[{"$f":"IFERROR(INDEX(Tableau_de_suivi[[Nom/Désignation]:[Clôturé]],SMALL(IF(Tableau_de_suivi[Type d''acte]=$B$1,ROW(Tableau_de_suivi[N°])-2),ROWS($1:56)),1),\"\")","v":""}]
[{"$f":"IFERROR(INDEX(Tableau_de_suivi[[Nom/Désignation]:[Clôturé]],SMALL(IF(Tableau_de_suivi[Type d''acte]=$B$1,ROW(Tableau_de_suivi[N°])-2),ROWS($1:57)),1),\"\")","v":""}]
[{"$f":"IFERROR(INDEX(Tableau_de_suivi[[Nom/Désignation]:[Clôturé]],SMALL(IF(Tableau_de_suivi[Type d''acte]=$B$1,ROW(Tableau_de_suivi[N°])-2),ROWS($1:58)),1),\"\")","v":""}]
[{"$f":"IFERROR(INDEX(Tableau_de_suivi[[Nom/Désignation]:[Clôturé]],SMALL(IF(Tableau_de_suivi[Type d''acte]=$B$1,ROW(Tableau_de_suivi[N°])-2),ROWS($1:59)),1),\"\")","v":""}]
[{"$f":"IFERROR(INDEX(Tableau_de_suivi[[Nom/Désignation]:[Clôturé]],SMALL(IF(Tableau_de_suivi[Type d''acte]=$B$1,ROW(Tableau_de_suivi[N°])-2),ROWS($1:60)),1),\"\")","v":""}]
[{"$f":"IFERROR(INDEX(Tableau_de_suivi[[Nom/Désignation]:[Clôturé]],SMALL(IF(Tableau_de_suivi[Type d''acte]=$B$1,ROW(Tableau_de_suivi[N°])-2),ROWS($1:61)),1),\"\")","v":""}]
[{"$f":"IFERROR(INDEX(Tableau_de_suivi[[Nom/Désignation]:[Clôturé]],SMALL(IF(Tableau_de_suivi[Type d''acte]=$B$1,ROW(Tableau_de_suivi[N°])-2),ROWS($1:62)),1),\"\")","v":""}]
[{"$f":"IFERROR(INDEX(Tableau_de_suivi[[Nom/Désignation]:[Clôturé]],SMALL(IF(Tableau_de_suivi[Type d''acte]=$B$1,ROW(Tableau_de_suivi[N°])-2),ROWS($1:63)),1),\"\")","v":""}]
[{"$f":"IFERROR(INDEX(Tableau_de_suivi[[Nom/Désignation]:[Clôturé]],SMALL(IF(Tableau_de_suivi[Type d''acte]=$B$1,ROW(Tableau_de_suivi[N°])-2),ROWS($1:64)),1),\"\")","v":""}]
[{"$f":"IFERROR(INDEX(Tableau_de_suivi[[Nom/Désignation]:[Clôturé]],SMALL(IF(Tableau_de_suivi[Type d''acte]=$B$1,ROW(Tableau_de_suivi[N°])-2),ROWS($1:65)),1),\"\")","v":""}]
[{"$f":"IFERROR(INDEX(Tableau_de_suivi[[Nom/Désignation]:[Clôturé]],SMALL(IF(Tableau_de_suivi[Type d''acte]=$B$1,ROW(Tableau_de_suivi[N°])-2),ROWS($1:66)),1),\"\")","v":""}]
[{"$f":"IFERROR(INDEX(Tableau_de_suivi[[Nom/Désignation]:[Clôturé]],SMALL(IF(Tableau_de_suivi[Type d''acte]=$B$1,ROW(Tableau_de_suivi[N°])-2),ROWS($1:67)),1),\"\")","v":""}]
[{"$f":"IFERROR(INDEX(Tableau_de_suivi[[Nom/Désignation]:[Clôturé]],SMALL(IF(Tableau_de_suivi[Type d''acte]=$B$1,ROW(Tableau_de_suivi[N°])-2),ROWS($1:68)),1),\"\")","v":""}]
[{"$f":"IFERROR(INDEX(Tableau_de_suivi[[Nom/Désignation]:[Clôturé]],SMALL(IF(Tableau_de_suivi[Type d''acte]=$B$1,ROW(Tableau_de_suivi[N°])-2),ROWS($1:69)),1),\"\")","v":""}]
[{"$f":"IFERROR(INDEX(Tableau_de_suivi[[Nom/Désignation]:[Clôturé]],SMALL(IF(Tableau_de_suivi[Type d''acte]=$B$1,ROW(Tableau_de_suivi[N°])-2),ROWS($1:70)),1),\"\")","v":""}]
[{"$f":"IFERROR(INDEX(Tableau_de_suivi[[Nom/Désignation]:[Clôturé]],SMALL(IF(Tableau_de_suivi[Type d''acte]=$B$1,ROW(Tableau_de_suivi[N°])-2),ROWS($1:71)),1),\"\")","v":""}]
[{"$f":"IFERROR(INDEX(Tableau_de_suivi[[Nom/Désignation]:[Clôturé]],SMALL(IF(Tableau_de_suivi[Type d''acte]=$B$1,ROW(Tableau_de_suivi[N°])-2),ROWS($1:72)),1),\"\")","v":""}]
[{"$f":"IFERROR(INDEX(Tableau_de_suivi[[Nom/Désignation]:[Clôturé]],SMALL(IF(Tableau_de_suivi[Type d''acte]=$B$1,ROW(Tableau_de_suivi[N°])-2),ROWS($1:73)),1),\"\")","v":""}]
[{"$f":"IFERROR(INDEX(Tableau_de_suivi[[Nom/Désignation]:[Clôturé]],SMALL(IF(Tableau_de_suivi[Type d''acte]=$B$1,ROW(Tableau_de_suivi[N°])-2),ROWS($1:74)),1),\"\")","v":""}]
[{"$f":"IFERROR(INDEX(Tableau_de_suivi[[Nom/Désignation]:[Clôturé]],SMALL(IF(Tableau_de_suivi[Type d''acte]=$B$1,ROW(Tableau_de_suivi[N°])-2),ROWS($1:75)),1),\"\")","v":""}]
[{"$f":"IFERROR(INDEX(Tableau_de_suivi[[Nom/Désignation]:[Clôturé]],SMALL(IF(Tableau_de_suivi[Type d''acte]=$B$1,ROW(Tableau_de_suivi[N°])-2),ROWS($1:76)),1),\"\")","v":""}]
[{"$f":"IFERROR(INDEX(Tableau_de_suivi[[Nom/Désignation]:[Clôturé]],SMALL(IF(Tableau_de_suivi[Type d''acte]=$B$1,ROW(Tableau_de_suivi[N°])-2),ROWS($1:77)),1),\"\")","v":""}]
[{"$f":"IFERROR(INDEX(Tableau_de_suivi[[Nom/Désignation]:[Clôturé]],SMALL(IF(Tableau_de_suivi[Type d''acte]=$B$1,ROW(Tableau_de_suivi[N°])-2),ROWS($1:78)),1),\"\")","v":""}]
[{"$f":"IFERROR(INDEX(Tableau_de_suivi[[Nom/Désignation]:[Clôturé]],SMALL(IF(Tableau_de_suivi[Type d''acte]=$B$1,ROW(Tableau_de_suivi[N°])-2),ROWS($1:79)),1),\"\")","v":""}]
[{"$f":"IFERROR(INDEX(Tableau_de_suivi[[Nom/Désignation]:[Clôturé]],SMALL(IF(Tableau_de_suivi[Type d''acte]=$B$1,ROW(Tableau_de_suivi[N°])-2),ROWS($1:80)),1),\"\")","v":""}]
[{"$f":"IFERROR(INDEX(Tableau_de_suivi[[Nom/Désignation]:[Clôturé]],SMALL(IF(Tableau_de_suivi[Type d''acte]=$B$1,ROW(Tableau_de_suivi[N°])-2),ROWS($1:81)),1),\"\")","v":""}]
[{"$f":"IFERROR(INDEX(Tableau_de_suivi[[Nom/Désignation]:[Clôturé]],SMALL(IF(Tableau_de_suivi[Type d''acte]=$B$1,ROW(Tableau_de_suivi[N°])-2),ROWS($1:82)),1),\"\")","v":""}]
[{"$f":"IFERROR(INDEX(Tableau_de_suivi[[Nom/Désignation]:[Clôturé]],SMALL(IF(Tableau_de_suivi[Type d''acte]=$B$1,ROW(Tableau_de_suivi[N°])-2),ROWS($1:83)),1),\"\")","v":""}]
[{"$f":"IFERROR(INDEX(Tableau_de_suivi[[Nom/Désignation]:[Clôturé]],SMALL(IF(Tableau_de_suivi[Type d''acte]=$B$1,ROW(Tableau_de_suivi[N°])-2),ROWS($1:84)),1),\"\")","v":""}]
[{"$f":"IFERROR(INDEX(Tableau_de_suivi[[Nom/Désignation]:[Clôturé]],SMALL(IF(Tableau_de_suivi[Type d''acte]=$B$1,ROW(Tableau_de_suivi[N°])-2),ROWS($1:85)),1),\"\")","v":""}]
[{"$f":"IFERROR(INDEX(Tableau_de_suivi[[Nom/Désignation]:[Clôturé]],SMALL(IF(Tableau_de_suivi[Type d''acte]=$B$1,ROW(Tableau_de_suivi[N°])-2),ROWS($1:86)),1),\"\")","v":""}]
[{"$f":"IFERROR(INDEX(Tableau_de_suivi[[Nom/Désignation]:[Clôturé]],SMALL(IF(Tableau_de_suivi[Type d''acte]=$B$1,ROW(Tableau_de_suivi[N°])-2),ROWS($1:87)),1),\"\")","v":""}]
[{"$f":"IFERROR(INDEX(Tableau_de_suivi[[Nom/Désignation]:[Clôturé]],SMALL(IF(Tableau_de_suivi[Type d''acte]=$B$1,ROW(Tableau_de_suivi[N°])-2),ROWS($1:88)),1),\"\")","v":""}]
[{"$f":"IFERROR(INDEX(Tableau_de_suivi[[Nom/Désignation]:[Clôturé]],SMALL(IF(Tableau_de_suivi[Type d''acte]=$B$1,ROW(Tableau_de_suivi[N°])-2),ROWS($1:89)),1),\"\")","v":""}]
[{"$f":"IFERROR(INDEX(Tableau_de_suivi[[Nom/Désignation]:[Clôturé]],SMALL(IF(Tableau_de_suivi[Type d''acte]=$B$1,ROW(Tableau_de_suivi[N°])-2),ROWS($1:90)),1),\"\")","v":""}]
[{"$f":"IFERROR(INDEX(Tableau_de_suivi[[Nom/Désignation]:[Clôturé]],SMALL(IF(Tableau_de_suivi[Type d''acte]=$B$1,ROW(Tableau_de_suivi[N°])-2),ROWS($1:91)),1),\"\")","v":""}]
[{"$f":"IFERROR(INDEX(Tableau_de_suivi[[Nom/Désignation]:[Clôturé]],SMALL(IF(Tableau_de_suivi[Type d''acte]=$B$1,ROW(Tableau_de_suivi[N°])-2),ROWS($1:92)),1),\"\")","v":""}]
[{"$f":"IFERROR(INDEX(Tableau_de_suivi[[Nom/Désignation]:[Clôturé]],SMALL(IF(Tableau_de_suivi[Type d''acte]=$B$1,ROW(Tableau_de_suivi[N°])-2),ROWS($1:93)),1),\"\")","v":""}]
[{"$f":"IFERROR(INDEX(Tableau_de_suivi[[Nom/Désignation]:[Clôturé]],SMALL(IF(Tableau_de_suivi[Type d''acte]=$B$1,ROW(Tableau_de_suivi[N°])-2),ROWS($1:94)),1),\"\")","v":""}]
[{"$f":"IFERROR(INDEX(Tableau_de_suivi[[Nom/Désignation]:[Clôturé]],SMALL(IF(Tableau_de_suivi[Type d''acte]=$B$1,ROW(Tableau_de_suivi[N°])-2),ROWS($1:95)),1),\"\")","v":""}]
[{"$f":"IFERROR(INDEX(Tableau_de_suivi[[Nom/Désignation]:[Clôturé]],SMALL(IF(Tableau_de_suivi[Type d''acte]=$B$1,ROW(Tableau_de_suivi[N°])-2),ROWS($1:96)),1),\"\")","v":""}]
[{"$f":"IFERROR(INDEX(Tableau_de_suivi[[Nom/Désignation]:[Clôturé]],SMALL(IF(Tableau_de_suivi[Type d''acte]=$B$1,ROW(Tableau_de_suivi[N°])-2),ROWS($1:97)),1),\"\")","v":""}]

{"sheet":"Changements statutaires","index":10,"n_rows":100,"n_cols":12,"rows_kept":100,"cut":false,"hidden":false,"merged":[[0,1,0,11]]}
[null,"Changement(s) statutaire(s):"]
[{"$f":"VLOOKUP($B$1,Sources!$F$3:$R$19,COLUMN()+1,FALSE)","v":"NOM"},{"$f":"VLOOKUP($B$1,Sources!$F$3:$R$19,COLUMN()+1,FALSE)","v":"Extrait RCSL"},{"$f":"VLOOKUP($B$1,Sources!$F$3:$R$19,COLUMN()+1,FALSE)","v":"ID "},{"$f":"VLOOKUP($B$1,Sources!$F$3:$R$19,COLUMN()+1,FALSE)","v":"Statuts "},{"$f":"VLOOKUP($B$1,Sources!$F$3:$R$19,COLUMN()+1,FALSE)","v":"Déclaration BE notaire "},{"$f":"VLOOKUP($B$1,Sources!$F$3:$R$19,COLUMN()+1,FALSE)","v":"Autorisation établissement (si nécessaire)"},{"$f":"VLOOKUP($B$1,Sources!$F$3:$R$19,COLUMN()+1,FALSE)","v":"Registre actionnaires / Organigramme (si nécessaire)"},{"$f":"VLOOKUP($B$1,Sources!$F$3:$R$19,COLUMN()+1,FALSE)","v":"Contrat de bail (si nécessaire)"},{"$f":"VLOOKUP($B$1,Sources!$F$3:$R$19,COLUMN()+1,FALSE)","v":0},{"$f":"VLOOKUP($B$1,Sources!$F$3:$R$19,COLUMN()+1,FALSE)","v":0},{"$f":"VLOOKUP($B$1,Sources!$F$3:$R$19,COLUMN()+1,FALSE)","v":0},{"$f":"VLOOKUP($B$1,Sources!$F$3:$R$19,COLUMN()+1,FALSE)","v":0}]
["Colonne1","Colonne2","Colonne3","Colonne4","Colonne5","Colonne6","Colonne7","Colonne8","Colonne9","Colonne10","Colonne11","Colonne12"]
[{"$f":"IFERROR(INDEX(Tableau_de_suivi[[Nom/Désignation]:[Clôturé]],SMALL(IF(Tableau_de_suivi[Type d''acte]=$B$1,ROW(Tableau_de_suivi[N°])-2),ROWS($1:1)),1),\"\")","v":""}]
[{"$f":"IFERROR(INDEX(Tableau_de_suivi[[Nom/Désignation]:[Clôturé]],SMALL(IF(Tableau_de_suivi[Type d''acte]=$B$1,ROW(Tableau_de_suivi[N°])-2),ROWS($1:2)),1),\"\")","v":""}]
[{"$f":"IFERROR(INDEX(Tableau_de_suivi[[Nom/Désignation]:[Clôturé]],SMALL(IF(Tableau_de_suivi[Type d''acte]=$B$1,ROW(Tableau_de_suivi[N°])-2),ROWS($1:3)),1),\"\")","v":""}]
[{"$f":"IFERROR(INDEX(Tableau_de_suivi[[Nom/Désignation]:[Clôturé]],SMALL(IF(Tableau_de_suivi[Type d''acte]=$B$1,ROW(Tableau_de_suivi[N°])-2),ROWS($1:4)),1),\"\")","v":""}]
[{"$f":"IFERROR(INDEX(Tableau_de_suivi[[Nom/Désignation]:[Clôturé]],SMALL(IF(Tableau_de_suivi[Type d''acte]=$B$1,ROW(Tableau_de_suivi[N°])-2),ROWS($1:5)),1),\"\")","v":""}]
[{"$f":"IFERROR(INDEX(Tableau_de_suivi[[Nom/Désignation]:[Clôturé]],SMALL(IF(Tableau_de_suivi[Type d''acte]=$B$1,ROW(Tableau_de_suivi[N°])-2),ROWS($1:6)),1),\"\")","v":""}]
[{"$f":"IFERROR(INDEX(Tableau_de_suivi[[Nom/Désignation]:[Clôturé]],SMALL(IF(Tableau_de_suivi[Type d''acte]=$B$1,ROW(Tableau_de_suivi[N°])-2),ROWS($1:7)),1),\"\")","v":""}]
[{"$f":"IFERROR(INDEX(Tableau_de_suivi[[Nom/Désignation]:[Clôturé]],SMALL(IF(Tableau_de_suivi[Type d''acte]=$B$1,ROW(Tableau_de_suivi[N°])-2),ROWS($1:8)),1),\"\")","v":""}]
[{"$f":"IFERROR(INDEX(Tableau_de_suivi[[Nom/Désignation]:[Clôturé]],SMALL(IF(Tableau_de_suivi[Type d''acte]=$B$1,ROW(Tableau_de_suivi[N°])-2),ROWS($1:9)),1),\"\")","v":""}]
[{"$f":"IFERROR(INDEX(Tableau_de_suivi[[Nom/Désignation]:[Clôturé]],SMALL(IF(Tableau_de_suivi[Type d''acte]=$B$1,ROW(Tableau_de_suivi[N°])-2),ROWS($1:10)),1),\"\")","v":""}]
[{"$f":"IFERROR(INDEX(Tableau_de_suivi[[Nom/Désignation]:[Clôturé]],SMALL(IF(Tableau_de_suivi[Type d''acte]=$B$1,ROW(Tableau_de_suivi[N°])-2),ROWS($1:11)),1),\"\")","v":""}]
[{"$f":"IFERROR(INDEX(Tableau_de_suivi[[Nom/Désignation]:[Clôturé]],SMALL(IF(Tableau_de_suivi[Type d''acte]=$B$1,ROW(Tableau_de_suivi[N°])-2),ROWS($1:12)),1),\"\")","v":""}]
[{"$f":"IFERROR(INDEX(Tableau_de_suivi[[Nom/Désignation]:[Clôturé]],SMALL(IF(Tableau_de_suivi[Type d''acte]=$B$1,ROW(Tableau_de_suivi[N°])-2),ROWS($1:13)),1),\"\")","v":""}]
[{"$f":"IFERROR(INDEX(Tableau_de_suivi[[Nom/Désignation]:[Clôturé]],SMALL(IF(Tableau_de_suivi[Type d''acte]=$B$1,ROW(Tableau_de_suivi[N°])-2),ROWS($1:14)),1),\"\")","v":""}]
[{"$f":"IFERROR(INDEX(Tableau_de_suivi[[Nom/Désignation]:[Clôturé]],SMALL(IF(Tableau_de_suivi[Type d''acte]=$B$1,ROW(Tableau_de_suivi[N°])-2),ROWS($1:15)),1),\"\")","v":""}]
[{"$f":"IFERROR(INDEX(Tableau_de_suivi[[Nom/Désignation]:[Clôturé]],SMALL(IF(Tableau_de_suivi[Type d''acte]=$B$1,ROW(Tableau_de_suivi[N°])-2),ROWS($1:16)),1),\"\")","v":""}]
[{"$f":"IFERROR(INDEX(Tableau_de_suivi[[Nom/Désignation]:[Clôturé]],SMALL(IF(Tableau_de_suivi[Type d''acte]=$B$1,ROW(Tableau_de_suivi[N°])-2),ROWS($1:17)),1),\"\")","v":""}]
[{"$f":"IFERROR(INDEX(Tableau_de_suivi[[Nom/Désignation]:[Clôturé]],SMALL(IF(Tableau_de_suivi[Type d''acte]=$B$1,ROW(Tableau_de_suivi[N°])-2),ROWS($1:18)),1),\"\")","v":""}]
[{"$f":"IFERROR(INDEX(Tableau_de_suivi[[Nom/Désignation]:[Clôturé]],SMALL(IF(Tableau_de_suivi[Type d''acte]=$B$1,ROW(Tableau_de_suivi[N°])-2),ROWS($1:19)),1),\"\")","v":""}]
[{"$f":"IFERROR(INDEX(Tableau_de_suivi[[Nom/Désignation]:[Clôturé]],SMALL(IF(Tableau_de_suivi[Type d''acte]=$B$1,ROW(Tableau_de_suivi[N°])-2),ROWS($1:20)),1),\"\")","v":""}]
[{"$f":"IFERROR(INDEX(Tableau_de_suivi[[Nom/Désignation]:[Clôturé]],SMALL(IF(Tableau_de_suivi[Type d''acte]=$B$1,ROW(Tableau_de_suivi[N°])-2),ROWS($1:21)),1),\"\")","v":""}]
[{"$f":"IFERROR(INDEX(Tableau_de_suivi[[Nom/Désignation]:[Clôturé]],SMALL(IF(Tableau_de_suivi[Type d''acte]=$B$1,ROW(Tableau_de_suivi[N°])-2),ROWS($1:22)),1),\"\")","v":""}]
[{"$f":"IFERROR(INDEX(Tableau_de_suivi[[Nom/Désignation]:[Clôturé]],SMALL(IF(Tableau_de_suivi[Type d''acte]=$B$1,ROW(Tableau_de_suivi[N°])-2),ROWS($1:23)),1),\"\")","v":""}]
[{"$f":"IFERROR(INDEX(Tableau_de_suivi[[Nom/Désignation]:[Clôturé]],SMALL(IF(Tableau_de_suivi[Type d''acte]=$B$1,ROW(Tableau_de_suivi[N°])-2),ROWS($1:24)),1),\"\")","v":""}]
[{"$f":"IFERROR(INDEX(Tableau_de_suivi[[Nom/Désignation]:[Clôturé]],SMALL(IF(Tableau_de_suivi[Type d''acte]=$B$1,ROW(Tableau_de_suivi[N°])-2),ROWS($1:25)),1),\"\")","v":""}]
[{"$f":"IFERROR(INDEX(Tableau_de_suivi[[Nom/Désignation]:[Clôturé]],SMALL(IF(Tableau_de_suivi[Type d''acte]=$B$1,ROW(Tableau_de_suivi[N°])-2),ROWS($1:26)),1),\"\")","v":""}]
[{"$f":"IFERROR(INDEX(Tableau_de_suivi[[Nom/Désignation]:[Clôturé]],SMALL(IF(Tableau_de_suivi[Type d''acte]=$B$1,ROW(Tableau_de_suivi[N°])-2),ROWS($1:27)),1),\"\")","v":""}]
[{"$f":"IFERROR(INDEX(Tableau_de_suivi[[Nom/Désignation]:[Clôturé]],SMALL(IF(Tableau_de_suivi[Type d''acte]=$B$1,ROW(Tableau_de_suivi[N°])-2),ROWS($1:28)),1),\"\")","v":""}]
[{"$f":"IFERROR(INDEX(Tableau_de_suivi[[Nom/Désignation]:[Clôturé]],SMALL(IF(Tableau_de_suivi[Type d''acte]=$B$1,ROW(Tableau_de_suivi[N°])-2),ROWS($1:29)),1),\"\")","v":""}]
[{"$f":"IFERROR(INDEX(Tableau_de_suivi[[Nom/Désignation]:[Clôturé]],SMALL(IF(Tableau_de_suivi[Type d''acte]=$B$1,ROW(Tableau_de_suivi[N°])-2),ROWS($1:30)),1),\"\")","v":""}]
[{"$f":"IFERROR(INDEX(Tableau_de_suivi[[Nom/Désignation]:[Clôturé]],SMALL(IF(Tableau_de_suivi[Type d''acte]=$B$1,ROW(Tableau_de_suivi[N°])-2),ROWS($1:31)),1),\"\")","v":""}]
[{"$f":"IFERROR(INDEX(Tableau_de_suivi[[Nom/Désignation]:[Clôturé]],SMALL(IF(Tableau_de_suivi[Type d''acte]=$B$1,ROW(Tableau_de_suivi[N°])-2),ROWS($1:32)),1),\"\")","v":""}]
[{"$f":"IFERROR(INDEX(Tableau_de_suivi[[Nom/Désignation]:[Clôturé]],SMALL(IF(Tableau_de_suivi[Type d''acte]=$B$1,ROW(Tableau_de_suivi[N°])-2),ROWS($1:33)),1),\"\")","v":""}]
[{"$f":"IFERROR(INDEX(Tableau_de_suivi[[Nom/Désignation]:[Clôturé]],SMALL(IF(Tableau_de_suivi[Type d''acte]=$B$1,ROW(Tableau_de_suivi[N°])-2),ROWS($1:34)),1),\"\")","v":""}]
[{"$f":"IFERROR(INDEX(Tableau_de_suivi[[Nom/Désignation]:[Clôturé]],SMALL(IF(Tableau_de_suivi[Type d''acte]=$B$1,ROW(Tableau_de_suivi[N°])-2),ROWS($1:35)),1),\"\")","v":""}]
[{"$f":"IFERROR(INDEX(Tableau_de_suivi[[Nom/Désignation]:[Clôturé]],SMALL(IF(Tableau_de_suivi[Type d''acte]=$B$1,ROW(Tableau_de_suivi[N°])-2),ROWS($1:36)),1),\"\")","v":""}]
[{"$f":"IFERROR(INDEX(Tableau_de_suivi[[Nom/Désignation]:[Clôturé]],SMALL(IF(Tableau_de_suivi[Type d''acte]=$B$1,ROW(Tableau_de_suivi[N°])-2),ROWS($1:37)),1),\"\")","v":""}]
[{"$f":"IFERROR(INDEX(Tableau_de_suivi[[Nom/Désignation]:[Clôturé]],SMALL(IF(Tableau_de_suivi[Type d''acte]=$B$1,ROW(Tableau_de_suivi[N°])-2),ROWS($1:38)),1),\"\")","v":""}]
[{"$f":"IFERROR(INDEX(Tableau_de_suivi[[Nom/Désignation]:[Clôturé]],SMALL(IF(Tableau_de_suivi[Type d''acte]=$B$1,ROW(Tableau_de_suivi[N°])-2),ROWS($1:39)),1),\"\")","v":""}]
[{"$f":"IFERROR(INDEX(Tableau_de_suivi[[Nom/Désignation]:[Clôturé]],SMALL(IF(Tableau_de_suivi[Type d''acte]=$B$1,ROW(Tableau_de_suivi[N°])-2),ROWS($1:40)),1),\"\")","v":""}]
[{"$f":"IFERROR(INDEX(Tableau_de_suivi[[Nom/Désignation]:[Clôturé]],SMALL(IF(Tableau_de_suivi[Type d''acte]=$B$1,ROW(Tableau_de_suivi[N°])-2),ROWS($1:41)),1),\"\")","v":""}]
[{"$f":"IFERROR(INDEX(Tableau_de_suivi[[Nom/Désignation]:[Clôturé]],SMALL(IF(Tableau_de_suivi[Type d''acte]=$B$1,ROW(Tableau_de_suivi[N°])-2),ROWS($1:42)),1),\"\")","v":""}]
[{"$f":"IFERROR(INDEX(Tableau_de_suivi[[Nom/Désignation]:[Clôturé]],SMALL(IF(Tableau_de_suivi[Type d''acte]=$B$1,ROW(Tableau_de_suivi[N°])-2),ROWS($1:43)),1),\"\")","v":""}]
[{"$f":"IFERROR(INDEX(Tableau_de_suivi[[Nom/Désignation]:[Clôturé]],SMALL(IF(Tableau_de_suivi[Type d''acte]=$B$1,ROW(Tableau_de_suivi[N°])-2),ROWS($1:44)),1),\"\")","v":""}]
[{"$f":"IFERROR(INDEX(Tableau_de_suivi[[Nom/Désignation]:[Clôturé]],SMALL(IF(Tableau_de_suivi[Type d''acte]=$B$1,ROW(Tableau_de_suivi[N°])-2),ROWS($1:45)),1),\"\")","v":""}]
[{"$f":"IFERROR(INDEX(Tableau_de_suivi[[Nom/Désignation]:[Clôturé]],SMALL(IF(Tableau_de_suivi[Type d''acte]=$B$1,ROW(Tableau_de_suivi[N°])-2),ROWS($1:46)),1),\"\")","v":""}]
[{"$f":"IFERROR(INDEX(Tableau_de_suivi[[Nom/Désignation]:[Clôturé]],SMALL(IF(Tableau_de_suivi[Type d''acte]=$B$1,ROW(Tableau_de_suivi[N°])-2),ROWS($1:47)),1),\"\")","v":""}]
[{"$f":"IFERROR(INDEX(Tableau_de_suivi[[Nom/Désignation]:[Clôturé]],SMALL(IF(Tableau_de_suivi[Type d''acte]=$B$1,ROW(Tableau_de_suivi[N°])-2),ROWS($1:48)),1),\"\")","v":""}]
[{"$f":"IFERROR(INDEX(Tableau_de_suivi[[Nom/Désignation]:[Clôturé]],SMALL(IF(Tableau_de_suivi[Type d''acte]=$B$1,ROW(Tableau_de_suivi[N°])-2),ROWS($1:49)),1),\"\")","v":""}]
[{"$f":"IFERROR(INDEX(Tableau_de_suivi[[Nom/Désignation]:[Clôturé]],SMALL(IF(Tableau_de_suivi[Type d''acte]=$B$1,ROW(Tableau_de_suivi[N°])-2),ROWS($1:50)),1),\"\")","v":""}]
[{"$f":"IFERROR(INDEX(Tableau_de_suivi[[Nom/Désignation]:[Clôturé]],SMALL(IF(Tableau_de_suivi[Type d''acte]=$B$1,ROW(Tableau_de_suivi[N°])-2),ROWS($1:51)),1),\"\")","v":""}]
[{"$f":"IFERROR(INDEX(Tableau_de_suivi[[Nom/Désignation]:[Clôturé]],SMALL(IF(Tableau_de_suivi[Type d''acte]=$B$1,ROW(Tableau_de_suivi[N°])-2),ROWS($1:52)),1),\"\")","v":""}]
[{"$f":"IFERROR(INDEX(Tableau_de_suivi[[Nom/Désignation]:[Clôturé]],SMALL(IF(Tableau_de_suivi[Type d''acte]=$B$1,ROW(Tableau_de_suivi[N°])-2),ROWS($1:53)),1),\"\")","v":""}]
[{"$f":"IFERROR(INDEX(Tableau_de_suivi[[Nom/Désignation]:[Clôturé]],SMALL(IF(Tableau_de_suivi[Type d''acte]=$B$1,ROW(Tableau_de_suivi[N°])-2),ROWS($1:54)),1),\"\")","v":""}]
[{"$f":"IFERROR(INDEX(Tableau_de_suivi[[Nom/Désignation]:[Clôturé]],SMALL(IF(Tableau_de_suivi[Type d''acte]=$B$1,ROW(Tableau_de_suivi[N°])-2),ROWS($1:55)),1),\"\")","v":""}]
[{"$f":"IFERROR(INDEX(Tableau_de_suivi[[Nom/Désignation]:[Clôturé]],SMALL(IF(Tableau_de_suivi[Type d''acte]=$B$1,ROW(Tableau_de_suivi[N°])-2),ROWS($1:56)),1),\"\")","v":""}]
[{"$f":"IFERROR(INDEX(Tableau_de_suivi[[Nom/Désignation]:[Clôturé]],SMALL(IF(Tableau_de_suivi[Type d''acte]=$B$1,ROW(Tableau_de_suivi[N°])-2),ROWS($1:57)),1),\"\")","v":""}]
[{"$f":"IFERROR(INDEX(Tableau_de_suivi[[Nom/Désignation]:[Clôturé]],SMALL(IF(Tableau_de_suivi[Type d''acte]=$B$1,ROW(Tableau_de_suivi[N°])-2),ROWS($1:58)),1),\"\")","v":""}]
[{"$f":"IFERROR(INDEX(Tableau_de_suivi[[Nom/Désignation]:[Clôturé]],SMALL(IF(Tableau_de_suivi[Type d''acte]=$B$1,ROW(Tableau_de_suivi[N°])-2),ROWS($1:59)),1),\"\")","v":""}]
[{"$f":"IFERROR(INDEX(Tableau_de_suivi[[Nom/Désignation]:[Clôturé]],SMALL(IF(Tableau_de_suivi[Type d''acte]=$B$1,ROW(Tableau_de_suivi[N°])-2),ROWS($1:60)),1),\"\")","v":""}]
[{"$f":"IFERROR(INDEX(Tableau_de_suivi[[Nom/Désignation]:[Clôturé]],SMALL(IF(Tableau_de_suivi[Type d''acte]=$B$1,ROW(Tableau_de_suivi[N°])-2),ROWS($1:61)),1),\"\")","v":""}]
[{"$f":"IFERROR(INDEX(Tableau_de_suivi[[Nom/Désignation]:[Clôturé]],SMALL(IF(Tableau_de_suivi[Type d''acte]=$B$1,ROW(Tableau_de_suivi[N°])-2),ROWS($1:62)),1),\"\")","v":""}]
[{"$f":"IFERROR(INDEX(Tableau_de_suivi[[Nom/Désignation]:[Clôturé]],SMALL(IF(Tableau_de_suivi[Type d''acte]=$B$1,ROW(Tableau_de_suivi[N°])-2),ROWS($1:63)),1),\"\")","v":""}]
[{"$f":"IFERROR(INDEX(Tableau_de_suivi[[Nom/Désignation]:[Clôturé]],SMALL(IF(Tableau_de_suivi[Type d''acte]=$B$1,ROW(Tableau_de_suivi[N°])-2),ROWS($1:64)),1),\"\")","v":""}]
[{"$f":"IFERROR(INDEX(Tableau_de_suivi[[Nom/Désignation]:[Clôturé]],SMALL(IF(Tableau_de_suivi[Type d''acte]=$B$1,ROW(Tableau_de_suivi[N°])-2),ROWS($1:65)),1),\"\")","v":""}]
[{"$f":"IFERROR(INDEX(Tableau_de_suivi[[Nom/Désignation]:[Clôturé]],SMALL(IF(Tableau_de_suivi[Type d''acte]=$B$1,ROW(Tableau_de_suivi[N°])-2),ROWS($1:66)),1),\"\")","v":""}]
[{"$f":"IFERROR(INDEX(Tableau_de_suivi[[Nom/Désignation]:[Clôturé]],SMALL(IF(Tableau_de_suivi[Type d''acte]=$B$1,ROW(Tableau_de_suivi[N°])-2),ROWS($1:67)),1),\"\")","v":""}]
[{"$f":"IFERROR(INDEX(Tableau_de_suivi[[Nom/Désignation]:[Clôturé]],SMALL(IF(Tableau_de_suivi[Type d''acte]=$B$1,ROW(Tableau_de_suivi[N°])-2),ROWS($1:68)),1),\"\")","v":""}]
[{"$f":"IFERROR(INDEX(Tableau_de_suivi[[Nom/Désignation]:[Clôturé]],SMALL(IF(Tableau_de_suivi[Type d''acte]=$B$1,ROW(Tableau_de_suivi[N°])-2),ROWS($1:69)),1),\"\")","v":""}]
[{"$f":"IFERROR(INDEX(Tableau_de_suivi[[Nom/Désignation]:[Clôturé]],SMALL(IF(Tableau_de_suivi[Type d''acte]=$B$1,ROW(Tableau_de_suivi[N°])-2),ROWS($1:70)),1),\"\")","v":""}]
[{"$f":"IFERROR(INDEX(Tableau_de_suivi[[Nom/Désignation]:[Clôturé]],SMALL(IF(Tableau_de_suivi[Type d''acte]=$B$1,ROW(Tableau_de_suivi[N°])-2),ROWS($1:71)),1),\"\")","v":""}]
[{"$f":"IFERROR(INDEX(Tableau_de_suivi[[Nom/Désignation]:[Clôturé]],SMALL(IF(Tableau_de_suivi[Type d''acte]=$B$1,ROW(Tableau_de_suivi[N°])-2),ROWS($1:72)),1),\"\")","v":""}]
[{"$f":"IFERROR(INDEX(Tableau_de_suivi[[Nom/Désignation]:[Clôturé]],SMALL(IF(Tableau_de_suivi[Type d''acte]=$B$1,ROW(Tableau_de_suivi[N°])-2),ROWS($1:73)),1),\"\")","v":""}]
[{"$f":"IFERROR(INDEX(Tableau_de_suivi[[Nom/Désignation]:[Clôturé]],SMALL(IF(Tableau_de_suivi[Type d''acte]=$B$1,ROW(Tableau_de_suivi[N°])-2),ROWS($1:74)),1),\"\")","v":""}]
[{"$f":"IFERROR(INDEX(Tableau_de_suivi[[Nom/Désignation]:[Clôturé]],SMALL(IF(Tableau_de_suivi[Type d''acte]=$B$1,ROW(Tableau_de_suivi[N°])-2),ROWS($1:75)),1),\"\")","v":""}]
[{"$f":"IFERROR(INDEX(Tableau_de_suivi[[Nom/Désignation]:[Clôturé]],SMALL(IF(Tableau_de_suivi[Type d''acte]=$B$1,ROW(Tableau_de_suivi[N°])-2),ROWS($1:76)),1),\"\")","v":""}]
[{"$f":"IFERROR(INDEX(Tableau_de_suivi[[Nom/Désignation]:[Clôturé]],SMALL(IF(Tableau_de_suivi[Type d''acte]=$B$1,ROW(Tableau_de_suivi[N°])-2),ROWS($1:77)),1),\"\")","v":""}]
[{"$f":"IFERROR(INDEX(Tableau_de_suivi[[Nom/Désignation]:[Clôturé]],SMALL(IF(Tableau_de_suivi[Type d''acte]=$B$1,ROW(Tableau_de_suivi[N°])-2),ROWS($1:78)),1),\"\")","v":""}]
[{"$f":"IFERROR(INDEX(Tableau_de_suivi[[Nom/Désignation]:[Clôturé]],SMALL(IF(Tableau_de_suivi[Type d''acte]=$B$1,ROW(Tableau_de_suivi[N°])-2),ROWS($1:79)),1),\"\")","v":""}]
[{"$f":"IFERROR(INDEX(Tableau_de_suivi[[Nom/Désignation]:[Clôturé]],SMALL(IF(Tableau_de_suivi[Type d''acte]=$B$1,ROW(Tableau_de_suivi[N°])-2),ROWS($1:80)),1),\"\")","v":""}]
[{"$f":"IFERROR(INDEX(Tableau_de_suivi[[Nom/Désignation]:[Clôturé]],SMALL(IF(Tableau_de_suivi[Type d''acte]=$B$1,ROW(Tableau_de_suivi[N°])-2),ROWS($1:81)),1),\"\")","v":""}]
[{"$f":"IFERROR(INDEX(Tableau_de_suivi[[Nom/Désignation]:[Clôturé]],SMALL(IF(Tableau_de_suivi[Type d''acte]=$B$1,ROW(Tableau_de_suivi[N°])-2),ROWS($1:82)),1),\"\")","v":""}]
[{"$f":"IFERROR(INDEX(Tableau_de_suivi[[Nom/Désignation]:[Clôturé]],SMALL(IF(Tableau_de_suivi[Type d''acte]=$B$1,ROW(Tableau_de_suivi[N°])-2),ROWS($1:83)),1),\"\")","v":""}]
[{"$f":"IFERROR(INDEX(Tableau_de_suivi[[Nom/Désignation]:[Clôturé]],SMALL(IF(Tableau_de_suivi[Type d''acte]=$B$1,ROW(Tableau_de_suivi[N°])-2),ROWS($1:84)),1),\"\")","v":""}]
[{"$f":"IFERROR(INDEX(Tableau_de_suivi[[Nom/Désignation]:[Clôturé]],SMALL(IF(Tableau_de_suivi[Type d''acte]=$B$1,ROW(Tableau_de_suivi[N°])-2),ROWS($1:85)),1),\"\")","v":""}]
[{"$f":"IFERROR(INDEX(Tableau_de_suivi[[Nom/Désignation]:[Clôturé]],SMALL(IF(Tableau_de_suivi[Type d''acte]=$B$1,ROW(Tableau_de_suivi[N°])-2),ROWS($1:86)),1),\"\")","v":""}]
[{"$f":"IFERROR(INDEX(Tableau_de_suivi[[Nom/Désignation]:[Clôturé]],SMALL(IF(Tableau_de_suivi[Type d''acte]=$B$1,ROW(Tableau_de_suivi[N°])-2),ROWS($1:87)),1),\"\")","v":""}]
[{"$f":"IFERROR(INDEX(Tableau_de_suivi[[Nom/Désignation]:[Clôturé]],SMALL(IF(Tableau_de_suivi[Type d''acte]=$B$1,ROW(Tableau_de_suivi[N°])-2),ROWS($1:88)),1),\"\")","v":""}]
[{"$f":"IFERROR(INDEX(Tableau_de_suivi[[Nom/Désignation]:[Clôturé]],SMALL(IF(Tableau_de_suivi[Type d''acte]=$B$1,ROW(Tableau_de_suivi[N°])-2),ROWS($1:89)),1),\"\")","v":""}]
[{"$f":"IFERROR(INDEX(Tableau_de_suivi[[Nom/Désignation]:[Clôturé]],SMALL(IF(Tableau_de_suivi[Type d''acte]=$B$1,ROW(Tableau_de_suivi[N°])-2),ROWS($1:90)),1),\"\")","v":""}]
[{"$f":"IFERROR(INDEX(Tableau_de_suivi[[Nom/Désignation]:[Clôturé]],SMALL(IF(Tableau_de_suivi[Type d''acte]=$B$1,ROW(Tableau_de_suivi[N°])-2),ROWS($1:91)),1),\"\")","v":""}]
[{"$f":"IFERROR(INDEX(Tableau_de_suivi[[Nom/Désignation]:[Clôturé]],SMALL(IF(Tableau_de_suivi[Type d''acte]=$B$1,ROW(Tableau_de_suivi[N°])-2),ROWS($1:92)),1),\"\")","v":""}]
[{"$f":"IFERROR(INDEX(Tableau_de_suivi[[Nom/Désignation]:[Clôturé]],SMALL(IF(Tableau_de_suivi[Type d''acte]=$B$1,ROW(Tableau_de_suivi[N°])-2),ROWS($1:93)),1),\"\")","v":""}]
[{"$f":"IFERROR(INDEX(Tableau_de_suivi[[Nom/Désignation]:[Clôturé]],SMALL(IF(Tableau_de_suivi[Type d''acte]=$B$1,ROW(Tableau_de_suivi[N°])-2),ROWS($1:94)),1),\"\")","v":""}]
[{"$f":"IFERROR(INDEX(Tableau_de_suivi[[Nom/Désignation]:[Clôturé]],SMALL(IF(Tableau_de_suivi[Type d''acte]=$B$1,ROW(Tableau_de_suivi[N°])-2),ROWS($1:95)),1),\"\")","v":""}]
[{"$f":"IFERROR(INDEX(Tableau_de_suivi[[Nom/Désignation]:[Clôturé]],SMALL(IF(Tableau_de_suivi[Type d''acte]=$B$1,ROW(Tableau_de_suivi[N°])-2),ROWS($1:96)),1),\"\")","v":""}]
[{"$f":"IFERROR(INDEX(Tableau_de_suivi[[Nom/Désignation]:[Clôturé]],SMALL(IF(Tableau_de_suivi[Type d''acte]=$B$1,ROW(Tableau_de_suivi[N°])-2),ROWS($1:97)),1),\"\")","v":""}]

{"sheet":"Autres","index":11,"n_rows":100,"n_cols":12,"rows_kept":100,"cut":false,"hidden":false,"merged":[[0,1,0,11]]}
[null,"Autre(s):"]
[{"$f":"VLOOKUP($B$1,Sources!$F$3:$R$19,COLUMN()+1,FALSE)","v":"NOM"},{"$f":"VLOOKUP($B$1,Sources!$F$3:$R$19,COLUMN()+1,FALSE)","v":0},{"$f":"VLOOKUP($B$1,Sources!$F$3:$R$19,COLUMN()+1,FALSE)","v":0},{"$f":"VLOOKUP($B$1,Sources!$F$3:$R$19,COLUMN()+1,FALSE)","v":0},{"$f":"VLOOKUP($B$1,Sources!$F$3:$R$19,COLUMN()+1,FALSE)","v":0},{"$f":"VLOOKUP($B$1,Sources!$F$3:$R$19,COLUMN()+1,FALSE)","v":0},{"$f":"VLOOKUP($B$1,Sources!$F$3:$R$19,COLUMN()+1,FALSE)","v":0},{"$f":"VLOOKUP($B$1,Sources!$F$3:$R$19,COLUMN()+1,FALSE)","v":0},{"$f":"VLOOKUP($B$1,Sources!$F$3:$R$19,COLUMN()+1,FALSE)","v":0},{"$f":"VLOOKUP($B$1,Sources!$F$3:$R$19,COLUMN()+1,FALSE)","v":0},{"$f":"VLOOKUP($B$1,Sources!$F$3:$R$19,COLUMN()+1,FALSE)","v":0},{"$f":"VLOOKUP($B$1,Sources!$F$3:$R$19,COLUMN()+1,FALSE)","v":0}]
["Colonne1","Colonne2","Colonne3","Colonne4","Colonne5","Colonne6","Colonne7","Colonne8","Colonne9","Colonne10","Colonne11","Colonne12"]
[{"$f":"IFERROR(INDEX(Tableau_de_suivi[[Nom/Désignation]:[Clôturé]],SMALL(IF(Tableau_de_suivi[Type d''acte]=$B$1,ROW(Tableau_de_suivi[N°])-2),ROWS($1:1)),1),\"\")","v":""}]
[{"$f":"IFERROR(INDEX(Tableau_de_suivi[[Nom/Désignation]:[Clôturé]],SMALL(IF(Tableau_de_suivi[Type d''acte]=$B$1,ROW(Tableau_de_suivi[N°])-2),ROWS($1:2)),1),\"\")","v":""}]
[{"$f":"IFERROR(INDEX(Tableau_de_suivi[[Nom/Désignation]:[Clôturé]],SMALL(IF(Tableau_de_suivi[Type d''acte]=$B$1,ROW(Tableau_de_suivi[N°])-2),ROWS($1:3)),1),\"\")","v":""}]
[{"$f":"IFERROR(INDEX(Tableau_de_suivi[[Nom/Désignation]:[Clôturé]],SMALL(IF(Tableau_de_suivi[Type d''acte]=$B$1,ROW(Tableau_de_suivi[N°])-2),ROWS($1:4)),1),\"\")","v":""}]
[{"$f":"IFERROR(INDEX(Tableau_de_suivi[[Nom/Désignation]:[Clôturé]],SMALL(IF(Tableau_de_suivi[Type d''acte]=$B$1,ROW(Tableau_de_suivi[N°])-2),ROWS($1:5)),1),\"\")","v":""}]
[{"$f":"IFERROR(INDEX(Tableau_de_suivi[[Nom/Désignation]:[Clôturé]],SMALL(IF(Tableau_de_suivi[Type d''acte]=$B$1,ROW(Tableau_de_suivi[N°])-2),ROWS($1:6)),1),\"\")","v":""}]
[{"$f":"IFERROR(INDEX(Tableau_de_suivi[[Nom/Désignation]:[Clôturé]],SMALL(IF(Tableau_de_suivi[Type d''acte]=$B$1,ROW(Tableau_de_suivi[N°])-2),ROWS($1:7)),1),\"\")","v":""}]
[{"$f":"IFERROR(INDEX(Tableau_de_suivi[[Nom/Désignation]:[Clôturé]],SMALL(IF(Tableau_de_suivi[Type d''acte]=$B$1,ROW(Tableau_de_suivi[N°])-2),ROWS($1:8)),1),\"\")","v":""}]
[{"$f":"IFERROR(INDEX(Tableau_de_suivi[[Nom/Désignation]:[Clôturé]],SMALL(IF(Tableau_de_suivi[Type d''acte]=$B$1,ROW(Tableau_de_suivi[N°])-2),ROWS($1:9)),1),\"\")","v":""}]
[{"$f":"IFERROR(INDEX(Tableau_de_suivi[[Nom/Désignation]:[Clôturé]],SMALL(IF(Tableau_de_suivi[Type d''acte]=$B$1,ROW(Tableau_de_suivi[N°])-2),ROWS($1:10)),1),\"\")","v":""}]
[{"$f":"IFERROR(INDEX(Tableau_de_suivi[[Nom/Désignation]:[Clôturé]],SMALL(IF(Tableau_de_suivi[Type d''acte]=$B$1,ROW(Tableau_de_suivi[N°])-2),ROWS($1:11)),1),\"\")","v":""}]
[{"$f":"IFERROR(INDEX(Tableau_de_suivi[[Nom/Désignation]:[Clôturé]],SMALL(IF(Tableau_de_suivi[Type d''acte]=$B$1,ROW(Tableau_de_suivi[N°])-2),ROWS($1:12)),1),\"\")","v":""}]
[{"$f":"IFERROR(INDEX(Tableau_de_suivi[[Nom/Désignation]:[Clôturé]],SMALL(IF(Tableau_de_suivi[Type d''acte]=$B$1,ROW(Tableau_de_suivi[N°])-2),ROWS($1:13)),1),\"\")","v":""}]
[{"$f":"IFERROR(INDEX(Tableau_de_suivi[[Nom/Désignation]:[Clôturé]],SMALL(IF(Tableau_de_suivi[Type d''acte]=$B$1,ROW(Tableau_de_suivi[N°])-2),ROWS($1:14)),1),\"\")","v":""}]
[{"$f":"IFERROR(INDEX(Tableau_de_suivi[[Nom/Désignation]:[Clôturé]],SMALL(IF(Tableau_de_suivi[Type d''acte]=$B$1,ROW(Tableau_de_suivi[N°])-2),ROWS($1:15)),1),\"\")","v":""}]
[{"$f":"IFERROR(INDEX(Tableau_de_suivi[[Nom/Désignation]:[Clôturé]],SMALL(IF(Tableau_de_suivi[Type d''acte]=$B$1,ROW(Tableau_de_suivi[N°])-2),ROWS($1:16)),1),\"\")","v":""}]
[{"$f":"IFERROR(INDEX(Tableau_de_suivi[[Nom/Désignation]:[Clôturé]],SMALL(IF(Tableau_de_suivi[Type d''acte]=$B$1,ROW(Tableau_de_suivi[N°])-2),ROWS($1:17)),1),\"\")","v":""}]
[{"$f":"IFERROR(INDEX(Tableau_de_suivi[[Nom/Désignation]:[Clôturé]],SMALL(IF(Tableau_de_suivi[Type d''acte]=$B$1,ROW(Tableau_de_suivi[N°])-2),ROWS($1:18)),1),\"\")","v":""}]
[{"$f":"IFERROR(INDEX(Tableau_de_suivi[[Nom/Désignation]:[Clôturé]],SMALL(IF(Tableau_de_suivi[Type d''acte]=$B$1,ROW(Tableau_de_suivi[N°])-2),ROWS($1:19)),1),\"\")","v":""}]
[{"$f":"IFERROR(INDEX(Tableau_de_suivi[[Nom/Désignation]:[Clôturé]],SMALL(IF(Tableau_de_suivi[Type d''acte]=$B$1,ROW(Tableau_de_suivi[N°])-2),ROWS($1:20)),1),\"\")","v":""}]
[{"$f":"IFERROR(INDEX(Tableau_de_suivi[[Nom/Désignation]:[Clôturé]],SMALL(IF(Tableau_de_suivi[Type d''acte]=$B$1,ROW(Tableau_de_suivi[N°])-2),ROWS($1:21)),1),\"\")","v":""}]
[{"$f":"IFERROR(INDEX(Tableau_de_suivi[[Nom/Désignation]:[Clôturé]],SMALL(IF(Tableau_de_suivi[Type d''acte]=$B$1,ROW(Tableau_de_suivi[N°])-2),ROWS($1:22)),1),\"\")","v":""}]
[{"$f":"IFERROR(INDEX(Tableau_de_suivi[[Nom/Désignation]:[Clôturé]],SMALL(IF(Tableau_de_suivi[Type d''acte]=$B$1,ROW(Tableau_de_suivi[N°])-2),ROWS($1:23)),1),\"\")","v":""}]
[{"$f":"IFERROR(INDEX(Tableau_de_suivi[[Nom/Désignation]:[Clôturé]],SMALL(IF(Tableau_de_suivi[Type d''acte]=$B$1,ROW(Tableau_de_suivi[N°])-2),ROWS($1:24)),1),\"\")","v":""}]
[{"$f":"IFERROR(INDEX(Tableau_de_suivi[[Nom/Désignation]:[Clôturé]],SMALL(IF(Tableau_de_suivi[Type d''acte]=$B$1,ROW(Tableau_de_suivi[N°])-2),ROWS($1:25)),1),\"\")","v":""}]
[{"$f":"IFERROR(INDEX(Tableau_de_suivi[[Nom/Désignation]:[Clôturé]],SMALL(IF(Tableau_de_suivi[Type d''acte]=$B$1,ROW(Tableau_de_suivi[N°])-2),ROWS($1:26)),1),\"\")","v":""}]
[{"$f":"IFERROR(INDEX(Tableau_de_suivi[[Nom/Désignation]:[Clôturé]],SMALL(IF(Tableau_de_suivi[Type d''acte]=$B$1,ROW(Tableau_de_suivi[N°])-2),ROWS($1:27)),1),\"\")","v":""}]
[{"$f":"IFERROR(INDEX(Tableau_de_suivi[[Nom/Désignation]:[Clôturé]],SMALL(IF(Tableau_de_suivi[Type d''acte]=$B$1,ROW(Tableau_de_suivi[N°])-2),ROWS($1:28)),1),\"\")","v":""}]
[{"$f":"IFERROR(INDEX(Tableau_de_suivi[[Nom/Désignation]:[Clôturé]],SMALL(IF(Tableau_de_suivi[Type d''acte]=$B$1,ROW(Tableau_de_suivi[N°])-2),ROWS($1:29)),1),\"\")","v":""}]
[{"$f":"IFERROR(INDEX(Tableau_de_suivi[[Nom/Désignation]:[Clôturé]],SMALL(IF(Tableau_de_suivi[Type d''acte]=$B$1,ROW(Tableau_de_suivi[N°])-2),ROWS($1:30)),1),\"\")","v":""}]
[{"$f":"IFERROR(INDEX(Tableau_de_suivi[[Nom/Désignation]:[Clôturé]],SMALL(IF(Tableau_de_suivi[Type d''acte]=$B$1,ROW(Tableau_de_suivi[N°])-2),ROWS($1:31)),1),\"\")","v":""}]
[{"$f":"IFERROR(INDEX(Tableau_de_suivi[[Nom/Désignation]:[Clôturé]],SMALL(IF(Tableau_de_suivi[Type d''acte]=$B$1,ROW(Tableau_de_suivi[N°])-2),ROWS($1:32)),1),\"\")","v":""}]
[{"$f":"IFERROR(INDEX(Tableau_de_suivi[[Nom/Désignation]:[Clôturé]],SMALL(IF(Tableau_de_suivi[Type d''acte]=$B$1,ROW(Tableau_de_suivi[N°])-2),ROWS($1:33)),1),\"\")","v":""}]
[{"$f":"IFERROR(INDEX(Tableau_de_suivi[[Nom/Désignation]:[Clôturé]],SMALL(IF(Tableau_de_suivi[Type d''acte]=$B$1,ROW(Tableau_de_suivi[N°])-2),ROWS($1:34)),1),\"\")","v":""}]
[{"$f":"IFERROR(INDEX(Tableau_de_suivi[[Nom/Désignation]:[Clôturé]],SMALL(IF(Tableau_de_suivi[Type d''acte]=$B$1,ROW(Tableau_de_suivi[N°])-2),ROWS($1:35)),1),\"\")","v":""}]
[{"$f":"IFERROR(INDEX(Tableau_de_suivi[[Nom/Désignation]:[Clôturé]],SMALL(IF(Tableau_de_suivi[Type d''acte]=$B$1,ROW(Tableau_de_suivi[N°])-2),ROWS($1:36)),1),\"\")","v":""}]
[{"$f":"IFERROR(INDEX(Tableau_de_suivi[[Nom/Désignation]:[Clôturé]],SMALL(IF(Tableau_de_suivi[Type d''acte]=$B$1,ROW(Tableau_de_suivi[N°])-2),ROWS($1:37)),1),\"\")","v":""}]
[{"$f":"IFERROR(INDEX(Tableau_de_suivi[[Nom/Désignation]:[Clôturé]],SMALL(IF(Tableau_de_suivi[Type d''acte]=$B$1,ROW(Tableau_de_suivi[N°])-2),ROWS($1:38)),1),\"\")","v":""}]
[{"$f":"IFERROR(INDEX(Tableau_de_suivi[[Nom/Désignation]:[Clôturé]],SMALL(IF(Tableau_de_suivi[Type d''acte]=$B$1,ROW(Tableau_de_suivi[N°])-2),ROWS($1:39)),1),\"\")","v":""}]
[{"$f":"IFERROR(INDEX(Tableau_de_suivi[[Nom/Désignation]:[Clôturé]],SMALL(IF(Tableau_de_suivi[Type d''acte]=$B$1,ROW(Tableau_de_suivi[N°])-2),ROWS($1:40)),1),\"\")","v":""}]
[{"$f":"IFERROR(INDEX(Tableau_de_suivi[[Nom/Désignation]:[Clôturé]],SMALL(IF(Tableau_de_suivi[Type d''acte]=$B$1,ROW(Tableau_de_suivi[N°])-2),ROWS($1:41)),1),\"\")","v":""}]
[{"$f":"IFERROR(INDEX(Tableau_de_suivi[[Nom/Désignation]:[Clôturé]],SMALL(IF(Tableau_de_suivi[Type d''acte]=$B$1,ROW(Tableau_de_suivi[N°])-2),ROWS($1:42)),1),\"\")","v":""}]
[{"$f":"IFERROR(INDEX(Tableau_de_suivi[[Nom/Désignation]:[Clôturé]],SMALL(IF(Tableau_de_suivi[Type d''acte]=$B$1,ROW(Tableau_de_suivi[N°])-2),ROWS($1:43)),1),\"\")","v":""}]
[{"$f":"IFERROR(INDEX(Tableau_de_suivi[[Nom/Désignation]:[Clôturé]],SMALL(IF(Tableau_de_suivi[Type d''acte]=$B$1,ROW(Tableau_de_suivi[N°])-2),ROWS($1:44)),1),\"\")","v":""}]
[{"$f":"IFERROR(INDEX(Tableau_de_suivi[[Nom/Désignation]:[Clôturé]],SMALL(IF(Tableau_de_suivi[Type d''acte]=$B$1,ROW(Tableau_de_suivi[N°])-2),ROWS($1:45)),1),\"\")","v":""}]
[{"$f":"IFERROR(INDEX(Tableau_de_suivi[[Nom/Désignation]:[Clôturé]],SMALL(IF(Tableau_de_suivi[Type d''acte]=$B$1,ROW(Tableau_de_suivi[N°])-2),ROWS($1:46)),1),\"\")","v":""}]
[{"$f":"IFERROR(INDEX(Tableau_de_suivi[[Nom/Désignation]:[Clôturé]],SMALL(IF(Tableau_de_suivi[Type d''acte]=$B$1,ROW(Tableau_de_suivi[N°])-2),ROWS($1:47)),1),\"\")","v":""}]
[{"$f":"IFERROR(INDEX(Tableau_de_suivi[[Nom/Désignation]:[Clôturé]],SMALL(IF(Tableau_de_suivi[Type d''acte]=$B$1,ROW(Tableau_de_suivi[N°])-2),ROWS($1:48)),1),\"\")","v":""}]
[{"$f":"IFERROR(INDEX(Tableau_de_suivi[[Nom/Désignation]:[Clôturé]],SMALL(IF(Tableau_de_suivi[Type d''acte]=$B$1,ROW(Tableau_de_suivi[N°])-2),ROWS($1:49)),1),\"\")","v":""}]
[{"$f":"IFERROR(INDEX(Tableau_de_suivi[[Nom/Désignation]:[Clôturé]],SMALL(IF(Tableau_de_suivi[Type d''acte]=$B$1,ROW(Tableau_de_suivi[N°])-2),ROWS($1:50)),1),\"\")","v":""}]
[{"$f":"IFERROR(INDEX(Tableau_de_suivi[[Nom/Désignation]:[Clôturé]],SMALL(IF(Tableau_de_suivi[Type d''acte]=$B$1,ROW(Tableau_de_suivi[N°])-2),ROWS($1:51)),1),\"\")","v":""}]
[{"$f":"IFERROR(INDEX(Tableau_de_suivi[[Nom/Désignation]:[Clôturé]],SMALL(IF(Tableau_de_suivi[Type d''acte]=$B$1,ROW(Tableau_de_suivi[N°])-2),ROWS($1:52)),1),\"\")","v":""}]
[{"$f":"IFERROR(INDEX(Tableau_de_suivi[[Nom/Désignation]:[Clôturé]],SMALL(IF(Tableau_de_suivi[Type d''acte]=$B$1,ROW(Tableau_de_suivi[N°])-2),ROWS($1:53)),1),\"\")","v":""}]
[{"$f":"IFERROR(INDEX(Tableau_de_suivi[[Nom/Désignation]:[Clôturé]],SMALL(IF(Tableau_de_suivi[Type d''acte]=$B$1,ROW(Tableau_de_suivi[N°])-2),ROWS($1:54)),1),\"\")","v":""}]
[{"$f":"IFERROR(INDEX(Tableau_de_suivi[[Nom/Désignation]:[Clôturé]],SMALL(IF(Tableau_de_suivi[Type d''acte]=$B$1,ROW(Tableau_de_suivi[N°])-2),ROWS($1:55)),1),\"\")","v":""}]
[{"$f":"IFERROR(INDEX(Tableau_de_suivi[[Nom/Désignation]:[Clôturé]],SMALL(IF(Tableau_de_suivi[Type d''acte]=$B$1,ROW(Tableau_de_suivi[N°])-2),ROWS($1:56)),1),\"\")","v":""}]
[{"$f":"IFERROR(INDEX(Tableau_de_suivi[[Nom/Désignation]:[Clôturé]],SMALL(IF(Tableau_de_suivi[Type d''acte]=$B$1,ROW(Tableau_de_suivi[N°])-2),ROWS($1:57)),1),\"\")","v":""}]
[{"$f":"IFERROR(INDEX(Tableau_de_suivi[[Nom/Désignation]:[Clôturé]],SMALL(IF(Tableau_de_suivi[Type d''acte]=$B$1,ROW(Tableau_de_suivi[N°])-2),ROWS($1:58)),1),\"\")","v":""}]
[{"$f":"IFERROR(INDEX(Tableau_de_suivi[[Nom/Désignation]:[Clôturé]],SMALL(IF(Tableau_de_suivi[Type d''acte]=$B$1,ROW(Tableau_de_suivi[N°])-2),ROWS($1:59)),1),\"\")","v":""}]
[{"$f":"IFERROR(INDEX(Tableau_de_suivi[[Nom/Désignation]:[Clôturé]],SMALL(IF(Tableau_de_suivi[Type d''acte]=$B$1,ROW(Tableau_de_suivi[N°])-2),ROWS($1:60)),1),\"\")","v":""}]
[{"$f":"IFERROR(INDEX(Tableau_de_suivi[[Nom/Désignation]:[Clôturé]],SMALL(IF(Tableau_de_suivi[Type d''acte]=$B$1,ROW(Tableau_de_suivi[N°])-2),ROWS($1:61)),1),\"\")","v":""}]
[{"$f":"IFERROR(INDEX(Tableau_de_suivi[[Nom/Désignation]:[Clôturé]],SMALL(IF(Tableau_de_suivi[Type d''acte]=$B$1,ROW(Tableau_de_suivi[N°])-2),ROWS($1:62)),1),\"\")","v":""}]
[{"$f":"IFERROR(INDEX(Tableau_de_suivi[[Nom/Désignation]:[Clôturé]],SMALL(IF(Tableau_de_suivi[Type d''acte]=$B$1,ROW(Tableau_de_suivi[N°])-2),ROWS($1:63)),1),\"\")","v":""}]
[{"$f":"IFERROR(INDEX(Tableau_de_suivi[[Nom/Désignation]:[Clôturé]],SMALL(IF(Tableau_de_suivi[Type d''acte]=$B$1,ROW(Tableau_de_suivi[N°])-2),ROWS($1:64)),1),\"\")","v":""}]
[{"$f":"IFERROR(INDEX(Tableau_de_suivi[[Nom/Désignation]:[Clôturé]],SMALL(IF(Tableau_de_suivi[Type d''acte]=$B$1,ROW(Tableau_de_suivi[N°])-2),ROWS($1:65)),1),\"\")","v":""}]
[{"$f":"IFERROR(INDEX(Tableau_de_suivi[[Nom/Désignation]:[Clôturé]],SMALL(IF(Tableau_de_suivi[Type d''acte]=$B$1,ROW(Tableau_de_suivi[N°])-2),ROWS($1:66)),1),\"\")","v":""}]
[{"$f":"IFERROR(INDEX(Tableau_de_suivi[[Nom/Désignation]:[Clôturé]],SMALL(IF(Tableau_de_suivi[Type d''acte]=$B$1,ROW(Tableau_de_suivi[N°])-2),ROWS($1:67)),1),\"\")","v":""}]
[{"$f":"IFERROR(INDEX(Tableau_de_suivi[[Nom/Désignation]:[Clôturé]],SMALL(IF(Tableau_de_suivi[Type d''acte]=$B$1,ROW(Tableau_de_suivi[N°])-2),ROWS($1:68)),1),\"\")","v":""}]
[{"$f":"IFERROR(INDEX(Tableau_de_suivi[[Nom/Désignation]:[Clôturé]],SMALL(IF(Tableau_de_suivi[Type d''acte]=$B$1,ROW(Tableau_de_suivi[N°])-2),ROWS($1:69)),1),\"\")","v":""}]
[{"$f":"IFERROR(INDEX(Tableau_de_suivi[[Nom/Désignation]:[Clôturé]],SMALL(IF(Tableau_de_suivi[Type d''acte]=$B$1,ROW(Tableau_de_suivi[N°])-2),ROWS($1:70)),1),\"\")","v":""}]
[{"$f":"IFERROR(INDEX(Tableau_de_suivi[[Nom/Désignation]:[Clôturé]],SMALL(IF(Tableau_de_suivi[Type d''acte]=$B$1,ROW(Tableau_de_suivi[N°])-2),ROWS($1:71)),1),\"\")","v":""}]
[{"$f":"IFERROR(INDEX(Tableau_de_suivi[[Nom/Désignation]:[Clôturé]],SMALL(IF(Tableau_de_suivi[Type d''acte]=$B$1,ROW(Tableau_de_suivi[N°])-2),ROWS($1:72)),1),\"\")","v":""}]
[{"$f":"IFERROR(INDEX(Tableau_de_suivi[[Nom/Désignation]:[Clôturé]],SMALL(IF(Tableau_de_suivi[Type d''acte]=$B$1,ROW(Tableau_de_suivi[N°])-2),ROWS($1:73)),1),\"\")","v":""}]
[{"$f":"IFERROR(INDEX(Tableau_de_suivi[[Nom/Désignation]:[Clôturé]],SMALL(IF(Tableau_de_suivi[Type d''acte]=$B$1,ROW(Tableau_de_suivi[N°])-2),ROWS($1:74)),1),\"\")","v":""}]
[{"$f":"IFERROR(INDEX(Tableau_de_suivi[[Nom/Désignation]:[Clôturé]],SMALL(IF(Tableau_de_suivi[Type d''acte]=$B$1,ROW(Tableau_de_suivi[N°])-2),ROWS($1:75)),1),\"\")","v":""}]
[{"$f":"IFERROR(INDEX(Tableau_de_suivi[[Nom/Désignation]:[Clôturé]],SMALL(IF(Tableau_de_suivi[Type d''acte]=$B$1,ROW(Tableau_de_suivi[N°])-2),ROWS($1:76)),1),\"\")","v":""}]
[{"$f":"IFERROR(INDEX(Tableau_de_suivi[[Nom/Désignation]:[Clôturé]],SMALL(IF(Tableau_de_suivi[Type d''acte]=$B$1,ROW(Tableau_de_suivi[N°])-2),ROWS($1:77)),1),\"\")","v":""}]
[{"$f":"IFERROR(INDEX(Tableau_de_suivi[[Nom/Désignation]:[Clôturé]],SMALL(IF(Tableau_de_suivi[Type d''acte]=$B$1,ROW(Tableau_de_suivi[N°])-2),ROWS($1:78)),1),\"\")","v":""}]
[{"$f":"IFERROR(INDEX(Tableau_de_suivi[[Nom/Désignation]:[Clôturé]],SMALL(IF(Tableau_de_suivi[Type d''acte]=$B$1,ROW(Tableau_de_suivi[N°])-2),ROWS($1:79)),1),\"\")","v":""}]
[{"$f":"IFERROR(INDEX(Tableau_de_suivi[[Nom/Désignation]:[Clôturé]],SMALL(IF(Tableau_de_suivi[Type d''acte]=$B$1,ROW(Tableau_de_suivi[N°])-2),ROWS($1:80)),1),\"\")","v":""}]
[{"$f":"IFERROR(INDEX(Tableau_de_suivi[[Nom/Désignation]:[Clôturé]],SMALL(IF(Tableau_de_suivi[Type d''acte]=$B$1,ROW(Tableau_de_suivi[N°])-2),ROWS($1:81)),1),\"\")","v":""}]
[{"$f":"IFERROR(INDEX(Tableau_de_suivi[[Nom/Désignation]:[Clôturé]],SMALL(IF(Tableau_de_suivi[Type d''acte]=$B$1,ROW(Tableau_de_suivi[N°])-2),ROWS($1:82)),1),\"\")","v":""}]
[{"$f":"IFERROR(INDEX(Tableau_de_suivi[[Nom/Désignation]:[Clôturé]],SMALL(IF(Tableau_de_suivi[Type d''acte]=$B$1,ROW(Tableau_de_suivi[N°])-2),ROWS($1:83)),1),\"\")","v":""}]
[{"$f":"IFERROR(INDEX(Tableau_de_suivi[[Nom/Désignation]:[Clôturé]],SMALL(IF(Tableau_de_suivi[Type d''acte]=$B$1,ROW(Tableau_de_suivi[N°])-2),ROWS($1:84)),1),\"\")","v":""}]
[{"$f":"IFERROR(INDEX(Tableau_de_suivi[[Nom/Désignation]:[Clôturé]],SMALL(IF(Tableau_de_suivi[Type d''acte]=$B$1,ROW(Tableau_de_suivi[N°])-2),ROWS($1:85)),1),\"\")","v":""}]
[{"$f":"IFERROR(INDEX(Tableau_de_suivi[[Nom/Désignation]:[Clôturé]],SMALL(IF(Tableau_de_suivi[Type d''acte]=$B$1,ROW(Tableau_de_suivi[N°])-2),ROWS($1:86)),1),\"\")","v":""}]
[{"$f":"IFERROR(INDEX(Tableau_de_suivi[[Nom/Désignation]:[Clôturé]],SMALL(IF(Tableau_de_suivi[Type d''acte]=$B$1,ROW(Tableau_de_suivi[N°])-2),ROWS($1:87)),1),\"\")","v":""}]
[{"$f":"IFERROR(INDEX(Tableau_de_suivi[[Nom/Désignation]:[Clôturé]],SMALL(IF(Tableau_de_suivi[Type d''acte]=$B$1,ROW(Tableau_de_suivi[N°])-2),ROWS($1:88)),1),\"\")","v":""}]
[{"$f":"IFERROR(INDEX(Tableau_de_suivi[[Nom/Désignation]:[Clôturé]],SMALL(IF(Tableau_de_suivi[Type d''acte]=$B$1,ROW(Tableau_de_suivi[N°])-2),ROWS($1:89)),1),\"\")","v":""}]
[{"$f":"IFERROR(INDEX(Tableau_de_suivi[[Nom/Désignation]:[Clôturé]],SMALL(IF(Tableau_de_suivi[Type d''acte]=$B$1,ROW(Tableau_de_suivi[N°])-2),ROWS($1:90)),1),\"\")","v":""}]
[{"$f":"IFERROR(INDEX(Tableau_de_suivi[[Nom/Désignation]:[Clôturé]],SMALL(IF(Tableau_de_suivi[Type d''acte]=$B$1,ROW(Tableau_de_suivi[N°])-2),ROWS($1:91)),1),\"\")","v":""}]
[{"$f":"IFERROR(INDEX(Tableau_de_suivi[[Nom/Désignation]:[Clôturé]],SMALL(IF(Tableau_de_suivi[Type d''acte]=$B$1,ROW(Tableau_de_suivi[N°])-2),ROWS($1:92)),1),\"\")","v":""}]
[{"$f":"IFERROR(INDEX(Tableau_de_suivi[[Nom/Désignation]:[Clôturé]],SMALL(IF(Tableau_de_suivi[Type d''acte]=$B$1,ROW(Tableau_de_suivi[N°])-2),ROWS($1:93)),1),\"\")","v":""}]
[{"$f":"IFERROR(INDEX(Tableau_de_suivi[[Nom/Désignation]:[Clôturé]],SMALL(IF(Tableau_de_suivi[Type d''acte]=$B$1,ROW(Tableau_de_suivi[N°])-2),ROWS($1:94)),1),\"\")","v":""}]
[{"$f":"IFERROR(INDEX(Tableau_de_suivi[[Nom/Désignation]:[Clôturé]],SMALL(IF(Tableau_de_suivi[Type d''acte]=$B$1,ROW(Tableau_de_suivi[N°])-2),ROWS($1:95)),1),\"\")","v":""}]
[{"$f":"IFERROR(INDEX(Tableau_de_suivi[[Nom/Désignation]:[Clôturé]],SMALL(IF(Tableau_de_suivi[Type d''acte]=$B$1,ROW(Tableau_de_suivi[N°])-2),ROWS($1:96)),1),\"\")","v":""}]
[{"$f":"IFERROR(INDEX(Tableau_de_suivi[[Nom/Désignation]:[Clôturé]],SMALL(IF(Tableau_de_suivi[Type d''acte]=$B$1,ROW(Tableau_de_suivi[N°])-2),ROWS($1:97)),1),\"\")","v":""}]

{"sheet":"Suivi des documents_OLD","index":12,"n_rows":6,"n_cols":75,"rows_kept":6,"cut":false,"hidden":false,"merged":[[0,65,0,71],[0,74,0,82],[0,1,0,10],[0,13,0,21],[0,24,0,29],[0,32,0,42],[0,45,0,52],[0,55,0,62]]}
[null,"AUTORISATION ETABLISSEMENT",null,null,null,null,null,null,null,null,null,null,null,"CONSTITUTION",null,null,null,null,null,null,null,null,null,null,"Demande inscription TVA ",null,null,null,null,null,null,null,"Dissolution",null,null,null,null,null,null,null,null,null,null,null,null,"Fusion",null,null,null,null,null,null,null,null,null,"Scission",null,null,null,null,null,null,null,null,null,"Changements statutaires",null,null,null,null,null,null,null,null,"Autres : "]
["NOM","Formulaire de demande ","Déclaration sur l'honneur","Diplôme(s)","Certificat relevé carrière prof. ","Autres preuves de qualifications prof.","Extrait de casier judiciaire ","Attestation de non-faillite","(Projet de) Statuts","Contrat de bail ","Carte ID ",null,"NOM","Déclaration BE AFC ","Déclaration BE notaire ","Copie ID(s) ","Certificat blocage de fonds ","Contrat de bail ","Certificat d'évaluation ","Mandat acceptation gérance","Copie ID gérant","Procuration ",null,"NOM","Formulaire de demande ","Copie statuts ","Contrat de bail","ID gérant","Copie autorisation établissement ","Relevé d'identité bancaire ",null,"NOM","Déclaration BE notaire ","Copie ID ","Attestation AED","Attestation ACD ","Attestation CCSS","Copie des statuts ","Extrait RCSL","Comptes annuels","Situation arrêtée ","Registre des actionnaires ","Organigramme signé",null,"NOM","Déclaration BE notaire ","Copie ID ","Copie des statuts ","Extrait RCSL","Comptes annuels","Situation arrêtée ","Registre des actionnaires ","Organigramme signé",null,"NOM","Déclaration BE notaire ","Copie ID ","Copie des statuts ","Extrait RCSL","Comptes annuels","Situation arrêtée ","Registre des actionnaires ","Organigramme signé",null,"NOM","Extrait RCSL","ID ","Statuts ","Déclaration BE notaire ","Autorisation établissement (si nécessaire)","Registre actionnaires / Organigramme (si nécessaire)","Contrat de bail (si nécessaire)",null,"NOM"]
[]
[]
[]
[null,null,null,null,null,null,null,null,null,null,null,null,null,null,null,null,null,null,null,null,null,null,null,null,null,null,null,null,null,null,null,null,null,null,null,null,null,null,null,null,null,null,null,null,null,null,null,null,null,null,null,null,null,null,null,null,null,null,null,null,null,null,null,null,null,null,null," "]

{"sheet":"Dossiers clôturés","index":13,"n_rows":100,"n_cols":22,"rows_kept":100,"cut":false,"hidden":false,"merged":[[0,0,0,21]]}
["DOSSIERS CLÔTURES"]
["N°","Nom/Désignation","Personne en charge","Colonne1","Type d'acte","Colonne2","Nom contact","Notaire ","Personne de contact","Email","Téléphone","Date échéance","Date passage de l'acte","Échéance (Jours)","Priorité","Date rappel client","Colonne3","Publication de l'acte","Commentaires","Facturation","Colonne4","Clôturé"]
[{"$f":"IFERROR(INDEX(Tableau_de_suivi[[N°]:[Clôturé]],SMALL(IF(Tableau_de_suivi[Clôturé]=\"OUI\",ROW(Tableau_de_suivi[Clôturé])-2),ROWS($1:1)),COLUMN()),\"\")","v":3},{"$f":"IFERROR(INDEX(Tableau_de_suivi[[N°]:[Clôturé]],SMALL(IF(Tableau_de_suivi[Clôturé]=\"OUI\",ROW(Tableau_de_suivi[Clôturé])-2),ROWS($1:1)),COLUMN()),\"\")","v":"Truc"},{"$f":"IFERROR(INDEX(Tableau_de_suivi[[N°]:[Clôturé]],SMALL(IF(Tableau_de_suivi[Clôturé]=\"OUI\",ROW(Tableau_de_suivi[Clôturé])-2),ROWS($1:1)),COLUMN()),\"\")","v":"BOURDIN C."},{"$f":"IFERROR(INDEX(Tableau_de_suivi[[N°]:[Clôturé]],SMALL(IF(Tableau_de_suivi[Clôturé]=\"OUI\",ROW(Tableau_de_suivi[Clôturé])-2),ROWS($1:1)),COLUMN()),\"\")","v":0},{"$f":"IFERROR(INDEX(Tableau_de_suivi[[N°]:[Clôturé]],SMALL(IF(Tableau_de_suivi[Clôturé]=\"OUI\",ROW(Tableau_de_suivi[Clôturé])-2),ROWS($1:1)),COLUMN()),\"\")","v":"Autorisation d'établissement"},{"$f":"IFERROR(INDEX(Tableau_de_suivi[[N°]:[Clôturé]],SMALL(IF(Tableau_de_suivi[Clôturé]=\"OUI\",ROW(Tableau_de_suivi[Clôturé])-2),ROWS($1:1)),COLUMN()),\"\")","v":0},{"$f":"IFERROR(INDEX(Tableau_de_suivi[[N°]:[Clôturé]],SMALL(IF(Tableau_de_suivi[Clôturé]=\"OUI\",ROW(Tableau_de_suivi[Clôturé])-2),ROWS($1:1)),COLUMN()),\"\")","v":0},{"$f":"IFERROR(INDEX(Tableau_de_suivi[[N°]:[Clôturé]],SMALL(IF(Tableau_de_suivi[Clôturé]=\"OUI\",ROW(Tableau_de_suivi[Clôturé])-2),ROWS($1:1)),COLUMN()),\"\")","v":"BETTINGEN Paul"},{"$f":"IFERROR(INDEX(Tableau_de_suivi[[N°]:[Clôturé]],SMALL(IF(Tableau_de_suivi[Clôturé]=\"OUI\",ROW(Tableau_de_suivi[Clôturé])-2),ROWS($1:1)),COLUMN()),\"\")","v":0},{"$f":"IFERROR(INDEX(Tableau_de_suivi[[N°]:[Clôturé]],SMALL(IF(Tableau_de_suivi[Clôturé]=\"OUI\",ROW(Tableau_de_suivi[Clôturé])-2),ROWS($1:1)),COLUMN()),\"\")","v":0},{"$f":"IFERROR(INDEX(Tableau_de_suivi[[N°]:[Clôturé]],SMALL(IF(Tableau_de_suivi[Clôturé]=\"OUI\",ROW(Tableau_de_suivi[Clôturé])-2),ROWS($1:1)),COLUMN()),\"\")","v":0},{"$f":"IFERROR(INDEX(Tableau_de_suivi[[N°]:[Clôturé]],SMALL(IF(Tableau_de_suivi[Clôturé]=\"OUI\",ROW(Tableau_de_suivi[Clôturé])-2),ROWS($1:1)),COLUMN()),\"\")","v":"00:00:00"},{"$f":"IFERROR(INDEX(Tableau_de_suivi[[N°]:[Clôturé]],SMALL(IF(Tableau_de_suivi[Clôturé]=\"OUI\",ROW(Tableau_de_suivi[Clôturé])-2),ROWS($1:1)),COLUMN()),\"\")","v":"2018-02-01"},{"$f":"IFERROR(INDEX(Tableau_de_suivi[[N°]:[Clôturé]],SMALL(IF(Tableau_de_suivi[Clôturé]=\"OUI\",ROW(Tableau_de_suivi[Clôturé])-2),ROWS($1:1)),COLUMN()),\"\")","v":10},{"$f":"IFERROR(INDEX(Tableau_de_suivi[[N°]:[Clôturé]],SMALL(IF(Tableau_de_suivi[Clôturé]=\"OUI\",ROW(Tableau_de_suivi[Clôturé])-2),ROWS($1:1)),COLUMN()),\"\")","v":"Normal"},{"$f":"IFERROR(INDEX(Tableau_de_suivi[[N°]:[Clôturé]],SMALL(IF(Tableau_de_suivi[Clôturé]=\"OUI\",ROW(Tableau_de_suivi[Clôturé])-2),ROWS($1:1)),COLUMN()),\"\")","v":"00:00:00"},{"$f":"IFERROR(INDEX(Tableau_de_suivi[[N°]:[Clôturé]],SMALL(IF(Tableau_de_suivi[Clôturé]=\"OUI\",ROW(Tableau_de_suivi[Clôturé])-2),ROWS($1:1)),COLUMN()),\"\")","v":0},{"$f":"IFERROR(INDEX(Tableau_de_suivi[[N°]:[Clôturé]],SMALL(IF(Tableau_de_suivi[Clôturé]=\"OUI\",ROW(Tableau_de_suivi[Clôturé])-2),ROWS($1:1)),COLUMN()),\"\")","v":"OUI"},{"$f":"IFERROR(INDEX(Tableau_de_suivi[[N°]:[Clôturé]],SMALL(IF(Tableau_de_suivi[Clôturé]=\"OUI\",ROW(Tableau_de_suivi[Clôturé])-2),ROWS($1:1)),COLUMN()),\"\")","v":0},{"$f":"IFERROR(INDEX(Tableau_de_suivi[[N°]:[Clôturé]],SMALL(IF(Tableau_de_suivi[Clôturé]=\"OUI\",ROW(Tableau_de_suivi[Clôturé])-2),ROWS($1:1)),COLUMN()),\"\")","v":0},{"$f":"IFERROR(INDEX(Tableau_de_suivi[[N°]:[Clôturé]],SMALL(IF(Tableau_de_suivi[Clôturé]=\"OUI\",ROW(Tableau_de_suivi[Clôturé])-2),ROWS($1:1)),COLUMN()),\"\")","v":0},{"$f":"IFERROR(INDEX(Tableau_de_suivi[[N°]:[Clôturé]],SMALL(IF(Tableau_de_suivi[Clôturé]=\"OUI\",ROW(Tableau_de_suivi[Clôturé])-2),ROWS($1:1)),COLUMN()),\"\")","v":"OUI"}]
[{"$f":"IFERROR(INDEX(Tableau_de_suivi[[N°]:[Clôturé]],SMALL(IF(Tableau_de_suivi[Clôturé]=\"OUI\",ROW(Tableau_de_suivi[Clôturé])-2),ROWS($1:2)),COLUMN()),\"\")","v":5},{"$f":"IFERROR(INDEX(Tableau_de_suivi[[N°]:[Clôturé]],SMALL(IF(Tableau_de_suivi[Clôturé]=\"OUI\",ROW(Tableau_de_suivi[Clôturé])-2),ROWS($1:2)),COLUMN()),\"\")","v":"Michel"},{"$f":"IFERROR(INDEX(Tableau_de_suivi[[N°]:[Clôturé]],SMALL(IF(Tableau_de_suivi[Clôturé]=\"OUI\",ROW(Tableau_de_suivi[Clôturé])-2),ROWS($1:2)),COLUMN()),\"\")","v":"LAMBERTY C."},{"$f":"IFERROR(INDEX(Tableau_de_suivi[[N°]:[Clôturé]],SMALL(IF(Tableau_de_suivi[Clôturé]=\"OUI\",ROW(Tableau_de_suivi[Clôturé])-2),ROWS($1:2)),COLUMN()),\"\")","v":0},{"$f":"IFERROR(INDEX(Tableau_de_suivi[[N°]:[Clôturé]],SMALL(IF(Tableau_de_suivi[Clôturé]=\"OUI\",ROW(Tableau_de_suivi[Clôturé])-2),ROWS($1:2)),COLUMN()),\"\")","v":"Demande inscription TVA "},{"$f":"IFERROR(INDEX(Tableau_de_suivi[[N°]:[Clôturé]],SMALL(IF(Tableau_de_suivi[Clôturé]=\"OUI\",ROW(Tableau_de_suivi[Clôturé])-2),ROWS($1:2)),COLUMN()),\"\")","v":0},{"$f":"IFERROR(INDEX(Tableau_de_suivi[[N°]:[Clôturé]],SMALL(IF(Tableau_de_suivi[Clôturé]=\"OUI\",ROW(Tableau_de_suivi[Clôturé])-2),ROWS($1:2)),COLUMN()),\"\")","v":0},{"$f":"IFERROR(INDEX(Tableau_de_suivi[[N°]:[Clôturé]],SMALL(IF(Tableau_de_suivi[Clôturé]=\"OUI\",ROW(Tableau_de_suivi[Clôturé])-2),ROWS($1:2)),COLUMN()),\"\")","v":"LECUIT Marc"},{"$f":"IFERROR(INDEX(Tableau_de_suivi[[N°]:[Clôturé]],SMALL(IF(Tableau_de_suivi[Clôturé]=\"OUI\",ROW(Tableau_de_suivi[Clôturé])-2),ROWS($1:2)),COLUMN()),\"\")","v":0},{"$f":"IFERROR(INDEX(Tableau_de_suivi[[N°]:[Clôturé]],SMALL(IF(Tableau_de_suivi[Clôturé]=\"OUI\",ROW(Tableau_de_suivi[Clôturé])-2),ROWS($1:2)),COLUMN()),\"\")","v":0},{"$f":"IFERROR(INDEX(Tableau_de_suivi[[N°]:[Clôturé]],SMALL(IF(Tableau_de_suivi[Clôturé]=\"OUI\",ROW(Tableau_de_suivi[Clôturé])-2),ROWS($1:2)),COLUMN()),\"\")","v":0},{"$f":"IFERROR(INDEX(Tableau_de_suivi[[N°]:[Clôturé]],SMALL(IF(Tableau_de_suivi[Clôturé]=\"OUI\",ROW(Tableau_de_suivi[Clôturé])-2),ROWS($1:2)),COLUMN()),\"\")","v":"00:00:00"},{"$f":"IFERROR(INDEX(Tableau_de_suivi[[N°]:[Clôturé]],SMALL(IF(Tableau_de_suivi[Clôturé]=\"OUI\",ROW(Tableau_de_suivi[Clôturé])-2),ROWS($1:2)),COLUMN()),\"\")","v":"2018-01-28"},{"$f":"IFERROR(INDEX(Tableau_de_suivi[[N°]:[Clôturé]],SMALL(IF(Tableau_de_suivi[Clôturé]=\"OUI\",ROW(Tableau_de_suivi[Clôturé])-2),ROWS($1:2)),COLUMN()),\"\")","v":6},{"$f":"IFERROR(INDEX(Tableau_de_suivi[[N°]:[Clôturé]],SMALL(IF(Tableau_de_suivi[Clôturé]=\"OUI\",ROW(Tableau_de_suivi[Clôturé])-2),ROWS($1:2)),COLUMN()),\"\")","v":"Normal"},{"$f":"IFERROR(INDEX(Tableau_de_suivi[[N°]:[Clôturé]],SMALL(IF(Tableau_de_suivi[Clôturé]=\"OUI\",ROW(Tableau_de_suivi[Clôturé])-2),ROWS($1:2)),COLUMN()),\"\")","v":"00:00:00"},{"$f":"IFERROR(INDEX(Tableau_de_suivi[[N°]:[Clôturé]],SMALL(IF(Tableau_de_suivi[Clôturé]=\"OUI\",ROW(Tableau_de_suivi[Clôturé])-2),ROWS($1:2)),COLUMN()),\"\")","v":0},{"$f":"IFERROR(INDEX(Tableau_de_suivi[[N°]:[Clôturé]],SMALL(IF(Tableau_de_suivi[Clôturé]=\"OUI\",ROW(Tableau_de_suivi[Clôturé])-2),ROWS($1:2)),COLUMN()),\"\")","v":"NON"},{"$f":"IFERROR(INDEX(Tableau_de_suivi[[N°]:[Clôturé]],SMALL(IF(Tableau_de_suivi[Clôturé]=\"OUI\",ROW(Tableau_de_suivi[Clôturé])-2),ROWS($1:2)),COLUMN()),\"\")","v":0},{"$f":"IFERROR(INDEX(Tableau_de_suivi[[N°]:[Clôturé]],SMALL(IF(Tableau_de_suivi[Clôturé]=\"OUI\",ROW(Tableau_de_suivi[Clôturé])-2),ROWS($1:2)),COLUMN()),\"\")","v":0},{"$f":"IFERROR(INDEX(Tableau_de_suivi[[N°]:[Clôturé]],SMALL(IF(Tableau_de_suivi[Clôturé]=\"OUI\",ROW(Tableau_de_suivi[Clôturé])-2),ROWS($1:2)),COLUMN()),\"\")","v":0},{"$f":"IFERROR(INDEX(Tableau_de_suivi[[N°]:[Clôturé]],SMALL(IF(Tableau_de_suivi[Clôturé]=\"OUI\",ROW(Tableau_de_suivi[Clôturé])-2),ROWS($1:2)),COLUMN()),\"\")","v":"OUI"}]
[{"$f":"IFERROR(INDEX(Tableau_de_suivi[[N°]:[Clôturé]],SMALL(IF(Tableau_de_suivi[Clôturé]=\"OUI\",ROW(Tableau_de_suivi[Clôturé])-2),ROWS($1:3)),COLUMN()),\"\")","v":""},{"$f":"IFERROR(INDEX(Tableau_de_suivi[[N°]:[Clôturé]],SMALL(IF(Tableau_de_suivi[Clôturé]=\"OUI\",ROW(Tableau_de_suivi[Clôturé])-2),ROWS($1:3)),COLUMN()),\"\")","v":""},{"$f":"IFERROR(INDEX(Tableau_de_suivi[[N°]:[Clôturé]],SMALL(IF(Tableau_de_suivi[Clôturé]=\"OUI\",ROW(Tableau_de_suivi[Clôturé])-2),ROWS($1:3)),COLUMN()),\"\")","v":""},{"$f":"IFERROR(INDEX(Tableau_de_suivi[[N°]:[Clôturé]],SMALL(IF(Tableau_de_suivi[Clôturé]=\"OUI\",ROW(Tableau_de_suivi[Clôturé])-2),ROWS($1:3)),COLUMN()),\"\")","v":""},{"$f":"IFERROR(INDEX(Tableau_de_suivi[[N°]:[Clôturé]],SMALL(IF(Tableau_de_suivi[Clôturé]=\"OUI\",ROW(Tableau_de_suivi[Clôturé])-2),ROWS($1:3)),COLUMN()),\"\")","v":""},{"$f":"IFERROR(INDEX(Tableau_de_suivi[[N°]:[Clôturé]],SMALL(IF(Tableau_de_suivi[Clôturé]=\"OUI\",ROW(Tableau_de_suivi[Clôturé])-2),ROWS($1:3)),COLUMN()),\"\")","v":""},{"$f":"IFERROR(INDEX(Tableau_de_suivi[[N°]:[Clôturé]],SMALL(IF(Tableau_de_suivi[Clôturé]=\"OUI\",ROW(Tableau_de_suivi[Clôturé])-2),ROWS($1:3)),COLUMN()),\"\")","v":""},{"$f":"IFERROR(INDEX(Tableau_de_suivi[[N°]:[Clôturé]],SMALL(IF(Tableau_de_suivi[Clôturé]=\"OUI\",ROW(Tableau_de_suivi[Clôturé])-2),ROWS($1:3)),COLUMN()),\"\")","v":""},{"$f":"IFERROR(INDEX(Tableau_de_suivi[[N°]:[Clôturé]],SMALL(IF(Tableau_de_suivi[Clôturé]=\"OUI\",ROW(Tableau_de_suivi[Clôturé])-2),ROWS($1:3)),COLUMN()),\"\")","v":""},{"$f":"IFERROR(INDEX(Tableau_de_suivi[[N°]:[Clôturé]],SMALL(IF(Tableau_de_suivi[Clôturé]=\"OUI\",ROW(Tableau_de_suivi[Clôturé])-2),ROWS($1:3)),COLUMN()),\"\")","v":""},{"$f":"IFERROR(INDEX(Tableau_de_suivi[[N°]:[Clôturé]],SMALL(IF(Tableau_de_suivi[Clôturé]=\"OUI\",ROW(Tableau_de_suivi[Clôturé])-2),ROWS($1:3)),COLUMN()),\"\")","v":""},{"$f":"IFERROR(INDEX(Tableau_de_suivi[[N°]:[Clôturé]],SMALL(IF(Tableau_de_suivi[Clôturé]=\"OUI\",ROW(Tableau_de_suivi[Clôturé])-2),ROWS($1:3)),COLUMN()),\"\")","v":""},{"$f":"IFERROR(INDEX(Tableau_de_suivi[[N°]:[Clôturé]],SMALL(IF(Tableau_de_suivi[Clôturé]=\"OUI\",ROW(Tableau_de_suivi[Clôturé])-2),ROWS($1:3)),COLUMN()),\"\")","v":""},{"$f":"IFERROR(INDEX(Tableau_de_suivi[[N°]:[Clôturé]],SMALL(IF(Tableau_de_suivi[Clôturé]=\"OUI\",ROW(Tableau_de_suivi[Clôturé])-2),ROWS($1:3)),COLUMN()),\"\")","v":""},{"$f":"IFERROR(INDEX(Tableau_de_suivi[[N°]:[Clôturé]],SMALL(IF(Tableau_de_suivi[Clôturé]=\"OUI\",ROW(Tableau_de_suivi[Clôturé])-2),ROWS($1:3)),COLUMN()),\"\")","v":""},{"$f":"IFERROR(INDEX(Tableau_de_suivi[[N°]:[Clôturé]],SMALL(IF(Tableau_de_suivi[Clôturé]=\"OUI\",ROW(Tableau_de_suivi[Clôturé])-2),ROWS($1:3)),COLUMN()),\"\")","v":""},{"$f":"IFERROR(INDEX(Tableau_de_suivi[[N°]:[Clôturé]],SMALL(IF(Tableau_de_suivi[Clôturé]=\"OUI\",ROW(Tableau_de_suivi[Clôturé])-2),ROWS($1:3)),COLUMN()),\"\")","v":""},{"$f":"IFERROR(INDEX(Tableau_de_suivi[[N°]:[Clôturé]],SMALL(IF(Tableau_de_suivi[Clôturé]=\"OUI\",ROW(Tableau_de_suivi[Clôturé])-2),ROWS($1:3)),COLUMN()),\"\")","v":""},{"$f":"IFERROR(INDEX(Tableau_de_suivi[[N°]:[Clôturé]],SMALL(IF(Tableau_de_suivi[Clôturé]=\"OUI\",ROW(Tableau_de_suivi[Clôturé])-2),ROWS($1:3)),COLUMN()),\"\")","v":""},{"$f":"IFERROR(INDEX(Tableau_de_suivi[[N°]:[Clôturé]],SMALL(IF(Tableau_de_suivi[Clôturé]=\"OUI\",ROW(Tableau_de_suivi[Clôturé])-2),ROWS($1:3)),COLUMN()),\"\")","v":""},{"$f":"IFERROR(INDEX(Tableau_de_suivi[[N°]:[Clôturé]],SMALL(IF(Tableau_de_suivi[Clôturé]=\"OUI\",ROW(Tableau_de_suivi[Clôturé])-2),ROWS($1:3)),COLUMN()),\"\")","v":""},{"$f":"IFERROR(INDEX(Tableau_de_suivi[[N°]:[Clôturé]],SMALL(IF(Tableau_de_suivi[Clôturé]=\"OUI\",ROW(Tableau_de_suivi[Clôturé])-2),ROWS($1:3)),COLUMN()),\"\")","v":""}]
[{"$f":"IFERROR(INDEX(Tableau_de_suivi[[N°]:[Clôturé]],SMALL(IF(Tableau_de_suivi[Clôturé]=\"OUI\",ROW(Tableau_de_suivi[Clôturé])-2),ROWS($1:4)),COLUMN()),\"\")","v":""},{"$f":"IFERROR(INDEX(Tableau_de_suivi[[N°]:[Clôturé]],SMALL(IF(Tableau_de_suivi[Clôturé]=\"OUI\",ROW(Tableau_de_suivi[Clôturé])-2),ROWS($1:4)),COLUMN()),\"\")","v":""},{"$f":"IFERROR(INDEX(Tableau_de_suivi[[N°]:[Clôturé]],SMALL(IF(Tableau_de_suivi[Clôturé]=\"OUI\",ROW(Tableau_de_suivi[Clôturé])-2),ROWS($1:4)),COLUMN()),\"\")","v":""},{"$f":"IFERROR(INDEX(Tableau_de_suivi[[N°]:[Clôturé]],SMALL(IF(Tableau_de_suivi[Clôturé]=\"OUI\",ROW(Tableau_de_suivi[Clôturé])-2),ROWS($1:4)),COLUMN()),\"\")","v":""},{"$f":"IFERROR(INDEX(Tableau_de_suivi[[N°]:[Clôturé]],SMALL(IF(Tableau_de_suivi[Clôturé]=\"OUI\",ROW(Tableau_de_suivi[Clôturé])-2),ROWS($1:4)),COLUMN()),\"\")","v":""},{"$f":"IFERROR(INDEX(Tableau_de_suivi[[N°]:[Clôturé]],SMALL(IF(Tableau_de_suivi[Clôturé]=\"OUI\",ROW(Tableau_de_suivi[Clôturé])-2),ROWS($1:4)),COLUMN()),\"\")","v":""},{"$f":"IFERROR(INDEX(Tableau_de_suivi[[N°]:[Clôturé]],SMALL(IF(Tableau_de_suivi[Clôturé]=\"OUI\",ROW(Tableau_de_suivi[Clôturé])-2),ROWS($1:4)),COLUMN()),\"\")","v":""},{"$f":"IFERROR(INDEX(Tableau_de_suivi[[N°]:[Clôturé]],SMALL(IF(Tableau_de_suivi[Clôturé]=\"OUI\",ROW(Tableau_de_suivi[Clôturé])-2),ROWS($1:4)),COLUMN()),\"\")","v":""},{"$f":"IFERROR(INDEX(Tableau_de_suivi[[N°]:[Clôturé]],SMALL(IF(Tableau_de_suivi[Clôturé]=\"OUI\",ROW(Tableau_de_suivi[Clôturé])-2),ROWS($1:4)),COLUMN()),\"\")","v":""},{"$f":"IFERROR(INDEX(Tableau_de_suivi[[N°]:[Clôturé]],SMALL(IF(Tableau_de_suivi[Clôturé]=\"OUI\",ROW(Tableau_de_suivi[Clôturé])-2),ROWS($1:4)),COLUMN()),\"\")","v":""},{"$f":"IFERROR(INDEX(Tableau_de_suivi[[N°]:[Clôturé]],SMALL(IF(Tableau_de_suivi[Clôturé]=\"OUI\",ROW(Tableau_de_suivi[Clôturé])-2),ROWS($1:4)),COLUMN()),\"\")","v":""},{"$f":"IFERROR(INDEX(Tableau_de_suivi[[N°]:[Clôturé]],SMALL(IF(Tableau_de_suivi[Clôturé]=\"OUI\",ROW(Tableau_de_suivi[Clôturé])-2),ROWS($1:4)),COLUMN()),\"\")","v":""},{"$f":"IFERROR(INDEX(Tableau_de_suivi[[N°]:[Clôturé]],SMALL(IF(Tableau_de_suivi[Clôturé]=\"OUI\",ROW(Tableau_de_suivi[Clôturé])-2),ROWS($1:4)),COLUMN()),\"\")","v":""},{"$f":"IFERROR(INDEX(Tableau_de_suivi[[N°]:[Clôturé]],SMALL(IF(Tableau_de_suivi[Clôturé]=\"OUI\",ROW(Tableau_de_suivi[Clôturé])-2),ROWS($1:4)),COLUMN()),\"\")","v":""},{"$f":"IFERROR(INDEX(Tableau_de_suivi[[N°]:[Clôturé]],SMALL(IF(Tableau_de_suivi[Clôturé]=\"OUI\",ROW(Tableau_de_suivi[Clôturé])-2),ROWS($1:4)),COLUMN()),\"\")","v":""},{"$f":"IFERROR(INDEX(Tableau_de_suivi[[N°]:[Clôturé]],SMALL(IF(Tableau_de_suivi[Clôturé]=\"OUI\",ROW(Tableau_de_suivi[Clôturé])-2),ROWS($1:4)),COLUMN()),\"\")","v":""},{"$f":"IFERROR(INDEX(Tableau_de_suivi[[N°]:[Clôturé]],SMALL(IF(Tableau_de_suivi[Clôturé]=\"OUI\",ROW(Tableau_de_suivi[Clôturé])-2),ROWS($1:4)),COLUMN()),\"\")","v":""},{"$f":"IFERROR(INDEX(Tableau_de_suivi[[N°]:[Clôturé]],SMALL(IF(Tableau_de_suivi[Clôturé]=\"OUI\",ROW(Tableau_de_suivi[Clôturé])-2),ROWS($1:4)),COLUMN()),\"\")","v":""},{"$f":"IFERROR(INDEX(Tableau_de_suivi[[N°]:[Clôturé]],SMALL(IF(Tableau_de_suivi[Clôturé]=\"OUI\",ROW(Tableau_de_suivi[Clôturé])-2),ROWS($1:4)),COLUMN()),\"\")","v":""},{"$f":"IFERROR(INDEX(Tableau_de_suivi[[N°]:[Clôturé]],SMALL(IF(Tableau_de_suivi[Clôturé]=\"OUI\",ROW(Tableau_de_suivi[Clôturé])-2),ROWS($1:4)),COLUMN()),\"\")","v":""},{"$f":"IFERROR(INDEX(Tableau_de_suivi[[N°]:[Clôturé]],SMALL(IF(Tableau_de_suivi[Clôturé]=\"OUI\",ROW(Tableau_de_suivi[Clôturé])-2),ROWS($1:4)),COLUMN()),\"\")","v":""},{"$f":"IFERROR(INDEX(Tableau_de_suivi[[N°]:[Clôturé]],SMALL(IF(Tableau_de_suivi[Clôturé]=\"OUI\",ROW(Tableau_de_suivi[Clôturé])-2),ROWS($1:4)),COLUMN()),\"\")","v":""}]
[{"$f":"IFERROR(INDEX(Tableau_de_suivi[[N°]:[Clôturé]],SMALL(IF(Tableau_de_suivi[Clôturé]=\"OUI\",ROW(Tableau_de_suivi[Clôturé])-2),ROWS($1:5)),COLUMN()),\"\")","v":""},{"$f":"IFERROR(INDEX(Tableau_de_suivi[[N°]:[Clôturé]],SMALL(IF(Tableau_de_suivi[Clôturé]=\"OUI\",ROW(Tableau_de_suivi[Clôturé])-2),ROWS($1:5)),COLUMN()),\"\")","v":""},{"$f":"IFERROR(INDEX(Tableau_de_suivi[[N°]:[Clôturé]],SMALL(IF(Tableau_de_suivi[Clôturé]=\"OUI\",ROW(Tableau_de_suivi[Clôturé])-2),ROWS($1:5)),COLUMN()),\"\")","v":""},{"$f":"IFERROR(INDEX(Tableau_de_suivi[[N°]:[Clôturé]],SMALL(IF(Tableau_de_suivi[Clôturé]=\"OUI\",ROW(Tableau_de_suivi[Clôturé])-2),ROWS($1:5)),COLUMN()),\"\")","v":""},{"$f":"IFERROR(INDEX(Tableau_de_suivi[[N°]:[Clôturé]],SMALL(IF(Tableau_de_suivi[Clôturé]=\"OUI\",ROW(Tableau_de_suivi[Clôturé])-2),ROWS($1:5)),COLUMN()),\"\")","v":""},{"$f":"IFERROR(INDEX(Tableau_de_suivi[[N°]:[Clôturé]],SMALL(IF(Tableau_de_suivi[Clôturé]=\"OUI\",ROW(Tableau_de_suivi[Clôturé])-2),ROWS($1:5)),COLUMN()),\"\")","v":""},{"$f":"IFERROR(INDEX(Tableau_de_suivi[[N°]:[Clôturé]],SMALL(IF(Tableau_de_suivi[Clôturé]=\"OUI\",ROW(Tableau_de_suivi[Clôturé])-2),ROWS($1:5)),COLUMN()),\"\")","v":""},{"$f":"IFERROR(INDEX(Tableau_de_suivi[[N°]:[Clôturé]],SMALL(IF(Tableau_de_suivi[Clôturé]=\"OUI\",ROW(Tableau_de_suivi[Clôturé])-2),ROWS($1:5)),COLUMN()),\"\")","v":""},{"$f":"IFERROR(INDEX(Tableau_de_suivi[[N°]:[Clôturé]],SMALL(IF(Tableau_de_suivi[Clôturé]=\"OUI\",ROW(Tableau_de_suivi[Clôturé])-2),ROWS($1:5)),COLUMN()),\"\")","v":""},{"$f":"IFERROR(INDEX(Tableau_de_suivi[[N°]:[Clôturé]],SMALL(IF(Tableau_de_suivi[Clôturé]=\"OUI\",ROW(Tableau_de_suivi[Clôturé])-2),ROWS($1:5)),COLUMN()),\"\")","v":""},{"$f":"IFERROR(INDEX(Tableau_de_suivi[[N°]:[Clôturé]],SMALL(IF(Tableau_de_suivi[Clôturé]=\"OUI\",ROW(Tableau_de_suivi[Clôturé])-2),ROWS($1:5)),COLUMN()),\"\")","v":""},{"$f":"IFERROR(INDEX(Tableau_de_suivi[[N°]:[Clôturé]],SMALL(IF(Tableau_de_suivi[Clôturé]=\"OUI\",ROW(Tableau_de_suivi[Clôturé])-2),ROWS($1:5)),COLUMN()),\"\")","v":""},{"$f":"IFERROR(INDEX(Tableau_de_suivi[[N°]:[Clôturé]],SMALL(IF(Tableau_de_suivi[Clôturé]=\"OUI\",ROW(Tableau_de_suivi[Clôturé])-2),ROWS($1:5)),COLUMN()),\"\")","v":""},{"$f":"IFERROR(INDEX(Tableau_de_suivi[[N°]:[Clôturé]],SMALL(IF(Tableau_de_suivi[Clôturé]=\"OUI\",ROW(Tableau_de_suivi[Clôturé])-2),ROWS($1:5)),COLUMN()),\"\")","v":""},{"$f":"IFERROR(INDEX(Tableau_de_suivi[[N°]:[Clôturé]],SMALL(IF(Tableau_de_suivi[Clôturé]=\"OUI\",ROW(Tableau_de_suivi[Clôturé])-2),ROWS($1:5)),COLUMN()),\"\")","v":""},{"$f":"IFERROR(INDEX(Tableau_de_suivi[[N°]:[Clôturé]],SMALL(IF(Tableau_de_suivi[Clôturé]=\"OUI\",ROW(Tableau_de_suivi[Clôturé])-2),ROWS($1:5)),COLUMN()),\"\")","v":""},{"$f":"IFERROR(INDEX(Tableau_de_suivi[[N°]:[Clôturé]],SMALL(IF(Tableau_de_suivi[Clôturé]=\"OUI\",ROW(Tableau_de_suivi[Clôturé])-2),ROWS($1:5)),COLUMN()),\"\")","v":""},{"$f":"IFERROR(INDEX(Tableau_de_suivi[[N°]:[Clôturé]],SMALL(IF(Tableau_de_suivi[Clôturé]=\"OUI\",ROW(Tableau_de_suivi[Clôturé])-2),ROWS($1:5)),COLUMN()),\"\")","v":""},{"$f":"IFERROR(INDEX(Tableau_de_suivi[[N°]:[Clôturé]],SMALL(IF(Tableau_de_suivi[Clôturé]=\"OUI\",ROW(Tableau_de_suivi[Clôturé])-2),ROWS($1:5)),COLUMN()),\"\")","v":""},{"$f":"IFERROR(INDEX(Tableau_de_suivi[[N°]:[Clôturé]],SMALL(IF(Tableau_de_suivi[Clôturé]=\"OUI\",ROW(Tableau_de_suivi[Clôturé])-2),ROWS($1:5)),COLUMN()),\"\")","v":""},{"$f":"IFERROR(INDEX(Tableau_de_suivi[[N°]:[Clôturé]],SMALL(IF(Tableau_de_suivi[Clôturé]=\"OUI\",ROW(Tableau_de_suivi[Clôturé])-2),ROWS($1:5)),COLUMN()),\"\")","v":""},{"$f":"IFERROR(INDEX(Tableau_de_suivi[[N°]:[Clôturé]],SMALL(IF(Tableau_de_suivi[Clôturé]=\"OUI\",ROW(Tableau_de_suivi[Clôturé])-2),ROWS($1:5)),COLUMN()),\"\")","v":""}]
[{"$f":"IFERROR(INDEX(Tableau_de_suivi[[N°]:[Clôturé]],SMALL(IF(Tableau_de_suivi[Clôturé]=\"OUI\",ROW(Tableau_de_suivi[Clôturé])-2),ROWS($1:6)),COLUMN()),\"\")","v":""},{"$f":"IFERROR(INDEX(Tableau_de_suivi[[N°]:[Clôturé]],SMALL(IF(Tableau_de_suivi[Clôturé]=\"OUI\",ROW(Tableau_de_suivi[Clôturé])-2),ROWS($1:6)),COLUMN()),\"\")","v":""},{"$f":"IFERROR(INDEX(Tableau_de_suivi[[N°]:[Clôturé]],SMALL(IF(Tableau_de_suivi[Clôturé]=\"OUI\",ROW(Tableau_de_suivi[Clôturé])-2),ROWS($1:6)),COLUMN()),\"\")","v":""},{"$f":"IFERROR(INDEX(Tableau_de_suivi[[N°]:[Clôturé]],SMALL(IF(Tableau_de_suivi[Clôturé]=\"OUI\",ROW(Tableau_de_suivi[Clôturé])-2),ROWS($1:6)),COLUMN()),\"\")","v":""},{"$f":"IFERROR(INDEX(Tableau_de_suivi[[N°]:[Clôturé]],SMALL(IF(Tableau_de_suivi[Clôturé]=\"OUI\",ROW(Tableau_de_suivi[Clôturé])-2),ROWS($1:6)),COLUMN()),\"\")","v":""},{"$f":"IFERROR(INDEX(Tableau_de_suivi[[N°]:[Clôturé]],SMALL(IF(Tableau_de_suivi[Clôturé]=\"OUI\",ROW(Tableau_de_suivi[Clôturé])-2),ROWS($1:6)),COLUMN()),\"\")","v":""},{"$f":"IFERROR(INDEX(Tableau_de_suivi[[N°]:[Clôturé]],SMALL(IF(Tableau_de_suivi[Clôturé]=\"OUI\",ROW(Tableau_de_suivi[Clôturé])-2),ROWS($1:6)),COLUMN()),\"\")","v":""},{"$f":"IFERROR(INDEX(Tableau_de_suivi[[N°]:[Clôturé]],SMALL(IF(Tableau_de_suivi[Clôturé]=\"OUI\",ROW(Tableau_de_suivi[Clôturé])-2),ROWS($1:6)),COLUMN()),\"\")","v":""},{"$f":"IFERROR(INDEX(Tableau_de_suivi[[N°]:[Clôturé]],SMALL(IF(Tableau_de_suivi[Clôturé]=\"OUI\",ROW(Tableau_de_suivi[Clôturé])-2),ROWS($1:6)),COLUMN()),\"\")","v":""},{"$f":"IFERROR(INDEX(Tableau_de_suivi[[N°]:[Clôturé]],SMALL(IF(Tableau_de_suivi[Clôturé]=\"OUI\",ROW(Tableau_de_suivi[Clôturé])-2),ROWS($1:6)),COLUMN()),\"\")","v":""},{"$f":"IFERROR(INDEX(Tableau_de_suivi[[N°]:[Clôturé]],SMALL(IF(Tableau_de_suivi[Clôturé]=\"OUI\",ROW(Tableau_de_suivi[Clôturé])-2),ROWS($1:6)),COLUMN()),\"\")","v":""},{"$f":"IFERROR(INDEX(Tableau_de_suivi[[N°]:[Clôturé]],SMALL(IF(Tableau_de_suivi[Clôturé]=\"OUI\",ROW(Tableau_de_suivi[Clôturé])-2),ROWS($1:6)),COLUMN()),\"\")","v":""},{"$f":"IFERROR(INDEX(Tableau_de_suivi[[N°]:[Clôturé]],SMALL(IF(Tableau_de_suivi[Clôturé]=\"OUI\",ROW(Tableau_de_suivi[Clôturé])-2),ROWS($1:6)),COLUMN()),\"\")","v":""},{"$f":"IFERROR(INDEX(Tableau_de_suivi[[N°]:[Clôturé]],SMALL(IF(Tableau_de_suivi[Clôturé]=\"OUI\",ROW(Tableau_de_suivi[Clôturé])-2),ROWS($1:6)),COLUMN()),\"\")","v":""},{"$f":"IFERROR(INDEX(Tableau_de_suivi[[N°]:[Clôturé]],SMALL(IF(Tableau_de_suivi[Clôturé]=\"OUI\",ROW(Tableau_de_suivi[Clôturé])-2),ROWS($1:6)),COLUMN()),\"\")","v":""},{"$f":"IFERROR(INDEX(Tableau_de_suivi[[N°]:[Clôturé]],SMALL(IF(Tableau_de_suivi[Clôturé]=\"OUI\",ROW(Tableau_de_suivi[Clôturé])-2),ROWS($1:6)),COLUMN()),\"\")","v":""},{"$f":"IFERROR(INDEX(Tableau_de_suivi[[N°]:[Clôturé]],SMALL(IF(Tableau_de_suivi[Clôturé]=\"OUI\",ROW(Tableau_de_suivi[Clôturé])-2),ROWS($1:6)),COLUMN()),\"\")","v":""},{"$f":"IFERROR(INDEX(Tableau_de_suivi[[N°]:[Clôturé]],SMALL(IF(Tableau_de_suivi[Clôturé]=\"OUI\",ROW(Tableau_de_suivi[Clôturé])-2),ROWS($1:6)),COLUMN()),\"\")","v":""},{"$f":"IFERROR(INDEX(Tableau_de_suivi[[N°]:[Clôturé]],SMALL(IF(Tableau_de_suivi[Clôturé]=\"OUI\",ROW(Tableau_de_suivi[Clôturé])-2),ROWS($1:6)),COLUMN()),\"\")","v":""},{"$f":"IFERROR(INDEX(Tableau_de_suivi[[N°]:[Clôturé]],SMALL(IF(Tableau_de_suivi[Clôturé]=\"OUI\",ROW(Tableau_de_suivi[Clôturé])-2),ROWS($1:6)),COLUMN()),\"\")","v":""},{"$f":"IFERROR(INDEX(Tableau_de_suivi[[N°]:[Clôturé]],SMALL(IF(Tableau_de_suivi[Clôturé]=\"OUI\",ROW(Tableau_de_suivi[Clôturé])-2),ROWS($1:6)),COLUMN()),\"\")","v":""},{"$f":"IFERROR(INDEX(Tableau_de_suivi[[N°]:[Clôturé]],SMALL(IF(Tableau_de_suivi[Clôturé]=\"OUI\",ROW(Tableau_de_suivi[Clôturé])-2),ROWS($1:6)),COLUMN()),\"\")","v":""}]
[{"$f":"IFERROR(INDEX(Tableau_de_suivi[[N°]:[Clôturé]],SMALL(IF(Tableau_de_suivi[Clôturé]=\"OUI\",ROW(Tableau_de_suivi[Clôturé])-2),ROWS($1:7)),COLUMN()),\"\")","v":""},{"$f":"IFERROR(INDEX(Tableau_de_suivi[[N°]:[Clôturé]],SMALL(IF(Tableau_de_suivi[Clôturé]=\"OUI\",ROW(Tableau_de_suivi[Clôturé])-2),ROWS($1:7)),COLUMN()),\"\")","v":""},{"$f":"IFERROR(INDEX(Tableau_de_suivi[[N°]:[Clôturé]],SMALL(IF(Tableau_de_suivi[Clôturé]=\"OUI\",ROW(Tableau_de_suivi[Clôturé])-2),ROWS($1:7)),COLUMN()),\"\")","v":""},{"$f":"IFERROR(INDEX(Tableau_de_suivi[[N°]:[Clôturé]],SMALL(IF(Tableau_de_suivi[Clôturé]=\"OUI\",ROW(Tableau_de_suivi[Clôturé])-2),ROWS($1:7)),COLUMN()),\"\")","v":""},{"$f":"IFERROR(INDEX(Tableau_de_suivi[[N°]:[Clôturé]],SMALL(IF(Tableau_de_suivi[Clôturé]=\"OUI\",ROW(Tableau_de_suivi[Clôturé])-2),ROWS($1:7)),COLUMN()),\"\")","v":""},{"$f":"IFERROR(INDEX(Tableau_de_suivi[[N°]:[Clôturé]],SMALL(IF(Tableau_de_suivi[Clôturé]=\"OUI\",ROW(Tableau_de_suivi[Clôturé])-2),ROWS($1:7)),COLUMN()),\"\")","v":""},{"$f":"IFERROR(INDEX(Tableau_de_suivi[[N°]:[Clôturé]],SMALL(IF(Tableau_de_suivi[Clôturé]=\"OUI\",ROW(Tableau_de_suivi[Clôturé])-2),ROWS($1:7)),COLUMN()),\"\")","v":""},{"$f":"IFERROR(INDEX(Tableau_de_suivi[[N°]:[Clôturé]],SMALL(IF(Tableau_de_suivi[Clôturé]=\"OUI\",ROW(Tableau_de_suivi[Clôturé])-2),ROWS($1:7)),COLUMN()),\"\")","v":""},{"$f":"IFERROR(INDEX(Tableau_de_suivi[[N°]:[Clôturé]],SMALL(IF(Tableau_de_suivi[Clôturé]=\"OUI\",ROW(Tableau_de_suivi[Clôturé])-2),ROWS($1:7)),COLUMN()),\"\")","v":""},{"$f":"IFERROR(INDEX(Tableau_de_suivi[[N°]:[Clôturé]],SMALL(IF(Tableau_de_suivi[Clôturé]=\"OUI\",ROW(Tableau_de_suivi[Clôturé])-2),ROWS($1:7)),COLUMN()),\"\")","v":""},{"$f":"IFERROR(INDEX(Tableau_de_suivi[[N°]:[Clôturé]],SMALL(IF(Tableau_de_suivi[Clôturé]=\"OUI\",ROW(Tableau_de_suivi[Clôturé])-2),ROWS($1:7)),COLUMN()),\"\")","v":""},{"$f":"IFERROR(INDEX(Tableau_de_suivi[[N°]:[Clôturé]],SMALL(IF(Tableau_de_suivi[Clôturé]=\"OUI\",ROW(Tableau_de_suivi[Clôturé])-2),ROWS($1:7)),COLUMN()),\"\")","v":""},{"$f":"IFERROR(INDEX(Tableau_de_suivi[[N°]:[Clôturé]],SMALL(IF(Tableau_de_suivi[Clôturé]=\"OUI\",ROW(Tableau_de_suivi[Clôturé])-2),ROWS($1:7)),COLUMN()),\"\")","v":""},{"$f":"IFERROR(INDEX(Tableau_de_suivi[[N°]:[Clôturé]],SMALL(IF(Tableau_de_suivi[Clôturé]=\"OUI\",ROW(Tableau_de_suivi[Clôturé])-2),ROWS($1:7)),COLUMN()),\"\")","v":""},{"$f":"IFERROR(INDEX(Tableau_de_suivi[[N°]:[Clôturé]],SMALL(IF(Tableau_de_suivi[Clôturé]=\"OUI\",ROW(Tableau_de_suivi[Clôturé])-2),ROWS($1:7)),COLUMN()),\"\")","v":""},{"$f":"IFERROR(INDEX(Tableau_de_suivi[[N°]:[Clôturé]],SMALL(IF(Tableau_de_suivi[Clôturé]=\"OUI\",ROW(Tableau_de_suivi[Clôturé])-2),ROWS($1:7)),COLUMN()),\"\")","v":""},{"$f":"IFERROR(INDEX(Tableau_de_suivi[[N°]:[Clôturé]],SMALL(IF(Tableau_de_suivi[Clôturé]=\"OUI\",ROW(Tableau_de_suivi[Clôturé])-2),ROWS($1:7)),COLUMN()),\"\")","v":""},{"$f":"IFERROR(INDEX(Tableau_de_suivi[[N°]:[Clôturé]],SMALL(IF(Tableau_de_suivi[Clôturé]=\"OUI\",ROW(Tableau_de_suivi[Clôturé])-2),ROWS($1:7)),COLUMN()),\"\")","v":""},{"$f":"IFERROR(INDEX(Tableau_de_suivi[[N°]:[Clôturé]],SMALL(IF(Tableau_de_suivi[Clôturé]=\"OUI\",ROW(Tableau_de_suivi[Clôturé])-2),ROWS($1:7)),COLUMN()),\"\")","v":""},{"$f":"IFERROR(INDEX(Tableau_de_suivi[[N°]:[Clôturé]],SMALL(IF(Tableau_de_suivi[Clôturé]=\"OUI\",ROW(Tableau_de_suivi[Clôturé])-2),ROWS($1:7)),COLUMN()),\"\")","v":""},{"$f":"IFERROR(INDEX(Tableau_de_suivi[[N°]:[Clôturé]],SMALL(IF(Tableau_de_suivi[Clôturé]=\"OUI\",ROW(Tableau_de_suivi[Clôturé])-2),ROWS($1:7)),COLUMN()),\"\")","v":""},{"$f":"IFERROR(INDEX(Tableau_de_suivi[[N°]:[Clôturé]],SMALL(IF(Tableau_de_suivi[Clôturé]=\"OUI\",ROW(Tableau_de_suivi[Clôturé])-2),ROWS($1:7)),COLUMN()),\"\")","v":""}]
[{"$f":"IFERROR(INDEX(Tableau_de_suivi[[N°]:[Clôturé]],SMALL(IF(Tableau_de_suivi[Clôturé]=\"OUI\",ROW(Tableau_de_suivi[Clôturé])-2),ROWS($1:8)),COLUMN()),\"\")","v":""},{"$f":"IFERROR(INDEX(Tableau_de_suivi[[N°]:[Clôturé]],SMALL(IF(Tableau_de_suivi[Clôturé]=\"OUI\",ROW(Tableau_de_suivi[Clôturé])-2),ROWS($1:8)),COLUMN()),\"\")","v":""},{"$f":"IFERROR(INDEX(Tableau_de_suivi[[N°]:[Clôturé]],SMALL(IF(Tableau_de_suivi[Clôturé]=\"OUI\",ROW(Tableau_de_suivi[Clôturé])-2),ROWS($1:8)),COLUMN()),\"\")","v":""},{"$f":"IFERROR(INDEX(Tableau_de_suivi[[N°]:[Clôturé]],SMALL(IF(Tableau_de_suivi[Clôturé]=\"OUI\",ROW(Tableau_de_suivi[Clôturé])-2),ROWS($1:8)),COLUMN()),\"\")","v":""},{"$f":"IFERROR(INDEX(Tableau_de_suivi[[N°]:[Clôturé]],SMALL(IF(Tableau_de_suivi[Clôturé]=\"OUI\",ROW(Tableau_de_suivi[Clôturé])-2),ROWS($1:8)),COLUMN()),\"\")","v":""},{"$f":"IFERROR(INDEX(Tableau_de_suivi[[N°]:[Clôturé]],SMALL(IF(Tableau_de_suivi[Clôturé]=\"OUI\",ROW(Tableau_de_suivi[Clôturé])-2),ROWS($1:8)),COLUMN()),\"\")","v":""},{"$f":"IFERROR(INDEX(Tableau_de_suivi[[N°]:[Clôturé]],SMALL(IF(Tableau_de_suivi[Clôturé]=\"OUI\",ROW(Tableau_de_suivi[Clôturé])-2),ROWS($1:8)),COLUMN()),\"\")","v":""},{"$f":"IFERROR(INDEX(Tableau_de_suivi[[N°]:[Clôturé]],SMALL(IF(Tableau_de_suivi[Clôturé]=\"OUI\",ROW(Tableau_de_suivi[Clôturé])-2),ROWS($1:8)),COLUMN()),\"\")","v":""},{"$f":"IFERROR(INDEX(Tableau_de_suivi[[N°]:[Clôturé]],SMALL(IF(Tableau_de_suivi[Clôturé]=\"OUI\",ROW(Tableau_de_suivi[Clôturé])-2),ROWS($1:8)),COLUMN()),\"\")","v":""},{"$f":"IFERROR(INDEX(Tableau_de_suivi[[N°]:[Clôturé]],SMALL(IF(Tableau_de_suivi[Clôturé]=\"OUI\",ROW(Tableau_de_suivi[Clôturé])-2),ROWS($1:8)),COLUMN()),\"\")","v":""},{"$f":"IFERROR(INDEX(Tableau_de_suivi[[N°]:[Clôturé]],SMALL(IF(Tableau_de_suivi[Clôturé]=\"OUI\",ROW(Tableau_de_suivi[Clôturé])-2),ROWS($1:8)),COLUMN()),\"\")","v":""},{"$f":"IFERROR(INDEX(Tableau_de_suivi[[N°]:[Clôturé]],SMALL(IF(Tableau_de_suivi[Clôturé]=\"OUI\",ROW(Tableau_de_suivi[Clôturé])-2),ROWS($1:8)),COLUMN()),\"\")","v":""},{"$f":"IFERROR(INDEX(Tableau_de_suivi[[N°]:[Clôturé]],SMALL(IF(Tableau_de_suivi[Clôturé]=\"OUI\",ROW(Tableau_de_suivi[Clôturé])-2),ROWS($1:8)),COLUMN()),\"\")","v":""},{"$f":"IFERROR(INDEX(Tableau_de_suivi[[N°]:[Clôturé]],SMALL(IF(Tableau_de_suivi[Clôturé]=\"OUI\",ROW(Tableau_de_suivi[Clôturé])-2),ROWS($1:8)),COLUMN()),\"\")","v":""},{"$f":"IFERROR(INDEX(Tableau_de_suivi[[N°]:[Clôturé]],SMALL(IF(Tableau_de_suivi[Clôturé]=\"OUI\",ROW(Tableau_de_suivi[Clôturé])-2),ROWS($1:8)),COLUMN()),\"\")","v":""},{"$f":"IFERROR(INDEX(Tableau_de_suivi[[N°]:[Clôturé]],SMALL(IF(Tableau_de_suivi[Clôturé]=\"OUI\",ROW(Tableau_de_suivi[Clôturé])-2),ROWS($1:8)),COLUMN()),\"\")","v":""},{"$f":"IFERROR(INDEX(Tableau_de_suivi[[N°]:[Clôturé]],SMALL(IF(Tableau_de_suivi[Clôturé]=\"OUI\",ROW(Tableau_de_suivi[Clôturé])-2),ROWS($1:8)),COLUMN()),\"\")","v":""},{"$f":"IFERROR(INDEX(Tableau_de_suivi[[N°]:[Clôturé]],SMALL(IF(Tableau_de_suivi[Clôturé]=\"OUI\",ROW(Tableau_de_suivi[Clôturé])-2),ROWS($1:8)),COLUMN()),\"\")","v":""},{"$f":"IFERROR(INDEX(Tableau_de_suivi[[N°]:[Clôturé]],SMALL(IF(Tableau_de_suivi[Clôturé]=\"OUI\",ROW(Tableau_de_suivi[Clôturé])-2),ROWS($1:8)),COLUMN()),\"\")","v":""},{"$f":"IFERROR(INDEX(Tableau_de_suivi[[N°]:[Clôturé]],SMALL(IF(Tableau_de_suivi[Clôturé]=\"OUI\",ROW(Tableau_de_suivi[Clôturé])-2),ROWS($1:8)),COLUMN()),\"\")","v":""},{"$f":"IFERROR(INDEX(Tableau_de_suivi[[N°]:[Clôturé]],SMALL(IF(Tableau_de_suivi[Clôturé]=\"OUI\",ROW(Tableau_de_suivi[Clôturé])-2),ROWS($1:8)),COLUMN()),\"\")","v":""},{"$f":"IFERROR(INDEX(Tableau_de_suivi[[N°]:[Clôturé]],SMALL(IF(Tableau_de_suivi[Clôturé]=\"OUI\",ROW(Tableau_de_suivi[Clôturé])-2),ROWS($1:8)),COLUMN()),\"\")","v":""}]
[{"$f":"IFERROR(INDEX(Tableau_de_suivi[[N°]:[Clôturé]],SMALL(IF(Tableau_de_suivi[Clôturé]=\"OUI\",ROW(Tableau_de_suivi[Clôturé])-2),ROWS($1:9)),COLUMN()),\"\")","v":""},{"$f":"IFERROR(INDEX(Tableau_de_suivi[[N°]:[Clôturé]],SMALL(IF(Tableau_de_suivi[Clôturé]=\"OUI\",ROW(Tableau_de_suivi[Clôturé])-2),ROWS($1:9)),COLUMN()),\"\")","v":""},{"$f":"IFERROR(INDEX(Tableau_de_suivi[[N°]:[Clôturé]],SMALL(IF(Tableau_de_suivi[Clôturé]=\"OUI\",ROW(Tableau_de_suivi[Clôturé])-2),ROWS($1:9)),COLUMN()),\"\")","v":""},{"$f":"IFERROR(INDEX(Tableau_de_suivi[[N°]:[Clôturé]],SMALL(IF(Tableau_de_suivi[Clôturé]=\"OUI\",ROW(Tableau_de_suivi[Clôturé])-2),ROWS($1:9)),COLUMN()),\"\")","v":""},{"$f":"IFERROR(INDEX(Tableau_de_suivi[[N°]:[Clôturé]],SMALL(IF(Tableau_de_suivi[Clôturé]=\"OUI\",ROW(Tableau_de_suivi[Clôturé])-2),ROWS($1:9)),COLUMN()),\"\")","v":""},{"$f":"IFERROR(INDEX(Tableau_de_suivi[[N°]:[Clôturé]],SMALL(IF(Tableau_de_suivi[Clôturé]=\"OUI\",ROW(Tableau_de_suivi[Clôturé])-2),ROWS($1:9)),COLUMN()),\"\")","v":""},{"$f":"IFERROR(INDEX(Tableau_de_suivi[[N°]:[Clôturé]],SMALL(IF(Tableau_de_suivi[Clôturé]=\"OUI\",ROW(Tableau_de_suivi[Clôturé])-2),ROWS($1:9)),COLUMN()),\"\")","v":""},{"$f":"IFERROR(INDEX(Tableau_de_suivi[[N°]:[Clôturé]],SMALL(IF(Tableau_de_suivi[Clôturé]=\"OUI\",ROW(Tableau_de_suivi[Clôturé])-2),ROWS($1:9)),COLUMN()),\"\")","v":""},{"$f":"IFERROR(INDEX(Tableau_de_suivi[[N°]:[Clôturé]],SMALL(IF(Tableau_de_suivi[Clôturé]=\"OUI\",ROW(Tableau_de_suivi[Clôturé])-2),ROWS($1:9)),COLUMN()),\"\")","v":""},{"$f":"IFERROR(INDEX(Tableau_de_suivi[[N°]:[Clôturé]],SMALL(IF(Tableau_de_suivi[Clôturé]=\"OUI\",ROW(Tableau_de_suivi[Clôturé])-2),ROWS($1:9)),COLUMN()),\"\")","v":""},{"$f":"IFERROR(INDEX(Tableau_de_suivi[[N°]:[Clôturé]],SMALL(IF(Tableau_de_suivi[Clôturé]=\"OUI\",ROW(Tableau_de_suivi[Clôturé])-2),ROWS($1:9)),COLUMN()),\"\")","v":""},{"$f":"IFERROR(INDEX(Tableau_de_suivi[[N°]:[Clôturé]],SMALL(IF(Tableau_de_suivi[Clôturé]=\"OUI\",ROW(Tableau_de_suivi[Clôturé])-2),ROWS($1:9)),COLUMN()),\"\")","v":""},{"$f":"IFERROR(INDEX(Tableau_de_suivi[[N°]:[Clôturé]],SMALL(IF(Tableau_de_suivi[Clôturé]=\"OUI\",ROW(Tableau_de_suivi[Clôturé])-2),ROWS($1:9)),COLUMN()),\"\")","v":""},{"$f":"IFERROR(INDEX(Tableau_de_suivi[[N°]:[Clôturé]],SMALL(IF(Tableau_de_suivi[Clôturé]=\"OUI\",ROW(Tableau_de_suivi[Clôturé])-2),ROWS($1:9)),COLUMN()),\"\")","v":""},{"$f":"IFERROR(INDEX(Tableau_de_suivi[[N°]:[Clôturé]],SMALL(IF(Tableau_de_suivi[Clôturé]=\"OUI\",ROW(Tableau_de_suivi[Clôturé])-2),ROWS($1:9)),COLUMN()),\"\")","v":""},{"$f":"IFERROR(INDEX(Tableau_de_suivi[[N°]:[Clôturé]],SMALL(IF(Tableau_de_suivi[Clôturé]=\"OUI\",ROW(Tableau_de_suivi[Clôturé])-2),ROWS($1:9)),COLUMN()),\"\")","v":""},{"$f":"IFERROR(INDEX(Tableau_de_suivi[[N°]:[Clôturé]],SMALL(IF(Tableau_de_suivi[Clôturé]=\"OUI\",ROW(Tableau_de_suivi[Clôturé])-2),ROWS($1:9)),COLUMN()),\"\")","v":""},{"$f":"IFERROR(INDEX(Tableau_de_suivi[[N°]:[Clôturé]],SMALL(IF(Tableau_de_suivi[Clôturé]=\"OUI\",ROW(Tableau_de_suivi[Clôturé])-2),ROWS($1:9)),COLUMN()),\"\")","v":""},{"$f":"IFERROR(INDEX(Tableau_de_suivi[[N°]:[Clôturé]],SMALL(IF(Tableau_de_suivi[Clôturé]=\"OUI\",ROW(Tableau_de_suivi[Clôturé])-2),ROWS($1:9)),COLUMN()),\"\")","v":""},{"$f":"IFERROR(INDEX(Tableau_de_suivi[[N°]:[Clôturé]],SMALL(IF(Tableau_de_suivi[Clôturé]=\"OUI\",ROW(Tableau_de_suivi[Clôturé])-2),ROWS($1:9)),COLUMN()),\"\")","v":""},{"$f":"IFERROR(INDEX(Tableau_de_suivi[[N°]:[Clôturé]],SMALL(IF(Tableau_de_suivi[Clôturé]=\"OUI\",ROW(Tableau_de_suivi[Clôturé])-2),ROWS($1:9)),COLUMN()),\"\")","v":""},{"$f":"IFERROR(INDEX(Tableau_de_suivi[[N°]:[Clôturé]],SMALL(IF(Tableau_de_suivi[Clôturé]=\"OUI\",ROW(Tableau_de_suivi[Clôturé])-2),ROWS($1:9)),COLUMN()),\"\")","v":""}]
[{"$f":"IFERROR(INDEX(Tableau_de_suivi[[N°]:[Clôturé]],SMALL(IF(Tableau_de_suivi[Clôturé]=\"OUI\",ROW(Tableau_de_suivi[Clôturé])-2),ROWS($1:10)),COLUMN()),\"\")","v":""},{"$f":"IFERROR(INDEX(Tableau_de_suivi[[N°]:[Clôturé]],SMALL(IF(Tableau_de_suivi[Clôturé]=\"OUI\",ROW(Tableau_de_suivi[Clôturé])-2),ROWS($1:10)),COLUMN()),\"\")","v":""},{"$f":"IFERROR(INDEX(Tableau_de_suivi[[N°]:[Clôturé]],SMALL(IF(Tableau_de_suivi[Clôturé]=\"OUI\",ROW(Tableau_de_suivi[Clôturé])-2),ROWS($1:10)),COLUMN()),\"\")","v":""},{"$f":"IFERROR(INDEX(Tableau_de_suivi[[N°]:[Clôturé]],SMALL(IF(Tableau_de_suivi[Clôturé]=\"OUI\",ROW(Tableau_de_suivi[Clôturé])-2),ROWS($1:10)),COLUMN()),\"\")","v":""},{"$f":"IFERROR(INDEX(Tableau_de_suivi[[N°]:[Clôturé]],SMALL(IF(Tableau_de_suivi[Clôturé]=\"OUI\",ROW(Tableau_de_suivi[Clôturé])-2),ROWS($1:10)),COLUMN()),\"\")","v":""},{"$f":"IFERROR(INDEX(Tableau_de_suivi[[N°]:[Clôturé]],SMALL(IF(Tableau_de_suivi[Clôturé]=\"OUI\",ROW(Tableau_de_suivi[Clôturé])-2),ROWS($1:10)),COLUMN()),\"\")","v":""},{"$f":"IFERROR(INDEX(Tableau_de_suivi[[N°]:[Clôturé]],SMALL(IF(Tableau_de_suivi[Clôturé]=\"OUI\",ROW(Tableau_de_suivi[Clôturé])-2),ROWS($1:10)),COLUMN()),\"\")","v":""},{"$f":"IFERROR(INDEX(Tableau_de_suivi[[N°]:[Clôturé]],SMALL(IF(Tableau_de_suivi[Clôturé]=\"OUI\",ROW(Tableau_de_suivi[Clôturé])-2),ROWS($1:10)),COLUMN()),\"\")","v":""},{"$f":"IFERROR(INDEX(Tableau_de_suivi[[N°]:[Clôturé]],SMALL(IF(Tableau_de_suivi[Clôturé]=\"OUI\",ROW(Tableau_de_suivi[Clôturé])-2),ROWS($1:10)),COLUMN()),\"\")","v":""},{"$f":"IFERROR(INDEX(Tableau_de_suivi[[N°]:[Clôturé]],SMALL(IF(Tableau_de_suivi[Clôturé]=\"OUI\",ROW(Tableau_de_suivi[Clôturé])-2),ROWS($1:10)),COLUMN()),\"\")","v":""},{"$f":"IFERROR(INDEX(Tableau_de_suivi[[N°]:[Clôturé]],SMALL(IF(Tableau_de_suivi[Clôturé]=\"OUI\",ROW(Tableau_de_suivi[Clôturé])-2),ROWS($1:10)),COLUMN()),\"\")","v":""},{"$f":"IFERROR(INDEX(Tableau_de_suivi[[N°]:[Clôturé]],SMALL(IF(Tableau_de_suivi[Clôturé]=\"OUI\",ROW(Tableau_de_suivi[Clôturé])-2),ROWS($1:10)),COLUMN()),\"\")","v":""},{"$f":"IFERROR(INDEX(Tableau_de_suivi[[N°]:[Clôturé]],SMALL(IF(Tableau_de_suivi[Clôturé]=\"OUI\",ROW(Tableau_de_suivi[Clôturé])-2),ROWS($1:10)),COLUMN()),\"\")","v":""},{"$f":"IFERROR(INDEX(Tableau_de_suivi[[N°]:[Clôturé]],SMALL(IF(Tableau_de_suivi[Clôturé]=\"OUI\",ROW(Tableau_de_suivi[Clôturé])-2),ROWS($1:10)),COLUMN()),\"\")","v":""},{"$f":"IFERROR(INDEX(Tableau_de_suivi[[N°]:[Clôturé]],SMALL(IF(Tableau_de_suivi[Clôturé]=\"OUI\",ROW(Tableau_de_suivi[Clôturé])-2),ROWS($1:10)),COLUMN()),\"\")","v":""},{"$f":"IFERROR(INDEX(Tableau_de_suivi[[N°]:[Clôturé]],SMALL(IF(Tableau_de_suivi[Clôturé]=\"OUI\",ROW(Tableau_de_suivi[Clôturé])-2),ROWS($1:10)),COLUMN()),\"\")","v":""},{"$f":"IFERROR(INDEX(Tableau_de_suivi[[N°]:[Clôturé]],SMALL(IF(Tableau_de_suivi[Clôturé]=\"OUI\",ROW(Tableau_de_suivi[Clôturé])-2),ROWS($1:10)),COLUMN()),\"\")","v":""},{"$f":"IFERROR(INDEX(Tableau_de_suivi[[N°]:[Clôturé]],SMALL(IF(Tableau_de_suivi[Clôturé]=\"OUI\",ROW(Tableau_de_suivi[Clôturé])-2),ROWS($1:10)),COLUMN()),\"\")","v":""},{"$f":"IFERROR(INDEX(Tableau_de_suivi[[N°]:[Clôturé]],SMALL(IF(Tableau_de_suivi[Clôturé]=\"OUI\",ROW(Tableau_de_suivi[Clôturé])-2),ROWS($1:10)),COLUMN()),\"\")","v":""},{"$f":"IFERROR(INDEX(Tableau_de_suivi[[N°]:[Clôturé]],SMALL(IF(Tableau_de_suivi[Clôturé]=\"OUI\",ROW(Tableau_de_suivi[Clôturé])-2),ROWS($1:10)),COLUMN()),\"\")","v":""},{"$f":"IFERROR(INDEX(Tableau_de_suivi[[N°]:[Clôturé]],SMALL(IF(Tableau_de_suivi[Clôturé]=\"OUI\",ROW(Tableau_de_suivi[Clôturé])-2),ROWS($1:10)),COLUMN()),\"\")","v":""},{"$f":"IFERROR(INDEX(Tableau_de_suivi[[N°]:[Clôturé]],SMALL(IF(Tableau_de_suivi[Clôturé]=\"OUI\",ROW(Tableau_de_suivi[Clôturé])-2),ROWS($1:10)),COLUMN()),\"\")","v":""}]
[{"$f":"IFERROR(INDEX(Tableau_de_suivi[[N°]:[Clôturé]],SMALL(IF(Tableau_de_suivi[Clôturé]=\"OUI\",ROW(Tableau_de_suivi[Clôturé])-2),ROWS($1:11)),COLUMN()),\"\")","v":""},{"$f":"IFERROR(INDEX(Tableau_de_suivi[[N°]:[Clôturé]],SMALL(IF(Tableau_de_suivi[Clôturé]=\"OUI\",ROW(Tableau_de_suivi[Clôturé])-2),ROWS($1:11)),COLUMN()),\"\")","v":""},{"$f":"IFERROR(INDEX(Tableau_de_suivi[[N°]:[Clôturé]],SMALL(IF(Tableau_de_suivi[Clôturé]=\"OUI\",ROW(Tableau_de_suivi[Clôturé])-2),ROWS($1:11)),COLUMN()),\"\")","v":""},{"$f":"IFERROR(INDEX(Tableau_de_suivi[[N°]:[Clôturé]],SMALL(IF(Tableau_de_suivi[Clôturé]=\"OUI\",ROW(Tableau_de_suivi[Clôturé])-2),ROWS($1:11)),COLUMN()),\"\")","v":""},{"$f":"IFERROR(INDEX(Tableau_de_suivi[[N°]:[Clôturé]],SMALL(IF(Tableau_de_suivi[Clôturé]=\"OUI\",ROW(Tableau_de_suivi[Clôturé])-2),ROWS($1:11)),COLUMN()),\"\")","v":""},{"$f":"IFERROR(INDEX(Tableau_de_suivi[[N°]:[Clôturé]],SMALL(IF(Tableau_de_suivi[Clôturé]=\"OUI\",ROW(Tableau_de_suivi[Clôturé])-2),ROWS($1:11)),COLUMN()),\"\")","v":""},{"$f":"IFERROR(INDEX(Tableau_de_suivi[[N°]:[Clôturé]],SMALL(IF(Tableau_de_suivi[Clôturé]=\"OUI\",ROW(Tableau_de_suivi[Clôturé])-2),ROWS($1:11)),COLUMN()),\"\")","v":""},{"$f":"IFERROR(INDEX(Tableau_de_suivi[[N°]:[Clôturé]],SMALL(IF(Tableau_de_suivi[Clôturé]=\"OUI\",ROW(Tableau_de_suivi[Clôturé])-2),ROWS($1:11)),COLUMN()),\"\")","v":""},{"$f":"IFERROR(INDEX(Tableau_de_suivi[[N°]:[Clôturé]],SMALL(IF(Tableau_de_suivi[Clôturé]=\"OUI\",ROW(Tableau_de_suivi[Clôturé])-2),ROWS($1:11)),COLUMN()),\"\")","v":""},{"$f":"IFERROR(INDEX(Tableau_de_suivi[[N°]:[Clôturé]],SMALL(IF(Tableau_de_suivi[Clôturé]=\"OUI\",ROW(Tableau_de_suivi[Clôturé])-2),ROWS($1:11)),COLUMN()),\"\")","v":""},{"$f":"IFERROR(INDEX(Tableau_de_suivi[[N°]:[Clôturé]],SMALL(IF(Tableau_de_suivi[Clôturé]=\"OUI\",ROW(Tableau_de_suivi[Clôturé])-2),ROWS($1:11)),COLUMN()),\"\")","v":""},{"$f":"IFERROR(INDEX(Tableau_de_suivi[[N°]:[Clôturé]],SMALL(IF(Tableau_de_suivi[Clôturé]=\"OUI\",ROW(Tableau_de_suivi[Clôturé])-2),ROWS($1:11)),COLUMN()),\"\")","v":""},{"$f":"IFERROR(INDEX(Tableau_de_suivi[[N°]:[Clôturé]],SMALL(IF(Tableau_de_suivi[Clôturé]=\"OUI\",ROW(Tableau_de_suivi[Clôturé])-2),ROWS($1:11)),COLUMN()),\"\")","v":""},{"$f":"IFERROR(INDEX(Tableau_de_suivi[[N°]:[Clôturé]],SMALL(IF(Tableau_de_suivi[Clôturé]=\"OUI\",ROW(Tableau_de_suivi[Clôturé])-2),ROWS($1:11)),COLUMN()),\"\")","v":""},{"$f":"IFERROR(INDEX(Tableau_de_suivi[[N°]:[Clôturé]],SMALL(IF(Tableau_de_suivi[Clôturé]=\"OUI\",ROW(Tableau_de_suivi[Clôturé])-2),ROWS($1:11)),COLUMN()),\"\")","v":""},{"$f":"IFERROR(INDEX(Tableau_de_suivi[[N°]:[Clôturé]],SMALL(IF(Tableau_de_suivi[Clôturé]=\"OUI\",ROW(Tableau_de_suivi[Clôturé])-2),ROWS($1:11)),COLUMN()),\"\")","v":""},{"$f":"IFERROR(INDEX(Tableau_de_suivi[[N°]:[Clôturé]],SMALL(IF(Tableau_de_suivi[Clôturé]=\"OUI\",ROW(Tableau_de_suivi[Clôturé])-2),ROWS($1:11)),COLUMN()),\"\")","v":""},{"$f":"IFERROR(INDEX(Tableau_de_suivi[[N°]:[Clôturé]],SMALL(IF(Tableau_de_suivi[Clôturé]=\"OUI\",ROW(Tableau_de_suivi[Clôturé])-2),ROWS($1:11)),COLUMN()),\"\")","v":""},{"$f":"IFERROR(INDEX(Tableau_de_suivi[[N°]:[Clôturé]],SMALL(IF(Tableau_de_suivi[Clôturé]=\"OUI\",ROW(Tableau_de_suivi[Clôturé])-2),ROWS($1:11)),COLUMN()),\"\")","v":""},{"$f":"IFERROR(INDEX(Tableau_de_suivi[[N°]:[Clôturé]],SMALL(IF(Tableau_de_suivi[Clôturé]=\"OUI\",ROW(Tableau_de_suivi[Clôturé])-2),ROWS($1:11)),COLUMN()),\"\")","v":""},{"$f":"IFERROR(INDEX(Tableau_de_suivi[[N°]:[Clôturé]],SMALL(IF(Tableau_de_suivi[Clôturé]=\"OUI\",ROW(Tableau_de_suivi[Clôturé])-2),ROWS($1:11)),COLUMN()),\"\")","v":""},{"$f":"IFERROR(INDEX(Tableau_de_suivi[[N°]:[Clôturé]],SMALL(IF(Tableau_de_suivi[Clôturé]=\"OUI\",ROW(Tableau_de_suivi[Clôturé])-2),ROWS($1:11)),COLUMN()),\"\")","v":""}]
[{"$f":"IFERROR(INDEX(Tableau_de_suivi[[N°]:[Clôturé]],SMALL(IF(Tableau_de_suivi[Clôturé]=\"OUI\",ROW(Tableau_de_suivi[Clôturé])-2),ROWS($1:12)),COLUMN()),\"\")","v":""},{"$f":"IFERROR(INDEX(Tableau_de_suivi[[N°]:[Clôturé]],SMALL(IF(Tableau_de_suivi[Clôturé]=\"OUI\",ROW(Tableau_de_suivi[Clôturé])-2),ROWS($1:12)),COLUMN()),\"\")","v":""},{"$f":"IFERROR(INDEX(Tableau_de_suivi[[N°]:[Clôturé]],SMALL(IF(Tableau_de_suivi[Clôturé]=\"OUI\",ROW(Tableau_de_suivi[Clôturé])-2),ROWS($1:12)),COLUMN()),\"\")","v":""},{"$f":"IFERROR(INDEX(Tableau_de_suivi[[N°]:[Clôturé]],SMALL(IF(Tableau_de_suivi[Clôturé]=\"OUI\",ROW(Tableau_de_suivi[Clôturé])-2),ROWS($1:12)),COLUMN()),\"\")","v":""},{"$f":"IFERROR(INDEX(Tableau_de_suivi[[N°]:[Clôturé]],SMALL(IF(Tableau_de_suivi[Clôturé]=\"OUI\",ROW(Tableau_de_suivi[Clôturé])-2),ROWS($1:12)),COLUMN()),\"\")","v":""},{"$f":"IFERROR(INDEX(Tableau_de_suivi[[N°]:[Clôturé]],SMALL(IF(Tableau_de_suivi[Clôturé]=\"OUI\",ROW(Tableau_de_suivi[Clôturé])-2),ROWS($1:12)),COLUMN()),\"\")","v":""},{"$f":"IFERROR(INDEX(Tableau_de_suivi[[N°]:[Clôturé]],SMALL(IF(Tableau_de_suivi[Clôturé]=\"OUI\",ROW(Tableau_de_suivi[Clôturé])-2),ROWS($1:12)),COLUMN()),\"\")","v":""},{"$f":"IFERROR(INDEX(Tableau_de_suivi[[N°]:[Clôturé]],SMALL(IF(Tableau_de_suivi[Clôturé]=\"OUI\",ROW(Tableau_de_suivi[Clôturé])-2),ROWS($1:12)),COLUMN()),\"\")","v":""},{"$f":"IFERROR(INDEX(Tableau_de_suivi[[N°]:[Clôturé]],SMALL(IF(Tableau_de_suivi[Clôturé]=\"OUI\",ROW(Tableau_de_suivi[Clôturé])-2),ROWS($1:12)),COLUMN()),\"\")","v":""},{"$f":"IFERROR(INDEX(Tableau_de_suivi[[N°]:[Clôturé]],SMALL(IF(Tableau_de_suivi[Clôturé]=\"OUI\",ROW(Tableau_de_suivi[Clôturé])-2),ROWS($1:12)),COLUMN()),\"\")","v":""},{"$f":"IFERROR(INDEX(Tableau_de_suivi[[N°]:[Clôturé]],SMALL(IF(Tableau_de_suivi[Clôturé]=\"OUI\",ROW(Tableau_de_suivi[Clôturé])-2),ROWS($1:12)),COLUMN()),\"\")","v":""},{"$f":"IFERROR(INDEX(Tableau_de_suivi[[N°]:[Clôturé]],SMALL(IF(Tableau_de_suivi[Clôturé]=\"OUI\",ROW(Tableau_de_suivi[Clôturé])-2),ROWS($1:12)),COLUMN()),\"\")","v":""},{"$f":"IFERROR(INDEX(Tableau_de_suivi[[N°]:[Clôturé]],SMALL(IF(Tableau_de_suivi[Clôturé]=\"OUI\",ROW(Tableau_de_suivi[Clôturé])-2),ROWS($1:12)),COLUMN()),\"\")","v":""},{"$f":"IFERROR(INDEX(Tableau_de_suivi[[N°]:[Clôturé]],SMALL(IF(Tableau_de_suivi[Clôturé]=\"OUI\",ROW(Tableau_de_suivi[Clôturé])-2),ROWS($1:12)),COLUMN()),\"\")","v":""},{"$f":"IFERROR(INDEX(Tableau_de_suivi[[N°]:[Clôturé]],SMALL(IF(Tableau_de_suivi[Clôturé]=\"OUI\",ROW(Tableau_de_suivi[Clôturé])-2),ROWS($1:12)),COLUMN()),\"\")","v":""},{"$f":"IFERROR(INDEX(Tableau_de_suivi[[N°]:[Clôturé]],SMALL(IF(Tableau_de_suivi[Clôturé]=\"OUI\",ROW(Tableau_de_suivi[Clôturé])-2),ROWS($1:12)),COLUMN()),\"\")","v":""},{"$f":"IFERROR(INDEX(Tableau_de_suivi[[N°]:[Clôturé]],SMALL(IF(Tableau_de_suivi[Clôturé]=\"OUI\",ROW(Tableau_de_suivi[Clôturé])-2),ROWS($1:12)),COLUMN()),\"\")","v":""},{"$f":"IFERROR(INDEX(Tableau_de_suivi[[N°]:[Clôturé]],SMALL(IF(Tableau_de_suivi[Clôturé]=\"OUI\",ROW(Tableau_de_suivi[Clôturé])-2),ROWS($1:12)),COLUMN()),\"\")","v":""},{"$f":"IFERROR(INDEX(Tableau_de_suivi[[N°]:[Clôturé]],SMALL(IF(Tableau_de_suivi[Clôturé]=\"OUI\",ROW(Tableau_de_suivi[Clôturé])-2),ROWS($1:12)),COLUMN()),\"\")","v":""},{"$f":"IFERROR(INDEX(Tableau_de_suivi[[N°]:[Clôturé]],SMALL(IF(Tableau_de_suivi[Clôturé]=\"OUI\",ROW(Tableau_de_suivi[Clôturé])-2),ROWS($1:12)),COLUMN()),\"\")","v":""},{"$f":"IFERROR(INDEX(Tableau_de_suivi[[N°]:[Clôturé]],SMALL(IF(Tableau_de_suivi[Clôturé]=\"OUI\",ROW(Tableau_de_suivi[Clôturé])-2),ROWS($1:12)),COLUMN()),\"\")","v":""},{"$f":"IFERROR(INDEX(Tableau_de_suivi[[N°]:[Clôturé]],SMALL(IF(Tableau_de_suivi[Clôturé]=\"OUI\",ROW(Tableau_de_suivi[Clôturé])-2),ROWS($1:12)),COLUMN()),\"\")","v":""}]
[{"$f":"IFERROR(INDEX(Tableau_de_suivi[[N°]:[Clôturé]],SMALL(IF(Tableau_de_suivi[Clôturé]=\"OUI\",ROW(Tableau_de_suivi[Clôturé])-2),ROWS($1:13)),COLUMN()),\"\")","v":""},{"$f":"IFERROR(INDEX(Tableau_de_suivi[[N°]:[Clôturé]],SMALL(IF(Tableau_de_suivi[Clôturé]=\"OUI\",ROW(Tableau_de_suivi[Clôturé])-2),ROWS($1:13)),COLUMN()),\"\")","v":""},{"$f":"IFERROR(INDEX(Tableau_de_suivi[[N°]:[Clôturé]],SMALL(IF(Tableau_de_suivi[Clôturé]=\"OUI\",ROW(Tableau_de_suivi[Clôturé])-2),ROWS($1:13)),COLUMN()),\"\")","v":""},{"$f":"IFERROR(INDEX(Tableau_de_suivi[[N°]:[Clôturé]],SMALL(IF(Tableau_de_suivi[Clôturé]=\"OUI\",ROW(Tableau_de_suivi[Clôturé])-2),ROWS($1:13)),COLUMN()),\"\")","v":""},{"$f":"IFERROR(INDEX(Tableau_de_suivi[[N°]:[Clôturé]],SMALL(IF(Tableau_de_suivi[Clôturé]=\"OUI\",ROW(Tableau_de_suivi[Clôturé])-2),ROWS($1:13)),COLUMN()),\"\")","v":""},{"$f":"IFERROR(INDEX(Tableau_de_suivi[[N°]:[Clôturé]],SMALL(IF(Tableau_de_suivi[Clôturé]=\"OUI\",ROW(Tableau_de_suivi[Clôturé])-2),ROWS($1:13)),COLUMN()),\"\")","v":""},{"$f":"IFERROR(INDEX(Tableau_de_suivi[[N°]:[Clôturé]],SMALL(IF(Tableau_de_suivi[Clôturé]=\"OUI\",ROW(Tableau_de_suivi[Clôturé])-2),ROWS($1:13)),COLUMN()),\"\")","v":""},{"$f":"IFERROR(INDEX(Tableau_de_suivi[[N°]:[Clôturé]],SMALL(IF(Tableau_de_suivi[Clôturé]=\"OUI\",ROW(Tableau_de_suivi[Clôturé])-2),ROWS($1:13)),COLUMN()),\"\")","v":""},{"$f":"IFERROR(INDEX(Tableau_de_suivi[[N°]:[Clôturé]],SMALL(IF(Tableau_de_suivi[Clôturé]=\"OUI\",ROW(Tableau_de_suivi[Clôturé])-2),ROWS($1:13)),COLUMN()),\"\")","v":""},{"$f":"IFERROR(INDEX(Tableau_de_suivi[[N°]:[Clôturé]],SMALL(IF(Tableau_de_suivi[Clôturé]=\"OUI\",ROW(Tableau_de_suivi[Clôturé])-2),ROWS($1:13)),COLUMN()),\"\")","v":""},{"$f":"IFERROR(INDEX(Tableau_de_suivi[[N°]:[Clôturé]],SMALL(IF(Tableau_de_suivi[Clôturé]=\"OUI\",ROW(Tableau_de_suivi[Clôturé])-2),ROWS($1:13)),COLUMN()),\"\")","v":""},{"$f":"IFERROR(INDEX(Tableau_de_suivi[[N°]:[Clôturé]],SMALL(IF(Tableau_de_suivi[Clôturé]=\"OUI\",ROW(Tableau_de_suivi[Clôturé])-2),ROWS($1:13)),COLUMN()),\"\")","v":""},{"$f":"IFERROR(INDEX(Tableau_de_suivi[[N°]:[Clôturé]],SMALL(IF(Tableau_de_suivi[Clôturé]=\"OUI\",ROW(Tableau_de_suivi[Clôturé])-2),ROWS($1:13)),COLUMN()),\"\")","v":""},{"$f":"IFERROR(INDEX(Tableau_de_suivi[[N°]:[Clôturé]],SMALL(IF(Tableau_de_suivi[Clôturé]=\"OUI\",ROW(Tableau_de_suivi[Clôturé])-2),ROWS($1:13)),COLUMN()),\"\")","v":""},{"$f":"IFERROR(INDEX(Tableau_de_suivi[[N°]:[Clôturé]],SMALL(IF(Tableau_de_suivi[Clôturé]=\"OUI\",ROW(Tableau_de_suivi[Clôturé])-2),ROWS($1:13)),COLUMN()),\"\")","v":""},{"$f":"IFERROR(INDEX(Tableau_de_suivi[[N°]:[Clôturé]],SMALL(IF(Tableau_de_suivi[Clôturé]=\"OUI\",ROW(Tableau_de_suivi[Clôturé])-2),ROWS($1:13)),COLUMN()),\"\")","v":""},{"$f":"IFERROR(INDEX(Tableau_de_suivi[[N°]:[Clôturé]],SMALL(IF(Tableau_de_suivi[Clôturé]=\"OUI\",ROW(Tableau_de_suivi[Clôturé])-2),ROWS($1:13)),COLUMN()),\"\")","v":""},{"$f":"IFERROR(INDEX(Tableau_de_suivi[[N°]:[Clôturé]],SMALL(IF(Tableau_de_suivi[Clôturé]=\"OUI\",ROW(Tableau_de_suivi[Clôturé])-2),ROWS($1:13)),COLUMN()),\"\")","v":""},{"$f":"IFERROR(INDEX(Tableau_de_suivi[[N°]:[Clôturé]],SMALL(IF(Tableau_de_suivi[Clôturé]=\"OUI\",ROW(Tableau_de_suivi[Clôturé])-2),ROWS($1:13)),COLUMN()),\"\")","v":""},{"$f":"IFERROR(INDEX(Tableau_de_suivi[[N°]:[Clôturé]],SMALL(IF(Tableau_de_suivi[Clôturé]=\"OUI\",ROW(Tableau_de_suivi[Clôturé])-2),ROWS($1:13)),COLUMN()),\"\")","v":""},{"$f":"IFERROR(INDEX(Tableau_de_suivi[[N°]:[Clôturé]],SMALL(IF(Tableau_de_suivi[Clôturé]=\"OUI\",ROW(Tableau_de_suivi[Clôturé])-2),ROWS($1:13)),COLUMN()),\"\")","v":""},{"$f":"IFERROR(INDEX(Tableau_de_suivi[[N°]:[Clôturé]],SMALL(IF(Tableau_de_suivi[Clôturé]=\"OUI\",ROW(Tableau_de_suivi[Clôturé])-2),ROWS($1:13)),COLUMN()),\"\")","v":""}]
[{"$f":"IFERROR(INDEX(Tableau_de_suivi[[N°]:[Clôturé]],SMALL(IF(Tableau_de_suivi[Clôturé]=\"OUI\",ROW(Tableau_de_suivi[Clôturé])-2),ROWS($1:14)),COLUMN()),\"\")","v":""},{"$f":"IFERROR(INDEX(Tableau_de_suivi[[N°]:[Clôturé]],SMALL(IF(Tableau_de_suivi[Clôturé]=\"OUI\",ROW(Tableau_de_suivi[Clôturé])-2),ROWS($1:14)),COLUMN()),\"\")","v":""},{"$f":"IFERROR(INDEX(Tableau_de_suivi[[N°]:[Clôturé]],SMALL(IF(Tableau_de_suivi[Clôturé]=\"OUI\",ROW(Tableau_de_suivi[Clôturé])-2),ROWS($1:14)),COLUMN()),\"\")","v":""},{"$f":"IFERROR(INDEX(Tableau_de_suivi[[N°]:[Clôturé]],SMALL(IF(Tableau_de_suivi[Clôturé]=\"OUI\",ROW(Tableau_de_suivi[Clôturé])-2),ROWS($1:14)),COLUMN()),\"\")","v":""},{"$f":"IFERROR(INDEX(Tableau_de_suivi[[N°]:[Clôturé]],SMALL(IF(Tableau_de_suivi[Clôturé]=\"OUI\",ROW(Tableau_de_suivi[Clôturé])-2),ROWS($1:14)),COLUMN()),\"\")","v":""},{"$f":"IFERROR(INDEX(Tableau_de_suivi[[N°]:[Clôturé]],SMALL(IF(Tableau_de_suivi[Clôturé]=\"OUI\",ROW(Tableau_de_suivi[Clôturé])-2),ROWS($1:14)),COLUMN()),\"\")","v":""},{"$f":"IFERROR(INDEX(Tableau_de_suivi[[N°]:[Clôturé]],SMALL(IF(Tableau_de_suivi[Clôturé]=\"OUI\",ROW(Tableau_de_suivi[Clôturé])-2),ROWS($1:14)),COLUMN()),\"\")","v":""},{"$f":"IFERROR(INDEX(Tableau_de_suivi[[N°]:[Clôturé]],SMALL(IF(Tableau_de_suivi[Clôturé]=\"OUI\",ROW(Tableau_de_suivi[Clôturé])-2),ROWS($1:14)),COLUMN()),\"\")","v":""},{"$f":"IFERROR(INDEX(Tableau_de_suivi[[N°]:[Clôturé]],SMALL(IF(Tableau_de_suivi[Clôturé]=\"OUI\",ROW(Tableau_de_suivi[Clôturé])-2),ROWS($1:14)),COLUMN()),\"\")","v":""},{"$f":"IFERROR(INDEX(Tableau_de_suivi[[N°]:[Clôturé]],SMALL(IF(Tableau_de_suivi[Clôturé]=\"OUI\",ROW(Tableau_de_suivi[Clôturé])-2),ROWS($1:14)),COLUMN()),\"\")","v":""},{"$f":"IFERROR(INDEX(Tableau_de_suivi[[N°]:[Clôturé]],SMALL(IF(Tableau_de_suivi[Clôturé]=\"OUI\",ROW(Tableau_de_suivi[Clôturé])-2),ROWS($1:14)),COLUMN()),\"\")","v":""},{"$f":"IFERROR(INDEX(Tableau_de_suivi[[N°]:[Clôturé]],SMALL(IF(Tableau_de_suivi[Clôturé]=\"OUI\",ROW(Tableau_de_suivi[Clôturé])-2),ROWS($1:14)),COLUMN()),\"\")","v":""},{"$f":"IFERROR(INDEX(Tableau_de_suivi[[N°]:[Clôturé]],SMALL(IF(Tableau_de_suivi[Clôturé]=\"OUI\",ROW(Tableau_de_suivi[Clôturé])-2),ROWS($1:14)),COLUMN()),\"\")","v":""},{"$f":"IFERROR(INDEX(Tableau_de_suivi[[N°]:[Clôturé]],SMALL(IF(Tableau_de_suivi[Clôturé]=\"OUI\",ROW(Tableau_de_suivi[Clôturé])-2),ROWS($1:14)),COLUMN()),\"\")","v":""},{"$f":"IFERROR(INDEX(Tableau_de_suivi[[N°]:[Clôturé]],SMALL(IF(Tableau_de_suivi[Clôturé]=\"OUI\",ROW(Tableau_de_suivi[Clôturé])-2),ROWS($1:14)),COLUMN()),\"\")","v":""},{"$f":"IFERROR(INDEX(Tableau_de_suivi[[N°]:[Clôturé]],SMALL(IF(Tableau_de_suivi[Clôturé]=\"OUI\",ROW(Tableau_de_suivi[Clôturé])-2),ROWS($1:14)),COLUMN()),\"\")","v":""},{"$f":"IFERROR(INDEX(Tableau_de_suivi[[N°]:[Clôturé]],SMALL(IF(Tableau_de_suivi[Clôturé]=\"OUI\",ROW(Tableau_de_suivi[Clôturé])-2),ROWS($1:14)),COLUMN()),\"\")","v":""},{"$f":"IFERROR(INDEX(Tableau_de_suivi[[N°]:[Clôturé]],SMALL(IF(Tableau_de_suivi[Clôturé]=\"OUI\",ROW(Tableau_de_suivi[Clôturé])-2),ROWS($1:14)),COLUMN()),\"\")","v":""},{"$f":"IFERROR(INDEX(Tableau_de_suivi[[N°]:[Clôturé]],SMALL(IF(Tableau_de_suivi[Clôturé]=\"OUI\",ROW(Tableau_de_suivi[Clôturé])-2),ROWS($1:14)),COLUMN()),\"\")","v":""},{"$f":"IFERROR(INDEX(Tableau_de_suivi[[N°]:[Clôturé]],SMALL(IF(Tableau_de_suivi[Clôturé]=\"OUI\",ROW(Tableau_de_suivi[Clôturé])-2),ROWS($1:14)),COLUMN()),\"\")","v":""},{"$f":"IFERROR(INDEX(Tableau_de_suivi[[N°]:[Clôturé]],SMALL(IF(Tableau_de_suivi[Clôturé]=\"OUI\",ROW(Tableau_de_suivi[Clôturé])-2),ROWS($1:14)),COLUMN()),\"\")","v":""},{"$f":"IFERROR(INDEX(Tableau_de_suivi[[N°]:[Clôturé]],SMALL(IF(Tableau_de_suivi[Clôturé]=\"OUI\",ROW(Tableau_de_suivi[Clôturé])-2),ROWS($1:14)),COLUMN()),\"\")","v":""}]
[{"$f":"IFERROR(INDEX(Tableau_de_suivi[[N°]:[Clôturé]],SMALL(IF(Tableau_de_suivi[Clôturé]=\"OUI\",ROW(Tableau_de_suivi[Clôturé])-2),ROWS($1:15)),COLUMN()),\"\")","v":""},{"$f":"IFERROR(INDEX(Tableau_de_suivi[[N°]:[Clôturé]],SMALL(IF(Tableau_de_suivi[Clôturé]=\"OUI\",ROW(Tableau_de_suivi[Clôturé])-2),ROWS($1:15)),COLUMN()),\"\")","v":""},{"$f":"IFERROR(INDEX(Tableau_de_suivi[[N°]:[Clôturé]],SMALL(IF(Tableau_de_suivi[Clôturé]=\"OUI\",ROW(Tableau_de_suivi[Clôturé])-2),ROWS($1:15)),COLUMN()),\"\")","v":""},{"$f":"IFERROR(INDEX(Tableau_de_suivi[[N°]:[Clôturé]],SMALL(IF(Tableau_de_suivi[Clôturé]=\"OUI\",ROW(Tableau_de_suivi[Clôturé])-2),ROWS($1:15)),COLUMN()),\"\")","v":""},{"$f":"IFERROR(INDEX(Tableau_de_suivi[[N°]:[Clôturé]],SMALL(IF(Tableau_de_suivi[Clôturé]=\"OUI\",ROW(Tableau_de_suivi[Clôturé])-2),ROWS($1:15)),COLUMN()),\"\")","v":""},{"$f":"IFERROR(INDEX(Tableau_de_suivi[[N°]:[Clôturé]],SMALL(IF(Tableau_de_suivi[Clôturé]=\"OUI\",ROW(Tableau_de_suivi[Clôturé])-2),ROWS($1:15)),COLUMN()),\"\")","v":""},{"$f":"IFERROR(INDEX(Tableau_de_suivi[[N°]:[Clôturé]],SMALL(IF(Tableau_de_suivi[Clôturé]=\"OUI\",ROW(Tableau_de_suivi[Clôturé])-2),ROWS($1:15)),COLUMN()),\"\")","v":""},{"$f":"IFERROR(INDEX(Tableau_de_suivi[[N°]:[Clôturé]],SMALL(IF(Tableau_de_suivi[Clôturé]=\"OUI\",ROW(Tableau_de_suivi[Clôturé])-2),ROWS($1:15)),COLUMN()),\"\")","v":""},{"$f":"IFERROR(INDEX(Tableau_de_suivi[[N°]:[Clôturé]],SMALL(IF(Tableau_de_suivi[Clôturé]=\"OUI\",ROW(Tableau_de_suivi[Clôturé])-2),ROWS($1:15)),COLUMN()),\"\")","v":""},{"$f":"IFERROR(INDEX(Tableau_de_suivi[[N°]:[Clôturé]],SMALL(IF(Tableau_de_suivi[Clôturé]=\"OUI\",ROW(Tableau_de_suivi[Clôturé])-2),ROWS($1:15)),COLUMN()),\"\")","v":""},{"$f":"IFERROR(INDEX(Tableau_de_suivi[[N°]:[Clôturé]],SMALL(IF(Tableau_de_suivi[Clôturé]=\"OUI\",ROW(Tableau_de_suivi[Clôturé])-2),ROWS($1:15)),COLUMN()),\"\")","v":""},{"$f":"IFERROR(INDEX(Tableau_de_suivi[[N°]:[Clôturé]],SMALL(IF(Tableau_de_suivi[Clôturé]=\"OUI\",ROW(Tableau_de_suivi[Clôturé])-2),ROWS($1:15)),COLUMN()),\"\")","v":""},{"$f":"IFERROR(INDEX(Tableau_de_suivi[[N°]:[Clôturé]],SMALL(IF(Tableau_de_suivi[Clôturé]=\"OUI\",ROW(Tableau_de_suivi[Clôturé])-2),ROWS($1:15)),COLUMN()),\"\")","v":""},{"$f":"IFERROR(INDEX(Tableau_de_suivi[[N°]:[Clôturé]],SMALL(IF(Tableau_de_suivi[Clôturé]=\"OUI\",ROW(Tableau_de_suivi[Clôturé])-2),ROWS($1:15)),COLUMN()),\"\")","v":""},{"$f":"IFERROR(INDEX(Tableau_de_suivi[[N°]:[Clôturé]],SMALL(IF(Tableau_de_suivi[Clôturé]=\"OUI\",ROW(Tableau_de_suivi[Clôturé])-2),ROWS($1:15)),COLUMN()),\"\")","v":""},{"$f":"IFERROR(INDEX(Tableau_de_suivi[[N°]:[Clôturé]],SMALL(IF(Tableau_de_suivi[Clôturé]=\"OUI\",ROW(Tableau_de_suivi[Clôturé])-2),ROWS($1:15)),COLUMN()),\"\")","v":""},{"$f":"IFERROR(INDEX(Tableau_de_suivi[[N°]:[Clôturé]],SMALL(IF(Tableau_de_suivi[Clôturé]=\"OUI\",ROW(Tableau_de_suivi[Clôturé])-2),ROWS($1:15)),COLUMN()),\"\")","v":""},{"$f":"IFERROR(INDEX(Tableau_de_suivi[[N°]:[Clôturé]],SMALL(IF(Tableau_de_suivi[Clôturé]=\"OUI\",ROW(Tableau_de_suivi[Clôturé])-2),ROWS($1:15)),COLUMN()),\"\")","v":""},{"$f":"IFERROR(INDEX(Tableau_de_suivi[[N°]:[Clôturé]],SMALL(IF(Tableau_de_suivi[Clôturé]=\"OUI\",ROW(Tableau_de_suivi[Clôturé])-2),ROWS($1:15)),COLUMN()),\"\")","v":""},{"$f":"IFERROR(INDEX(Tableau_de_suivi[[N°]:[Clôturé]],SMALL(IF(Tableau_de_suivi[Clôturé]=\"OUI\",ROW(Tableau_de_suivi[Clôturé])-2),ROWS($1:15)),COLUMN()),\"\")","v":""},{"$f":"IFERROR(INDEX(Tableau_de_suivi[[N°]:[Clôturé]],SMALL(IF(Tableau_de_suivi[Clôturé]=\"OUI\",ROW(Tableau_de_suivi[Clôturé])-2),ROWS($1:15)),COLUMN()),\"\")","v":""},{"$f":"IFERROR(INDEX(Tableau_de_suivi[[N°]:[Clôturé]],SMALL(IF(Tableau_de_suivi[Clôturé]=\"OUI\",ROW(Tableau_de_suivi[Clôturé])-2),ROWS($1:15)),COLUMN()),\"\")","v":""}]
[{"$f":"IFERROR(INDEX(Tableau_de_suivi[[N°]:[Clôturé]],SMALL(IF(Tableau_de_suivi[Clôturé]=\"OUI\",ROW(Tableau_de_suivi[Clôturé])-2),ROWS($1:16)),COLUMN()),\"\")","v":""},{"$f":"IFERROR(INDEX(Tableau_de_suivi[[N°]:[Clôturé]],SMALL(IF(Tableau_de_suivi[Clôturé]=\"OUI\",ROW(Tableau_de_suivi[Clôturé])-2),ROWS($1:16)),COLUMN()),\"\")","v":""},{"$f":"IFERROR(INDEX(Tableau_de_suivi[[N°]:[Clôturé]],SMALL(IF(Tableau_de_suivi[Clôturé]=\"OUI\",ROW(Tableau_de_suivi[Clôturé])-2),ROWS($1:16)),COLUMN()),\"\")","v":""},{"$f":"IFERROR(INDEX(Tableau_de_suivi[[N°]:[Clôturé]],SMALL(IF(Tableau_de_suivi[Clôturé]=\"OUI\",ROW(Tableau_de_suivi[Clôturé])-2),ROWS($1:16)),COLUMN()),\"\")","v":""},{"$f":"IFERROR(INDEX(Tableau_de_suivi[[N°]:[Clôturé]],SMALL(IF(Tableau_de_suivi[Clôturé]=\"OUI\",ROW(Tableau_de_suivi[Clôturé])-2),ROWS($1:16)),COLUMN()),\"\")","v":""},{"$f":"IFERROR(INDEX(Tableau_de_suivi[[N°]:[Clôturé]],SMALL(IF(Tableau_de_suivi[Clôturé]=\"OUI\",ROW(Tableau_de_suivi[Clôturé])-2),ROWS($1:16)),COLUMN()),\"\")","v":""},{"$f":"IFERROR(INDEX(Tableau_de_suivi[[N°]:[Clôturé]],SMALL(IF(Tableau_de_suivi[Clôturé]=\"OUI\",ROW(Tableau_de_suivi[Clôturé])-2),ROWS($1:16)),COLUMN()),\"\")","v":""},{"$f":"IFERROR(INDEX(Tableau_de_suivi[[N°]:[Clôturé]],SMALL(IF(Tableau_de_suivi[Clôturé]=\"OUI\",ROW(Tableau_de_suivi[Clôturé])-2),ROWS($1:16)),COLUMN()),\"\")","v":""},{"$f":"IFERROR(INDEX(Tableau_de_suivi[[N°]:[Clôturé]],SMALL(IF(Tableau_de_suivi[Clôturé]=\"OUI\",ROW(Tableau_de_suivi[Clôturé])-2),ROWS($1:16)),COLUMN()),\"\")","v":""},{"$f":"IFERROR(INDEX(Tableau_de_suivi[[N°]:[Clôturé]],SMALL(IF(Tableau_de_suivi[Clôturé]=\"OUI\",ROW(Tableau_de_suivi[Clôturé])-2),ROWS($1:16)),COLUMN()),\"\")","v":""},{"$f":"IFERROR(INDEX(Tableau_de_suivi[[N°]:[Clôturé]],SMALL(IF(Tableau_de_suivi[Clôturé]=\"OUI\",ROW(Tableau_de_suivi[Clôturé])-2),ROWS($1:16)),COLUMN()),\"\")","v":""},{"$f":"IFERROR(INDEX(Tableau_de_suivi[[N°]:[Clôturé]],SMALL(IF(Tableau_de_suivi[Clôturé]=\"OUI\",ROW(Tableau_de_suivi[Clôturé])-2),ROWS($1:16)),COLUMN()),\"\")","v":""},{"$f":"IFERROR(INDEX(Tableau_de_suivi[[N°]:[Clôturé]],SMALL(IF(Tableau_de_suivi[Clôturé]=\"OUI\",ROW(Tableau_de_suivi[Clôturé])-2),ROWS($1:16)),COLUMN()),\"\")","v":""},{"$f":"IFERROR(INDEX(Tableau_de_suivi[[N°]:[Clôturé]],SMALL(IF(Tableau_de_suivi[Clôturé]=\"OUI\",ROW(Tableau_de_suivi[Clôturé])-2),ROWS($1:16)),COLUMN()),\"\")","v":""},{"$f":"IFERROR(INDEX(Tableau_de_suivi[[N°]:[Clôturé]],SMALL(IF(Tableau_de_suivi[Clôturé]=\"OUI\",ROW(Tableau_de_suivi[Clôturé])-2),ROWS($1:16)),COLUMN()),\"\")","v":""},{"$f":"IFERROR(INDEX(Tableau_de_suivi[[N°]:[Clôturé]],SMALL(IF(Tableau_de_suivi[Clôturé]=\"OUI\",ROW(Tableau_de_suivi[Clôturé])-2),ROWS($1:16)),COLUMN()),\"\")","v":""},{"$f":"IFERROR(INDEX(Tableau_de_suivi[[N°]:[Clôturé]],SMALL(IF(Tableau_de_suivi[Clôturé]=\"OUI\",ROW(Tableau_de_suivi[Clôturé])-2),ROWS($1:16)),COLUMN()),\"\")","v":""},{"$f":"IFERROR(INDEX(Tableau_de_suivi[[N°]:[Clôturé]],SMALL(IF(Tableau_de_suivi[Clôturé]=\"OUI\",ROW(Tableau_de_suivi[Clôturé])-2),ROWS($1:16)),COLUMN()),\"\")","v":""},{"$f":"IFERROR(INDEX(Tableau_de_suivi[[N°]:[Clôturé]],SMALL(IF(Tableau_de_suivi[Clôturé]=\"OUI\",ROW(Tableau_de_suivi[Clôturé])-2),ROWS($1:16)),COLUMN()),\"\")","v":""},{"$f":"IFERROR(INDEX(Tableau_de_suivi[[N°]:[Clôturé]],SMALL(IF(Tableau_de_suivi[Clôturé]=\"OUI\",ROW(Tableau_de_suivi[Clôturé])-2),ROWS($1:16)),COLUMN()),\"\")","v":""},{"$f":"IFERROR(INDEX(Tableau_de_suivi[[N°]:[Clôturé]],SMALL(IF(Tableau_de_suivi[Clôturé]=\"OUI\",ROW(Tableau_de_suivi[Clôturé])-2),ROWS($1:16)),COLUMN()),\"\")","v":""},{"$f":"IFERROR(INDEX(Tableau_de_suivi[[N°]:[Clôturé]],SMALL(IF(Tableau_de_suivi[Clôturé]=\"OUI\",ROW(Tableau_de_suivi[Clôturé])-2),ROWS($1:16)),COLUMN()),\"\")","v":""}]
[{"$f":"IFERROR(INDEX(Tableau_de_suivi[[N°]:[Clôturé]],SMALL(IF(Tableau_de_suivi[Clôturé]=\"OUI\",ROW(Tableau_de_suivi[Clôturé])-2),ROWS($1:17)),COLUMN()),\"\")","v":""},{"$f":"IFERROR(INDEX(Tableau_de_suivi[[N°]:[Clôturé]],SMALL(IF(Tableau_de_suivi[Clôturé]=\"OUI\",ROW(Tableau_de_suivi[Clôturé])-2),ROWS($1:17)),COLUMN()),\"\")","v":""},{"$f":"IFERROR(INDEX(Tableau_de_suivi[[N°]:[Clôturé]],SMALL(IF(Tableau_de_suivi[Clôturé]=\"OUI\",ROW(Tableau_de_suivi[Clôturé])-2),ROWS($1:17)),COLUMN()),\"\")","v":""},{"$f":"IFERROR(INDEX(Tableau_de_suivi[[N°]:[Clôturé]],SMALL(IF(Tableau_de_suivi[Clôturé]=\"OUI\",ROW(Tableau_de_suivi[Clôturé])-2),ROWS($1:17)),COLUMN()),\"\")","v":""},{"$f":"IFERROR(INDEX(Tableau_de_suivi[[N°]:[Clôturé]],SMALL(IF(Tableau_de_suivi[Clôturé]=\"OUI\",ROW(Tableau_de_suivi[Clôturé])-2),ROWS($1:17)),COLUMN()),\"\")","v":""},{"$f":"IFERROR(INDEX(Tableau_de_suivi[[N°]:[Clôturé]],SMALL(IF(Tableau_de_suivi[Clôturé]=\"OUI\",ROW(Tableau_de_suivi[Clôturé])-2),ROWS($1:17)),COLUMN()),\"\")","v":""},{"$f":"IFERROR(INDEX(Tableau_de_suivi[[N°]:[Clôturé]],SMALL(IF(Tableau_de_suivi[Clôturé]=\"OUI\",ROW(Tableau_de_suivi[Clôturé])-2),ROWS($1:17)),COLUMN()),\"\")","v":""},{"$f":"IFERROR(INDEX(Tableau_de_suivi[[N°]:[Clôturé]],SMALL(IF(Tableau_de_suivi[Clôturé]=\"OUI\",ROW(Tableau_de_suivi[Clôturé])-2),ROWS($1:17)),COLUMN()),\"\")","v":""},{"$f":"IFERROR(INDEX(Tableau_de_suivi[[N°]:[Clôturé]],SMALL(IF(Tableau_de_suivi[Clôturé]=\"OUI\",ROW(Tableau_de_suivi[Clôturé])-2),ROWS($1:17)),COLUMN()),\"\")","v":""},{"$f":"IFERROR(INDEX(Tableau_de_suivi[[N°]:[Clôturé]],SMALL(IF(Tableau_de_suivi[Clôturé]=\"OUI\",ROW(Tableau_de_suivi[Clôturé])-2),ROWS($1:17)),COLUMN()),\"\")","v":""},{"$f":"IFERROR(INDEX(Tableau_de_suivi[[N°]:[Clôturé]],SMALL(IF(Tableau_de_suivi[Clôturé]=\"OUI\",ROW(Tableau_de_suivi[Clôturé])-2),ROWS($1:17)),COLUMN()),\"\")","v":""},{"$f":"IFERROR(INDEX(Tableau_de_suivi[[N°]:[Clôturé]],SMALL(IF(Tableau_de_suivi[Clôturé]=\"OUI\",ROW(Tableau_de_suivi[Clôturé])-2),ROWS($1:17)),COLUMN()),\"\")","v":""},{"$f":"IFERROR(INDEX(Tableau_de_suivi[[N°]:[Clôturé]],SMALL(IF(Tableau_de_suivi[Clôturé]=\"OUI\",ROW(Tableau_de_suivi[Clôturé])-2),ROWS($1:17)),COLUMN()),\"\")","v":""},{"$f":"IFERROR(INDEX(Tableau_de_suivi[[N°]:[Clôturé]],SMALL(IF(Tableau_de_suivi[Clôturé]=\"OUI\",ROW(Tableau_de_suivi[Clôturé])-2),ROWS($1:17)),COLUMN()),\"\")","v":""},{"$f":"IFERROR(INDEX(Tableau_de_suivi[[N°]:[Clôturé]],SMALL(IF(Tableau_de_suivi[Clôturé]=\"OUI\",ROW(Tableau_de_suivi[Clôturé])-2),ROWS($1:17)),COLUMN()),\"\")","v":""},{"$f":"IFERROR(INDEX(Tableau_de_suivi[[N°]:[Clôturé]],SMALL(IF(Tableau_de_suivi[Clôturé]=\"OUI\",ROW(Tableau_de_suivi[Clôturé])-2),ROWS($1:17)),COLUMN()),\"\")","v":""},{"$f":"IFERROR(INDEX(Tableau_de_suivi[[N°]:[Clôturé]],SMALL(IF(Tableau_de_suivi[Clôturé]=\"OUI\",ROW(Tableau_de_suivi[Clôturé])-2),ROWS($1:17)),COLUMN()),\"\")","v":""},{"$f":"IFERROR(INDEX(Tableau_de_suivi[[N°]:[Clôturé]],SMALL(IF(Tableau_de_suivi[Clôturé]=\"OUI\",ROW(Tableau_de_suivi[Clôturé])-2),ROWS($1:17)),COLUMN()),\"\")","v":""},{"$f":"IFERROR(INDEX(Tableau_de_suivi[[N°]:[Clôturé]],SMALL(IF(Tableau_de_suivi[Clôturé]=\"OUI\",ROW(Tableau_de_suivi[Clôturé])-2),ROWS($1:17)),COLUMN()),\"\")","v":""},{"$f":"IFERROR(INDEX(Tableau_de_suivi[[N°]:[Clôturé]],SMALL(IF(Tableau_de_suivi[Clôturé]=\"OUI\",ROW(Tableau_de_suivi[Clôturé])-2),ROWS($1:17)),COLUMN()),\"\")","v":""},{"$f":"IFERROR(INDEX(Tableau_de_suivi[[N°]:[Clôturé]],SMALL(IF(Tableau_de_suivi[Clôturé]=\"OUI\",ROW(Tableau_de_suivi[Clôturé])-2),ROWS($1:17)),COLUMN()),\"\")","v":""},{"$f":"IFERROR(INDEX(Tableau_de_suivi[[N°]:[Clôturé]],SMALL(IF(Tableau_de_suivi[Clôturé]=\"OUI\",ROW(Tableau_de_suivi[Clôturé])-2),ROWS($1:17)),COLUMN()),\"\")","v":""}]
[{"$f":"IFERROR(INDEX(Tableau_de_suivi[[N°]:[Clôturé]],SMALL(IF(Tableau_de_suivi[Clôturé]=\"OUI\",ROW(Tableau_de_suivi[Clôturé])-2),ROWS($1:18)),COLUMN()),\"\")","v":""},{"$f":"IFERROR(INDEX(Tableau_de_suivi[[N°]:[Clôturé]],SMALL(IF(Tableau_de_suivi[Clôturé]=\"OUI\",ROW(Tableau_de_suivi[Clôturé])-2),ROWS($1:18)),COLUMN()),\"\")","v":""},{"$f":"IFERROR(INDEX(Tableau_de_suivi[[N°]:[Clôturé]],SMALL(IF(Tableau_de_suivi[Clôturé]=\"OUI\",ROW(Tableau_de_suivi[Clôturé])-2),ROWS($1:18)),COLUMN()),\"\")","v":""},{"$f":"IFERROR(INDEX(Tableau_de_suivi[[N°]:[Clôturé]],SMALL(IF(Tableau_de_suivi[Clôturé]=\"OUI\",ROW(Tableau_de_suivi[Clôturé])-2),ROWS($1:18)),COLUMN()),\"\")","v":""},{"$f":"IFERROR(INDEX(Tableau_de_suivi[[N°]:[Clôturé]],SMALL(IF(Tableau_de_suivi[Clôturé]=\"OUI\",ROW(Tableau_de_suivi[Clôturé])-2),ROWS($1:18)),COLUMN()),\"\")","v":""},{"$f":"IFERROR(INDEX(Tableau_de_suivi[[N°]:[Clôturé]],SMALL(IF(Tableau_de_suivi[Clôturé]=\"OUI\",ROW(Tableau_de_suivi[Clôturé])-2),ROWS($1:18)),COLUMN()),\"\")","v":""},{"$f":"IFERROR(INDEX(Tableau_de_suivi[[N°]:[Clôturé]],SMALL(IF(Tableau_de_suivi[Clôturé]=\"OUI\",ROW(Tableau_de_suivi[Clôturé])-2),ROWS($1:18)),COLUMN()),\"\")","v":""},{"$f":"IFERROR(INDEX(Tableau_de_suivi[[N°]:[Clôturé]],SMALL(IF(Tableau_de_suivi[Clôturé]=\"OUI\",ROW(Tableau_de_suivi[Clôturé])-2),ROWS($1:18)),COLUMN()),\"\")","v":""},{"$f":"IFERROR(INDEX(Tableau_de_suivi[[N°]:[Clôturé]],SMALL(IF(Tableau_de_suivi[Clôturé]=\"OUI\",ROW(Tableau_de_suivi[Clôturé])-2),ROWS($1:18)),COLUMN()),\"\")","v":""},{"$f":"IFERROR(INDEX(Tableau_de_suivi[[N°]:[Clôturé]],SMALL(IF(Tableau_de_suivi[Clôturé]=\"OUI\",ROW(Tableau_de_suivi[Clôturé])-2),ROWS($1:18)),COLUMN()),\"\")","v":""},{"$f":"IFERROR(INDEX(Tableau_de_suivi[[N°]:[Clôturé]],SMALL(IF(Tableau_de_suivi[Clôturé]=\"OUI\",ROW(Tableau_de_suivi[Clôturé])-2),ROWS($1:18)),COLUMN()),\"\")","v":""},{"$f":"IFERROR(INDEX(Tableau_de_suivi[[N°]:[Clôturé]],SMALL(IF(Tableau_de_suivi[Clôturé]=\"OUI\",ROW(Tableau_de_suivi[Clôturé])-2),ROWS($1:18)),COLUMN()),\"\")","v":""},{"$f":"IFERROR(INDEX(Tableau_de_suivi[[N°]:[Clôturé]],SMALL(IF(Tableau_de_suivi[Clôturé]=\"OUI\",ROW(Tableau_de_suivi[Clôturé])-2),ROWS($1:18)),COLUMN()),\"\")","v":""},{"$f":"IFERROR(INDEX(Tableau_de_suivi[[N°]:[Clôturé]],SMALL(IF(Tableau_de_suivi[Clôturé]=\"OUI\",ROW(Tableau_de_suivi[Clôturé])-2),ROWS($1:18)),COLUMN()),\"\")","v":""},{"$f":"IFERROR(INDEX(Tableau_de_suivi[[N°]:[Clôturé]],SMALL(IF(Tableau_de_suivi[Clôturé]=\"OUI\",ROW(Tableau_de_suivi[Clôturé])-2),ROWS($1:18)),COLUMN()),\"\")","v":""},{"$f":"IFERROR(INDEX(Tableau_de_suivi[[N°]:[Clôturé]],SMALL(IF(Tableau_de_suivi[Clôturé]=\"OUI\",ROW(Tableau_de_suivi[Clôturé])-2),ROWS($1:18)),COLUMN()),\"\")","v":""},{"$f":"IFERROR(INDEX(Tableau_de_suivi[[N°]:[Clôturé]],SMALL(IF(Tableau_de_suivi[Clôturé]=\"OUI\",ROW(Tableau_de_suivi[Clôturé])-2),ROWS($1:18)),COLUMN()),\"\")","v":""},{"$f":"IFERROR(INDEX(Tableau_de_suivi[[N°]:[Clôturé]],SMALL(IF(Tableau_de_suivi[Clôturé]=\"OUI\",ROW(Tableau_de_suivi[Clôturé])-2),ROWS($1:18)),COLUMN()),\"\")","v":""},{"$f":"IFERROR(INDEX(Tableau_de_suivi[[N°]:[Clôturé]],SMALL(IF(Tableau_de_suivi[Clôturé]=\"OUI\",ROW(Tableau_de_suivi[Clôturé])-2),ROWS($1:18)),COLUMN()),\"\")","v":""},{"$f":"IFERROR(INDEX(Tableau_de_suivi[[N°]:[Clôturé]],SMALL(IF(Tableau_de_suivi[Clôturé]=\"OUI\",ROW(Tableau_de_suivi[Clôturé])-2),ROWS($1:18)),COLUMN()),\"\")","v":""},{"$f":"IFERROR(INDEX(Tableau_de_suivi[[N°]:[Clôturé]],SMALL(IF(Tableau_de_suivi[Clôturé]=\"OUI\",ROW(Tableau_de_suivi[Clôturé])-2),ROWS($1:18)),COLUMN()),\"\")","v":""},{"$f":"IFERROR(INDEX(Tableau_de_suivi[[N°]:[Clôturé]],SMALL(IF(Tableau_de_suivi[Clôturé]=\"OUI\",ROW(Tableau_de_suivi[Clôturé])-2),ROWS($1:18)),COLUMN()),\"\")","v":""}]
[{"$f":"IFERROR(INDEX(Tableau_de_suivi[[N°]:[Clôturé]],SMALL(IF(Tableau_de_suivi[Clôturé]=\"OUI\",ROW(Tableau_de_suivi[Clôturé])-2),ROWS($1:19)),COLUMN()),\"\")","v":""},{"$f":"IFERROR(INDEX(Tableau_de_suivi[[N°]:[Clôturé]],SMALL(IF(Tableau_de_suivi[Clôturé]=\"OUI\",ROW(Tableau_de_suivi[Clôturé])-2),ROWS($1:19)),COLUMN()),\"\")","v":""},{"$f":"IFERROR(INDEX(Tableau_de_suivi[[N°]:[Clôturé]],SMALL(IF(Tableau_de_suivi[Clôturé]=\"OUI\",ROW(Tableau_de_suivi[Clôturé])-2),ROWS($1:19)),COLUMN()),\"\")","v":""},{"$f":"IFERROR(INDEX(Tableau_de_suivi[[N°]:[Clôturé]],SMALL(IF(Tableau_de_suivi[Clôturé]=\"OUI\",ROW(Tableau_de_suivi[Clôturé])-2),ROWS($1:19)),COLUMN()),\"\")","v":""},{"$f":"IFERROR(INDEX(Tableau_de_suivi[[N°]:[Clôturé]],SMALL(IF(Tableau_de_suivi[Clôturé]=\"OUI\",ROW(Tableau_de_suivi[Clôturé])-2),ROWS($1:19)),COLUMN()),\"\")","v":""},{"$f":"IFERROR(INDEX(Tableau_de_suivi[[N°]:[Clôturé]],SMALL(IF(Tableau_de_suivi[Clôturé]=\"OUI\",ROW(Tableau_de_suivi[Clôturé])-2),ROWS($1:19)),COLUMN()),\"\")","v":""},{"$f":"IFERROR(INDEX(Tableau_de_suivi[[N°]:[Clôturé]],SMALL(IF(Tableau_de_suivi[Clôturé]=\"OUI\",ROW(Tableau_de_suivi[Clôturé])-2),ROWS($1:19)),COLUMN()),\"\")","v":""},{"$f":"IFERROR(INDEX(Tableau_de_suivi[[N°]:[Clôturé]],SMALL(IF(Tableau_de_suivi[Clôturé]=\"OUI\",ROW(Tableau_de_suivi[Clôturé])-2),ROWS($1:19)),COLUMN()),\"\")","v":""},{"$f":"IFERROR(INDEX(Tableau_de_suivi[[N°]:[Clôturé]],SMALL(IF(Tableau_de_suivi[Clôturé]=\"OUI\",ROW(Tableau_de_suivi[Clôturé])-2),ROWS($1:19)),COLUMN()),\"\")","v":""},{"$f":"IFERROR(INDEX(Tableau_de_suivi[[N°]:[Clôturé]],SMALL(IF(Tableau_de_suivi[Clôturé]=\"OUI\",ROW(Tableau_de_suivi[Clôturé])-2),ROWS($1:19)),COLUMN()),\"\")","v":""},{"$f":"IFERROR(INDEX(Tableau_de_suivi[[N°]:[Clôturé]],SMALL(IF(Tableau_de_suivi[Clôturé]=\"OUI\",ROW(Tableau_de_suivi[Clôturé])-2),ROWS($1:19)),COLUMN()),\"\")","v":""},{"$f":"IFERROR(INDEX(Tableau_de_suivi[[N°]:[Clôturé]],SMALL(IF(Tableau_de_suivi[Clôturé]=\"OUI\",ROW(Tableau_de_suivi[Clôturé])-2),ROWS($1:19)),COLUMN()),\"\")","v":""},{"$f":"IFERROR(INDEX(Tableau_de_suivi[[N°]:[Clôturé]],SMALL(IF(Tableau_de_suivi[Clôturé]=\"OUI\",ROW(Tableau_de_suivi[Clôturé])-2),ROWS($1:19)),COLUMN()),\"\")","v":""},{"$f":"IFERROR(INDEX(Tableau_de_suivi[[N°]:[Clôturé]],SMALL(IF(Tableau_de_suivi[Clôturé]=\"OUI\",ROW(Tableau_de_suivi[Clôturé])-2),ROWS($1:19)),COLUMN()),\"\")","v":""},{"$f":"IFERROR(INDEX(Tableau_de_suivi[[N°]:[Clôturé]],SMALL(IF(Tableau_de_suivi[Clôturé]=\"OUI\",ROW(Tableau_de_suivi[Clôturé])-2),ROWS($1:19)),COLUMN()),\"\")","v":""},{"$f":"IFERROR(INDEX(Tableau_de_suivi[[N°]:[Clôturé]],SMALL(IF(Tableau_de_suivi[Clôturé]=\"OUI\",ROW(Tableau_de_suivi[Clôturé])-2),ROWS($1:19)),COLUMN()),\"\")","v":""},{"$f":"IFERROR(INDEX(Tableau_de_suivi[[N°]:[Clôturé]],SMALL(IF(Tableau_de_suivi[Clôturé]=\"OUI\",ROW(Tableau_de_suivi[Clôturé])-2),ROWS($1:19)),COLUMN()),\"\")","v":""},{"$f":"IFERROR(INDEX(Tableau_de_suivi[[N°]:[Clôturé]],SMALL(IF(Tableau_de_suivi[Clôturé]=\"OUI\",ROW(Tableau_de_suivi[Clôturé])-2),ROWS($1:19)),COLUMN()),\"\")","v":""},{"$f":"IFERROR(INDEX(Tableau_de_suivi[[N°]:[Clôturé]],SMALL(IF(Tableau_de_suivi[Clôturé]=\"OUI\",ROW(Tableau_de_suivi[Clôturé])-2),ROWS($1:19)),COLUMN()),\"\")","v":""},{"$f":"IFERROR(INDEX(Tableau_de_suivi[[N°]:[Clôturé]],SMALL(IF(Tableau_de_suivi[Clôturé]=\"OUI\",ROW(Tableau_de_suivi[Clôturé])-2),ROWS($1:19)),COLUMN()),\"\")","v":""},{"$f":"IFERROR(INDEX(Tableau_de_suivi[[N°]:[Clôturé]],SMALL(IF(Tableau_de_suivi[Clôturé]=\"OUI\",ROW(Tableau_de_suivi[Clôturé])-2),ROWS($1:19)),COLUMN()),\"\")","v":""},{"$f":"IFERROR(INDEX(Tableau_de_suivi[[N°]:[Clôturé]],SMALL(IF(Tableau_de_suivi[Clôturé]=\"OUI\",ROW(Tableau_de_suivi[Clôturé])-2),ROWS($1:19)),COLUMN()),\"\")","v":""}]
[{"$f":"IFERROR(INDEX(Tableau_de_suivi[[N°]:[Clôturé]],SMALL(IF(Tableau_de_suivi[Clôturé]=\"OUI\",ROW(Tableau_de_suivi[Clôturé])-2),ROWS($1:20)),COLUMN()),\"\")","v":""},{"$f":"IFERROR(INDEX(Tableau_de_suivi[[N°]:[Clôturé]],SMALL(IF(Tableau_de_suivi[Clôturé]=\"OUI\",ROW(Tableau_de_suivi[Clôturé])-2),ROWS($1:20)),COLUMN()),\"\")","v":""},{"$f":"IFERROR(INDEX(Tableau_de_suivi[[N°]:[Clôturé]],SMALL(IF(Tableau_de_suivi[Clôturé]=\"OUI\",ROW(Tableau_de_suivi[Clôturé])-2),ROWS($1:20)),COLUMN()),\"\")","v":""},{"$f":"IFERROR(INDEX(Tableau_de_suivi[[N°]:[Clôturé]],SMALL(IF(Tableau_de_suivi[Clôturé]=\"OUI\",ROW(Tableau_de_suivi[Clôturé])-2),ROWS($1:20)),COLUMN()),\"\")","v":""},{"$f":"IFERROR(INDEX(Tableau_de_suivi[[N°]:[Clôturé]],SMALL(IF(Tableau_de_suivi[Clôturé]=\"OUI\",ROW(Tableau_de_suivi[Clôturé])-2),ROWS($1:20)),COLUMN()),\"\")","v":""},{"$f":"IFERROR(INDEX(Tableau_de_suivi[[N°]:[Clôturé]],SMALL(IF(Tableau_de_suivi[Clôturé]=\"OUI\",ROW(Tableau_de_suivi[Clôturé])-2),ROWS($1:20)),COLUMN()),\"\")","v":""},{"$f":"IFERROR(INDEX(Tableau_de_suivi[[N°]:[Clôturé]],SMALL(IF(Tableau_de_suivi[Clôturé]=\"OUI\",ROW(Tableau_de_suivi[Clôturé])-2),ROWS($1:20)),COLUMN()),\"\")","v":""},{"$f":"IFERROR(INDEX(Tableau_de_suivi[[N°]:[Clôturé]],SMALL(IF(Tableau_de_suivi[Clôturé]=\"OUI\",ROW(Tableau_de_suivi[Clôturé])-2),ROWS($1:20)),COLUMN()),\"\")","v":""},{"$f":"IFERROR(INDEX(Tableau_de_suivi[[N°]:[Clôturé]],SMALL(IF(Tableau_de_suivi[Clôturé]=\"OUI\",ROW(Tableau_de_suivi[Clôturé])-2),ROWS($1:20)),COLUMN()),\"\")","v":""},{"$f":"IFERROR(INDEX(Tableau_de_suivi[[N°]:[Clôturé]],SMALL(IF(Tableau_de_suivi[Clôturé]=\"OUI\",ROW(Tableau_de_suivi[Clôturé])-2),ROWS($1:20)),COLUMN()),\"\")","v":""},{"$f":"IFERROR(INDEX(Tableau_de_suivi[[N°]:[Clôturé]],SMALL(IF(Tableau_de_suivi[Clôturé]=\"OUI\",ROW(Tableau_de_suivi[Clôturé])-2),ROWS($1:20)),COLUMN()),\"\")","v":""},{"$f":"IFERROR(INDEX(Tableau_de_suivi[[N°]:[Clôturé]],SMALL(IF(Tableau_de_suivi[Clôturé]=\"OUI\",ROW(Tableau_de_suivi[Clôturé])-2),ROWS($1:20)),COLUMN()),\"\")","v":""},{"$f":"IFERROR(INDEX(Tableau_de_suivi[[N°]:[Clôturé]],SMALL(IF(Tableau_de_suivi[Clôturé]=\"OUI\",ROW(Tableau_de_suivi[Clôturé])-2),ROWS($1:20)),COLUMN()),\"\")","v":""},{"$f":"IFERROR(INDEX(Tableau_de_suivi[[N°]:[Clôturé]],SMALL(IF(Tableau_de_suivi[Clôturé]=\"OUI\",ROW(Tableau_de_suivi[Clôturé])-2),ROWS($1:20)),COLUMN()),\"\")","v":""},{"$f":"IFERROR(INDEX(Tableau_de_suivi[[N°]:[Clôturé]],SMALL(IF(Tableau_de_suivi[Clôturé]=\"OUI\",ROW(Tableau_de_suivi[Clôturé])-2),ROWS($1:20)),COLUMN()),\"\")","v":""},{"$f":"IFERROR(INDEX(Tableau_de_suivi[[N°]:[Clôturé]],SMALL(IF(Tableau_de_suivi[Clôturé]=\"OUI\",ROW(Tableau_de_suivi[Clôturé])-2),ROWS($1:20)),COLUMN()),\"\")","v":""},{"$f":"IFERROR(INDEX(Tableau_de_suivi[[N°]:[Clôturé]],SMALL(IF(Tableau_de_suivi[Clôturé]=\"OUI\",ROW(Tableau_de_suivi[Clôturé])-2),ROWS($1:20)),COLUMN()),\"\")","v":""},{"$f":"IFERROR(INDEX(Tableau_de_suivi[[N°]:[Clôturé]],SMALL(IF(Tableau_de_suivi[Clôturé]=\"OUI\",ROW(Tableau_de_suivi[Clôturé])-2),ROWS($1:20)),COLUMN()),\"\")","v":""},{"$f":"IFERROR(INDEX(Tableau_de_suivi[[N°]:[Clôturé]],SMALL(IF(Tableau_de_suivi[Clôturé]=\"OUI\",ROW(Tableau_de_suivi[Clôturé])-2),ROWS($1:20)),COLUMN()),\"\")","v":""},{"$f":"IFERROR(INDEX(Tableau_de_suivi[[N°]:[Clôturé]],SMALL(IF(Tableau_de_suivi[Clôturé]=\"OUI\",ROW(Tableau_de_suivi[Clôturé])-2),ROWS($1:20)),COLUMN()),\"\")","v":""},{"$f":"IFERROR(INDEX(Tableau_de_suivi[[N°]:[Clôturé]],SMALL(IF(Tableau_de_suivi[Clôturé]=\"OUI\",ROW(Tableau_de_suivi[Clôturé])-2),ROWS($1:20)),COLUMN()),\"\")","v":""},{"$f":"IFERROR(INDEX(Tableau_de_suivi[[N°]:[Clôturé]],SMALL(IF(Tableau_de_suivi[Clôturé]=\"OUI\",ROW(Tableau_de_suivi[Clôturé])-2),ROWS($1:20)),COLUMN()),\"\")","v":""}]
[{"$f":"IFERROR(INDEX(Tableau_de_suivi[[N°]:[Clôturé]],SMALL(IF(Tableau_de_suivi[Clôturé]=\"OUI\",ROW(Tableau_de_suivi[Clôturé])-2),ROWS($1:21)),COLUMN()),\"\")","v":""},{"$f":"IFERROR(INDEX(Tableau_de_suivi[[N°]:[Clôturé]],SMALL(IF(Tableau_de_suivi[Clôturé]=\"OUI\",ROW(Tableau_de_suivi[Clôturé])-2),ROWS($1:21)),COLUMN()),\"\")","v":""},{"$f":"IFERROR(INDEX(Tableau_de_suivi[[N°]:[Clôturé]],SMALL(IF(Tableau_de_suivi[Clôturé]=\"OUI\",ROW(Tableau_de_suivi[Clôturé])-2),ROWS($1:21)),COLUMN()),\"\")","v":""},{"$f":"IFERROR(INDEX(Tableau_de_suivi[[N°]:[Clôturé]],SMALL(IF(Tableau_de_suivi[Clôturé]=\"OUI\",ROW(Tableau_de_suivi[Clôturé])-2),ROWS($1:21)),COLUMN()),\"\")","v":""},{"$f":"IFERROR(INDEX(Tableau_de_suivi[[N°]:[Clôturé]],SMALL(IF(Tableau_de_suivi[Clôturé]=\"OUI\",ROW(Tableau_de_suivi[Clôturé])-2),ROWS($1:21)),COLUMN()),\"\")","v":""},{"$f":"IFERROR(INDEX(Tableau_de_suivi[[N°]:[Clôturé]],SMALL(IF(Tableau_de_suivi[Clôturé]=\"OUI\",ROW(Tableau_de_suivi[Clôturé])-2),ROWS($1:21)),COLUMN()),\"\")","v":""},{"$f":"IFERROR(INDEX(Tableau_de_suivi[[N°]:[Clôturé]],SMALL(IF(Tableau_de_suivi[Clôturé]=\"OUI\",ROW(Tableau_de_suivi[Clôturé])-2),ROWS($1:21)),COLUMN()),\"\")","v":""},{"$f":"IFERROR(INDEX(Tableau_de_suivi[[N°]:[Clôturé]],SMALL(IF(Tableau_de_suivi[Clôturé]=\"OUI\",ROW(Tableau_de_suivi[Clôturé])-2),ROWS($1:21)),COLUMN()),\"\")","v":""},{"$f":"IFERROR(INDEX(Tableau_de_suivi[[N°]:[Clôturé]],SMALL(IF(Tableau_de_suivi[Clôturé]=\"OUI\",ROW(Tableau_de_suivi[Clôturé])-2),ROWS($1:21)),COLUMN()),\"\")","v":""},{"$f":"IFERROR(INDEX(Tableau_de_suivi[[N°]:[Clôturé]],SMALL(IF(Tableau_de_suivi[Clôturé]=\"OUI\",ROW(Tableau_de_suivi[Clôturé])-2),ROWS($1:21)),COLUMN()),\"\")","v":""},{"$f":"IFERROR(INDEX(Tableau_de_suivi[[N°]:[Clôturé]],SMALL(IF(Tableau_de_suivi[Clôturé]=\"OUI\",ROW(Tableau_de_suivi[Clôturé])-2),ROWS($1:21)),COLUMN()),\"\")","v":""},{"$f":"IFERROR(INDEX(Tableau_de_suivi[[N°]:[Clôturé]],SMALL(IF(Tableau_de_suivi[Clôturé]=\"OUI\",ROW(Tableau_de_suivi[Clôturé])-2),ROWS($1:21)),COLUMN()),\"\")","v":""},{"$f":"IFERROR(INDEX(Tableau_de_suivi[[N°]:[Clôturé]],SMALL(IF(Tableau_de_suivi[Clôturé]=\"OUI\",ROW(Tableau_de_suivi[Clôturé])-2),ROWS($1:21)),COLUMN()),\"\")","v":""},{"$f":"IFERROR(INDEX(Tableau_de_suivi[[N°]:[Clôturé]],SMALL(IF(Tableau_de_suivi[Clôturé]=\"OUI\",ROW(Tableau_de_suivi[Clôturé])-2),ROWS($1:21)),COLUMN()),\"\")","v":""},{"$f":"IFERROR(INDEX(Tableau_de_suivi[[N°]:[Clôturé]],SMALL(IF(Tableau_de_suivi[Clôturé]=\"OUI\",ROW(Tableau_de_suivi[Clôturé])-2),ROWS($1:21)),COLUMN()),\"\")","v":""},{"$f":"IFERROR(INDEX(Tableau_de_suivi[[N°]:[Clôturé]],SMALL(IF(Tableau_de_suivi[Clôturé]=\"OUI\",ROW(Tableau_de_suivi[Clôturé])-2),ROWS($1:21)),COLUMN()),\"\")","v":""},{"$f":"IFERROR(INDEX(Tableau_de_suivi[[N°]:[Clôturé]],SMALL(IF(Tableau_de_suivi[Clôturé]=\"OUI\",ROW(Tableau_de_suivi[Clôturé])-2),ROWS($1:21)),COLUMN()),\"\")","v":""},{"$f":"IFERROR(INDEX(Tableau_de_suivi[[N°]:[Clôturé]],SMALL(IF(Tableau_de_suivi[Clôturé]=\"OUI\",ROW(Tableau_de_suivi[Clôturé])-2),ROWS($1:21)),COLUMN()),\"\")","v":""},{"$f":"IFERROR(INDEX(Tableau_de_suivi[[N°]:[Clôturé]],SMALL(IF(Tableau_de_suivi[Clôturé]=\"OUI\",ROW(Tableau_de_suivi[Clôturé])-2),ROWS($1:21)),COLUMN()),\"\")","v":""},{"$f":"IFERROR(INDEX(Tableau_de_suivi[[N°]:[Clôturé]],SMALL(IF(Tableau_de_suivi[Clôturé]=\"OUI\",ROW(Tableau_de_suivi[Clôturé])-2),ROWS($1:21)),COLUMN()),\"\")","v":""},{"$f":"IFERROR(INDEX(Tableau_de_suivi[[N°]:[Clôturé]],SMALL(IF(Tableau_de_suivi[Clôturé]=\"OUI\",ROW(Tableau_de_suivi[Clôturé])-2),ROWS($1:21)),COLUMN()),\"\")","v":""},{"$f":"IFERROR(INDEX(Tableau_de_suivi[[N°]:[Clôturé]],SMALL(IF(Tableau_de_suivi[Clôturé]=\"OUI\",ROW(Tableau_de_suivi[Clôturé])-2),ROWS($1:21)),COLUMN()),\"\")","v":""}]
[{"$f":"IFERROR(INDEX(Tableau_de_suivi[[N°]:[Clôturé]],SMALL(IF(Tableau_de_suivi[Clôturé]=\"OUI\",ROW(Tableau_de_suivi[Clôturé])-2),ROWS($1:22)),COLUMN()),\"\")","v":""},{"$f":"IFERROR(INDEX(Tableau_de_suivi[[N°]:[Clôturé]],SMALL(IF(Tableau_de_suivi[Clôturé]=\"OUI\",ROW(Tableau_de_suivi[Clôturé])-2),ROWS($1:22)),COLUMN()),\"\")","v":""},{"$f":"IFERROR(INDEX(Tableau_de_suivi[[N°]:[Clôturé]],SMALL(IF(Tableau_de_suivi[Clôturé]=\"OUI\",ROW(Tableau_de_suivi[Clôturé])-2),ROWS($1:22)),COLUMN()),\"\")","v":""},{"$f":"IFERROR(INDEX(Tableau_de_suivi[[N°]:[Clôturé]],SMALL(IF(Tableau_de_suivi[Clôturé]=\"OUI\",ROW(Tableau_de_suivi[Clôturé])-2),ROWS($1:22)),COLUMN()),\"\")","v":""},{"$f":"IFERROR(INDEX(Tableau_de_suivi[[N°]:[Clôturé]],SMALL(IF(Tableau_de_suivi[Clôturé]=\"OUI\",ROW(Tableau_de_suivi[Clôturé])-2),ROWS($1:22)),COLUMN()),\"\")","v":""},{"$f":"IFERROR(INDEX(Tableau_de_suivi[[N°]:[Clôturé]],SMALL(IF(Tableau_de_suivi[Clôturé]=\"OUI\",ROW(Tableau_de_suivi[Clôturé])-2),ROWS($1:22)),COLUMN()),\"\")","v":""},{"$f":"IFERROR(INDEX(Tableau_de_suivi[[N°]:[Clôturé]],SMALL(IF(Tableau_de_suivi[Clôturé]=\"OUI\",ROW(Tableau_de_suivi[Clôturé])-2),ROWS($1:22)),COLUMN()),\"\")","v":""},{"$f":"IFERROR(INDEX(Tableau_de_suivi[[N°]:[Clôturé]],SMALL(IF(Tableau_de_suivi[Clôturé]=\"OUI\",ROW(Tableau_de_suivi[Clôturé])-2),ROWS($1:22)),COLUMN()),\"\")","v":""},{"$f":"IFERROR(INDEX(Tableau_de_suivi[[N°]:[Clôturé]],SMALL(IF(Tableau_de_suivi[Clôturé]=\"OUI\",ROW(Tableau_de_suivi[Clôturé])-2),ROWS($1:22)),COLUMN()),\"\")","v":""},{"$f":"IFERROR(INDEX(Tableau_de_suivi[[N°]:[Clôturé]],SMALL(IF(Tableau_de_suivi[Clôturé]=\"OUI\",ROW(Tableau_de_suivi[Clôturé])-2),ROWS($1:22)),COLUMN()),\"\")","v":""},{"$f":"IFERROR(INDEX(Tableau_de_suivi[[N°]:[Clôturé]],SMALL(IF(Tableau_de_suivi[Clôturé]=\"OUI\",ROW(Tableau_de_suivi[Clôturé])-2),ROWS($1:22)),COLUMN()),\"\")","v":""},{"$f":"IFERROR(INDEX(Tableau_de_suivi[[N°]:[Clôturé]],SMALL(IF(Tableau_de_suivi[Clôturé]=\"OUI\",ROW(Tableau_de_suivi[Clôturé])-2),ROWS($1:22)),COLUMN()),\"\")","v":""},{"$f":"IFERROR(INDEX(Tableau_de_suivi[[N°]:[Clôturé]],SMALL(IF(Tableau_de_suivi[Clôturé]=\"OUI\",ROW(Tableau_de_suivi[Clôturé])-2),ROWS($1:22)),COLUMN()),\"\")","v":""},{"$f":"IFERROR(INDEX(Tableau_de_suivi[[N°]:[Clôturé]],SMALL(IF(Tableau_de_suivi[Clôturé]=\"OUI\",ROW(Tableau_de_suivi[Clôturé])-2),ROWS($1:22)),COLUMN()),\"\")","v":""},{"$f":"IFERROR(INDEX(Tableau_de_suivi[[N°]:[Clôturé]],SMALL(IF(Tableau_de_suivi[Clôturé]=\"OUI\",ROW(Tableau_de_suivi[Clôturé])-2),ROWS($1:22)),COLUMN()),\"\")","v":""},{"$f":"IFERROR(INDEX(Tableau_de_suivi[[N°]:[Clôturé]],SMALL(IF(Tableau_de_suivi[Clôturé]=\"OUI\",ROW(Tableau_de_suivi[Clôturé])-2),ROWS($1:22)),COLUMN()),\"\")","v":""},{"$f":"IFERROR(INDEX(Tableau_de_suivi[[N°]:[Clôturé]],SMALL(IF(Tableau_de_suivi[Clôturé]=\"OUI\",ROW(Tableau_de_suivi[Clôturé])-2),ROWS($1:22)),COLUMN()),\"\")","v":""},{"$f":"IFERROR(INDEX(Tableau_de_suivi[[N°]:[Clôturé]],SMALL(IF(Tableau_de_suivi[Clôturé]=\"OUI\",ROW(Tableau_de_suivi[Clôturé])-2),ROWS($1:22)),COLUMN()),\"\")","v":""},{"$f":"IFERROR(INDEX(Tableau_de_suivi[[N°]:[Clôturé]],SMALL(IF(Tableau_de_suivi[Clôturé]=\"OUI\",ROW(Tableau_de_suivi[Clôturé])-2),ROWS($1:22)),COLUMN()),\"\")","v":""},{"$f":"IFERROR(INDEX(Tableau_de_suivi[[N°]:[Clôturé]],SMALL(IF(Tableau_de_suivi[Clôturé]=\"OUI\",ROW(Tableau_de_suivi[Clôturé])-2),ROWS($1:22)),COLUMN()),\"\")","v":""},{"$f":"IFERROR(INDEX(Tableau_de_suivi[[N°]:[Clôturé]],SMALL(IF(Tableau_de_suivi[Clôturé]=\"OUI\",ROW(Tableau_de_suivi[Clôturé])-2),ROWS($1:22)),COLUMN()),\"\")","v":""},{"$f":"IFERROR(INDEX(Tableau_de_suivi[[N°]:[Clôturé]],SMALL(IF(Tableau_de_suivi[Clôturé]=\"OUI\",ROW(Tableau_de_suivi[Clôturé])-2),ROWS($1:22)),COLUMN()),\"\")","v":""}]
[{"$f":"IFERROR(INDEX(Tableau_de_suivi[[N°]:[Clôturé]],SMALL(IF(Tableau_de_suivi[Clôturé]=\"OUI\",ROW(Tableau_de_suivi[Clôturé])-2),ROWS($1:23)),COLUMN()),\"\")","v":""},{"$f":"IFERROR(INDEX(Tableau_de_suivi[[N°]:[Clôturé]],SMALL(IF(Tableau_de_suivi[Clôturé]=\"OUI\",ROW(Tableau_de_suivi[Clôturé])-2),ROWS($1:23)),COLUMN()),\"\")","v":""},{"$f":"IFERROR(INDEX(Tableau_de_suivi[[N°]:[Clôturé]],SMALL(IF(Tableau_de_suivi[Clôturé]=\"OUI\",ROW(Tableau_de_suivi[Clôturé])-2),ROWS($1:23)),COLUMN()),\"\")","v":""},{"$f":"IFERROR(INDEX(Tableau_de_suivi[[N°]:[Clôturé]],SMALL(IF(Tableau_de_suivi[Clôturé]=\"OUI\",ROW(Tableau_de_suivi[Clôturé])-2),ROWS($1:23)),COLUMN()),\"\")","v":""},{"$f":"IFERROR(INDEX(Tableau_de_suivi[[N°]:[Clôturé]],SMALL(IF(Tableau_de_suivi[Clôturé]=\"OUI\",ROW(Tableau_de_suivi[Clôturé])-2),ROWS($1:23)),COLUMN()),\"\")","v":""},{"$f":"IFERROR(INDEX(Tableau_de_suivi[[N°]:[Clôturé]],SMALL(IF(Tableau_de_suivi[Clôturé]=\"OUI\",ROW(Tableau_de_suivi[Clôturé])-2),ROWS($1:23)),COLUMN()),\"\")","v":""},{"$f":"IFERROR(INDEX(Tableau_de_suivi[[N°]:[Clôturé]],SMALL(IF(Tableau_de_suivi[Clôturé]=\"OUI\",ROW(Tableau_de_suivi[Clôturé])-2),ROWS($1:23)),COLUMN()),\"\")","v":""},{"$f":"IFERROR(INDEX(Tableau_de_suivi[[N°]:[Clôturé]],SMALL(IF(Tableau_de_suivi[Clôturé]=\"OUI\",ROW(Tableau_de_suivi[Clôturé])-2),ROWS($1:23)),COLUMN()),\"\")","v":""},{"$f":"IFERROR(INDEX(Tableau_de_suivi[[N°]:[Clôturé]],SMALL(IF(Tableau_de_suivi[Clôturé]=\"OUI\",ROW(Tableau_de_suivi[Clôturé])-2),ROWS($1:23)),COLUMN()),\"\")","v":""},{"$f":"IFERROR(INDEX(Tableau_de_suivi[[N°]:[Clôturé]],SMALL(IF(Tableau_de_suivi[Clôturé]=\"OUI\",ROW(Tableau_de_suivi[Clôturé])-2),ROWS($1:23)),COLUMN()),\"\")","v":""},{"$f":"IFERROR(INDEX(Tableau_de_suivi[[N°]:[Clôturé]],SMALL(IF(Tableau_de_suivi[Clôturé]=\"OUI\",ROW(Tableau_de_suivi[Clôturé])-2),ROWS($1:23)),COLUMN()),\"\")","v":""},{"$f":"IFERROR(INDEX(Tableau_de_suivi[[N°]:[Clôturé]],SMALL(IF(Tableau_de_suivi[Clôturé]=\"OUI\",ROW(Tableau_de_suivi[Clôturé])-2),ROWS($1:23)),COLUMN()),\"\")","v":""},{"$f":"IFERROR(INDEX(Tableau_de_suivi[[N°]:[Clôturé]],SMALL(IF(Tableau_de_suivi[Clôturé]=\"OUI\",ROW(Tableau_de_suivi[Clôturé])-2),ROWS($1:23)),COLUMN()),\"\")","v":""},{"$f":"IFERROR(INDEX(Tableau_de_suivi[[N°]:[Clôturé]],SMALL(IF(Tableau_de_suivi[Clôturé]=\"OUI\",ROW(Tableau_de_suivi[Clôturé])-2),ROWS($1:23)),COLUMN()),\"\")","v":""},{"$f":"IFERROR(INDEX(Tableau_de_suivi[[N°]:[Clôturé]],SMALL(IF(Tableau_de_suivi[Clôturé]=\"OUI\",ROW(Tableau_de_suivi[Clôturé])-2),ROWS($1:23)),COLUMN()),\"\")","v":""},{"$f":"IFERROR(INDEX(Tableau_de_suivi[[N°]:[Clôturé]],SMALL(IF(Tableau_de_suivi[Clôturé]=\"OUI\",ROW(Tableau_de_suivi[Clôturé])-2),ROWS($1:23)),COLUMN()),\"\")","v":""},{"$f":"IFERROR(INDEX(Tableau_de_suivi[[N°]:[Clôturé]],SMALL(IF(Tableau_de_suivi[Clôturé]=\"OUI\",ROW(Tableau_de_suivi[Clôturé])-2),ROWS($1:23)),COLUMN()),\"\")","v":""},{"$f":"IFERROR(INDEX(Tableau_de_suivi[[N°]:[Clôturé]],SMALL(IF(Tableau_de_suivi[Clôturé]=\"OUI\",ROW(Tableau_de_suivi[Clôturé])-2),ROWS($1:23)),COLUMN()),\"\")","v":""},{"$f":"IFERROR(INDEX(Tableau_de_suivi[[N°]:[Clôturé]],SMALL(IF(Tableau_de_suivi[Clôturé]=\"OUI\",ROW(Tableau_de_suivi[Clôturé])-2),ROWS($1:23)),COLUMN()),\"\")","v":""},{"$f":"IFERROR(INDEX(Tableau_de_suivi[[N°]:[Clôturé]],SMALL(IF(Tableau_de_suivi[Clôturé]=\"OUI\",ROW(Tableau_de_suivi[Clôturé])-2),ROWS($1:23)),COLUMN()),\"\")","v":""},{"$f":"IFERROR(INDEX(Tableau_de_suivi[[N°]:[Clôturé]],SMALL(IF(Tableau_de_suivi[Clôturé]=\"OUI\",ROW(Tableau_de_suivi[Clôturé])-2),ROWS($1:23)),COLUMN()),\"\")","v":""},{"$f":"IFERROR(INDEX(Tableau_de_suivi[[N°]:[Clôturé]],SMALL(IF(Tableau_de_suivi[Clôturé]=\"OUI\",ROW(Tableau_de_suivi[Clôturé])-2),ROWS($1:23)),COLUMN()),\"\")","v":""}]
[{"$f":"IFERROR(INDEX(Tableau_de_suivi[[N°]:[Clôturé]],SMALL(IF(Tableau_de_suivi[Clôturé]=\"OUI\",ROW(Tableau_de_suivi[Clôturé])-2),ROWS($1:24)),COLUMN()),\"\")","v":""},{"$f":"IFERROR(INDEX(Tableau_de_suivi[[N°]:[Clôturé]],SMALL(IF(Tableau_de_suivi[Clôturé]=\"OUI\",ROW(Tableau_de_suivi[Clôturé])-2),ROWS($1:24)),COLUMN()),\"\")","v":""},{"$f":"IFERROR(INDEX(Tableau_de_suivi[[N°]:[Clôturé]],SMALL(IF(Tableau_de_suivi[Clôturé]=\"OUI\",ROW(Tableau_de_suivi[Clôturé])-2),ROWS($1:24)),COLUMN()),\"\")","v":""},{"$f":"IFERROR(INDEX(Tableau_de_suivi[[N°]:[Clôturé]],SMALL(IF(Tableau_de_suivi[Clôturé]=\"OUI\",ROW(Tableau_de_suivi[Clôturé])-2),ROWS($1:24)),COLUMN()),\"\")","v":""},{"$f":"IFERROR(INDEX(Tableau_de_suivi[[N°]:[Clôturé]],SMALL(IF(Tableau_de_suivi[Clôturé]=\"OUI\",ROW(Tableau_de_suivi[Clôturé])-2),ROWS($1:24)),COLUMN()),\"\")","v":""},{"$f":"IFERROR(INDEX(Tableau_de_suivi[[N°]:[Clôturé]],SMALL(IF(Tableau_de_suivi[Clôturé]=\"OUI\",ROW(Tableau_de_suivi[Clôturé])-2),ROWS($1:24)),COLUMN()),\"\")","v":""},{"$f":"IFERROR(INDEX(Tableau_de_suivi[[N°]:[Clôturé]],SMALL(IF(Tableau_de_suivi[Clôturé]=\"OUI\",ROW(Tableau_de_suivi[Clôturé])-2),ROWS($1:24)),COLUMN()),\"\")","v":""},{"$f":"IFERROR(INDEX(Tableau_de_suivi[[N°]:[Clôturé]],SMALL(IF(Tableau_de_suivi[Clôturé]=\"OUI\",ROW(Tableau_de_suivi[Clôturé])-2),ROWS($1:24)),COLUMN()),\"\")","v":""},{"$f":"IFERROR(INDEX(Tableau_de_suivi[[N°]:[Clôturé]],SMALL(IF(Tableau_de_suivi[Clôturé]=\"OUI\",ROW(Tableau_de_suivi[Clôturé])-2),ROWS($1:24)),COLUMN()),\"\")","v":""},{"$f":"IFERROR(INDEX(Tableau_de_suivi[[N°]:[Clôturé]],SMALL(IF(Tableau_de_suivi[Clôturé]=\"OUI\",ROW(Tableau_de_suivi[Clôturé])-2),ROWS($1:24)),COLUMN()),\"\")","v":""},{"$f":"IFERROR(INDEX(Tableau_de_suivi[[N°]:[Clôturé]],SMALL(IF(Tableau_de_suivi[Clôturé]=\"OUI\",ROW(Tableau_de_suivi[Clôturé])-2),ROWS($1:24)),COLUMN()),\"\")","v":""},{"$f":"IFERROR(INDEX(Tableau_de_suivi[[N°]:[Clôturé]],SMALL(IF(Tableau_de_suivi[Clôturé]=\"OUI\",ROW(Tableau_de_suivi[Clôturé])-2),ROWS($1:24)),COLUMN()),\"\")","v":""},{"$f":"IFERROR(INDEX(Tableau_de_suivi[[N°]:[Clôturé]],SMALL(IF(Tableau_de_suivi[Clôturé]=\"OUI\",ROW(Tableau_de_suivi[Clôturé])-2),ROWS($1:24)),COLUMN()),\"\")","v":""},{"$f":"IFERROR(INDEX(Tableau_de_suivi[[N°]:[Clôturé]],SMALL(IF(Tableau_de_suivi[Clôturé]=\"OUI\",ROW(Tableau_de_suivi[Clôturé])-2),ROWS($1:24)),COLUMN()),\"\")","v":""},{"$f":"IFERROR(INDEX(Tableau_de_suivi[[N°]:[Clôturé]],SMALL(IF(Tableau_de_suivi[Clôturé]=\"OUI\",ROW(Tableau_de_suivi[Clôturé])-2),ROWS($1:24)),COLUMN()),\"\")","v":""},{"$f":"IFERROR(INDEX(Tableau_de_suivi[[N°]:[Clôturé]],SMALL(IF(Tableau_de_suivi[Clôturé]=\"OUI\",ROW(Tableau_de_suivi[Clôturé])-2),ROWS($1:24)),COLUMN()),\"\")","v":""},{"$f":"IFERROR(INDEX(Tableau_de_suivi[[N°]:[Clôturé]],SMALL(IF(Tableau_de_suivi[Clôturé]=\"OUI\",ROW(Tableau_de_suivi[Clôturé])-2),ROWS($1:24)),COLUMN()),\"\")","v":""},{"$f":"IFERROR(INDEX(Tableau_de_suivi[[N°]:[Clôturé]],SMALL(IF(Tableau_de_suivi[Clôturé]=\"OUI\",ROW(Tableau_de_suivi[Clôturé])-2),ROWS($1:24)),COLUMN()),\"\")","v":""},{"$f":"IFERROR(INDEX(Tableau_de_suivi[[N°]:[Clôturé]],SMALL(IF(Tableau_de_suivi[Clôturé]=\"OUI\",ROW(Tableau_de_suivi[Clôturé])-2),ROWS($1:24)),COLUMN()),\"\")","v":""},{"$f":"IFERROR(INDEX(Tableau_de_suivi[[N°]:[Clôturé]],SMALL(IF(Tableau_de_suivi[Clôturé]=\"OUI\",ROW(Tableau_de_suivi[Clôturé])-2),ROWS($1:24)),COLUMN()),\"\")","v":""},{"$f":"IFERROR(INDEX(Tableau_de_suivi[[N°]:[Clôturé]],SMALL(IF(Tableau_de_suivi[Clôturé]=\"OUI\",ROW(Tableau_de_suivi[Clôturé])-2),ROWS($1:24)),COLUMN()),\"\")","v":""},{"$f":"IFERROR(INDEX(Tableau_de_suivi[[N°]:[Clôturé]],SMALL(IF(Tableau_de_suivi[Clôturé]=\"OUI\",ROW(Tableau_de_suivi[Clôturé])-2),ROWS($1:24)),COLUMN()),\"\")","v":""}]
[{"$f":"IFERROR(INDEX(Tableau_de_suivi[[N°]:[Clôturé]],SMALL(IF(Tableau_de_suivi[Clôturé]=\"OUI\",ROW(Tableau_de_suivi[Clôturé])-2),ROWS($1:25)),COLUMN()),\"\")","v":""},{"$f":"IFERROR(INDEX(Tableau_de_suivi[[N°]:[Clôturé]],SMALL(IF(Tableau_de_suivi[Clôturé]=\"OUI\",ROW(Tableau_de_suivi[Clôturé])-2),ROWS($1:25)),COLUMN()),\"\")","v":""},{"$f":"IFERROR(INDEX(Tableau_de_suivi[[N°]:[Clôturé]],SMALL(IF(Tableau_de_suivi[Clôturé]=\"OUI\",ROW(Tableau_de_suivi[Clôturé])-2),ROWS($1:25)),COLUMN()),\"\")","v":""},{"$f":"IFERROR(INDEX(Tableau_de_suivi[[N°]:[Clôturé]],SMALL(IF(Tableau_de_suivi[Clôturé]=\"OUI\",ROW(Tableau_de_suivi[Clôturé])-2),ROWS($1:25)),COLUMN()),\"\")","v":""},{"$f":"IFERROR(INDEX(Tableau_de_suivi[[N°]:[Clôturé]],SMALL(IF(Tableau_de_suivi[Clôturé]=\"OUI\",ROW(Tableau_de_suivi[Clôturé])-2),ROWS($1:25)),COLUMN()),\"\")","v":""},{"$f":"IFERROR(INDEX(Tableau_de_suivi[[N°]:[Clôturé]],SMALL(IF(Tableau_de_suivi[Clôturé]=\"OUI\",ROW(Tableau_de_suivi[Clôturé])-2),ROWS($1:25)),COLUMN()),\"\")","v":""},{"$f":"IFERROR(INDEX(Tableau_de_suivi[[N°]:[Clôturé]],SMALL(IF(Tableau_de_suivi[Clôturé]=\"OUI\",ROW(Tableau_de_suivi[Clôturé])-2),ROWS($1:25)),COLUMN()),\"\")","v":""},{"$f":"IFERROR(INDEX(Tableau_de_suivi[[N°]:[Clôturé]],SMALL(IF(Tableau_de_suivi[Clôturé]=\"OUI\",ROW(Tableau_de_suivi[Clôturé])-2),ROWS($1:25)),COLUMN()),\"\")","v":""},{"$f":"IFERROR(INDEX(Tableau_de_suivi[[N°]:[Clôturé]],SMALL(IF(Tableau_de_suivi[Clôturé]=\"OUI\",ROW(Tableau_de_suivi[Clôturé])-2),ROWS($1:25)),COLUMN()),\"\")","v":""},{"$f":"IFERROR(INDEX(Tableau_de_suivi[[N°]:[Clôturé]],SMALL(IF(Tableau_de_suivi[Clôturé]=\"OUI\",ROW(Tableau_de_suivi[Clôturé])-2),ROWS($1:25)),COLUMN()),\"\")","v":""},{"$f":"IFERROR(INDEX(Tableau_de_suivi[[N°]:[Clôturé]],SMALL(IF(Tableau_de_suivi[Clôturé]=\"OUI\",ROW(Tableau_de_suivi[Clôturé])-2),ROWS($1:25)),COLUMN()),\"\")","v":""},{"$f":"IFERROR(INDEX(Tableau_de_suivi[[N°]:[Clôturé]],SMALL(IF(Tableau_de_suivi[Clôturé]=\"OUI\",ROW(Tableau_de_suivi[Clôturé])-2),ROWS($1:25)),COLUMN()),\"\")","v":""},{"$f":"IFERROR(INDEX(Tableau_de_suivi[[N°]:[Clôturé]],SMALL(IF(Tableau_de_suivi[Clôturé]=\"OUI\",ROW(Tableau_de_suivi[Clôturé])-2),ROWS($1:25)),COLUMN()),\"\")","v":""},{"$f":"IFERROR(INDEX(Tableau_de_suivi[[N°]:[Clôturé]],SMALL(IF(Tableau_de_suivi[Clôturé]=\"OUI\",ROW(Tableau_de_suivi[Clôturé])-2),ROWS($1:25)),COLUMN()),\"\")","v":""},{"$f":"IFERROR(INDEX(Tableau_de_suivi[[N°]:[Clôturé]],SMALL(IF(Tableau_de_suivi[Clôturé]=\"OUI\",ROW(Tableau_de_suivi[Clôturé])-2),ROWS($1:25)),COLUMN()),\"\")","v":""},{"$f":"IFERROR(INDEX(Tableau_de_suivi[[N°]:[Clôturé]],SMALL(IF(Tableau_de_suivi[Clôturé]=\"OUI\",ROW(Tableau_de_suivi[Clôturé])-2),ROWS($1:25)),COLUMN()),\"\")","v":""},{"$f":"IFERROR(INDEX(Tableau_de_suivi[[N°]:[Clôturé]],SMALL(IF(Tableau_de_suivi[Clôturé]=\"OUI\",ROW(Tableau_de_suivi[Clôturé])-2),ROWS($1:25)),COLUMN()),\"\")","v":""},{"$f":"IFERROR(INDEX(Tableau_de_suivi[[N°]:[Clôturé]],SMALL(IF(Tableau_de_suivi[Clôturé]=\"OUI\",ROW(Tableau_de_suivi[Clôturé])-2),ROWS($1:25)),COLUMN()),\"\")","v":""},{"$f":"IFERROR(INDEX(Tableau_de_suivi[[N°]:[Clôturé]],SMALL(IF(Tableau_de_suivi[Clôturé]=\"OUI\",ROW(Tableau_de_suivi[Clôturé])-2),ROWS($1:25)),COLUMN()),\"\")","v":""},{"$f":"IFERROR(INDEX(Tableau_de_suivi[[N°]:[Clôturé]],SMALL(IF(Tableau_de_suivi[Clôturé]=\"OUI\",ROW(Tableau_de_suivi[Clôturé])-2),ROWS($1:25)),COLUMN()),\"\")","v":""},{"$f":"IFERROR(INDEX(Tableau_de_suivi[[N°]:[Clôturé]],SMALL(IF(Tableau_de_suivi[Clôturé]=\"OUI\",ROW(Tableau_de_suivi[Clôturé])-2),ROWS($1:25)),COLUMN()),\"\")","v":""},{"$f":"IFERROR(INDEX(Tableau_de_suivi[[N°]:[Clôturé]],SMALL(IF(Tableau_de_suivi[Clôturé]=\"OUI\",ROW(Tableau_de_suivi[Clôturé])-2),ROWS($1:25)),COLUMN()),\"\")","v":""}]
[{"$f":"IFERROR(INDEX(Tableau_de_suivi[[N°]:[Clôturé]],SMALL(IF(Tableau_de_suivi[Clôturé]=\"OUI\",ROW(Tableau_de_suivi[Clôturé])-2),ROWS($1:26)),COLUMN()),\"\")","v":""},{"$f":"IFERROR(INDEX(Tableau_de_suivi[[N°]:[Clôturé]],SMALL(IF(Tableau_de_suivi[Clôturé]=\"OUI\",ROW(Tableau_de_suivi[Clôturé])-2),ROWS($1:26)),COLUMN()),\"\")","v":""},{"$f":"IFERROR(INDEX(Tableau_de_suivi[[N°]:[Clôturé]],SMALL(IF(Tableau_de_suivi[Clôturé]=\"OUI\",ROW(Tableau_de_suivi[Clôturé])-2),ROWS($1:26)),COLUMN()),\"\")","v":""},{"$f":"IFERROR(INDEX(Tableau_de_suivi[[N°]:[Clôturé]],SMALL(IF(Tableau_de_suivi[Clôturé]=\"OUI\",ROW(Tableau_de_suivi[Clôturé])-2),ROWS($1:26)),COLUMN()),\"\")","v":""},{"$f":"IFERROR(INDEX(Tableau_de_suivi[[N°]:[Clôturé]],SMALL(IF(Tableau_de_suivi[Clôturé]=\"OUI\",ROW(Tableau_de_suivi[Clôturé])-2),ROWS($1:26)),COLUMN()),\"\")","v":""},{"$f":"IFERROR(INDEX(Tableau_de_suivi[[N°]:[Clôturé]],SMALL(IF(Tableau_de_suivi[Clôturé]=\"OUI\",ROW(Tableau_de_suivi[Clôturé])-2),ROWS($1:26)),COLUMN()),\"\")","v":""},{"$f":"IFERROR(INDEX(Tableau_de_suivi[[N°]:[Clôturé]],SMALL(IF(Tableau_de_suivi[Clôturé]=\"OUI\",ROW(Tableau_de_suivi[Clôturé])-2),ROWS($1:26)),COLUMN()),\"\")","v":""},{"$f":"IFERROR(INDEX(Tableau_de_suivi[[N°]:[Clôturé]],SMALL(IF(Tableau_de_suivi[Clôturé]=\"OUI\",ROW(Tableau_de_suivi[Clôturé])-2),ROWS($1:26)),COLUMN()),\"\")","v":""},{"$f":"IFERROR(INDEX(Tableau_de_suivi[[N°]:[Clôturé]],SMALL(IF(Tableau_de_suivi[Clôturé]=\"OUI\",ROW(Tableau_de_suivi[Clôturé])-2),ROWS($1:26)),COLUMN()),\"\")","v":""},{"$f":"IFERROR(INDEX(Tableau_de_suivi[[N°]:[Clôturé]],SMALL(IF(Tableau_de_suivi[Clôturé]=\"OUI\",ROW(Tableau_de_suivi[Clôturé])-2),ROWS($1:26)),COLUMN()),\"\")","v":""},{"$f":"IFERROR(INDEX(Tableau_de_suivi[[N°]:[Clôturé]],SMALL(IF(Tableau_de_suivi[Clôturé]=\"OUI\",ROW(Tableau_de_suivi[Clôturé])-2),ROWS($1:26)),COLUMN()),\"\")","v":""},{"$f":"IFERROR(INDEX(Tableau_de_suivi[[N°]:[Clôturé]],SMALL(IF(Tableau_de_suivi[Clôturé]=\"OUI\",ROW(Tableau_de_suivi[Clôturé])-2),ROWS($1:26)),COLUMN()),\"\")","v":""},{"$f":"IFERROR(INDEX(Tableau_de_suivi[[N°]:[Clôturé]],SMALL(IF(Tableau_de_suivi[Clôturé]=\"OUI\",ROW(Tableau_de_suivi[Clôturé])-2),ROWS($1:26)),COLUMN()),\"\")","v":""},{"$f":"IFERROR(INDEX(Tableau_de_suivi[[N°]:[Clôturé]],SMALL(IF(Tableau_de_suivi[Clôturé]=\"OUI\",ROW(Tableau_de_suivi[Clôturé])-2),ROWS($1:26)),COLUMN()),\"\")","v":""},{"$f":"IFERROR(INDEX(Tableau_de_suivi[[N°]:[Clôturé]],SMALL(IF(Tableau_de_suivi[Clôturé]=\"OUI\",ROW(Tableau_de_suivi[Clôturé])-2),ROWS($1:26)),COLUMN()),\"\")","v":""},{"$f":"IFERROR(INDEX(Tableau_de_suivi[[N°]:[Clôturé]],SMALL(IF(Tableau_de_suivi[Clôturé]=\"OUI\",ROW(Tableau_de_suivi[Clôturé])-2),ROWS($1:26)),COLUMN()),\"\")","v":""},{"$f":"IFERROR(INDEX(Tableau_de_suivi[[N°]:[Clôturé]],SMALL(IF(Tableau_de_suivi[Clôturé]=\"OUI\",ROW(Tableau_de_suivi[Clôturé])-2),ROWS($1:26)),COLUMN()),\"\")","v":""},{"$f":"IFERROR(INDEX(Tableau_de_suivi[[N°]:[Clôturé]],SMALL(IF(Tableau_de_suivi[Clôturé]=\"OUI\",ROW(Tableau_de_suivi[Clôturé])-2),ROWS($1:26)),COLUMN()),\"\")","v":""},{"$f":"IFERROR(INDEX(Tableau_de_suivi[[N°]:[Clôturé]],SMALL(IF(Tableau_de_suivi[Clôturé]=\"OUI\",ROW(Tableau_de_suivi[Clôturé])-2),ROWS($1:26)),COLUMN()),\"\")","v":""},{"$f":"IFERROR(INDEX(Tableau_de_suivi[[N°]:[Clôturé]],SMALL(IF(Tableau_de_suivi[Clôturé]=\"OUI\",ROW(Tableau_de_suivi[Clôturé])-2),ROWS($1:26)),COLUMN()),\"\")","v":""},{"$f":"IFERROR(INDEX(Tableau_de_suivi[[N°]:[Clôturé]],SMALL(IF(Tableau_de_suivi[Clôturé]=\"OUI\",ROW(Tableau_de_suivi[Clôturé])-2),ROWS($1:26)),COLUMN()),\"\")","v":""},{"$f":"IFERROR(INDEX(Tableau_de_suivi[[N°]:[Clôturé]],SMALL(IF(Tableau_de_suivi[Clôturé]=\"OUI\",ROW(Tableau_de_suivi[Clôturé])-2),ROWS($1:26)),COLUMN()),\"\")","v":""}]
[{"$f":"IFERROR(INDEX(Tableau_de_suivi[[N°]:[Clôturé]],SMALL(IF(Tableau_de_suivi[Clôturé]=\"OUI\",ROW(Tableau_de_suivi[Clôturé])-2),ROWS($1:27)),COLUMN()),\"\")","v":""},{"$f":"IFERROR(INDEX(Tableau_de_suivi[[N°]:[Clôturé]],SMALL(IF(Tableau_de_suivi[Clôturé]=\"OUI\",ROW(Tableau_de_suivi[Clôturé])-2),ROWS($1:27)),COLUMN()),\"\")","v":""},{"$f":"IFERROR(INDEX(Tableau_de_suivi[[N°]:[Clôturé]],SMALL(IF(Tableau_de_suivi[Clôturé]=\"OUI\",ROW(Tableau_de_suivi[Clôturé])-2),ROWS($1:27)),COLUMN()),\"\")","v":""},{"$f":"IFERROR(INDEX(Tableau_de_suivi[[N°]:[Clôturé]],SMALL(IF(Tableau_de_suivi[Clôturé]=\"OUI\",ROW(Tableau_de_suivi[Clôturé])-2),ROWS($1:27)),COLUMN()),\"\")","v":""},{"$f":"IFERROR(INDEX(Tableau_de_suivi[[N°]:[Clôturé]],SMALL(IF(Tableau_de_suivi[Clôturé]=\"OUI\",ROW(Tableau_de_suivi[Clôturé])-2),ROWS($1:27)),COLUMN()),\"\")","v":""},{"$f":"IFERROR(INDEX(Tableau_de_suivi[[N°]:[Clôturé]],SMALL(IF(Tableau_de_suivi[Clôturé]=\"OUI\",ROW(Tableau_de_suivi[Clôturé])-2),ROWS($1:27)),COLUMN()),\"\")","v":""},{"$f":"IFERROR(INDEX(Tableau_de_suivi[[N°]:[Clôturé]],SMALL(IF(Tableau_de_suivi[Clôturé]=\"OUI\",ROW(Tableau_de_suivi[Clôturé])-2),ROWS($1:27)),COLUMN()),\"\")","v":""},{"$f":"IFERROR(INDEX(Tableau_de_suivi[[N°]:[Clôturé]],SMALL(IF(Tableau_de_suivi[Clôturé]=\"OUI\",ROW(Tableau_de_suivi[Clôturé])-2),ROWS($1:27)),COLUMN()),\"\")","v":""},{"$f":"IFERROR(INDEX(Tableau_de_suivi[[N°]:[Clôturé]],SMALL(IF(Tableau_de_suivi[Clôturé]=\"OUI\",ROW(Tableau_de_suivi[Clôturé])-2),ROWS($1:27)),COLUMN()),\"\")","v":""},{"$f":"IFERROR(INDEX(Tableau_de_suivi[[N°]:[Clôturé]],SMALL(IF(Tableau_de_suivi[Clôturé]=\"OUI\",ROW(Tableau_de_suivi[Clôturé])-2),ROWS($1:27)),COLUMN()),\"\")","v":""},{"$f":"IFERROR(INDEX(Tableau_de_suivi[[N°]:[Clôturé]],SMALL(IF(Tableau_de_suivi[Clôturé]=\"OUI\",ROW(Tableau_de_suivi[Clôturé])-2),ROWS($1:27)),COLUMN()),\"\")","v":""},{"$f":"IFERROR(INDEX(Tableau_de_suivi[[N°]:[Clôturé]],SMALL(IF(Tableau_de_suivi[Clôturé]=\"OUI\",ROW(Tableau_de_suivi[Clôturé])-2),ROWS($1:27)),COLUMN()),\"\")","v":""},{"$f":"IFERROR(INDEX(Tableau_de_suivi[[N°]:[Clôturé]],SMALL(IF(Tableau_de_suivi[Clôturé]=\"OUI\",ROW(Tableau_de_suivi[Clôturé])-2),ROWS($1:27)),COLUMN()),\"\")","v":""},{"$f":"IFERROR(INDEX(Tableau_de_suivi[[N°]:[Clôturé]],SMALL(IF(Tableau_de_suivi[Clôturé]=\"OUI\",ROW(Tableau_de_suivi[Clôturé])-2),ROWS($1:27)),COLUMN()),\"\")","v":""},{"$f":"IFERROR(INDEX(Tableau_de_suivi[[N°]:[Clôturé]],SMALL(IF(Tableau_de_suivi[Clôturé]=\"OUI\",ROW(Tableau_de_suivi[Clôturé])-2),ROWS($1:27)),COLUMN()),\"\")","v":""},{"$f":"IFERROR(INDEX(Tableau_de_suivi[[N°]:[Clôturé]],SMALL(IF(Tableau_de_suivi[Clôturé]=\"OUI\",ROW(Tableau_de_suivi[Clôturé])-2),ROWS($1:27)),COLUMN()),\"\")","v":""},{"$f":"IFERROR(INDEX(Tableau_de_suivi[[N°]:[Clôturé]],SMALL(IF(Tableau_de_suivi[Clôturé]=\"OUI\",ROW(Tableau_de_suivi[Clôturé])-2),ROWS($1:27)),COLUMN()),\"\")","v":""},{"$f":"IFERROR(INDEX(Tableau_de_suivi[[N°]:[Clôturé]],SMALL(IF(Tableau_de_suivi[Clôturé]=\"OUI\",ROW(Tableau_de_suivi[Clôturé])-2),ROWS($1:27)),COLUMN()),\"\")","v":""},{"$f":"IFERROR(INDEX(Tableau_de_suivi[[N°]:[Clôturé]],SMALL(IF(Tableau_de_suivi[Clôturé]=\"OUI\",ROW(Tableau_de_suivi[Clôturé])-2),ROWS($1:27)),COLUMN()),\"\")","v":""},{"$f":"IFERROR(INDEX(Tableau_de_suivi[[N°]:[Clôturé]],SMALL(IF(Tableau_de_suivi[Clôturé]=\"OUI\",ROW(Tableau_de_suivi[Clôturé])-2),ROWS($1:27)),COLUMN()),\"\")","v":""},{"$f":"IFERROR(INDEX(Tableau_de_suivi[[N°]:[Clôturé]],SMALL(IF(Tableau_de_suivi[Clôturé]=\"OUI\",ROW(Tableau_de_suivi[Clôturé])-2),ROWS($1:27)),COLUMN()),\"\")","v":""},{"$f":"IFERROR(INDEX(Tableau_de_suivi[[N°]:[Clôturé]],SMALL(IF(Tableau_de_suivi[Clôturé]=\"OUI\",ROW(Tableau_de_suivi[Clôturé])-2),ROWS($1:27)),COLUMN()),\"\")","v":""}]
[{"$f":"IFERROR(INDEX(Tableau_de_suivi[[N°]:[Clôturé]],SMALL(IF(Tableau_de_suivi[Clôturé]=\"OUI\",ROW(Tableau_de_suivi[Clôturé])-2),ROWS($1:28)),COLUMN()),\"\")","v":""},{"$f":"IFERROR(INDEX(Tableau_de_suivi[[N°]:[Clôturé]],SMALL(IF(Tableau_de_suivi[Clôturé]=\"OUI\",ROW(Tableau_de_suivi[Clôturé])-2),ROWS($1:28)),COLUMN()),\"\")","v":""},{"$f":"IFERROR(INDEX(Tableau_de_suivi[[N°]:[Clôturé]],SMALL(IF(Tableau_de_suivi[Clôturé]=\"OUI\",ROW(Tableau_de_suivi[Clôturé])-2),ROWS($1:28)),COLUMN()),\"\")","v":""},{"$f":"IFERROR(INDEX(Tableau_de_suivi[[N°]:[Clôturé]],SMALL(IF(Tableau_de_suivi[Clôturé]=\"OUI\",ROW(Tableau_de_suivi[Clôturé])-2),ROWS($1:28)),COLUMN()),\"\")","v":""},{"$f":"IFERROR(INDEX(Tableau_de_suivi[[N°]:[Clôturé]],SMALL(IF(Tableau_de_suivi[Clôturé]=\"OUI\",ROW(Tableau_de_suivi[Clôturé])-2),ROWS($1:28)),COLUMN()),\"\")","v":""},{"$f":"IFERROR(INDEX(Tableau_de_suivi[[N°]:[Clôturé]],SMALL(IF(Tableau_de_suivi[Clôturé]=\"OUI\",ROW(Tableau_de_suivi[Clôturé])-2),ROWS($1:28)),COLUMN()),\"\")","v":""},{"$f":"IFERROR(INDEX(Tableau_de_suivi[[N°]:[Clôturé]],SMALL(IF(Tableau_de_suivi[Clôturé]=\"OUI\",ROW(Tableau_de_suivi[Clôturé])-2),ROWS($1:28)),COLUMN()),\"\")","v":""},{"$f":"IFERROR(INDEX(Tableau_de_suivi[[N°]:[Clôturé]],SMALL(IF(Tableau_de_suivi[Clôturé]=\"OUI\",ROW(Tableau_de_suivi[Clôturé])-2),ROWS($1:28)),COLUMN()),\"\")","v":""},{"$f":"IFERROR(INDEX(Tableau_de_suivi[[N°]:[Clôturé]],SMALL(IF(Tableau_de_suivi[Clôturé]=\"OUI\",ROW(Tableau_de_suivi[Clôturé])-2),ROWS($1:28)),COLUMN()),\"\")","v":""},{"$f":"IFERROR(INDEX(Tableau_de_suivi[[N°]:[Clôturé]],SMALL(IF(Tableau_de_suivi[Clôturé]=\"OUI\",ROW(Tableau_de_suivi[Clôturé])-2),ROWS($1:28)),COLUMN()),\"\")","v":""},{"$f":"IFERROR(INDEX(Tableau_de_suivi[[N°]:[Clôturé]],SMALL(IF(Tableau_de_suivi[Clôturé]=\"OUI\",ROW(Tableau_de_suivi[Clôturé])-2),ROWS($1:28)),COLUMN()),\"\")","v":""},{"$f":"IFERROR(INDEX(Tableau_de_suivi[[N°]:[Clôturé]],SMALL(IF(Tableau_de_suivi[Clôturé]=\"OUI\",ROW(Tableau_de_suivi[Clôturé])-2),ROWS($1:28)),COLUMN()),\"\")","v":""},{"$f":"IFERROR(INDEX(Tableau_de_suivi[[N°]:[Clôturé]],SMALL(IF(Tableau_de_suivi[Clôturé]=\"OUI\",ROW(Tableau_de_suivi[Clôturé])-2),ROWS($1:28)),COLUMN()),\"\")","v":""},{"$f":"IFERROR(INDEX(Tableau_de_suivi[[N°]:[Clôturé]],SMALL(IF(Tableau_de_suivi[Clôturé]=\"OUI\",ROW(Tableau_de_suivi[Clôturé])-2),ROWS($1:28)),COLUMN()),\"\")","v":""},{"$f":"IFERROR(INDEX(Tableau_de_suivi[[N°]:[Clôturé]],SMALL(IF(Tableau_de_suivi[Clôturé]=\"OUI\",ROW(Tableau_de_suivi[Clôturé])-2),ROWS($1:28)),COLUMN()),\"\")","v":""},{"$f":"IFERROR(INDEX(Tableau_de_suivi[[N°]:[Clôturé]],SMALL(IF(Tableau_de_suivi[Clôturé]=\"OUI\",ROW(Tableau_de_suivi[Clôturé])-2),ROWS($1:28)),COLUMN()),\"\")","v":""},{"$f":"IFERROR(INDEX(Tableau_de_suivi[[N°]:[Clôturé]],SMALL(IF(Tableau_de_suivi[Clôturé]=\"OUI\",ROW(Tableau_de_suivi[Clôturé])-2),ROWS($1:28)),COLUMN()),\"\")","v":""},{"$f":"IFERROR(INDEX(Tableau_de_suivi[[N°]:[Clôturé]],SMALL(IF(Tableau_de_suivi[Clôturé]=\"OUI\",ROW(Tableau_de_suivi[Clôturé])-2),ROWS($1:28)),COLUMN()),\"\")","v":""},{"$f":"IFERROR(INDEX(Tableau_de_suivi[[N°]:[Clôturé]],SMALL(IF(Tableau_de_suivi[Clôturé]=\"OUI\",ROW(Tableau_de_suivi[Clôturé])-2),ROWS($1:28)),COLUMN()),\"\")","v":""},{"$f":"IFERROR(INDEX(Tableau_de_suivi[[N°]:[Clôturé]],SMALL(IF(Tableau_de_suivi[Clôturé]=\"OUI\",ROW(Tableau_de_suivi[Clôturé])-2),ROWS($1:28)),COLUMN()),\"\")","v":""},{"$f":"IFERROR(INDEX(Tableau_de_suivi[[N°]:[Clôturé]],SMALL(IF(Tableau_de_suivi[Clôturé]=\"OUI\",ROW(Tableau_de_suivi[Clôturé])-2),ROWS($1:28)),COLUMN()),\"\")","v":""},{"$f":"IFERROR(INDEX(Tableau_de_suivi[[N°]:[Clôturé]],SMALL(IF(Tableau_de_suivi[Clôturé]=\"OUI\",ROW(Tableau_de_suivi[Clôturé])-2),ROWS($1:28)),COLUMN()),\"\")","v":""}]
[{"$f":"IFERROR(INDEX(Tableau_de_suivi[[N°]:[Clôturé]],SMALL(IF(Tableau_de_suivi[Clôturé]=\"OUI\",ROW(Tableau_de_suivi[Clôturé])-2),ROWS($1:29)),COLUMN()),\"\")","v":""},{"$f":"IFERROR(INDEX(Tableau_de_suivi[[N°]:[Clôturé]],SMALL(IF(Tableau_de_suivi[Clôturé]=\"OUI\",ROW(Tableau_de_suivi[Clôturé])-2),ROWS($1:29)),COLUMN()),\"\")","v":""},{"$f":"IFERROR(INDEX(Tableau_de_suivi[[N°]:[Clôturé]],SMALL(IF(Tableau_de_suivi[Clôturé]=\"OUI\",ROW(Tableau_de_suivi[Clôturé])-2),ROWS($1:29)),COLUMN()),\"\")","v":""},{"$f":"IFERROR(INDEX(Tableau_de_suivi[[N°]:[Clôturé]],SMALL(IF(Tableau_de_suivi[Clôturé]=\"OUI\",ROW(Tableau_de_suivi[Clôturé])-2),ROWS($1:29)),COLUMN()),\"\")","v":""},{"$f":"IFERROR(INDEX(Tableau_de_suivi[[N°]:[Clôturé]],SMALL(IF(Tableau_de_suivi[Clôturé]=\"OUI\",ROW(Tableau_de_suivi[Clôturé])-2),ROWS($1:29)),COLUMN()),\"\")","v":""},{"$f":"IFERROR(INDEX(Tableau_de_suivi[[N°]:[Clôturé]],SMALL(IF(Tableau_de_suivi[Clôturé]=\"OUI\",ROW(Tableau_de_suivi[Clôturé])-2),ROWS($1:29)),COLUMN()),\"\")","v":""},{"$f":"IFERROR(INDEX(Tableau_de_suivi[[N°]:[Clôturé]],SMALL(IF(Tableau_de_suivi[Clôturé]=\"OUI\",ROW(Tableau_de_suivi[Clôturé])-2),ROWS($1:29)),COLUMN()),\"\")","v":""},{"$f":"IFERROR(INDEX(Tableau_de_suivi[[N°]:[Clôturé]],SMALL(IF(Tableau_de_suivi[Clôturé]=\"OUI\",ROW(Tableau_de_suivi[Clôturé])-2),ROWS($1:29)),COLUMN()),\"\")","v":""},{"$f":"IFERROR(INDEX(Tableau_de_suivi[[N°]:[Clôturé]],SMALL(IF(Tableau_de_suivi[Clôturé]=\"OUI\",ROW(Tableau_de_suivi[Clôturé])-2),ROWS($1:29)),COLUMN()),\"\")","v":""},{"$f":"IFERROR(INDEX(Tableau_de_suivi[[N°]:[Clôturé]],SMALL(IF(Tableau_de_suivi[Clôturé]=\"OUI\",ROW(Tableau_de_suivi[Clôturé])-2),ROWS($1:29)),COLUMN()),\"\")","v":""},{"$f":"IFERROR(INDEX(Tableau_de_suivi[[N°]:[Clôturé]],SMALL(IF(Tableau_de_suivi[Clôturé]=\"OUI\",ROW(Tableau_de_suivi[Clôturé])-2),ROWS($1:29)),COLUMN()),\"\")","v":""},{"$f":"IFERROR(INDEX(Tableau_de_suivi[[N°]:[Clôturé]],SMALL(IF(Tableau_de_suivi[Clôturé]=\"OUI\",ROW(Tableau_de_suivi[Clôturé])-2),ROWS($1:29)),COLUMN()),\"\")","v":""},{"$f":"IFERROR(INDEX(Tableau_de_suivi[[N°]:[Clôturé]],SMALL(IF(Tableau_de_suivi[Clôturé]=\"OUI\",ROW(Tableau_de_suivi[Clôturé])-2),ROWS($1:29)),COLUMN()),\"\")","v":""},{"$f":"IFERROR(INDEX(Tableau_de_suivi[[N°]:[Clôturé]],SMALL(IF(Tableau_de_suivi[Clôturé]=\"OUI\",ROW(Tableau_de_suivi[Clôturé])-2),ROWS($1:29)),COLUMN()),\"\")","v":""},{"$f":"IFERROR(INDEX(Tableau_de_suivi[[N°]:[Clôturé]],SMALL(IF(Tableau_de_suivi[Clôturé]=\"OUI\",ROW(Tableau_de_suivi[Clôturé])-2),ROWS($1:29)),COLUMN()),\"\")","v":""},{"$f":"IFERROR(INDEX(Tableau_de_suivi[[N°]:[Clôturé]],SMALL(IF(Tableau_de_suivi[Clôturé]=\"OUI\",ROW(Tableau_de_suivi[Clôturé])-2),ROWS($1:29)),COLUMN()),\"\")","v":""},{"$f":"IFERROR(INDEX(Tableau_de_suivi[[N°]:[Clôturé]],SMALL(IF(Tableau_de_suivi[Clôturé]=\"OUI\",ROW(Tableau_de_suivi[Clôturé])-2),ROWS($1:29)),COLUMN()),\"\")","v":""},{"$f":"IFERROR(INDEX(Tableau_de_suivi[[N°]:[Clôturé]],SMALL(IF(Tableau_de_suivi[Clôturé]=\"OUI\",ROW(Tableau_de_suivi[Clôturé])-2),ROWS($1:29)),COLUMN()),\"\")","v":""},{"$f":"IFERROR(INDEX(Tableau_de_suivi[[N°]:[Clôturé]],SMALL(IF(Tableau_de_suivi[Clôturé]=\"OUI\",ROW(Tableau_de_suivi[Clôturé])-2),ROWS($1:29)),COLUMN()),\"\")","v":""},{"$f":"IFERROR(INDEX(Tableau_de_suivi[[N°]:[Clôturé]],SMALL(IF(Tableau_de_suivi[Clôturé]=\"OUI\",ROW(Tableau_de_suivi[Clôturé])-2),ROWS($1:29)),COLUMN()),\"\")","v":""},{"$f":"IFERROR(INDEX(Tableau_de_suivi[[N°]:[Clôturé]],SMALL(IF(Tableau_de_suivi[Clôturé]=\"OUI\",ROW(Tableau_de_suivi[Clôturé])-2),ROWS($1:29)),COLUMN()),\"\")","v":""},{"$f":"IFERROR(INDEX(Tableau_de_suivi[[N°]:[Clôturé]],SMALL(IF(Tableau_de_suivi[Clôturé]=\"OUI\",ROW(Tableau_de_suivi[Clôturé])-2),ROWS($1:29)),COLUMN()),\"\")","v":""}]
[{"$f":"IFERROR(INDEX(Tableau_de_suivi[[N°]:[Clôturé]],SMALL(IF(Tableau_de_suivi[Clôturé]=\"OUI\",ROW(Tableau_de_suivi[Clôturé])-2),ROWS($1:30)),COLUMN()),\"\")","v":""},{"$f":"IFERROR(INDEX(Tableau_de_suivi[[N°]:[Clôturé]],SMALL(IF(Tableau_de_suivi[Clôturé]=\"OUI\",ROW(Tableau_de_suivi[Clôturé])-2),ROWS($1:30)),COLUMN()),\"\")","v":""},{"$f":"IFERROR(INDEX(Tableau_de_suivi[[N°]:[Clôturé]],SMALL(IF(Tableau_de_suivi[Clôturé]=\"OUI\",ROW(Tableau_de_suivi[Clôturé])-2),ROWS($1:30)),COLUMN()),\"\")","v":""},{"$f":"IFERROR(INDEX(Tableau_de_suivi[[N°]:[Clôturé]],SMALL(IF(Tableau_de_suivi[Clôturé]=\"OUI\",ROW(Tableau_de_suivi[Clôturé])-2),ROWS($1:30)),COLUMN()),\"\")","v":""},{"$f":"IFERROR(INDEX(Tableau_de_suivi[[N°]:[Clôturé]],SMALL(IF(Tableau_de_suivi[Clôturé]=\"OUI\",ROW(Tableau_de_suivi[Clôturé])-2),ROWS($1:30)),COLUMN()),\"\")","v":""},{"$f":"IFERROR(INDEX(Tableau_de_suivi[[N°]:[Clôturé]],SMALL(IF(Tableau_de_suivi[Clôturé]=\"OUI\",ROW(Tableau_de_suivi[Clôturé])-2),ROWS($1:30)),COLUMN()),\"\")","v":""},{"$f":"IFERROR(INDEX(Tableau_de_suivi[[N°]:[Clôturé]],SMALL(IF(Tableau_de_suivi[Clôturé]=\"OUI\",ROW(Tableau_de_suivi[Clôturé])-2),ROWS($1:30)),COLUMN()),\"\")","v":""},{"$f":"IFERROR(INDEX(Tableau_de_suivi[[N°]:[Clôturé]],SMALL(IF(Tableau_de_suivi[Clôturé]=\"OUI\",ROW(Tableau_de_suivi[Clôturé])-2),ROWS($1:30)),COLUMN()),\"\")","v":""},{"$f":"IFERROR(INDEX(Tableau_de_suivi[[N°]:[Clôturé]],SMALL(IF(Tableau_de_suivi[Clôturé]=\"OUI\",ROW(Tableau_de_suivi[Clôturé])-2),ROWS($1:30)),COLUMN()),\"\")","v":""},{"$f":"IFERROR(INDEX(Tableau_de_suivi[[N°]:[Clôturé]],SMALL(IF(Tableau_de_suivi[Clôturé]=\"OUI\",ROW(Tableau_de_suivi[Clôturé])-2),ROWS($1:30)),COLUMN()),\"\")","v":""},{"$f":"IFERROR(INDEX(Tableau_de_suivi[[N°]:[Clôturé]],SMALL(IF(Tableau_de_suivi[Clôturé]=\"OUI\",ROW(Tableau_de_suivi[Clôturé])-2),ROWS($1:30)),COLUMN()),\"\")","v":""},{"$f":"IFERROR(INDEX(Tableau_de_suivi[[N°]:[Clôturé]],SMALL(IF(Tableau_de_suivi[Clôturé]=\"OUI\",ROW(Tableau_de_suivi[Clôturé])-2),ROWS($1:30)),COLUMN()),\"\")","v":""},{"$f":"IFERROR(INDEX(Tableau_de_suivi[[N°]:[Clôturé]],SMALL(IF(Tableau_de_suivi[Clôturé]=\"OUI\",ROW(Tableau_de_suivi[Clôturé])-2),ROWS($1:30)),COLUMN()),\"\")","v":""},{"$f":"IFERROR(INDEX(Tableau_de_suivi[[N°]:[Clôturé]],SMALL(IF(Tableau_de_suivi[Clôturé]=\"OUI\",ROW(Tableau_de_suivi[Clôturé])-2),ROWS($1:30)),COLUMN()),\"\")","v":""},{"$f":"IFERROR(INDEX(Tableau_de_suivi[[N°]:[Clôturé]],SMALL(IF(Tableau_de_suivi[Clôturé]=\"OUI\",ROW(Tableau_de_suivi[Clôturé])-2),ROWS($1:30)),COLUMN()),\"\")","v":""},{"$f":"IFERROR(INDEX(Tableau_de_suivi[[N°]:[Clôturé]],SMALL(IF(Tableau_de_suivi[Clôturé]=\"OUI\",ROW(Tableau_de_suivi[Clôturé])-2),ROWS($1:30)),COLUMN()),\"\")","v":""},{"$f":"IFERROR(INDEX(Tableau_de_suivi[[N°]:[Clôturé]],SMALL(IF(Tableau_de_suivi[Clôturé]=\"OUI\",ROW(Tableau_de_suivi[Clôturé])-2),ROWS($1:30)),COLUMN()),\"\")","v":""},{"$f":"IFERROR(INDEX(Tableau_de_suivi[[N°]:[Clôturé]],SMALL(IF(Tableau_de_suivi[Clôturé]=\"OUI\",ROW(Tableau_de_suivi[Clôturé])-2),ROWS($1:30)),COLUMN()),\"\")","v":""},{"$f":"IFERROR(INDEX(Tableau_de_suivi[[N°]:[Clôturé]],SMALL(IF(Tableau_de_suivi[Clôturé]=\"OUI\",ROW(Tableau_de_suivi[Clôturé])-2),ROWS($1:30)),COLUMN()),\"\")","v":""},{"$f":"IFERROR(INDEX(Tableau_de_suivi[[N°]:[Clôturé]],SMALL(IF(Tableau_de_suivi[Clôturé]=\"OUI\",ROW(Tableau_de_suivi[Clôturé])-2),ROWS($1:30)),COLUMN()),\"\")","v":""},{"$f":"IFERROR(INDEX(Tableau_de_suivi[[N°]:[Clôturé]],SMALL(IF(Tableau_de_suivi[Clôturé]=\"OUI\",ROW(Tableau_de_suivi[Clôturé])-2),ROWS($1:30)),COLUMN()),\"\")","v":""},{"$f":"IFERROR(INDEX(Tableau_de_suivi[[N°]:[Clôturé]],SMALL(IF(Tableau_de_suivi[Clôturé]=\"OUI\",ROW(Tableau_de_suivi[Clôturé])-2),ROWS($1:30)),COLUMN()),\"\")","v":""}]
[{"$f":"IFERROR(INDEX(Tableau_de_suivi[[N°]:[Clôturé]],SMALL(IF(Tableau_de_suivi[Clôturé]=\"OUI\",ROW(Tableau_de_suivi[Clôturé])-2),ROWS($1:31)),COLUMN()),\"\")","v":""},{"$f":"IFERROR(INDEX(Tableau_de_suivi[[N°]:[Clôturé]],SMALL(IF(Tableau_de_suivi[Clôturé]=\"OUI\",ROW(Tableau_de_suivi[Clôturé])-2),ROWS($1:31)),COLUMN()),\"\")","v":""},{"$f":"IFERROR(INDEX(Tableau_de_suivi[[N°]:[Clôturé]],SMALL(IF(Tableau_de_suivi[Clôturé]=\"OUI\",ROW(Tableau_de_suivi[Clôturé])-2),ROWS($1:31)),COLUMN()),\"\")","v":""},{"$f":"IFERROR(INDEX(Tableau_de_suivi[[N°]:[Clôturé]],SMALL(IF(Tableau_de_suivi[Clôturé]=\"OUI\",ROW(Tableau_de_suivi[Clôturé])-2),ROWS($1:31)),COLUMN()),\"\")","v":""},{"$f":"IFERROR(INDEX(Tableau_de_suivi[[N°]:[Clôturé]],SMALL(IF(Tableau_de_suivi[Clôturé]=\"OUI\",ROW(Tableau_de_suivi[Clôturé])-2),ROWS($1:31)),COLUMN()),\"\")","v":""},{"$f":"IFERROR(INDEX(Tableau_de_suivi[[N°]:[Clôturé]],SMALL(IF(Tableau_de_suivi[Clôturé]=\"OUI\",ROW(Tableau_de_suivi[Clôturé])-2),ROWS($1:31)),COLUMN()),\"\")","v":""},{"$f":"IFERROR(INDEX(Tableau_de_suivi[[N°]:[Clôturé]],SMALL(IF(Tableau_de_suivi[Clôturé]=\"OUI\",ROW(Tableau_de_suivi[Clôturé])-2),ROWS($1:31)),COLUMN()),\"\")","v":""},{"$f":"IFERROR(INDEX(Tableau_de_suivi[[N°]:[Clôturé]],SMALL(IF(Tableau_de_suivi[Clôturé]=\"OUI\",ROW(Tableau_de_suivi[Clôturé])-2),ROWS($1:31)),COLUMN()),\"\")","v":""},{"$f":"IFERROR(INDEX(Tableau_de_suivi[[N°]:[Clôturé]],SMALL(IF(Tableau_de_suivi[Clôturé]=\"OUI\",ROW(Tableau_de_suivi[Clôturé])-2),ROWS($1:31)),COLUMN()),\"\")","v":""},{"$f":"IFERROR(INDEX(Tableau_de_suivi[[N°]:[Clôturé]],SMALL(IF(Tableau_de_suivi[Clôturé]=\"OUI\",ROW(Tableau_de_suivi[Clôturé])-2),ROWS($1:31)),COLUMN()),\"\")","v":""},{"$f":"IFERROR(INDEX(Tableau_de_suivi[[N°]:[Clôturé]],SMALL(IF(Tableau_de_suivi[Clôturé]=\"OUI\",ROW(Tableau_de_suivi[Clôturé])-2),ROWS($1:31)),COLUMN()),\"\")","v":""},{"$f":"IFERROR(INDEX(Tableau_de_suivi[[N°]:[Clôturé]],SMALL(IF(Tableau_de_suivi[Clôturé]=\"OUI\",ROW(Tableau_de_suivi[Clôturé])-2),ROWS($1:31)),COLUMN()),\"\")","v":""},{"$f":"IFERROR(INDEX(Tableau_de_suivi[[N°]:[Clôturé]],SMALL(IF(Tableau_de_suivi[Clôturé]=\"OUI\",ROW(Tableau_de_suivi[Clôturé])-2),ROWS($1:31)),COLUMN()),\"\")","v":""},{"$f":"IFERROR(INDEX(Tableau_de_suivi[[N°]:[Clôturé]],SMALL(IF(Tableau_de_suivi[Clôturé]=\"OUI\",ROW(Tableau_de_suivi[Clôturé])-2),ROWS($1:31)),COLUMN()),\"\")","v":""},{"$f":"IFERROR(INDEX(Tableau_de_suivi[[N°]:[Clôturé]],SMALL(IF(Tableau_de_suivi[Clôturé]=\"OUI\",ROW(Tableau_de_suivi[Clôturé])-2),ROWS($1:31)),COLUMN()),\"\")","v":""},{"$f":"IFERROR(INDEX(Tableau_de_suivi[[N°]:[Clôturé]],SMALL(IF(Tableau_de_suivi[Clôturé]=\"OUI\",ROW(Tableau_de_suivi[Clôturé])-2),ROWS($1:31)),COLUMN()),\"\")","v":""},{"$f":"IFERROR(INDEX(Tableau_de_suivi[[N°]:[Clôturé]],SMALL(IF(Tableau_de_suivi[Clôturé]=\"OUI\",ROW(Tableau_de_suivi[Clôturé])-2),ROWS($1:31)),COLUMN()),\"\")","v":""},{"$f":"IFERROR(INDEX(Tableau_de_suivi[[N°]:[Clôturé]],SMALL(IF(Tableau_de_suivi[Clôturé]=\"OUI\",ROW(Tableau_de_suivi[Clôturé])-2),ROWS($1:31)),COLUMN()),\"\")","v":""},{"$f":"IFERROR(INDEX(Tableau_de_suivi[[N°]:[Clôturé]],SMALL(IF(Tableau_de_suivi[Clôturé]=\"OUI\",ROW(Tableau_de_suivi[Clôturé])-2),ROWS($1:31)),COLUMN()),\"\")","v":""},{"$f":"IFERROR(INDEX(Tableau_de_suivi[[N°]:[Clôturé]],SMALL(IF(Tableau_de_suivi[Clôturé]=\"OUI\",ROW(Tableau_de_suivi[Clôturé])-2),ROWS($1:31)),COLUMN()),\"\")","v":""},{"$f":"IFERROR(INDEX(Tableau_de_suivi[[N°]:[Clôturé]],SMALL(IF(Tableau_de_suivi[Clôturé]=\"OUI\",ROW(Tableau_de_suivi[Clôturé])-2),ROWS($1:31)),COLUMN()),\"\")","v":""},{"$f":"IFERROR(INDEX(Tableau_de_suivi[[N°]:[Clôturé]],SMALL(IF(Tableau_de_suivi[Clôturé]=\"OUI\",ROW(Tableau_de_suivi[Clôturé])-2),ROWS($1:31)),COLUMN()),\"\")","v":""}]
[{"$f":"IFERROR(INDEX(Tableau_de_suivi[[N°]:[Clôturé]],SMALL(IF(Tableau_de_suivi[Clôturé]=\"OUI\",ROW(Tableau_de_suivi[Clôturé])-2),ROWS($1:32)),COLUMN()),\"\")","v":""},{"$f":"IFERROR(INDEX(Tableau_de_suivi[[N°]:[Clôturé]],SMALL(IF(Tableau_de_suivi[Clôturé]=\"OUI\",ROW(Tableau_de_suivi[Clôturé])-2),ROWS($1:32)),COLUMN()),\"\")","v":""},{"$f":"IFERROR(INDEX(Tableau_de_suivi[[N°]:[Clôturé]],SMALL(IF(Tableau_de_suivi[Clôturé]=\"OUI\",ROW(Tableau_de_suivi[Clôturé])-2),ROWS($1:32)),COLUMN()),\"\")","v":""},{"$f":"IFERROR(INDEX(Tableau_de_suivi[[N°]:[Clôturé]],SMALL(IF(Tableau_de_suivi[Clôturé]=\"OUI\",ROW(Tableau_de_suivi[Clôturé])-2),ROWS($1:32)),COLUMN()),\"\")","v":""},{"$f":"IFERROR(INDEX(Tableau_de_suivi[[N°]:[Clôturé]],SMALL(IF(Tableau_de_suivi[Clôturé]=\"OUI\",ROW(Tableau_de_suivi[Clôturé])-2),ROWS($1:32)),COLUMN()),\"\")","v":""},{"$f":"IFERROR(INDEX(Tableau_de_suivi[[N°]:[Clôturé]],SMALL(IF(Tableau_de_suivi[Clôturé]=\"OUI\",ROW(Tableau_de_suivi[Clôturé])-2),ROWS($1:32)),COLUMN()),\"\")","v":""},{"$f":"IFERROR(INDEX(Tableau_de_suivi[[N°]:[Clôturé]],SMALL(IF(Tableau_de_suivi[Clôturé]=\"OUI\",ROW(Tableau_de_suivi[Clôturé])-2),ROWS($1:32)),COLUMN()),\"\")","v":""},{"$f":"IFERROR(INDEX(Tableau_de_suivi[[N°]:[Clôturé]],SMALL(IF(Tableau_de_suivi[Clôturé]=\"OUI\",ROW(Tableau_de_suivi[Clôturé])-2),ROWS($1:32)),COLUMN()),\"\")","v":""},{"$f":"IFERROR(INDEX(Tableau_de_suivi[[N°]:[Clôturé]],SMALL(IF(Tableau_de_suivi[Clôturé]=\"OUI\",ROW(Tableau_de_suivi[Clôturé])-2),ROWS($1:32)),COLUMN()),\"\")","v":""},{"$f":"IFERROR(INDEX(Tableau_de_suivi[[N°]:[Clôturé]],SMALL(IF(Tableau_de_suivi[Clôturé]=\"OUI\",ROW(Tableau_de_suivi[Clôturé])-2),ROWS($1:32)),COLUMN()),\"\")","v":""},{"$f":"IFERROR(INDEX(Tableau_de_suivi[[N°]:[Clôturé]],SMALL(IF(Tableau_de_suivi[Clôturé]=\"OUI\",ROW(Tableau_de_suivi[Clôturé])-2),ROWS($1:32)),COLUMN()),\"\")","v":""},{"$f":"IFERROR(INDEX(Tableau_de_suivi[[N°]:[Clôturé]],SMALL(IF(Tableau_de_suivi[Clôturé]=\"OUI\",ROW(Tableau_de_suivi[Clôturé])-2),ROWS($1:32)),COLUMN()),\"\")","v":""},{"$f":"IFERROR(INDEX(Tableau_de_suivi[[N°]:[Clôturé]],SMALL(IF(Tableau_de_suivi[Clôturé]=\"OUI\",ROW(Tableau_de_suivi[Clôturé])-2),ROWS($1:32)),COLUMN()),\"\")","v":""},{"$f":"IFERROR(INDEX(Tableau_de_suivi[[N°]:[Clôturé]],SMALL(IF(Tableau_de_suivi[Clôturé]=\"OUI\",ROW(Tableau_de_suivi[Clôturé])-2),ROWS($1:32)),COLUMN()),\"\")","v":""},{"$f":"IFERROR(INDEX(Tableau_de_suivi[[N°]:[Clôturé]],SMALL(IF(Tableau_de_suivi[Clôturé]=\"OUI\",ROW(Tableau_de_suivi[Clôturé])-2),ROWS($1:32)),COLUMN()),\"\")","v":""},{"$f":"IFERROR(INDEX(Tableau_de_suivi[[N°]:[Clôturé]],SMALL(IF(Tableau_de_suivi[Clôturé]=\"OUI\",ROW(Tableau_de_suivi[Clôturé])-2),ROWS($1:32)),COLUMN()),\"\")","v":""},{"$f":"IFERROR(INDEX(Tableau_de_suivi[[N°]:[Clôturé]],SMALL(IF(Tableau_de_suivi[Clôturé]=\"OUI\",ROW(Tableau_de_suivi[Clôturé])-2),ROWS($1:32)),COLUMN()),\"\")","v":""},{"$f":"IFERROR(INDEX(Tableau_de_suivi[[N°]:[Clôturé]],SMALL(IF(Tableau_de_suivi[Clôturé]=\"OUI\",ROW(Tableau_de_suivi[Clôturé])-2),ROWS($1:32)),COLUMN()),\"\")","v":""},{"$f":"IFERROR(INDEX(Tableau_de_suivi[[N°]:[Clôturé]],SMALL(IF(Tableau_de_suivi[Clôturé]=\"OUI\",ROW(Tableau_de_suivi[Clôturé])-2),ROWS($1:32)),COLUMN()),\"\")","v":""},{"$f":"IFERROR(INDEX(Tableau_de_suivi[[N°]:[Clôturé]],SMALL(IF(Tableau_de_suivi[Clôturé]=\"OUI\",ROW(Tableau_de_suivi[Clôturé])-2),ROWS($1:32)),COLUMN()),\"\")","v":""},{"$f":"IFERROR(INDEX(Tableau_de_suivi[[N°]:[Clôturé]],SMALL(IF(Tableau_de_suivi[Clôturé]=\"OUI\",ROW(Tableau_de_suivi[Clôturé])-2),ROWS($1:32)),COLUMN()),\"\")","v":""},{"$f":"IFERROR(INDEX(Tableau_de_suivi[[N°]:[Clôturé]],SMALL(IF(Tableau_de_suivi[Clôturé]=\"OUI\",ROW(Tableau_de_suivi[Clôturé])-2),ROWS($1:32)),COLUMN()),\"\")","v":""}]
[{"$f":"IFERROR(INDEX(Tableau_de_suivi[[N°]:[Clôturé]],SMALL(IF(Tableau_de_suivi[Clôturé]=\"OUI\",ROW(Tableau_de_suivi[Clôturé])-2),ROWS($1:33)),COLUMN()),\"\")","v":""},{"$f":"IFERROR(INDEX(Tableau_de_suivi[[N°]:[Clôturé]],SMALL(IF(Tableau_de_suivi[Clôturé]=\"OUI\",ROW(Tableau_de_suivi[Clôturé])-2),ROWS($1:33)),COLUMN()),\"\")","v":""},{"$f":"IFERROR(INDEX(Tableau_de_suivi[[N°]:[Clôturé]],SMALL(IF(Tableau_de_suivi[Clôturé]=\"OUI\",ROW(Tableau_de_suivi[Clôturé])-2),ROWS($1:33)),COLUMN()),\"\")","v":""},{"$f":"IFERROR(INDEX(Tableau_de_suivi[[N°]:[Clôturé]],SMALL(IF(Tableau_de_suivi[Clôturé]=\"OUI\",ROW(Tableau_de_suivi[Clôturé])-2),ROWS($1:33)),COLUMN()),\"\")","v":""},{"$f":"IFERROR(INDEX(Tableau_de_suivi[[N°]:[Clôturé]],SMALL(IF(Tableau_de_suivi[Clôturé]=\"OUI\",ROW(Tableau_de_suivi[Clôturé])-2),ROWS($1:33)),COLUMN()),\"\")","v":""},{"$f":"IFERROR(INDEX(Tableau_de_suivi[[N°]:[Clôturé]],SMALL(IF(Tableau_de_suivi[Clôturé]=\"OUI\",ROW(Tableau_de_suivi[Clôturé])-2),ROWS($1:33)),COLUMN()),\"\")","v":""},{"$f":"IFERROR(INDEX(Tableau_de_suivi[[N°]:[Clôturé]],SMALL(IF(Tableau_de_suivi[Clôturé]=\"OUI\",ROW(Tableau_de_suivi[Clôturé])-2),ROWS($1:33)),COLUMN()),\"\")","v":""},{"$f":"IFERROR(INDEX(Tableau_de_suivi[[N°]:[Clôturé]],SMALL(IF(Tableau_de_suivi[Clôturé]=\"OUI\",ROW(Tableau_de_suivi[Clôturé])-2),ROWS($1:33)),COLUMN()),\"\")","v":""},{"$f":"IFERROR(INDEX(Tableau_de_suivi[[N°]:[Clôturé]],SMALL(IF(Tableau_de_suivi[Clôturé]=\"OUI\",ROW(Tableau_de_suivi[Clôturé])-2),ROWS($1:33)),COLUMN()),\"\")","v":""},{"$f":"IFERROR(INDEX(Tableau_de_suivi[[N°]:[Clôturé]],SMALL(IF(Tableau_de_suivi[Clôturé]=\"OUI\",ROW(Tableau_de_suivi[Clôturé])-2),ROWS($1:33)),COLUMN()),\"\")","v":""},{"$f":"IFERROR(INDEX(Tableau_de_suivi[[N°]:[Clôturé]],SMALL(IF(Tableau_de_suivi[Clôturé]=\"OUI\",ROW(Tableau_de_suivi[Clôturé])-2),ROWS($1:33)),COLUMN()),\"\")","v":""},{"$f":"IFERROR(INDEX(Tableau_de_suivi[[N°]:[Clôturé]],SMALL(IF(Tableau_de_suivi[Clôturé]=\"OUI\",ROW(Tableau_de_suivi[Clôturé])-2),ROWS($1:33)),COLUMN()),\"\")","v":""},{"$f":"IFERROR(INDEX(Tableau_de_suivi[[N°]:[Clôturé]],SMALL(IF(Tableau_de_suivi[Clôturé]=\"OUI\",ROW(Tableau_de_suivi[Clôturé])-2),ROWS($1:33)),COLUMN()),\"\")","v":""},{"$f":"IFERROR(INDEX(Tableau_de_suivi[[N°]:[Clôturé]],SMALL(IF(Tableau_de_suivi[Clôturé]=\"OUI\",ROW(Tableau_de_suivi[Clôturé])-2),ROWS($1:33)),COLUMN()),\"\")","v":""},{"$f":"IFERROR(INDEX(Tableau_de_suivi[[N°]:[Clôturé]],SMALL(IF(Tableau_de_suivi[Clôturé]=\"OUI\",ROW(Tableau_de_suivi[Clôturé])-2),ROWS($1:33)),COLUMN()),\"\")","v":""},{"$f":"IFERROR(INDEX(Tableau_de_suivi[[N°]:[Clôturé]],SMALL(IF(Tableau_de_suivi[Clôturé]=\"OUI\",ROW(Tableau_de_suivi[Clôturé])-2),ROWS($1:33)),COLUMN()),\"\")","v":""},{"$f":"IFERROR(INDEX(Tableau_de_suivi[[N°]:[Clôturé]],SMALL(IF(Tableau_de_suivi[Clôturé]=\"OUI\",ROW(Tableau_de_suivi[Clôturé])-2),ROWS($1:33)),COLUMN()),\"\")","v":""},{"$f":"IFERROR(INDEX(Tableau_de_suivi[[N°]:[Clôturé]],SMALL(IF(Tableau_de_suivi[Clôturé]=\"OUI\",ROW(Tableau_de_suivi[Clôturé])-2),ROWS($1:33)),COLUMN()),\"\")","v":""},{"$f":"IFERROR(INDEX(Tableau_de_suivi[[N°]:[Clôturé]],SMALL(IF(Tableau_de_suivi[Clôturé]=\"OUI\",ROW(Tableau_de_suivi[Clôturé])-2),ROWS($1:33)),COLUMN()),\"\")","v":""},{"$f":"IFERROR(INDEX(Tableau_de_suivi[[N°]:[Clôturé]],SMALL(IF(Tableau_de_suivi[Clôturé]=\"OUI\",ROW(Tableau_de_suivi[Clôturé])-2),ROWS($1:33)),COLUMN()),\"\")","v":""},{"$f":"IFERROR(INDEX(Tableau_de_suivi[[N°]:[Clôturé]],SMALL(IF(Tableau_de_suivi[Clôturé]=\"OUI\",ROW(Tableau_de_suivi[Clôturé])-2),ROWS($1:33)),COLUMN()),\"\")","v":""},{"$f":"IFERROR(INDEX(Tableau_de_suivi[[N°]:[Clôturé]],SMALL(IF(Tableau_de_suivi[Clôturé]=\"OUI\",ROW(Tableau_de_suivi[Clôturé])-2),ROWS($1:33)),COLUMN()),\"\")","v":""}]
[{"$f":"IFERROR(INDEX(Tableau_de_suivi[[N°]:[Clôturé]],SMALL(IF(Tableau_de_suivi[Clôturé]=\"OUI\",ROW(Tableau_de_suivi[Clôturé])-2),ROWS($1:34)),COLUMN()),\"\")","v":""},{"$f":"IFERROR(INDEX(Tableau_de_suivi[[N°]:[Clôturé]],SMALL(IF(Tableau_de_suivi[Clôturé]=\"OUI\",ROW(Tableau_de_suivi[Clôturé])-2),ROWS($1:34)),COLUMN()),\"\")","v":""},{"$f":"IFERROR(INDEX(Tableau_de_suivi[[N°]:[Clôturé]],SMALL(IF(Tableau_de_suivi[Clôturé]=\"OUI\",ROW(Tableau_de_suivi[Clôturé])-2),ROWS($1:34)),COLUMN()),\"\")","v":""},{"$f":"IFERROR(INDEX(Tableau_de_suivi[[N°]:[Clôturé]],SMALL(IF(Tableau_de_suivi[Clôturé]=\"OUI\",ROW(Tableau_de_suivi[Clôturé])-2),ROWS($1:34)),COLUMN()),\"\")","v":""},{"$f":"IFERROR(INDEX(Tableau_de_suivi[[N°]:[Clôturé]],SMALL(IF(Tableau_de_suivi[Clôturé]=\"OUI\",ROW(Tableau_de_suivi[Clôturé])-2),ROWS($1:34)),COLUMN()),\"\")","v":""},{"$f":"IFERROR(INDEX(Tableau_de_suivi[[N°]:[Clôturé]],SMALL(IF(Tableau_de_suivi[Clôturé]=\"OUI\",ROW(Tableau_de_suivi[Clôturé])-2),ROWS($1:34)),COLUMN()),\"\")","v":""},{"$f":"IFERROR(INDEX(Tableau_de_suivi[[N°]:[Clôturé]],SMALL(IF(Tableau_de_suivi[Clôturé]=\"OUI\",ROW(Tableau_de_suivi[Clôturé])-2),ROWS($1:34)),COLUMN()),\"\")","v":""},{"$f":"IFERROR(INDEX(Tableau_de_suivi[[N°]:[Clôturé]],SMALL(IF(Tableau_de_suivi[Clôturé]=\"OUI\",ROW(Tableau_de_suivi[Clôturé])-2),ROWS($1:34)),COLUMN()),\"\")","v":""},{"$f":"IFERROR(INDEX(Tableau_de_suivi[[N°]:[Clôturé]],SMALL(IF(Tableau_de_suivi[Clôturé]=\"OUI\",ROW(Tableau_de_suivi[Clôturé])-2),ROWS($1:34)),COLUMN()),\"\")","v":""},{"$f":"IFERROR(INDEX(Tableau_de_suivi[[N°]:[Clôturé]],SMALL(IF(Tableau_de_suivi[Clôturé]=\"OUI\",ROW(Tableau_de_suivi[Clôturé])-2),ROWS($1:34)),COLUMN()),\"\")","v":""},{"$f":"IFERROR(INDEX(Tableau_de_suivi[[N°]:[Clôturé]],SMALL(IF(Tableau_de_suivi[Clôturé]=\"OUI\",ROW(Tableau_de_suivi[Clôturé])-2),ROWS($1:34)),COLUMN()),\"\")","v":""},{"$f":"IFERROR(INDEX(Tableau_de_suivi[[N°]:[Clôturé]],SMALL(IF(Tableau_de_suivi[Clôturé]=\"OUI\",ROW(Tableau_de_suivi[Clôturé])-2),ROWS($1:34)),COLUMN()),\"\")","v":""},{"$f":"IFERROR(INDEX(Tableau_de_suivi[[N°]:[Clôturé]],SMALL(IF(Tableau_de_suivi[Clôturé]=\"OUI\",ROW(Tableau_de_suivi[Clôturé])-2),ROWS($1:34)),COLUMN()),\"\")","v":""},{"$f":"IFERROR(INDEX(Tableau_de_suivi[[N°]:[Clôturé]],SMALL(IF(Tableau_de_suivi[Clôturé]=\"OUI\",ROW(Tableau_de_suivi[Clôturé])-2),ROWS($1:34)),COLUMN()),\"\")","v":""},{"$f":"IFERROR(INDEX(Tableau_de_suivi[[N°]:[Clôturé]],SMALL(IF(Tableau_de_suivi[Clôturé]=\"OUI\",ROW(Tableau_de_suivi[Clôturé])-2),ROWS($1:34)),COLUMN()),\"\")","v":""},{"$f":"IFERROR(INDEX(Tableau_de_suivi[[N°]:[Clôturé]],SMALL(IF(Tableau_de_suivi[Clôturé]=\"OUI\",ROW(Tableau_de_suivi[Clôturé])-2),ROWS($1:34)),COLUMN()),\"\")","v":""},{"$f":"IFERROR(INDEX(Tableau_de_suivi[[N°]:[Clôturé]],SMALL(IF(Tableau_de_suivi[Clôturé]=\"OUI\",ROW(Tableau_de_suivi[Clôturé])-2),ROWS($1:34)),COLUMN()),\"\")","v":""},{"$f":"IFERROR(INDEX(Tableau_de_suivi[[N°]:[Clôturé]],SMALL(IF(Tableau_de_suivi[Clôturé]=\"OUI\",ROW(Tableau_de_suivi[Clôturé])-2),ROWS($1:34)),COLUMN()),\"\")","v":""},{"$f":"IFERROR(INDEX(Tableau_de_suivi[[N°]:[Clôturé]],SMALL(IF(Tableau_de_suivi[Clôturé]=\"OUI\",ROW(Tableau_de_suivi[Clôturé])-2),ROWS($1:34)),COLUMN()),\"\")","v":""},{"$f":"IFERROR(INDEX(Tableau_de_suivi[[N°]:[Clôturé]],SMALL(IF(Tableau_de_suivi[Clôturé]=\"OUI\",ROW(Tableau_de_suivi[Clôturé])-2),ROWS($1:34)),COLUMN()),\"\")","v":""},{"$f":"IFERROR(INDEX(Tableau_de_suivi[[N°]:[Clôturé]],SMALL(IF(Tableau_de_suivi[Clôturé]=\"OUI\",ROW(Tableau_de_suivi[Clôturé])-2),ROWS($1:34)),COLUMN()),\"\")","v":""},{"$f":"IFERROR(INDEX(Tableau_de_suivi[[N°]:[Clôturé]],SMALL(IF(Tableau_de_suivi[Clôturé]=\"OUI\",ROW(Tableau_de_suivi[Clôturé])-2),ROWS($1:34)),COLUMN()),\"\")","v":""}]
[{"$f":"IFERROR(INDEX(Tableau_de_suivi[[N°]:[Clôturé]],SMALL(IF(Tableau_de_suivi[Clôturé]=\"OUI\",ROW(Tableau_de_suivi[Clôturé])-2),ROWS($1:35)),COLUMN()),\"\")","v":""},{"$f":"IFERROR(INDEX(Tableau_de_suivi[[N°]:[Clôturé]],SMALL(IF(Tableau_de_suivi[Clôturé]=\"OUI\",ROW(Tableau_de_suivi[Clôturé])-2),ROWS($1:35)),COLUMN()),\"\")","v":""},{"$f":"IFERROR(INDEX(Tableau_de_suivi[[N°]:[Clôturé]],SMALL(IF(Tableau_de_suivi[Clôturé]=\"OUI\",ROW(Tableau_de_suivi[Clôturé])-2),ROWS($1:35)),COLUMN()),\"\")","v":""},{"$f":"IFERROR(INDEX(Tableau_de_suivi[[N°]:[Clôturé]],SMALL(IF(Tableau_de_suivi[Clôturé]=\"OUI\",ROW(Tableau_de_suivi[Clôturé])-2),ROWS($1:35)),COLUMN()),\"\")","v":""},{"$f":"IFERROR(INDEX(Tableau_de_suivi[[N°]:[Clôturé]],SMALL(IF(Tableau_de_suivi[Clôturé]=\"OUI\",ROW(Tableau_de_suivi[Clôturé])-2),ROWS($1:35)),COLUMN()),\"\")","v":""},{"$f":"IFERROR(INDEX(Tableau_de_suivi[[N°]:[Clôturé]],SMALL(IF(Tableau_de_suivi[Clôturé]=\"OUI\",ROW(Tableau_de_suivi[Clôturé])-2),ROWS($1:35)),COLUMN()),\"\")","v":""},{"$f":"IFERROR(INDEX(Tableau_de_suivi[[N°]:[Clôturé]],SMALL(IF(Tableau_de_suivi[Clôturé]=\"OUI\",ROW(Tableau_de_suivi[Clôturé])-2),ROWS($1:35)),COLUMN()),\"\")","v":""},{"$f":"IFERROR(INDEX(Tableau_de_suivi[[N°]:[Clôturé]],SMALL(IF(Tableau_de_suivi[Clôturé]=\"OUI\",ROW(Tableau_de_suivi[Clôturé])-2),ROWS($1:35)),COLUMN()),\"\")","v":""},{"$f":"IFERROR(INDEX(Tableau_de_suivi[[N°]:[Clôturé]],SMALL(IF(Tableau_de_suivi[Clôturé]=\"OUI\",ROW(Tableau_de_suivi[Clôturé])-2),ROWS($1:35)),COLUMN()),\"\")","v":""},{"$f":"IFERROR(INDEX(Tableau_de_suivi[[N°]:[Clôturé]],SMALL(IF(Tableau_de_suivi[Clôturé]=\"OUI\",ROW(Tableau_de_suivi[Clôturé])-2),ROWS($1:35)),COLUMN()),\"\")","v":""},{"$f":"IFERROR(INDEX(Tableau_de_suivi[[N°]:[Clôturé]],SMALL(IF(Tableau_de_suivi[Clôturé]=\"OUI\",ROW(Tableau_de_suivi[Clôturé])-2),ROWS($1:35)),COLUMN()),\"\")","v":""},{"$f":"IFERROR(INDEX(Tableau_de_suivi[[N°]:[Clôturé]],SMALL(IF(Tableau_de_suivi[Clôturé]=\"OUI\",ROW(Tableau_de_suivi[Clôturé])-2),ROWS($1:35)),COLUMN()),\"\")","v":""},{"$f":"IFERROR(INDEX(Tableau_de_suivi[[N°]:[Clôturé]],SMALL(IF(Tableau_de_suivi[Clôturé]=\"OUI\",ROW(Tableau_de_suivi[Clôturé])-2),ROWS($1:35)),COLUMN()),\"\")","v":""},{"$f":"IFERROR(INDEX(Tableau_de_suivi[[N°]:[Clôturé]],SMALL(IF(Tableau_de_suivi[Clôturé]=\"OUI\",ROW(Tableau_de_suivi[Clôturé])-2),ROWS($1:35)),COLUMN()),\"\")","v":""},{"$f":"IFERROR(INDEX(Tableau_de_suivi[[N°]:[Clôturé]],SMALL(IF(Tableau_de_suivi[Clôturé]=\"OUI\",ROW(Tableau_de_suivi[Clôturé])-2),ROWS($1:35)),COLUMN()),\"\")","v":""},{"$f":"IFERROR(INDEX(Tableau_de_suivi[[N°]:[Clôturé]],SMALL(IF(Tableau_de_suivi[Clôturé]=\"OUI\",ROW(Tableau_de_suivi[Clôturé])-2),ROWS($1:35)),COLUMN()),\"\")","v":""},{"$f":"IFERROR(INDEX(Tableau_de_suivi[[N°]:[Clôturé]],SMALL(IF(Tableau_de_suivi[Clôturé]=\"OUI\",ROW(Tableau_de_suivi[Clôturé])-2),ROWS($1:35)),COLUMN()),\"\")","v":""},{"$f":"IFERROR(INDEX(Tableau_de_suivi[[N°]:[Clôturé]],SMALL(IF(Tableau_de_suivi[Clôturé]=\"OUI\",ROW(Tableau_de_suivi[Clôturé])-2),ROWS($1:35)),COLUMN()),\"\")","v":""},{"$f":"IFERROR(INDEX(Tableau_de_suivi[[N°]:[Clôturé]],SMALL(IF(Tableau_de_suivi[Clôturé]=\"OUI\",ROW(Tableau_de_suivi[Clôturé])-2),ROWS($1:35)),COLUMN()),\"\")","v":""},{"$f":"IFERROR(INDEX(Tableau_de_suivi[[N°]:[Clôturé]],SMALL(IF(Tableau_de_suivi[Clôturé]=\"OUI\",ROW(Tableau_de_suivi[Clôturé])-2),ROWS($1:35)),COLUMN()),\"\")","v":""},{"$f":"IFERROR(INDEX(Tableau_de_suivi[[N°]:[Clôturé]],SMALL(IF(Tableau_de_suivi[Clôturé]=\"OUI\",ROW(Tableau_de_suivi[Clôturé])-2),ROWS($1:35)),COLUMN()),\"\")","v":""},{"$f":"IFERROR(INDEX(Tableau_de_suivi[[N°]:[Clôturé]],SMALL(IF(Tableau_de_suivi[Clôturé]=\"OUI\",ROW(Tableau_de_suivi[Clôturé])-2),ROWS($1:35)),COLUMN()),\"\")","v":""}]
[{"$f":"IFERROR(INDEX(Tableau_de_suivi[[N°]:[Clôturé]],SMALL(IF(Tableau_de_suivi[Clôturé]=\"OUI\",ROW(Tableau_de_suivi[Clôturé])-2),ROWS($1:36)),COLUMN()),\"\")","v":""},{"$f":"IFERROR(INDEX(Tableau_de_suivi[[N°]:[Clôturé]],SMALL(IF(Tableau_de_suivi[Clôturé]=\"OUI\",ROW(Tableau_de_suivi[Clôturé])-2),ROWS($1:36)),COLUMN()),\"\")","v":""},{"$f":"IFERROR(INDEX(Tableau_de_suivi[[N°]:[Clôturé]],SMALL(IF(Tableau_de_suivi[Clôturé]=\"OUI\",ROW(Tableau_de_suivi[Clôturé])-2),ROWS($1:36)),COLUMN()),\"\")","v":""},{"$f":"IFERROR(INDEX(Tableau_de_suivi[[N°]:[Clôturé]],SMALL(IF(Tableau_de_suivi[Clôturé]=\"OUI\",ROW(Tableau_de_suivi[Clôturé])-2),ROWS($1:36)),COLUMN()),\"\")","v":""},{"$f":"IFERROR(INDEX(Tableau_de_suivi[[N°]:[Clôturé]],SMALL(IF(Tableau_de_suivi[Clôturé]=\"OUI\",ROW(Tableau_de_suivi[Clôturé])-2),ROWS($1:36)),COLUMN()),\"\")","v":""},{"$f":"IFERROR(INDEX(Tableau_de_suivi[[N°]:[Clôturé]],SMALL(IF(Tableau_de_suivi[Clôturé]=\"OUI\",ROW(Tableau_de_suivi[Clôturé])-2),ROWS($1:36)),COLUMN()),\"\")","v":""},{"$f":"IFERROR(INDEX(Tableau_de_suivi[[N°]:[Clôturé]],SMALL(IF(Tableau_de_suivi[Clôturé]=\"OUI\",ROW(Tableau_de_suivi[Clôturé])-2),ROWS($1:36)),COLUMN()),\"\")","v":""},{"$f":"IFERROR(INDEX(Tableau_de_suivi[[N°]:[Clôturé]],SMALL(IF(Tableau_de_suivi[Clôturé]=\"OUI\",ROW(Tableau_de_suivi[Clôturé])-2),ROWS($1:36)),COLUMN()),\"\")","v":""},{"$f":"IFERROR(INDEX(Tableau_de_suivi[[N°]:[Clôturé]],SMALL(IF(Tableau_de_suivi[Clôturé]=\"OUI\",ROW(Tableau_de_suivi[Clôturé])-2),ROWS($1:36)),COLUMN()),\"\")","v":""},{"$f":"IFERROR(INDEX(Tableau_de_suivi[[N°]:[Clôturé]],SMALL(IF(Tableau_de_suivi[Clôturé]=\"OUI\",ROW(Tableau_de_suivi[Clôturé])-2),ROWS($1:36)),COLUMN()),\"\")","v":""},{"$f":"IFERROR(INDEX(Tableau_de_suivi[[N°]:[Clôturé]],SMALL(IF(Tableau_de_suivi[Clôturé]=\"OUI\",ROW(Tableau_de_suivi[Clôturé])-2),ROWS($1:36)),COLUMN()),\"\")","v":""},{"$f":"IFERROR(INDEX(Tableau_de_suivi[[N°]:[Clôturé]],SMALL(IF(Tableau_de_suivi[Clôturé]=\"OUI\",ROW(Tableau_de_suivi[Clôturé])-2),ROWS($1:36)),COLUMN()),\"\")","v":""},{"$f":"IFERROR(INDEX(Tableau_de_suivi[[N°]:[Clôturé]],SMALL(IF(Tableau_de_suivi[Clôturé]=\"OUI\",ROW(Tableau_de_suivi[Clôturé])-2),ROWS($1:36)),COLUMN()),\"\")","v":""},{"$f":"IFERROR(INDEX(Tableau_de_suivi[[N°]:[Clôturé]],SMALL(IF(Tableau_de_suivi[Clôturé]=\"OUI\",ROW(Tableau_de_suivi[Clôturé])-2),ROWS($1:36)),COLUMN()),\"\")","v":""},{"$f":"IFERROR(INDEX(Tableau_de_suivi[[N°]:[Clôturé]],SMALL(IF(Tableau_de_suivi[Clôturé]=\"OUI\",ROW(Tableau_de_suivi[Clôturé])-2),ROWS($1:36)),COLUMN()),\"\")","v":""},{"$f":"IFERROR(INDEX(Tableau_de_suivi[[N°]:[Clôturé]],SMALL(IF(Tableau_de_suivi[Clôturé]=\"OUI\",ROW(Tableau_de_suivi[Clôturé])-2),ROWS($1:36)),COLUMN()),\"\")","v":""},{"$f":"IFERROR(INDEX(Tableau_de_suivi[[N°]:[Clôturé]],SMALL(IF(Tableau_de_suivi[Clôturé]=\"OUI\",ROW(Tableau_de_suivi[Clôturé])-2),ROWS($1:36)),COLUMN()),\"\")","v":""},{"$f":"IFERROR(INDEX(Tableau_de_suivi[[N°]:[Clôturé]],SMALL(IF(Tableau_de_suivi[Clôturé]=\"OUI\",ROW(Tableau_de_suivi[Clôturé])-2),ROWS($1:36)),COLUMN()),\"\")","v":""},{"$f":"IFERROR(INDEX(Tableau_de_suivi[[N°]:[Clôturé]],SMALL(IF(Tableau_de_suivi[Clôturé]=\"OUI\",ROW(Tableau_de_suivi[Clôturé])-2),ROWS($1:36)),COLUMN()),\"\")","v":""},{"$f":"IFERROR(INDEX(Tableau_de_suivi[[N°]:[Clôturé]],SMALL(IF(Tableau_de_suivi[Clôturé]=\"OUI\",ROW(Tableau_de_suivi[Clôturé])-2),ROWS($1:36)),COLUMN()),\"\")","v":""},{"$f":"IFERROR(INDEX(Tableau_de_suivi[[N°]:[Clôturé]],SMALL(IF(Tableau_de_suivi[Clôturé]=\"OUI\",ROW(Tableau_de_suivi[Clôturé])-2),ROWS($1:36)),COLUMN()),\"\")","v":""},{"$f":"IFERROR(INDEX(Tableau_de_suivi[[N°]:[Clôturé]],SMALL(IF(Tableau_de_suivi[Clôturé]=\"OUI\",ROW(Tableau_de_suivi[Clôturé])-2),ROWS($1:36)),COLUMN()),\"\")","v":""}]
[{"$f":"IFERROR(INDEX(Tableau_de_suivi[[N°]:[Clôturé]],SMALL(IF(Tableau_de_suivi[Clôturé]=\"OUI\",ROW(Tableau_de_suivi[Clôturé])-2),ROWS($1:37)),COLUMN()),\"\")","v":""},{"$f":"IFERROR(INDEX(Tableau_de_suivi[[N°]:[Clôturé]],SMALL(IF(Tableau_de_suivi[Clôturé]=\"OUI\",ROW(Tableau_de_suivi[Clôturé])-2),ROWS($1:37)),COLUMN()),\"\")","v":""},{"$f":"IFERROR(INDEX(Tableau_de_suivi[[N°]:[Clôturé]],SMALL(IF(Tableau_de_suivi[Clôturé]=\"OUI\",ROW(Tableau_de_suivi[Clôturé])-2),ROWS($1:37)),COLUMN()),\"\")","v":""},{"$f":"IFERROR(INDEX(Tableau_de_suivi[[N°]:[Clôturé]],SMALL(IF(Tableau_de_suivi[Clôturé]=\"OUI\",ROW(Tableau_de_suivi[Clôturé])-2),ROWS($1:37)),COLUMN()),\"\")","v":""},{"$f":"IFERROR(INDEX(Tableau_de_suivi[[N°]:[Clôturé]],SMALL(IF(Tableau_de_suivi[Clôturé]=\"OUI\",ROW(Tableau_de_suivi[Clôturé])-2),ROWS($1:37)),COLUMN()),\"\")","v":""},{"$f":"IFERROR(INDEX(Tableau_de_suivi[[N°]:[Clôturé]],SMALL(IF(Tableau_de_suivi[Clôturé]=\"OUI\",ROW(Tableau_de_suivi[Clôturé])-2),ROWS($1:37)),COLUMN()),\"\")","v":""},{"$f":"IFERROR(INDEX(Tableau_de_suivi[[N°]:[Clôturé]],SMALL(IF(Tableau_de_suivi[Clôturé]=\"OUI\",ROW(Tableau_de_suivi[Clôturé])-2),ROWS($1:37)),COLUMN()),\"\")","v":""},{"$f":"IFERROR(INDEX(Tableau_de_suivi[[N°]:[Clôturé]],SMALL(IF(Tableau_de_suivi[Clôturé]=\"OUI\",ROW(Tableau_de_suivi[Clôturé])-2),ROWS($1:37)),COLUMN()),\"\")","v":""},{"$f":"IFERROR(INDEX(Tableau_de_suivi[[N°]:[Clôturé]],SMALL(IF(Tableau_de_suivi[Clôturé]=\"OUI\",ROW(Tableau_de_suivi[Clôturé])-2),ROWS($1:37)),COLUMN()),\"\")","v":""},{"$f":"IFERROR(INDEX(Tableau_de_suivi[[N°]:[Clôturé]],SMALL(IF(Tableau_de_suivi[Clôturé]=\"OUI\",ROW(Tableau_de_suivi[Clôturé])-2),ROWS($1:37)),COLUMN()),\"\")","v":""},{"$f":"IFERROR(INDEX(Tableau_de_suivi[[N°]:[Clôturé]],SMALL(IF(Tableau_de_suivi[Clôturé]=\"OUI\",ROW(Tableau_de_suivi[Clôturé])-2),ROWS($1:37)),COLUMN()),\"\")","v":""},{"$f":"IFERROR(INDEX(Tableau_de_suivi[[N°]:[Clôturé]],SMALL(IF(Tableau_de_suivi[Clôturé]=\"OUI\",ROW(Tableau_de_suivi[Clôturé])-2),ROWS($1:37)),COLUMN()),\"\")","v":""},{"$f":"IFERROR(INDEX(Tableau_de_suivi[[N°]:[Clôturé]],SMALL(IF(Tableau_de_suivi[Clôturé]=\"OUI\",ROW(Tableau_de_suivi[Clôturé])-2),ROWS($1:37)),COLUMN()),\"\")","v":""},{"$f":"IFERROR(INDEX(Tableau_de_suivi[[N°]:[Clôturé]],SMALL(IF(Tableau_de_suivi[Clôturé]=\"OUI\",ROW(Tableau_de_suivi[Clôturé])-2),ROWS($1:37)),COLUMN()),\"\")","v":""},{"$f":"IFERROR(INDEX(Tableau_de_suivi[[N°]:[Clôturé]],SMALL(IF(Tableau_de_suivi[Clôturé]=\"OUI\",ROW(Tableau_de_suivi[Clôturé])-2),ROWS($1:37)),COLUMN()),\"\")","v":""},{"$f":"IFERROR(INDEX(Tableau_de_suivi[[N°]:[Clôturé]],SMALL(IF(Tableau_de_suivi[Clôturé]=\"OUI\",ROW(Tableau_de_suivi[Clôturé])-2),ROWS($1:37)),COLUMN()),\"\")","v":""},{"$f":"IFERROR(INDEX(Tableau_de_suivi[[N°]:[Clôturé]],SMALL(IF(Tableau_de_suivi[Clôturé]=\"OUI\",ROW(Tableau_de_suivi[Clôturé])-2),ROWS($1:37)),COLUMN()),\"\")","v":""},{"$f":"IFERROR(INDEX(Tableau_de_suivi[[N°]:[Clôturé]],SMALL(IF(Tableau_de_suivi[Clôturé]=\"OUI\",ROW(Tableau_de_suivi[Clôturé])-2),ROWS($1:37)),COLUMN()),\"\")","v":""},{"$f":"IFERROR(INDEX(Tableau_de_suivi[[N°]:[Clôturé]],SMALL(IF(Tableau_de_suivi[Clôturé]=\"OUI\",ROW(Tableau_de_suivi[Clôturé])-2),ROWS($1:37)),COLUMN()),\"\")","v":""},{"$f":"IFERROR(INDEX(Tableau_de_suivi[[N°]:[Clôturé]],SMALL(IF(Tableau_de_suivi[Clôturé]=\"OUI\",ROW(Tableau_de_suivi[Clôturé])-2),ROWS($1:37)),COLUMN()),\"\")","v":""},{"$f":"IFERROR(INDEX(Tableau_de_suivi[[N°]:[Clôturé]],SMALL(IF(Tableau_de_suivi[Clôturé]=\"OUI\",ROW(Tableau_de_suivi[Clôturé])-2),ROWS($1:37)),COLUMN()),\"\")","v":""},{"$f":"IFERROR(INDEX(Tableau_de_suivi[[N°]:[Clôturé]],SMALL(IF(Tableau_de_suivi[Clôturé]=\"OUI\",ROW(Tableau_de_suivi[Clôturé])-2),ROWS($1:37)),COLUMN()),\"\")","v":""}]
[{"$f":"IFERROR(INDEX(Tableau_de_suivi[[N°]:[Clôturé]],SMALL(IF(Tableau_de_suivi[Clôturé]=\"OUI\",ROW(Tableau_de_suivi[Clôturé])-2),ROWS($1:38)),COLUMN()),\"\")","v":""},{"$f":"IFERROR(INDEX(Tableau_de_suivi[[N°]:[Clôturé]],SMALL(IF(Tableau_de_suivi[Clôturé]=\"OUI\",ROW(Tableau_de_suivi[Clôturé])-2),ROWS($1:38)),COLUMN()),\"\")","v":""},{"$f":"IFERROR(INDEX(Tableau_de_suivi[[N°]:[Clôturé]],SMALL(IF(Tableau_de_suivi[Clôturé]=\"OUI\",ROW(Tableau_de_suivi[Clôturé])-2),ROWS($1:38)),COLUMN()),\"\")","v":""},{"$f":"IFERROR(INDEX(Tableau_de_suivi[[N°]:[Clôturé]],SMALL(IF(Tableau_de_suivi[Clôturé]=\"OUI\",ROW(Tableau_de_suivi[Clôturé])-2),ROWS($1:38)),COLUMN()),\"\")","v":""},{"$f":"IFERROR(INDEX(Tableau_de_suivi[[N°]:[Clôturé]],SMALL(IF(Tableau_de_suivi[Clôturé]=\"OUI\",ROW(Tableau_de_suivi[Clôturé])-2),ROWS($1:38)),COLUMN()),\"\")","v":""},{"$f":"IFERROR(INDEX(Tableau_de_suivi[[N°]:[Clôturé]],SMALL(IF(Tableau_de_suivi[Clôturé]=\"OUI\",ROW(Tableau_de_suivi[Clôturé])-2),ROWS($1:38)),COLUMN()),\"\")","v":""},{"$f":"IFERROR(INDEX(Tableau_de_suivi[[N°]:[Clôturé]],SMALL(IF(Tableau_de_suivi[Clôturé]=\"OUI\",ROW(Tableau_de_suivi[Clôturé])-2),ROWS($1:38)),COLUMN()),\"\")","v":""},{"$f":"IFERROR(INDEX(Tableau_de_suivi[[N°]:[Clôturé]],SMALL(IF(Tableau_de_suivi[Clôturé]=\"OUI\",ROW(Tableau_de_suivi[Clôturé])-2),ROWS($1:38)),COLUMN()),\"\")","v":""},{"$f":"IFERROR(INDEX(Tableau_de_suivi[[N°]:[Clôturé]],SMALL(IF(Tableau_de_suivi[Clôturé]=\"OUI\",ROW(Tableau_de_suivi[Clôturé])-2),ROWS($1:38)),COLUMN()),\"\")","v":""},{"$f":"IFERROR(INDEX(Tableau_de_suivi[[N°]:[Clôturé]],SMALL(IF(Tableau_de_suivi[Clôturé]=\"OUI\",ROW(Tableau_de_suivi[Clôturé])-2),ROWS($1:38)),COLUMN()),\"\")","v":""},{"$f":"IFERROR(INDEX(Tableau_de_suivi[[N°]:[Clôturé]],SMALL(IF(Tableau_de_suivi[Clôturé]=\"OUI\",ROW(Tableau_de_suivi[Clôturé])-2),ROWS($1:38)),COLUMN()),\"\")","v":""},{"$f":"IFERROR(INDEX(Tableau_de_suivi[[N°]:[Clôturé]],SMALL(IF(Tableau_de_suivi[Clôturé]=\"OUI\",ROW(Tableau_de_suivi[Clôturé])-2),ROWS($1:38)),COLUMN()),\"\")","v":""},{"$f":"IFERROR(INDEX(Tableau_de_suivi[[N°]:[Clôturé]],SMALL(IF(Tableau_de_suivi[Clôturé]=\"OUI\",ROW(Tableau_de_suivi[Clôturé])-2),ROWS($1:38)),COLUMN()),\"\")","v":""},{"$f":"IFERROR(INDEX(Tableau_de_suivi[[N°]:[Clôturé]],SMALL(IF(Tableau_de_suivi[Clôturé]=\"OUI\",ROW(Tableau_de_suivi[Clôturé])-2),ROWS($1:38)),COLUMN()),\"\")","v":""},{"$f":"IFERROR(INDEX(Tableau_de_suivi[[N°]:[Clôturé]],SMALL(IF(Tableau_de_suivi[Clôturé]=\"OUI\",ROW(Tableau_de_suivi[Clôturé])-2),ROWS($1:38)),COLUMN()),\"\")","v":""},{"$f":"IFERROR(INDEX(Tableau_de_suivi[[N°]:[Clôturé]],SMALL(IF(Tableau_de_suivi[Clôturé]=\"OUI\",ROW(Tableau_de_suivi[Clôturé])-2),ROWS($1:38)),COLUMN()),\"\")","v":""},{"$f":"IFERROR(INDEX(Tableau_de_suivi[[N°]:[Clôturé]],SMALL(IF(Tableau_de_suivi[Clôturé]=\"OUI\",ROW(Tableau_de_suivi[Clôturé])-2),ROWS($1:38)),COLUMN()),\"\")","v":""},{"$f":"IFERROR(INDEX(Tableau_de_suivi[[N°]:[Clôturé]],SMALL(IF(Tableau_de_suivi[Clôturé]=\"OUI\",ROW(Tableau_de_suivi[Clôturé])-2),ROWS($1:38)),COLUMN()),\"\")","v":""},{"$f":"IFERROR(INDEX(Tableau_de_suivi[[N°]:[Clôturé]],SMALL(IF(Tableau_de_suivi[Clôturé]=\"OUI\",ROW(Tableau_de_suivi[Clôturé])-2),ROWS($1:38)),COLUMN()),\"\")","v":""},{"$f":"IFERROR(INDEX(Tableau_de_suivi[[N°]:[Clôturé]],SMALL(IF(Tableau_de_suivi[Clôturé]=\"OUI\",ROW(Tableau_de_suivi[Clôturé])-2),ROWS($1:38)),COLUMN()),\"\")","v":""},{"$f":"IFERROR(INDEX(Tableau_de_suivi[[N°]:[Clôturé]],SMALL(IF(Tableau_de_suivi[Clôturé]=\"OUI\",ROW(Tableau_de_suivi[Clôturé])-2),ROWS($1:38)),COLUMN()),\"\")","v":""},{"$f":"IFERROR(INDEX(Tableau_de_suivi[[N°]:[Clôturé]],SMALL(IF(Tableau_de_suivi[Clôturé]=\"OUI\",ROW(Tableau_de_suivi[Clôturé])-2),ROWS($1:38)),COLUMN()),\"\")","v":""}]
[{"$f":"IFERROR(INDEX(Tableau_de_suivi[[N°]:[Clôturé]],SMALL(IF(Tableau_de_suivi[Clôturé]=\"OUI\",ROW(Tableau_de_suivi[Clôturé])-2),ROWS($1:39)),COLUMN()),\"\")","v":""},{"$f":"IFERROR(INDEX(Tableau_de_suivi[[N°]:[Clôturé]],SMALL(IF(Tableau_de_suivi[Clôturé]=\"OUI\",ROW(Tableau_de_suivi[Clôturé])-2),ROWS($1:39)),COLUMN()),\"\")","v":""},{"$f":"IFERROR(INDEX(Tableau_de_suivi[[N°]:[Clôturé]],SMALL(IF(Tableau_de_suivi[Clôturé]=\"OUI\",ROW(Tableau_de_suivi[Clôturé])-2),ROWS($1:39)),COLUMN()),\"\")","v":""},{"$f":"IFERROR(INDEX(Tableau_de_suivi[[N°]:[Clôturé]],SMALL(IF(Tableau_de_suivi[Clôturé]=\"OUI\",ROW(Tableau_de_suivi[Clôturé])-2),ROWS($1:39)),COLUMN()),\"\")","v":""},{"$f":"IFERROR(INDEX(Tableau_de_suivi[[N°]:[Clôturé]],SMALL(IF(Tableau_de_suivi[Clôturé]=\"OUI\",ROW(Tableau_de_suivi[Clôturé])-2),ROWS($1:39)),COLUMN()),\"\")","v":""},{"$f":"IFERROR(INDEX(Tableau_de_suivi[[N°]:[Clôturé]],SMALL(IF(Tableau_de_suivi[Clôturé]=\"OUI\",ROW(Tableau_de_suivi[Clôturé])-2),ROWS($1:39)),COLUMN()),\"\")","v":""},{"$f":"IFERROR(INDEX(Tableau_de_suivi[[N°]:[Clôturé]],SMALL(IF(Tableau_de_suivi[Clôturé]=\"OUI\",ROW(Tableau_de_suivi[Clôturé])-2),ROWS($1:39)),COLUMN()),\"\")","v":""},{"$f":"IFERROR(INDEX(Tableau_de_suivi[[N°]:[Clôturé]],SMALL(IF(Tableau_de_suivi[Clôturé]=\"OUI\",ROW(Tableau_de_suivi[Clôturé])-2),ROWS($1:39)),COLUMN()),\"\")","v":""},{"$f":"IFERROR(INDEX(Tableau_de_suivi[[N°]:[Clôturé]],SMALL(IF(Tableau_de_suivi[Clôturé]=\"OUI\",ROW(Tableau_de_suivi[Clôturé])-2),ROWS($1:39)),COLUMN()),\"\")","v":""},{"$f":"IFERROR(INDEX(Tableau_de_suivi[[N°]:[Clôturé]],SMALL(IF(Tableau_de_suivi[Clôturé]=\"OUI\",ROW(Tableau_de_suivi[Clôturé])-2),ROWS($1:39)),COLUMN()),\"\")","v":""},{"$f":"IFERROR(INDEX(Tableau_de_suivi[[N°]:[Clôturé]],SMALL(IF(Tableau_de_suivi[Clôturé]=\"OUI\",ROW(Tableau_de_suivi[Clôturé])-2),ROWS($1:39)),COLUMN()),\"\")","v":""},{"$f":"IFERROR(INDEX(Tableau_de_suivi[[N°]:[Clôturé]],SMALL(IF(Tableau_de_suivi[Clôturé]=\"OUI\",ROW(Tableau_de_suivi[Clôturé])-2),ROWS($1:39)),COLUMN()),\"\")","v":""},{"$f":"IFERROR(INDEX(Tableau_de_suivi[[N°]:[Clôturé]],SMALL(IF(Tableau_de_suivi[Clôturé]=\"OUI\",ROW(Tableau_de_suivi[Clôturé])-2),ROWS($1:39)),COLUMN()),\"\")","v":""},{"$f":"IFERROR(INDEX(Tableau_de_suivi[[N°]:[Clôturé]],SMALL(IF(Tableau_de_suivi[Clôturé]=\"OUI\",ROW(Tableau_de_suivi[Clôturé])-2),ROWS($1:39)),COLUMN()),\"\")","v":""},{"$f":"IFERROR(INDEX(Tableau_de_suivi[[N°]:[Clôturé]],SMALL(IF(Tableau_de_suivi[Clôturé]=\"OUI\",ROW(Tableau_de_suivi[Clôturé])-2),ROWS($1:39)),COLUMN()),\"\")","v":""},{"$f":"IFERROR(INDEX(Tableau_de_suivi[[N°]:[Clôturé]],SMALL(IF(Tableau_de_suivi[Clôturé]=\"OUI\",ROW(Tableau_de_suivi[Clôturé])-2),ROWS($1:39)),COLUMN()),\"\")","v":""},{"$f":"IFERROR(INDEX(Tableau_de_suivi[[N°]:[Clôturé]],SMALL(IF(Tableau_de_suivi[Clôturé]=\"OUI\",ROW(Tableau_de_suivi[Clôturé])-2),ROWS($1:39)),COLUMN()),\"\")","v":""},{"$f":"IFERROR(INDEX(Tableau_de_suivi[[N°]:[Clôturé]],SMALL(IF(Tableau_de_suivi[Clôturé]=\"OUI\",ROW(Tableau_de_suivi[Clôturé])-2),ROWS($1:39)),COLUMN()),\"\")","v":""},{"$f":"IFERROR(INDEX(Tableau_de_suivi[[N°]:[Clôturé]],SMALL(IF(Tableau_de_suivi[Clôturé]=\"OUI\",ROW(Tableau_de_suivi[Clôturé])-2),ROWS($1:39)),COLUMN()),\"\")","v":""},{"$f":"IFERROR(INDEX(Tableau_de_suivi[[N°]:[Clôturé]],SMALL(IF(Tableau_de_suivi[Clôturé]=\"OUI\",ROW(Tableau_de_suivi[Clôturé])-2),ROWS($1:39)),COLUMN()),\"\")","v":""},{"$f":"IFERROR(INDEX(Tableau_de_suivi[[N°]:[Clôturé]],SMALL(IF(Tableau_de_suivi[Clôturé]=\"OUI\",ROW(Tableau_de_suivi[Clôturé])-2),ROWS($1:39)),COLUMN()),\"\")","v":""},{"$f":"IFERROR(INDEX(Tableau_de_suivi[[N°]:[Clôturé]],SMALL(IF(Tableau_de_suivi[Clôturé]=\"OUI\",ROW(Tableau_de_suivi[Clôturé])-2),ROWS($1:39)),COLUMN()),\"\")","v":""}]
[{"$f":"IFERROR(INDEX(Tableau_de_suivi[[N°]:[Clôturé]],SMALL(IF(Tableau_de_suivi[Clôturé]=\"OUI\",ROW(Tableau_de_suivi[Clôturé])-2),ROWS($1:40)),COLUMN()),\"\")","v":""},{"$f":"IFERROR(INDEX(Tableau_de_suivi[[N°]:[Clôturé]],SMALL(IF(Tableau_de_suivi[Clôturé]=\"OUI\",ROW(Tableau_de_suivi[Clôturé])-2),ROWS($1:40)),COLUMN()),\"\")","v":""},{"$f":"IFERROR(INDEX(Tableau_de_suivi[[N°]:[Clôturé]],SMALL(IF(Tableau_de_suivi[Clôturé]=\"OUI\",ROW(Tableau_de_suivi[Clôturé])-2),ROWS($1:40)),COLUMN()),\"\")","v":""},{"$f":"IFERROR(INDEX(Tableau_de_suivi[[N°]:[Clôturé]],SMALL(IF(Tableau_de_suivi[Clôturé]=\"OUI\",ROW(Tableau_de_suivi[Clôturé])-2),ROWS($1:40)),COLUMN()),\"\")","v":""},{"$f":"IFERROR(INDEX(Tableau_de_suivi[[N°]:[Clôturé]],SMALL(IF(Tableau_de_suivi[Clôturé]=\"OUI\",ROW(Tableau_de_suivi[Clôturé])-2),ROWS($1:40)),COLUMN()),\"\")","v":""},{"$f":"IFERROR(INDEX(Tableau_de_suivi[[N°]:[Clôturé]],SMALL(IF(Tableau_de_suivi[Clôturé]=\"OUI\",ROW(Tableau_de_suivi[Clôturé])-2),ROWS($1:40)),COLUMN()),\"\")","v":""},{"$f":"IFERROR(INDEX(Tableau_de_suivi[[N°]:[Clôturé]],SMALL(IF(Tableau_de_suivi[Clôturé]=\"OUI\",ROW(Tableau_de_suivi[Clôturé])-2),ROWS($1:40)),COLUMN()),\"\")","v":""},{"$f":"IFERROR(INDEX(Tableau_de_suivi[[N°]:[Clôturé]],SMALL(IF(Tableau_de_suivi[Clôturé]=\"OUI\",ROW(Tableau_de_suivi[Clôturé])-2),ROWS($1:40)),COLUMN()),\"\")","v":""},{"$f":"IFERROR(INDEX(Tableau_de_suivi[[N°]:[Clôturé]],SMALL(IF(Tableau_de_suivi[Clôturé]=\"OUI\",ROW(Tableau_de_suivi[Clôturé])-2),ROWS($1:40)),COLUMN()),\"\")","v":""},{"$f":"IFERROR(INDEX(Tableau_de_suivi[[N°]:[Clôturé]],SMALL(IF(Tableau_de_suivi[Clôturé]=\"OUI\",ROW(Tableau_de_suivi[Clôturé])-2),ROWS($1:40)),COLUMN()),\"\")","v":""},{"$f":"IFERROR(INDEX(Tableau_de_suivi[[N°]:[Clôturé]],SMALL(IF(Tableau_de_suivi[Clôturé]=\"OUI\",ROW(Tableau_de_suivi[Clôturé])-2),ROWS($1:40)),COLUMN()),\"\")","v":""},{"$f":"IFERROR(INDEX(Tableau_de_suivi[[N°]:[Clôturé]],SMALL(IF(Tableau_de_suivi[Clôturé]=\"OUI\",ROW(Tableau_de_suivi[Clôturé])-2),ROWS($1:40)),COLUMN()),\"\")","v":""},{"$f":"IFERROR(INDEX(Tableau_de_suivi[[N°]:[Clôturé]],SMALL(IF(Tableau_de_suivi[Clôturé]=\"OUI\",ROW(Tableau_de_suivi[Clôturé])-2),ROWS($1:40)),COLUMN()),\"\")","v":""},{"$f":"IFERROR(INDEX(Tableau_de_suivi[[N°]:[Clôturé]],SMALL(IF(Tableau_de_suivi[Clôturé]=\"OUI\",ROW(Tableau_de_suivi[Clôturé])-2),ROWS($1:40)),COLUMN()),\"\")","v":""},{"$f":"IFERROR(INDEX(Tableau_de_suivi[[N°]:[Clôturé]],SMALL(IF(Tableau_de_suivi[Clôturé]=\"OUI\",ROW(Tableau_de_suivi[Clôturé])-2),ROWS($1:40)),COLUMN()),\"\")","v":""},{"$f":"IFERROR(INDEX(Tableau_de_suivi[[N°]:[Clôturé]],SMALL(IF(Tableau_de_suivi[Clôturé]=\"OUI\",ROW(Tableau_de_suivi[Clôturé])-2),ROWS($1:40)),COLUMN()),\"\")","v":""},{"$f":"IFERROR(INDEX(Tableau_de_suivi[[N°]:[Clôturé]],SMALL(IF(Tableau_de_suivi[Clôturé]=\"OUI\",ROW(Tableau_de_suivi[Clôturé])-2),ROWS($1:40)),COLUMN()),\"\")","v":""},{"$f":"IFERROR(INDEX(Tableau_de_suivi[[N°]:[Clôturé]],SMALL(IF(Tableau_de_suivi[Clôturé]=\"OUI\",ROW(Tableau_de_suivi[Clôturé])-2),ROWS($1:40)),COLUMN()),\"\")","v":""},{"$f":"IFERROR(INDEX(Tableau_de_suivi[[N°]:[Clôturé]],SMALL(IF(Tableau_de_suivi[Clôturé]=\"OUI\",ROW(Tableau_de_suivi[Clôturé])-2),ROWS($1:40)),COLUMN()),\"\")","v":""},{"$f":"IFERROR(INDEX(Tableau_de_suivi[[N°]:[Clôturé]],SMALL(IF(Tableau_de_suivi[Clôturé]=\"OUI\",ROW(Tableau_de_suivi[Clôturé])-2),ROWS($1:40)),COLUMN()),\"\")","v":""},{"$f":"IFERROR(INDEX(Tableau_de_suivi[[N°]:[Clôturé]],SMALL(IF(Tableau_de_suivi[Clôturé]=\"OUI\",ROW(Tableau_de_suivi[Clôturé])-2),ROWS($1:40)),COLUMN()),\"\")","v":""},{"$f":"IFERROR(INDEX(Tableau_de_suivi[[N°]:[Clôturé]],SMALL(IF(Tableau_de_suivi[Clôturé]=\"OUI\",ROW(Tableau_de_suivi[Clôturé])-2),ROWS($1:40)),COLUMN()),\"\")","v":""}]
[{"$f":"IFERROR(INDEX(Tableau_de_suivi[[N°]:[Clôturé]],SMALL(IF(Tableau_de_suivi[Clôturé]=\"OUI\",ROW(Tableau_de_suivi[Clôturé])-2),ROWS($1:41)),COLUMN()),\"\")","v":""},{"$f":"IFERROR(INDEX(Tableau_de_suivi[[N°]:[Clôturé]],SMALL(IF(Tableau_de_suivi[Clôturé]=\"OUI\",ROW(Tableau_de_suivi[Clôturé])-2),ROWS($1:41)),COLUMN()),\"\")","v":""},{"$f":"IFERROR(INDEX(Tableau_de_suivi[[N°]:[Clôturé]],SMALL(IF(Tableau_de_suivi[Clôturé]=\"OUI\",ROW(Tableau_de_suivi[Clôturé])-2),ROWS($1:41)),COLUMN()),\"\")","v":""},{"$f":"IFERROR(INDEX(Tableau_de_suivi[[N°]:[Clôturé]],SMALL(IF(Tableau_de_suivi[Clôturé]=\"OUI\",ROW(Tableau_de_suivi[Clôturé])-2),ROWS($1:41)),COLUMN()),\"\")","v":""},{"$f":"IFERROR(INDEX(Tableau_de_suivi[[N°]:[Clôturé]],SMALL(IF(Tableau_de_suivi[Clôturé]=\"OUI\",ROW(Tableau_de_suivi[Clôturé])-2),ROWS($1:41)),COLUMN()),\"\")","v":""},{"$f":"IFERROR(INDEX(Tableau_de_suivi[[N°]:[Clôturé]],SMALL(IF(Tableau_de_suivi[Clôturé]=\"OUI\",ROW(Tableau_de_suivi[Clôturé])-2),ROWS($1:41)),COLUMN()),\"\")","v":""},{"$f":"IFERROR(INDEX(Tableau_de_suivi[[N°]:[Clôturé]],SMALL(IF(Tableau_de_suivi[Clôturé]=\"OUI\",ROW(Tableau_de_suivi[Clôturé])-2),ROWS($1:41)),COLUMN()),\"\")","v":""},{"$f":"IFERROR(INDEX(Tableau_de_suivi[[N°]:[Clôturé]],SMALL(IF(Tableau_de_suivi[Clôturé]=\"OUI\",ROW(Tableau_de_suivi[Clôturé])-2),ROWS($1:41)),COLUMN()),\"\")","v":""},{"$f":"IFERROR(INDEX(Tableau_de_suivi[[N°]:[Clôturé]],SMALL(IF(Tableau_de_suivi[Clôturé]=\"OUI\",ROW(Tableau_de_suivi[Clôturé])-2),ROWS($1:41)),COLUMN()),\"\")","v":""},{"$f":"IFERROR(INDEX(Tableau_de_suivi[[N°]:[Clôturé]],SMALL(IF(Tableau_de_suivi[Clôturé]=\"OUI\",ROW(Tableau_de_suivi[Clôturé])-2),ROWS($1:41)),COLUMN()),\"\")","v":""},{"$f":"IFERROR(INDEX(Tableau_de_suivi[[N°]:[Clôturé]],SMALL(IF(Tableau_de_suivi[Clôturé]=\"OUI\",ROW(Tableau_de_suivi[Clôturé])-2),ROWS($1:41)),COLUMN()),\"\")","v":""},{"$f":"IFERROR(INDEX(Tableau_de_suivi[[N°]:[Clôturé]],SMALL(IF(Tableau_de_suivi[Clôturé]=\"OUI\",ROW(Tableau_de_suivi[Clôturé])-2),ROWS($1:41)),COLUMN()),\"\")","v":""},{"$f":"IFERROR(INDEX(Tableau_de_suivi[[N°]:[Clôturé]],SMALL(IF(Tableau_de_suivi[Clôturé]=\"OUI\",ROW(Tableau_de_suivi[Clôturé])-2),ROWS($1:41)),COLUMN()),\"\")","v":""},{"$f":"IFERROR(INDEX(Tableau_de_suivi[[N°]:[Clôturé]],SMALL(IF(Tableau_de_suivi[Clôturé]=\"OUI\",ROW(Tableau_de_suivi[Clôturé])-2),ROWS($1:41)),COLUMN()),\"\")","v":""},{"$f":"IFERROR(INDEX(Tableau_de_suivi[[N°]:[Clôturé]],SMALL(IF(Tableau_de_suivi[Clôturé]=\"OUI\",ROW(Tableau_de_suivi[Clôturé])-2),ROWS($1:41)),COLUMN()),\"\")","v":""},{"$f":"IFERROR(INDEX(Tableau_de_suivi[[N°]:[Clôturé]],SMALL(IF(Tableau_de_suivi[Clôturé]=\"OUI\",ROW(Tableau_de_suivi[Clôturé])-2),ROWS($1:41)),COLUMN()),\"\")","v":""},{"$f":"IFERROR(INDEX(Tableau_de_suivi[[N°]:[Clôturé]],SMALL(IF(Tableau_de_suivi[Clôturé]=\"OUI\",ROW(Tableau_de_suivi[Clôturé])-2),ROWS($1:41)),COLUMN()),\"\")","v":""},{"$f":"IFERROR(INDEX(Tableau_de_suivi[[N°]:[Clôturé]],SMALL(IF(Tableau_de_suivi[Clôturé]=\"OUI\",ROW(Tableau_de_suivi[Clôturé])-2),ROWS($1:41)),COLUMN()),\"\")","v":""},{"$f":"IFERROR(INDEX(Tableau_de_suivi[[N°]:[Clôturé]],SMALL(IF(Tableau_de_suivi[Clôturé]=\"OUI\",ROW(Tableau_de_suivi[Clôturé])-2),ROWS($1:41)),COLUMN()),\"\")","v":""},{"$f":"IFERROR(INDEX(Tableau_de_suivi[[N°]:[Clôturé]],SMALL(IF(Tableau_de_suivi[Clôturé]=\"OUI\",ROW(Tableau_de_suivi[Clôturé])-2),ROWS($1:41)),COLUMN()),\"\")","v":""},{"$f":"IFERROR(INDEX(Tableau_de_suivi[[N°]:[Clôturé]],SMALL(IF(Tableau_de_suivi[Clôturé]=\"OUI\",ROW(Tableau_de_suivi[Clôturé])-2),ROWS($1:41)),COLUMN()),\"\")","v":""},{"$f":"IFERROR(INDEX(Tableau_de_suivi[[N°]:[Clôturé]],SMALL(IF(Tableau_de_suivi[Clôturé]=\"OUI\",ROW(Tableau_de_suivi[Clôturé])-2),ROWS($1:41)),COLUMN()),\"\")","v":""}]
[{"$f":"IFERROR(INDEX(Tableau_de_suivi[[N°]:[Clôturé]],SMALL(IF(Tableau_de_suivi[Clôturé]=\"OUI\",ROW(Tableau_de_suivi[Clôturé])-2),ROWS($1:42)),COLUMN()),\"\")","v":""},{"$f":"IFERROR(INDEX(Tableau_de_suivi[[N°]:[Clôturé]],SMALL(IF(Tableau_de_suivi[Clôturé]=\"OUI\",ROW(Tableau_de_suivi[Clôturé])-2),ROWS($1:42)),COLUMN()),\"\")","v":""},{"$f":"IFERROR(INDEX(Tableau_de_suivi[[N°]:[Clôturé]],SMALL(IF(Tableau_de_suivi[Clôturé]=\"OUI\",ROW(Tableau_de_suivi[Clôturé])-2),ROWS($1:42)),COLUMN()),\"\")","v":""},{"$f":"IFERROR(INDEX(Tableau_de_suivi[[N°]:[Clôturé]],SMALL(IF(Tableau_de_suivi[Clôturé]=\"OUI\",ROW(Tableau_de_suivi[Clôturé])-2),ROWS($1:42)),COLUMN()),\"\")","v":""},{"$f":"IFERROR(INDEX(Tableau_de_suivi[[N°]:[Clôturé]],SMALL(IF(Tableau_de_suivi[Clôturé]=\"OUI\",ROW(Tableau_de_suivi[Clôturé])-2),ROWS($1:42)),COLUMN()),\"\")","v":""},{"$f":"IFERROR(INDEX(Tableau_de_suivi[[N°]:[Clôturé]],SMALL(IF(Tableau_de_suivi[Clôturé]=\"OUI\",ROW(Tableau_de_suivi[Clôturé])-2),ROWS($1:42)),COLUMN()),\"\")","v":""},{"$f":"IFERROR(INDEX(Tableau_de_suivi[[N°]:[Clôturé]],SMALL(IF(Tableau_de_suivi[Clôturé]=\"OUI\",ROW(Tableau_de_suivi[Clôturé])-2),ROWS($1:42)),COLUMN()),\"\")","v":""},{"$f":"IFERROR(INDEX(Tableau_de_suivi[[N°]:[Clôturé]],SMALL(IF(Tableau_de_suivi[Clôturé]=\"OUI\",ROW(Tableau_de_suivi[Clôturé])-2),ROWS($1:42)),COLUMN()),\"\")","v":""},{"$f":"IFERROR(INDEX(Tableau_de_suivi[[N°]:[Clôturé]],SMALL(IF(Tableau_de_suivi[Clôturé]=\"OUI\",ROW(Tableau_de_suivi[Clôturé])-2),ROWS($1:42)),COLUMN()),\"\")","v":""},{"$f":"IFERROR(INDEX(Tableau_de_suivi[[N°]:[Clôturé]],SMALL(IF(Tableau_de_suivi[Clôturé]=\"OUI\",ROW(Tableau_de_suivi[Clôturé])-2),ROWS($1:42)),COLUMN()),\"\")","v":""},{"$f":"IFERROR(INDEX(Tableau_de_suivi[[N°]:[Clôturé]],SMALL(IF(Tableau_de_suivi[Clôturé]=\"OUI\",ROW(Tableau_de_suivi[Clôturé])-2),ROWS($1:42)),COLUMN()),\"\")","v":""},{"$f":"IFERROR(INDEX(Tableau_de_suivi[[N°]:[Clôturé]],SMALL(IF(Tableau_de_suivi[Clôturé]=\"OUI\",ROW(Tableau_de_suivi[Clôturé])-2),ROWS($1:42)),COLUMN()),\"\")","v":""},{"$f":"IFERROR(INDEX(Tableau_de_suivi[[N°]:[Clôturé]],SMALL(IF(Tableau_de_suivi[Clôturé]=\"OUI\",ROW(Tableau_de_suivi[Clôturé])-2),ROWS($1:42)),COLUMN()),\"\")","v":""},{"$f":"IFERROR(INDEX(Tableau_de_suivi[[N°]:[Clôturé]],SMALL(IF(Tableau_de_suivi[Clôturé]=\"OUI\",ROW(Tableau_de_suivi[Clôturé])-2),ROWS($1:42)),COLUMN()),\"\")","v":""},{"$f":"IFERROR(INDEX(Tableau_de_suivi[[N°]:[Clôturé]],SMALL(IF(Tableau_de_suivi[Clôturé]=\"OUI\",ROW(Tableau_de_suivi[Clôturé])-2),ROWS($1:42)),COLUMN()),\"\")","v":""},{"$f":"IFERROR(INDEX(Tableau_de_suivi[[N°]:[Clôturé]],SMALL(IF(Tableau_de_suivi[Clôturé]=\"OUI\",ROW(Tableau_de_suivi[Clôturé])-2),ROWS($1:42)),COLUMN()),\"\")","v":""},{"$f":"IFERROR(INDEX(Tableau_de_suivi[[N°]:[Clôturé]],SMALL(IF(Tableau_de_suivi[Clôturé]=\"OUI\",ROW(Tableau_de_suivi[Clôturé])-2),ROWS($1:42)),COLUMN()),\"\")","v":""},{"$f":"IFERROR(INDEX(Tableau_de_suivi[[N°]:[Clôturé]],SMALL(IF(Tableau_de_suivi[Clôturé]=\"OUI\",ROW(Tableau_de_suivi[Clôturé])-2),ROWS($1:42)),COLUMN()),\"\")","v":""},{"$f":"IFERROR(INDEX(Tableau_de_suivi[[N°]:[Clôturé]],SMALL(IF(Tableau_de_suivi[Clôturé]=\"OUI\",ROW(Tableau_de_suivi[Clôturé])-2),ROWS($1:42)),COLUMN()),\"\")","v":""},{"$f":"IFERROR(INDEX(Tableau_de_suivi[[N°]:[Clôturé]],SMALL(IF(Tableau_de_suivi[Clôturé]=\"OUI\",ROW(Tableau_de_suivi[Clôturé])-2),ROWS($1:42)),COLUMN()),\"\")","v":""},{"$f":"IFERROR(INDEX(Tableau_de_suivi[[N°]:[Clôturé]],SMALL(IF(Tableau_de_suivi[Clôturé]=\"OUI\",ROW(Tableau_de_suivi[Clôturé])-2),ROWS($1:42)),COLUMN()),\"\")","v":""},{"$f":"IFERROR(INDEX(Tableau_de_suivi[[N°]:[Clôturé]],SMALL(IF(Tableau_de_suivi[Clôturé]=\"OUI\",ROW(Tableau_de_suivi[Clôturé])-2),ROWS($1:42)),COLUMN()),\"\")","v":""}]
[{"$f":"IFERROR(INDEX(Tableau_de_suivi[[N°]:[Clôturé]],SMALL(IF(Tableau_de_suivi[Clôturé]=\"OUI\",ROW(Tableau_de_suivi[Clôturé])-2),ROWS($1:43)),COLUMN()),\"\")","v":""},{"$f":"IFERROR(INDEX(Tableau_de_suivi[[N°]:[Clôturé]],SMALL(IF(Tableau_de_suivi[Clôturé]=\"OUI\",ROW(Tableau_de_suivi[Clôturé])-2),ROWS($1:43)),COLUMN()),\"\")","v":""},{"$f":"IFERROR(INDEX(Tableau_de_suivi[[N°]:[Clôturé]],SMALL(IF(Tableau_de_suivi[Clôturé]=\"OUI\",ROW(Tableau_de_suivi[Clôturé])-2),ROWS($1:43)),COLUMN()),\"\")","v":""},{"$f":"IFERROR(INDEX(Tableau_de_suivi[[N°]:[Clôturé]],SMALL(IF(Tableau_de_suivi[Clôturé]=\"OUI\",ROW(Tableau_de_suivi[Clôturé])-2),ROWS($1:43)),COLUMN()),\"\")","v":""},{"$f":"IFERROR(INDEX(Tableau_de_suivi[[N°]:[Clôturé]],SMALL(IF(Tableau_de_suivi[Clôturé]=\"OUI\",ROW(Tableau_de_suivi[Clôturé])-2),ROWS($1:43)),COLUMN()),\"\")","v":""},{"$f":"IFERROR(INDEX(Tableau_de_suivi[[N°]:[Clôturé]],SMALL(IF(Tableau_de_suivi[Clôturé]=\"OUI\",ROW(Tableau_de_suivi[Clôturé])-2),ROWS($1:43)),COLUMN()),\"\")","v":""},{"$f":"IFERROR(INDEX(Tableau_de_suivi[[N°]:[Clôturé]],SMALL(IF(Tableau_de_suivi[Clôturé]=\"OUI\",ROW(Tableau_de_suivi[Clôturé])-2),ROWS($1:43)),COLUMN()),\"\")","v":""},{"$f":"IFERROR(INDEX(Tableau_de_suivi[[N°]:[Clôturé]],SMALL(IF(Tableau_de_suivi[Clôturé]=\"OUI\",ROW(Tableau_de_suivi[Clôturé])-2),ROWS($1:43)),COLUMN()),\"\")","v":""},{"$f":"IFERROR(INDEX(Tableau_de_suivi[[N°]:[Clôturé]],SMALL(IF(Tableau_de_suivi[Clôturé]=\"OUI\",ROW(Tableau_de_suivi[Clôturé])-2),ROWS($1:43)),COLUMN()),\"\")","v":""},{"$f":"IFERROR(INDEX(Tableau_de_suivi[[N°]:[Clôturé]],SMALL(IF(Tableau_de_suivi[Clôturé]=\"OUI\",ROW(Tableau_de_suivi[Clôturé])-2),ROWS($1:43)),COLUMN()),\"\")","v":""},{"$f":"IFERROR(INDEX(Tableau_de_suivi[[N°]:[Clôturé]],SMALL(IF(Tableau_de_suivi[Clôturé]=\"OUI\",ROW(Tableau_de_suivi[Clôturé])-2),ROWS($1:43)),COLUMN()),\"\")","v":""},{"$f":"IFERROR(INDEX(Tableau_de_suivi[[N°]:[Clôturé]],SMALL(IF(Tableau_de_suivi[Clôturé]=\"OUI\",ROW(Tableau_de_suivi[Clôturé])-2),ROWS($1:43)),COLUMN()),\"\")","v":""},{"$f":"IFERROR(INDEX(Tableau_de_suivi[[N°]:[Clôturé]],SMALL(IF(Tableau_de_suivi[Clôturé]=\"OUI\",ROW(Tableau_de_suivi[Clôturé])-2),ROWS($1:43)),COLUMN()),\"\")","v":""},{"$f":"IFERROR(INDEX(Tableau_de_suivi[[N°]:[Clôturé]],SMALL(IF(Tableau_de_suivi[Clôturé]=\"OUI\",ROW(Tableau_de_suivi[Clôturé])-2),ROWS($1:43)),COLUMN()),\"\")","v":""},{"$f":"IFERROR(INDEX(Tableau_de_suivi[[N°]:[Clôturé]],SMALL(IF(Tableau_de_suivi[Clôturé]=\"OUI\",ROW(Tableau_de_suivi[Clôturé])-2),ROWS($1:43)),COLUMN()),\"\")","v":""},{"$f":"IFERROR(INDEX(Tableau_de_suivi[[N°]:[Clôturé]],SMALL(IF(Tableau_de_suivi[Clôturé]=\"OUI\",ROW(Tableau_de_suivi[Clôturé])-2),ROWS($1:43)),COLUMN()),\"\")","v":""},{"$f":"IFERROR(INDEX(Tableau_de_suivi[[N°]:[Clôturé]],SMALL(IF(Tableau_de_suivi[Clôturé]=\"OUI\",ROW(Tableau_de_suivi[Clôturé])-2),ROWS($1:43)),COLUMN()),\"\")","v":""},{"$f":"IFERROR(INDEX(Tableau_de_suivi[[N°]:[Clôturé]],SMALL(IF(Tableau_de_suivi[Clôturé]=\"OUI\",ROW(Tableau_de_suivi[Clôturé])-2),ROWS($1:43)),COLUMN()),\"\")","v":""},{"$f":"IFERROR(INDEX(Tableau_de_suivi[[N°]:[Clôturé]],SMALL(IF(Tableau_de_suivi[Clôturé]=\"OUI\",ROW(Tableau_de_suivi[Clôturé])-2),ROWS($1:43)),COLUMN()),\"\")","v":""},{"$f":"IFERROR(INDEX(Tableau_de_suivi[[N°]:[Clôturé]],SMALL(IF(Tableau_de_suivi[Clôturé]=\"OUI\",ROW(Tableau_de_suivi[Clôturé])-2),ROWS($1:43)),COLUMN()),\"\")","v":""},{"$f":"IFERROR(INDEX(Tableau_de_suivi[[N°]:[Clôturé]],SMALL(IF(Tableau_de_suivi[Clôturé]=\"OUI\",ROW(Tableau_de_suivi[Clôturé])-2),ROWS($1:43)),COLUMN()),\"\")","v":""},{"$f":"IFERROR(INDEX(Tableau_de_suivi[[N°]:[Clôturé]],SMALL(IF(Tableau_de_suivi[Clôturé]=\"OUI\",ROW(Tableau_de_suivi[Clôturé])-2),ROWS($1:43)),COLUMN()),\"\")","v":""}]
[{"$f":"IFERROR(INDEX(Tableau_de_suivi[[N°]:[Clôturé]],SMALL(IF(Tableau_de_suivi[Clôturé]=\"OUI\",ROW(Tableau_de_suivi[Clôturé])-2),ROWS($1:44)),COLUMN()),\"\")","v":""},{"$f":"IFERROR(INDEX(Tableau_de_suivi[[N°]:[Clôturé]],SMALL(IF(Tableau_de_suivi[Clôturé]=\"OUI\",ROW(Tableau_de_suivi[Clôturé])-2),ROWS($1:44)),COLUMN()),\"\")","v":""},{"$f":"IFERROR(INDEX(Tableau_de_suivi[[N°]:[Clôturé]],SMALL(IF(Tableau_de_suivi[Clôturé]=\"OUI\",ROW(Tableau_de_suivi[Clôturé])-2),ROWS($1:44)),COLUMN()),\"\")","v":""},{"$f":"IFERROR(INDEX(Tableau_de_suivi[[N°]:[Clôturé]],SMALL(IF(Tableau_de_suivi[Clôturé]=\"OUI\",ROW(Tableau_de_suivi[Clôturé])-2),ROWS($1:44)),COLUMN()),\"\")","v":""},{"$f":"IFERROR(INDEX(Tableau_de_suivi[[N°]:[Clôturé]],SMALL(IF(Tableau_de_suivi[Clôturé]=\"OUI\",ROW(Tableau_de_suivi[Clôturé])-2),ROWS($1:44)),COLUMN()),\"\")","v":""},{"$f":"IFERROR(INDEX(Tableau_de_suivi[[N°]:[Clôturé]],SMALL(IF(Tableau_de_suivi[Clôturé]=\"OUI\",ROW(Tableau_de_suivi[Clôturé])-2),ROWS($1:44)),COLUMN()),\"\")","v":""},{"$f":"IFERROR(INDEX(Tableau_de_suivi[[N°]:[Clôturé]],SMALL(IF(Tableau_de_suivi[Clôturé]=\"OUI\",ROW(Tableau_de_suivi[Clôturé])-2),ROWS($1:44)),COLUMN()),\"\")","v":""},{"$f":"IFERROR(INDEX(Tableau_de_suivi[[N°]:[Clôturé]],SMALL(IF(Tableau_de_suivi[Clôturé]=\"OUI\",ROW(Tableau_de_suivi[Clôturé])-2),ROWS($1:44)),COLUMN()),\"\")","v":""},{"$f":"IFERROR(INDEX(Tableau_de_suivi[[N°]:[Clôturé]],SMALL(IF(Tableau_de_suivi[Clôturé]=\"OUI\",ROW(Tableau_de_suivi[Clôturé])-2),ROWS($1:44)),COLUMN()),\"\")","v":""},{"$f":"IFERROR(INDEX(Tableau_de_suivi[[N°]:[Clôturé]],SMALL(IF(Tableau_de_suivi[Clôturé]=\"OUI\",ROW(Tableau_de_suivi[Clôturé])-2),ROWS($1:44)),COLUMN()),\"\")","v":""},{"$f":"IFERROR(INDEX(Tableau_de_suivi[[N°]:[Clôturé]],SMALL(IF(Tableau_de_suivi[Clôturé]=\"OUI\",ROW(Tableau_de_suivi[Clôturé])-2),ROWS($1:44)),COLUMN()),\"\")","v":""},{"$f":"IFERROR(INDEX(Tableau_de_suivi[[N°]:[Clôturé]],SMALL(IF(Tableau_de_suivi[Clôturé]=\"OUI\",ROW(Tableau_de_suivi[Clôturé])-2),ROWS($1:44)),COLUMN()),\"\")","v":""},{"$f":"IFERROR(INDEX(Tableau_de_suivi[[N°]:[Clôturé]],SMALL(IF(Tableau_de_suivi[Clôturé]=\"OUI\",ROW(Tableau_de_suivi[Clôturé])-2),ROWS($1:44)),COLUMN()),\"\")","v":""},{"$f":"IFERROR(INDEX(Tableau_de_suivi[[N°]:[Clôturé]],SMALL(IF(Tableau_de_suivi[Clôturé]=\"OUI\",ROW(Tableau_de_suivi[Clôturé])-2),ROWS($1:44)),COLUMN()),\"\")","v":""},{"$f":"IFERROR(INDEX(Tableau_de_suivi[[N°]:[Clôturé]],SMALL(IF(Tableau_de_suivi[Clôturé]=\"OUI\",ROW(Tableau_de_suivi[Clôturé])-2),ROWS($1:44)),COLUMN()),\"\")","v":""},{"$f":"IFERROR(INDEX(Tableau_de_suivi[[N°]:[Clôturé]],SMALL(IF(Tableau_de_suivi[Clôturé]=\"OUI\",ROW(Tableau_de_suivi[Clôturé])-2),ROWS($1:44)),COLUMN()),\"\")","v":""},{"$f":"IFERROR(INDEX(Tableau_de_suivi[[N°]:[Clôturé]],SMALL(IF(Tableau_de_suivi[Clôturé]=\"OUI\",ROW(Tableau_de_suivi[Clôturé])-2),ROWS($1:44)),COLUMN()),\"\")","v":""},{"$f":"IFERROR(INDEX(Tableau_de_suivi[[N°]:[Clôturé]],SMALL(IF(Tableau_de_suivi[Clôturé]=\"OUI\",ROW(Tableau_de_suivi[Clôturé])-2),ROWS($1:44)),COLUMN()),\"\")","v":""},{"$f":"IFERROR(INDEX(Tableau_de_suivi[[N°]:[Clôturé]],SMALL(IF(Tableau_de_suivi[Clôturé]=\"OUI\",ROW(Tableau_de_suivi[Clôturé])-2),ROWS($1:44)),COLUMN()),\"\")","v":""},{"$f":"IFERROR(INDEX(Tableau_de_suivi[[N°]:[Clôturé]],SMALL(IF(Tableau_de_suivi[Clôturé]=\"OUI\",ROW(Tableau_de_suivi[Clôturé])-2),ROWS($1:44)),COLUMN()),\"\")","v":""},{"$f":"IFERROR(INDEX(Tableau_de_suivi[[N°]:[Clôturé]],SMALL(IF(Tableau_de_suivi[Clôturé]=\"OUI\",ROW(Tableau_de_suivi[Clôturé])-2),ROWS($1:44)),COLUMN()),\"\")","v":""},{"$f":"IFERROR(INDEX(Tableau_de_suivi[[N°]:[Clôturé]],SMALL(IF(Tableau_de_suivi[Clôturé]=\"OUI\",ROW(Tableau_de_suivi[Clôturé])-2),ROWS($1:44)),COLUMN()),\"\")","v":""}]
[{"$f":"IFERROR(INDEX(Tableau_de_suivi[[N°]:[Clôturé]],SMALL(IF(Tableau_de_suivi[Clôturé]=\"OUI\",ROW(Tableau_de_suivi[Clôturé])-2),ROWS($1:45)),COLUMN()),\"\")","v":""},{"$f":"IFERROR(INDEX(Tableau_de_suivi[[N°]:[Clôturé]],SMALL(IF(Tableau_de_suivi[Clôturé]=\"OUI\",ROW(Tableau_de_suivi[Clôturé])-2),ROWS($1:45)),COLUMN()),\"\")","v":""},{"$f":"IFERROR(INDEX(Tableau_de_suivi[[N°]:[Clôturé]],SMALL(IF(Tableau_de_suivi[Clôturé]=\"OUI\",ROW(Tableau_de_suivi[Clôturé])-2),ROWS($1:45)),COLUMN()),\"\")","v":""},{"$f":"IFERROR(INDEX(Tableau_de_suivi[[N°]:[Clôturé]],SMALL(IF(Tableau_de_suivi[Clôturé]=\"OUI\",ROW(Tableau_de_suivi[Clôturé])-2),ROWS($1:45)),COLUMN()),\"\")","v":""},{"$f":"IFERROR(INDEX(Tableau_de_suivi[[N°]:[Clôturé]],SMALL(IF(Tableau_de_suivi[Clôturé]=\"OUI\",ROW(Tableau_de_suivi[Clôturé])-2),ROWS($1:45)),COLUMN()),\"\")","v":""},{"$f":"IFERROR(INDEX(Tableau_de_suivi[[N°]:[Clôturé]],SMALL(IF(Tableau_de_suivi[Clôturé]=\"OUI\",ROW(Tableau_de_suivi[Clôturé])-2),ROWS($1:45)),COLUMN()),\"\")","v":""},{"$f":"IFERROR(INDEX(Tableau_de_suivi[[N°]:[Clôturé]],SMALL(IF(Tableau_de_suivi[Clôturé]=\"OUI\",ROW(Tableau_de_suivi[Clôturé])-2),ROWS($1:45)),COLUMN()),\"\")","v":""},{"$f":"IFERROR(INDEX(Tableau_de_suivi[[N°]:[Clôturé]],SMALL(IF(Tableau_de_suivi[Clôturé]=\"OUI\",ROW(Tableau_de_suivi[Clôturé])-2),ROWS($1:45)),COLUMN()),\"\")","v":""},{"$f":"IFERROR(INDEX(Tableau_de_suivi[[N°]:[Clôturé]],SMALL(IF(Tableau_de_suivi[Clôturé]=\"OUI\",ROW(Tableau_de_suivi[Clôturé])-2),ROWS($1:45)),COLUMN()),\"\")","v":""},{"$f":"IFERROR(INDEX(Tableau_de_suivi[[N°]:[Clôturé]],SMALL(IF(Tableau_de_suivi[Clôturé]=\"OUI\",ROW(Tableau_de_suivi[Clôturé])-2),ROWS($1:45)),COLUMN()),\"\")","v":""},{"$f":"IFERROR(INDEX(Tableau_de_suivi[[N°]:[Clôturé]],SMALL(IF(Tableau_de_suivi[Clôturé]=\"OUI\",ROW(Tableau_de_suivi[Clôturé])-2),ROWS($1:45)),COLUMN()),\"\")","v":""},{"$f":"IFERROR(INDEX(Tableau_de_suivi[[N°]:[Clôturé]],SMALL(IF(Tableau_de_suivi[Clôturé]=\"OUI\",ROW(Tableau_de_suivi[Clôturé])-2),ROWS($1:45)),COLUMN()),\"\")","v":""},{"$f":"IFERROR(INDEX(Tableau_de_suivi[[N°]:[Clôturé]],SMALL(IF(Tableau_de_suivi[Clôturé]=\"OUI\",ROW(Tableau_de_suivi[Clôturé])-2),ROWS($1:45)),COLUMN()),\"\")","v":""},{"$f":"IFERROR(INDEX(Tableau_de_suivi[[N°]:[Clôturé]],SMALL(IF(Tableau_de_suivi[Clôturé]=\"OUI\",ROW(Tableau_de_suivi[Clôturé])-2),ROWS($1:45)),COLUMN()),\"\")","v":""},{"$f":"IFERROR(INDEX(Tableau_de_suivi[[N°]:[Clôturé]],SMALL(IF(Tableau_de_suivi[Clôturé]=\"OUI\",ROW(Tableau_de_suivi[Clôturé])-2),ROWS($1:45)),COLUMN()),\"\")","v":""},{"$f":"IFERROR(INDEX(Tableau_de_suivi[[N°]:[Clôturé]],SMALL(IF(Tableau_de_suivi[Clôturé]=\"OUI\",ROW(Tableau_de_suivi[Clôturé])-2),ROWS($1:45)),COLUMN()),\"\")","v":""},{"$f":"IFERROR(INDEX(Tableau_de_suivi[[N°]:[Clôturé]],SMALL(IF(Tableau_de_suivi[Clôturé]=\"OUI\",ROW(Tableau_de_suivi[Clôturé])-2),ROWS($1:45)),COLUMN()),\"\")","v":""},{"$f":"IFERROR(INDEX(Tableau_de_suivi[[N°]:[Clôturé]],SMALL(IF(Tableau_de_suivi[Clôturé]=\"OUI\",ROW(Tableau_de_suivi[Clôturé])-2),ROWS($1:45)),COLUMN()),\"\")","v":""},{"$f":"IFERROR(INDEX(Tableau_de_suivi[[N°]:[Clôturé]],SMALL(IF(Tableau_de_suivi[Clôturé]=\"OUI\",ROW(Tableau_de_suivi[Clôturé])-2),ROWS($1:45)),COLUMN()),\"\")","v":""},{"$f":"IFERROR(INDEX(Tableau_de_suivi[[N°]:[Clôturé]],SMALL(IF(Tableau_de_suivi[Clôturé]=\"OUI\",ROW(Tableau_de_suivi[Clôturé])-2),ROWS($1:45)),COLUMN()),\"\")","v":""},{"$f":"IFERROR(INDEX(Tableau_de_suivi[[N°]:[Clôturé]],SMALL(IF(Tableau_de_suivi[Clôturé]=\"OUI\",ROW(Tableau_de_suivi[Clôturé])-2),ROWS($1:45)),COLUMN()),\"\")","v":""},{"$f":"IFERROR(INDEX(Tableau_de_suivi[[N°]:[Clôturé]],SMALL(IF(Tableau_de_suivi[Clôturé]=\"OUI\",ROW(Tableau_de_suivi[Clôturé])-2),ROWS($1:45)),COLUMN()),\"\")","v":""}]
[{"$f":"IFERROR(INDEX(Tableau_de_suivi[[N°]:[Clôturé]],SMALL(IF(Tableau_de_suivi[Clôturé]=\"OUI\",ROW(Tableau_de_suivi[Clôturé])-2),ROWS($1:46)),COLUMN()),\"\")","v":""},{"$f":"IFERROR(INDEX(Tableau_de_suivi[[N°]:[Clôturé]],SMALL(IF(Tableau_de_suivi[Clôturé]=\"OUI\",ROW(Tableau_de_suivi[Clôturé])-2),ROWS($1:46)),COLUMN()),\"\")","v":""},{"$f":"IFERROR(INDEX(Tableau_de_suivi[[N°]:[Clôturé]],SMALL(IF(Tableau_de_suivi[Clôturé]=\"OUI\",ROW(Tableau_de_suivi[Clôturé])-2),ROWS($1:46)),COLUMN()),\"\")","v":""},{"$f":"IFERROR(INDEX(Tableau_de_suivi[[N°]:[Clôturé]],SMALL(IF(Tableau_de_suivi[Clôturé]=\"OUI\",ROW(Tableau_de_suivi[Clôturé])-2),ROWS($1:46)),COLUMN()),\"\")","v":""},{"$f":"IFERROR(INDEX(Tableau_de_suivi[[N°]:[Clôturé]],SMALL(IF(Tableau_de_suivi[Clôturé]=\"OUI\",ROW(Tableau_de_suivi[Clôturé])-2),ROWS($1:46)),COLUMN()),\"\")","v":""},{"$f":"IFERROR(INDEX(Tableau_de_suivi[[N°]:[Clôturé]],SMALL(IF(Tableau_de_suivi[Clôturé]=\"OUI\",ROW(Tableau_de_suivi[Clôturé])-2),ROWS($1:46)),COLUMN()),\"\")","v":""},{"$f":"IFERROR(INDEX(Tableau_de_suivi[[N°]:[Clôturé]],SMALL(IF(Tableau_de_suivi[Clôturé]=\"OUI\",ROW(Tableau_de_suivi[Clôturé])-2),ROWS($1:46)),COLUMN()),\"\")","v":""},{"$f":"IFERROR(INDEX(Tableau_de_suivi[[N°]:[Clôturé]],SMALL(IF(Tableau_de_suivi[Clôturé]=\"OUI\",ROW(Tableau_de_suivi[Clôturé])-2),ROWS($1:46)),COLUMN()),\"\")","v":""},{"$f":"IFERROR(INDEX(Tableau_de_suivi[[N°]:[Clôturé]],SMALL(IF(Tableau_de_suivi[Clôturé]=\"OUI\",ROW(Tableau_de_suivi[Clôturé])-2),ROWS($1:46)),COLUMN()),\"\")","v":""},{"$f":"IFERROR(INDEX(Tableau_de_suivi[[N°]:[Clôturé]],SMALL(IF(Tableau_de_suivi[Clôturé]=\"OUI\",ROW(Tableau_de_suivi[Clôturé])-2),ROWS($1:46)),COLUMN()),\"\")","v":""},{"$f":"IFERROR(INDEX(Tableau_de_suivi[[N°]:[Clôturé]],SMALL(IF(Tableau_de_suivi[Clôturé]=\"OUI\",ROW(Tableau_de_suivi[Clôturé])-2),ROWS($1:46)),COLUMN()),\"\")","v":""},{"$f":"IFERROR(INDEX(Tableau_de_suivi[[N°]:[Clôturé]],SMALL(IF(Tableau_de_suivi[Clôturé]=\"OUI\",ROW(Tableau_de_suivi[Clôturé])-2),ROWS($1:46)),COLUMN()),\"\")","v":""},{"$f":"IFERROR(INDEX(Tableau_de_suivi[[N°]:[Clôturé]],SMALL(IF(Tableau_de_suivi[Clôturé]=\"OUI\",ROW(Tableau_de_suivi[Clôturé])-2),ROWS($1:46)),COLUMN()),\"\")","v":""},{"$f":"IFERROR(INDEX(Tableau_de_suivi[[N°]:[Clôturé]],SMALL(IF(Tableau_de_suivi[Clôturé]=\"OUI\",ROW(Tableau_de_suivi[Clôturé])-2),ROWS($1:46)),COLUMN()),\"\")","v":""},{"$f":"IFERROR(INDEX(Tableau_de_suivi[[N°]:[Clôturé]],SMALL(IF(Tableau_de_suivi[Clôturé]=\"OUI\",ROW(Tableau_de_suivi[Clôturé])-2),ROWS($1:46)),COLUMN()),\"\")","v":""},{"$f":"IFERROR(INDEX(Tableau_de_suivi[[N°]:[Clôturé]],SMALL(IF(Tableau_de_suivi[Clôturé]=\"OUI\",ROW(Tableau_de_suivi[Clôturé])-2),ROWS($1:46)),COLUMN()),\"\")","v":""},{"$f":"IFERROR(INDEX(Tableau_de_suivi[[N°]:[Clôturé]],SMALL(IF(Tableau_de_suivi[Clôturé]=\"OUI\",ROW(Tableau_de_suivi[Clôturé])-2),ROWS($1:46)),COLUMN()),\"\")","v":""},{"$f":"IFERROR(INDEX(Tableau_de_suivi[[N°]:[Clôturé]],SMALL(IF(Tableau_de_suivi[Clôturé]=\"OUI\",ROW(Tableau_de_suivi[Clôturé])-2),ROWS($1:46)),COLUMN()),\"\")","v":""},{"$f":"IFERROR(INDEX(Tableau_de_suivi[[N°]:[Clôturé]],SMALL(IF(Tableau_de_suivi[Clôturé]=\"OUI\",ROW(Tableau_de_suivi[Clôturé])-2),ROWS($1:46)),COLUMN()),\"\")","v":""},{"$f":"IFERROR(INDEX(Tableau_de_suivi[[N°]:[Clôturé]],SMALL(IF(Tableau_de_suivi[Clôturé]=\"OUI\",ROW(Tableau_de_suivi[Clôturé])-2),ROWS($1:46)),COLUMN()),\"\")","v":""},{"$f":"IFERROR(INDEX(Tableau_de_suivi[[N°]:[Clôturé]],SMALL(IF(Tableau_de_suivi[Clôturé]=\"OUI\",ROW(Tableau_de_suivi[Clôturé])-2),ROWS($1:46)),COLUMN()),\"\")","v":""},{"$f":"IFERROR(INDEX(Tableau_de_suivi[[N°]:[Clôturé]],SMALL(IF(Tableau_de_suivi[Clôturé]=\"OUI\",ROW(Tableau_de_suivi[Clôturé])-2),ROWS($1:46)),COLUMN()),\"\")","v":""}]
[{"$f":"IFERROR(INDEX(Tableau_de_suivi[[N°]:[Clôturé]],SMALL(IF(Tableau_de_suivi[Clôturé]=\"OUI\",ROW(Tableau_de_suivi[Clôturé])-2),ROWS($1:47)),COLUMN()),\"\")","v":""},{"$f":"IFERROR(INDEX(Tableau_de_suivi[[N°]:[Clôturé]],SMALL(IF(Tableau_de_suivi[Clôturé]=\"OUI\",ROW(Tableau_de_suivi[Clôturé])-2),ROWS($1:47)),COLUMN()),\"\")","v":""},{"$f":"IFERROR(INDEX(Tableau_de_suivi[[N°]:[Clôturé]],SMALL(IF(Tableau_de_suivi[Clôturé]=\"OUI\",ROW(Tableau_de_suivi[Clôturé])-2),ROWS($1:47)),COLUMN()),\"\")","v":""},{"$f":"IFERROR(INDEX(Tableau_de_suivi[[N°]:[Clôturé]],SMALL(IF(Tableau_de_suivi[Clôturé]=\"OUI\",ROW(Tableau_de_suivi[Clôturé])-2),ROWS($1:47)),COLUMN()),\"\")","v":""},{"$f":"IFERROR(INDEX(Tableau_de_suivi[[N°]:[Clôturé]],SMALL(IF(Tableau_de_suivi[Clôturé]=\"OUI\",ROW(Tableau_de_suivi[Clôturé])-2),ROWS($1:47)),COLUMN()),\"\")","v":""},{"$f":"IFERROR(INDEX(Tableau_de_suivi[[N°]:[Clôturé]],SMALL(IF(Tableau_de_suivi[Clôturé]=\"OUI\",ROW(Tableau_de_suivi[Clôturé])-2),ROWS($1:47)),COLUMN()),\"\")","v":""},{"$f":"IFERROR(INDEX(Tableau_de_suivi[[N°]:[Clôturé]],SMALL(IF(Tableau_de_suivi[Clôturé]=\"OUI\",ROW(Tableau_de_suivi[Clôturé])-2),ROWS($1:47)),COLUMN()),\"\")","v":""},{"$f":"IFERROR(INDEX(Tableau_de_suivi[[N°]:[Clôturé]],SMALL(IF(Tableau_de_suivi[Clôturé]=\"OUI\",ROW(Tableau_de_suivi[Clôturé])-2),ROWS($1:47)),COLUMN()),\"\")","v":""},{"$f":"IFERROR(INDEX(Tableau_de_suivi[[N°]:[Clôturé]],SMALL(IF(Tableau_de_suivi[Clôturé]=\"OUI\",ROW(Tableau_de_suivi[Clôturé])-2),ROWS($1:47)),COLUMN()),\"\")","v":""},{"$f":"IFERROR(INDEX(Tableau_de_suivi[[N°]:[Clôturé]],SMALL(IF(Tableau_de_suivi[Clôturé]=\"OUI\",ROW(Tableau_de_suivi[Clôturé])-2),ROWS($1:47)),COLUMN()),\"\")","v":""},{"$f":"IFERROR(INDEX(Tableau_de_suivi[[N°]:[Clôturé]],SMALL(IF(Tableau_de_suivi[Clôturé]=\"OUI\",ROW(Tableau_de_suivi[Clôturé])-2),ROWS($1:47)),COLUMN()),\"\")","v":""},{"$f":"IFERROR(INDEX(Tableau_de_suivi[[N°]:[Clôturé]],SMALL(IF(Tableau_de_suivi[Clôturé]=\"OUI\",ROW(Tableau_de_suivi[Clôturé])-2),ROWS($1:47)),COLUMN()),\"\")","v":""},{"$f":"IFERROR(INDEX(Tableau_de_suivi[[N°]:[Clôturé]],SMALL(IF(Tableau_de_suivi[Clôturé]=\"OUI\",ROW(Tableau_de_suivi[Clôturé])-2),ROWS($1:47)),COLUMN()),\"\")","v":""},{"$f":"IFERROR(INDEX(Tableau_de_suivi[[N°]:[Clôturé]],SMALL(IF(Tableau_de_suivi[Clôturé]=\"OUI\",ROW(Tableau_de_suivi[Clôturé])-2),ROWS($1:47)),COLUMN()),\"\")","v":""},{"$f":"IFERROR(INDEX(Tableau_de_suivi[[N°]:[Clôturé]],SMALL(IF(Tableau_de_suivi[Clôturé]=\"OUI\",ROW(Tableau_de_suivi[Clôturé])-2),ROWS($1:47)),COLUMN()),\"\")","v":""},{"$f":"IFERROR(INDEX(Tableau_de_suivi[[N°]:[Clôturé]],SMALL(IF(Tableau_de_suivi[Clôturé]=\"OUI\",ROW(Tableau_de_suivi[Clôturé])-2),ROWS($1:47)),COLUMN()),\"\")","v":""},{"$f":"IFERROR(INDEX(Tableau_de_suivi[[N°]:[Clôturé]],SMALL(IF(Tableau_de_suivi[Clôturé]=\"OUI\",ROW(Tableau_de_suivi[Clôturé])-2),ROWS($1:47)),COLUMN()),\"\")","v":""},{"$f":"IFERROR(INDEX(Tableau_de_suivi[[N°]:[Clôturé]],SMALL(IF(Tableau_de_suivi[Clôturé]=\"OUI\",ROW(Tableau_de_suivi[Clôturé])-2),ROWS($1:47)),COLUMN()),\"\")","v":""},{"$f":"IFERROR(INDEX(Tableau_de_suivi[[N°]:[Clôturé]],SMALL(IF(Tableau_de_suivi[Clôturé]=\"OUI\",ROW(Tableau_de_suivi[Clôturé])-2),ROWS($1:47)),COLUMN()),\"\")","v":""},{"$f":"IFERROR(INDEX(Tableau_de_suivi[[N°]:[Clôturé]],SMALL(IF(Tableau_de_suivi[Clôturé]=\"OUI\",ROW(Tableau_de_suivi[Clôturé])-2),ROWS($1:47)),COLUMN()),\"\")","v":""},{"$f":"IFERROR(INDEX(Tableau_de_suivi[[N°]:[Clôturé]],SMALL(IF(Tableau_de_suivi[Clôturé]=\"OUI\",ROW(Tableau_de_suivi[Clôturé])-2),ROWS($1:47)),COLUMN()),\"\")","v":""},{"$f":"IFERROR(INDEX(Tableau_de_suivi[[N°]:[Clôturé]],SMALL(IF(Tableau_de_suivi[Clôturé]=\"OUI\",ROW(Tableau_de_suivi[Clôturé])-2),ROWS($1:47)),COLUMN()),\"\")","v":""}]
[{"$f":"IFERROR(INDEX(Tableau_de_suivi[[N°]:[Clôturé]],SMALL(IF(Tableau_de_suivi[Clôturé]=\"OUI\",ROW(Tableau_de_suivi[Clôturé])-2),ROWS($1:48)),COLUMN()),\"\")","v":""},{"$f":"IFERROR(INDEX(Tableau_de_suivi[[N°]:[Clôturé]],SMALL(IF(Tableau_de_suivi[Clôturé]=\"OUI\",ROW(Tableau_de_suivi[Clôturé])-2),ROWS($1:48)),COLUMN()),\"\")","v":""},{"$f":"IFERROR(INDEX(Tableau_de_suivi[[N°]:[Clôturé]],SMALL(IF(Tableau_de_suivi[Clôturé]=\"OUI\",ROW(Tableau_de_suivi[Clôturé])-2),ROWS($1:48)),COLUMN()),\"\")","v":""},{"$f":"IFERROR(INDEX(Tableau_de_suivi[[N°]:[Clôturé]],SMALL(IF(Tableau_de_suivi[Clôturé]=\"OUI\",ROW(Tableau_de_suivi[Clôturé])-2),ROWS($1:48)),COLUMN()),\"\")","v":""},{"$f":"IFERROR(INDEX(Tableau_de_suivi[[N°]:[Clôturé]],SMALL(IF(Tableau_de_suivi[Clôturé]=\"OUI\",ROW(Tableau_de_suivi[Clôturé])-2),ROWS($1:48)),COLUMN()),\"\")","v":""},{"$f":"IFERROR(INDEX(Tableau_de_suivi[[N°]:[Clôturé]],SMALL(IF(Tableau_de_suivi[Clôturé]=\"OUI\",ROW(Tableau_de_suivi[Clôturé])-2),ROWS($1:48)),COLUMN()),\"\")","v":""},{"$f":"IFERROR(INDEX(Tableau_de_suivi[[N°]:[Clôturé]],SMALL(IF(Tableau_de_suivi[Clôturé]=\"OUI\",ROW(Tableau_de_suivi[Clôturé])-2),ROWS($1:48)),COLUMN()),\"\")","v":""},{"$f":"IFERROR(INDEX(Tableau_de_suivi[[N°]:[Clôturé]],SMALL(IF(Tableau_de_suivi[Clôturé]=\"OUI\",ROW(Tableau_de_suivi[Clôturé])-2),ROWS($1:48)),COLUMN()),\"\")","v":""},{"$f":"IFERROR(INDEX(Tableau_de_suivi[[N°]:[Clôturé]],SMALL(IF(Tableau_de_suivi[Clôturé]=\"OUI\",ROW(Tableau_de_suivi[Clôturé])-2),ROWS($1:48)),COLUMN()),\"\")","v":""},{"$f":"IFERROR(INDEX(Tableau_de_suivi[[N°]:[Clôturé]],SMALL(IF(Tableau_de_suivi[Clôturé]=\"OUI\",ROW(Tableau_de_suivi[Clôturé])-2),ROWS($1:48)),COLUMN()),\"\")","v":""},{"$f":"IFERROR(INDEX(Tableau_de_suivi[[N°]:[Clôturé]],SMALL(IF(Tableau_de_suivi[Clôturé]=\"OUI\",ROW(Tableau_de_suivi[Clôturé])-2),ROWS($1:48)),COLUMN()),\"\")","v":""},{"$f":"IFERROR(INDEX(Tableau_de_suivi[[N°]:[Clôturé]],SMALL(IF(Tableau_de_suivi[Clôturé]=\"OUI\",ROW(Tableau_de_suivi[Clôturé])-2),ROWS($1:48)),COLUMN()),\"\")","v":""},{"$f":"IFERROR(INDEX(Tableau_de_suivi[[N°]:[Clôturé]],SMALL(IF(Tableau_de_suivi[Clôturé]=\"OUI\",ROW(Tableau_de_suivi[Clôturé])-2),ROWS($1:48)),COLUMN()),\"\")","v":""},{"$f":"IFERROR(INDEX(Tableau_de_suivi[[N°]:[Clôturé]],SMALL(IF(Tableau_de_suivi[Clôturé]=\"OUI\",ROW(Tableau_de_suivi[Clôturé])-2),ROWS($1:48)),COLUMN()),\"\")","v":""},{"$f":"IFERROR(INDEX(Tableau_de_suivi[[N°]:[Clôturé]],SMALL(IF(Tableau_de_suivi[Clôturé]=\"OUI\",ROW(Tableau_de_suivi[Clôturé])-2),ROWS($1:48)),COLUMN()),\"\")","v":""},{"$f":"IFERROR(INDEX(Tableau_de_suivi[[N°]:[Clôturé]],SMALL(IF(Tableau_de_suivi[Clôturé]=\"OUI\",ROW(Tableau_de_suivi[Clôturé])-2),ROWS($1:48)),COLUMN()),\"\")","v":""},{"$f":"IFERROR(INDEX(Tableau_de_suivi[[N°]:[Clôturé]],SMALL(IF(Tableau_de_suivi[Clôturé]=\"OUI\",ROW(Tableau_de_suivi[Clôturé])-2),ROWS($1:48)),COLUMN()),\"\")","v":""},{"$f":"IFERROR(INDEX(Tableau_de_suivi[[N°]:[Clôturé]],SMALL(IF(Tableau_de_suivi[Clôturé]=\"OUI\",ROW(Tableau_de_suivi[Clôturé])-2),ROWS($1:48)),COLUMN()),\"\")","v":""},{"$f":"IFERROR(INDEX(Tableau_de_suivi[[N°]:[Clôturé]],SMALL(IF(Tableau_de_suivi[Clôturé]=\"OUI\",ROW(Tableau_de_suivi[Clôturé])-2),ROWS($1:48)),COLUMN()),\"\")","v":""},{"$f":"IFERROR(INDEX(Tableau_de_suivi[[N°]:[Clôturé]],SMALL(IF(Tableau_de_suivi[Clôturé]=\"OUI\",ROW(Tableau_de_suivi[Clôturé])-2),ROWS($1:48)),COLUMN()),\"\")","v":""},{"$f":"IFERROR(INDEX(Tableau_de_suivi[[N°]:[Clôturé]],SMALL(IF(Tableau_de_suivi[Clôturé]=\"OUI\",ROW(Tableau_de_suivi[Clôturé])-2),ROWS($1:48)),COLUMN()),\"\")","v":""},{"$f":"IFERROR(INDEX(Tableau_de_suivi[[N°]:[Clôturé]],SMALL(IF(Tableau_de_suivi[Clôturé]=\"OUI\",ROW(Tableau_de_suivi[Clôturé])-2),ROWS($1:48)),COLUMN()),\"\")","v":""}]
[{"$f":"IFERROR(INDEX(Tableau_de_suivi[[N°]:[Clôturé]],SMALL(IF(Tableau_de_suivi[Clôturé]=\"OUI\",ROW(Tableau_de_suivi[Clôturé])-2),ROWS($1:49)),COLUMN()),\"\")","v":""},{"$f":"IFERROR(INDEX(Tableau_de_suivi[[N°]:[Clôturé]],SMALL(IF(Tableau_de_suivi[Clôturé]=\"OUI\",ROW(Tableau_de_suivi[Clôturé])-2),ROWS($1:49)),COLUMN()),\"\")","v":""},{"$f":"IFERROR(INDEX(Tableau_de_suivi[[N°]:[Clôturé]],SMALL(IF(Tableau_de_suivi[Clôturé]=\"OUI\",ROW(Tableau_de_suivi[Clôturé])-2),ROWS($1:49)),COLUMN()),\"\")","v":""},{"$f":"IFERROR(INDEX(Tableau_de_suivi[[N°]:[Clôturé]],SMALL(IF(Tableau_de_suivi[Clôturé]=\"OUI\",ROW(Tableau_de_suivi[Clôturé])-2),ROWS($1:49)),COLUMN()),\"\")","v":""},{"$f":"IFERROR(INDEX(Tableau_de_suivi[[N°]:[Clôturé]],SMALL(IF(Tableau_de_suivi[Clôturé]=\"OUI\",ROW(Tableau_de_suivi[Clôturé])-2),ROWS($1:49)),COLUMN()),\"\")","v":""},{"$f":"IFERROR(INDEX(Tableau_de_suivi[[N°]:[Clôturé]],SMALL(IF(Tableau_de_suivi[Clôturé]=\"OUI\",ROW(Tableau_de_suivi[Clôturé])-2),ROWS($1:49)),COLUMN()),\"\")","v":""},{"$f":"IFERROR(INDEX(Tableau_de_suivi[[N°]:[Clôturé]],SMALL(IF(Tableau_de_suivi[Clôturé]=\"OUI\",ROW(Tableau_de_suivi[Clôturé])-2),ROWS($1:49)),COLUMN()),\"\")","v":""},{"$f":"IFERROR(INDEX(Tableau_de_suivi[[N°]:[Clôturé]],SMALL(IF(Tableau_de_suivi[Clôturé]=\"OUI\",ROW(Tableau_de_suivi[Clôturé])-2),ROWS($1:49)),COLUMN()),\"\")","v":""},{"$f":"IFERROR(INDEX(Tableau_de_suivi[[N°]:[Clôturé]],SMALL(IF(Tableau_de_suivi[Clôturé]=\"OUI\",ROW(Tableau_de_suivi[Clôturé])-2),ROWS($1:49)),COLUMN()),\"\")","v":""},{"$f":"IFERROR(INDEX(Tableau_de_suivi[[N°]:[Clôturé]],SMALL(IF(Tableau_de_suivi[Clôturé]=\"OUI\",ROW(Tableau_de_suivi[Clôturé])-2),ROWS($1:49)),COLUMN()),\"\")","v":""},{"$f":"IFERROR(INDEX(Tableau_de_suivi[[N°]:[Clôturé]],SMALL(IF(Tableau_de_suivi[Clôturé]=\"OUI\",ROW(Tableau_de_suivi[Clôturé])-2),ROWS($1:49)),COLUMN()),\"\")","v":""},{"$f":"IFERROR(INDEX(Tableau_de_suivi[[N°]:[Clôturé]],SMALL(IF(Tableau_de_suivi[Clôturé]=\"OUI\",ROW(Tableau_de_suivi[Clôturé])-2),ROWS($1:49)),COLUMN()),\"\")","v":""},{"$f":"IFERROR(INDEX(Tableau_de_suivi[[N°]:[Clôturé]],SMALL(IF(Tableau_de_suivi[Clôturé]=\"OUI\",ROW(Tableau_de_suivi[Clôturé])-2),ROWS($1:49)),COLUMN()),\"\")","v":""},{"$f":"IFERROR(INDEX(Tableau_de_suivi[[N°]:[Clôturé]],SMALL(IF(Tableau_de_suivi[Clôturé]=\"OUI\",ROW(Tableau_de_suivi[Clôturé])-2),ROWS($1:49)),COLUMN()),\"\")","v":""},{"$f":"IFERROR(INDEX(Tableau_de_suivi[[N°]:[Clôturé]],SMALL(IF(Tableau_de_suivi[Clôturé]=\"OUI\",ROW(Tableau_de_suivi[Clôturé])-2),ROWS($1:49)),COLUMN()),\"\")","v":""},{"$f":"IFERROR(INDEX(Tableau_de_suivi[[N°]:[Clôturé]],SMALL(IF(Tableau_de_suivi[Clôturé]=\"OUI\",ROW(Tableau_de_suivi[Clôturé])-2),ROWS($1:49)),COLUMN()),\"\")","v":""},{"$f":"IFERROR(INDEX(Tableau_de_suivi[[N°]:[Clôturé]],SMALL(IF(Tableau_de_suivi[Clôturé]=\"OUI\",ROW(Tableau_de_suivi[Clôturé])-2),ROWS($1:49)),COLUMN()),\"\")","v":""},{"$f":"IFERROR(INDEX(Tableau_de_suivi[[N°]:[Clôturé]],SMALL(IF(Tableau_de_suivi[Clôturé]=\"OUI\",ROW(Tableau_de_suivi[Clôturé])-2),ROWS($1:49)),COLUMN()),\"\")","v":""},{"$f":"IFERROR(INDEX(Tableau_de_suivi[[N°]:[Clôturé]],SMALL(IF(Tableau_de_suivi[Clôturé]=\"OUI\",ROW(Tableau_de_suivi[Clôturé])-2),ROWS($1:49)),COLUMN()),\"\")","v":""},{"$f":"IFERROR(INDEX(Tableau_de_suivi[[N°]:[Clôturé]],SMALL(IF(Tableau_de_suivi[Clôturé]=\"OUI\",ROW(Tableau_de_suivi[Clôturé])-2),ROWS($1:49)),COLUMN()),\"\")","v":""},{"$f":"IFERROR(INDEX(Tableau_de_suivi[[N°]:[Clôturé]],SMALL(IF(Tableau_de_suivi[Clôturé]=\"OUI\",ROW(Tableau_de_suivi[Clôturé])-2),ROWS($1:49)),COLUMN()),\"\")","v":""},{"$f":"IFERROR(INDEX(Tableau_de_suivi[[N°]:[Clôturé]],SMALL(IF(Tableau_de_suivi[Clôturé]=\"OUI\",ROW(Tableau_de_suivi[Clôturé])-2),ROWS($1:49)),COLUMN()),\"\")","v":""}]
[{"$f":"IFERROR(INDEX(Tableau_de_suivi[[N°]:[Clôturé]],SMALL(IF(Tableau_de_suivi[Clôturé]=\"OUI\",ROW(Tableau_de_suivi[Clôturé])-2),ROWS($1:50)),COLUMN()),\"\")","v":""},{"$f":"IFERROR(INDEX(Tableau_de_suivi[[N°]:[Clôturé]],SMALL(IF(Tableau_de_suivi[Clôturé]=\"OUI\",ROW(Tableau_de_suivi[Clôturé])-2),ROWS($1:50)),COLUMN()),\"\")","v":""},{"$f":"IFERROR(INDEX(Tableau_de_suivi[[N°]:[Clôturé]],SMALL(IF(Tableau_de_suivi[Clôturé]=\"OUI\",ROW(Tableau_de_suivi[Clôturé])-2),ROWS($1:50)),COLUMN()),\"\")","v":""},{"$f":"IFERROR(INDEX(Tableau_de_suivi[[N°]:[Clôturé]],SMALL(IF(Tableau_de_suivi[Clôturé]=\"OUI\",ROW(Tableau_de_suivi[Clôturé])-2),ROWS($1:50)),COLUMN()),\"\")","v":""},{"$f":"IFERROR(INDEX(Tableau_de_suivi[[N°]:[Clôturé]],SMALL(IF(Tableau_de_suivi[Clôturé]=\"OUI\",ROW(Tableau_de_suivi[Clôturé])-2),ROWS($1:50)),COLUMN()),\"\")","v":""},{"$f":"IFERROR(INDEX(Tableau_de_suivi[[N°]:[Clôturé]],SMALL(IF(Tableau_de_suivi[Clôturé]=\"OUI\",ROW(Tableau_de_suivi[Clôturé])-2),ROWS($1:50)),COLUMN()),\"\")","v":""},{"$f":"IFERROR(INDEX(Tableau_de_suivi[[N°]:[Clôturé]],SMALL(IF(Tableau_de_suivi[Clôturé]=\"OUI\",ROW(Tableau_de_suivi[Clôturé])-2),ROWS($1:50)),COLUMN()),\"\")","v":""},{"$f":"IFERROR(INDEX(Tableau_de_suivi[[N°]:[Clôturé]],SMALL(IF(Tableau_de_suivi[Clôturé]=\"OUI\",ROW(Tableau_de_suivi[Clôturé])-2),ROWS($1:50)),COLUMN()),\"\")","v":""},{"$f":"IFERROR(INDEX(Tableau_de_suivi[[N°]:[Clôturé]],SMALL(IF(Tableau_de_suivi[Clôturé]=\"OUI\",ROW(Tableau_de_suivi[Clôturé])-2),ROWS($1:50)),COLUMN()),\"\")","v":""},{"$f":"IFERROR(INDEX(Tableau_de_suivi[[N°]:[Clôturé]],SMALL(IF(Tableau_de_suivi[Clôturé]=\"OUI\",ROW(Tableau_de_suivi[Clôturé])-2),ROWS($1:50)),COLUMN()),\"\")","v":""},{"$f":"IFERROR(INDEX(Tableau_de_suivi[[N°]:[Clôturé]],SMALL(IF(Tableau_de_suivi[Clôturé]=\"OUI\",ROW(Tableau_de_suivi[Clôturé])-2),ROWS($1:50)),COLUMN()),\"\")","v":""},{"$f":"IFERROR(INDEX(Tableau_de_suivi[[N°]:[Clôturé]],SMALL(IF(Tableau_de_suivi[Clôturé]=\"OUI\",ROW(Tableau_de_suivi[Clôturé])-2),ROWS($1:50)),COLUMN()),\"\")","v":""},{"$f":"IFERROR(INDEX(Tableau_de_suivi[[N°]:[Clôturé]],SMALL(IF(Tableau_de_suivi[Clôturé]=\"OUI\",ROW(Tableau_de_suivi[Clôturé])-2),ROWS($1:50)),COLUMN()),\"\")","v":""},{"$f":"IFERROR(INDEX(Tableau_de_suivi[[N°]:[Clôturé]],SMALL(IF(Tableau_de_suivi[Clôturé]=\"OUI\",ROW(Tableau_de_suivi[Clôturé])-2),ROWS($1:50)),COLUMN()),\"\")","v":""},{"$f":"IFERROR(INDEX(Tableau_de_suivi[[N°]:[Clôturé]],SMALL(IF(Tableau_de_suivi[Clôturé]=\"OUI\",ROW(Tableau_de_suivi[Clôturé])-2),ROWS($1:50)),COLUMN()),\"\")","v":""},{"$f":"IFERROR(INDEX(Tableau_de_suivi[[N°]:[Clôturé]],SMALL(IF(Tableau_de_suivi[Clôturé]=\"OUI\",ROW(Tableau_de_suivi[Clôturé])-2),ROWS($1:50)),COLUMN()),\"\")","v":""},{"$f":"IFERROR(INDEX(Tableau_de_suivi[[N°]:[Clôturé]],SMALL(IF(Tableau_de_suivi[Clôturé]=\"OUI\",ROW(Tableau_de_suivi[Clôturé])-2),ROWS($1:50)),COLUMN()),\"\")","v":""},{"$f":"IFERROR(INDEX(Tableau_de_suivi[[N°]:[Clôturé]],SMALL(IF(Tableau_de_suivi[Clôturé]=\"OUI\",ROW(Tableau_de_suivi[Clôturé])-2),ROWS($1:50)),COLUMN()),\"\")","v":""},{"$f":"IFERROR(INDEX(Tableau_de_suivi[[N°]:[Clôturé]],SMALL(IF(Tableau_de_suivi[Clôturé]=\"OUI\",ROW(Tableau_de_suivi[Clôturé])-2),ROWS($1:50)),COLUMN()),\"\")","v":""},{"$f":"IFERROR(INDEX(Tableau_de_suivi[[N°]:[Clôturé]],SMALL(IF(Tableau_de_suivi[Clôturé]=\"OUI\",ROW(Tableau_de_suivi[Clôturé])-2),ROWS($1:50)),COLUMN()),\"\")","v":""},{"$f":"IFERROR(INDEX(Tableau_de_suivi[[N°]:[Clôturé]],SMALL(IF(Tableau_de_suivi[Clôturé]=\"OUI\",ROW(Tableau_de_suivi[Clôturé])-2),ROWS($1:50)),COLUMN()),\"\")","v":""},{"$f":"IFERROR(INDEX(Tableau_de_suivi[[N°]:[Clôturé]],SMALL(IF(Tableau_de_suivi[Clôturé]=\"OUI\",ROW(Tableau_de_suivi[Clôturé])-2),ROWS($1:50)),COLUMN()),\"\")","v":""}]
[{"$f":"IFERROR(INDEX(Tableau_de_suivi[[N°]:[Clôturé]],SMALL(IF(Tableau_de_suivi[Clôturé]=\"OUI\",ROW(Tableau_de_suivi[Clôturé])-2),ROWS($1:51)),COLUMN()),\"\")","v":""},{"$f":"IFERROR(INDEX(Tableau_de_suivi[[N°]:[Clôturé]],SMALL(IF(Tableau_de_suivi[Clôturé]=\"OUI\",ROW(Tableau_de_suivi[Clôturé])-2),ROWS($1:51)),COLUMN()),\"\")","v":""},{"$f":"IFERROR(INDEX(Tableau_de_suivi[[N°]:[Clôturé]],SMALL(IF(Tableau_de_suivi[Clôturé]=\"OUI\",ROW(Tableau_de_suivi[Clôturé])-2),ROWS($1:51)),COLUMN()),\"\")","v":""},{"$f":"IFERROR(INDEX(Tableau_de_suivi[[N°]:[Clôturé]],SMALL(IF(Tableau_de_suivi[Clôturé]=\"OUI\",ROW(Tableau_de_suivi[Clôturé])-2),ROWS($1:51)),COLUMN()),\"\")","v":""},{"$f":"IFERROR(INDEX(Tableau_de_suivi[[N°]:[Clôturé]],SMALL(IF(Tableau_de_suivi[Clôturé]=\"OUI\",ROW(Tableau_de_suivi[Clôturé])-2),ROWS($1:51)),COLUMN()),\"\")","v":""},{"$f":"IFERROR(INDEX(Tableau_de_suivi[[N°]:[Clôturé]],SMALL(IF(Tableau_de_suivi[Clôturé]=\"OUI\",ROW(Tableau_de_suivi[Clôturé])-2),ROWS($1:51)),COLUMN()),\"\")","v":""},{"$f":"IFERROR(INDEX(Tableau_de_suivi[[N°]:[Clôturé]],SMALL(IF(Tableau_de_suivi[Clôturé]=\"OUI\",ROW(Tableau_de_suivi[Clôturé])-2),ROWS($1:51)),COLUMN()),\"\")","v":""},{"$f":"IFERROR(INDEX(Tableau_de_suivi[[N°]:[Clôturé]],SMALL(IF(Tableau_de_suivi[Clôturé]=\"OUI\",ROW(Tableau_de_suivi[Clôturé])-2),ROWS($1:51)),COLUMN()),\"\")","v":""},{"$f":"IFERROR(INDEX(Tableau_de_suivi[[N°]:[Clôturé]],SMALL(IF(Tableau_de_suivi[Clôturé]=\"OUI\",ROW(Tableau_de_suivi[Clôturé])-2),ROWS($1:51)),COLUMN()),\"\")","v":""},{"$f":"IFERROR(INDEX(Tableau_de_suivi[[N°]:[Clôturé]],SMALL(IF(Tableau_de_suivi[Clôturé]=\"OUI\",ROW(Tableau_de_suivi[Clôturé])-2),ROWS($1:51)),COLUMN()),\"\")","v":""},{"$f":"IFERROR(INDEX(Tableau_de_suivi[[N°]:[Clôturé]],SMALL(IF(Tableau_de_suivi[Clôturé]=\"OUI\",ROW(Tableau_de_suivi[Clôturé])-2),ROWS($1:51)),COLUMN()),\"\")","v":""},{"$f":"IFERROR(INDEX(Tableau_de_suivi[[N°]:[Clôturé]],SMALL(IF(Tableau_de_suivi[Clôturé]=\"OUI\",ROW(Tableau_de_suivi[Clôturé])-2),ROWS($1:51)),COLUMN()),\"\")","v":""},{"$f":"IFERROR(INDEX(Tableau_de_suivi[[N°]:[Clôturé]],SMALL(IF(Tableau_de_suivi[Clôturé]=\"OUI\",ROW(Tableau_de_suivi[Clôturé])-2),ROWS($1:51)),COLUMN()),\"\")","v":""},{"$f":"IFERROR(INDEX(Tableau_de_suivi[[N°]:[Clôturé]],SMALL(IF(Tableau_de_suivi[Clôturé]=\"OUI\",ROW(Tableau_de_suivi[Clôturé])-2),ROWS($1:51)),COLUMN()),\"\")","v":""},{"$f":"IFERROR(INDEX(Tableau_de_suivi[[N°]:[Clôturé]],SMALL(IF(Tableau_de_suivi[Clôturé]=\"OUI\",ROW(Tableau_de_suivi[Clôturé])-2),ROWS($1:51)),COLUMN()),\"\")","v":""},{"$f":"IFERROR(INDEX(Tableau_de_suivi[[N°]:[Clôturé]],SMALL(IF(Tableau_de_suivi[Clôturé]=\"OUI\",ROW(Tableau_de_suivi[Clôturé])-2),ROWS($1:51)),COLUMN()),\"\")","v":""},{"$f":"IFERROR(INDEX(Tableau_de_suivi[[N°]:[Clôturé]],SMALL(IF(Tableau_de_suivi[Clôturé]=\"OUI\",ROW(Tableau_de_suivi[Clôturé])-2),ROWS($1:51)),COLUMN()),\"\")","v":""},{"$f":"IFERROR(INDEX(Tableau_de_suivi[[N°]:[Clôturé]],SMALL(IF(Tableau_de_suivi[Clôturé]=\"OUI\",ROW(Tableau_de_suivi[Clôturé])-2),ROWS($1:51)),COLUMN()),\"\")","v":""},{"$f":"IFERROR(INDEX(Tableau_de_suivi[[N°]:[Clôturé]],SMALL(IF(Tableau_de_suivi[Clôturé]=\"OUI\",ROW(Tableau_de_suivi[Clôturé])-2),ROWS($1:51)),COLUMN()),\"\")","v":""},{"$f":"IFERROR(INDEX(Tableau_de_suivi[[N°]:[Clôturé]],SMALL(IF(Tableau_de_suivi[Clôturé]=\"OUI\",ROW(Tableau_de_suivi[Clôturé])-2),ROWS($1:51)),COLUMN()),\"\")","v":""},{"$f":"IFERROR(INDEX(Tableau_de_suivi[[N°]:[Clôturé]],SMALL(IF(Tableau_de_suivi[Clôturé]=\"OUI\",ROW(Tableau_de_suivi[Clôturé])-2),ROWS($1:51)),COLUMN()),\"\")","v":""},{"$f":"IFERROR(INDEX(Tableau_de_suivi[[N°]:[Clôturé]],SMALL(IF(Tableau_de_suivi[Clôturé]=\"OUI\",ROW(Tableau_de_suivi[Clôturé])-2),ROWS($1:51)),COLUMN()),\"\")","v":""}]
[{"$f":"IFERROR(INDEX(Tableau_de_suivi[[N°]:[Clôturé]],SMALL(IF(Tableau_de_suivi[Clôturé]=\"OUI\",ROW(Tableau_de_suivi[Clôturé])-2),ROWS($1:52)),COLUMN()),\"\")","v":""},{"$f":"IFERROR(INDEX(Tableau_de_suivi[[N°]:[Clôturé]],SMALL(IF(Tableau_de_suivi[Clôturé]=\"OUI\",ROW(Tableau_de_suivi[Clôturé])-2),ROWS($1:52)),COLUMN()),\"\")","v":""},{"$f":"IFERROR(INDEX(Tableau_de_suivi[[N°]:[Clôturé]],SMALL(IF(Tableau_de_suivi[Clôturé]=\"OUI\",ROW(Tableau_de_suivi[Clôturé])-2),ROWS($1:52)),COLUMN()),\"\")","v":""},{"$f":"IFERROR(INDEX(Tableau_de_suivi[[N°]:[Clôturé]],SMALL(IF(Tableau_de_suivi[Clôturé]=\"OUI\",ROW(Tableau_de_suivi[Clôturé])-2),ROWS($1:52)),COLUMN()),\"\")","v":""},{"$f":"IFERROR(INDEX(Tableau_de_suivi[[N°]:[Clôturé]],SMALL(IF(Tableau_de_suivi[Clôturé]=\"OUI\",ROW(Tableau_de_suivi[Clôturé])-2),ROWS($1:52)),COLUMN()),\"\")","v":""},{"$f":"IFERROR(INDEX(Tableau_de_suivi[[N°]:[Clôturé]],SMALL(IF(Tableau_de_suivi[Clôturé]=\"OUI\",ROW(Tableau_de_suivi[Clôturé])-2),ROWS($1:52)),COLUMN()),\"\")","v":""},{"$f":"IFERROR(INDEX(Tableau_de_suivi[[N°]:[Clôturé]],SMALL(IF(Tableau_de_suivi[Clôturé]=\"OUI\",ROW(Tableau_de_suivi[Clôturé])-2),ROWS($1:52)),COLUMN()),\"\")","v":""},{"$f":"IFERROR(INDEX(Tableau_de_suivi[[N°]:[Clôturé]],SMALL(IF(Tableau_de_suivi[Clôturé]=\"OUI\",ROW(Tableau_de_suivi[Clôturé])-2),ROWS($1:52)),COLUMN()),\"\")","v":""},{"$f":"IFERROR(INDEX(Tableau_de_suivi[[N°]:[Clôturé]],SMALL(IF(Tableau_de_suivi[Clôturé]=\"OUI\",ROW(Tableau_de_suivi[Clôturé])-2),ROWS($1:52)),COLUMN()),\"\")","v":""},{"$f":"IFERROR(INDEX(Tableau_de_suivi[[N°]:[Clôturé]],SMALL(IF(Tableau_de_suivi[Clôturé]=\"OUI\",ROW(Tableau_de_suivi[Clôturé])-2),ROWS($1:52)),COLUMN()),\"\")","v":""},{"$f":"IFERROR(INDEX(Tableau_de_suivi[[N°]:[Clôturé]],SMALL(IF(Tableau_de_suivi[Clôturé]=\"OUI\",ROW(Tableau_de_suivi[Clôturé])-2),ROWS($1:52)),COLUMN()),\"\")","v":""},{"$f":"IFERROR(INDEX(Tableau_de_suivi[[N°]:[Clôturé]],SMALL(IF(Tableau_de_suivi[Clôturé]=\"OUI\",ROW(Tableau_de_suivi[Clôturé])-2),ROWS($1:52)),COLUMN()),\"\")","v":""},{"$f":"IFERROR(INDEX(Tableau_de_suivi[[N°]:[Clôturé]],SMALL(IF(Tableau_de_suivi[Clôturé]=\"OUI\",ROW(Tableau_de_suivi[Clôturé])-2),ROWS($1:52)),COLUMN()),\"\")","v":""},{"$f":"IFERROR(INDEX(Tableau_de_suivi[[N°]:[Clôturé]],SMALL(IF(Tableau_de_suivi[Clôturé]=\"OUI\",ROW(Tableau_de_suivi[Clôturé])-2),ROWS($1:52)),COLUMN()),\"\")","v":""},{"$f":"IFERROR(INDEX(Tableau_de_suivi[[N°]:[Clôturé]],SMALL(IF(Tableau_de_suivi[Clôturé]=\"OUI\",ROW(Tableau_de_suivi[Clôturé])-2),ROWS($1:52)),COLUMN()),\"\")","v":""},{"$f":"IFERROR(INDEX(Tableau_de_suivi[[N°]:[Clôturé]],SMALL(IF(Tableau_de_suivi[Clôturé]=\"OUI\",ROW(Tableau_de_suivi[Clôturé])-2),ROWS($1:52)),COLUMN()),\"\")","v":""},{"$f":"IFERROR(INDEX(Tableau_de_suivi[[N°]:[Clôturé]],SMALL(IF(Tableau_de_suivi[Clôturé]=\"OUI\",ROW(Tableau_de_suivi[Clôturé])-2),ROWS($1:52)),COLUMN()),\"\")","v":""},{"$f":"IFERROR(INDEX(Tableau_de_suivi[[N°]:[Clôturé]],SMALL(IF(Tableau_de_suivi[Clôturé]=\"OUI\",ROW(Tableau_de_suivi[Clôturé])-2),ROWS($1:52)),COLUMN()),\"\")","v":""},{"$f":"IFERROR(INDEX(Tableau_de_suivi[[N°]:[Clôturé]],SMALL(IF(Tableau_de_suivi[Clôturé]=\"OUI\",ROW(Tableau_de_suivi[Clôturé])-2),ROWS($1:52)),COLUMN()),\"\")","v":""},{"$f":"IFERROR(INDEX(Tableau_de_suivi[[N°]:[Clôturé]],SMALL(IF(Tableau_de_suivi[Clôturé]=\"OUI\",ROW(Tableau_de_suivi[Clôturé])-2),ROWS($1:52)),COLUMN()),\"\")","v":""},{"$f":"IFERROR(INDEX(Tableau_de_suivi[[N°]:[Clôturé]],SMALL(IF(Tableau_de_suivi[Clôturé]=\"OUI\",ROW(Tableau_de_suivi[Clôturé])-2),ROWS($1:52)),COLUMN()),\"\")","v":""},{"$f":"IFERROR(INDEX(Tableau_de_suivi[[N°]:[Clôturé]],SMALL(IF(Tableau_de_suivi[Clôturé]=\"OUI\",ROW(Tableau_de_suivi[Clôturé])-2),ROWS($1:52)),COLUMN()),\"\")","v":""}]
[{"$f":"IFERROR(INDEX(Tableau_de_suivi[[N°]:[Clôturé]],SMALL(IF(Tableau_de_suivi[Clôturé]=\"OUI\",ROW(Tableau_de_suivi[Clôturé])-2),ROWS($1:53)),COLUMN()),\"\")","v":""},{"$f":"IFERROR(INDEX(Tableau_de_suivi[[N°]:[Clôturé]],SMALL(IF(Tableau_de_suivi[Clôturé]=\"OUI\",ROW(Tableau_de_suivi[Clôturé])-2),ROWS($1:53)),COLUMN()),\"\")","v":""},{"$f":"IFERROR(INDEX(Tableau_de_suivi[[N°]:[Clôturé]],SMALL(IF(Tableau_de_suivi[Clôturé]=\"OUI\",ROW(Tableau_de_suivi[Clôturé])-2),ROWS($1:53)),COLUMN()),\"\")","v":""},{"$f":"IFERROR(INDEX(Tableau_de_suivi[[N°]:[Clôturé]],SMALL(IF(Tableau_de_suivi[Clôturé]=\"OUI\",ROW(Tableau_de_suivi[Clôturé])-2),ROWS($1:53)),COLUMN()),\"\")","v":""},{"$f":"IFERROR(INDEX(Tableau_de_suivi[[N°]:[Clôturé]],SMALL(IF(Tableau_de_suivi[Clôturé]=\"OUI\",ROW(Tableau_de_suivi[Clôturé])-2),ROWS($1:53)),COLUMN()),\"\")","v":""},{"$f":"IFERROR(INDEX(Tableau_de_suivi[[N°]:[Clôturé]],SMALL(IF(Tableau_de_suivi[Clôturé]=\"OUI\",ROW(Tableau_de_suivi[Clôturé])-2),ROWS($1:53)),COLUMN()),\"\")","v":""},{"$f":"IFERROR(INDEX(Tableau_de_suivi[[N°]:[Clôturé]],SMALL(IF(Tableau_de_suivi[Clôturé]=\"OUI\",ROW(Tableau_de_suivi[Clôturé])-2),ROWS($1:53)),COLUMN()),\"\")","v":""},{"$f":"IFERROR(INDEX(Tableau_de_suivi[[N°]:[Clôturé]],SMALL(IF(Tableau_de_suivi[Clôturé]=\"OUI\",ROW(Tableau_de_suivi[Clôturé])-2),ROWS($1:53)),COLUMN()),\"\")","v":""},{"$f":"IFERROR(INDEX(Tableau_de_suivi[[N°]:[Clôturé]],SMALL(IF(Tableau_de_suivi[Clôturé]=\"OUI\",ROW(Tableau_de_suivi[Clôturé])-2),ROWS($1:53)),COLUMN()),\"\")","v":""},{"$f":"IFERROR(INDEX(Tableau_de_suivi[[N°]:[Clôturé]],SMALL(IF(Tableau_de_suivi[Clôturé]=\"OUI\",ROW(Tableau_de_suivi[Clôturé])-2),ROWS($1:53)),COLUMN()),\"\")","v":""},{"$f":"IFERROR(INDEX(Tableau_de_suivi[[N°]:[Clôturé]],SMALL(IF(Tableau_de_suivi[Clôturé]=\"OUI\",ROW(Tableau_de_suivi[Clôturé])-2),ROWS($1:53)),COLUMN()),\"\")","v":""},{"$f":"IFERROR(INDEX(Tableau_de_suivi[[N°]:[Clôturé]],SMALL(IF(Tableau_de_suivi[Clôturé]=\"OUI\",ROW(Tableau_de_suivi[Clôturé])-2),ROWS($1:53)),COLUMN()),\"\")","v":""},{"$f":"IFERROR(INDEX(Tableau_de_suivi[[N°]:[Clôturé]],SMALL(IF(Tableau_de_suivi[Clôturé]=\"OUI\",ROW(Tableau_de_suivi[Clôturé])-2),ROWS($1:53)),COLUMN()),\"\")","v":""},{"$f":"IFERROR(INDEX(Tableau_de_suivi[[N°]:[Clôturé]],SMALL(IF(Tableau_de_suivi[Clôturé]=\"OUI\",ROW(Tableau_de_suivi[Clôturé])-2),ROWS($1:53)),COLUMN()),\"\")","v":""},{"$f":"IFERROR(INDEX(Tableau_de_suivi[[N°]:[Clôturé]],SMALL(IF(Tableau_de_suivi[Clôturé]=\"OUI\",ROW(Tableau_de_suivi[Clôturé])-2),ROWS($1:53)),COLUMN()),\"\")","v":""},{"$f":"IFERROR(INDEX(Tableau_de_suivi[[N°]:[Clôturé]],SMALL(IF(Tableau_de_suivi[Clôturé]=\"OUI\",ROW(Tableau_de_suivi[Clôturé])-2),ROWS($1:53)),COLUMN()),\"\")","v":""},{"$f":"IFERROR(INDEX(Tableau_de_suivi[[N°]:[Clôturé]],SMALL(IF(Tableau_de_suivi[Clôturé]=\"OUI\",ROW(Tableau_de_suivi[Clôturé])-2),ROWS($1:53)),COLUMN()),\"\")","v":""},{"$f":"IFERROR(INDEX(Tableau_de_suivi[[N°]:[Clôturé]],SMALL(IF(Tableau_de_suivi[Clôturé]=\"OUI\",ROW(Tableau_de_suivi[Clôturé])-2),ROWS($1:53)),COLUMN()),\"\")","v":""},{"$f":"IFERROR(INDEX(Tableau_de_suivi[[N°]:[Clôturé]],SMALL(IF(Tableau_de_suivi[Clôturé]=\"OUI\",ROW(Tableau_de_suivi[Clôturé])-2),ROWS($1:53)),COLUMN()),\"\")","v":""},{"$f":"IFERROR(INDEX(Tableau_de_suivi[[N°]:[Clôturé]],SMALL(IF(Tableau_de_suivi[Clôturé]=\"OUI\",ROW(Tableau_de_suivi[Clôturé])-2),ROWS($1:53)),COLUMN()),\"\")","v":""},{"$f":"IFERROR(INDEX(Tableau_de_suivi[[N°]:[Clôturé]],SMALL(IF(Tableau_de_suivi[Clôturé]=\"OUI\",ROW(Tableau_de_suivi[Clôturé])-2),ROWS($1:53)),COLUMN()),\"\")","v":""},{"$f":"IFERROR(INDEX(Tableau_de_suivi[[N°]:[Clôturé]],SMALL(IF(Tableau_de_suivi[Clôturé]=\"OUI\",ROW(Tableau_de_suivi[Clôturé])-2),ROWS($1:53)),COLUMN()),\"\")","v":""}]
[{"$f":"IFERROR(INDEX(Tableau_de_suivi[[N°]:[Clôturé]],SMALL(IF(Tableau_de_suivi[Clôturé]=\"OUI\",ROW(Tableau_de_suivi[Clôturé])-2),ROWS($1:54)),COLUMN()),\"\")","v":""},{"$f":"IFERROR(INDEX(Tableau_de_suivi[[N°]:[Clôturé]],SMALL(IF(Tableau_de_suivi[Clôturé]=\"OUI\",ROW(Tableau_de_suivi[Clôturé])-2),ROWS($1:54)),COLUMN()),\"\")","v":""},{"$f":"IFERROR(INDEX(Tableau_de_suivi[[N°]:[Clôturé]],SMALL(IF(Tableau_de_suivi[Clôturé]=\"OUI\",ROW(Tableau_de_suivi[Clôturé])-2),ROWS($1:54)),COLUMN()),\"\")","v":""},{"$f":"IFERROR(INDEX(Tableau_de_suivi[[N°]:[Clôturé]],SMALL(IF(Tableau_de_suivi[Clôturé]=\"OUI\",ROW(Tableau_de_suivi[Clôturé])-2),ROWS($1:54)),COLUMN()),\"\")","v":""},{"$f":"IFERROR(INDEX(Tableau_de_suivi[[N°]:[Clôturé]],SMALL(IF(Tableau_de_suivi[Clôturé]=\"OUI\",ROW(Tableau_de_suivi[Clôturé])-2),ROWS($1:54)),COLUMN()),\"\")","v":""},{"$f":"IFERROR(INDEX(Tableau_de_suivi[[N°]:[Clôturé]],SMALL(IF(Tableau_de_suivi[Clôturé]=\"OUI\",ROW(Tableau_de_suivi[Clôturé])-2),ROWS($1:54)),COLUMN()),\"\")","v":""},{"$f":"IFERROR(INDEX(Tableau_de_suivi[[N°]:[Clôturé]],SMALL(IF(Tableau_de_suivi[Clôturé]=\"OUI\",ROW(Tableau_de_suivi[Clôturé])-2),ROWS($1:54)),COLUMN()),\"\")","v":""},{"$f":"IFERROR(INDEX(Tableau_de_suivi[[N°]:[Clôturé]],SMALL(IF(Tableau_de_suivi[Clôturé]=\"OUI\",ROW(Tableau_de_suivi[Clôturé])-2),ROWS($1:54)),COLUMN()),\"\")","v":""},{"$f":"IFERROR(INDEX(Tableau_de_suivi[[N°]:[Clôturé]],SMALL(IF(Tableau_de_suivi[Clôturé]=\"OUI\",ROW(Tableau_de_suivi[Clôturé])-2),ROWS($1:54)),COLUMN()),\"\")","v":""},{"$f":"IFERROR(INDEX(Tableau_de_suivi[[N°]:[Clôturé]],SMALL(IF(Tableau_de_suivi[Clôturé]=\"OUI\",ROW(Tableau_de_suivi[Clôturé])-2),ROWS($1:54)),COLUMN()),\"\")","v":""},{"$f":"IFERROR(INDEX(Tableau_de_suivi[[N°]:[Clôturé]],SMALL(IF(Tableau_de_suivi[Clôturé]=\"OUI\",ROW(Tableau_de_suivi[Clôturé])-2),ROWS($1:54)),COLUMN()),\"\")","v":""},{"$f":"IFERROR(INDEX(Tableau_de_suivi[[N°]:[Clôturé]],SMALL(IF(Tableau_de_suivi[Clôturé]=\"OUI\",ROW(Tableau_de_suivi[Clôturé])-2),ROWS($1:54)),COLUMN()),\"\")","v":""},{"$f":"IFERROR(INDEX(Tableau_de_suivi[[N°]:[Clôturé]],SMALL(IF(Tableau_de_suivi[Clôturé]=\"OUI\",ROW(Tableau_de_suivi[Clôturé])-2),ROWS($1:54)),COLUMN()),\"\")","v":""},{"$f":"IFERROR(INDEX(Tableau_de_suivi[[N°]:[Clôturé]],SMALL(IF(Tableau_de_suivi[Clôturé]=\"OUI\",ROW(Tableau_de_suivi[Clôturé])-2),ROWS($1:54)),COLUMN()),\"\")","v":""},{"$f":"IFERROR(INDEX(Tableau_de_suivi[[N°]:[Clôturé]],SMALL(IF(Tableau_de_suivi[Clôturé]=\"OUI\",ROW(Tableau_de_suivi[Clôturé])-2),ROWS($1:54)),COLUMN()),\"\")","v":""},{"$f":"IFERROR(INDEX(Tableau_de_suivi[[N°]:[Clôturé]],SMALL(IF(Tableau_de_suivi[Clôturé]=\"OUI\",ROW(Tableau_de_suivi[Clôturé])-2),ROWS($1:54)),COLUMN()),\"\")","v":""},{"$f":"IFERROR(INDEX(Tableau_de_suivi[[N°]:[Clôturé]],SMALL(IF(Tableau_de_suivi[Clôturé]=\"OUI\",ROW(Tableau_de_suivi[Clôturé])-2),ROWS($1:54)),COLUMN()),\"\")","v":""},{"$f":"IFERROR(INDEX(Tableau_de_suivi[[N°]:[Clôturé]],SMALL(IF(Tableau_de_suivi[Clôturé]=\"OUI\",ROW(Tableau_de_suivi[Clôturé])-2),ROWS($1:54)),COLUMN()),\"\")","v":""},{"$f":"IFERROR(INDEX(Tableau_de_suivi[[N°]:[Clôturé]],SMALL(IF(Tableau_de_suivi[Clôturé]=\"OUI\",ROW(Tableau_de_suivi[Clôturé])-2),ROWS($1:54)),COLUMN()),\"\")","v":""},{"$f":"IFERROR(INDEX(Tableau_de_suivi[[N°]:[Clôturé]],SMALL(IF(Tableau_de_suivi[Clôturé]=\"OUI\",ROW(Tableau_de_suivi[Clôturé])-2),ROWS($1:54)),COLUMN()),\"\")","v":""},{"$f":"IFERROR(INDEX(Tableau_de_suivi[[N°]:[Clôturé]],SMALL(IF(Tableau_de_suivi[Clôturé]=\"OUI\",ROW(Tableau_de_suivi[Clôturé])-2),ROWS($1:54)),COLUMN()),\"\")","v":""},{"$f":"IFERROR(INDEX(Tableau_de_suivi[[N°]:[Clôturé]],SMALL(IF(Tableau_de_suivi[Clôturé]=\"OUI\",ROW(Tableau_de_suivi[Clôturé])-2),ROWS($1:54)),COLUMN()),\"\")","v":""}]
[{"$f":"IFERROR(INDEX(Tableau_de_suivi[[N°]:[Clôturé]],SMALL(IF(Tableau_de_suivi[Clôturé]=\"OUI\",ROW(Tableau_de_suivi[Clôturé])-2),ROWS($1:55)),COLUMN()),\"\")","v":""},{"$f":"IFERROR(INDEX(Tableau_de_suivi[[N°]:[Clôturé]],SMALL(IF(Tableau_de_suivi[Clôturé]=\"OUI\",ROW(Tableau_de_suivi[Clôturé])-2),ROWS($1:55)),COLUMN()),\"\")","v":""},{"$f":"IFERROR(INDEX(Tableau_de_suivi[[N°]:[Clôturé]],SMALL(IF(Tableau_de_suivi[Clôturé]=\"OUI\",ROW(Tableau_de_suivi[Clôturé])-2),ROWS($1:55)),COLUMN()),\"\")","v":""},{"$f":"IFERROR(INDEX(Tableau_de_suivi[[N°]:[Clôturé]],SMALL(IF(Tableau_de_suivi[Clôturé]=\"OUI\",ROW(Tableau_de_suivi[Clôturé])-2),ROWS($1:55)),COLUMN()),\"\")","v":""},{"$f":"IFERROR(INDEX(Tableau_de_suivi[[N°]:[Clôturé]],SMALL(IF(Tableau_de_suivi[Clôturé]=\"OUI\",ROW(Tableau_de_suivi[Clôturé])-2),ROWS($1:55)),COLUMN()),\"\")","v":""},{"$f":"IFERROR(INDEX(Tableau_de_suivi[[N°]:[Clôturé]],SMALL(IF(Tableau_de_suivi[Clôturé]=\"OUI\",ROW(Tableau_de_suivi[Clôturé])-2),ROWS($1:55)),COLUMN()),\"\")","v":""},{"$f":"IFERROR(INDEX(Tableau_de_suivi[[N°]:[Clôturé]],SMALL(IF(Tableau_de_suivi[Clôturé]=\"OUI\",ROW(Tableau_de_suivi[Clôturé])-2),ROWS($1:55)),COLUMN()),\"\")","v":""},{"$f":"IFERROR(INDEX(Tableau_de_suivi[[N°]:[Clôturé]],SMALL(IF(Tableau_de_suivi[Clôturé]=\"OUI\",ROW(Tableau_de_suivi[Clôturé])-2),ROWS($1:55)),COLUMN()),\"\")","v":""},{"$f":"IFERROR(INDEX(Tableau_de_suivi[[N°]:[Clôturé]],SMALL(IF(Tableau_de_suivi[Clôturé]=\"OUI\",ROW(Tableau_de_suivi[Clôturé])-2),ROWS($1:55)),COLUMN()),\"\")","v":""},{"$f":"IFERROR(INDEX(Tableau_de_suivi[[N°]:[Clôturé]],SMALL(IF(Tableau_de_suivi[Clôturé]=\"OUI\",ROW(Tableau_de_suivi[Clôturé])-2),ROWS($1:55)),COLUMN()),\"\")","v":""},{"$f":"IFERROR(INDEX(Tableau_de_suivi[[N°]:[Clôturé]],SMALL(IF(Tableau_de_suivi[Clôturé]=\"OUI\",ROW(Tableau_de_suivi[Clôturé])-2),ROWS($1:55)),COLUMN()),\"\")","v":""},{"$f":"IFERROR(INDEX(Tableau_de_suivi[[N°]:[Clôturé]],SMALL(IF(Tableau_de_suivi[Clôturé]=\"OUI\",ROW(Tableau_de_suivi[Clôturé])-2),ROWS($1:55)),COLUMN()),\"\")","v":""},{"$f":"IFERROR(INDEX(Tableau_de_suivi[[N°]:[Clôturé]],SMALL(IF(Tableau_de_suivi[Clôturé]=\"OUI\",ROW(Tableau_de_suivi[Clôturé])-2),ROWS($1:55)),COLUMN()),\"\")","v":""},{"$f":"IFERROR(INDEX(Tableau_de_suivi[[N°]:[Clôturé]],SMALL(IF(Tableau_de_suivi[Clôturé]=\"OUI\",ROW(Tableau_de_suivi[Clôturé])-2),ROWS($1:55)),COLUMN()),\"\")","v":""},{"$f":"IFERROR(INDEX(Tableau_de_suivi[[N°]:[Clôturé]],SMALL(IF(Tableau_de_suivi[Clôturé]=\"OUI\",ROW(Tableau_de_suivi[Clôturé])-2),ROWS($1:55)),COLUMN()),\"\")","v":""},{"$f":"IFERROR(INDEX(Tableau_de_suivi[[N°]:[Clôturé]],SMALL(IF(Tableau_de_suivi[Clôturé]=\"OUI\",ROW(Tableau_de_suivi[Clôturé])-2),ROWS($1:55)),COLUMN()),\"\")","v":""},{"$f":"IFERROR(INDEX(Tableau_de_suivi[[N°]:[Clôturé]],SMALL(IF(Tableau_de_suivi[Clôturé]=\"OUI\",ROW(Tableau_de_suivi[Clôturé])-2),ROWS($1:55)),COLUMN()),\"\")","v":""},{"$f":"IFERROR(INDEX(Tableau_de_suivi[[N°]:[Clôturé]],SMALL(IF(Tableau_de_suivi[Clôturé]=\"OUI\",ROW(Tableau_de_suivi[Clôturé])-2),ROWS($1:55)),COLUMN()),\"\")","v":""},{"$f":"IFERROR(INDEX(Tableau_de_suivi[[N°]:[Clôturé]],SMALL(IF(Tableau_de_suivi[Clôturé]=\"OUI\",ROW(Tableau_de_suivi[Clôturé])-2),ROWS($1:55)),COLUMN()),\"\")","v":""},{"$f":"IFERROR(INDEX(Tableau_de_suivi[[N°]:[Clôturé]],SMALL(IF(Tableau_de_suivi[Clôturé]=\"OUI\",ROW(Tableau_de_suivi[Clôturé])-2),ROWS($1:55)),COLUMN()),\"\")","v":""},{"$f":"IFERROR(INDEX(Tableau_de_suivi[[N°]:[Clôturé]],SMALL(IF(Tableau_de_suivi[Clôturé]=\"OUI\",ROW(Tableau_de_suivi[Clôturé])-2),ROWS($1:55)),COLUMN()),\"\")","v":""},{"$f":"IFERROR(INDEX(Tableau_de_suivi[[N°]:[Clôturé]],SMALL(IF(Tableau_de_suivi[Clôturé]=\"OUI\",ROW(Tableau_de_suivi[Clôturé])-2),ROWS($1:55)),COLUMN()),\"\")","v":""}]
[{"$f":"IFERROR(INDEX(Tableau_de_suivi[[N°]:[Clôturé]],SMALL(IF(Tableau_de_suivi[Clôturé]=\"OUI\",ROW(Tableau_de_suivi[Clôturé])-2),ROWS($1:56)),COLUMN()),\"\")","v":""},{"$f":"IFERROR(INDEX(Tableau_de_suivi[[N°]:[Clôturé]],SMALL(IF(Tableau_de_suivi[Clôturé]=\"OUI\",ROW(Tableau_de_suivi[Clôturé])-2),ROWS($1:56)),COLUMN()),\"\")","v":""},{"$f":"IFERROR(INDEX(Tableau_de_suivi[[N°]:[Clôturé]],SMALL(IF(Tableau_de_suivi[Clôturé]=\"OUI\",ROW(Tableau_de_suivi[Clôturé])-2),ROWS($1:56)),COLUMN()),\"\")","v":""},{"$f":"IFERROR(INDEX(Tableau_de_suivi[[N°]:[Clôturé]],SMALL(IF(Tableau_de_suivi[Clôturé]=\"OUI\",ROW(Tableau_de_suivi[Clôturé])-2),ROWS($1:56)),COLUMN()),\"\")","v":""},{"$f":"IFERROR(INDEX(Tableau_de_suivi[[N°]:[Clôturé]],SMALL(IF(Tableau_de_suivi[Clôturé]=\"OUI\",ROW(Tableau_de_suivi[Clôturé])-2),ROWS($1:56)),COLUMN()),\"\")","v":""},{"$f":"IFERROR(INDEX(Tableau_de_suivi[[N°]:[Clôturé]],SMALL(IF(Tableau_de_suivi[Clôturé]=\"OUI\",ROW(Tableau_de_suivi[Clôturé])-2),ROWS($1:56)),COLUMN()),\"\")","v":""},{"$f":"IFERROR(INDEX(Tableau_de_suivi[[N°]:[Clôturé]],SMALL(IF(Tableau_de_suivi[Clôturé]=\"OUI\",ROW(Tableau_de_suivi[Clôturé])-2),ROWS($1:56)),COLUMN()),\"\")","v":""},{"$f":"IFERROR(INDEX(Tableau_de_suivi[[N°]:[Clôturé]],SMALL(IF(Tableau_de_suivi[Clôturé]=\"OUI\",ROW(Tableau_de_suivi[Clôturé])-2),ROWS($1:56)),COLUMN()),\"\")","v":""},{"$f":"IFERROR(INDEX(Tableau_de_suivi[[N°]:[Clôturé]],SMALL(IF(Tableau_de_suivi[Clôturé]=\"OUI\",ROW(Tableau_de_suivi[Clôturé])-2),ROWS($1:56)),COLUMN()),\"\")","v":""},{"$f":"IFERROR(INDEX(Tableau_de_suivi[[N°]:[Clôturé]],SMALL(IF(Tableau_de_suivi[Clôturé]=\"OUI\",ROW(Tableau_de_suivi[Clôturé])-2),ROWS($1:56)),COLUMN()),\"\")","v":""},{"$f":"IFERROR(INDEX(Tableau_de_suivi[[N°]:[Clôturé]],SMALL(IF(Tableau_de_suivi[Clôturé]=\"OUI\",ROW(Tableau_de_suivi[Clôturé])-2),ROWS($1:56)),COLUMN()),\"\")","v":""},{"$f":"IFERROR(INDEX(Tableau_de_suivi[[N°]:[Clôturé]],SMALL(IF(Tableau_de_suivi[Clôturé]=\"OUI\",ROW(Tableau_de_suivi[Clôturé])-2),ROWS($1:56)),COLUMN()),\"\")","v":""},{"$f":"IFERROR(INDEX(Tableau_de_suivi[[N°]:[Clôturé]],SMALL(IF(Tableau_de_suivi[Clôturé]=\"OUI\",ROW(Tableau_de_suivi[Clôturé])-2),ROWS($1:56)),COLUMN()),\"\")","v":""},{"$f":"IFERROR(INDEX(Tableau_de_suivi[[N°]:[Clôturé]],SMALL(IF(Tableau_de_suivi[Clôturé]=\"OUI\",ROW(Tableau_de_suivi[Clôturé])-2),ROWS($1:56)),COLUMN()),\"\")","v":""},{"$f":"IFERROR(INDEX(Tableau_de_suivi[[N°]:[Clôturé]],SMALL(IF(Tableau_de_suivi[Clôturé]=\"OUI\",ROW(Tableau_de_suivi[Clôturé])-2),ROWS($1:56)),COLUMN()),\"\")","v":""},{"$f":"IFERROR(INDEX(Tableau_de_suivi[[N°]:[Clôturé]],SMALL(IF(Tableau_de_suivi[Clôturé]=\"OUI\",ROW(Tableau_de_suivi[Clôturé])-2),ROWS($1:56)),COLUMN()),\"\")","v":""},{"$f":"IFERROR(INDEX(Tableau_de_suivi[[N°]:[Clôturé]],SMALL(IF(Tableau_de_suivi[Clôturé]=\"OUI\",ROW(Tableau_de_suivi[Clôturé])-2),ROWS($1:56)),COLUMN()),\"\")","v":""},{"$f":"IFERROR(INDEX(Tableau_de_suivi[[N°]:[Clôturé]],SMALL(IF(Tableau_de_suivi[Clôturé]=\"OUI\",ROW(Tableau_de_suivi[Clôturé])-2),ROWS($1:56)),COLUMN()),\"\")","v":""},{"$f":"IFERROR(INDEX(Tableau_de_suivi[[N°]:[Clôturé]],SMALL(IF(Tableau_de_suivi[Clôturé]=\"OUI\",ROW(Tableau_de_suivi[Clôturé])-2),ROWS($1:56)),COLUMN()),\"\")","v":""},{"$f":"IFERROR(INDEX(Tableau_de_suivi[[N°]:[Clôturé]],SMALL(IF(Tableau_de_suivi[Clôturé]=\"OUI\",ROW(Tableau_de_suivi[Clôturé])-2),ROWS($1:56)),COLUMN()),\"\")","v":""},{"$f":"IFERROR(INDEX(Tableau_de_suivi[[N°]:[Clôturé]],SMALL(IF(Tableau_de_suivi[Clôturé]=\"OUI\",ROW(Tableau_de_suivi[Clôturé])-2),ROWS($1:56)),COLUMN()),\"\")","v":""},{"$f":"IFERROR(INDEX(Tableau_de_suivi[[N°]:[Clôturé]],SMALL(IF(Tableau_de_suivi[Clôturé]=\"OUI\",ROW(Tableau_de_suivi[Clôturé])-2),ROWS($1:56)),COLUMN()),\"\")","v":""}]
[{"$f":"IFERROR(INDEX(Tableau_de_suivi[[N°]:[Clôturé]],SMALL(IF(Tableau_de_suivi[Clôturé]=\"OUI\",ROW(Tableau_de_suivi[Clôturé])-2),ROWS($1:57)),COLUMN()),\"\")","v":""},{"$f":"IFERROR(INDEX(Tableau_de_suivi[[N°]:[Clôturé]],SMALL(IF(Tableau_de_suivi[Clôturé]=\"OUI\",ROW(Tableau_de_suivi[Clôturé])-2),ROWS($1:57)),COLUMN()),\"\")","v":""},{"$f":"IFERROR(INDEX(Tableau_de_suivi[[N°]:[Clôturé]],SMALL(IF(Tableau_de_suivi[Clôturé]=\"OUI\",ROW(Tableau_de_suivi[Clôturé])-2),ROWS($1:57)),COLUMN()),\"\")","v":""},{"$f":"IFERROR(INDEX(Tableau_de_suivi[[N°]:[Clôturé]],SMALL(IF(Tableau_de_suivi[Clôturé]=\"OUI\",ROW(Tableau_de_suivi[Clôturé])-2),ROWS($1:57)),COLUMN()),\"\")","v":""},{"$f":"IFERROR(INDEX(Tableau_de_suivi[[N°]:[Clôturé]],SMALL(IF(Tableau_de_suivi[Clôturé]=\"OUI\",ROW(Tableau_de_suivi[Clôturé])-2),ROWS($1:57)),COLUMN()),\"\")","v":""},{"$f":"IFERROR(INDEX(Tableau_de_suivi[[N°]:[Clôturé]],SMALL(IF(Tableau_de_suivi[Clôturé]=\"OUI\",ROW(Tableau_de_suivi[Clôturé])-2),ROWS($1:57)),COLUMN()),\"\")","v":""},{"$f":"IFERROR(INDEX(Tableau_de_suivi[[N°]:[Clôturé]],SMALL(IF(Tableau_de_suivi[Clôturé]=\"OUI\",ROW(Tableau_de_suivi[Clôturé])-2),ROWS($1:57)),COLUMN()),\"\")","v":""},{"$f":"IFERROR(INDEX(Tableau_de_suivi[[N°]:[Clôturé]],SMALL(IF(Tableau_de_suivi[Clôturé]=\"OUI\",ROW(Tableau_de_suivi[Clôturé])-2),ROWS($1:57)),COLUMN()),\"\")","v":""},{"$f":"IFERROR(INDEX(Tableau_de_suivi[[N°]:[Clôturé]],SMALL(IF(Tableau_de_suivi[Clôturé]=\"OUI\",ROW(Tableau_de_suivi[Clôturé])-2),ROWS($1:57)),COLUMN()),\"\")","v":""},{"$f":"IFERROR(INDEX(Tableau_de_suivi[[N°]:[Clôturé]],SMALL(IF(Tableau_de_suivi[Clôturé]=\"OUI\",ROW(Tableau_de_suivi[Clôturé])-2),ROWS($1:57)),COLUMN()),\"\")","v":""},{"$f":"IFERROR(INDEX(Tableau_de_suivi[[N°]:[Clôturé]],SMALL(IF(Tableau_de_suivi[Clôturé]=\"OUI\",ROW(Tableau_de_suivi[Clôturé])-2),ROWS($1:57)),COLUMN()),\"\")","v":""},{"$f":"IFERROR(INDEX(Tableau_de_suivi[[N°]:[Clôturé]],SMALL(IF(Tableau_de_suivi[Clôturé]=\"OUI\",ROW(Tableau_de_suivi[Clôturé])-2),ROWS($1:57)),COLUMN()),\"\")","v":""},{"$f":"IFERROR(INDEX(Tableau_de_suivi[[N°]:[Clôturé]],SMALL(IF(Tableau_de_suivi[Clôturé]=\"OUI\",ROW(Tableau_de_suivi[Clôturé])-2),ROWS($1:57)),COLUMN()),\"\")","v":""},{"$f":"IFERROR(INDEX(Tableau_de_suivi[[N°]:[Clôturé]],SMALL(IF(Tableau_de_suivi[Clôturé]=\"OUI\",ROW(Tableau_de_suivi[Clôturé])-2),ROWS($1:57)),COLUMN()),\"\")","v":""},{"$f":"IFERROR(INDEX(Tableau_de_suivi[[N°]:[Clôturé]],SMALL(IF(Tableau_de_suivi[Clôturé]=\"OUI\",ROW(Tableau_de_suivi[Clôturé])-2),ROWS($1:57)),COLUMN()),\"\")","v":""},{"$f":"IFERROR(INDEX(Tableau_de_suivi[[N°]:[Clôturé]],SMALL(IF(Tableau_de_suivi[Clôturé]=\"OUI\",ROW(Tableau_de_suivi[Clôturé])-2),ROWS($1:57)),COLUMN()),\"\")","v":""},{"$f":"IFERROR(INDEX(Tableau_de_suivi[[N°]:[Clôturé]],SMALL(IF(Tableau_de_suivi[Clôturé]=\"OUI\",ROW(Tableau_de_suivi[Clôturé])-2),ROWS($1:57)),COLUMN()),\"\")","v":""},{"$f":"IFERROR(INDEX(Tableau_de_suivi[[N°]:[Clôturé]],SMALL(IF(Tableau_de_suivi[Clôturé]=\"OUI\",ROW(Tableau_de_suivi[Clôturé])-2),ROWS($1:57)),COLUMN()),\"\")","v":""},{"$f":"IFERROR(INDEX(Tableau_de_suivi[[N°]:[Clôturé]],SMALL(IF(Tableau_de_suivi[Clôturé]=\"OUI\",ROW(Tableau_de_suivi[Clôturé])-2),ROWS($1:57)),COLUMN()),\"\")","v":""},{"$f":"IFERROR(INDEX(Tableau_de_suivi[[N°]:[Clôturé]],SMALL(IF(Tableau_de_suivi[Clôturé]=\"OUI\",ROW(Tableau_de_suivi[Clôturé])-2),ROWS($1:57)),COLUMN()),\"\")","v":""},{"$f":"IFERROR(INDEX(Tableau_de_suivi[[N°]:[Clôturé]],SMALL(IF(Tableau_de_suivi[Clôturé]=\"OUI\",ROW(Tableau_de_suivi[Clôturé])-2),ROWS($1:57)),COLUMN()),\"\")","v":""},{"$f":"IFERROR(INDEX(Tableau_de_suivi[[N°]:[Clôturé]],SMALL(IF(Tableau_de_suivi[Clôturé]=\"OUI\",ROW(Tableau_de_suivi[Clôturé])-2),ROWS($1:57)),COLUMN()),\"\")","v":""}]
[{"$f":"IFERROR(INDEX(Tableau_de_suivi[[N°]:[Clôturé]],SMALL(IF(Tableau_de_suivi[Clôturé]=\"OUI\",ROW(Tableau_de_suivi[Clôturé])-2),ROWS($1:58)),COLUMN()),\"\")","v":""},{"$f":"IFERROR(INDEX(Tableau_de_suivi[[N°]:[Clôturé]],SMALL(IF(Tableau_de_suivi[Clôturé]=\"OUI\",ROW(Tableau_de_suivi[Clôturé])-2),ROWS($1:58)),COLUMN()),\"\")","v":""},{"$f":"IFERROR(INDEX(Tableau_de_suivi[[N°]:[Clôturé]],SMALL(IF(Tableau_de_suivi[Clôturé]=\"OUI\",ROW(Tableau_de_suivi[Clôturé])-2),ROWS($1:58)),COLUMN()),\"\")","v":""},{"$f":"IFERROR(INDEX(Tableau_de_suivi[[N°]:[Clôturé]],SMALL(IF(Tableau_de_suivi[Clôturé]=\"OUI\",ROW(Tableau_de_suivi[Clôturé])-2),ROWS($1:58)),COLUMN()),\"\")","v":""},{"$f":"IFERROR(INDEX(Tableau_de_suivi[[N°]:[Clôturé]],SMALL(IF(Tableau_de_suivi[Clôturé]=\"OUI\",ROW(Tableau_de_suivi[Clôturé])-2),ROWS($1:58)),COLUMN()),\"\")","v":""},{"$f":"IFERROR(INDEX(Tableau_de_suivi[[N°]:[Clôturé]],SMALL(IF(Tableau_de_suivi[Clôturé]=\"OUI\",ROW(Tableau_de_suivi[Clôturé])-2),ROWS($1:58)),COLUMN()),\"\")","v":""},{"$f":"IFERROR(INDEX(Tableau_de_suivi[[N°]:[Clôturé]],SMALL(IF(Tableau_de_suivi[Clôturé]=\"OUI\",ROW(Tableau_de_suivi[Clôturé])-2),ROWS($1:58)),COLUMN()),\"\")","v":""},{"$f":"IFERROR(INDEX(Tableau_de_suivi[[N°]:[Clôturé]],SMALL(IF(Tableau_de_suivi[Clôturé]=\"OUI\",ROW(Tableau_de_suivi[Clôturé])-2),ROWS($1:58)),COLUMN()),\"\")","v":""},{"$f":"IFERROR(INDEX(Tableau_de_suivi[[N°]:[Clôturé]],SMALL(IF(Tableau_de_suivi[Clôturé]=\"OUI\",ROW(Tableau_de_suivi[Clôturé])-2),ROWS($1:58)),COLUMN()),\"\")","v":""},{"$f":"IFERROR(INDEX(Tableau_de_suivi[[N°]:[Clôturé]],SMALL(IF(Tableau_de_suivi[Clôturé]=\"OUI\",ROW(Tableau_de_suivi[Clôturé])-2),ROWS($1:58)),COLUMN()),\"\")","v":""},{"$f":"IFERROR(INDEX(Tableau_de_suivi[[N°]:[Clôturé]],SMALL(IF(Tableau_de_suivi[Clôturé]=\"OUI\",ROW(Tableau_de_suivi[Clôturé])-2),ROWS($1:58)),COLUMN()),\"\")","v":""},{"$f":"IFERROR(INDEX(Tableau_de_suivi[[N°]:[Clôturé]],SMALL(IF(Tableau_de_suivi[Clôturé]=\"OUI\",ROW(Tableau_de_suivi[Clôturé])-2),ROWS($1:58)),COLUMN()),\"\")","v":""},{"$f":"IFERROR(INDEX(Tableau_de_suivi[[N°]:[Clôturé]],SMALL(IF(Tableau_de_suivi[Clôturé]=\"OUI\",ROW(Tableau_de_suivi[Clôturé])-2),ROWS($1:58)),COLUMN()),\"\")","v":""},{"$f":"IFERROR(INDEX(Tableau_de_suivi[[N°]:[Clôturé]],SMALL(IF(Tableau_de_suivi[Clôturé]=\"OUI\",ROW(Tableau_de_suivi[Clôturé])-2),ROWS($1:58)),COLUMN()),\"\")","v":""},{"$f":"IFERROR(INDEX(Tableau_de_suivi[[N°]:[Clôturé]],SMALL(IF(Tableau_de_suivi[Clôturé]=\"OUI\",ROW(Tableau_de_suivi[Clôturé])-2),ROWS($1:58)),COLUMN()),\"\")","v":""},{"$f":"IFERROR(INDEX(Tableau_de_suivi[[N°]:[Clôturé]],SMALL(IF(Tableau_de_suivi[Clôturé]=\"OUI\",ROW(Tableau_de_suivi[Clôturé])-2),ROWS($1:58)),COLUMN()),\"\")","v":""},{"$f":"IFERROR(INDEX(Tableau_de_suivi[[N°]:[Clôturé]],SMALL(IF(Tableau_de_suivi[Clôturé]=\"OUI\",ROW(Tableau_de_suivi[Clôturé])-2),ROWS($1:58)),COLUMN()),\"\")","v":""},{"$f":"IFERROR(INDEX(Tableau_de_suivi[[N°]:[Clôturé]],SMALL(IF(Tableau_de_suivi[Clôturé]=\"OUI\",ROW(Tableau_de_suivi[Clôturé])-2),ROWS($1:58)),COLUMN()),\"\")","v":""},{"$f":"IFERROR(INDEX(Tableau_de_suivi[[N°]:[Clôturé]],SMALL(IF(Tableau_de_suivi[Clôturé]=\"OUI\",ROW(Tableau_de_suivi[Clôturé])-2),ROWS($1:58)),COLUMN()),\"\")","v":""},{"$f":"IFERROR(INDEX(Tableau_de_suivi[[N°]:[Clôturé]],SMALL(IF(Tableau_de_suivi[Clôturé]=\"OUI\",ROW(Tableau_de_suivi[Clôturé])-2),ROWS($1:58)),COLUMN()),\"\")","v":""},{"$f":"IFERROR(INDEX(Tableau_de_suivi[[N°]:[Clôturé]],SMALL(IF(Tableau_de_suivi[Clôturé]=\"OUI\",ROW(Tableau_de_suivi[Clôturé])-2),ROWS($1:58)),COLUMN()),\"\")","v":""},{"$f":"IFERROR(INDEX(Tableau_de_suivi[[N°]:[Clôturé]],SMALL(IF(Tableau_de_suivi[Clôturé]=\"OUI\",ROW(Tableau_de_suivi[Clôturé])-2),ROWS($1:58)),COLUMN()),\"\")","v":""}]
[{"$f":"IFERROR(INDEX(Tableau_de_suivi[[N°]:[Clôturé]],SMALL(IF(Tableau_de_suivi[Clôturé]=\"OUI\",ROW(Tableau_de_suivi[Clôturé])-2),ROWS($1:59)),COLUMN()),\"\")","v":""},{"$f":"IFERROR(INDEX(Tableau_de_suivi[[N°]:[Clôturé]],SMALL(IF(Tableau_de_suivi[Clôturé]=\"OUI\",ROW(Tableau_de_suivi[Clôturé])-2),ROWS($1:59)),COLUMN()),\"\")","v":""},{"$f":"IFERROR(INDEX(Tableau_de_suivi[[N°]:[Clôturé]],SMALL(IF(Tableau_de_suivi[Clôturé]=\"OUI\",ROW(Tableau_de_suivi[Clôturé])-2),ROWS($1:59)),COLUMN()),\"\")","v":""},{"$f":"IFERROR(INDEX(Tableau_de_suivi[[N°]:[Clôturé]],SMALL(IF(Tableau_de_suivi[Clôturé]=\"OUI\",ROW(Tableau_de_suivi[Clôturé])-2),ROWS($1:59)),COLUMN()),\"\")","v":""},{"$f":"IFERROR(INDEX(Tableau_de_suivi[[N°]:[Clôturé]],SMALL(IF(Tableau_de_suivi[Clôturé]=\"OUI\",ROW(Tableau_de_suivi[Clôturé])-2),ROWS($1:59)),COLUMN()),\"\")","v":""},{"$f":"IFERROR(INDEX(Tableau_de_suivi[[N°]:[Clôturé]],SMALL(IF(Tableau_de_suivi[Clôturé]=\"OUI\",ROW(Tableau_de_suivi[Clôturé])-2),ROWS($1:59)),COLUMN()),\"\")","v":""},{"$f":"IFERROR(INDEX(Tableau_de_suivi[[N°]:[Clôturé]],SMALL(IF(Tableau_de_suivi[Clôturé]=\"OUI\",ROW(Tableau_de_suivi[Clôturé])-2),ROWS($1:59)),COLUMN()),\"\")","v":""},{"$f":"IFERROR(INDEX(Tableau_de_suivi[[N°]:[Clôturé]],SMALL(IF(Tableau_de_suivi[Clôturé]=\"OUI\",ROW(Tableau_de_suivi[Clôturé])-2),ROWS($1:59)),COLUMN()),\"\")","v":""},{"$f":"IFERROR(INDEX(Tableau_de_suivi[[N°]:[Clôturé]],SMALL(IF(Tableau_de_suivi[Clôturé]=\"OUI\",ROW(Tableau_de_suivi[Clôturé])-2),ROWS($1:59)),COLUMN()),\"\")","v":""},{"$f":"IFERROR(INDEX(Tableau_de_suivi[[N°]:[Clôturé]],SMALL(IF(Tableau_de_suivi[Clôturé]=\"OUI\",ROW(Tableau_de_suivi[Clôturé])-2),ROWS($1:59)),COLUMN()),\"\")","v":""},{"$f":"IFERROR(INDEX(Tableau_de_suivi[[N°]:[Clôturé]],SMALL(IF(Tableau_de_suivi[Clôturé]=\"OUI\",ROW(Tableau_de_suivi[Clôturé])-2),ROWS($1:59)),COLUMN()),\"\")","v":""},{"$f":"IFERROR(INDEX(Tableau_de_suivi[[N°]:[Clôturé]],SMALL(IF(Tableau_de_suivi[Clôturé]=\"OUI\",ROW(Tableau_de_suivi[Clôturé])-2),ROWS($1:59)),COLUMN()),\"\")","v":""},{"$f":"IFERROR(INDEX(Tableau_de_suivi[[N°]:[Clôturé]],SMALL(IF(Tableau_de_suivi[Clôturé]=\"OUI\",ROW(Tableau_de_suivi[Clôturé])-2),ROWS($1:59)),COLUMN()),\"\")","v":""},{"$f":"IFERROR(INDEX(Tableau_de_suivi[[N°]:[Clôturé]],SMALL(IF(Tableau_de_suivi[Clôturé]=\"OUI\",ROW(Tableau_de_suivi[Clôturé])-2),ROWS($1:59)),COLUMN()),\"\")","v":""},{"$f":"IFERROR(INDEX(Tableau_de_suivi[[N°]:[Clôturé]],SMALL(IF(Tableau_de_suivi[Clôturé]=\"OUI\",ROW(Tableau_de_suivi[Clôturé])-2),ROWS($1:59)),COLUMN()),\"\")","v":""},{"$f":"IFERROR(INDEX(Tableau_de_suivi[[N°]:[Clôturé]],SMALL(IF(Tableau_de_suivi[Clôturé]=\"OUI\",ROW(Tableau_de_suivi[Clôturé])-2),ROWS($1:59)),COLUMN()),\"\")","v":""},{"$f":"IFERROR(INDEX(Tableau_de_suivi[[N°]:[Clôturé]],SMALL(IF(Tableau_de_suivi[Clôturé]=\"OUI\",ROW(Tableau_de_suivi[Clôturé])-2),ROWS($1:59)),COLUMN()),\"\")","v":""},{"$f":"IFERROR(INDEX(Tableau_de_suivi[[N°]:[Clôturé]],SMALL(IF(Tableau_de_suivi[Clôturé]=\"OUI\",ROW(Tableau_de_suivi[Clôturé])-2),ROWS($1:59)),COLUMN()),\"\")","v":""},{"$f":"IFERROR(INDEX(Tableau_de_suivi[[N°]:[Clôturé]],SMALL(IF(Tableau_de_suivi[Clôturé]=\"OUI\",ROW(Tableau_de_suivi[Clôturé])-2),ROWS($1:59)),COLUMN()),\"\")","v":""},{"$f":"IFERROR(INDEX(Tableau_de_suivi[[N°]:[Clôturé]],SMALL(IF(Tableau_de_suivi[Clôturé]=\"OUI\",ROW(Tableau_de_suivi[Clôturé])-2),ROWS($1:59)),COLUMN()),\"\")","v":""},{"$f":"IFERROR(INDEX(Tableau_de_suivi[[N°]:[Clôturé]],SMALL(IF(Tableau_de_suivi[Clôturé]=\"OUI\",ROW(Tableau_de_suivi[Clôturé])-2),ROWS($1:59)),COLUMN()),\"\")","v":""},{"$f":"IFERROR(INDEX(Tableau_de_suivi[[N°]:[Clôturé]],SMALL(IF(Tableau_de_suivi[Clôturé]=\"OUI\",ROW(Tableau_de_suivi[Clôturé])-2),ROWS($1:59)),COLUMN()),\"\")","v":""}]
[{"$f":"IFERROR(INDEX(Tableau_de_suivi[[N°]:[Clôturé]],SMALL(IF(Tableau_de_suivi[Clôturé]=\"OUI\",ROW(Tableau_de_suivi[Clôturé])-2),ROWS($1:60)),COLUMN()),\"\")","v":""},{"$f":"IFERROR(INDEX(Tableau_de_suivi[[N°]:[Clôturé]],SMALL(IF(Tableau_de_suivi[Clôturé]=\"OUI\",ROW(Tableau_de_suivi[Clôturé])-2),ROWS($1:60)),COLUMN()),\"\")","v":""},{"$f":"IFERROR(INDEX(Tableau_de_suivi[[N°]:[Clôturé]],SMALL(IF(Tableau_de_suivi[Clôturé]=\"OUI\",ROW(Tableau_de_suivi[Clôturé])-2),ROWS($1:60)),COLUMN()),\"\")","v":""},{"$f":"IFERROR(INDEX(Tableau_de_suivi[[N°]:[Clôturé]],SMALL(IF(Tableau_de_suivi[Clôturé]=\"OUI\",ROW(Tableau_de_suivi[Clôturé])-2),ROWS($1:60)),COLUMN()),\"\")","v":""},{"$f":"IFERROR(INDEX(Tableau_de_suivi[[N°]:[Clôturé]],SMALL(IF(Tableau_de_suivi[Clôturé]=\"OUI\",ROW(Tableau_de_suivi[Clôturé])-2),ROWS($1:60)),COLUMN()),\"\")","v":""},{"$f":"IFERROR(INDEX(Tableau_de_suivi[[N°]:[Clôturé]],SMALL(IF(Tableau_de_suivi[Clôturé]=\"OUI\",ROW(Tableau_de_suivi[Clôturé])-2),ROWS($1:60)),COLUMN()),\"\")","v":""},{"$f":"IFERROR(INDEX(Tableau_de_suivi[[N°]:[Clôturé]],SMALL(IF(Tableau_de_suivi[Clôturé]=\"OUI\",ROW(Tableau_de_suivi[Clôturé])-2),ROWS($1:60)),COLUMN()),\"\")","v":""},{"$f":"IFERROR(INDEX(Tableau_de_suivi[[N°]:[Clôturé]],SMALL(IF(Tableau_de_suivi[Clôturé]=\"OUI\",ROW(Tableau_de_suivi[Clôturé])-2),ROWS($1:60)),COLUMN()),\"\")","v":""},{"$f":"IFERROR(INDEX(Tableau_de_suivi[[N°]:[Clôturé]],SMALL(IF(Tableau_de_suivi[Clôturé]=\"OUI\",ROW(Tableau_de_suivi[Clôturé])-2),ROWS($1:60)),COLUMN()),\"\")","v":""},{"$f":"IFERROR(INDEX(Tableau_de_suivi[[N°]:[Clôturé]],SMALL(IF(Tableau_de_suivi[Clôturé]=\"OUI\",ROW(Tableau_de_suivi[Clôturé])-2),ROWS($1:60)),COLUMN()),\"\")","v":""},{"$f":"IFERROR(INDEX(Tableau_de_suivi[[N°]:[Clôturé]],SMALL(IF(Tableau_de_suivi[Clôturé]=\"OUI\",ROW(Tableau_de_suivi[Clôturé])-2),ROWS($1:60)),COLUMN()),\"\")","v":""},{"$f":"IFERROR(INDEX(Tableau_de_suivi[[N°]:[Clôturé]],SMALL(IF(Tableau_de_suivi[Clôturé]=\"OUI\",ROW(Tableau_de_suivi[Clôturé])-2),ROWS($1:60)),COLUMN()),\"\")","v":""},{"$f":"IFERROR(INDEX(Tableau_de_suivi[[N°]:[Clôturé]],SMALL(IF(Tableau_de_suivi[Clôturé]=\"OUI\",ROW(Tableau_de_suivi[Clôturé])-2),ROWS($1:60)),COLUMN()),\"\")","v":""},{"$f":"IFERROR(INDEX(Tableau_de_suivi[[N°]:[Clôturé]],SMALL(IF(Tableau_de_suivi[Clôturé]=\"OUI\",ROW(Tableau_de_suivi[Clôturé])-2),ROWS($1:60)),COLUMN()),\"\")","v":""},{"$f":"IFERROR(INDEX(Tableau_de_suivi[[N°]:[Clôturé]],SMALL(IF(Tableau_de_suivi[Clôturé]=\"OUI\",ROW(Tableau_de_suivi[Clôturé])-2),ROWS($1:60)),COLUMN()),\"\")","v":""},{"$f":"IFERROR(INDEX(Tableau_de_suivi[[N°]:[Clôturé]],SMALL(IF(Tableau_de_suivi[Clôturé]=\"OUI\",ROW(Tableau_de_suivi[Clôturé])-2),ROWS($1:60)),COLUMN()),\"\")","v":""},{"$f":"IFERROR(INDEX(Tableau_de_suivi[[N°]:[Clôturé]],SMALL(IF(Tableau_de_suivi[Clôturé]=\"OUI\",ROW(Tableau_de_suivi[Clôturé])-2),ROWS($1:60)),COLUMN()),\"\")","v":""},{"$f":"IFERROR(INDEX(Tableau_de_suivi[[N°]:[Clôturé]],SMALL(IF(Tableau_de_suivi[Clôturé]=\"OUI\",ROW(Tableau_de_suivi[Clôturé])-2),ROWS($1:60)),COLUMN()),\"\")","v":""},{"$f":"IFERROR(INDEX(Tableau_de_suivi[[N°]:[Clôturé]],SMALL(IF(Tableau_de_suivi[Clôturé]=\"OUI\",ROW(Tableau_de_suivi[Clôturé])-2),ROWS($1:60)),COLUMN()),\"\")","v":""},{"$f":"IFERROR(INDEX(Tableau_de_suivi[[N°]:[Clôturé]],SMALL(IF(Tableau_de_suivi[Clôturé]=\"OUI\",ROW(Tableau_de_suivi[Clôturé])-2),ROWS($1:60)),COLUMN()),\"\")","v":""},{"$f":"IFERROR(INDEX(Tableau_de_suivi[[N°]:[Clôturé]],SMALL(IF(Tableau_de_suivi[Clôturé]=\"OUI\",ROW(Tableau_de_suivi[Clôturé])-2),ROWS($1:60)),COLUMN()),\"\")","v":""},{"$f":"IFERROR(INDEX(Tableau_de_suivi[[N°]:[Clôturé]],SMALL(IF(Tableau_de_suivi[Clôturé]=\"OUI\",ROW(Tableau_de_suivi[Clôturé])-2),ROWS($1:60)),COLUMN()),\"\")","v":""}]
[{"$f":"IFERROR(INDEX(Tableau_de_suivi[[N°]:[Clôturé]],SMALL(IF(Tableau_de_suivi[Clôturé]=\"OUI\",ROW(Tableau_de_suivi[Clôturé])-2),ROWS($1:61)),COLUMN()),\"\")","v":""},{"$f":"IFERROR(INDEX(Tableau_de_suivi[[N°]:[Clôturé]],SMALL(IF(Tableau_de_suivi[Clôturé]=\"OUI\",ROW(Tableau_de_suivi[Clôturé])-2),ROWS($1:61)),COLUMN()),\"\")","v":""},{"$f":"IFERROR(INDEX(Tableau_de_suivi[[N°]:[Clôturé]],SMALL(IF(Tableau_de_suivi[Clôturé]=\"OUI\",ROW(Tableau_de_suivi[Clôturé])-2),ROWS($1:61)),COLUMN()),\"\")","v":""},{"$f":"IFERROR(INDEX(Tableau_de_suivi[[N°]:[Clôturé]],SMALL(IF(Tableau_de_suivi[Clôturé]=\"OUI\",ROW(Tableau_de_suivi[Clôturé])-2),ROWS($1:61)),COLUMN()),\"\")","v":""},{"$f":"IFERROR(INDEX(Tableau_de_suivi[[N°]:[Clôturé]],SMALL(IF(Tableau_de_suivi[Clôturé]=\"OUI\",ROW(Tableau_de_suivi[Clôturé])-2),ROWS($1:61)),COLUMN()),\"\")","v":""},{"$f":"IFERROR(INDEX(Tableau_de_suivi[[N°]:[Clôturé]],SMALL(IF(Tableau_de_suivi[Clôturé]=\"OUI\",ROW(Tableau_de_suivi[Clôturé])-2),ROWS($1:61)),COLUMN()),\"\")","v":""},{"$f":"IFERROR(INDEX(Tableau_de_suivi[[N°]:[Clôturé]],SMALL(IF(Tableau_de_suivi[Clôturé]=\"OUI\",ROW(Tableau_de_suivi[Clôturé])-2),ROWS($1:61)),COLUMN()),\"\")","v":""},{"$f":"IFERROR(INDEX(Tableau_de_suivi[[N°]:[Clôturé]],SMALL(IF(Tableau_de_suivi[Clôturé]=\"OUI\",ROW(Tableau_de_suivi[Clôturé])-2),ROWS($1:61)),COLUMN()),\"\")","v":""},{"$f":"IFERROR(INDEX(Tableau_de_suivi[[N°]:[Clôturé]],SMALL(IF(Tableau_de_suivi[Clôturé]=\"OUI\",ROW(Tableau_de_suivi[Clôturé])-2),ROWS($1:61)),COLUMN()),\"\")","v":""},{"$f":"IFERROR(INDEX(Tableau_de_suivi[[N°]:[Clôturé]],SMALL(IF(Tableau_de_suivi[Clôturé]=\"OUI\",ROW(Tableau_de_suivi[Clôturé])-2),ROWS($1:61)),COLUMN()),\"\")","v":""},{"$f":"IFERROR(INDEX(Tableau_de_suivi[[N°]:[Clôturé]],SMALL(IF(Tableau_de_suivi[Clôturé]=\"OUI\",ROW(Tableau_de_suivi[Clôturé])-2),ROWS($1:61)),COLUMN()),\"\")","v":""},{"$f":"IFERROR(INDEX(Tableau_de_suivi[[N°]:[Clôturé]],SMALL(IF(Tableau_de_suivi[Clôturé]=\"OUI\",ROW(Tableau_de_suivi[Clôturé])-2),ROWS($1:61)),COLUMN()),\"\")","v":""},{"$f":"IFERROR(INDEX(Tableau_de_suivi[[N°]:[Clôturé]],SMALL(IF(Tableau_de_suivi[Clôturé]=\"OUI\",ROW(Tableau_de_suivi[Clôturé])-2),ROWS($1:61)),COLUMN()),\"\")","v":""},{"$f":"IFERROR(INDEX(Tableau_de_suivi[[N°]:[Clôturé]],SMALL(IF(Tableau_de_suivi[Clôturé]=\"OUI\",ROW(Tableau_de_suivi[Clôturé])-2),ROWS($1:61)),COLUMN()),\"\")","v":""},{"$f":"IFERROR(INDEX(Tableau_de_suivi[[N°]:[Clôturé]],SMALL(IF(Tableau_de_suivi[Clôturé]=\"OUI\",ROW(Tableau_de_suivi[Clôturé])-2),ROWS($1:61)),COLUMN()),\"\")","v":""},{"$f":"IFERROR(INDEX(Tableau_de_suivi[[N°]:[Clôturé]],SMALL(IF(Tableau_de_suivi[Clôturé]=\"OUI\",ROW(Tableau_de_suivi[Clôturé])-2),ROWS($1:61)),COLUMN()),\"\")","v":""},{"$f":"IFERROR(INDEX(Tableau_de_suivi[[N°]:[Clôturé]],SMALL(IF(Tableau_de_suivi[Clôturé]=\"OUI\",ROW(Tableau_de_suivi[Clôturé])-2),ROWS($1:61)),COLUMN()),\"\")","v":""},{"$f":"IFERROR(INDEX(Tableau_de_suivi[[N°]:[Clôturé]],SMALL(IF(Tableau_de_suivi[Clôturé]=\"OUI\",ROW(Tableau_de_suivi[Clôturé])-2),ROWS($1:61)),COLUMN()),\"\")","v":""},{"$f":"IFERROR(INDEX(Tableau_de_suivi[[N°]:[Clôturé]],SMALL(IF(Tableau_de_suivi[Clôturé]=\"OUI\",ROW(Tableau_de_suivi[Clôturé])-2),ROWS($1:61)),COLUMN()),\"\")","v":""},{"$f":"IFERROR(INDEX(Tableau_de_suivi[[N°]:[Clôturé]],SMALL(IF(Tableau_de_suivi[Clôturé]=\"OUI\",ROW(Tableau_de_suivi[Clôturé])-2),ROWS($1:61)),COLUMN()),\"\")","v":""},{"$f":"IFERROR(INDEX(Tableau_de_suivi[[N°]:[Clôturé]],SMALL(IF(Tableau_de_suivi[Clôturé]=\"OUI\",ROW(Tableau_de_suivi[Clôturé])-2),ROWS($1:61)),COLUMN()),\"\")","v":""},{"$f":"IFERROR(INDEX(Tableau_de_suivi[[N°]:[Clôturé]],SMALL(IF(Tableau_de_suivi[Clôturé]=\"OUI\",ROW(Tableau_de_suivi[Clôturé])-2),ROWS($1:61)),COLUMN()),\"\")","v":""}]
[{"$f":"IFERROR(INDEX(Tableau_de_suivi[[N°]:[Clôturé]],SMALL(IF(Tableau_de_suivi[Clôturé]=\"OUI\",ROW(Tableau_de_suivi[Clôturé])-2),ROWS($1:62)),COLUMN()),\"\")","v":""},{"$f":"IFERROR(INDEX(Tableau_de_suivi[[N°]:[Clôturé]],SMALL(IF(Tableau_de_suivi[Clôturé]=\"OUI\",ROW(Tableau_de_suivi[Clôturé])-2),ROWS($1:62)),COLUMN()),\"\")","v":""},{"$f":"IFERROR(INDEX(Tableau_de_suivi[[N°]:[Clôturé]],SMALL(IF(Tableau_de_suivi[Clôturé]=\"OUI\",ROW(Tableau_de_suivi[Clôturé])-2),ROWS($1:62)),COLUMN()),\"\")","v":""},{"$f":"IFERROR(INDEX(Tableau_de_suivi[[N°]:[Clôturé]],SMALL(IF(Tableau_de_suivi[Clôturé]=\"OUI\",ROW(Tableau_de_suivi[Clôturé])-2),ROWS($1:62)),COLUMN()),\"\")","v":""},{"$f":"IFERROR(INDEX(Tableau_de_suivi[[N°]:[Clôturé]],SMALL(IF(Tableau_de_suivi[Clôturé]=\"OUI\",ROW(Tableau_de_suivi[Clôturé])-2),ROWS($1:62)),COLUMN()),\"\")","v":""},{"$f":"IFERROR(INDEX(Tableau_de_suivi[[N°]:[Clôturé]],SMALL(IF(Tableau_de_suivi[Clôturé]=\"OUI\",ROW(Tableau_de_suivi[Clôturé])-2),ROWS($1:62)),COLUMN()),\"\")","v":""},{"$f":"IFERROR(INDEX(Tableau_de_suivi[[N°]:[Clôturé]],SMALL(IF(Tableau_de_suivi[Clôturé]=\"OUI\",ROW(Tableau_de_suivi[Clôturé])-2),ROWS($1:62)),COLUMN()),\"\")","v":""},{"$f":"IFERROR(INDEX(Tableau_de_suivi[[N°]:[Clôturé]],SMALL(IF(Tableau_de_suivi[Clôturé]=\"OUI\",ROW(Tableau_de_suivi[Clôturé])-2),ROWS($1:62)),COLUMN()),\"\")","v":""},{"$f":"IFERROR(INDEX(Tableau_de_suivi[[N°]:[Clôturé]],SMALL(IF(Tableau_de_suivi[Clôturé]=\"OUI\",ROW(Tableau_de_suivi[Clôturé])-2),ROWS($1:62)),COLUMN()),\"\")","v":""},{"$f":"IFERROR(INDEX(Tableau_de_suivi[[N°]:[Clôturé]],SMALL(IF(Tableau_de_suivi[Clôturé]=\"OUI\",ROW(Tableau_de_suivi[Clôturé])-2),ROWS($1:62)),COLUMN()),\"\")","v":""},{"$f":"IFERROR(INDEX(Tableau_de_suivi[[N°]:[Clôturé]],SMALL(IF(Tableau_de_suivi[Clôturé]=\"OUI\",ROW(Tableau_de_suivi[Clôturé])-2),ROWS($1:62)),COLUMN()),\"\")","v":""},{"$f":"IFERROR(INDEX(Tableau_de_suivi[[N°]:[Clôturé]],SMALL(IF(Tableau_de_suivi[Clôturé]=\"OUI\",ROW(Tableau_de_suivi[Clôturé])-2),ROWS($1:62)),COLUMN()),\"\")","v":""},{"$f":"IFERROR(INDEX(Tableau_de_suivi[[N°]:[Clôturé]],SMALL(IF(Tableau_de_suivi[Clôturé]=\"OUI\",ROW(Tableau_de_suivi[Clôturé])-2),ROWS($1:62)),COLUMN()),\"\")","v":""},{"$f":"IFERROR(INDEX(Tableau_de_suivi[[N°]:[Clôturé]],SMALL(IF(Tableau_de_suivi[Clôturé]=\"OUI\",ROW(Tableau_de_suivi[Clôturé])-2),ROWS($1:62)),COLUMN()),\"\")","v":""},{"$f":"IFERROR(INDEX(Tableau_de_suivi[[N°]:[Clôturé]],SMALL(IF(Tableau_de_suivi[Clôturé]=\"OUI\",ROW(Tableau_de_suivi[Clôturé])-2),ROWS($1:62)),COLUMN()),\"\")","v":""},{"$f":"IFERROR(INDEX(Tableau_de_suivi[[N°]:[Clôturé]],SMALL(IF(Tableau_de_suivi[Clôturé]=\"OUI\",ROW(Tableau_de_suivi[Clôturé])-2),ROWS($1:62)),COLUMN()),\"\")","v":""},{"$f":"IFERROR(INDEX(Tableau_de_suivi[[N°]:[Clôturé]],SMALL(IF(Tableau_de_suivi[Clôturé]=\"OUI\",ROW(Tableau_de_suivi[Clôturé])-2),ROWS($1:62)),COLUMN()),\"\")","v":""},{"$f":"IFERROR(INDEX(Tableau_de_suivi[[N°]:[Clôturé]],SMALL(IF(Tableau_de_suivi[Clôturé]=\"OUI\",ROW(Tableau_de_suivi[Clôturé])-2),ROWS($1:62)),COLUMN()),\"\")","v":""},{"$f":"IFERROR(INDEX(Tableau_de_suivi[[N°]:[Clôturé]],SMALL(IF(Tableau_de_suivi[Clôturé]=\"OUI\",ROW(Tableau_de_suivi[Clôturé])-2),ROWS($1:62)),COLUMN()),\"\")","v":""},{"$f":"IFERROR(INDEX(Tableau_de_suivi[[N°]:[Clôturé]],SMALL(IF(Tableau_de_suivi[Clôturé]=\"OUI\",ROW(Tableau_de_suivi[Clôturé])-2),ROWS($1:62)),COLUMN()),\"\")","v":""},{"$f":"IFERROR(INDEX(Tableau_de_suivi[[N°]:[Clôturé]],SMALL(IF(Tableau_de_suivi[Clôturé]=\"OUI\",ROW(Tableau_de_suivi[Clôturé])-2),ROWS($1:62)),COLUMN()),\"\")","v":""},{"$f":"IFERROR(INDEX(Tableau_de_suivi[[N°]:[Clôturé]],SMALL(IF(Tableau_de_suivi[Clôturé]=\"OUI\",ROW(Tableau_de_suivi[Clôturé])-2),ROWS($1:62)),COLUMN()),\"\")","v":""}]
[{"$f":"IFERROR(INDEX(Tableau_de_suivi[[N°]:[Clôturé]],SMALL(IF(Tableau_de_suivi[Clôturé]=\"OUI\",ROW(Tableau_de_suivi[Clôturé])-2),ROWS($1:63)),COLUMN()),\"\")","v":""},{"$f":"IFERROR(INDEX(Tableau_de_suivi[[N°]:[Clôturé]],SMALL(IF(Tableau_de_suivi[Clôturé]=\"OUI\",ROW(Tableau_de_suivi[Clôturé])-2),ROWS($1:63)),COLUMN()),\"\")","v":""},{"$f":"IFERROR(INDEX(Tableau_de_suivi[[N°]:[Clôturé]],SMALL(IF(Tableau_de_suivi[Clôturé]=\"OUI\",ROW(Tableau_de_suivi[Clôturé])-2),ROWS($1:63)),COLUMN()),\"\")","v":""},{"$f":"IFERROR(INDEX(Tableau_de_suivi[[N°]:[Clôturé]],SMALL(IF(Tableau_de_suivi[Clôturé]=\"OUI\",ROW(Tableau_de_suivi[Clôturé])-2),ROWS($1:63)),COLUMN()),\"\")","v":""},{"$f":"IFERROR(INDEX(Tableau_de_suivi[[N°]:[Clôturé]],SMALL(IF(Tableau_de_suivi[Clôturé]=\"OUI\",ROW(Tableau_de_suivi[Clôturé])-2),ROWS($1:63)),COLUMN()),\"\")","v":""},{"$f":"IFERROR(INDEX(Tableau_de_suivi[[N°]:[Clôturé]],SMALL(IF(Tableau_de_suivi[Clôturé]=\"OUI\",ROW(Tableau_de_suivi[Clôturé])-2),ROWS($1:63)),COLUMN()),\"\")","v":""},{"$f":"IFERROR(INDEX(Tableau_de_suivi[[N°]:[Clôturé]],SMALL(IF(Tableau_de_suivi[Clôturé]=\"OUI\",ROW(Tableau_de_suivi[Clôturé])-2),ROWS($1:63)),COLUMN()),\"\")","v":""},{"$f":"IFERROR(INDEX(Tableau_de_suivi[[N°]:[Clôturé]],SMALL(IF(Tableau_de_suivi[Clôturé]=\"OUI\",ROW(Tableau_de_suivi[Clôturé])-2),ROWS($1:63)),COLUMN()),\"\")","v":""},{"$f":"IFERROR(INDEX(Tableau_de_suivi[[N°]:[Clôturé]],SMALL(IF(Tableau_de_suivi[Clôturé]=\"OUI\",ROW(Tableau_de_suivi[Clôturé])-2),ROWS($1:63)),COLUMN()),\"\")","v":""},{"$f":"IFERROR(INDEX(Tableau_de_suivi[[N°]:[Clôturé]],SMALL(IF(Tableau_de_suivi[Clôturé]=\"OUI\",ROW(Tableau_de_suivi[Clôturé])-2),ROWS($1:63)),COLUMN()),\"\")","v":""},{"$f":"IFERROR(INDEX(Tableau_de_suivi[[N°]:[Clôturé]],SMALL(IF(Tableau_de_suivi[Clôturé]=\"OUI\",ROW(Tableau_de_suivi[Clôturé])-2),ROWS($1:63)),COLUMN()),\"\")","v":""},{"$f":"IFERROR(INDEX(Tableau_de_suivi[[N°]:[Clôturé]],SMALL(IF(Tableau_de_suivi[Clôturé]=\"OUI\",ROW(Tableau_de_suivi[Clôturé])-2),ROWS($1:63)),COLUMN()),\"\")","v":""},{"$f":"IFERROR(INDEX(Tableau_de_suivi[[N°]:[Clôturé]],SMALL(IF(Tableau_de_suivi[Clôturé]=\"OUI\",ROW(Tableau_de_suivi[Clôturé])-2),ROWS($1:63)),COLUMN()),\"\")","v":""},{"$f":"IFERROR(INDEX(Tableau_de_suivi[[N°]:[Clôturé]],SMALL(IF(Tableau_de_suivi[Clôturé]=\"OUI\",ROW(Tableau_de_suivi[Clôturé])-2),ROWS($1:63)),COLUMN()),\"\")","v":""},{"$f":"IFERROR(INDEX(Tableau_de_suivi[[N°]:[Clôturé]],SMALL(IF(Tableau_de_suivi[Clôturé]=\"OUI\",ROW(Tableau_de_suivi[Clôturé])-2),ROWS($1:63)),COLUMN()),\"\")","v":""},{"$f":"IFERROR(INDEX(Tableau_de_suivi[[N°]:[Clôturé]],SMALL(IF(Tableau_de_suivi[Clôturé]=\"OUI\",ROW(Tableau_de_suivi[Clôturé])-2),ROWS($1:63)),COLUMN()),\"\")","v":""},{"$f":"IFERROR(INDEX(Tableau_de_suivi[[N°]:[Clôturé]],SMALL(IF(Tableau_de_suivi[Clôturé]=\"OUI\",ROW(Tableau_de_suivi[Clôturé])-2),ROWS($1:63)),COLUMN()),\"\")","v":""},{"$f":"IFERROR(INDEX(Tableau_de_suivi[[N°]:[Clôturé]],SMALL(IF(Tableau_de_suivi[Clôturé]=\"OUI\",ROW(Tableau_de_suivi[Clôturé])-2),ROWS($1:63)),COLUMN()),\"\")","v":""},{"$f":"IFERROR(INDEX(Tableau_de_suivi[[N°]:[Clôturé]],SMALL(IF(Tableau_de_suivi[Clôturé]=\"OUI\",ROW(Tableau_de_suivi[Clôturé])-2),ROWS($1:63)),COLUMN()),\"\")","v":""},{"$f":"IFERROR(INDEX(Tableau_de_suivi[[N°]:[Clôturé]],SMALL(IF(Tableau_de_suivi[Clôturé]=\"OUI\",ROW(Tableau_de_suivi[Clôturé])-2),ROWS($1:63)),COLUMN()),\"\")","v":""},{"$f":"IFERROR(INDEX(Tableau_de_suivi[[N°]:[Clôturé]],SMALL(IF(Tableau_de_suivi[Clôturé]=\"OUI\",ROW(Tableau_de_suivi[Clôturé])-2),ROWS($1:63)),COLUMN()),\"\")","v":""},{"$f":"IFERROR(INDEX(Tableau_de_suivi[[N°]:[Clôturé]],SMALL(IF(Tableau_de_suivi[Clôturé]=\"OUI\",ROW(Tableau_de_suivi[Clôturé])-2),ROWS($1:63)),COLUMN()),\"\")","v":""}]
[{"$f":"IFERROR(INDEX(Tableau_de_suivi[[N°]:[Clôturé]],SMALL(IF(Tableau_de_suivi[Clôturé]=\"OUI\",ROW(Tableau_de_suivi[Clôturé])-2),ROWS($1:64)),COLUMN()),\"\")","v":""},{"$f":"IFERROR(INDEX(Tableau_de_suivi[[N°]:[Clôturé]],SMALL(IF(Tableau_de_suivi[Clôturé]=\"OUI\",ROW(Tableau_de_suivi[Clôturé])-2),ROWS($1:64)),COLUMN()),\"\")","v":""},{"$f":"IFERROR(INDEX(Tableau_de_suivi[[N°]:[Clôturé]],SMALL(IF(Tableau_de_suivi[Clôturé]=\"OUI\",ROW(Tableau_de_suivi[Clôturé])-2),ROWS($1:64)),COLUMN()),\"\")","v":""},{"$f":"IFERROR(INDEX(Tableau_de_suivi[[N°]:[Clôturé]],SMALL(IF(Tableau_de_suivi[Clôturé]=\"OUI\",ROW(Tableau_de_suivi[Clôturé])-2),ROWS($1:64)),COLUMN()),\"\")","v":""},{"$f":"IFERROR(INDEX(Tableau_de_suivi[[N°]:[Clôturé]],SMALL(IF(Tableau_de_suivi[Clôturé]=\"OUI\",ROW(Tableau_de_suivi[Clôturé])-2),ROWS($1:64)),COLUMN()),\"\")","v":""},{"$f":"IFERROR(INDEX(Tableau_de_suivi[[N°]:[Clôturé]],SMALL(IF(Tableau_de_suivi[Clôturé]=\"OUI\",ROW(Tableau_de_suivi[Clôturé])-2),ROWS($1:64)),COLUMN()),\"\")","v":""},{"$f":"IFERROR(INDEX(Tableau_de_suivi[[N°]:[Clôturé]],SMALL(IF(Tableau_de_suivi[Clôturé]=\"OUI\",ROW(Tableau_de_suivi[Clôturé])-2),ROWS($1:64)),COLUMN()),\"\")","v":""},{"$f":"IFERROR(INDEX(Tableau_de_suivi[[N°]:[Clôturé]],SMALL(IF(Tableau_de_suivi[Clôturé]=\"OUI\",ROW(Tableau_de_suivi[Clôturé])-2),ROWS($1:64)),COLUMN()),\"\")","v":""},{"$f":"IFERROR(INDEX(Tableau_de_suivi[[N°]:[Clôturé]],SMALL(IF(Tableau_de_suivi[Clôturé]=\"OUI\",ROW(Tableau_de_suivi[Clôturé])-2),ROWS($1:64)),COLUMN()),\"\")","v":""},{"$f":"IFERROR(INDEX(Tableau_de_suivi[[N°]:[Clôturé]],SMALL(IF(Tableau_de_suivi[Clôturé]=\"OUI\",ROW(Tableau_de_suivi[Clôturé])-2),ROWS($1:64)),COLUMN()),\"\")","v":""},{"$f":"IFERROR(INDEX(Tableau_de_suivi[[N°]:[Clôturé]],SMALL(IF(Tableau_de_suivi[Clôturé]=\"OUI\",ROW(Tableau_de_suivi[Clôturé])-2),ROWS($1:64)),COLUMN()),\"\")","v":""},{"$f":"IFERROR(INDEX(Tableau_de_suivi[[N°]:[Clôturé]],SMALL(IF(Tableau_de_suivi[Clôturé]=\"OUI\",ROW(Tableau_de_suivi[Clôturé])-2),ROWS($1:64)),COLUMN()),\"\")","v":""},{"$f":"IFERROR(INDEX(Tableau_de_suivi[[N°]:[Clôturé]],SMALL(IF(Tableau_de_suivi[Clôturé]=\"OUI\",ROW(Tableau_de_suivi[Clôturé])-2),ROWS($1:64)),COLUMN()),\"\")","v":""},{"$f":"IFERROR(INDEX(Tableau_de_suivi[[N°]:[Clôturé]],SMALL(IF(Tableau_de_suivi[Clôturé]=\"OUI\",ROW(Tableau_de_suivi[Clôturé])-2),ROWS($1:64)),COLUMN()),\"\")","v":""},{"$f":"IFERROR(INDEX(Tableau_de_suivi[[N°]:[Clôturé]],SMALL(IF(Tableau_de_suivi[Clôturé]=\"OUI\",ROW(Tableau_de_suivi[Clôturé])-2),ROWS($1:64)),COLUMN()),\"\")","v":""},{"$f":"IFERROR(INDEX(Tableau_de_suivi[[N°]:[Clôturé]],SMALL(IF(Tableau_de_suivi[Clôturé]=\"OUI\",ROW(Tableau_de_suivi[Clôturé])-2),ROWS($1:64)),COLUMN()),\"\")","v":""},{"$f":"IFERROR(INDEX(Tableau_de_suivi[[N°]:[Clôturé]],SMALL(IF(Tableau_de_suivi[Clôturé]=\"OUI\",ROW(Tableau_de_suivi[Clôturé])-2),ROWS($1:64)),COLUMN()),\"\")","v":""},{"$f":"IFERROR(INDEX(Tableau_de_suivi[[N°]:[Clôturé]],SMALL(IF(Tableau_de_suivi[Clôturé]=\"OUI\",ROW(Tableau_de_suivi[Clôturé])-2),ROWS($1:64)),COLUMN()),\"\")","v":""},{"$f":"IFERROR(INDEX(Tableau_de_suivi[[N°]:[Clôturé]],SMALL(IF(Tableau_de_suivi[Clôturé]=\"OUI\",ROW(Tableau_de_suivi[Clôturé])-2),ROWS($1:64)),COLUMN()),\"\")","v":""},{"$f":"IFERROR(INDEX(Tableau_de_suivi[[N°]:[Clôturé]],SMALL(IF(Tableau_de_suivi[Clôturé]=\"OUI\",ROW(Tableau_de_suivi[Clôturé])-2),ROWS($1:64)),COLUMN()),\"\")","v":""},{"$f":"IFERROR(INDEX(Tableau_de_suivi[[N°]:[Clôturé]],SMALL(IF(Tableau_de_suivi[Clôturé]=\"OUI\",ROW(Tableau_de_suivi[Clôturé])-2),ROWS($1:64)),COLUMN()),\"\")","v":""},{"$f":"IFERROR(INDEX(Tableau_de_suivi[[N°]:[Clôturé]],SMALL(IF(Tableau_de_suivi[Clôturé]=\"OUI\",ROW(Tableau_de_suivi[Clôturé])-2),ROWS($1:64)),COLUMN()),\"\")","v":""}]
[{"$f":"IFERROR(INDEX(Tableau_de_suivi[[N°]:[Clôturé]],SMALL(IF(Tableau_de_suivi[Clôturé]=\"OUI\",ROW(Tableau_de_suivi[Clôturé])-2),ROWS($1:65)),COLUMN()),\"\")","v":""},{"$f":"IFERROR(INDEX(Tableau_de_suivi[[N°]:[Clôturé]],SMALL(IF(Tableau_de_suivi[Clôturé]=\"OUI\",ROW(Tableau_de_suivi[Clôturé])-2),ROWS($1:65)),COLUMN()),\"\")","v":""},{"$f":"IFERROR(INDEX(Tableau_de_suivi[[N°]:[Clôturé]],SMALL(IF(Tableau_de_suivi[Clôturé]=\"OUI\",ROW(Tableau_de_suivi[Clôturé])-2),ROWS($1:65)),COLUMN()),\"\")","v":""},{"$f":"IFERROR(INDEX(Tableau_de_suivi[[N°]:[Clôturé]],SMALL(IF(Tableau_de_suivi[Clôturé]=\"OUI\",ROW(Tableau_de_suivi[Clôturé])-2),ROWS($1:65)),COLUMN()),\"\")","v":""},{"$f":"IFERROR(INDEX(Tableau_de_suivi[[N°]:[Clôturé]],SMALL(IF(Tableau_de_suivi[Clôturé]=\"OUI\",ROW(Tableau_de_suivi[Clôturé])-2),ROWS($1:65)),COLUMN()),\"\")","v":""},{"$f":"IFERROR(INDEX(Tableau_de_suivi[[N°]:[Clôturé]],SMALL(IF(Tableau_de_suivi[Clôturé]=\"OUI\",ROW(Tableau_de_suivi[Clôturé])-2),ROWS($1:65)),COLUMN()),\"\")","v":""},{"$f":"IFERROR(INDEX(Tableau_de_suivi[[N°]:[Clôturé]],SMALL(IF(Tableau_de_suivi[Clôturé]=\"OUI\",ROW(Tableau_de_suivi[Clôturé])-2),ROWS($1:65)),COLUMN()),\"\")","v":""},{"$f":"IFERROR(INDEX(Tableau_de_suivi[[N°]:[Clôturé]],SMALL(IF(Tableau_de_suivi[Clôturé]=\"OUI\",ROW(Tableau_de_suivi[Clôturé])-2),ROWS($1:65)),COLUMN()),\"\")","v":""},{"$f":"IFERROR(INDEX(Tableau_de_suivi[[N°]:[Clôturé]],SMALL(IF(Tableau_de_suivi[Clôturé]=\"OUI\",ROW(Tableau_de_suivi[Clôturé])-2),ROWS($1:65)),COLUMN()),\"\")","v":""},{"$f":"IFERROR(INDEX(Tableau_de_suivi[[N°]:[Clôturé]],SMALL(IF(Tableau_de_suivi[Clôturé]=\"OUI\",ROW(Tableau_de_suivi[Clôturé])-2),ROWS($1:65)),COLUMN()),\"\")","v":""},{"$f":"IFERROR(INDEX(Tableau_de_suivi[[N°]:[Clôturé]],SMALL(IF(Tableau_de_suivi[Clôturé]=\"OUI\",ROW(Tableau_de_suivi[Clôturé])-2),ROWS($1:65)),COLUMN()),\"\")","v":""},{"$f":"IFERROR(INDEX(Tableau_de_suivi[[N°]:[Clôturé]],SMALL(IF(Tableau_de_suivi[Clôturé]=\"OUI\",ROW(Tableau_de_suivi[Clôturé])-2),ROWS($1:65)),COLUMN()),\"\")","v":""},{"$f":"IFERROR(INDEX(Tableau_de_suivi[[N°]:[Clôturé]],SMALL(IF(Tableau_de_suivi[Clôturé]=\"OUI\",ROW(Tableau_de_suivi[Clôturé])-2),ROWS($1:65)),COLUMN()),\"\")","v":""},{"$f":"IFERROR(INDEX(Tableau_de_suivi[[N°]:[Clôturé]],SMALL(IF(Tableau_de_suivi[Clôturé]=\"OUI\",ROW(Tableau_de_suivi[Clôturé])-2),ROWS($1:65)),COLUMN()),\"\")","v":""},{"$f":"IFERROR(INDEX(Tableau_de_suivi[[N°]:[Clôturé]],SMALL(IF(Tableau_de_suivi[Clôturé]=\"OUI\",ROW(Tableau_de_suivi[Clôturé])-2),ROWS($1:65)),COLUMN()),\"\")","v":""},{"$f":"IFERROR(INDEX(Tableau_de_suivi[[N°]:[Clôturé]],SMALL(IF(Tableau_de_suivi[Clôturé]=\"OUI\",ROW(Tableau_de_suivi[Clôturé])-2),ROWS($1:65)),COLUMN()),\"\")","v":""},{"$f":"IFERROR(INDEX(Tableau_de_suivi[[N°]:[Clôturé]],SMALL(IF(Tableau_de_suivi[Clôturé]=\"OUI\",ROW(Tableau_de_suivi[Clôturé])-2),ROWS($1:65)),COLUMN()),\"\")","v":""},{"$f":"IFERROR(INDEX(Tableau_de_suivi[[N°]:[Clôturé]],SMALL(IF(Tableau_de_suivi[Clôturé]=\"OUI\",ROW(Tableau_de_suivi[Clôturé])-2),ROWS($1:65)),COLUMN()),\"\")","v":""},{"$f":"IFERROR(INDEX(Tableau_de_suivi[[N°]:[Clôturé]],SMALL(IF(Tableau_de_suivi[Clôturé]=\"OUI\",ROW(Tableau_de_suivi[Clôturé])-2),ROWS($1:65)),COLUMN()),\"\")","v":""},{"$f":"IFERROR(INDEX(Tableau_de_suivi[[N°]:[Clôturé]],SMALL(IF(Tableau_de_suivi[Clôturé]=\"OUI\",ROW(Tableau_de_suivi[Clôturé])-2),ROWS($1:65)),COLUMN()),\"\")","v":""},{"$f":"IFERROR(INDEX(Tableau_de_suivi[[N°]:[Clôturé]],SMALL(IF(Tableau_de_suivi[Clôturé]=\"OUI\",ROW(Tableau_de_suivi[Clôturé])-2),ROWS($1:65)),COLUMN()),\"\")","v":""},{"$f":"IFERROR(INDEX(Tableau_de_suivi[[N°]:[Clôturé]],SMALL(IF(Tableau_de_suivi[Clôturé]=\"OUI\",ROW(Tableau_de_suivi[Clôturé])-2),ROWS($1:65)),COLUMN()),\"\")","v":""}]
[{"$f":"IFERROR(INDEX(Tableau_de_suivi[[N°]:[Clôturé]],SMALL(IF(Tableau_de_suivi[Clôturé]=\"OUI\",ROW(Tableau_de_suivi[Clôturé])-2),ROWS($1:66)),COLUMN()),\"\")","v":""},{"$f":"IFERROR(INDEX(Tableau_de_suivi[[N°]:[Clôturé]],SMALL(IF(Tableau_de_suivi[Clôturé]=\"OUI\",ROW(Tableau_de_suivi[Clôturé])-2),ROWS($1:66)),COLUMN()),\"\")","v":""},{"$f":"IFERROR(INDEX(Tableau_de_suivi[[N°]:[Clôturé]],SMALL(IF(Tableau_de_suivi[Clôturé]=\"OUI\",ROW(Tableau_de_suivi[Clôturé])-2),ROWS($1:66)),COLUMN()),\"\")","v":""},{"$f":"IFERROR(INDEX(Tableau_de_suivi[[N°]:[Clôturé]],SMALL(IF(Tableau_de_suivi[Clôturé]=\"OUI\",ROW(Tableau_de_suivi[Clôturé])-2),ROWS($1:66)),COLUMN()),\"\")","v":""},{"$f":"IFERROR(INDEX(Tableau_de_suivi[[N°]:[Clôturé]],SMALL(IF(Tableau_de_suivi[Clôturé]=\"OUI\",ROW(Tableau_de_suivi[Clôturé])-2),ROWS($1:66)),COLUMN()),\"\")","v":""},{"$f":"IFERROR(INDEX(Tableau_de_suivi[[N°]:[Clôturé]],SMALL(IF(Tableau_de_suivi[Clôturé]=\"OUI\",ROW(Tableau_de_suivi[Clôturé])-2),ROWS($1:66)),COLUMN()),\"\")","v":""},{"$f":"IFERROR(INDEX(Tableau_de_suivi[[N°]:[Clôturé]],SMALL(IF(Tableau_de_suivi[Clôturé]=\"OUI\",ROW(Tableau_de_suivi[Clôturé])-2),ROWS($1:66)),COLUMN()),\"\")","v":""},{"$f":"IFERROR(INDEX(Tableau_de_suivi[[N°]:[Clôturé]],SMALL(IF(Tableau_de_suivi[Clôturé]=\"OUI\",ROW(Tableau_de_suivi[Clôturé])-2),ROWS($1:66)),COLUMN()),\"\")","v":""},{"$f":"IFERROR(INDEX(Tableau_de_suivi[[N°]:[Clôturé]],SMALL(IF(Tableau_de_suivi[Clôturé]=\"OUI\",ROW(Tableau_de_suivi[Clôturé])-2),ROWS($1:66)),COLUMN()),\"\")","v":""},{"$f":"IFERROR(INDEX(Tableau_de_suivi[[N°]:[Clôturé]],SMALL(IF(Tableau_de_suivi[Clôturé]=\"OUI\",ROW(Tableau_de_suivi[Clôturé])-2),ROWS($1:66)),COLUMN()),\"\")","v":""},{"$f":"IFERROR(INDEX(Tableau_de_suivi[[N°]:[Clôturé]],SMALL(IF(Tableau_de_suivi[Clôturé]=\"OUI\",ROW(Tableau_de_suivi[Clôturé])-2),ROWS($1:66)),COLUMN()),\"\")","v":""},{"$f":"IFERROR(INDEX(Tableau_de_suivi[[N°]:[Clôturé]],SMALL(IF(Tableau_de_suivi[Clôturé]=\"OUI\",ROW(Tableau_de_suivi[Clôturé])-2),ROWS($1:66)),COLUMN()),\"\")","v":""},{"$f":"IFERROR(INDEX(Tableau_de_suivi[[N°]:[Clôturé]],SMALL(IF(Tableau_de_suivi[Clôturé]=\"OUI\",ROW(Tableau_de_suivi[Clôturé])-2),ROWS($1:66)),COLUMN()),\"\")","v":""},{"$f":"IFERROR(INDEX(Tableau_de_suivi[[N°]:[Clôturé]],SMALL(IF(Tableau_de_suivi[Clôturé]=\"OUI\",ROW(Tableau_de_suivi[Clôturé])-2),ROWS($1:66)),COLUMN()),\"\")","v":""},{"$f":"IFERROR(INDEX(Tableau_de_suivi[[N°]:[Clôturé]],SMALL(IF(Tableau_de_suivi[Clôturé]=\"OUI\",ROW(Tableau_de_suivi[Clôturé])-2),ROWS($1:66)),COLUMN()),\"\")","v":""},{"$f":"IFERROR(INDEX(Tableau_de_suivi[[N°]:[Clôturé]],SMALL(IF(Tableau_de_suivi[Clôturé]=\"OUI\",ROW(Tableau_de_suivi[Clôturé])-2),ROWS($1:66)),COLUMN()),\"\")","v":""},{"$f":"IFERROR(INDEX(Tableau_de_suivi[[N°]:[Clôturé]],SMALL(IF(Tableau_de_suivi[Clôturé]=\"OUI\",ROW(Tableau_de_suivi[Clôturé])-2),ROWS($1:66)),COLUMN()),\"\")","v":""},{"$f":"IFERROR(INDEX(Tableau_de_suivi[[N°]:[Clôturé]],SMALL(IF(Tableau_de_suivi[Clôturé]=\"OUI\",ROW(Tableau_de_suivi[Clôturé])-2),ROWS($1:66)),COLUMN()),\"\")","v":""},{"$f":"IFERROR(INDEX(Tableau_de_suivi[[N°]:[Clôturé]],SMALL(IF(Tableau_de_suivi[Clôturé]=\"OUI\",ROW(Tableau_de_suivi[Clôturé])-2),ROWS($1:66)),COLUMN()),\"\")","v":""},{"$f":"IFERROR(INDEX(Tableau_de_suivi[[N°]:[Clôturé]],SMALL(IF(Tableau_de_suivi[Clôturé]=\"OUI\",ROW(Tableau_de_suivi[Clôturé])-2),ROWS($1:66)),COLUMN()),\"\")","v":""},{"$f":"IFERROR(INDEX(Tableau_de_suivi[[N°]:[Clôturé]],SMALL(IF(Tableau_de_suivi[Clôturé]=\"OUI\",ROW(Tableau_de_suivi[Clôturé])-2),ROWS($1:66)),COLUMN()),\"\")","v":""},{"$f":"IFERROR(INDEX(Tableau_de_suivi[[N°]:[Clôturé]],SMALL(IF(Tableau_de_suivi[Clôturé]=\"OUI\",ROW(Tableau_de_suivi[Clôturé])-2),ROWS($1:66)),COLUMN()),\"\")","v":""}]
[{"$f":"IFERROR(INDEX(Tableau_de_suivi[[N°]:[Clôturé]],SMALL(IF(Tableau_de_suivi[Clôturé]=\"OUI\",ROW(Tableau_de_suivi[Clôturé])-2),ROWS($1:67)),COLUMN()),\"\")","v":""},{"$f":"IFERROR(INDEX(Tableau_de_suivi[[N°]:[Clôturé]],SMALL(IF(Tableau_de_suivi[Clôturé]=\"OUI\",ROW(Tableau_de_suivi[Clôturé])-2),ROWS($1:67)),COLUMN()),\"\")","v":""},{"$f":"IFERROR(INDEX(Tableau_de_suivi[[N°]:[Clôturé]],SMALL(IF(Tableau_de_suivi[Clôturé]=\"OUI\",ROW(Tableau_de_suivi[Clôturé])-2),ROWS($1:67)),COLUMN()),\"\")","v":""},{"$f":"IFERROR(INDEX(Tableau_de_suivi[[N°]:[Clôturé]],SMALL(IF(Tableau_de_suivi[Clôturé]=\"OUI\",ROW(Tableau_de_suivi[Clôturé])-2),ROWS($1:67)),COLUMN()),\"\")","v":""},{"$f":"IFERROR(INDEX(Tableau_de_suivi[[N°]:[Clôturé]],SMALL(IF(Tableau_de_suivi[Clôturé]=\"OUI\",ROW(Tableau_de_suivi[Clôturé])-2),ROWS($1:67)),COLUMN()),\"\")","v":""},{"$f":"IFERROR(INDEX(Tableau_de_suivi[[N°]:[Clôturé]],SMALL(IF(Tableau_de_suivi[Clôturé]=\"OUI\",ROW(Tableau_de_suivi[Clôturé])-2),ROWS($1:67)),COLUMN()),\"\")","v":""},{"$f":"IFERROR(INDEX(Tableau_de_suivi[[N°]:[Clôturé]],SMALL(IF(Tableau_de_suivi[Clôturé]=\"OUI\",ROW(Tableau_de_suivi[Clôturé])-2),ROWS($1:67)),COLUMN()),\"\")","v":""},{"$f":"IFERROR(INDEX(Tableau_de_suivi[[N°]:[Clôturé]],SMALL(IF(Tableau_de_suivi[Clôturé]=\"OUI\",ROW(Tableau_de_suivi[Clôturé])-2),ROWS($1:67)),COLUMN()),\"\")","v":""},{"$f":"IFERROR(INDEX(Tableau_de_suivi[[N°]:[Clôturé]],SMALL(IF(Tableau_de_suivi[Clôturé]=\"OUI\",ROW(Tableau_de_suivi[Clôturé])-2),ROWS($1:67)),COLUMN()),\"\")","v":""},{"$f":"IFERROR(INDEX(Tableau_de_suivi[[N°]:[Clôturé]],SMALL(IF(Tableau_de_suivi[Clôturé]=\"OUI\",ROW(Tableau_de_suivi[Clôturé])-2),ROWS($1:67)),COLUMN()),\"\")","v":""},{"$f":"IFERROR(INDEX(Tableau_de_suivi[[N°]:[Clôturé]],SMALL(IF(Tableau_de_suivi[Clôturé]=\"OUI\",ROW(Tableau_de_suivi[Clôturé])-2),ROWS($1:67)),COLUMN()),\"\")","v":""},{"$f":"IFERROR(INDEX(Tableau_de_suivi[[N°]:[Clôturé]],SMALL(IF(Tableau_de_suivi[Clôturé]=\"OUI\",ROW(Tableau_de_suivi[Clôturé])-2),ROWS($1:67)),COLUMN()),\"\")","v":""},{"$f":"IFERROR(INDEX(Tableau_de_suivi[[N°]:[Clôturé]],SMALL(IF(Tableau_de_suivi[Clôturé]=\"OUI\",ROW(Tableau_de_suivi[Clôturé])-2),ROWS($1:67)),COLUMN()),\"\")","v":""},{"$f":"IFERROR(INDEX(Tableau_de_suivi[[N°]:[Clôturé]],SMALL(IF(Tableau_de_suivi[Clôturé]=\"OUI\",ROW(Tableau_de_suivi[Clôturé])-2),ROWS($1:67)),COLUMN()),\"\")","v":""},{"$f":"IFERROR(INDEX(Tableau_de_suivi[[N°]:[Clôturé]],SMALL(IF(Tableau_de_suivi[Clôturé]=\"OUI\",ROW(Tableau_de_suivi[Clôturé])-2),ROWS($1:67)),COLUMN()),\"\")","v":""},{"$f":"IFERROR(INDEX(Tableau_de_suivi[[N°]:[Clôturé]],SMALL(IF(Tableau_de_suivi[Clôturé]=\"OUI\",ROW(Tableau_de_suivi[Clôturé])-2),ROWS($1:67)),COLUMN()),\"\")","v":""},{"$f":"IFERROR(INDEX(Tableau_de_suivi[[N°]:[Clôturé]],SMALL(IF(Tableau_de_suivi[Clôturé]=\"OUI\",ROW(Tableau_de_suivi[Clôturé])-2),ROWS($1:67)),COLUMN()),\"\")","v":""},{"$f":"IFERROR(INDEX(Tableau_de_suivi[[N°]:[Clôturé]],SMALL(IF(Tableau_de_suivi[Clôturé]=\"OUI\",ROW(Tableau_de_suivi[Clôturé])-2),ROWS($1:67)),COLUMN()),\"\")","v":""},{"$f":"IFERROR(INDEX(Tableau_de_suivi[[N°]:[Clôturé]],SMALL(IF(Tableau_de_suivi[Clôturé]=\"OUI\",ROW(Tableau_de_suivi[Clôturé])-2),ROWS($1:67)),COLUMN()),\"\")","v":""},{"$f":"IFERROR(INDEX(Tableau_de_suivi[[N°]:[Clôturé]],SMALL(IF(Tableau_de_suivi[Clôturé]=\"OUI\",ROW(Tableau_de_suivi[Clôturé])-2),ROWS($1:67)),COLUMN()),\"\")","v":""},{"$f":"IFERROR(INDEX(Tableau_de_suivi[[N°]:[Clôturé]],SMALL(IF(Tableau_de_suivi[Clôturé]=\"OUI\",ROW(Tableau_de_suivi[Clôturé])-2),ROWS($1:67)),COLUMN()),\"\")","v":""},{"$f":"IFERROR(INDEX(Tableau_de_suivi[[N°]:[Clôturé]],SMALL(IF(Tableau_de_suivi[Clôturé]=\"OUI\",ROW(Tableau_de_suivi[Clôturé])-2),ROWS($1:67)),COLUMN()),\"\")","v":""}]
[{"$f":"IFERROR(INDEX(Tableau_de_suivi[[N°]:[Clôturé]],SMALL(IF(Tableau_de_suivi[Clôturé]=\"OUI\",ROW(Tableau_de_suivi[Clôturé])-2),ROWS($1:68)),COLUMN()),\"\")","v":""},{"$f":"IFERROR(INDEX(Tableau_de_suivi[[N°]:[Clôturé]],SMALL(IF(Tableau_de_suivi[Clôturé]=\"OUI\",ROW(Tableau_de_suivi[Clôturé])-2),ROWS($1:68)),COLUMN()),\"\")","v":""},{"$f":"IFERROR(INDEX(Tableau_de_suivi[[N°]:[Clôturé]],SMALL(IF(Tableau_de_suivi[Clôturé]=\"OUI\",ROW(Tableau_de_suivi[Clôturé])-2),ROWS($1:68)),COLUMN()),\"\")","v":""},{"$f":"IFERROR(INDEX(Tableau_de_suivi[[N°]:[Clôturé]],SMALL(IF(Tableau_de_suivi[Clôturé]=\"OUI\",ROW(Tableau_de_suivi[Clôturé])-2),ROWS($1:68)),COLUMN()),\"\")","v":""},{"$f":"IFERROR(INDEX(Tableau_de_suivi[[N°]:[Clôturé]],SMALL(IF(Tableau_de_suivi[Clôturé]=\"OUI\",ROW(Tableau_de_suivi[Clôturé])-2),ROWS($1:68)),COLUMN()),\"\")","v":""},{"$f":"IFERROR(INDEX(Tableau_de_suivi[[N°]:[Clôturé]],SMALL(IF(Tableau_de_suivi[Clôturé]=\"OUI\",ROW(Tableau_de_suivi[Clôturé])-2),ROWS($1:68)),COLUMN()),\"\")","v":""},{"$f":"IFERROR(INDEX(Tableau_de_suivi[[N°]:[Clôturé]],SMALL(IF(Tableau_de_suivi[Clôturé]=\"OUI\",ROW(Tableau_de_suivi[Clôturé])-2),ROWS($1:68)),COLUMN()),\"\")","v":""},{"$f":"IFERROR(INDEX(Tableau_de_suivi[[N°]:[Clôturé]],SMALL(IF(Tableau_de_suivi[Clôturé]=\"OUI\",ROW(Tableau_de_suivi[Clôturé])-2),ROWS($1:68)),COLUMN()),\"\")","v":""},{"$f":"IFERROR(INDEX(Tableau_de_suivi[[N°]:[Clôturé]],SMALL(IF(Tableau_de_suivi[Clôturé]=\"OUI\",ROW(Tableau_de_suivi[Clôturé])-2),ROWS($1:68)),COLUMN()),\"\")","v":""},{"$f":"IFERROR(INDEX(Tableau_de_suivi[[N°]:[Clôturé]],SMALL(IF(Tableau_de_suivi[Clôturé]=\"OUI\",ROW(Tableau_de_suivi[Clôturé])-2),ROWS($1:68)),COLUMN()),\"\")","v":""},{"$f":"IFERROR(INDEX(Tableau_de_suivi[[N°]:[Clôturé]],SMALL(IF(Tableau_de_suivi[Clôturé]=\"OUI\",ROW(Tableau_de_suivi[Clôturé])-2),ROWS($1:68)),COLUMN()),\"\")","v":""},{"$f":"IFERROR(INDEX(Tableau_de_suivi[[N°]:[Clôturé]],SMALL(IF(Tableau_de_suivi[Clôturé]=\"OUI\",ROW(Tableau_de_suivi[Clôturé])-2),ROWS($1:68)),COLUMN()),\"\")","v":""},{"$f":"IFERROR(INDEX(Tableau_de_suivi[[N°]:[Clôturé]],SMALL(IF(Tableau_de_suivi[Clôturé]=\"OUI\",ROW(Tableau_de_suivi[Clôturé])-2),ROWS($1:68)),COLUMN()),\"\")","v":""},{"$f":"IFERROR(INDEX(Tableau_de_suivi[[N°]:[Clôturé]],SMALL(IF(Tableau_de_suivi[Clôturé]=\"OUI\",ROW(Tableau_de_suivi[Clôturé])-2),ROWS($1:68)),COLUMN()),\"\")","v":""},{"$f":"IFERROR(INDEX(Tableau_de_suivi[[N°]:[Clôturé]],SMALL(IF(Tableau_de_suivi[Clôturé]=\"OUI\",ROW(Tableau_de_suivi[Clôturé])-2),ROWS($1:68)),COLUMN()),\"\")","v":""},{"$f":"IFERROR(INDEX(Tableau_de_suivi[[N°]:[Clôturé]],SMALL(IF(Tableau_de_suivi[Clôturé]=\"OUI\",ROW(Tableau_de_suivi[Clôturé])-2),ROWS($1:68)),COLUMN()),\"\")","v":""},{"$f":"IFERROR(INDEX(Tableau_de_suivi[[N°]:[Clôturé]],SMALL(IF(Tableau_de_suivi[Clôturé]=\"OUI\",ROW(Tableau_de_suivi[Clôturé])-2),ROWS($1:68)),COLUMN()),\"\")","v":""},{"$f":"IFERROR(INDEX(Tableau_de_suivi[[N°]:[Clôturé]],SMALL(IF(Tableau_de_suivi[Clôturé]=\"OUI\",ROW(Tableau_de_suivi[Clôturé])-2),ROWS($1:68)),COLUMN()),\"\")","v":""},{"$f":"IFERROR(INDEX(Tableau_de_suivi[[N°]:[Clôturé]],SMALL(IF(Tableau_de_suivi[Clôturé]=\"OUI\",ROW(Tableau_de_suivi[Clôturé])-2),ROWS($1:68)),COLUMN()),\"\")","v":""},{"$f":"IFERROR(INDEX(Tableau_de_suivi[[N°]:[Clôturé]],SMALL(IF(Tableau_de_suivi[Clôturé]=\"OUI\",ROW(Tableau_de_suivi[Clôturé])-2),ROWS($1:68)),COLUMN()),\"\")","v":""},{"$f":"IFERROR(INDEX(Tableau_de_suivi[[N°]:[Clôturé]],SMALL(IF(Tableau_de_suivi[Clôturé]=\"OUI\",ROW(Tableau_de_suivi[Clôturé])-2),ROWS($1:68)),COLUMN()),\"\")","v":""},{"$f":"IFERROR(INDEX(Tableau_de_suivi[[N°]:[Clôturé]],SMALL(IF(Tableau_de_suivi[Clôturé]=\"OUI\",ROW(Tableau_de_suivi[Clôturé])-2),ROWS($1:68)),COLUMN()),\"\")","v":""}]
[{"$f":"IFERROR(INDEX(Tableau_de_suivi[[N°]:[Clôturé]],SMALL(IF(Tableau_de_suivi[Clôturé]=\"OUI\",ROW(Tableau_de_suivi[Clôturé])-2),ROWS($1:69)),COLUMN()),\"\")","v":""},{"$f":"IFERROR(INDEX(Tableau_de_suivi[[N°]:[Clôturé]],SMALL(IF(Tableau_de_suivi[Clôturé]=\"OUI\",ROW(Tableau_de_suivi[Clôturé])-2),ROWS($1:69)),COLUMN()),\"\")","v":""},{"$f":"IFERROR(INDEX(Tableau_de_suivi[[N°]:[Clôturé]],SMALL(IF(Tableau_de_suivi[Clôturé]=\"OUI\",ROW(Tableau_de_suivi[Clôturé])-2),ROWS($1:69)),COLUMN()),\"\")","v":""},{"$f":"IFERROR(INDEX(Tableau_de_suivi[[N°]:[Clôturé]],SMALL(IF(Tableau_de_suivi[Clôturé]=\"OUI\",ROW(Tableau_de_suivi[Clôturé])-2),ROWS($1:69)),COLUMN()),\"\")","v":""},{"$f":"IFERROR(INDEX(Tableau_de_suivi[[N°]:[Clôturé]],SMALL(IF(Tableau_de_suivi[Clôturé]=\"OUI\",ROW(Tableau_de_suivi[Clôturé])-2),ROWS($1:69)),COLUMN()),\"\")","v":""},{"$f":"IFERROR(INDEX(Tableau_de_suivi[[N°]:[Clôturé]],SMALL(IF(Tableau_de_suivi[Clôturé]=\"OUI\",ROW(Tableau_de_suivi[Clôturé])-2),ROWS($1:69)),COLUMN()),\"\")","v":""},{"$f":"IFERROR(INDEX(Tableau_de_suivi[[N°]:[Clôturé]],SMALL(IF(Tableau_de_suivi[Clôturé]=\"OUI\",ROW(Tableau_de_suivi[Clôturé])-2),ROWS($1:69)),COLUMN()),\"\")","v":""},{"$f":"IFERROR(INDEX(Tableau_de_suivi[[N°]:[Clôturé]],SMALL(IF(Tableau_de_suivi[Clôturé]=\"OUI\",ROW(Tableau_de_suivi[Clôturé])-2),ROWS($1:69)),COLUMN()),\"\")","v":""},{"$f":"IFERROR(INDEX(Tableau_de_suivi[[N°]:[Clôturé]],SMALL(IF(Tableau_de_suivi[Clôturé]=\"OUI\",ROW(Tableau_de_suivi[Clôturé])-2),ROWS($1:69)),COLUMN()),\"\")","v":""},{"$f":"IFERROR(INDEX(Tableau_de_suivi[[N°]:[Clôturé]],SMALL(IF(Tableau_de_suivi[Clôturé]=\"OUI\",ROW(Tableau_de_suivi[Clôturé])-2),ROWS($1:69)),COLUMN()),\"\")","v":""},{"$f":"IFERROR(INDEX(Tableau_de_suivi[[N°]:[Clôturé]],SMALL(IF(Tableau_de_suivi[Clôturé]=\"OUI\",ROW(Tableau_de_suivi[Clôturé])-2),ROWS($1:69)),COLUMN()),\"\")","v":""},{"$f":"IFERROR(INDEX(Tableau_de_suivi[[N°]:[Clôturé]],SMALL(IF(Tableau_de_suivi[Clôturé]=\"OUI\",ROW(Tableau_de_suivi[Clôturé])-2),ROWS($1:69)),COLUMN()),\"\")","v":""},{"$f":"IFERROR(INDEX(Tableau_de_suivi[[N°]:[Clôturé]],SMALL(IF(Tableau_de_suivi[Clôturé]=\"OUI\",ROW(Tableau_de_suivi[Clôturé])-2),ROWS($1:69)),COLUMN()),\"\")","v":""},{"$f":"IFERROR(INDEX(Tableau_de_suivi[[N°]:[Clôturé]],SMALL(IF(Tableau_de_suivi[Clôturé]=\"OUI\",ROW(Tableau_de_suivi[Clôturé])-2),ROWS($1:69)),COLUMN()),\"\")","v":""},{"$f":"IFERROR(INDEX(Tableau_de_suivi[[N°]:[Clôturé]],SMALL(IF(Tableau_de_suivi[Clôturé]=\"OUI\",ROW(Tableau_de_suivi[Clôturé])-2),ROWS($1:69)),COLUMN()),\"\")","v":""},{"$f":"IFERROR(INDEX(Tableau_de_suivi[[N°]:[Clôturé]],SMALL(IF(Tableau_de_suivi[Clôturé]=\"OUI\",ROW(Tableau_de_suivi[Clôturé])-2),ROWS($1:69)),COLUMN()),\"\")","v":""},{"$f":"IFERROR(INDEX(Tableau_de_suivi[[N°]:[Clôturé]],SMALL(IF(Tableau_de_suivi[Clôturé]=\"OUI\",ROW(Tableau_de_suivi[Clôturé])-2),ROWS($1:69)),COLUMN()),\"\")","v":""},{"$f":"IFERROR(INDEX(Tableau_de_suivi[[N°]:[Clôturé]],SMALL(IF(Tableau_de_suivi[Clôturé]=\"OUI\",ROW(Tableau_de_suivi[Clôturé])-2),ROWS($1:69)),COLUMN()),\"\")","v":""},{"$f":"IFERROR(INDEX(Tableau_de_suivi[[N°]:[Clôturé]],SMALL(IF(Tableau_de_suivi[Clôturé]=\"OUI\",ROW(Tableau_de_suivi[Clôturé])-2),ROWS($1:69)),COLUMN()),\"\")","v":""},{"$f":"IFERROR(INDEX(Tableau_de_suivi[[N°]:[Clôturé]],SMALL(IF(Tableau_de_suivi[Clôturé]=\"OUI\",ROW(Tableau_de_suivi[Clôturé])-2),ROWS($1:69)),COLUMN()),\"\")","v":""},{"$f":"IFERROR(INDEX(Tableau_de_suivi[[N°]:[Clôturé]],SMALL(IF(Tableau_de_suivi[Clôturé]=\"OUI\",ROW(Tableau_de_suivi[Clôturé])-2),ROWS($1:69)),COLUMN()),\"\")","v":""},{"$f":"IFERROR(INDEX(Tableau_de_suivi[[N°]:[Clôturé]],SMALL(IF(Tableau_de_suivi[Clôturé]=\"OUI\",ROW(Tableau_de_suivi[Clôturé])-2),ROWS($1:69)),COLUMN()),\"\")","v":""}]
[{"$f":"IFERROR(INDEX(Tableau_de_suivi[[N°]:[Clôturé]],SMALL(IF(Tableau_de_suivi[Clôturé]=\"OUI\",ROW(Tableau_de_suivi[Clôturé])-2),ROWS($1:70)),COLUMN()),\"\")","v":""},{"$f":"IFERROR(INDEX(Tableau_de_suivi[[N°]:[Clôturé]],SMALL(IF(Tableau_de_suivi[Clôturé]=\"OUI\",ROW(Tableau_de_suivi[Clôturé])-2),ROWS($1:70)),COLUMN()),\"\")","v":""},{"$f":"IFERROR(INDEX(Tableau_de_suivi[[N°]:[Clôturé]],SMALL(IF(Tableau_de_suivi[Clôturé]=\"OUI\",ROW(Tableau_de_suivi[Clôturé])-2),ROWS($1:70)),COLUMN()),\"\")","v":""},{"$f":"IFERROR(INDEX(Tableau_de_suivi[[N°]:[Clôturé]],SMALL(IF(Tableau_de_suivi[Clôturé]=\"OUI\",ROW(Tableau_de_suivi[Clôturé])-2),ROWS($1:70)),COLUMN()),\"\")","v":""},{"$f":"IFERROR(INDEX(Tableau_de_suivi[[N°]:[Clôturé]],SMALL(IF(Tableau_de_suivi[Clôturé]=\"OUI\",ROW(Tableau_de_suivi[Clôturé])-2),ROWS($1:70)),COLUMN()),\"\")","v":""},{"$f":"IFERROR(INDEX(Tableau_de_suivi[[N°]:[Clôturé]],SMALL(IF(Tableau_de_suivi[Clôturé]=\"OUI\",ROW(Tableau_de_suivi[Clôturé])-2),ROWS($1:70)),COLUMN()),\"\")","v":""},{"$f":"IFERROR(INDEX(Tableau_de_suivi[[N°]:[Clôturé]],SMALL(IF(Tableau_de_suivi[Clôturé]=\"OUI\",ROW(Tableau_de_suivi[Clôturé])-2),ROWS($1:70)),COLUMN()),\"\")","v":""},{"$f":"IFERROR(INDEX(Tableau_de_suivi[[N°]:[Clôturé]],SMALL(IF(Tableau_de_suivi[Clôturé]=\"OUI\",ROW(Tableau_de_suivi[Clôturé])-2),ROWS($1:70)),COLUMN()),\"\")","v":""},{"$f":"IFERROR(INDEX(Tableau_de_suivi[[N°]:[Clôturé]],SMALL(IF(Tableau_de_suivi[Clôturé]=\"OUI\",ROW(Tableau_de_suivi[Clôturé])-2),ROWS($1:70)),COLUMN()),\"\")","v":""},{"$f":"IFERROR(INDEX(Tableau_de_suivi[[N°]:[Clôturé]],SMALL(IF(Tableau_de_suivi[Clôturé]=\"OUI\",ROW(Tableau_de_suivi[Clôturé])-2),ROWS($1:70)),COLUMN()),\"\")","v":""},{"$f":"IFERROR(INDEX(Tableau_de_suivi[[N°]:[Clôturé]],SMALL(IF(Tableau_de_suivi[Clôturé]=\"OUI\",ROW(Tableau_de_suivi[Clôturé])-2),ROWS($1:70)),COLUMN()),\"\")","v":""},{"$f":"IFERROR(INDEX(Tableau_de_suivi[[N°]:[Clôturé]],SMALL(IF(Tableau_de_suivi[Clôturé]=\"OUI\",ROW(Tableau_de_suivi[Clôturé])-2),ROWS($1:70)),COLUMN()),\"\")","v":""},{"$f":"IFERROR(INDEX(Tableau_de_suivi[[N°]:[Clôturé]],SMALL(IF(Tableau_de_suivi[Clôturé]=\"OUI\",ROW(Tableau_de_suivi[Clôturé])-2),ROWS($1:70)),COLUMN()),\"\")","v":""},{"$f":"IFERROR(INDEX(Tableau_de_suivi[[N°]:[Clôturé]],SMALL(IF(Tableau_de_suivi[Clôturé]=\"OUI\",ROW(Tableau_de_suivi[Clôturé])-2),ROWS($1:70)),COLUMN()),\"\")","v":""},{"$f":"IFERROR(INDEX(Tableau_de_suivi[[N°]:[Clôturé]],SMALL(IF(Tableau_de_suivi[Clôturé]=\"OUI\",ROW(Tableau_de_suivi[Clôturé])-2),ROWS($1:70)),COLUMN()),\"\")","v":""},{"$f":"IFERROR(INDEX(Tableau_de_suivi[[N°]:[Clôturé]],SMALL(IF(Tableau_de_suivi[Clôturé]=\"OUI\",ROW(Tableau_de_suivi[Clôturé])-2),ROWS($1:70)),COLUMN()),\"\")","v":""},{"$f":"IFERROR(INDEX(Tableau_de_suivi[[N°]:[Clôturé]],SMALL(IF(Tableau_de_suivi[Clôturé]=\"OUI\",ROW(Tableau_de_suivi[Clôturé])-2),ROWS($1:70)),COLUMN()),\"\")","v":""},{"$f":"IFERROR(INDEX(Tableau_de_suivi[[N°]:[Clôturé]],SMALL(IF(Tableau_de_suivi[Clôturé]=\"OUI\",ROW(Tableau_de_suivi[Clôturé])-2),ROWS($1:70)),COLUMN()),\"\")","v":""},{"$f":"IFERROR(INDEX(Tableau_de_suivi[[N°]:[Clôturé]],SMALL(IF(Tableau_de_suivi[Clôturé]=\"OUI\",ROW(Tableau_de_suivi[Clôturé])-2),ROWS($1:70)),COLUMN()),\"\")","v":""},{"$f":"IFERROR(INDEX(Tableau_de_suivi[[N°]:[Clôturé]],SMALL(IF(Tableau_de_suivi[Clôturé]=\"OUI\",ROW(Tableau_de_suivi[Clôturé])-2),ROWS($1:70)),COLUMN()),\"\")","v":""},{"$f":"IFERROR(INDEX(Tableau_de_suivi[[N°]:[Clôturé]],SMALL(IF(Tableau_de_suivi[Clôturé]=\"OUI\",ROW(Tableau_de_suivi[Clôturé])-2),ROWS($1:70)),COLUMN()),\"\")","v":""},{"$f":"IFERROR(INDEX(Tableau_de_suivi[[N°]:[Clôturé]],SMALL(IF(Tableau_de_suivi[Clôturé]=\"OUI\",ROW(Tableau_de_suivi[Clôturé])-2),ROWS($1:70)),COLUMN()),\"\")","v":""}]
[{"$f":"IFERROR(INDEX(Tableau_de_suivi[[N°]:[Clôturé]],SMALL(IF(Tableau_de_suivi[Clôturé]=\"OUI\",ROW(Tableau_de_suivi[Clôturé])-2),ROWS($1:71)),COLUMN()),\"\")","v":""},{"$f":"IFERROR(INDEX(Tableau_de_suivi[[N°]:[Clôturé]],SMALL(IF(Tableau_de_suivi[Clôturé]=\"OUI\",ROW(Tableau_de_suivi[Clôturé])-2),ROWS($1:71)),COLUMN()),\"\")","v":""},{"$f":"IFERROR(INDEX(Tableau_de_suivi[[N°]:[Clôturé]],SMALL(IF(Tableau_de_suivi[Clôturé]=\"OUI\",ROW(Tableau_de_suivi[Clôturé])-2),ROWS($1:71)),COLUMN()),\"\")","v":""},{"$f":"IFERROR(INDEX(Tableau_de_suivi[[N°]:[Clôturé]],SMALL(IF(Tableau_de_suivi[Clôturé]=\"OUI\",ROW(Tableau_de_suivi[Clôturé])-2),ROWS($1:71)),COLUMN()),\"\")","v":""},{"$f":"IFERROR(INDEX(Tableau_de_suivi[[N°]:[Clôturé]],SMALL(IF(Tableau_de_suivi[Clôturé]=\"OUI\",ROW(Tableau_de_suivi[Clôturé])-2),ROWS($1:71)),COLUMN()),\"\")","v":""},{"$f":"IFERROR(INDEX(Tableau_de_suivi[[N°]:[Clôturé]],SMALL(IF(Tableau_de_suivi[Clôturé]=\"OUI\",ROW(Tableau_de_suivi[Clôturé])-2),ROWS($1:71)),COLUMN()),\"\")","v":""},{"$f":"IFERROR(INDEX(Tableau_de_suivi[[N°]:[Clôturé]],SMALL(IF(Tableau_de_suivi[Clôturé]=\"OUI\",ROW(Tableau_de_suivi[Clôturé])-2),ROWS($1:71)),COLUMN()),\"\")","v":""},{"$f":"IFERROR(INDEX(Tableau_de_suivi[[N°]:[Clôturé]],SMALL(IF(Tableau_de_suivi[Clôturé]=\"OUI\",ROW(Tableau_de_suivi[Clôturé])-2),ROWS($1:71)),COLUMN()),\"\")","v":""},{"$f":"IFERROR(INDEX(Tableau_de_suivi[[N°]:[Clôturé]],SMALL(IF(Tableau_de_suivi[Clôturé]=\"OUI\",ROW(Tableau_de_suivi[Clôturé])-2),ROWS($1:71)),COLUMN()),\"\")","v":""},{"$f":"IFERROR(INDEX(Tableau_de_suivi[[N°]:[Clôturé]],SMALL(IF(Tableau_de_suivi[Clôturé]=\"OUI\",ROW(Tableau_de_suivi[Clôturé])-2),ROWS($1:71)),COLUMN()),\"\")","v":""},{"$f":"IFERROR(INDEX(Tableau_de_suivi[[N°]:[Clôturé]],SMALL(IF(Tableau_de_suivi[Clôturé]=\"OUI\",ROW(Tableau_de_suivi[Clôturé])-2),ROWS($1:71)),COLUMN()),\"\")","v":""},{"$f":"IFERROR(INDEX(Tableau_de_suivi[[N°]:[Clôturé]],SMALL(IF(Tableau_de_suivi[Clôturé]=\"OUI\",ROW(Tableau_de_suivi[Clôturé])-2),ROWS($1:71)),COLUMN()),\"\")","v":""},{"$f":"IFERROR(INDEX(Tableau_de_suivi[[N°]:[Clôturé]],SMALL(IF(Tableau_de_suivi[Clôturé]=\"OUI\",ROW(Tableau_de_suivi[Clôturé])-2),ROWS($1:71)),COLUMN()),\"\")","v":""},{"$f":"IFERROR(INDEX(Tableau_de_suivi[[N°]:[Clôturé]],SMALL(IF(Tableau_de_suivi[Clôturé]=\"OUI\",ROW(Tableau_de_suivi[Clôturé])-2),ROWS($1:71)),COLUMN()),\"\")","v":""},{"$f":"IFERROR(INDEX(Tableau_de_suivi[[N°]:[Clôturé]],SMALL(IF(Tableau_de_suivi[Clôturé]=\"OUI\",ROW(Tableau_de_suivi[Clôturé])-2),ROWS($1:71)),COLUMN()),\"\")","v":""},{"$f":"IFERROR(INDEX(Tableau_de_suivi[[N°]:[Clôturé]],SMALL(IF(Tableau_de_suivi[Clôturé]=\"OUI\",ROW(Tableau_de_suivi[Clôturé])-2),ROWS($1:71)),COLUMN()),\"\")","v":""},{"$f":"IFERROR(INDEX(Tableau_de_suivi[[N°]:[Clôturé]],SMALL(IF(Tableau_de_suivi[Clôturé]=\"OUI\",ROW(Tableau_de_suivi[Clôturé])-2),ROWS($1:71)),COLUMN()),\"\")","v":""},{"$f":"IFERROR(INDEX(Tableau_de_suivi[[N°]:[Clôturé]],SMALL(IF(Tableau_de_suivi[Clôturé]=\"OUI\",ROW(Tableau_de_suivi[Clôturé])-2),ROWS($1:71)),COLUMN()),\"\")","v":""},{"$f":"IFERROR(INDEX(Tableau_de_suivi[[N°]:[Clôturé]],SMALL(IF(Tableau_de_suivi[Clôturé]=\"OUI\",ROW(Tableau_de_suivi[Clôturé])-2),ROWS($1:71)),COLUMN()),\"\")","v":""},{"$f":"IFERROR(INDEX(Tableau_de_suivi[[N°]:[Clôturé]],SMALL(IF(Tableau_de_suivi[Clôturé]=\"OUI\",ROW(Tableau_de_suivi[Clôturé])-2),ROWS($1:71)),COLUMN()),\"\")","v":""},{"$f":"IFERROR(INDEX(Tableau_de_suivi[[N°]:[Clôturé]],SMALL(IF(Tableau_de_suivi[Clôturé]=\"OUI\",ROW(Tableau_de_suivi[Clôturé])-2),ROWS($1:71)),COLUMN()),\"\")","v":""},{"$f":"IFERROR(INDEX(Tableau_de_suivi[[N°]:[Clôturé]],SMALL(IF(Tableau_de_suivi[Clôturé]=\"OUI\",ROW(Tableau_de_suivi[Clôturé])-2),ROWS($1:71)),COLUMN()),\"\")","v":""}]
[{"$f":"IFERROR(INDEX(Tableau_de_suivi[[N°]:[Clôturé]],SMALL(IF(Tableau_de_suivi[Clôturé]=\"OUI\",ROW(Tableau_de_suivi[Clôturé])-2),ROWS($1:72)),COLUMN()),\"\")","v":""},{"$f":"IFERROR(INDEX(Tableau_de_suivi[[N°]:[Clôturé]],SMALL(IF(Tableau_de_suivi[Clôturé]=\"OUI\",ROW(Tableau_de_suivi[Clôturé])-2),ROWS($1:72)),COLUMN()),\"\")","v":""},{"$f":"IFERROR(INDEX(Tableau_de_suivi[[N°]:[Clôturé]],SMALL(IF(Tableau_de_suivi[Clôturé]=\"OUI\",ROW(Tableau_de_suivi[Clôturé])-2),ROWS($1:72)),COLUMN()),\"\")","v":""},{"$f":"IFERROR(INDEX(Tableau_de_suivi[[N°]:[Clôturé]],SMALL(IF(Tableau_de_suivi[Clôturé]=\"OUI\",ROW(Tableau_de_suivi[Clôturé])-2),ROWS($1:72)),COLUMN()),\"\")","v":""},{"$f":"IFERROR(INDEX(Tableau_de_suivi[[N°]:[Clôturé]],SMALL(IF(Tableau_de_suivi[Clôturé]=\"OUI\",ROW(Tableau_de_suivi[Clôturé])-2),ROWS($1:72)),COLUMN()),\"\")","v":""},{"$f":"IFERROR(INDEX(Tableau_de_suivi[[N°]:[Clôturé]],SMALL(IF(Tableau_de_suivi[Clôturé]=\"OUI\",ROW(Tableau_de_suivi[Clôturé])-2),ROWS($1:72)),COLUMN()),\"\")","v":""},{"$f":"IFERROR(INDEX(Tableau_de_suivi[[N°]:[Clôturé]],SMALL(IF(Tableau_de_suivi[Clôturé]=\"OUI\",ROW(Tableau_de_suivi[Clôturé])-2),ROWS($1:72)),COLUMN()),\"\")","v":""},{"$f":"IFERROR(INDEX(Tableau_de_suivi[[N°]:[Clôturé]],SMALL(IF(Tableau_de_suivi[Clôturé]=\"OUI\",ROW(Tableau_de_suivi[Clôturé])-2),ROWS($1:72)),COLUMN()),\"\")","v":""},{"$f":"IFERROR(INDEX(Tableau_de_suivi[[N°]:[Clôturé]],SMALL(IF(Tableau_de_suivi[Clôturé]=\"OUI\",ROW(Tableau_de_suivi[Clôturé])-2),ROWS($1:72)),COLUMN()),\"\")","v":""},{"$f":"IFERROR(INDEX(Tableau_de_suivi[[N°]:[Clôturé]],SMALL(IF(Tableau_de_suivi[Clôturé]=\"OUI\",ROW(Tableau_de_suivi[Clôturé])-2),ROWS($1:72)),COLUMN()),\"\")","v":""},{"$f":"IFERROR(INDEX(Tableau_de_suivi[[N°]:[Clôturé]],SMALL(IF(Tableau_de_suivi[Clôturé]=\"OUI\",ROW(Tableau_de_suivi[Clôturé])-2),ROWS($1:72)),COLUMN()),\"\")","v":""},{"$f":"IFERROR(INDEX(Tableau_de_suivi[[N°]:[Clôturé]],SMALL(IF(Tableau_de_suivi[Clôturé]=\"OUI\",ROW(Tableau_de_suivi[Clôturé])-2),ROWS($1:72)),COLUMN()),\"\")","v":""},{"$f":"IFERROR(INDEX(Tableau_de_suivi[[N°]:[Clôturé]],SMALL(IF(Tableau_de_suivi[Clôturé]=\"OUI\",ROW(Tableau_de_suivi[Clôturé])-2),ROWS($1:72)),COLUMN()),\"\")","v":""},{"$f":"IFERROR(INDEX(Tableau_de_suivi[[N°]:[Clôturé]],SMALL(IF(Tableau_de_suivi[Clôturé]=\"OUI\",ROW(Tableau_de_suivi[Clôturé])-2),ROWS($1:72)),COLUMN()),\"\")","v":""},{"$f":"IFERROR(INDEX(Tableau_de_suivi[[N°]:[Clôturé]],SMALL(IF(Tableau_de_suivi[Clôturé]=\"OUI\",ROW(Tableau_de_suivi[Clôturé])-2),ROWS($1:72)),COLUMN()),\"\")","v":""},{"$f":"IFERROR(INDEX(Tableau_de_suivi[[N°]:[Clôturé]],SMALL(IF(Tableau_de_suivi[Clôturé]=\"OUI\",ROW(Tableau_de_suivi[Clôturé])-2),ROWS($1:72)),COLUMN()),\"\")","v":""},{"$f":"IFERROR(INDEX(Tableau_de_suivi[[N°]:[Clôturé]],SMALL(IF(Tableau_de_suivi[Clôturé]=\"OUI\",ROW(Tableau_de_suivi[Clôturé])-2),ROWS($1:72)),COLUMN()),\"\")","v":""},{"$f":"IFERROR(INDEX(Tableau_de_suivi[[N°]:[Clôturé]],SMALL(IF(Tableau_de_suivi[Clôturé]=\"OUI\",ROW(Tableau_de_suivi[Clôturé])-2),ROWS($1:72)),COLUMN()),\"\")","v":""},{"$f":"IFERROR(INDEX(Tableau_de_suivi[[N°]:[Clôturé]],SMALL(IF(Tableau_de_suivi[Clôturé]=\"OUI\",ROW(Tableau_de_suivi[Clôturé])-2),ROWS($1:72)),COLUMN()),\"\")","v":""},{"$f":"IFERROR(INDEX(Tableau_de_suivi[[N°]:[Clôturé]],SMALL(IF(Tableau_de_suivi[Clôturé]=\"OUI\",ROW(Tableau_de_suivi[Clôturé])-2),ROWS($1:72)),COLUMN()),\"\")","v":""},{"$f":"IFERROR(INDEX(Tableau_de_suivi[[N°]:[Clôturé]],SMALL(IF(Tableau_de_suivi[Clôturé]=\"OUI\",ROW(Tableau_de_suivi[Clôturé])-2),ROWS($1:72)),COLUMN()),\"\")","v":""},{"$f":"IFERROR(INDEX(Tableau_de_suivi[[N°]:[Clôturé]],SMALL(IF(Tableau_de_suivi[Clôturé]=\"OUI\",ROW(Tableau_de_suivi[Clôturé])-2),ROWS($1:72)),COLUMN()),\"\")","v":""}]
[{"$f":"IFERROR(INDEX(Tableau_de_suivi[[N°]:[Clôturé]],SMALL(IF(Tableau_de_suivi[Clôturé]=\"OUI\",ROW(Tableau_de_suivi[Clôturé])-2),ROWS($1:73)),COLUMN()),\"\")","v":""},{"$f":"IFERROR(INDEX(Tableau_de_suivi[[N°]:[Clôturé]],SMALL(IF(Tableau_de_suivi[Clôturé]=\"OUI\",ROW(Tableau_de_suivi[Clôturé])-2),ROWS($1:73)),COLUMN()),\"\")","v":""},{"$f":"IFERROR(INDEX(Tableau_de_suivi[[N°]:[Clôturé]],SMALL(IF(Tableau_de_suivi[Clôturé]=\"OUI\",ROW(Tableau_de_suivi[Clôturé])-2),ROWS($1:73)),COLUMN()),\"\")","v":""},{"$f":"IFERROR(INDEX(Tableau_de_suivi[[N°]:[Clôturé]],SMALL(IF(Tableau_de_suivi[Clôturé]=\"OUI\",ROW(Tableau_de_suivi[Clôturé])-2),ROWS($1:73)),COLUMN()),\"\")","v":""},{"$f":"IFERROR(INDEX(Tableau_de_suivi[[N°]:[Clôturé]],SMALL(IF(Tableau_de_suivi[Clôturé]=\"OUI\",ROW(Tableau_de_suivi[Clôturé])-2),ROWS($1:73)),COLUMN()),\"\")","v":""},{"$f":"IFERROR(INDEX(Tableau_de_suivi[[N°]:[Clôturé]],SMALL(IF(Tableau_de_suivi[Clôturé]=\"OUI\",ROW(Tableau_de_suivi[Clôturé])-2),ROWS($1:73)),COLUMN()),\"\")","v":""},{"$f":"IFERROR(INDEX(Tableau_de_suivi[[N°]:[Clôturé]],SMALL(IF(Tableau_de_suivi[Clôturé]=\"OUI\",ROW(Tableau_de_suivi[Clôturé])-2),ROWS($1:73)),COLUMN()),\"\")","v":""},{"$f":"IFERROR(INDEX(Tableau_de_suivi[[N°]:[Clôturé]],SMALL(IF(Tableau_de_suivi[Clôturé]=\"OUI\",ROW(Tableau_de_suivi[Clôturé])-2),ROWS($1:73)),COLUMN()),\"\")","v":""},{"$f":"IFERROR(INDEX(Tableau_de_suivi[[N°]:[Clôturé]],SMALL(IF(Tableau_de_suivi[Clôturé]=\"OUI\",ROW(Tableau_de_suivi[Clôturé])-2),ROWS($1:73)),COLUMN()),\"\")","v":""},{"$f":"IFERROR(INDEX(Tableau_de_suivi[[N°]:[Clôturé]],SMALL(IF(Tableau_de_suivi[Clôturé]=\"OUI\",ROW(Tableau_de_suivi[Clôturé])-2),ROWS($1:73)),COLUMN()),\"\")","v":""},{"$f":"IFERROR(INDEX(Tableau_de_suivi[[N°]:[Clôturé]],SMALL(IF(Tableau_de_suivi[Clôturé]=\"OUI\",ROW(Tableau_de_suivi[Clôturé])-2),ROWS($1:73)),COLUMN()),\"\")","v":""},{"$f":"IFERROR(INDEX(Tableau_de_suivi[[N°]:[Clôturé]],SMALL(IF(Tableau_de_suivi[Clôturé]=\"OUI\",ROW(Tableau_de_suivi[Clôturé])-2),ROWS($1:73)),COLUMN()),\"\")","v":""},{"$f":"IFERROR(INDEX(Tableau_de_suivi[[N°]:[Clôturé]],SMALL(IF(Tableau_de_suivi[Clôturé]=\"OUI\",ROW(Tableau_de_suivi[Clôturé])-2),ROWS($1:73)),COLUMN()),\"\")","v":""},{"$f":"IFERROR(INDEX(Tableau_de_suivi[[N°]:[Clôturé]],SMALL(IF(Tableau_de_suivi[Clôturé]=\"OUI\",ROW(Tableau_de_suivi[Clôturé])-2),ROWS($1:73)),COLUMN()),\"\")","v":""},{"$f":"IFERROR(INDEX(Tableau_de_suivi[[N°]:[Clôturé]],SMALL(IF(Tableau_de_suivi[Clôturé]=\"OUI\",ROW(Tableau_de_suivi[Clôturé])-2),ROWS($1:73)),COLUMN()),\"\")","v":""},{"$f":"IFERROR(INDEX(Tableau_de_suivi[[N°]:[Clôturé]],SMALL(IF(Tableau_de_suivi[Clôturé]=\"OUI\",ROW(Tableau_de_suivi[Clôturé])-2),ROWS($1:73)),COLUMN()),\"\")","v":""},{"$f":"IFERROR(INDEX(Tableau_de_suivi[[N°]:[Clôturé]],SMALL(IF(Tableau_de_suivi[Clôturé]=\"OUI\",ROW(Tableau_de_suivi[Clôturé])-2),ROWS($1:73)),COLUMN()),\"\")","v":""},{"$f":"IFERROR(INDEX(Tableau_de_suivi[[N°]:[Clôturé]],SMALL(IF(Tableau_de_suivi[Clôturé]=\"OUI\",ROW(Tableau_de_suivi[Clôturé])-2),ROWS($1:73)),COLUMN()),\"\")","v":""},{"$f":"IFERROR(INDEX(Tableau_de_suivi[[N°]:[Clôturé]],SMALL(IF(Tableau_de_suivi[Clôturé]=\"OUI\",ROW(Tableau_de_suivi[Clôturé])-2),ROWS($1:73)),COLUMN()),\"\")","v":""},{"$f":"IFERROR(INDEX(Tableau_de_suivi[[N°]:[Clôturé]],SMALL(IF(Tableau_de_suivi[Clôturé]=\"OUI\",ROW(Tableau_de_suivi[Clôturé])-2),ROWS($1:73)),COLUMN()),\"\")","v":""},{"$f":"IFERROR(INDEX(Tableau_de_suivi[[N°]:[Clôturé]],SMALL(IF(Tableau_de_suivi[Clôturé]=\"OUI\",ROW(Tableau_de_suivi[Clôturé])-2),ROWS($1:73)),COLUMN()),\"\")","v":""},{"$f":"IFERROR(INDEX(Tableau_de_suivi[[N°]:[Clôturé]],SMALL(IF(Tableau_de_suivi[Clôturé]=\"OUI\",ROW(Tableau_de_suivi[Clôturé])-2),ROWS($1:73)),COLUMN()),\"\")","v":""}]
[{"$f":"IFERROR(INDEX(Tableau_de_suivi[[N°]:[Clôturé]],SMALL(IF(Tableau_de_suivi[Clôturé]=\"OUI\",ROW(Tableau_de_suivi[Clôturé])-2),ROWS($1:74)),COLUMN()),\"\")","v":""},{"$f":"IFERROR(INDEX(Tableau_de_suivi[[N°]:[Clôturé]],SMALL(IF(Tableau_de_suivi[Clôturé]=\"OUI\",ROW(Tableau_de_suivi[Clôturé])-2),ROWS($1:74)),COLUMN()),\"\")","v":""},{"$f":"IFERROR(INDEX(Tableau_de_suivi[[N°]:[Clôturé]],SMALL(IF(Tableau_de_suivi[Clôturé]=\"OUI\",ROW(Tableau_de_suivi[Clôturé])-2),ROWS($1:74)),COLUMN()),\"\")","v":""},{"$f":"IFERROR(INDEX(Tableau_de_suivi[[N°]:[Clôturé]],SMALL(IF(Tableau_de_suivi[Clôturé]=\"OUI\",ROW(Tableau_de_suivi[Clôturé])-2),ROWS($1:74)),COLUMN()),\"\")","v":""},{"$f":"IFERROR(INDEX(Tableau_de_suivi[[N°]:[Clôturé]],SMALL(IF(Tableau_de_suivi[Clôturé]=\"OUI\",ROW(Tableau_de_suivi[Clôturé])-2),ROWS($1:74)),COLUMN()),\"\")","v":""},{"$f":"IFERROR(INDEX(Tableau_de_suivi[[N°]:[Clôturé]],SMALL(IF(Tableau_de_suivi[Clôturé]=\"OUI\",ROW(Tableau_de_suivi[Clôturé])-2),ROWS($1:74)),COLUMN()),\"\")","v":""},{"$f":"IFERROR(INDEX(Tableau_de_suivi[[N°]:[Clôturé]],SMALL(IF(Tableau_de_suivi[Clôturé]=\"OUI\",ROW(Tableau_de_suivi[Clôturé])-2),ROWS($1:74)),COLUMN()),\"\")","v":""},{"$f":"IFERROR(INDEX(Tableau_de_suivi[[N°]:[Clôturé]],SMALL(IF(Tableau_de_suivi[Clôturé]=\"OUI\",ROW(Tableau_de_suivi[Clôturé])-2),ROWS($1:74)),COLUMN()),\"\")","v":""},{"$f":"IFERROR(INDEX(Tableau_de_suivi[[N°]:[Clôturé]],SMALL(IF(Tableau_de_suivi[Clôturé]=\"OUI\",ROW(Tableau_de_suivi[Clôturé])-2),ROWS($1:74)),COLUMN()),\"\")","v":""},{"$f":"IFERROR(INDEX(Tableau_de_suivi[[N°]:[Clôturé]],SMALL(IF(Tableau_de_suivi[Clôturé]=\"OUI\",ROW(Tableau_de_suivi[Clôturé])-2),ROWS($1:74)),COLUMN()),\"\")","v":""},{"$f":"IFERROR(INDEX(Tableau_de_suivi[[N°]:[Clôturé]],SMALL(IF(Tableau_de_suivi[Clôturé]=\"OUI\",ROW(Tableau_de_suivi[Clôturé])-2),ROWS($1:74)),COLUMN()),\"\")","v":""},{"$f":"IFERROR(INDEX(Tableau_de_suivi[[N°]:[Clôturé]],SMALL(IF(Tableau_de_suivi[Clôturé]=\"OUI\",ROW(Tableau_de_suivi[Clôturé])-2),ROWS($1:74)),COLUMN()),\"\")","v":""},{"$f":"IFERROR(INDEX(Tableau_de_suivi[[N°]:[Clôturé]],SMALL(IF(Tableau_de_suivi[Clôturé]=\"OUI\",ROW(Tableau_de_suivi[Clôturé])-2),ROWS($1:74)),COLUMN()),\"\")","v":""},{"$f":"IFERROR(INDEX(Tableau_de_suivi[[N°]:[Clôturé]],SMALL(IF(Tableau_de_suivi[Clôturé]=\"OUI\",ROW(Tableau_de_suivi[Clôturé])-2),ROWS($1:74)),COLUMN()),\"\")","v":""},{"$f":"IFERROR(INDEX(Tableau_de_suivi[[N°]:[Clôturé]],SMALL(IF(Tableau_de_suivi[Clôturé]=\"OUI\",ROW(Tableau_de_suivi[Clôturé])-2),ROWS($1:74)),COLUMN()),\"\")","v":""},{"$f":"IFERROR(INDEX(Tableau_de_suivi[[N°]:[Clôturé]],SMALL(IF(Tableau_de_suivi[Clôturé]=\"OUI\",ROW(Tableau_de_suivi[Clôturé])-2),ROWS($1:74)),COLUMN()),\"\")","v":""},{"$f":"IFERROR(INDEX(Tableau_de_suivi[[N°]:[Clôturé]],SMALL(IF(Tableau_de_suivi[Clôturé]=\"OUI\",ROW(Tableau_de_suivi[Clôturé])-2),ROWS($1:74)),COLUMN()),\"\")","v":""},{"$f":"IFERROR(INDEX(Tableau_de_suivi[[N°]:[Clôturé]],SMALL(IF(Tableau_de_suivi[Clôturé]=\"OUI\",ROW(Tableau_de_suivi[Clôturé])-2),ROWS($1:74)),COLUMN()),\"\")","v":""},{"$f":"IFERROR(INDEX(Tableau_de_suivi[[N°]:[Clôturé]],SMALL(IF(Tableau_de_suivi[Clôturé]=\"OUI\",ROW(Tableau_de_suivi[Clôturé])-2),ROWS($1:74)),COLUMN()),\"\")","v":""},{"$f":"IFERROR(INDEX(Tableau_de_suivi[[N°]:[Clôturé]],SMALL(IF(Tableau_de_suivi[Clôturé]=\"OUI\",ROW(Tableau_de_suivi[Clôturé])-2),ROWS($1:74)),COLUMN()),\"\")","v":""},{"$f":"IFERROR(INDEX(Tableau_de_suivi[[N°]:[Clôturé]],SMALL(IF(Tableau_de_suivi[Clôturé]=\"OUI\",ROW(Tableau_de_suivi[Clôturé])-2),ROWS($1:74)),COLUMN()),\"\")","v":""},{"$f":"IFERROR(INDEX(Tableau_de_suivi[[N°]:[Clôturé]],SMALL(IF(Tableau_de_suivi[Clôturé]=\"OUI\",ROW(Tableau_de_suivi[Clôturé])-2),ROWS($1:74)),COLUMN()),\"\")","v":""}]
[{"$f":"IFERROR(INDEX(Tableau_de_suivi[[N°]:[Clôturé]],SMALL(IF(Tableau_de_suivi[Clôturé]=\"OUI\",ROW(Tableau_de_suivi[Clôturé])-2),ROWS($1:75)),COLUMN()),\"\")","v":""},{"$f":"IFERROR(INDEX(Tableau_de_suivi[[N°]:[Clôturé]],SMALL(IF(Tableau_de_suivi[Clôturé]=\"OUI\",ROW(Tableau_de_suivi[Clôturé])-2),ROWS($1:75)),COLUMN()),\"\")","v":""},{"$f":"IFERROR(INDEX(Tableau_de_suivi[[N°]:[Clôturé]],SMALL(IF(Tableau_de_suivi[Clôturé]=\"OUI\",ROW(Tableau_de_suivi[Clôturé])-2),ROWS($1:75)),COLUMN()),\"\")","v":""},{"$f":"IFERROR(INDEX(Tableau_de_suivi[[N°]:[Clôturé]],SMALL(IF(Tableau_de_suivi[Clôturé]=\"OUI\",ROW(Tableau_de_suivi[Clôturé])-2),ROWS($1:75)),COLUMN()),\"\")","v":""},{"$f":"IFERROR(INDEX(Tableau_de_suivi[[N°]:[Clôturé]],SMALL(IF(Tableau_de_suivi[Clôturé]=\"OUI\",ROW(Tableau_de_suivi[Clôturé])-2),ROWS($1:75)),COLUMN()),\"\")","v":""},{"$f":"IFERROR(INDEX(Tableau_de_suivi[[N°]:[Clôturé]],SMALL(IF(Tableau_de_suivi[Clôturé]=\"OUI\",ROW(Tableau_de_suivi[Clôturé])-2),ROWS($1:75)),COLUMN()),\"\")","v":""},{"$f":"IFERROR(INDEX(Tableau_de_suivi[[N°]:[Clôturé]],SMALL(IF(Tableau_de_suivi[Clôturé]=\"OUI\",ROW(Tableau_de_suivi[Clôturé])-2),ROWS($1:75)),COLUMN()),\"\")","v":""},{"$f":"IFERROR(INDEX(Tableau_de_suivi[[N°]:[Clôturé]],SMALL(IF(Tableau_de_suivi[Clôturé]=\"OUI\",ROW(Tableau_de_suivi[Clôturé])-2),ROWS($1:75)),COLUMN()),\"\")","v":""},{"$f":"IFERROR(INDEX(Tableau_de_suivi[[N°]:[Clôturé]],SMALL(IF(Tableau_de_suivi[Clôturé]=\"OUI\",ROW(Tableau_de_suivi[Clôturé])-2),ROWS($1:75)),COLUMN()),\"\")","v":""},{"$f":"IFERROR(INDEX(Tableau_de_suivi[[N°]:[Clôturé]],SMALL(IF(Tableau_de_suivi[Clôturé]=\"OUI\",ROW(Tableau_de_suivi[Clôturé])-2),ROWS($1:75)),COLUMN()),\"\")","v":""},{"$f":"IFERROR(INDEX(Tableau_de_suivi[[N°]:[Clôturé]],SMALL(IF(Tableau_de_suivi[Clôturé]=\"OUI\",ROW(Tableau_de_suivi[Clôturé])-2),ROWS($1:75)),COLUMN()),\"\")","v":""},{"$f":"IFERROR(INDEX(Tableau_de_suivi[[N°]:[Clôturé]],SMALL(IF(Tableau_de_suivi[Clôturé]=\"OUI\",ROW(Tableau_de_suivi[Clôturé])-2),ROWS($1:75)),COLUMN()),\"\")","v":""},{"$f":"IFERROR(INDEX(Tableau_de_suivi[[N°]:[Clôturé]],SMALL(IF(Tableau_de_suivi[Clôturé]=\"OUI\",ROW(Tableau_de_suivi[Clôturé])-2),ROWS($1:75)),COLUMN()),\"\")","v":""},{"$f":"IFERROR(INDEX(Tableau_de_suivi[[N°]:[Clôturé]],SMALL(IF(Tableau_de_suivi[Clôturé]=\"OUI\",ROW(Tableau_de_suivi[Clôturé])-2),ROWS($1:75)),COLUMN()),\"\")","v":""},{"$f":"IFERROR(INDEX(Tableau_de_suivi[[N°]:[Clôturé]],SMALL(IF(Tableau_de_suivi[Clôturé]=\"OUI\",ROW(Tableau_de_suivi[Clôturé])-2),ROWS($1:75)),COLUMN()),\"\")","v":""},{"$f":"IFERROR(INDEX(Tableau_de_suivi[[N°]:[Clôturé]],SMALL(IF(Tableau_de_suivi[Clôturé]=\"OUI\",ROW(Tableau_de_suivi[Clôturé])-2),ROWS($1:75)),COLUMN()),\"\")","v":""},{"$f":"IFERROR(INDEX(Tableau_de_suivi[[N°]:[Clôturé]],SMALL(IF(Tableau_de_suivi[Clôturé]=\"OUI\",ROW(Tableau_de_suivi[Clôturé])-2),ROWS($1:75)),COLUMN()),\"\")","v":""},{"$f":"IFERROR(INDEX(Tableau_de_suivi[[N°]:[Clôturé]],SMALL(IF(Tableau_de_suivi[Clôturé]=\"OUI\",ROW(Tableau_de_suivi[Clôturé])-2),ROWS($1:75)),COLUMN()),\"\")","v":""},{"$f":"IFERROR(INDEX(Tableau_de_suivi[[N°]:[Clôturé]],SMALL(IF(Tableau_de_suivi[Clôturé]=\"OUI\",ROW(Tableau_de_suivi[Clôturé])-2),ROWS($1:75)),COLUMN()),\"\")","v":""},{"$f":"IFERROR(INDEX(Tableau_de_suivi[[N°]:[Clôturé]],SMALL(IF(Tableau_de_suivi[Clôturé]=\"OUI\",ROW(Tableau_de_suivi[Clôturé])-2),ROWS($1:75)),COLUMN()),\"\")","v":""},{"$f":"IFERROR(INDEX(Tableau_de_suivi[[N°]:[Clôturé]],SMALL(IF(Tableau_de_suivi[Clôturé]=\"OUI\",ROW(Tableau_de_suivi[Clôturé])-2),ROWS($1:75)),COLUMN()),\"\")","v":""},{"$f":"IFERROR(INDEX(Tableau_de_suivi[[N°]:[Clôturé]],SMALL(IF(Tableau_de_suivi[Clôturé]=\"OUI\",ROW(Tableau_de_suivi[Clôturé])-2),ROWS($1:75)),COLUMN()),\"\")","v":""}]
[{"$f":"IFERROR(INDEX(Tableau_de_suivi[[N°]:[Clôturé]],SMALL(IF(Tableau_de_suivi[Clôturé]=\"OUI\",ROW(Tableau_de_suivi[Clôturé])-2),ROWS($1:76)),COLUMN()),\"\")","v":""},{"$f":"IFERROR(INDEX(Tableau_de_suivi[[N°]:[Clôturé]],SMALL(IF(Tableau_de_suivi[Clôturé]=\"OUI\",ROW(Tableau_de_suivi[Clôturé])-2),ROWS($1:76)),COLUMN()),\"\")","v":""},{"$f":"IFERROR(INDEX(Tableau_de_suivi[[N°]:[Clôturé]],SMALL(IF(Tableau_de_suivi[Clôturé]=\"OUI\",ROW(Tableau_de_suivi[Clôturé])-2),ROWS($1:76)),COLUMN()),\"\")","v":""},{"$f":"IFERROR(INDEX(Tableau_de_suivi[[N°]:[Clôturé]],SMALL(IF(Tableau_de_suivi[Clôturé]=\"OUI\",ROW(Tableau_de_suivi[Clôturé])-2),ROWS($1:76)),COLUMN()),\"\")","v":""},{"$f":"IFERROR(INDEX(Tableau_de_suivi[[N°]:[Clôturé]],SMALL(IF(Tableau_de_suivi[Clôturé]=\"OUI\",ROW(Tableau_de_suivi[Clôturé])-2),ROWS($1:76)),COLUMN()),\"\")","v":""},{"$f":"IFERROR(INDEX(Tableau_de_suivi[[N°]:[Clôturé]],SMALL(IF(Tableau_de_suivi[Clôturé]=\"OUI\",ROW(Tableau_de_suivi[Clôturé])-2),ROWS($1:76)),COLUMN()),\"\")","v":""},{"$f":"IFERROR(INDEX(Tableau_de_suivi[[N°]:[Clôturé]],SMALL(IF(Tableau_de_suivi[Clôturé]=\"OUI\",ROW(Tableau_de_suivi[Clôturé])-2),ROWS($1:76)),COLUMN()),\"\")","v":""},{"$f":"IFERROR(INDEX(Tableau_de_suivi[[N°]:[Clôturé]],SMALL(IF(Tableau_de_suivi[Clôturé]=\"OUI\",ROW(Tableau_de_suivi[Clôturé])-2),ROWS($1:76)),COLUMN()),\"\")","v":""},{"$f":"IFERROR(INDEX(Tableau_de_suivi[[N°]:[Clôturé]],SMALL(IF(Tableau_de_suivi[Clôturé]=\"OUI\",ROW(Tableau_de_suivi[Clôturé])-2),ROWS($1:76)),COLUMN()),\"\")","v":""},{"$f":"IFERROR(INDEX(Tableau_de_suivi[[N°]:[Clôturé]],SMALL(IF(Tableau_de_suivi[Clôturé]=\"OUI\",ROW(Tableau_de_suivi[Clôturé])-2),ROWS($1:76)),COLUMN()),\"\")","v":""},{"$f":"IFERROR(INDEX(Tableau_de_suivi[[N°]:[Clôturé]],SMALL(IF(Tableau_de_suivi[Clôturé]=\"OUI\",ROW(Tableau_de_suivi[Clôturé])-2),ROWS($1:76)),COLUMN()),\"\")","v":""},{"$f":"IFERROR(INDEX(Tableau_de_suivi[[N°]:[Clôturé]],SMALL(IF(Tableau_de_suivi[Clôturé]=\"OUI\",ROW(Tableau_de_suivi[Clôturé])-2),ROWS($1:76)),COLUMN()),\"\")","v":""},{"$f":"IFERROR(INDEX(Tableau_de_suivi[[N°]:[Clôturé]],SMALL(IF(Tableau_de_suivi[Clôturé]=\"OUI\",ROW(Tableau_de_suivi[Clôturé])-2),ROWS($1:76)),COLUMN()),\"\")","v":""},{"$f":"IFERROR(INDEX(Tableau_de_suivi[[N°]:[Clôturé]],SMALL(IF(Tableau_de_suivi[Clôturé]=\"OUI\",ROW(Tableau_de_suivi[Clôturé])-2),ROWS($1:76)),COLUMN()),\"\")","v":""},{"$f":"IFERROR(INDEX(Tableau_de_suivi[[N°]:[Clôturé]],SMALL(IF(Tableau_de_suivi[Clôturé]=\"OUI\",ROW(Tableau_de_suivi[Clôturé])-2),ROWS($1:76)),COLUMN()),\"\")","v":""},{"$f":"IFERROR(INDEX(Tableau_de_suivi[[N°]:[Clôturé]],SMALL(IF(Tableau_de_suivi[Clôturé]=\"OUI\",ROW(Tableau_de_suivi[Clôturé])-2),ROWS($1:76)),COLUMN()),\"\")","v":""},{"$f":"IFERROR(INDEX(Tableau_de_suivi[[N°]:[Clôturé]],SMALL(IF(Tableau_de_suivi[Clôturé]=\"OUI\",ROW(Tableau_de_suivi[Clôturé])-2),ROWS($1:76)),COLUMN()),\"\")","v":""},{"$f":"IFERROR(INDEX(Tableau_de_suivi[[N°]:[Clôturé]],SMALL(IF(Tableau_de_suivi[Clôturé]=\"OUI\",ROW(Tableau_de_suivi[Clôturé])-2),ROWS($1:76)),COLUMN()),\"\")","v":""},{"$f":"IFERROR(INDEX(Tableau_de_suivi[[N°]:[Clôturé]],SMALL(IF(Tableau_de_suivi[Clôturé]=\"OUI\",ROW(Tableau_de_suivi[Clôturé])-2),ROWS($1:76)),COLUMN()),\"\")","v":""},{"$f":"IFERROR(INDEX(Tableau_de_suivi[[N°]:[Clôturé]],SMALL(IF(Tableau_de_suivi[Clôturé]=\"OUI\",ROW(Tableau_de_suivi[Clôturé])-2),ROWS($1:76)),COLUMN()),\"\")","v":""},{"$f":"IFERROR(INDEX(Tableau_de_suivi[[N°]:[Clôturé]],SMALL(IF(Tableau_de_suivi[Clôturé]=\"OUI\",ROW(Tableau_de_suivi[Clôturé])-2),ROWS($1:76)),COLUMN()),\"\")","v":""},{"$f":"IFERROR(INDEX(Tableau_de_suivi[[N°]:[Clôturé]],SMALL(IF(Tableau_de_suivi[Clôturé]=\"OUI\",ROW(Tableau_de_suivi[Clôturé])-2),ROWS($1:76)),COLUMN()),\"\")","v":""}]
[{"$f":"IFERROR(INDEX(Tableau_de_suivi[[N°]:[Clôturé]],SMALL(IF(Tableau_de_suivi[Clôturé]=\"OUI\",ROW(Tableau_de_suivi[Clôturé])-2),ROWS($1:77)),COLUMN()),\"\")","v":""},{"$f":"IFERROR(INDEX(Tableau_de_suivi[[N°]:[Clôturé]],SMALL(IF(Tableau_de_suivi[Clôturé]=\"OUI\",ROW(Tableau_de_suivi[Clôturé])-2),ROWS($1:77)),COLUMN()),\"\")","v":""},{"$f":"IFERROR(INDEX(Tableau_de_suivi[[N°]:[Clôturé]],SMALL(IF(Tableau_de_suivi[Clôturé]=\"OUI\",ROW(Tableau_de_suivi[Clôturé])-2),ROWS($1:77)),COLUMN()),\"\")","v":""},{"$f":"IFERROR(INDEX(Tableau_de_suivi[[N°]:[Clôturé]],SMALL(IF(Tableau_de_suivi[Clôturé]=\"OUI\",ROW(Tableau_de_suivi[Clôturé])-2),ROWS($1:77)),COLUMN()),\"\")","v":""},{"$f":"IFERROR(INDEX(Tableau_de_suivi[[N°]:[Clôturé]],SMALL(IF(Tableau_de_suivi[Clôturé]=\"OUI\",ROW(Tableau_de_suivi[Clôturé])-2),ROWS($1:77)),COLUMN()),\"\")","v":""},{"$f":"IFERROR(INDEX(Tableau_de_suivi[[N°]:[Clôturé]],SMALL(IF(Tableau_de_suivi[Clôturé]=\"OUI\",ROW(Tableau_de_suivi[Clôturé])-2),ROWS($1:77)),COLUMN()),\"\")","v":""},{"$f":"IFERROR(INDEX(Tableau_de_suivi[[N°]:[Clôturé]],SMALL(IF(Tableau_de_suivi[Clôturé]=\"OUI\",ROW(Tableau_de_suivi[Clôturé])-2),ROWS($1:77)),COLUMN()),\"\")","v":""},{"$f":"IFERROR(INDEX(Tableau_de_suivi[[N°]:[Clôturé]],SMALL(IF(Tableau_de_suivi[Clôturé]=\"OUI\",ROW(Tableau_de_suivi[Clôturé])-2),ROWS($1:77)),COLUMN()),\"\")","v":""},{"$f":"IFERROR(INDEX(Tableau_de_suivi[[N°]:[Clôturé]],SMALL(IF(Tableau_de_suivi[Clôturé]=\"OUI\",ROW(Tableau_de_suivi[Clôturé])-2),ROWS($1:77)),COLUMN()),\"\")","v":""},{"$f":"IFERROR(INDEX(Tableau_de_suivi[[N°]:[Clôturé]],SMALL(IF(Tableau_de_suivi[Clôturé]=\"OUI\",ROW(Tableau_de_suivi[Clôturé])-2),ROWS($1:77)),COLUMN()),\"\")","v":""},{"$f":"IFERROR(INDEX(Tableau_de_suivi[[N°]:[Clôturé]],SMALL(IF(Tableau_de_suivi[Clôturé]=\"OUI\",ROW(Tableau_de_suivi[Clôturé])-2),ROWS($1:77)),COLUMN()),\"\")","v":""},{"$f":"IFERROR(INDEX(Tableau_de_suivi[[N°]:[Clôturé]],SMALL(IF(Tableau_de_suivi[Clôturé]=\"OUI\",ROW(Tableau_de_suivi[Clôturé])-2),ROWS($1:77)),COLUMN()),\"\")","v":""},{"$f":"IFERROR(INDEX(Tableau_de_suivi[[N°]:[Clôturé]],SMALL(IF(Tableau_de_suivi[Clôturé]=\"OUI\",ROW(Tableau_de_suivi[Clôturé])-2),ROWS($1:77)),COLUMN()),\"\")","v":""},{"$f":"IFERROR(INDEX(Tableau_de_suivi[[N°]:[Clôturé]],SMALL(IF(Tableau_de_suivi[Clôturé]=\"OUI\",ROW(Tableau_de_suivi[Clôturé])-2),ROWS($1:77)),COLUMN()),\"\")","v":""},{"$f":"IFERROR(INDEX(Tableau_de_suivi[[N°]:[Clôturé]],SMALL(IF(Tableau_de_suivi[Clôturé]=\"OUI\",ROW(Tableau_de_suivi[Clôturé])-2),ROWS($1:77)),COLUMN()),\"\")","v":""},{"$f":"IFERROR(INDEX(Tableau_de_suivi[[N°]:[Clôturé]],SMALL(IF(Tableau_de_suivi[Clôturé]=\"OUI\",ROW(Tableau_de_suivi[Clôturé])-2),ROWS($1:77)),COLUMN()),\"\")","v":""},{"$f":"IFERROR(INDEX(Tableau_de_suivi[[N°]:[Clôturé]],SMALL(IF(Tableau_de_suivi[Clôturé]=\"OUI\",ROW(Tableau_de_suivi[Clôturé])-2),ROWS($1:77)),COLUMN()),\"\")","v":""},{"$f":"IFERROR(INDEX(Tableau_de_suivi[[N°]:[Clôturé]],SMALL(IF(Tableau_de_suivi[Clôturé]=\"OUI\",ROW(Tableau_de_suivi[Clôturé])-2),ROWS($1:77)),COLUMN()),\"\")","v":""},{"$f":"IFERROR(INDEX(Tableau_de_suivi[[N°]:[Clôturé]],SMALL(IF(Tableau_de_suivi[Clôturé]=\"OUI\",ROW(Tableau_de_suivi[Clôturé])-2),ROWS($1:77)),COLUMN()),\"\")","v":""},{"$f":"IFERROR(INDEX(Tableau_de_suivi[[N°]:[Clôturé]],SMALL(IF(Tableau_de_suivi[Clôturé]=\"OUI\",ROW(Tableau_de_suivi[Clôturé])-2),ROWS($1:77)),COLUMN()),\"\")","v":""},{"$f":"IFERROR(INDEX(Tableau_de_suivi[[N°]:[Clôturé]],SMALL(IF(Tableau_de_suivi[Clôturé]=\"OUI\",ROW(Tableau_de_suivi[Clôturé])-2),ROWS($1:77)),COLUMN()),\"\")","v":""},{"$f":"IFERROR(INDEX(Tableau_de_suivi[[N°]:[Clôturé]],SMALL(IF(Tableau_de_suivi[Clôturé]=\"OUI\",ROW(Tableau_de_suivi[Clôturé])-2),ROWS($1:77)),COLUMN()),\"\")","v":""}]
[{"$f":"IFERROR(INDEX(Tableau_de_suivi[[N°]:[Clôturé]],SMALL(IF(Tableau_de_suivi[Clôturé]=\"OUI\",ROW(Tableau_de_suivi[Clôturé])-2),ROWS($1:78)),COLUMN()),\"\")","v":""},{"$f":"IFERROR(INDEX(Tableau_de_suivi[[N°]:[Clôturé]],SMALL(IF(Tableau_de_suivi[Clôturé]=\"OUI\",ROW(Tableau_de_suivi[Clôturé])-2),ROWS($1:78)),COLUMN()),\"\")","v":""},{"$f":"IFERROR(INDEX(Tableau_de_suivi[[N°]:[Clôturé]],SMALL(IF(Tableau_de_suivi[Clôturé]=\"OUI\",ROW(Tableau_de_suivi[Clôturé])-2),ROWS($1:78)),COLUMN()),\"\")","v":""},{"$f":"IFERROR(INDEX(Tableau_de_suivi[[N°]:[Clôturé]],SMALL(IF(Tableau_de_suivi[Clôturé]=\"OUI\",ROW(Tableau_de_suivi[Clôturé])-2),ROWS($1:78)),COLUMN()),\"\")","v":""},{"$f":"IFERROR(INDEX(Tableau_de_suivi[[N°]:[Clôturé]],SMALL(IF(Tableau_de_suivi[Clôturé]=\"OUI\",ROW(Tableau_de_suivi[Clôturé])-2),ROWS($1:78)),COLUMN()),\"\")","v":""},{"$f":"IFERROR(INDEX(Tableau_de_suivi[[N°]:[Clôturé]],SMALL(IF(Tableau_de_suivi[Clôturé]=\"OUI\",ROW(Tableau_de_suivi[Clôturé])-2),ROWS($1:78)),COLUMN()),\"\")","v":""},{"$f":"IFERROR(INDEX(Tableau_de_suivi[[N°]:[Clôturé]],SMALL(IF(Tableau_de_suivi[Clôturé]=\"OUI\",ROW(Tableau_de_suivi[Clôturé])-2),ROWS($1:78)),COLUMN()),\"\")","v":""},{"$f":"IFERROR(INDEX(Tableau_de_suivi[[N°]:[Clôturé]],SMALL(IF(Tableau_de_suivi[Clôturé]=\"OUI\",ROW(Tableau_de_suivi[Clôturé])-2),ROWS($1:78)),COLUMN()),\"\")","v":""},{"$f":"IFERROR(INDEX(Tableau_de_suivi[[N°]:[Clôturé]],SMALL(IF(Tableau_de_suivi[Clôturé]=\"OUI\",ROW(Tableau_de_suivi[Clôturé])-2),ROWS($1:78)),COLUMN()),\"\")","v":""},{"$f":"IFERROR(INDEX(Tableau_de_suivi[[N°]:[Clôturé]],SMALL(IF(Tableau_de_suivi[Clôturé]=\"OUI\",ROW(Tableau_de_suivi[Clôturé])-2),ROWS($1:78)),COLUMN()),\"\")","v":""},{"$f":"IFERROR(INDEX(Tableau_de_suivi[[N°]:[Clôturé]],SMALL(IF(Tableau_de_suivi[Clôturé]=\"OUI\",ROW(Tableau_de_suivi[Clôturé])-2),ROWS($1:78)),COLUMN()),\"\")","v":""},{"$f":"IFERROR(INDEX(Tableau_de_suivi[[N°]:[Clôturé]],SMALL(IF(Tableau_de_suivi[Clôturé]=\"OUI\",ROW(Tableau_de_suivi[Clôturé])-2),ROWS($1:78)),COLUMN()),\"\")","v":""},{"$f":"IFERROR(INDEX(Tableau_de_suivi[[N°]:[Clôturé]],SMALL(IF(Tableau_de_suivi[Clôturé]=\"OUI\",ROW(Tableau_de_suivi[Clôturé])-2),ROWS($1:78)),COLUMN()),\"\")","v":""},{"$f":"IFERROR(INDEX(Tableau_de_suivi[[N°]:[Clôturé]],SMALL(IF(Tableau_de_suivi[Clôturé]=\"OUI\",ROW(Tableau_de_suivi[Clôturé])-2),ROWS($1:78)),COLUMN()),\"\")","v":""},{"$f":"IFERROR(INDEX(Tableau_de_suivi[[N°]:[Clôturé]],SMALL(IF(Tableau_de_suivi[Clôturé]=\"OUI\",ROW(Tableau_de_suivi[Clôturé])-2),ROWS($1:78)),COLUMN()),\"\")","v":""},{"$f":"IFERROR(INDEX(Tableau_de_suivi[[N°]:[Clôturé]],SMALL(IF(Tableau_de_suivi[Clôturé]=\"OUI\",ROW(Tableau_de_suivi[Clôturé])-2),ROWS($1:78)),COLUMN()),\"\")","v":""},{"$f":"IFERROR(INDEX(Tableau_de_suivi[[N°]:[Clôturé]],SMALL(IF(Tableau_de_suivi[Clôturé]=\"OUI\",ROW(Tableau_de_suivi[Clôturé])-2),ROWS($1:78)),COLUMN()),\"\")","v":""},{"$f":"IFERROR(INDEX(Tableau_de_suivi[[N°]:[Clôturé]],SMALL(IF(Tableau_de_suivi[Clôturé]=\"OUI\",ROW(Tableau_de_suivi[Clôturé])-2),ROWS($1:78)),COLUMN()),\"\")","v":""},{"$f":"IFERROR(INDEX(Tableau_de_suivi[[N°]:[Clôturé]],SMALL(IF(Tableau_de_suivi[Clôturé]=\"OUI\",ROW(Tableau_de_suivi[Clôturé])-2),ROWS($1:78)),COLUMN()),\"\")","v":""},{"$f":"IFERROR(INDEX(Tableau_de_suivi[[N°]:[Clôturé]],SMALL(IF(Tableau_de_suivi[Clôturé]=\"OUI\",ROW(Tableau_de_suivi[Clôturé])-2),ROWS($1:78)),COLUMN()),\"\")","v":""},{"$f":"IFERROR(INDEX(Tableau_de_suivi[[N°]:[Clôturé]],SMALL(IF(Tableau_de_suivi[Clôturé]=\"OUI\",ROW(Tableau_de_suivi[Clôturé])-2),ROWS($1:78)),COLUMN()),\"\")","v":""},{"$f":"IFERROR(INDEX(Tableau_de_suivi[[N°]:[Clôturé]],SMALL(IF(Tableau_de_suivi[Clôturé]=\"OUI\",ROW(Tableau_de_suivi[Clôturé])-2),ROWS($1:78)),COLUMN()),\"\")","v":""}]
[{"$f":"IFERROR(INDEX(Tableau_de_suivi[[N°]:[Clôturé]],SMALL(IF(Tableau_de_suivi[Clôturé]=\"OUI\",ROW(Tableau_de_suivi[Clôturé])-2),ROWS($1:79)),COLUMN()),\"\")","v":""},{"$f":"IFERROR(INDEX(Tableau_de_suivi[[N°]:[Clôturé]],SMALL(IF(Tableau_de_suivi[Clôturé]=\"OUI\",ROW(Tableau_de_suivi[Clôturé])-2),ROWS($1:79)),COLUMN()),\"\")","v":""},{"$f":"IFERROR(INDEX(Tableau_de_suivi[[N°]:[Clôturé]],SMALL(IF(Tableau_de_suivi[Clôturé]=\"OUI\",ROW(Tableau_de_suivi[Clôturé])-2),ROWS($1:79)),COLUMN()),\"\")","v":""},{"$f":"IFERROR(INDEX(Tableau_de_suivi[[N°]:[Clôturé]],SMALL(IF(Tableau_de_suivi[Clôturé]=\"OUI\",ROW(Tableau_de_suivi[Clôturé])-2),ROWS($1:79)),COLUMN()),\"\")","v":""},{"$f":"IFERROR(INDEX(Tableau_de_suivi[[N°]:[Clôturé]],SMALL(IF(Tableau_de_suivi[Clôturé]=\"OUI\",ROW(Tableau_de_suivi[Clôturé])-2),ROWS($1:79)),COLUMN()),\"\")","v":""},{"$f":"IFERROR(INDEX(Tableau_de_suivi[[N°]:[Clôturé]],SMALL(IF(Tableau_de_suivi[Clôturé]=\"OUI\",ROW(Tableau_de_suivi[Clôturé])-2),ROWS($1:79)),COLUMN()),\"\")","v":""},{"$f":"IFERROR(INDEX(Tableau_de_suivi[[N°]:[Clôturé]],SMALL(IF(Tableau_de_suivi[Clôturé]=\"OUI\",ROW(Tableau_de_suivi[Clôturé])-2),ROWS($1:79)),COLUMN()),\"\")","v":""},{"$f":"IFERROR(INDEX(Tableau_de_suivi[[N°]:[Clôturé]],SMALL(IF(Tableau_de_suivi[Clôturé]=\"OUI\",ROW(Tableau_de_suivi[Clôturé])-2),ROWS($1:79)),COLUMN()),\"\")","v":""},{"$f":"IFERROR(INDEX(Tableau_de_suivi[[N°]:[Clôturé]],SMALL(IF(Tableau_de_suivi[Clôturé]=\"OUI\",ROW(Tableau_de_suivi[Clôturé])-2),ROWS($1:79)),COLUMN()),\"\")","v":""},{"$f":"IFERROR(INDEX(Tableau_de_suivi[[N°]:[Clôturé]],SMALL(IF(Tableau_de_suivi[Clôturé]=\"OUI\",ROW(Tableau_de_suivi[Clôturé])-2),ROWS($1:79)),COLUMN()),\"\")","v":""},{"$f":"IFERROR(INDEX(Tableau_de_suivi[[N°]:[Clôturé]],SMALL(IF(Tableau_de_suivi[Clôturé]=\"OUI\",ROW(Tableau_de_suivi[Clôturé])-2),ROWS($1:79)),COLUMN()),\"\")","v":""},{"$f":"IFERROR(INDEX(Tableau_de_suivi[[N°]:[Clôturé]],SMALL(IF(Tableau_de_suivi[Clôturé]=\"OUI\",ROW(Tableau_de_suivi[Clôturé])-2),ROWS($1:79)),COLUMN()),\"\")","v":""},{"$f":"IFERROR(INDEX(Tableau_de_suivi[[N°]:[Clôturé]],SMALL(IF(Tableau_de_suivi[Clôturé]=\"OUI\",ROW(Tableau_de_suivi[Clôturé])-2),ROWS($1:79)),COLUMN()),\"\")","v":""},{"$f":"IFERROR(INDEX(Tableau_de_suivi[[N°]:[Clôturé]],SMALL(IF(Tableau_de_suivi[Clôturé]=\"OUI\",ROW(Tableau_de_suivi[Clôturé])-2),ROWS($1:79)),COLUMN()),\"\")","v":""},{"$f":"IFERROR(INDEX(Tableau_de_suivi[[N°]:[Clôturé]],SMALL(IF(Tableau_de_suivi[Clôturé]=\"OUI\",ROW(Tableau_de_suivi[Clôturé])-2),ROWS($1:79)),COLUMN()),\"\")","v":""},{"$f":"IFERROR(INDEX(Tableau_de_suivi[[N°]:[Clôturé]],SMALL(IF(Tableau_de_suivi[Clôturé]=\"OUI\",ROW(Tableau_de_suivi[Clôturé])-2),ROWS($1:79)),COLUMN()),\"\")","v":""},{"$f":"IFERROR(INDEX(Tableau_de_suivi[[N°]:[Clôturé]],SMALL(IF(Tableau_de_suivi[Clôturé]=\"OUI\",ROW(Tableau_de_suivi[Clôturé])-2),ROWS($1:79)),COLUMN()),\"\")","v":""},{"$f":"IFERROR(INDEX(Tableau_de_suivi[[N°]:[Clôturé]],SMALL(IF(Tableau_de_suivi[Clôturé]=\"OUI\",ROW(Tableau_de_suivi[Clôturé])-2),ROWS($1:79)),COLUMN()),\"\")","v":""},{"$f":"IFERROR(INDEX(Tableau_de_suivi[[N°]:[Clôturé]],SMALL(IF(Tableau_de_suivi[Clôturé]=\"OUI\",ROW(Tableau_de_suivi[Clôturé])-2),ROWS($1:79)),COLUMN()),\"\")","v":""},{"$f":"IFERROR(INDEX(Tableau_de_suivi[[N°]:[Clôturé]],SMALL(IF(Tableau_de_suivi[Clôturé]=\"OUI\",ROW(Tableau_de_suivi[Clôturé])-2),ROWS($1:79)),COLUMN()),\"\")","v":""},{"$f":"IFERROR(INDEX(Tableau_de_suivi[[N°]:[Clôturé]],SMALL(IF(Tableau_de_suivi[Clôturé]=\"OUI\",ROW(Tableau_de_suivi[Clôturé])-2),ROWS($1:79)),COLUMN()),\"\")","v":""},{"$f":"IFERROR(INDEX(Tableau_de_suivi[[N°]:[Clôturé]],SMALL(IF(Tableau_de_suivi[Clôturé]=\"OUI\",ROW(Tableau_de_suivi[Clôturé])-2),ROWS($1:79)),COLUMN()),\"\")","v":""}]
[{"$f":"IFERROR(INDEX(Tableau_de_suivi[[N°]:[Clôturé]],SMALL(IF(Tableau_de_suivi[Clôturé]=\"OUI\",ROW(Tableau_de_suivi[Clôturé])-2),ROWS($1:80)),COLUMN()),\"\")","v":""},{"$f":"IFERROR(INDEX(Tableau_de_suivi[[N°]:[Clôturé]],SMALL(IF(Tableau_de_suivi[Clôturé]=\"OUI\",ROW(Tableau_de_suivi[Clôturé])-2),ROWS($1:80)),COLUMN()),\"\")","v":""},{"$f":"IFERROR(INDEX(Tableau_de_suivi[[N°]:[Clôturé]],SMALL(IF(Tableau_de_suivi[Clôturé]=\"OUI\",ROW(Tableau_de_suivi[Clôturé])-2),ROWS($1:80)),COLUMN()),\"\")","v":""},{"$f":"IFERROR(INDEX(Tableau_de_suivi[[N°]:[Clôturé]],SMALL(IF(Tableau_de_suivi[Clôturé]=\"OUI\",ROW(Tableau_de_suivi[Clôturé])-2),ROWS($1:80)),COLUMN()),\"\")","v":""},{"$f":"IFERROR(INDEX(Tableau_de_suivi[[N°]:[Clôturé]],SMALL(IF(Tableau_de_suivi[Clôturé]=\"OUI\",ROW(Tableau_de_suivi[Clôturé])-2),ROWS($1:80)),COLUMN()),\"\")","v":""},{"$f":"IFERROR(INDEX(Tableau_de_suivi[[N°]:[Clôturé]],SMALL(IF(Tableau_de_suivi[Clôturé]=\"OUI\",ROW(Tableau_de_suivi[Clôturé])-2),ROWS($1:80)),COLUMN()),\"\")","v":""},{"$f":"IFERROR(INDEX(Tableau_de_suivi[[N°]:[Clôturé]],SMALL(IF(Tableau_de_suivi[Clôturé]=\"OUI\",ROW(Tableau_de_suivi[Clôturé])-2),ROWS($1:80)),COLUMN()),\"\")","v":""},{"$f":"IFERROR(INDEX(Tableau_de_suivi[[N°]:[Clôturé]],SMALL(IF(Tableau_de_suivi[Clôturé]=\"OUI\",ROW(Tableau_de_suivi[Clôturé])-2),ROWS($1:80)),COLUMN()),\"\")","v":""},{"$f":"IFERROR(INDEX(Tableau_de_suivi[[N°]:[Clôturé]],SMALL(IF(Tableau_de_suivi[Clôturé]=\"OUI\",ROW(Tableau_de_suivi[Clôturé])-2),ROWS($1:80)),COLUMN()),\"\")","v":""},{"$f":"IFERROR(INDEX(Tableau_de_suivi[[N°]:[Clôturé]],SMALL(IF(Tableau_de_suivi[Clôturé]=\"OUI\",ROW(Tableau_de_suivi[Clôturé])-2),ROWS($1:80)),COLUMN()),\"\")","v":""},{"$f":"IFERROR(INDEX(Tableau_de_suivi[[N°]:[Clôturé]],SMALL(IF(Tableau_de_suivi[Clôturé]=\"OUI\",ROW(Tableau_de_suivi[Clôturé])-2),ROWS($1:80)),COLUMN()),\"\")","v":""},{"$f":"IFERROR(INDEX(Tableau_de_suivi[[N°]:[Clôturé]],SMALL(IF(Tableau_de_suivi[Clôturé]=\"OUI\",ROW(Tableau_de_suivi[Clôturé])-2),ROWS($1:80)),COLUMN()),\"\")","v":""},{"$f":"IFERROR(INDEX(Tableau_de_suivi[[N°]:[Clôturé]],SMALL(IF(Tableau_de_suivi[Clôturé]=\"OUI\",ROW(Tableau_de_suivi[Clôturé])-2),ROWS($1:80)),COLUMN()),\"\")","v":""},{"$f":"IFERROR(INDEX(Tableau_de_suivi[[N°]:[Clôturé]],SMALL(IF(Tableau_de_suivi[Clôturé]=\"OUI\",ROW(Tableau_de_suivi[Clôturé])-2),ROWS($1:80)),COLUMN()),\"\")","v":""},{"$f":"IFERROR(INDEX(Tableau_de_suivi[[N°]:[Clôturé]],SMALL(IF(Tableau_de_suivi[Clôturé]=\"OUI\",ROW(Tableau_de_suivi[Clôturé])-2),ROWS($1:80)),COLUMN()),\"\")","v":""},{"$f":"IFERROR(INDEX(Tableau_de_suivi[[N°]:[Clôturé]],SMALL(IF(Tableau_de_suivi[Clôturé]=\"OUI\",ROW(Tableau_de_suivi[Clôturé])-2),ROWS($1:80)),COLUMN()),\"\")","v":""},{"$f":"IFERROR(INDEX(Tableau_de_suivi[[N°]:[Clôturé]],SMALL(IF(Tableau_de_suivi[Clôturé]=\"OUI\",ROW(Tableau_de_suivi[Clôturé])-2),ROWS($1:80)),COLUMN()),\"\")","v":""},{"$f":"IFERROR(INDEX(Tableau_de_suivi[[N°]:[Clôturé]],SMALL(IF(Tableau_de_suivi[Clôturé]=\"OUI\",ROW(Tableau_de_suivi[Clôturé])-2),ROWS($1:80)),COLUMN()),\"\")","v":""},{"$f":"IFERROR(INDEX(Tableau_de_suivi[[N°]:[Clôturé]],SMALL(IF(Tableau_de_suivi[Clôturé]=\"OUI\",ROW(Tableau_de_suivi[Clôturé])-2),ROWS($1:80)),COLUMN()),\"\")","v":""},{"$f":"IFERROR(INDEX(Tableau_de_suivi[[N°]:[Clôturé]],SMALL(IF(Tableau_de_suivi[Clôturé]=\"OUI\",ROW(Tableau_de_suivi[Clôturé])-2),ROWS($1:80)),COLUMN()),\"\")","v":""},{"$f":"IFERROR(INDEX(Tableau_de_suivi[[N°]:[Clôturé]],SMALL(IF(Tableau_de_suivi[Clôturé]=\"OUI\",ROW(Tableau_de_suivi[Clôturé])-2),ROWS($1:80)),COLUMN()),\"\")","v":""},{"$f":"IFERROR(INDEX(Tableau_de_suivi[[N°]:[Clôturé]],SMALL(IF(Tableau_de_suivi[Clôturé]=\"OUI\",ROW(Tableau_de_suivi[Clôturé])-2),ROWS($1:80)),COLUMN()),\"\")","v":""}]
[{"$f":"IFERROR(INDEX(Tableau_de_suivi[[N°]:[Clôturé]],SMALL(IF(Tableau_de_suivi[Clôturé]=\"OUI\",ROW(Tableau_de_suivi[Clôturé])-2),ROWS($1:81)),COLUMN()),\"\")","v":""},{"$f":"IFERROR(INDEX(Tableau_de_suivi[[N°]:[Clôturé]],SMALL(IF(Tableau_de_suivi[Clôturé]=\"OUI\",ROW(Tableau_de_suivi[Clôturé])-2),ROWS($1:81)),COLUMN()),\"\")","v":""},{"$f":"IFERROR(INDEX(Tableau_de_suivi[[N°]:[Clôturé]],SMALL(IF(Tableau_de_suivi[Clôturé]=\"OUI\",ROW(Tableau_de_suivi[Clôturé])-2),ROWS($1:81)),COLUMN()),\"\")","v":""},{"$f":"IFERROR(INDEX(Tableau_de_suivi[[N°]:[Clôturé]],SMALL(IF(Tableau_de_suivi[Clôturé]=\"OUI\",ROW(Tableau_de_suivi[Clôturé])-2),ROWS($1:81)),COLUMN()),\"\")","v":""},{"$f":"IFERROR(INDEX(Tableau_de_suivi[[N°]:[Clôturé]],SMALL(IF(Tableau_de_suivi[Clôturé]=\"OUI\",ROW(Tableau_de_suivi[Clôturé])-2),ROWS($1:81)),COLUMN()),\"\")","v":""},{"$f":"IFERROR(INDEX(Tableau_de_suivi[[N°]:[Clôturé]],SMALL(IF(Tableau_de_suivi[Clôturé]=\"OUI\",ROW(Tableau_de_suivi[Clôturé])-2),ROWS($1:81)),COLUMN()),\"\")","v":""},{"$f":"IFERROR(INDEX(Tableau_de_suivi[[N°]:[Clôturé]],SMALL(IF(Tableau_de_suivi[Clôturé]=\"OUI\",ROW(Tableau_de_suivi[Clôturé])-2),ROWS($1:81)),COLUMN()),\"\")","v":""},{"$f":"IFERROR(INDEX(Tableau_de_suivi[[N°]:[Clôturé]],SMALL(IF(Tableau_de_suivi[Clôturé]=\"OUI\",ROW(Tableau_de_suivi[Clôturé])-2),ROWS($1:81)),COLUMN()),\"\")","v":""},{"$f":"IFERROR(INDEX(Tableau_de_suivi[[N°]:[Clôturé]],SMALL(IF(Tableau_de_suivi[Clôturé]=\"OUI\",ROW(Tableau_de_suivi[Clôturé])-2),ROWS($1:81)),COLUMN()),\"\")","v":""},{"$f":"IFERROR(INDEX(Tableau_de_suivi[[N°]:[Clôturé]],SMALL(IF(Tableau_de_suivi[Clôturé]=\"OUI\",ROW(Tableau_de_suivi[Clôturé])-2),ROWS($1:81)),COLUMN()),\"\")","v":""},{"$f":"IFERROR(INDEX(Tableau_de_suivi[[N°]:[Clôturé]],SMALL(IF(Tableau_de_suivi[Clôturé]=\"OUI\",ROW(Tableau_de_suivi[Clôturé])-2),ROWS($1:81)),COLUMN()),\"\")","v":""},{"$f":"IFERROR(INDEX(Tableau_de_suivi[[N°]:[Clôturé]],SMALL(IF(Tableau_de_suivi[Clôturé]=\"OUI\",ROW(Tableau_de_suivi[Clôturé])-2),ROWS($1:81)),COLUMN()),\"\")","v":""},{"$f":"IFERROR(INDEX(Tableau_de_suivi[[N°]:[Clôturé]],SMALL(IF(Tableau_de_suivi[Clôturé]=\"OUI\",ROW(Tableau_de_suivi[Clôturé])-2),ROWS($1:81)),COLUMN()),\"\")","v":""},{"$f":"IFERROR(INDEX(Tableau_de_suivi[[N°]:[Clôturé]],SMALL(IF(Tableau_de_suivi[Clôturé]=\"OUI\",ROW(Tableau_de_suivi[Clôturé])-2),ROWS($1:81)),COLUMN()),\"\")","v":""},{"$f":"IFERROR(INDEX(Tableau_de_suivi[[N°]:[Clôturé]],SMALL(IF(Tableau_de_suivi[Clôturé]=\"OUI\",ROW(Tableau_de_suivi[Clôturé])-2),ROWS($1:81)),COLUMN()),\"\")","v":""},{"$f":"IFERROR(INDEX(Tableau_de_suivi[[N°]:[Clôturé]],SMALL(IF(Tableau_de_suivi[Clôturé]=\"OUI\",ROW(Tableau_de_suivi[Clôturé])-2),ROWS($1:81)),COLUMN()),\"\")","v":""},{"$f":"IFERROR(INDEX(Tableau_de_suivi[[N°]:[Clôturé]],SMALL(IF(Tableau_de_suivi[Clôturé]=\"OUI\",ROW(Tableau_de_suivi[Clôturé])-2),ROWS($1:81)),COLUMN()),\"\")","v":""},{"$f":"IFERROR(INDEX(Tableau_de_suivi[[N°]:[Clôturé]],SMALL(IF(Tableau_de_suivi[Clôturé]=\"OUI\",ROW(Tableau_de_suivi[Clôturé])-2),ROWS($1:81)),COLUMN()),\"\")","v":""},{"$f":"IFERROR(INDEX(Tableau_de_suivi[[N°]:[Clôturé]],SMALL(IF(Tableau_de_suivi[Clôturé]=\"OUI\",ROW(Tableau_de_suivi[Clôturé])-2),ROWS($1:81)),COLUMN()),\"\")","v":""},{"$f":"IFERROR(INDEX(Tableau_de_suivi[[N°]:[Clôturé]],SMALL(IF(Tableau_de_suivi[Clôturé]=\"OUI\",ROW(Tableau_de_suivi[Clôturé])-2),ROWS($1:81)),COLUMN()),\"\")","v":""},{"$f":"IFERROR(INDEX(Tableau_de_suivi[[N°]:[Clôturé]],SMALL(IF(Tableau_de_suivi[Clôturé]=\"OUI\",ROW(Tableau_de_suivi[Clôturé])-2),ROWS($1:81)),COLUMN()),\"\")","v":""},{"$f":"IFERROR(INDEX(Tableau_de_suivi[[N°]:[Clôturé]],SMALL(IF(Tableau_de_suivi[Clôturé]=\"OUI\",ROW(Tableau_de_suivi[Clôturé])-2),ROWS($1:81)),COLUMN()),\"\")","v":""}]
[{"$f":"IFERROR(INDEX(Tableau_de_suivi[[N°]:[Clôturé]],SMALL(IF(Tableau_de_suivi[Clôturé]=\"OUI\",ROW(Tableau_de_suivi[Clôturé])-2),ROWS($1:82)),COLUMN()),\"\")","v":""},{"$f":"IFERROR(INDEX(Tableau_de_suivi[[N°]:[Clôturé]],SMALL(IF(Tableau_de_suivi[Clôturé]=\"OUI\",ROW(Tableau_de_suivi[Clôturé])-2),ROWS($1:82)),COLUMN()),\"\")","v":""},{"$f":"IFERROR(INDEX(Tableau_de_suivi[[N°]:[Clôturé]],SMALL(IF(Tableau_de_suivi[Clôturé]=\"OUI\",ROW(Tableau_de_suivi[Clôturé])-2),ROWS($1:82)),COLUMN()),\"\")","v":""},{"$f":"IFERROR(INDEX(Tableau_de_suivi[[N°]:[Clôturé]],SMALL(IF(Tableau_de_suivi[Clôturé]=\"OUI\",ROW(Tableau_de_suivi[Clôturé])-2),ROWS($1:82)),COLUMN()),\"\")","v":""},{"$f":"IFERROR(INDEX(Tableau_de_suivi[[N°]:[Clôturé]],SMALL(IF(Tableau_de_suivi[Clôturé]=\"OUI\",ROW(Tableau_de_suivi[Clôturé])-2),ROWS($1:82)),COLUMN()),\"\")","v":""},{"$f":"IFERROR(INDEX(Tableau_de_suivi[[N°]:[Clôturé]],SMALL(IF(Tableau_de_suivi[Clôturé]=\"OUI\",ROW(Tableau_de_suivi[Clôturé])-2),ROWS($1:82)),COLUMN()),\"\")","v":""},{"$f":"IFERROR(INDEX(Tableau_de_suivi[[N°]:[Clôturé]],SMALL(IF(Tableau_de_suivi[Clôturé]=\"OUI\",ROW(Tableau_de_suivi[Clôturé])-2),ROWS($1:82)),COLUMN()),\"\")","v":""},{"$f":"IFERROR(INDEX(Tableau_de_suivi[[N°]:[Clôturé]],SMALL(IF(Tableau_de_suivi[Clôturé]=\"OUI\",ROW(Tableau_de_suivi[Clôturé])-2),ROWS($1:82)),COLUMN()),\"\")","v":""},{"$f":"IFERROR(INDEX(Tableau_de_suivi[[N°]:[Clôturé]],SMALL(IF(Tableau_de_suivi[Clôturé]=\"OUI\",ROW(Tableau_de_suivi[Clôturé])-2),ROWS($1:82)),COLUMN()),\"\")","v":""},{"$f":"IFERROR(INDEX(Tableau_de_suivi[[N°]:[Clôturé]],SMALL(IF(Tableau_de_suivi[Clôturé]=\"OUI\",ROW(Tableau_de_suivi[Clôturé])-2),ROWS($1:82)),COLUMN()),\"\")","v":""},{"$f":"IFERROR(INDEX(Tableau_de_suivi[[N°]:[Clôturé]],SMALL(IF(Tableau_de_suivi[Clôturé]=\"OUI\",ROW(Tableau_de_suivi[Clôturé])-2),ROWS($1:82)),COLUMN()),\"\")","v":""},{"$f":"IFERROR(INDEX(Tableau_de_suivi[[N°]:[Clôturé]],SMALL(IF(Tableau_de_suivi[Clôturé]=\"OUI\",ROW(Tableau_de_suivi[Clôturé])-2),ROWS($1:82)),COLUMN()),\"\")","v":""},{"$f":"IFERROR(INDEX(Tableau_de_suivi[[N°]:[Clôturé]],SMALL(IF(Tableau_de_suivi[Clôturé]=\"OUI\",ROW(Tableau_de_suivi[Clôturé])-2),ROWS($1:82)),COLUMN()),\"\")","v":""},{"$f":"IFERROR(INDEX(Tableau_de_suivi[[N°]:[Clôturé]],SMALL(IF(Tableau_de_suivi[Clôturé]=\"OUI\",ROW(Tableau_de_suivi[Clôturé])-2),ROWS($1:82)),COLUMN()),\"\")","v":""},{"$f":"IFERROR(INDEX(Tableau_de_suivi[[N°]:[Clôturé]],SMALL(IF(Tableau_de_suivi[Clôturé]=\"OUI\",ROW(Tableau_de_suivi[Clôturé])-2),ROWS($1:82)),COLUMN()),\"\")","v":""},{"$f":"IFERROR(INDEX(Tableau_de_suivi[[N°]:[Clôturé]],SMALL(IF(Tableau_de_suivi[Clôturé]=\"OUI\",ROW(Tableau_de_suivi[Clôturé])-2),ROWS($1:82)),COLUMN()),\"\")","v":""},{"$f":"IFERROR(INDEX(Tableau_de_suivi[[N°]:[Clôturé]],SMALL(IF(Tableau_de_suivi[Clôturé]=\"OUI\",ROW(Tableau_de_suivi[Clôturé])-2),ROWS($1:82)),COLUMN()),\"\")","v":""},{"$f":"IFERROR(INDEX(Tableau_de_suivi[[N°]:[Clôturé]],SMALL(IF(Tableau_de_suivi[Clôturé]=\"OUI\",ROW(Tableau_de_suivi[Clôturé])-2),ROWS($1:82)),COLUMN()),\"\")","v":""},{"$f":"IFERROR(INDEX(Tableau_de_suivi[[N°]:[Clôturé]],SMALL(IF(Tableau_de_suivi[Clôturé]=\"OUI\",ROW(Tableau_de_suivi[Clôturé])-2),ROWS($1:82)),COLUMN()),\"\")","v":""},{"$f":"IFERROR(INDEX(Tableau_de_suivi[[N°]:[Clôturé]],SMALL(IF(Tableau_de_suivi[Clôturé]=\"OUI\",ROW(Tableau_de_suivi[Clôturé])-2),ROWS($1:82)),COLUMN()),\"\")","v":""},{"$f":"IFERROR(INDEX(Tableau_de_suivi[[N°]:[Clôturé]],SMALL(IF(Tableau_de_suivi[Clôturé]=\"OUI\",ROW(Tableau_de_suivi[Clôturé])-2),ROWS($1:82)),COLUMN()),\"\")","v":""},{"$f":"IFERROR(INDEX(Tableau_de_suivi[[N°]:[Clôturé]],SMALL(IF(Tableau_de_suivi[Clôturé]=\"OUI\",ROW(Tableau_de_suivi[Clôturé])-2),ROWS($1:82)),COLUMN()),\"\")","v":""}]
[{"$f":"IFERROR(INDEX(Tableau_de_suivi[[N°]:[Clôturé]],SMALL(IF(Tableau_de_suivi[Clôturé]=\"OUI\",ROW(Tableau_de_suivi[Clôturé])-2),ROWS($1:83)),COLUMN()),\"\")","v":""},{"$f":"IFERROR(INDEX(Tableau_de_suivi[[N°]:[Clôturé]],SMALL(IF(Tableau_de_suivi[Clôturé]=\"OUI\",ROW(Tableau_de_suivi[Clôturé])-2),ROWS($1:83)),COLUMN()),\"\")","v":""},{"$f":"IFERROR(INDEX(Tableau_de_suivi[[N°]:[Clôturé]],SMALL(IF(Tableau_de_suivi[Clôturé]=\"OUI\",ROW(Tableau_de_suivi[Clôturé])-2),ROWS($1:83)),COLUMN()),\"\")","v":""},{"$f":"IFERROR(INDEX(Tableau_de_suivi[[N°]:[Clôturé]],SMALL(IF(Tableau_de_suivi[Clôturé]=\"OUI\",ROW(Tableau_de_suivi[Clôturé])-2),ROWS($1:83)),COLUMN()),\"\")","v":""},{"$f":"IFERROR(INDEX(Tableau_de_suivi[[N°]:[Clôturé]],SMALL(IF(Tableau_de_suivi[Clôturé]=\"OUI\",ROW(Tableau_de_suivi[Clôturé])-2),ROWS($1:83)),COLUMN()),\"\")","v":""},{"$f":"IFERROR(INDEX(Tableau_de_suivi[[N°]:[Clôturé]],SMALL(IF(Tableau_de_suivi[Clôturé]=\"OUI\",ROW(Tableau_de_suivi[Clôturé])-2),ROWS($1:83)),COLUMN()),\"\")","v":""},{"$f":"IFERROR(INDEX(Tableau_de_suivi[[N°]:[Clôturé]],SMALL(IF(Tableau_de_suivi[Clôturé]=\"OUI\",ROW(Tableau_de_suivi[Clôturé])-2),ROWS($1:83)),COLUMN()),\"\")","v":""},{"$f":"IFERROR(INDEX(Tableau_de_suivi[[N°]:[Clôturé]],SMALL(IF(Tableau_de_suivi[Clôturé]=\"OUI\",ROW(Tableau_de_suivi[Clôturé])-2),ROWS($1:83)),COLUMN()),\"\")","v":""},{"$f":"IFERROR(INDEX(Tableau_de_suivi[[N°]:[Clôturé]],SMALL(IF(Tableau_de_suivi[Clôturé]=\"OUI\",ROW(Tableau_de_suivi[Clôturé])-2),ROWS($1:83)),COLUMN()),\"\")","v":""},{"$f":"IFERROR(INDEX(Tableau_de_suivi[[N°]:[Clôturé]],SMALL(IF(Tableau_de_suivi[Clôturé]=\"OUI\",ROW(Tableau_de_suivi[Clôturé])-2),ROWS($1:83)),COLUMN()),\"\")","v":""},{"$f":"IFERROR(INDEX(Tableau_de_suivi[[N°]:[Clôturé]],SMALL(IF(Tableau_de_suivi[Clôturé]=\"OUI\",ROW(Tableau_de_suivi[Clôturé])-2),ROWS($1:83)),COLUMN()),\"\")","v":""},{"$f":"IFERROR(INDEX(Tableau_de_suivi[[N°]:[Clôturé]],SMALL(IF(Tableau_de_suivi[Clôturé]=\"OUI\",ROW(Tableau_de_suivi[Clôturé])-2),ROWS($1:83)),COLUMN()),\"\")","v":""},{"$f":"IFERROR(INDEX(Tableau_de_suivi[[N°]:[Clôturé]],SMALL(IF(Tableau_de_suivi[Clôturé]=\"OUI\",ROW(Tableau_de_suivi[Clôturé])-2),ROWS($1:83)),COLUMN()),\"\")","v":""},{"$f":"IFERROR(INDEX(Tableau_de_suivi[[N°]:[Clôturé]],SMALL(IF(Tableau_de_suivi[Clôturé]=\"OUI\",ROW(Tableau_de_suivi[Clôturé])-2),ROWS($1:83)),COLUMN()),\"\")","v":""},{"$f":"IFERROR(INDEX(Tableau_de_suivi[[N°]:[Clôturé]],SMALL(IF(Tableau_de_suivi[Clôturé]=\"OUI\",ROW(Tableau_de_suivi[Clôturé])-2),ROWS($1:83)),COLUMN()),\"\")","v":""},{"$f":"IFERROR(INDEX(Tableau_de_suivi[[N°]:[Clôturé]],SMALL(IF(Tableau_de_suivi[Clôturé]=\"OUI\",ROW(Tableau_de_suivi[Clôturé])-2),ROWS($1:83)),COLUMN()),\"\")","v":""},{"$f":"IFERROR(INDEX(Tableau_de_suivi[[N°]:[Clôturé]],SMALL(IF(Tableau_de_suivi[Clôturé]=\"OUI\",ROW(Tableau_de_suivi[Clôturé])-2),ROWS($1:83)),COLUMN()),\"\")","v":""},{"$f":"IFERROR(INDEX(Tableau_de_suivi[[N°]:[Clôturé]],SMALL(IF(Tableau_de_suivi[Clôturé]=\"OUI\",ROW(Tableau_de_suivi[Clôturé])-2),ROWS($1:83)),COLUMN()),\"\")","v":""},{"$f":"IFERROR(INDEX(Tableau_de_suivi[[N°]:[Clôturé]],SMALL(IF(Tableau_de_suivi[Clôturé]=\"OUI\",ROW(Tableau_de_suivi[Clôturé])-2),ROWS($1:83)),COLUMN()),\"\")","v":""},{"$f":"IFERROR(INDEX(Tableau_de_suivi[[N°]:[Clôturé]],SMALL(IF(Tableau_de_suivi[Clôturé]=\"OUI\",ROW(Tableau_de_suivi[Clôturé])-2),ROWS($1:83)),COLUMN()),\"\")","v":""},{"$f":"IFERROR(INDEX(Tableau_de_suivi[[N°]:[Clôturé]],SMALL(IF(Tableau_de_suivi[Clôturé]=\"OUI\",ROW(Tableau_de_suivi[Clôturé])-2),ROWS($1:83)),COLUMN()),\"\")","v":""},{"$f":"IFERROR(INDEX(Tableau_de_suivi[[N°]:[Clôturé]],SMALL(IF(Tableau_de_suivi[Clôturé]=\"OUI\",ROW(Tableau_de_suivi[Clôturé])-2),ROWS($1:83)),COLUMN()),\"\")","v":""}]
[{"$f":"IFERROR(INDEX(Tableau_de_suivi[[N°]:[Clôturé]],SMALL(IF(Tableau_de_suivi[Clôturé]=\"OUI\",ROW(Tableau_de_suivi[Clôturé])-2),ROWS($1:84)),COLUMN()),\"\")","v":""},{"$f":"IFERROR(INDEX(Tableau_de_suivi[[N°]:[Clôturé]],SMALL(IF(Tableau_de_suivi[Clôturé]=\"OUI\",ROW(Tableau_de_suivi[Clôturé])-2),ROWS($1:84)),COLUMN()),\"\")","v":""},{"$f":"IFERROR(INDEX(Tableau_de_suivi[[N°]:[Clôturé]],SMALL(IF(Tableau_de_suivi[Clôturé]=\"OUI\",ROW(Tableau_de_suivi[Clôturé])-2),ROWS($1:84)),COLUMN()),\"\")","v":""},{"$f":"IFERROR(INDEX(Tableau_de_suivi[[N°]:[Clôturé]],SMALL(IF(Tableau_de_suivi[Clôturé]=\"OUI\",ROW(Tableau_de_suivi[Clôturé])-2),ROWS($1:84)),COLUMN()),\"\")","v":""},{"$f":"IFERROR(INDEX(Tableau_de_suivi[[N°]:[Clôturé]],SMALL(IF(Tableau_de_suivi[Clôturé]=\"OUI\",ROW(Tableau_de_suivi[Clôturé])-2),ROWS($1:84)),COLUMN()),\"\")","v":""},{"$f":"IFERROR(INDEX(Tableau_de_suivi[[N°]:[Clôturé]],SMALL(IF(Tableau_de_suivi[Clôturé]=\"OUI\",ROW(Tableau_de_suivi[Clôturé])-2),ROWS($1:84)),COLUMN()),\"\")","v":""},{"$f":"IFERROR(INDEX(Tableau_de_suivi[[N°]:[Clôturé]],SMALL(IF(Tableau_de_suivi[Clôturé]=\"OUI\",ROW(Tableau_de_suivi[Clôturé])-2),ROWS($1:84)),COLUMN()),\"\")","v":""},{"$f":"IFERROR(INDEX(Tableau_de_suivi[[N°]:[Clôturé]],SMALL(IF(Tableau_de_suivi[Clôturé]=\"OUI\",ROW(Tableau_de_suivi[Clôturé])-2),ROWS($1:84)),COLUMN()),\"\")","v":""},{"$f":"IFERROR(INDEX(Tableau_de_suivi[[N°]:[Clôturé]],SMALL(IF(Tableau_de_suivi[Clôturé]=\"OUI\",ROW(Tableau_de_suivi[Clôturé])-2),ROWS($1:84)),COLUMN()),\"\")","v":""},{"$f":"IFERROR(INDEX(Tableau_de_suivi[[N°]:[Clôturé]],SMALL(IF(Tableau_de_suivi[Clôturé]=\"OUI\",ROW(Tableau_de_suivi[Clôturé])-2),ROWS($1:84)),COLUMN()),\"\")","v":""},{"$f":"IFERROR(INDEX(Tableau_de_suivi[[N°]:[Clôturé]],SMALL(IF(Tableau_de_suivi[Clôturé]=\"OUI\",ROW(Tableau_de_suivi[Clôturé])-2),ROWS($1:84)),COLUMN()),\"\")","v":""},{"$f":"IFERROR(INDEX(Tableau_de_suivi[[N°]:[Clôturé]],SMALL(IF(Tableau_de_suivi[Clôturé]=\"OUI\",ROW(Tableau_de_suivi[Clôturé])-2),ROWS($1:84)),COLUMN()),\"\")","v":""},{"$f":"IFERROR(INDEX(Tableau_de_suivi[[N°]:[Clôturé]],SMALL(IF(Tableau_de_suivi[Clôturé]=\"OUI\",ROW(Tableau_de_suivi[Clôturé])-2),ROWS($1:84)),COLUMN()),\"\")","v":""},{"$f":"IFERROR(INDEX(Tableau_de_suivi[[N°]:[Clôturé]],SMALL(IF(Tableau_de_suivi[Clôturé]=\"OUI\",ROW(Tableau_de_suivi[Clôturé])-2),ROWS($1:84)),COLUMN()),\"\")","v":""},{"$f":"IFERROR(INDEX(Tableau_de_suivi[[N°]:[Clôturé]],SMALL(IF(Tableau_de_suivi[Clôturé]=\"OUI\",ROW(Tableau_de_suivi[Clôturé])-2),ROWS($1:84)),COLUMN()),\"\")","v":""},{"$f":"IFERROR(INDEX(Tableau_de_suivi[[N°]:[Clôturé]],SMALL(IF(Tableau_de_suivi[Clôturé]=\"OUI\",ROW(Tableau_de_suivi[Clôturé])-2),ROWS($1:84)),COLUMN()),\"\")","v":""},{"$f":"IFERROR(INDEX(Tableau_de_suivi[[N°]:[Clôturé]],SMALL(IF(Tableau_de_suivi[Clôturé]=\"OUI\",ROW(Tableau_de_suivi[Clôturé])-2),ROWS($1:84)),COLUMN()),\"\")","v":""},{"$f":"IFERROR(INDEX(Tableau_de_suivi[[N°]:[Clôturé]],SMALL(IF(Tableau_de_suivi[Clôturé]=\"OUI\",ROW(Tableau_de_suivi[Clôturé])-2),ROWS($1:84)),COLUMN()),\"\")","v":""},{"$f":"IFERROR(INDEX(Tableau_de_suivi[[N°]:[Clôturé]],SMALL(IF(Tableau_de_suivi[Clôturé]=\"OUI\",ROW(Tableau_de_suivi[Clôturé])-2),ROWS($1:84)),COLUMN()),\"\")","v":""},{"$f":"IFERROR(INDEX(Tableau_de_suivi[[N°]:[Clôturé]],SMALL(IF(Tableau_de_suivi[Clôturé]=\"OUI\",ROW(Tableau_de_suivi[Clôturé])-2),ROWS($1:84)),COLUMN()),\"\")","v":""},{"$f":"IFERROR(INDEX(Tableau_de_suivi[[N°]:[Clôturé]],SMALL(IF(Tableau_de_suivi[Clôturé]=\"OUI\",ROW(Tableau_de_suivi[Clôturé])-2),ROWS($1:84)),COLUMN()),\"\")","v":""},{"$f":"IFERROR(INDEX(Tableau_de_suivi[[N°]:[Clôturé]],SMALL(IF(Tableau_de_suivi[Clôturé]=\"OUI\",ROW(Tableau_de_suivi[Clôturé])-2),ROWS($1:84)),COLUMN()),\"\")","v":""}]
[{"$f":"IFERROR(INDEX(Tableau_de_suivi[[N°]:[Clôturé]],SMALL(IF(Tableau_de_suivi[Clôturé]=\"OUI\",ROW(Tableau_de_suivi[Clôturé])-2),ROWS($1:85)),COLUMN()),\"\")","v":""},{"$f":"IFERROR(INDEX(Tableau_de_suivi[[N°]:[Clôturé]],SMALL(IF(Tableau_de_suivi[Clôturé]=\"OUI\",ROW(Tableau_de_suivi[Clôturé])-2),ROWS($1:85)),COLUMN()),\"\")","v":""},{"$f":"IFERROR(INDEX(Tableau_de_suivi[[N°]:[Clôturé]],SMALL(IF(Tableau_de_suivi[Clôturé]=\"OUI\",ROW(Tableau_de_suivi[Clôturé])-2),ROWS($1:85)),COLUMN()),\"\")","v":""},{"$f":"IFERROR(INDEX(Tableau_de_suivi[[N°]:[Clôturé]],SMALL(IF(Tableau_de_suivi[Clôturé]=\"OUI\",ROW(Tableau_de_suivi[Clôturé])-2),ROWS($1:85)),COLUMN()),\"\")","v":""},{"$f":"IFERROR(INDEX(Tableau_de_suivi[[N°]:[Clôturé]],SMALL(IF(Tableau_de_suivi[Clôturé]=\"OUI\",ROW(Tableau_de_suivi[Clôturé])-2),ROWS($1:85)),COLUMN()),\"\")","v":""},{"$f":"IFERROR(INDEX(Tableau_de_suivi[[N°]:[Clôturé]],SMALL(IF(Tableau_de_suivi[Clôturé]=\"OUI\",ROW(Tableau_de_suivi[Clôturé])-2),ROWS($1:85)),COLUMN()),\"\")","v":""},{"$f":"IFERROR(INDEX(Tableau_de_suivi[[N°]:[Clôturé]],SMALL(IF(Tableau_de_suivi[Clôturé]=\"OUI\",ROW(Tableau_de_suivi[Clôturé])-2),ROWS($1:85)),COLUMN()),\"\")","v":""},{"$f":"IFERROR(INDEX(Tableau_de_suivi[[N°]:[Clôturé]],SMALL(IF(Tableau_de_suivi[Clôturé]=\"OUI\",ROW(Tableau_de_suivi[Clôturé])-2),ROWS($1:85)),COLUMN()),\"\")","v":""},{"$f":"IFERROR(INDEX(Tableau_de_suivi[[N°]:[Clôturé]],SMALL(IF(Tableau_de_suivi[Clôturé]=\"OUI\",ROW(Tableau_de_suivi[Clôturé])-2),ROWS($1:85)),COLUMN()),\"\")","v":""},{"$f":"IFERROR(INDEX(Tableau_de_suivi[[N°]:[Clôturé]],SMALL(IF(Tableau_de_suivi[Clôturé]=\"OUI\",ROW(Tableau_de_suivi[Clôturé])-2),ROWS($1:85)),COLUMN()),\"\")","v":""},{"$f":"IFERROR(INDEX(Tableau_de_suivi[[N°]:[Clôturé]],SMALL(IF(Tableau_de_suivi[Clôturé]=\"OUI\",ROW(Tableau_de_suivi[Clôturé])-2),ROWS($1:85)),COLUMN()),\"\")","v":""},{"$f":"IFERROR(INDEX(Tableau_de_suivi[[N°]:[Clôturé]],SMALL(IF(Tableau_de_suivi[Clôturé]=\"OUI\",ROW(Tableau_de_suivi[Clôturé])-2),ROWS($1:85)),COLUMN()),\"\")","v":""},{"$f":"IFERROR(INDEX(Tableau_de_suivi[[N°]:[Clôturé]],SMALL(IF(Tableau_de_suivi[Clôturé]=\"OUI\",ROW(Tableau_de_suivi[Clôturé])-2),ROWS($1:85)),COLUMN()),\"\")","v":""},{"$f":"IFERROR(INDEX(Tableau_de_suivi[[N°]:[Clôturé]],SMALL(IF(Tableau_de_suivi[Clôturé]=\"OUI\",ROW(Tableau_de_suivi[Clôturé])-2),ROWS($1:85)),COLUMN()),\"\")","v":""},{"$f":"IFERROR(INDEX(Tableau_de_suivi[[N°]:[Clôturé]],SMALL(IF(Tableau_de_suivi[Clôturé]=\"OUI\",ROW(Tableau_de_suivi[Clôturé])-2),ROWS($1:85)),COLUMN()),\"\")","v":""},{"$f":"IFERROR(INDEX(Tableau_de_suivi[[N°]:[Clôturé]],SMALL(IF(Tableau_de_suivi[Clôturé]=\"OUI\",ROW(Tableau_de_suivi[Clôturé])-2),ROWS($1:85)),COLUMN()),\"\")","v":""},{"$f":"IFERROR(INDEX(Tableau_de_suivi[[N°]:[Clôturé]],SMALL(IF(Tableau_de_suivi[Clôturé]=\"OUI\",ROW(Tableau_de_suivi[Clôturé])-2),ROWS($1:85)),COLUMN()),\"\")","v":""},{"$f":"IFERROR(INDEX(Tableau_de_suivi[[N°]:[Clôturé]],SMALL(IF(Tableau_de_suivi[Clôturé]=\"OUI\",ROW(Tableau_de_suivi[Clôturé])-2),ROWS($1:85)),COLUMN()),\"\")","v":""},{"$f":"IFERROR(INDEX(Tableau_de_suivi[[N°]:[Clôturé]],SMALL(IF(Tableau_de_suivi[Clôturé]=\"OUI\",ROW(Tableau_de_suivi[Clôturé])-2),ROWS($1:85)),COLUMN()),\"\")","v":""},{"$f":"IFERROR(INDEX(Tableau_de_suivi[[N°]:[Clôturé]],SMALL(IF(Tableau_de_suivi[Clôturé]=\"OUI\",ROW(Tableau_de_suivi[Clôturé])-2),ROWS($1:85)),COLUMN()),\"\")","v":""},{"$f":"IFERROR(INDEX(Tableau_de_suivi[[N°]:[Clôturé]],SMALL(IF(Tableau_de_suivi[Clôturé]=\"OUI\",ROW(Tableau_de_suivi[Clôturé])-2),ROWS($1:85)),COLUMN()),\"\")","v":""},{"$f":"IFERROR(INDEX(Tableau_de_suivi[[N°]:[Clôturé]],SMALL(IF(Tableau_de_suivi[Clôturé]=\"OUI\",ROW(Tableau_de_suivi[Clôturé])-2),ROWS($1:85)),COLUMN()),\"\")","v":""}]
[{"$f":"IFERROR(INDEX(Tableau_de_suivi[[N°]:[Clôturé]],SMALL(IF(Tableau_de_suivi[Clôturé]=\"OUI\",ROW(Tableau_de_suivi[Clôturé])-2),ROWS($1:86)),COLUMN()),\"\")","v":""},{"$f":"IFERROR(INDEX(Tableau_de_suivi[[N°]:[Clôturé]],SMALL(IF(Tableau_de_suivi[Clôturé]=\"OUI\",ROW(Tableau_de_suivi[Clôturé])-2),ROWS($1:86)),COLUMN()),\"\")","v":""},{"$f":"IFERROR(INDEX(Tableau_de_suivi[[N°]:[Clôturé]],SMALL(IF(Tableau_de_suivi[Clôturé]=\"OUI\",ROW(Tableau_de_suivi[Clôturé])-2),ROWS($1:86)),COLUMN()),\"\")","v":""},{"$f":"IFERROR(INDEX(Tableau_de_suivi[[N°]:[Clôturé]],SMALL(IF(Tableau_de_suivi[Clôturé]=\"OUI\",ROW(Tableau_de_suivi[Clôturé])-2),ROWS($1:86)),COLUMN()),\"\")","v":""},{"$f":"IFERROR(INDEX(Tableau_de_suivi[[N°]:[Clôturé]],SMALL(IF(Tableau_de_suivi[Clôturé]=\"OUI\",ROW(Tableau_de_suivi[Clôturé])-2),ROWS($1:86)),COLUMN()),\"\")","v":""},{"$f":"IFERROR(INDEX(Tableau_de_suivi[[N°]:[Clôturé]],SMALL(IF(Tableau_de_suivi[Clôturé]=\"OUI\",ROW(Tableau_de_suivi[Clôturé])-2),ROWS($1:86)),COLUMN()),\"\")","v":""},{"$f":"IFERROR(INDEX(Tableau_de_suivi[[N°]:[Clôturé]],SMALL(IF(Tableau_de_suivi[Clôturé]=\"OUI\",ROW(Tableau_de_suivi[Clôturé])-2),ROWS($1:86)),COLUMN()),\"\")","v":""},{"$f":"IFERROR(INDEX(Tableau_de_suivi[[N°]:[Clôturé]],SMALL(IF(Tableau_de_suivi[Clôturé]=\"OUI\",ROW(Tableau_de_suivi[Clôturé])-2),ROWS($1:86)),COLUMN()),\"\")","v":""},{"$f":"IFERROR(INDEX(Tableau_de_suivi[[N°]:[Clôturé]],SMALL(IF(Tableau_de_suivi[Clôturé]=\"OUI\",ROW(Tableau_de_suivi[Clôturé])-2),ROWS($1:86)),COLUMN()),\"\")","v":""},{"$f":"IFERROR(INDEX(Tableau_de_suivi[[N°]:[Clôturé]],SMALL(IF(Tableau_de_suivi[Clôturé]=\"OUI\",ROW(Tableau_de_suivi[Clôturé])-2),ROWS($1:86)),COLUMN()),\"\")","v":""},{"$f":"IFERROR(INDEX(Tableau_de_suivi[[N°]:[Clôturé]],SMALL(IF(Tableau_de_suivi[Clôturé]=\"OUI\",ROW(Tableau_de_suivi[Clôturé])-2),ROWS($1:86)),COLUMN()),\"\")","v":""},{"$f":"IFERROR(INDEX(Tableau_de_suivi[[N°]:[Clôturé]],SMALL(IF(Tableau_de_suivi[Clôturé]=\"OUI\",ROW(Tableau_de_suivi[Clôturé])-2),ROWS($1:86)),COLUMN()),\"\")","v":""},{"$f":"IFERROR(INDEX(Tableau_de_suivi[[N°]:[Clôturé]],SMALL(IF(Tableau_de_suivi[Clôturé]=\"OUI\",ROW(Tableau_de_suivi[Clôturé])-2),ROWS($1:86)),COLUMN()),\"\")","v":""},{"$f":"IFERROR(INDEX(Tableau_de_suivi[[N°]:[Clôturé]],SMALL(IF(Tableau_de_suivi[Clôturé]=\"OUI\",ROW(Tableau_de_suivi[Clôturé])-2),ROWS($1:86)),COLUMN()),\"\")","v":""},{"$f":"IFERROR(INDEX(Tableau_de_suivi[[N°]:[Clôturé]],SMALL(IF(Tableau_de_suivi[Clôturé]=\"OUI\",ROW(Tableau_de_suivi[Clôturé])-2),ROWS($1:86)),COLUMN()),\"\")","v":""},{"$f":"IFERROR(INDEX(Tableau_de_suivi[[N°]:[Clôturé]],SMALL(IF(Tableau_de_suivi[Clôturé]=\"OUI\",ROW(Tableau_de_suivi[Clôturé])-2),ROWS($1:86)),COLUMN()),\"\")","v":""},{"$f":"IFERROR(INDEX(Tableau_de_suivi[[N°]:[Clôturé]],SMALL(IF(Tableau_de_suivi[Clôturé]=\"OUI\",ROW(Tableau_de_suivi[Clôturé])-2),ROWS($1:86)),COLUMN()),\"\")","v":""},{"$f":"IFERROR(INDEX(Tableau_de_suivi[[N°]:[Clôturé]],SMALL(IF(Tableau_de_suivi[Clôturé]=\"OUI\",ROW(Tableau_de_suivi[Clôturé])-2),ROWS($1:86)),COLUMN()),\"\")","v":""},{"$f":"IFERROR(INDEX(Tableau_de_suivi[[N°]:[Clôturé]],SMALL(IF(Tableau_de_suivi[Clôturé]=\"OUI\",ROW(Tableau_de_suivi[Clôturé])-2),ROWS($1:86)),COLUMN()),\"\")","v":""},{"$f":"IFERROR(INDEX(Tableau_de_suivi[[N°]:[Clôturé]],SMALL(IF(Tableau_de_suivi[Clôturé]=\"OUI\",ROW(Tableau_de_suivi[Clôturé])-2),ROWS($1:86)),COLUMN()),\"\")","v":""},{"$f":"IFERROR(INDEX(Tableau_de_suivi[[N°]:[Clôturé]],SMALL(IF(Tableau_de_suivi[Clôturé]=\"OUI\",ROW(Tableau_de_suivi[Clôturé])-2),ROWS($1:86)),COLUMN()),\"\")","v":""},{"$f":"IFERROR(INDEX(Tableau_de_suivi[[N°]:[Clôturé]],SMALL(IF(Tableau_de_suivi[Clôturé]=\"OUI\",ROW(Tableau_de_suivi[Clôturé])-2),ROWS($1:86)),COLUMN()),\"\")","v":""}]
[{"$f":"IFERROR(INDEX(Tableau_de_suivi[[N°]:[Clôturé]],SMALL(IF(Tableau_de_suivi[Clôturé]=\"OUI\",ROW(Tableau_de_suivi[Clôturé])-2),ROWS($1:87)),COLUMN()),\"\")","v":""},{"$f":"IFERROR(INDEX(Tableau_de_suivi[[N°]:[Clôturé]],SMALL(IF(Tableau_de_suivi[Clôturé]=\"OUI\",ROW(Tableau_de_suivi[Clôturé])-2),ROWS($1:87)),COLUMN()),\"\")","v":""},{"$f":"IFERROR(INDEX(Tableau_de_suivi[[N°]:[Clôturé]],SMALL(IF(Tableau_de_suivi[Clôturé]=\"OUI\",ROW(Tableau_de_suivi[Clôturé])-2),ROWS($1:87)),COLUMN()),\"\")","v":""},{"$f":"IFERROR(INDEX(Tableau_de_suivi[[N°]:[Clôturé]],SMALL(IF(Tableau_de_suivi[Clôturé]=\"OUI\",ROW(Tableau_de_suivi[Clôturé])-2),ROWS($1:87)),COLUMN()),\"\")","v":""},{"$f":"IFERROR(INDEX(Tableau_de_suivi[[N°]:[Clôturé]],SMALL(IF(Tableau_de_suivi[Clôturé]=\"OUI\",ROW(Tableau_de_suivi[Clôturé])-2),ROWS($1:87)),COLUMN()),\"\")","v":""},{"$f":"IFERROR(INDEX(Tableau_de_suivi[[N°]:[Clôturé]],SMALL(IF(Tableau_de_suivi[Clôturé]=\"OUI\",ROW(Tableau_de_suivi[Clôturé])-2),ROWS($1:87)),COLUMN()),\"\")","v":""},{"$f":"IFERROR(INDEX(Tableau_de_suivi[[N°]:[Clôturé]],SMALL(IF(Tableau_de_suivi[Clôturé]=\"OUI\",ROW(Tableau_de_suivi[Clôturé])-2),ROWS($1:87)),COLUMN()),\"\")","v":""},{"$f":"IFERROR(INDEX(Tableau_de_suivi[[N°]:[Clôturé]],SMALL(IF(Tableau_de_suivi[Clôturé]=\"OUI\",ROW(Tableau_de_suivi[Clôturé])-2),ROWS($1:87)),COLUMN()),\"\")","v":""},{"$f":"IFERROR(INDEX(Tableau_de_suivi[[N°]:[Clôturé]],SMALL(IF(Tableau_de_suivi[Clôturé]=\"OUI\",ROW(Tableau_de_suivi[Clôturé])-2),ROWS($1:87)),COLUMN()),\"\")","v":""},{"$f":"IFERROR(INDEX(Tableau_de_suivi[[N°]:[Clôturé]],SMALL(IF(Tableau_de_suivi[Clôturé]=\"OUI\",ROW(Tableau_de_suivi[Clôturé])-2),ROWS($1:87)),COLUMN()),\"\")","v":""},{"$f":"IFERROR(INDEX(Tableau_de_suivi[[N°]:[Clôturé]],SMALL(IF(Tableau_de_suivi[Clôturé]=\"OUI\",ROW(Tableau_de_suivi[Clôturé])-2),ROWS($1:87)),COLUMN()),\"\")","v":""},{"$f":"IFERROR(INDEX(Tableau_de_suivi[[N°]:[Clôturé]],SMALL(IF(Tableau_de_suivi[Clôturé]=\"OUI\",ROW(Tableau_de_suivi[Clôturé])-2),ROWS($1:87)),COLUMN()),\"\")","v":""},{"$f":"IFERROR(INDEX(Tableau_de_suivi[[N°]:[Clôturé]],SMALL(IF(Tableau_de_suivi[Clôturé]=\"OUI\",ROW(Tableau_de_suivi[Clôturé])-2),ROWS($1:87)),COLUMN()),\"\")","v":""},{"$f":"IFERROR(INDEX(Tableau_de_suivi[[N°]:[Clôturé]],SMALL(IF(Tableau_de_suivi[Clôturé]=\"OUI\",ROW(Tableau_de_suivi[Clôturé])-2),ROWS($1:87)),COLUMN()),\"\")","v":""},{"$f":"IFERROR(INDEX(Tableau_de_suivi[[N°]:[Clôturé]],SMALL(IF(Tableau_de_suivi[Clôturé]=\"OUI\",ROW(Tableau_de_suivi[Clôturé])-2),ROWS($1:87)),COLUMN()),\"\")","v":""},{"$f":"IFERROR(INDEX(Tableau_de_suivi[[N°]:[Clôturé]],SMALL(IF(Tableau_de_suivi[Clôturé]=\"OUI\",ROW(Tableau_de_suivi[Clôturé])-2),ROWS($1:87)),COLUMN()),\"\")","v":""},{"$f":"IFERROR(INDEX(Tableau_de_suivi[[N°]:[Clôturé]],SMALL(IF(Tableau_de_suivi[Clôturé]=\"OUI\",ROW(Tableau_de_suivi[Clôturé])-2),ROWS($1:87)),COLUMN()),\"\")","v":""},{"$f":"IFERROR(INDEX(Tableau_de_suivi[[N°]:[Clôturé]],SMALL(IF(Tableau_de_suivi[Clôturé]=\"OUI\",ROW(Tableau_de_suivi[Clôturé])-2),ROWS($1:87)),COLUMN()),\"\")","v":""},{"$f":"IFERROR(INDEX(Tableau_de_suivi[[N°]:[Clôturé]],SMALL(IF(Tableau_de_suivi[Clôturé]=\"OUI\",ROW(Tableau_de_suivi[Clôturé])-2),ROWS($1:87)),COLUMN()),\"\")","v":""},{"$f":"IFERROR(INDEX(Tableau_de_suivi[[N°]:[Clôturé]],SMALL(IF(Tableau_de_suivi[Clôturé]=\"OUI\",ROW(Tableau_de_suivi[Clôturé])-2),ROWS($1:87)),COLUMN()),\"\")","v":""},{"$f":"IFERROR(INDEX(Tableau_de_suivi[[N°]:[Clôturé]],SMALL(IF(Tableau_de_suivi[Clôturé]=\"OUI\",ROW(Tableau_de_suivi[Clôturé])-2),ROWS($1:87)),COLUMN()),\"\")","v":""},{"$f":"IFERROR(INDEX(Tableau_de_suivi[[N°]:[Clôturé]],SMALL(IF(Tableau_de_suivi[Clôturé]=\"OUI\",ROW(Tableau_de_suivi[Clôturé])-2),ROWS($1:87)),COLUMN()),\"\")","v":""}]
[{"$f":"IFERROR(INDEX(Tableau_de_suivi[[N°]:[Clôturé]],SMALL(IF(Tableau_de_suivi[Clôturé]=\"OUI\",ROW(Tableau_de_suivi[Clôturé])-2),ROWS($1:88)),COLUMN()),\"\")","v":""},{"$f":"IFERROR(INDEX(Tableau_de_suivi[[N°]:[Clôturé]],SMALL(IF(Tableau_de_suivi[Clôturé]=\"OUI\",ROW(Tableau_de_suivi[Clôturé])-2),ROWS($1:88)),COLUMN()),\"\")","v":""},{"$f":"IFERROR(INDEX(Tableau_de_suivi[[N°]:[Clôturé]],SMALL(IF(Tableau_de_suivi[Clôturé]=\"OUI\",ROW(Tableau_de_suivi[Clôturé])-2),ROWS($1:88)),COLUMN()),\"\")","v":""},{"$f":"IFERROR(INDEX(Tableau_de_suivi[[N°]:[Clôturé]],SMALL(IF(Tableau_de_suivi[Clôturé]=\"OUI\",ROW(Tableau_de_suivi[Clôturé])-2),ROWS($1:88)),COLUMN()),\"\")","v":""},{"$f":"IFERROR(INDEX(Tableau_de_suivi[[N°]:[Clôturé]],SMALL(IF(Tableau_de_suivi[Clôturé]=\"OUI\",ROW(Tableau_de_suivi[Clôturé])-2),ROWS($1:88)),COLUMN()),\"\")","v":""},{"$f":"IFERROR(INDEX(Tableau_de_suivi[[N°]:[Clôturé]],SMALL(IF(Tableau_de_suivi[Clôturé]=\"OUI\",ROW(Tableau_de_suivi[Clôturé])-2),ROWS($1:88)),COLUMN()),\"\")","v":""},{"$f":"IFERROR(INDEX(Tableau_de_suivi[[N°]:[Clôturé]],SMALL(IF(Tableau_de_suivi[Clôturé]=\"OUI\",ROW(Tableau_de_suivi[Clôturé])-2),ROWS($1:88)),COLUMN()),\"\")","v":""},{"$f":"IFERROR(INDEX(Tableau_de_suivi[[N°]:[Clôturé]],SMALL(IF(Tableau_de_suivi[Clôturé]=\"OUI\",ROW(Tableau_de_suivi[Clôturé])-2),ROWS($1:88)),COLUMN()),\"\")","v":""},{"$f":"IFERROR(INDEX(Tableau_de_suivi[[N°]:[Clôturé]],SMALL(IF(Tableau_de_suivi[Clôturé]=\"OUI\",ROW(Tableau_de_suivi[Clôturé])-2),ROWS($1:88)),COLUMN()),\"\")","v":""},{"$f":"IFERROR(INDEX(Tableau_de_suivi[[N°]:[Clôturé]],SMALL(IF(Tableau_de_suivi[Clôturé]=\"OUI\",ROW(Tableau_de_suivi[Clôturé])-2),ROWS($1:88)),COLUMN()),\"\")","v":""},{"$f":"IFERROR(INDEX(Tableau_de_suivi[[N°]:[Clôturé]],SMALL(IF(Tableau_de_suivi[Clôturé]=\"OUI\",ROW(Tableau_de_suivi[Clôturé])-2),ROWS($1:88)),COLUMN()),\"\")","v":""},{"$f":"IFERROR(INDEX(Tableau_de_suivi[[N°]:[Clôturé]],SMALL(IF(Tableau_de_suivi[Clôturé]=\"OUI\",ROW(Tableau_de_suivi[Clôturé])-2),ROWS($1:88)),COLUMN()),\"\")","v":""},{"$f":"IFERROR(INDEX(Tableau_de_suivi[[N°]:[Clôturé]],SMALL(IF(Tableau_de_suivi[Clôturé]=\"OUI\",ROW(Tableau_de_suivi[Clôturé])-2),ROWS($1:88)),COLUMN()),\"\")","v":""},{"$f":"IFERROR(INDEX(Tableau_de_suivi[[N°]:[Clôturé]],SMALL(IF(Tableau_de_suivi[Clôturé]=\"OUI\",ROW(Tableau_de_suivi[Clôturé])-2),ROWS($1:88)),COLUMN()),\"\")","v":""},{"$f":"IFERROR(INDEX(Tableau_de_suivi[[N°]:[Clôturé]],SMALL(IF(Tableau_de_suivi[Clôturé]=\"OUI\",ROW(Tableau_de_suivi[Clôturé])-2),ROWS($1:88)),COLUMN()),\"\")","v":""},{"$f":"IFERROR(INDEX(Tableau_de_suivi[[N°]:[Clôturé]],SMALL(IF(Tableau_de_suivi[Clôturé]=\"OUI\",ROW(Tableau_de_suivi[Clôturé])-2),ROWS($1:88)),COLUMN()),\"\")","v":""},{"$f":"IFERROR(INDEX(Tableau_de_suivi[[N°]:[Clôturé]],SMALL(IF(Tableau_de_suivi[Clôturé]=\"OUI\",ROW(Tableau_de_suivi[Clôturé])-2),ROWS($1:88)),COLUMN()),\"\")","v":""},{"$f":"IFERROR(INDEX(Tableau_de_suivi[[N°]:[Clôturé]],SMALL(IF(Tableau_de_suivi[Clôturé]=\"OUI\",ROW(Tableau_de_suivi[Clôturé])-2),ROWS($1:88)),COLUMN()),\"\")","v":""},{"$f":"IFERROR(INDEX(Tableau_de_suivi[[N°]:[Clôturé]],SMALL(IF(Tableau_de_suivi[Clôturé]=\"OUI\",ROW(Tableau_de_suivi[Clôturé])-2),ROWS($1:88)),COLUMN()),\"\")","v":""},{"$f":"IFERROR(INDEX(Tableau_de_suivi[[N°]:[Clôturé]],SMALL(IF(Tableau_de_suivi[Clôturé]=\"OUI\",ROW(Tableau_de_suivi[Clôturé])-2),ROWS($1:88)),COLUMN()),\"\")","v":""},{"$f":"IFERROR(INDEX(Tableau_de_suivi[[N°]:[Clôturé]],SMALL(IF(Tableau_de_suivi[Clôturé]=\"OUI\",ROW(Tableau_de_suivi[Clôturé])-2),ROWS($1:88)),COLUMN()),\"\")","v":""},{"$f":"IFERROR(INDEX(Tableau_de_suivi[[N°]:[Clôturé]],SMALL(IF(Tableau_de_suivi[Clôturé]=\"OUI\",ROW(Tableau_de_suivi[Clôturé])-2),ROWS($1:88)),COLUMN()),\"\")","v":""}]
[{"$f":"IFERROR(INDEX(Tableau_de_suivi[[N°]:[Clôturé]],SMALL(IF(Tableau_de_suivi[Clôturé]=\"OUI\",ROW(Tableau_de_suivi[Clôturé])-2),ROWS($1:89)),COLUMN()),\"\")","v":""},{"$f":"IFERROR(INDEX(Tableau_de_suivi[[N°]:[Clôturé]],SMALL(IF(Tableau_de_suivi[Clôturé]=\"OUI\",ROW(Tableau_de_suivi[Clôturé])-2),ROWS($1:89)),COLUMN()),\"\")","v":""},{"$f":"IFERROR(INDEX(Tableau_de_suivi[[N°]:[Clôturé]],SMALL(IF(Tableau_de_suivi[Clôturé]=\"OUI\",ROW(Tableau_de_suivi[Clôturé])-2),ROWS($1:89)),COLUMN()),\"\")","v":""},{"$f":"IFERROR(INDEX(Tableau_de_suivi[[N°]:[Clôturé]],SMALL(IF(Tableau_de_suivi[Clôturé]=\"OUI\",ROW(Tableau_de_suivi[Clôturé])-2),ROWS($1:89)),COLUMN()),\"\")","v":""},{"$f":"IFERROR(INDEX(Tableau_de_suivi[[N°]:[Clôturé]],SMALL(IF(Tableau_de_suivi[Clôturé]=\"OUI\",ROW(Tableau_de_suivi[Clôturé])-2),ROWS($1:89)),COLUMN()),\"\")","v":""},{"$f":"IFERROR(INDEX(Tableau_de_suivi[[N°]:[Clôturé]],SMALL(IF(Tableau_de_suivi[Clôturé]=\"OUI\",ROW(Tableau_de_suivi[Clôturé])-2),ROWS($1:89)),COLUMN()),\"\")","v":""},{"$f":"IFERROR(INDEX(Tableau_de_suivi[[N°]:[Clôturé]],SMALL(IF(Tableau_de_suivi[Clôturé]=\"OUI\",ROW(Tableau_de_suivi[Clôturé])-2),ROWS($1:89)),COLUMN()),\"\")","v":""},{"$f":"IFERROR(INDEX(Tableau_de_suivi[[N°]:[Clôturé]],SMALL(IF(Tableau_de_suivi[Clôturé]=\"OUI\",ROW(Tableau_de_suivi[Clôturé])-2),ROWS($1:89)),COLUMN()),\"\")","v":""},{"$f":"IFERROR(INDEX(Tableau_de_suivi[[N°]:[Clôturé]],SMALL(IF(Tableau_de_suivi[Clôturé]=\"OUI\",ROW(Tableau_de_suivi[Clôturé])-2),ROWS($1:89)),COLUMN()),\"\")","v":""},{"$f":"IFERROR(INDEX(Tableau_de_suivi[[N°]:[Clôturé]],SMALL(IF(Tableau_de_suivi[Clôturé]=\"OUI\",ROW(Tableau_de_suivi[Clôturé])-2),ROWS($1:89)),COLUMN()),\"\")","v":""},{"$f":"IFERROR(INDEX(Tableau_de_suivi[[N°]:[Clôturé]],SMALL(IF(Tableau_de_suivi[Clôturé]=\"OUI\",ROW(Tableau_de_suivi[Clôturé])-2),ROWS($1:89)),COLUMN()),\"\")","v":""},{"$f":"IFERROR(INDEX(Tableau_de_suivi[[N°]:[Clôturé]],SMALL(IF(Tableau_de_suivi[Clôturé]=\"OUI\",ROW(Tableau_de_suivi[Clôturé])-2),ROWS($1:89)),COLUMN()),\"\")","v":""},{"$f":"IFERROR(INDEX(Tableau_de_suivi[[N°]:[Clôturé]],SMALL(IF(Tableau_de_suivi[Clôturé]=\"OUI\",ROW(Tableau_de_suivi[Clôturé])-2),ROWS($1:89)),COLUMN()),\"\")","v":""},{"$f":"IFERROR(INDEX(Tableau_de_suivi[[N°]:[Clôturé]],SMALL(IF(Tableau_de_suivi[Clôturé]=\"OUI\",ROW(Tableau_de_suivi[Clôturé])-2),ROWS($1:89)),COLUMN()),\"\")","v":""},{"$f":"IFERROR(INDEX(Tableau_de_suivi[[N°]:[Clôturé]],SMALL(IF(Tableau_de_suivi[Clôturé]=\"OUI\",ROW(Tableau_de_suivi[Clôturé])-2),ROWS($1:89)),COLUMN()),\"\")","v":""},{"$f":"IFERROR(INDEX(Tableau_de_suivi[[N°]:[Clôturé]],SMALL(IF(Tableau_de_suivi[Clôturé]=\"OUI\",ROW(Tableau_de_suivi[Clôturé])-2),ROWS($1:89)),COLUMN()),\"\")","v":""},{"$f":"IFERROR(INDEX(Tableau_de_suivi[[N°]:[Clôturé]],SMALL(IF(Tableau_de_suivi[Clôturé]=\"OUI\",ROW(Tableau_de_suivi[Clôturé])-2),ROWS($1:89)),COLUMN()),\"\")","v":""},{"$f":"IFERROR(INDEX(Tableau_de_suivi[[N°]:[Clôturé]],SMALL(IF(Tableau_de_suivi[Clôturé]=\"OUI\",ROW(Tableau_de_suivi[Clôturé])-2),ROWS($1:89)),COLUMN()),\"\")","v":""},{"$f":"IFERROR(INDEX(Tableau_de_suivi[[N°]:[Clôturé]],SMALL(IF(Tableau_de_suivi[Clôturé]=\"OUI\",ROW(Tableau_de_suivi[Clôturé])-2),ROWS($1:89)),COLUMN()),\"\")","v":""},{"$f":"IFERROR(INDEX(Tableau_de_suivi[[N°]:[Clôturé]],SMALL(IF(Tableau_de_suivi[Clôturé]=\"OUI\",ROW(Tableau_de_suivi[Clôturé])-2),ROWS($1:89)),COLUMN()),\"\")","v":""},{"$f":"IFERROR(INDEX(Tableau_de_suivi[[N°]:[Clôturé]],SMALL(IF(Tableau_de_suivi[Clôturé]=\"OUI\",ROW(Tableau_de_suivi[Clôturé])-2),ROWS($1:89)),COLUMN()),\"\")","v":""},{"$f":"IFERROR(INDEX(Tableau_de_suivi[[N°]:[Clôturé]],SMALL(IF(Tableau_de_suivi[Clôturé]=\"OUI\",ROW(Tableau_de_suivi[Clôturé])-2),ROWS($1:89)),COLUMN()),\"\")","v":""}]
[{"$f":"IFERROR(INDEX(Tableau_de_suivi[[N°]:[Clôturé]],SMALL(IF(Tableau_de_suivi[Clôturé]=\"OUI\",ROW(Tableau_de_suivi[Clôturé])-2),ROWS($1:90)),COLUMN()),\"\")","v":""},{"$f":"IFERROR(INDEX(Tableau_de_suivi[[N°]:[Clôturé]],SMALL(IF(Tableau_de_suivi[Clôturé]=\"OUI\",ROW(Tableau_de_suivi[Clôturé])-2),ROWS($1:90)),COLUMN()),\"\")","v":""},{"$f":"IFERROR(INDEX(Tableau_de_suivi[[N°]:[Clôturé]],SMALL(IF(Tableau_de_suivi[Clôturé]=\"OUI\",ROW(Tableau_de_suivi[Clôturé])-2),ROWS($1:90)),COLUMN()),\"\")","v":""},{"$f":"IFERROR(INDEX(Tableau_de_suivi[[N°]:[Clôturé]],SMALL(IF(Tableau_de_suivi[Clôturé]=\"OUI\",ROW(Tableau_de_suivi[Clôturé])-2),ROWS($1:90)),COLUMN()),\"\")","v":""},{"$f":"IFERROR(INDEX(Tableau_de_suivi[[N°]:[Clôturé]],SMALL(IF(Tableau_de_suivi[Clôturé]=\"OUI\",ROW(Tableau_de_suivi[Clôturé])-2),ROWS($1:90)),COLUMN()),\"\")","v":""},{"$f":"IFERROR(INDEX(Tableau_de_suivi[[N°]:[Clôturé]],SMALL(IF(Tableau_de_suivi[Clôturé]=\"OUI\",ROW(Tableau_de_suivi[Clôturé])-2),ROWS($1:90)),COLUMN()),\"\")","v":""},{"$f":"IFERROR(INDEX(Tableau_de_suivi[[N°]:[Clôturé]],SMALL(IF(Tableau_de_suivi[Clôturé]=\"OUI\",ROW(Tableau_de_suivi[Clôturé])-2),ROWS($1:90)),COLUMN()),\"\")","v":""},{"$f":"IFERROR(INDEX(Tableau_de_suivi[[N°]:[Clôturé]],SMALL(IF(Tableau_de_suivi[Clôturé]=\"OUI\",ROW(Tableau_de_suivi[Clôturé])-2),ROWS($1:90)),COLUMN()),\"\")","v":""},{"$f":"IFERROR(INDEX(Tableau_de_suivi[[N°]:[Clôturé]],SMALL(IF(Tableau_de_suivi[Clôturé]=\"OUI\",ROW(Tableau_de_suivi[Clôturé])-2),ROWS($1:90)),COLUMN()),\"\")","v":""},{"$f":"IFERROR(INDEX(Tableau_de_suivi[[N°]:[Clôturé]],SMALL(IF(Tableau_de_suivi[Clôturé]=\"OUI\",ROW(Tableau_de_suivi[Clôturé])-2),ROWS($1:90)),COLUMN()),\"\")","v":""},{"$f":"IFERROR(INDEX(Tableau_de_suivi[[N°]:[Clôturé]],SMALL(IF(Tableau_de_suivi[Clôturé]=\"OUI\",ROW(Tableau_de_suivi[Clôturé])-2),ROWS($1:90)),COLUMN()),\"\")","v":""},{"$f":"IFERROR(INDEX(Tableau_de_suivi[[N°]:[Clôturé]],SMALL(IF(Tableau_de_suivi[Clôturé]=\"OUI\",ROW(Tableau_de_suivi[Clôturé])-2),ROWS($1:90)),COLUMN()),\"\")","v":""},{"$f":"IFERROR(INDEX(Tableau_de_suivi[[N°]:[Clôturé]],SMALL(IF(Tableau_de_suivi[Clôturé]=\"OUI\",ROW(Tableau_de_suivi[Clôturé])-2),ROWS($1:90)),COLUMN()),\"\")","v":""},{"$f":"IFERROR(INDEX(Tableau_de_suivi[[N°]:[Clôturé]],SMALL(IF(Tableau_de_suivi[Clôturé]=\"OUI\",ROW(Tableau_de_suivi[Clôturé])-2),ROWS($1:90)),COLUMN()),\"\")","v":""},{"$f":"IFERROR(INDEX(Tableau_de_suivi[[N°]:[Clôturé]],SMALL(IF(Tableau_de_suivi[Clôturé]=\"OUI\",ROW(Tableau_de_suivi[Clôturé])-2),ROWS($1:90)),COLUMN()),\"\")","v":""},{"$f":"IFERROR(INDEX(Tableau_de_suivi[[N°]:[Clôturé]],SMALL(IF(Tableau_de_suivi[Clôturé]=\"OUI\",ROW(Tableau_de_suivi[Clôturé])-2),ROWS($1:90)),COLUMN()),\"\")","v":""},{"$f":"IFERROR(INDEX(Tableau_de_suivi[[N°]:[Clôturé]],SMALL(IF(Tableau_de_suivi[Clôturé]=\"OUI\",ROW(Tableau_de_suivi[Clôturé])-2),ROWS($1:90)),COLUMN()),\"\")","v":""},{"$f":"IFERROR(INDEX(Tableau_de_suivi[[N°]:[Clôturé]],SMALL(IF(Tableau_de_suivi[Clôturé]=\"OUI\",ROW(Tableau_de_suivi[Clôturé])-2),ROWS($1:90)),COLUMN()),\"\")","v":""},{"$f":"IFERROR(INDEX(Tableau_de_suivi[[N°]:[Clôturé]],SMALL(IF(Tableau_de_suivi[Clôturé]=\"OUI\",ROW(Tableau_de_suivi[Clôturé])-2),ROWS($1:90)),COLUMN()),\"\")","v":""},{"$f":"IFERROR(INDEX(Tableau_de_suivi[[N°]:[Clôturé]],SMALL(IF(Tableau_de_suivi[Clôturé]=\"OUI\",ROW(Tableau_de_suivi[Clôturé])-2),ROWS($1:90)),COLUMN()),\"\")","v":""},{"$f":"IFERROR(INDEX(Tableau_de_suivi[[N°]:[Clôturé]],SMALL(IF(Tableau_de_suivi[Clôturé]=\"OUI\",ROW(Tableau_de_suivi[Clôturé])-2),ROWS($1:90)),COLUMN()),\"\")","v":""},{"$f":"IFERROR(INDEX(Tableau_de_suivi[[N°]:[Clôturé]],SMALL(IF(Tableau_de_suivi[Clôturé]=\"OUI\",ROW(Tableau_de_suivi[Clôturé])-2),ROWS($1:90)),COLUMN()),\"\")","v":""}]
[{"$f":"IFERROR(INDEX(Tableau_de_suivi[[N°]:[Clôturé]],SMALL(IF(Tableau_de_suivi[Clôturé]=\"OUI\",ROW(Tableau_de_suivi[Clôturé])-2),ROWS($1:91)),COLUMN()),\"\")","v":""},{"$f":"IFERROR(INDEX(Tableau_de_suivi[[N°]:[Clôturé]],SMALL(IF(Tableau_de_suivi[Clôturé]=\"OUI\",ROW(Tableau_de_suivi[Clôturé])-2),ROWS($1:91)),COLUMN()),\"\")","v":""},{"$f":"IFERROR(INDEX(Tableau_de_suivi[[N°]:[Clôturé]],SMALL(IF(Tableau_de_suivi[Clôturé]=\"OUI\",ROW(Tableau_de_suivi[Clôturé])-2),ROWS($1:91)),COLUMN()),\"\")","v":""},{"$f":"IFERROR(INDEX(Tableau_de_suivi[[N°]:[Clôturé]],SMALL(IF(Tableau_de_suivi[Clôturé]=\"OUI\",ROW(Tableau_de_suivi[Clôturé])-2),ROWS($1:91)),COLUMN()),\"\")","v":""},{"$f":"IFERROR(INDEX(Tableau_de_suivi[[N°]:[Clôturé]],SMALL(IF(Tableau_de_suivi[Clôturé]=\"OUI\",ROW(Tableau_de_suivi[Clôturé])-2),ROWS($1:91)),COLUMN()),\"\")","v":""},{"$f":"IFERROR(INDEX(Tableau_de_suivi[[N°]:[Clôturé]],SMALL(IF(Tableau_de_suivi[Clôturé]=\"OUI\",ROW(Tableau_de_suivi[Clôturé])-2),ROWS($1:91)),COLUMN()),\"\")","v":""},{"$f":"IFERROR(INDEX(Tableau_de_suivi[[N°]:[Clôturé]],SMALL(IF(Tableau_de_suivi[Clôturé]=\"OUI\",ROW(Tableau_de_suivi[Clôturé])-2),ROWS($1:91)),COLUMN()),\"\")","v":""},{"$f":"IFERROR(INDEX(Tableau_de_suivi[[N°]:[Clôturé]],SMALL(IF(Tableau_de_suivi[Clôturé]=\"OUI\",ROW(Tableau_de_suivi[Clôturé])-2),ROWS($1:91)),COLUMN()),\"\")","v":""},{"$f":"IFERROR(INDEX(Tableau_de_suivi[[N°]:[Clôturé]],SMALL(IF(Tableau_de_suivi[Clôturé]=\"OUI\",ROW(Tableau_de_suivi[Clôturé])-2),ROWS($1:91)),COLUMN()),\"\")","v":""},{"$f":"IFERROR(INDEX(Tableau_de_suivi[[N°]:[Clôturé]],SMALL(IF(Tableau_de_suivi[Clôturé]=\"OUI\",ROW(Tableau_de_suivi[Clôturé])-2),ROWS($1:91)),COLUMN()),\"\")","v":""},{"$f":"IFERROR(INDEX(Tableau_de_suivi[[N°]:[Clôturé]],SMALL(IF(Tableau_de_suivi[Clôturé]=\"OUI\",ROW(Tableau_de_suivi[Clôturé])-2),ROWS($1:91)),COLUMN()),\"\")","v":""},{"$f":"IFERROR(INDEX(Tableau_de_suivi[[N°]:[Clôturé]],SMALL(IF(Tableau_de_suivi[Clôturé]=\"OUI\",ROW(Tableau_de_suivi[Clôturé])-2),ROWS($1:91)),COLUMN()),\"\")","v":""},{"$f":"IFERROR(INDEX(Tableau_de_suivi[[N°]:[Clôturé]],SMALL(IF(Tableau_de_suivi[Clôturé]=\"OUI\",ROW(Tableau_de_suivi[Clôturé])-2),ROWS($1:91)),COLUMN()),\"\")","v":""},{"$f":"IFERROR(INDEX(Tableau_de_suivi[[N°]:[Clôturé]],SMALL(IF(Tableau_de_suivi[Clôturé]=\"OUI\",ROW(Tableau_de_suivi[Clôturé])-2),ROWS($1:91)),COLUMN()),\"\")","v":""},{"$f":"IFERROR(INDEX(Tableau_de_suivi[[N°]:[Clôturé]],SMALL(IF(Tableau_de_suivi[Clôturé]=\"OUI\",ROW(Tableau_de_suivi[Clôturé])-2),ROWS($1:91)),COLUMN()),\"\")","v":""},{"$f":"IFERROR(INDEX(Tableau_de_suivi[[N°]:[Clôturé]],SMALL(IF(Tableau_de_suivi[Clôturé]=\"OUI\",ROW(Tableau_de_suivi[Clôturé])-2),ROWS($1:91)),COLUMN()),\"\")","v":""},{"$f":"IFERROR(INDEX(Tableau_de_suivi[[N°]:[Clôturé]],SMALL(IF(Tableau_de_suivi[Clôturé]=\"OUI\",ROW(Tableau_de_suivi[Clôturé])-2),ROWS($1:91)),COLUMN()),\"\")","v":""},{"$f":"IFERROR(INDEX(Tableau_de_suivi[[N°]:[Clôturé]],SMALL(IF(Tableau_de_suivi[Clôturé]=\"OUI\",ROW(Tableau_de_suivi[Clôturé])-2),ROWS($1:91)),COLUMN()),\"\")","v":""},{"$f":"IFERROR(INDEX(Tableau_de_suivi[[N°]:[Clôturé]],SMALL(IF(Tableau_de_suivi[Clôturé]=\"OUI\",ROW(Tableau_de_suivi[Clôturé])-2),ROWS($1:91)),COLUMN()),\"\")","v":""},{"$f":"IFERROR(INDEX(Tableau_de_suivi[[N°]:[Clôturé]],SMALL(IF(Tableau_de_suivi[Clôturé]=\"OUI\",ROW(Tableau_de_suivi[Clôturé])-2),ROWS($1:91)),COLUMN()),\"\")","v":""},{"$f":"IFERROR(INDEX(Tableau_de_suivi[[N°]:[Clôturé]],SMALL(IF(Tableau_de_suivi[Clôturé]=\"OUI\",ROW(Tableau_de_suivi[Clôturé])-2),ROWS($1:91)),COLUMN()),\"\")","v":""},{"$f":"IFERROR(INDEX(Tableau_de_suivi[[N°]:[Clôturé]],SMALL(IF(Tableau_de_suivi[Clôturé]=\"OUI\",ROW(Tableau_de_suivi[Clôturé])-2),ROWS($1:91)),COLUMN()),\"\")","v":""}]
[{"$f":"IFERROR(INDEX(Tableau_de_suivi[[N°]:[Clôturé]],SMALL(IF(Tableau_de_suivi[Clôturé]=\"OUI\",ROW(Tableau_de_suivi[Clôturé])-2),ROWS($1:92)),COLUMN()),\"\")","v":""},{"$f":"IFERROR(INDEX(Tableau_de_suivi[[N°]:[Clôturé]],SMALL(IF(Tableau_de_suivi[Clôturé]=\"OUI\",ROW(Tableau_de_suivi[Clôturé])-2),ROWS($1:92)),COLUMN()),\"\")","v":""},{"$f":"IFERROR(INDEX(Tableau_de_suivi[[N°]:[Clôturé]],SMALL(IF(Tableau_de_suivi[Clôturé]=\"OUI\",ROW(Tableau_de_suivi[Clôturé])-2),ROWS($1:92)),COLUMN()),\"\")","v":""},{"$f":"IFERROR(INDEX(Tableau_de_suivi[[N°]:[Clôturé]],SMALL(IF(Tableau_de_suivi[Clôturé]=\"OUI\",ROW(Tableau_de_suivi[Clôturé])-2),ROWS($1:92)),COLUMN()),\"\")","v":""},{"$f":"IFERROR(INDEX(Tableau_de_suivi[[N°]:[Clôturé]],SMALL(IF(Tableau_de_suivi[Clôturé]=\"OUI\",ROW(Tableau_de_suivi[Clôturé])-2),ROWS($1:92)),COLUMN()),\"\")","v":""},{"$f":"IFERROR(INDEX(Tableau_de_suivi[[N°]:[Clôturé]],SMALL(IF(Tableau_de_suivi[Clôturé]=\"OUI\",ROW(Tableau_de_suivi[Clôturé])-2),ROWS($1:92)),COLUMN()),\"\")","v":""},{"$f":"IFERROR(INDEX(Tableau_de_suivi[[N°]:[Clôturé]],SMALL(IF(Tableau_de_suivi[Clôturé]=\"OUI\",ROW(Tableau_de_suivi[Clôturé])-2),ROWS($1:92)),COLUMN()),\"\")","v":""},{"$f":"IFERROR(INDEX(Tableau_de_suivi[[N°]:[Clôturé]],SMALL(IF(Tableau_de_suivi[Clôturé]=\"OUI\",ROW(Tableau_de_suivi[Clôturé])-2),ROWS($1:92)),COLUMN()),\"\")","v":""},{"$f":"IFERROR(INDEX(Tableau_de_suivi[[N°]:[Clôturé]],SMALL(IF(Tableau_de_suivi[Clôturé]=\"OUI\",ROW(Tableau_de_suivi[Clôturé])-2),ROWS($1:92)),COLUMN()),\"\")","v":""},{"$f":"IFERROR(INDEX(Tableau_de_suivi[[N°]:[Clôturé]],SMALL(IF(Tableau_de_suivi[Clôturé]=\"OUI\",ROW(Tableau_de_suivi[Clôturé])-2),ROWS($1:92)),COLUMN()),\"\")","v":""},{"$f":"IFERROR(INDEX(Tableau_de_suivi[[N°]:[Clôturé]],SMALL(IF(Tableau_de_suivi[Clôturé]=\"OUI\",ROW(Tableau_de_suivi[Clôturé])-2),ROWS($1:92)),COLUMN()),\"\")","v":""},{"$f":"IFERROR(INDEX(Tableau_de_suivi[[N°]:[Clôturé]],SMALL(IF(Tableau_de_suivi[Clôturé]=\"OUI\",ROW(Tableau_de_suivi[Clôturé])-2),ROWS($1:92)),COLUMN()),\"\")","v":""},{"$f":"IFERROR(INDEX(Tableau_de_suivi[[N°]:[Clôturé]],SMALL(IF(Tableau_de_suivi[Clôturé]=\"OUI\",ROW(Tableau_de_suivi[Clôturé])-2),ROWS($1:92)),COLUMN()),\"\")","v":""},{"$f":"IFERROR(INDEX(Tableau_de_suivi[[N°]:[Clôturé]],SMALL(IF(Tableau_de_suivi[Clôturé]=\"OUI\",ROW(Tableau_de_suivi[Clôturé])-2),ROWS($1:92)),COLUMN()),\"\")","v":""},{"$f":"IFERROR(INDEX(Tableau_de_suivi[[N°]:[Clôturé]],SMALL(IF(Tableau_de_suivi[Clôturé]=\"OUI\",ROW(Tableau_de_suivi[Clôturé])-2),ROWS($1:92)),COLUMN()),\"\")","v":""},{"$f":"IFERROR(INDEX(Tableau_de_suivi[[N°]:[Clôturé]],SMALL(IF(Tableau_de_suivi[Clôturé]=\"OUI\",ROW(Tableau_de_suivi[Clôturé])-2),ROWS($1:92)),COLUMN()),\"\")","v":""},{"$f":"IFERROR(INDEX(Tableau_de_suivi[[N°]:[Clôturé]],SMALL(IF(Tableau_de_suivi[Clôturé]=\"OUI\",ROW(Tableau_de_suivi[Clôturé])-2),ROWS($1:92)),COLUMN()),\"\")","v":""},{"$f":"IFERROR(INDEX(Tableau_de_suivi[[N°]:[Clôturé]],SMALL(IF(Tableau_de_suivi[Clôturé]=\"OUI\",ROW(Tableau_de_suivi[Clôturé])-2),ROWS($1:92)),COLUMN()),\"\")","v":""},{"$f":"IFERROR(INDEX(Tableau_de_suivi[[N°]:[Clôturé]],SMALL(IF(Tableau_de_suivi[Clôturé]=\"OUI\",ROW(Tableau_de_suivi[Clôturé])-2),ROWS($1:92)),COLUMN()),\"\")","v":""},{"$f":"IFERROR(INDEX(Tableau_de_suivi[[N°]:[Clôturé]],SMALL(IF(Tableau_de_suivi[Clôturé]=\"OUI\",ROW(Tableau_de_suivi[Clôturé])-2),ROWS($1:92)),COLUMN()),\"\")","v":""},{"$f":"IFERROR(INDEX(Tableau_de_suivi[[N°]:[Clôturé]],SMALL(IF(Tableau_de_suivi[Clôturé]=\"OUI\",ROW(Tableau_de_suivi[Clôturé])-2),ROWS($1:92)),COLUMN()),\"\")","v":""},{"$f":"IFERROR(INDEX(Tableau_de_suivi[[N°]:[Clôturé]],SMALL(IF(Tableau_de_suivi[Clôturé]=\"OUI\",ROW(Tableau_de_suivi[Clôturé])-2),ROWS($1:92)),COLUMN()),\"\")","v":""}]
[{"$f":"IFERROR(INDEX(Tableau_de_suivi[[N°]:[Clôturé]],SMALL(IF(Tableau_de_suivi[Clôturé]=\"OUI\",ROW(Tableau_de_suivi[Clôturé])-2),ROWS($1:93)),COLUMN()),\"\")","v":""},{"$f":"IFERROR(INDEX(Tableau_de_suivi[[N°]:[Clôturé]],SMALL(IF(Tableau_de_suivi[Clôturé]=\"OUI\",ROW(Tableau_de_suivi[Clôturé])-2),ROWS($1:93)),COLUMN()),\"\")","v":""},{"$f":"IFERROR(INDEX(Tableau_de_suivi[[N°]:[Clôturé]],SMALL(IF(Tableau_de_suivi[Clôturé]=\"OUI\",ROW(Tableau_de_suivi[Clôturé])-2),ROWS($1:93)),COLUMN()),\"\")","v":""},{"$f":"IFERROR(INDEX(Tableau_de_suivi[[N°]:[Clôturé]],SMALL(IF(Tableau_de_suivi[Clôturé]=\"OUI\",ROW(Tableau_de_suivi[Clôturé])-2),ROWS($1:93)),COLUMN()),\"\")","v":""},{"$f":"IFERROR(INDEX(Tableau_de_suivi[[N°]:[Clôturé]],SMALL(IF(Tableau_de_suivi[Clôturé]=\"OUI\",ROW(Tableau_de_suivi[Clôturé])-2),ROWS($1:93)),COLUMN()),\"\")","v":""},{"$f":"IFERROR(INDEX(Tableau_de_suivi[[N°]:[Clôturé]],SMALL(IF(Tableau_de_suivi[Clôturé]=\"OUI\",ROW(Tableau_de_suivi[Clôturé])-2),ROWS($1:93)),COLUMN()),\"\")","v":""},{"$f":"IFERROR(INDEX(Tableau_de_suivi[[N°]:[Clôturé]],SMALL(IF(Tableau_de_suivi[Clôturé]=\"OUI\",ROW(Tableau_de_suivi[Clôturé])-2),ROWS($1:93)),COLUMN()),\"\")","v":""},{"$f":"IFERROR(INDEX(Tableau_de_suivi[[N°]:[Clôturé]],SMALL(IF(Tableau_de_suivi[Clôturé]=\"OUI\",ROW(Tableau_de_suivi[Clôturé])-2),ROWS($1:93)),COLUMN()),\"\")","v":""},{"$f":"IFERROR(INDEX(Tableau_de_suivi[[N°]:[Clôturé]],SMALL(IF(Tableau_de_suivi[Clôturé]=\"OUI\",ROW(Tableau_de_suivi[Clôturé])-2),ROWS($1:93)),COLUMN()),\"\")","v":""},{"$f":"IFERROR(INDEX(Tableau_de_suivi[[N°]:[Clôturé]],SMALL(IF(Tableau_de_suivi[Clôturé]=\"OUI\",ROW(Tableau_de_suivi[Clôturé])-2),ROWS($1:93)),COLUMN()),\"\")","v":""},{"$f":"IFERROR(INDEX(Tableau_de_suivi[[N°]:[Clôturé]],SMALL(IF(Tableau_de_suivi[Clôturé]=\"OUI\",ROW(Tableau_de_suivi[Clôturé])-2),ROWS($1:93)),COLUMN()),\"\")","v":""},{"$f":"IFERROR(INDEX(Tableau_de_suivi[[N°]:[Clôturé]],SMALL(IF(Tableau_de_suivi[Clôturé]=\"OUI\",ROW(Tableau_de_suivi[Clôturé])-2),ROWS($1:93)),COLUMN()),\"\")","v":""},{"$f":"IFERROR(INDEX(Tableau_de_suivi[[N°]:[Clôturé]],SMALL(IF(Tableau_de_suivi[Clôturé]=\"OUI\",ROW(Tableau_de_suivi[Clôturé])-2),ROWS($1:93)),COLUMN()),\"\")","v":""},{"$f":"IFERROR(INDEX(Tableau_de_suivi[[N°]:[Clôturé]],SMALL(IF(Tableau_de_suivi[Clôturé]=\"OUI\",ROW(Tableau_de_suivi[Clôturé])-2),ROWS($1:93)),COLUMN()),\"\")","v":""},{"$f":"IFERROR(INDEX(Tableau_de_suivi[[N°]:[Clôturé]],SMALL(IF(Tableau_de_suivi[Clôturé]=\"OUI\",ROW(Tableau_de_suivi[Clôturé])-2),ROWS($1:93)),COLUMN()),\"\")","v":""},{"$f":"IFERROR(INDEX(Tableau_de_suivi[[N°]:[Clôturé]],SMALL(IF(Tableau_de_suivi[Clôturé]=\"OUI\",ROW(Tableau_de_suivi[Clôturé])-2),ROWS($1:93)),COLUMN()),\"\")","v":""},{"$f":"IFERROR(INDEX(Tableau_de_suivi[[N°]:[Clôturé]],SMALL(IF(Tableau_de_suivi[Clôturé]=\"OUI\",ROW(Tableau_de_suivi[Clôturé])-2),ROWS($1:93)),COLUMN()),\"\")","v":""},{"$f":"IFERROR(INDEX(Tableau_de_suivi[[N°]:[Clôturé]],SMALL(IF(Tableau_de_suivi[Clôturé]=\"OUI\",ROW(Tableau_de_suivi[Clôturé])-2),ROWS($1:93)),COLUMN()),\"\")","v":""},{"$f":"IFERROR(INDEX(Tableau_de_suivi[[N°]:[Clôturé]],SMALL(IF(Tableau_de_suivi[Clôturé]=\"OUI\",ROW(Tableau_de_suivi[Clôturé])-2),ROWS($1:93)),COLUMN()),\"\")","v":""},{"$f":"IFERROR(INDEX(Tableau_de_suivi[[N°]:[Clôturé]],SMALL(IF(Tableau_de_suivi[Clôturé]=\"OUI\",ROW(Tableau_de_suivi[Clôturé])-2),ROWS($1:93)),COLUMN()),\"\")","v":""},{"$f":"IFERROR(INDEX(Tableau_de_suivi[[N°]:[Clôturé]],SMALL(IF(Tableau_de_suivi[Clôturé]=\"OUI\",ROW(Tableau_de_suivi[Clôturé])-2),ROWS($1:93)),COLUMN()),\"\")","v":""},{"$f":"IFERROR(INDEX(Tableau_de_suivi[[N°]:[Clôturé]],SMALL(IF(Tableau_de_suivi[Clôturé]=\"OUI\",ROW(Tableau_de_suivi[Clôturé])-2),ROWS($1:93)),COLUMN()),\"\")","v":""}]
[{"$f":"IFERROR(INDEX(Tableau_de_suivi[[N°]:[Clôturé]],SMALL(IF(Tableau_de_suivi[Clôturé]=\"OUI\",ROW(Tableau_de_suivi[Clôturé])-2),ROWS($1:94)),COLUMN()),\"\")","v":""},{"$f":"IFERROR(INDEX(Tableau_de_suivi[[N°]:[Clôturé]],SMALL(IF(Tableau_de_suivi[Clôturé]=\"OUI\",ROW(Tableau_de_suivi[Clôturé])-2),ROWS($1:94)),COLUMN()),\"\")","v":""},{"$f":"IFERROR(INDEX(Tableau_de_suivi[[N°]:[Clôturé]],SMALL(IF(Tableau_de_suivi[Clôturé]=\"OUI\",ROW(Tableau_de_suivi[Clôturé])-2),ROWS($1:94)),COLUMN()),\"\")","v":""},{"$f":"IFERROR(INDEX(Tableau_de_suivi[[N°]:[Clôturé]],SMALL(IF(Tableau_de_suivi[Clôturé]=\"OUI\",ROW(Tableau_de_suivi[Clôturé])-2),ROWS($1:94)),COLUMN()),\"\")","v":""},{"$f":"IFERROR(INDEX(Tableau_de_suivi[[N°]:[Clôturé]],SMALL(IF(Tableau_de_suivi[Clôturé]=\"OUI\",ROW(Tableau_de_suivi[Clôturé])-2),ROWS($1:94)),COLUMN()),\"\")","v":""},{"$f":"IFERROR(INDEX(Tableau_de_suivi[[N°]:[Clôturé]],SMALL(IF(Tableau_de_suivi[Clôturé]=\"OUI\",ROW(Tableau_de_suivi[Clôturé])-2),ROWS($1:94)),COLUMN()),\"\")","v":""},{"$f":"IFERROR(INDEX(Tableau_de_suivi[[N°]:[Clôturé]],SMALL(IF(Tableau_de_suivi[Clôturé]=\"OUI\",ROW(Tableau_de_suivi[Clôturé])-2),ROWS($1:94)),COLUMN()),\"\")","v":""},{"$f":"IFERROR(INDEX(Tableau_de_suivi[[N°]:[Clôturé]],SMALL(IF(Tableau_de_suivi[Clôturé]=\"OUI\",ROW(Tableau_de_suivi[Clôturé])-2),ROWS($1:94)),COLUMN()),\"\")","v":""},{"$f":"IFERROR(INDEX(Tableau_de_suivi[[N°]:[Clôturé]],SMALL(IF(Tableau_de_suivi[Clôturé]=\"OUI\",ROW(Tableau_de_suivi[Clôturé])-2),ROWS($1:94)),COLUMN()),\"\")","v":""},{"$f":"IFERROR(INDEX(Tableau_de_suivi[[N°]:[Clôturé]],SMALL(IF(Tableau_de_suivi[Clôturé]=\"OUI\",ROW(Tableau_de_suivi[Clôturé])-2),ROWS($1:94)),COLUMN()),\"\")","v":""},{"$f":"IFERROR(INDEX(Tableau_de_suivi[[N°]:[Clôturé]],SMALL(IF(Tableau_de_suivi[Clôturé]=\"OUI\",ROW(Tableau_de_suivi[Clôturé])-2),ROWS($1:94)),COLUMN()),\"\")","v":""},{"$f":"IFERROR(INDEX(Tableau_de_suivi[[N°]:[Clôturé]],SMALL(IF(Tableau_de_suivi[Clôturé]=\"OUI\",ROW(Tableau_de_suivi[Clôturé])-2),ROWS($1:94)),COLUMN()),\"\")","v":""},{"$f":"IFERROR(INDEX(Tableau_de_suivi[[N°]:[Clôturé]],SMALL(IF(Tableau_de_suivi[Clôturé]=\"OUI\",ROW(Tableau_de_suivi[Clôturé])-2),ROWS($1:94)),COLUMN()),\"\")","v":""},{"$f":"IFERROR(INDEX(Tableau_de_suivi[[N°]:[Clôturé]],SMALL(IF(Tableau_de_suivi[Clôturé]=\"OUI\",ROW(Tableau_de_suivi[Clôturé])-2),ROWS($1:94)),COLUMN()),\"\")","v":""},{"$f":"IFERROR(INDEX(Tableau_de_suivi[[N°]:[Clôturé]],SMALL(IF(Tableau_de_suivi[Clôturé]=\"OUI\",ROW(Tableau_de_suivi[Clôturé])-2),ROWS($1:94)),COLUMN()),\"\")","v":""},{"$f":"IFERROR(INDEX(Tableau_de_suivi[[N°]:[Clôturé]],SMALL(IF(Tableau_de_suivi[Clôturé]=\"OUI\",ROW(Tableau_de_suivi[Clôturé])-2),ROWS($1:94)),COLUMN()),\"\")","v":""},{"$f":"IFERROR(INDEX(Tableau_de_suivi[[N°]:[Clôturé]],SMALL(IF(Tableau_de_suivi[Clôturé]=\"OUI\",ROW(Tableau_de_suivi[Clôturé])-2),ROWS($1:94)),COLUMN()),\"\")","v":""},{"$f":"IFERROR(INDEX(Tableau_de_suivi[[N°]:[Clôturé]],SMALL(IF(Tableau_de_suivi[Clôturé]=\"OUI\",ROW(Tableau_de_suivi[Clôturé])-2),ROWS($1:94)),COLUMN()),\"\")","v":""},{"$f":"IFERROR(INDEX(Tableau_de_suivi[[N°]:[Clôturé]],SMALL(IF(Tableau_de_suivi[Clôturé]=\"OUI\",ROW(Tableau_de_suivi[Clôturé])-2),ROWS($1:94)),COLUMN()),\"\")","v":""},{"$f":"IFERROR(INDEX(Tableau_de_suivi[[N°]:[Clôturé]],SMALL(IF(Tableau_de_suivi[Clôturé]=\"OUI\",ROW(Tableau_de_suivi[Clôturé])-2),ROWS($1:94)),COLUMN()),\"\")","v":""},{"$f":"IFERROR(INDEX(Tableau_de_suivi[[N°]:[Clôturé]],SMALL(IF(Tableau_de_suivi[Clôturé]=\"OUI\",ROW(Tableau_de_suivi[Clôturé])-2),ROWS($1:94)),COLUMN()),\"\")","v":""},{"$f":"IFERROR(INDEX(Tableau_de_suivi[[N°]:[Clôturé]],SMALL(IF(Tableau_de_suivi[Clôturé]=\"OUI\",ROW(Tableau_de_suivi[Clôturé])-2),ROWS($1:94)),COLUMN()),\"\")","v":""}]
[{"$f":"IFERROR(INDEX(Tableau_de_suivi[[N°]:[Clôturé]],SMALL(IF(Tableau_de_suivi[Clôturé]=\"OUI\",ROW(Tableau_de_suivi[Clôturé])-2),ROWS($1:95)),COLUMN()),\"\")","v":""},{"$f":"IFERROR(INDEX(Tableau_de_suivi[[N°]:[Clôturé]],SMALL(IF(Tableau_de_suivi[Clôturé]=\"OUI\",ROW(Tableau_de_suivi[Clôturé])-2),ROWS($1:95)),COLUMN()),\"\")","v":""},{"$f":"IFERROR(INDEX(Tableau_de_suivi[[N°]:[Clôturé]],SMALL(IF(Tableau_de_suivi[Clôturé]=\"OUI\",ROW(Tableau_de_suivi[Clôturé])-2),ROWS($1:95)),COLUMN()),\"\")","v":""},{"$f":"IFERROR(INDEX(Tableau_de_suivi[[N°]:[Clôturé]],SMALL(IF(Tableau_de_suivi[Clôturé]=\"OUI\",ROW(Tableau_de_suivi[Clôturé])-2),ROWS($1:95)),COLUMN()),\"\")","v":""},{"$f":"IFERROR(INDEX(Tableau_de_suivi[[N°]:[Clôturé]],SMALL(IF(Tableau_de_suivi[Clôturé]=\"OUI\",ROW(Tableau_de_suivi[Clôturé])-2),ROWS($1:95)),COLUMN()),\"\")","v":""},{"$f":"IFERROR(INDEX(Tableau_de_suivi[[N°]:[Clôturé]],SMALL(IF(Tableau_de_suivi[Clôturé]=\"OUI\",ROW(Tableau_de_suivi[Clôturé])-2),ROWS($1:95)),COLUMN()),\"\")","v":""},{"$f":"IFERROR(INDEX(Tableau_de_suivi[[N°]:[Clôturé]],SMALL(IF(Tableau_de_suivi[Clôturé]=\"OUI\",ROW(Tableau_de_suivi[Clôturé])-2),ROWS($1:95)),COLUMN()),\"\")","v":""},{"$f":"IFERROR(INDEX(Tableau_de_suivi[[N°]:[Clôturé]],SMALL(IF(Tableau_de_suivi[Clôturé]=\"OUI\",ROW(Tableau_de_suivi[Clôturé])-2),ROWS($1:95)),COLUMN()),\"\")","v":""},{"$f":"IFERROR(INDEX(Tableau_de_suivi[[N°]:[Clôturé]],SMALL(IF(Tableau_de_suivi[Clôturé]=\"OUI\",ROW(Tableau_de_suivi[Clôturé])-2),ROWS($1:95)),COLUMN()),\"\")","v":""},{"$f":"IFERROR(INDEX(Tableau_de_suivi[[N°]:[Clôturé]],SMALL(IF(Tableau_de_suivi[Clôturé]=\"OUI\",ROW(Tableau_de_suivi[Clôturé])-2),ROWS($1:95)),COLUMN()),\"\")","v":""},{"$f":"IFERROR(INDEX(Tableau_de_suivi[[N°]:[Clôturé]],SMALL(IF(Tableau_de_suivi[Clôturé]=\"OUI\",ROW(Tableau_de_suivi[Clôturé])-2),ROWS($1:95)),COLUMN()),\"\")","v":""},{"$f":"IFERROR(INDEX(Tableau_de_suivi[[N°]:[Clôturé]],SMALL(IF(Tableau_de_suivi[Clôturé]=\"OUI\",ROW(Tableau_de_suivi[Clôturé])-2),ROWS($1:95)),COLUMN()),\"\")","v":""},{"$f":"IFERROR(INDEX(Tableau_de_suivi[[N°]:[Clôturé]],SMALL(IF(Tableau_de_suivi[Clôturé]=\"OUI\",ROW(Tableau_de_suivi[Clôturé])-2),ROWS($1:95)),COLUMN()),\"\")","v":""},{"$f":"IFERROR(INDEX(Tableau_de_suivi[[N°]:[Clôturé]],SMALL(IF(Tableau_de_suivi[Clôturé]=\"OUI\",ROW(Tableau_de_suivi[Clôturé])-2),ROWS($1:95)),COLUMN()),\"\")","v":""},{"$f":"IFERROR(INDEX(Tableau_de_suivi[[N°]:[Clôturé]],SMALL(IF(Tableau_de_suivi[Clôturé]=\"OUI\",ROW(Tableau_de_suivi[Clôturé])-2),ROWS($1:95)),COLUMN()),\"\")","v":""},{"$f":"IFERROR(INDEX(Tableau_de_suivi[[N°]:[Clôturé]],SMALL(IF(Tableau_de_suivi[Clôturé]=\"OUI\",ROW(Tableau_de_suivi[Clôturé])-2),ROWS($1:95)),COLUMN()),\"\")","v":""},{"$f":"IFERROR(INDEX(Tableau_de_suivi[[N°]:[Clôturé]],SMALL(IF(Tableau_de_suivi[Clôturé]=\"OUI\",ROW(Tableau_de_suivi[Clôturé])-2),ROWS($1:95)),COLUMN()),\"\")","v":""},{"$f":"IFERROR(INDEX(Tableau_de_suivi[[N°]:[Clôturé]],SMALL(IF(Tableau_de_suivi[Clôturé]=\"OUI\",ROW(Tableau_de_suivi[Clôturé])-2),ROWS($1:95)),COLUMN()),\"\")","v":""},{"$f":"IFERROR(INDEX(Tableau_de_suivi[[N°]:[Clôturé]],SMALL(IF(Tableau_de_suivi[Clôturé]=\"OUI\",ROW(Tableau_de_suivi[Clôturé])-2),ROWS($1:95)),COLUMN()),\"\")","v":""},{"$f":"IFERROR(INDEX(Tableau_de_suivi[[N°]:[Clôturé]],SMALL(IF(Tableau_de_suivi[Clôturé]=\"OUI\",ROW(Tableau_de_suivi[Clôturé])-2),ROWS($1:95)),COLUMN()),\"\")","v":""},{"$f":"IFERROR(INDEX(Tableau_de_suivi[[N°]:[Clôturé]],SMALL(IF(Tableau_de_suivi[Clôturé]=\"OUI\",ROW(Tableau_de_suivi[Clôturé])-2),ROWS($1:95)),COLUMN()),\"\")","v":""},{"$f":"IFERROR(INDEX(Tableau_de_suivi[[N°]:[Clôturé]],SMALL(IF(Tableau_de_suivi[Clôturé]=\"OUI\",ROW(Tableau_de_suivi[Clôturé])-2),ROWS($1:95)),COLUMN()),\"\")","v":""}]
[{"$f":"IFERROR(INDEX(Tableau_de_suivi[[N°]:[Clôturé]],SMALL(IF(Tableau_de_suivi[Clôturé]=\"OUI\",ROW(Tableau_de_suivi[Clôturé])-2),ROWS($1:96)),COLUMN()),\"\")","v":""},{"$f":"IFERROR(INDEX(Tableau_de_suivi[[N°]:[Clôturé]],SMALL(IF(Tableau_de_suivi[Clôturé]=\"OUI\",ROW(Tableau_de_suivi[Clôturé])-2),ROWS($1:96)),COLUMN()),\"\")","v":""},{"$f":"IFERROR(INDEX(Tableau_de_suivi[[N°]:[Clôturé]],SMALL(IF(Tableau_de_suivi[Clôturé]=\"OUI\",ROW(Tableau_de_suivi[Clôturé])-2),ROWS($1:96)),COLUMN()),\"\")","v":""},{"$f":"IFERROR(INDEX(Tableau_de_suivi[[N°]:[Clôturé]],SMALL(IF(Tableau_de_suivi[Clôturé]=\"OUI\",ROW(Tableau_de_suivi[Clôturé])-2),ROWS($1:96)),COLUMN()),\"\")","v":""},{"$f":"IFERROR(INDEX(Tableau_de_suivi[[N°]:[Clôturé]],SMALL(IF(Tableau_de_suivi[Clôturé]=\"OUI\",ROW(Tableau_de_suivi[Clôturé])-2),ROWS($1:96)),COLUMN()),\"\")","v":""},{"$f":"IFERROR(INDEX(Tableau_de_suivi[[N°]:[Clôturé]],SMALL(IF(Tableau_de_suivi[Clôturé]=\"OUI\",ROW(Tableau_de_suivi[Clôturé])-2),ROWS($1:96)),COLUMN()),\"\")","v":""},{"$f":"IFERROR(INDEX(Tableau_de_suivi[[N°]:[Clôturé]],SMALL(IF(Tableau_de_suivi[Clôturé]=\"OUI\",ROW(Tableau_de_suivi[Clôturé])-2),ROWS($1:96)),COLUMN()),\"\")","v":""},{"$f":"IFERROR(INDEX(Tableau_de_suivi[[N°]:[Clôturé]],SMALL(IF(Tableau_de_suivi[Clôturé]=\"OUI\",ROW(Tableau_de_suivi[Clôturé])-2),ROWS($1:96)),COLUMN()),\"\")","v":""},{"$f":"IFERROR(INDEX(Tableau_de_suivi[[N°]:[Clôturé]],SMALL(IF(Tableau_de_suivi[Clôturé]=\"OUI\",ROW(Tableau_de_suivi[Clôturé])-2),ROWS($1:96)),COLUMN()),\"\")","v":""},{"$f":"IFERROR(INDEX(Tableau_de_suivi[[N°]:[Clôturé]],SMALL(IF(Tableau_de_suivi[Clôturé]=\"OUI\",ROW(Tableau_de_suivi[Clôturé])-2),ROWS($1:96)),COLUMN()),\"\")","v":""},{"$f":"IFERROR(INDEX(Tableau_de_suivi[[N°]:[Clôturé]],SMALL(IF(Tableau_de_suivi[Clôturé]=\"OUI\",ROW(Tableau_de_suivi[Clôturé])-2),ROWS($1:96)),COLUMN()),\"\")","v":""},{"$f":"IFERROR(INDEX(Tableau_de_suivi[[N°]:[Clôturé]],SMALL(IF(Tableau_de_suivi[Clôturé]=\"OUI\",ROW(Tableau_de_suivi[Clôturé])-2),ROWS($1:96)),COLUMN()),\"\")","v":""},{"$f":"IFERROR(INDEX(Tableau_de_suivi[[N°]:[Clôturé]],SMALL(IF(Tableau_de_suivi[Clôturé]=\"OUI\",ROW(Tableau_de_suivi[Clôturé])-2),ROWS($1:96)),COLUMN()),\"\")","v":""},{"$f":"IFERROR(INDEX(Tableau_de_suivi[[N°]:[Clôturé]],SMALL(IF(Tableau_de_suivi[Clôturé]=\"OUI\",ROW(Tableau_de_suivi[Clôturé])-2),ROWS($1:96)),COLUMN()),\"\")","v":""},{"$f":"IFERROR(INDEX(Tableau_de_suivi[[N°]:[Clôturé]],SMALL(IF(Tableau_de_suivi[Clôturé]=\"OUI\",ROW(Tableau_de_suivi[Clôturé])-2),ROWS($1:96)),COLUMN()),\"\")","v":""},{"$f":"IFERROR(INDEX(Tableau_de_suivi[[N°]:[Clôturé]],SMALL(IF(Tableau_de_suivi[Clôturé]=\"OUI\",ROW(Tableau_de_suivi[Clôturé])-2),ROWS($1:96)),COLUMN()),\"\")","v":""},{"$f":"IFERROR(INDEX(Tableau_de_suivi[[N°]:[Clôturé]],SMALL(IF(Tableau_de_suivi[Clôturé]=\"OUI\",ROW(Tableau_de_suivi[Clôturé])-2),ROWS($1:96)),COLUMN()),\"\")","v":""},{"$f":"IFERROR(INDEX(Tableau_de_suivi[[N°]:[Clôturé]],SMALL(IF(Tableau_de_suivi[Clôturé]=\"OUI\",ROW(Tableau_de_suivi[Clôturé])-2),ROWS($1:96)),COLUMN()),\"\")","v":""},{"$f":"IFERROR(INDEX(Tableau_de_suivi[[N°]:[Clôturé]],SMALL(IF(Tableau_de_suivi[Clôturé]=\"OUI\",ROW(Tableau_de_suivi[Clôturé])-2),ROWS($1:96)),COLUMN()),\"\")","v":""},{"$f":"IFERROR(INDEX(Tableau_de_suivi[[N°]:[Clôturé]],SMALL(IF(Tableau_de_suivi[Clôturé]=\"OUI\",ROW(Tableau_de_suivi[Clôturé])-2),ROWS($1:96)),COLUMN()),\"\")","v":""},{"$f":"IFERROR(INDEX(Tableau_de_suivi[[N°]:[Clôturé]],SMALL(IF(Tableau_de_suivi[Clôturé]=\"OUI\",ROW(Tableau_de_suivi[Clôturé])-2),ROWS($1:96)),COLUMN()),\"\")","v":""},{"$f":"IFERROR(INDEX(Tableau_de_suivi[[N°]:[Clôturé]],SMALL(IF(Tableau_de_suivi[Clôturé]=\"OUI\",ROW(Tableau_de_suivi[Clôturé])-2),ROWS($1:96)),COLUMN()),\"\")","v":""}]
[{"$f":"IFERROR(INDEX(Tableau_de_suivi[[N°]:[Clôturé]],SMALL(IF(Tableau_de_suivi[Clôturé]=\"OUI\",ROW(Tableau_de_suivi[Clôturé])-2),ROWS($1:97)),COLUMN()),\"\")","v":""},{"$f":"IFERROR(INDEX(Tableau_de_suivi[[N°]:[Clôturé]],SMALL(IF(Tableau_de_suivi[Clôturé]=\"OUI\",ROW(Tableau_de_suivi[Clôturé])-2),ROWS($1:97)),COLUMN()),\"\")","v":""},{"$f":"IFERROR(INDEX(Tableau_de_suivi[[N°]:[Clôturé]],SMALL(IF(Tableau_de_suivi[Clôturé]=\"OUI\",ROW(Tableau_de_suivi[Clôturé])-2),ROWS($1:97)),COLUMN()),\"\")","v":""},{"$f":"IFERROR(INDEX(Tableau_de_suivi[[N°]:[Clôturé]],SMALL(IF(Tableau_de_suivi[Clôturé]=\"OUI\",ROW(Tableau_de_suivi[Clôturé])-2),ROWS($1:97)),COLUMN()),\"\")","v":""},{"$f":"IFERROR(INDEX(Tableau_de_suivi[[N°]:[Clôturé]],SMALL(IF(Tableau_de_suivi[Clôturé]=\"OUI\",ROW(Tableau_de_suivi[Clôturé])-2),ROWS($1:97)),COLUMN()),\"\")","v":""},{"$f":"IFERROR(INDEX(Tableau_de_suivi[[N°]:[Clôturé]],SMALL(IF(Tableau_de_suivi[Clôturé]=\"OUI\",ROW(Tableau_de_suivi[Clôturé])-2),ROWS($1:97)),COLUMN()),\"\")","v":""},{"$f":"IFERROR(INDEX(Tableau_de_suivi[[N°]:[Clôturé]],SMALL(IF(Tableau_de_suivi[Clôturé]=\"OUI\",ROW(Tableau_de_suivi[Clôturé])-2),ROWS($1:97)),COLUMN()),\"\")","v":""},{"$f":"IFERROR(INDEX(Tableau_de_suivi[[N°]:[Clôturé]],SMALL(IF(Tableau_de_suivi[Clôturé]=\"OUI\",ROW(Tableau_de_suivi[Clôturé])-2),ROWS($1:97)),COLUMN()),\"\")","v":""},{"$f":"IFERROR(INDEX(Tableau_de_suivi[[N°]:[Clôturé]],SMALL(IF(Tableau_de_suivi[Clôturé]=\"OUI\",ROW(Tableau_de_suivi[Clôturé])-2),ROWS($1:97)),COLUMN()),\"\")","v":""},{"$f":"IFERROR(INDEX(Tableau_de_suivi[[N°]:[Clôturé]],SMALL(IF(Tableau_de_suivi[Clôturé]=\"OUI\",ROW(Tableau_de_suivi[Clôturé])-2),ROWS($1:97)),COLUMN()),\"\")","v":""},{"$f":"IFERROR(INDEX(Tableau_de_suivi[[N°]:[Clôturé]],SMALL(IF(Tableau_de_suivi[Clôturé]=\"OUI\",ROW(Tableau_de_suivi[Clôturé])-2),ROWS($1:97)),COLUMN()),\"\")","v":""},{"$f":"IFERROR(INDEX(Tableau_de_suivi[[N°]:[Clôturé]],SMALL(IF(Tableau_de_suivi[Clôturé]=\"OUI\",ROW(Tableau_de_suivi[Clôturé])-2),ROWS($1:97)),COLUMN()),\"\")","v":""},{"$f":"IFERROR(INDEX(Tableau_de_suivi[[N°]:[Clôturé]],SMALL(IF(Tableau_de_suivi[Clôturé]=\"OUI\",ROW(Tableau_de_suivi[Clôturé])-2),ROWS($1:97)),COLUMN()),\"\")","v":""},{"$f":"IFERROR(INDEX(Tableau_de_suivi[[N°]:[Clôturé]],SMALL(IF(Tableau_de_suivi[Clôturé]=\"OUI\",ROW(Tableau_de_suivi[Clôturé])-2),ROWS($1:97)),COLUMN()),\"\")","v":""},{"$f":"IFERROR(INDEX(Tableau_de_suivi[[N°]:[Clôturé]],SMALL(IF(Tableau_de_suivi[Clôturé]=\"OUI\",ROW(Tableau_de_suivi[Clôturé])-2),ROWS($1:97)),COLUMN()),\"\")","v":""},{"$f":"IFERROR(INDEX(Tableau_de_suivi[[N°]:[Clôturé]],SMALL(IF(Tableau_de_suivi[Clôturé]=\"OUI\",ROW(Tableau_de_suivi[Clôturé])-2),ROWS($1:97)),COLUMN()),\"\")","v":""},{"$f":"IFERROR(INDEX(Tableau_de_suivi[[N°]:[Clôturé]],SMALL(IF(Tableau_de_suivi[Clôturé]=\"OUI\",ROW(Tableau_de_suivi[Clôturé])-2),ROWS($1:97)),COLUMN()),\"\")","v":""},{"$f":"IFERROR(INDEX(Tableau_de_suivi[[N°]:[Clôturé]],SMALL(IF(Tableau_de_suivi[Clôturé]=\"OUI\",ROW(Tableau_de_suivi[Clôturé])-2),ROWS($1:97)),COLUMN()),\"\")","v":""},{"$f":"IFERROR(INDEX(Tableau_de_suivi[[N°]:[Clôturé]],SMALL(IF(Tableau_de_suivi[Clôturé]=\"OUI\",ROW(Tableau_de_suivi[Clôturé])-2),ROWS($1:97)),COLUMN()),\"\")","v":""},{"$f":"IFERROR(INDEX(Tableau_de_suivi[[N°]:[Clôturé]],SMALL(IF(Tableau_de_suivi[Clôturé]=\"OUI\",ROW(Tableau_de_suivi[Clôturé])-2),ROWS($1:97)),COLUMN()),\"\")","v":""},{"$f":"IFERROR(INDEX(Tableau_de_suivi[[N°]:[Clôturé]],SMALL(IF(Tableau_de_suivi[Clôturé]=\"OUI\",ROW(Tableau_de_suivi[Clôturé])-2),ROWS($1:97)),COLUMN()),\"\")","v":""},{"$f":"IFERROR(INDEX(Tableau_de_suivi[[N°]:[Clôturé]],SMALL(IF(Tableau_de_suivi[Clôturé]=\"OUI\",ROW(Tableau_de_suivi[Clôturé])-2),ROWS($1:97)),COLUMN()),\"\")","v":""}]
[{"$f":"IFERROR(INDEX(Tableau_de_suivi[[N°]:[Clôturé]],SMALL(IF(Tableau_de_suivi[Clôturé]=\"OUI\",ROW(Tableau_de_suivi[Clôturé])-2),ROWS($1:98)),COLUMN()),\"\")","v":""},{"$f":"IFERROR(INDEX(Tableau_de_suivi[[N°]:[Clôturé]],SMALL(IF(Tableau_de_suivi[Clôturé]=\"OUI\",ROW(Tableau_de_suivi[Clôturé])-2),ROWS($1:98)),COLUMN()),\"\")","v":""},{"$f":"IFERROR(INDEX(Tableau_de_suivi[[N°]:[Clôturé]],SMALL(IF(Tableau_de_suivi[Clôturé]=\"OUI\",ROW(Tableau_de_suivi[Clôturé])-2),ROWS($1:98)),COLUMN()),\"\")","v":""},{"$f":"IFERROR(INDEX(Tableau_de_suivi[[N°]:[Clôturé]],SMALL(IF(Tableau_de_suivi[Clôturé]=\"OUI\",ROW(Tableau_de_suivi[Clôturé])-2),ROWS($1:98)),COLUMN()),\"\")","v":""},{"$f":"IFERROR(INDEX(Tableau_de_suivi[[N°]:[Clôturé]],SMALL(IF(Tableau_de_suivi[Clôturé]=\"OUI\",ROW(Tableau_de_suivi[Clôturé])-2),ROWS($1:98)),COLUMN()),\"\")","v":""},{"$f":"IFERROR(INDEX(Tableau_de_suivi[[N°]:[Clôturé]],SMALL(IF(Tableau_de_suivi[Clôturé]=\"OUI\",ROW(Tableau_de_suivi[Clôturé])-2),ROWS($1:98)),COLUMN()),\"\")","v":""},{"$f":"IFERROR(INDEX(Tableau_de_suivi[[N°]:[Clôturé]],SMALL(IF(Tableau_de_suivi[Clôturé]=\"OUI\",ROW(Tableau_de_suivi[Clôturé])-2),ROWS($1:98)),COLUMN()),\"\")","v":""},{"$f":"IFERROR(INDEX(Tableau_de_suivi[[N°]:[Clôturé]],SMALL(IF(Tableau_de_suivi[Clôturé]=\"OUI\",ROW(Tableau_de_suivi[Clôturé])-2),ROWS($1:98)),COLUMN()),\"\")","v":""},{"$f":"IFERROR(INDEX(Tableau_de_suivi[[N°]:[Clôturé]],SMALL(IF(Tableau_de_suivi[Clôturé]=\"OUI\",ROW(Tableau_de_suivi[Clôturé])-2),ROWS($1:98)),COLUMN()),\"\")","v":""},{"$f":"IFERROR(INDEX(Tableau_de_suivi[[N°]:[Clôturé]],SMALL(IF(Tableau_de_suivi[Clôturé]=\"OUI\",ROW(Tableau_de_suivi[Clôturé])-2),ROWS($1:98)),COLUMN()),\"\")","v":""},{"$f":"IFERROR(INDEX(Tableau_de_suivi[[N°]:[Clôturé]],SMALL(IF(Tableau_de_suivi[Clôturé]=\"OUI\",ROW(Tableau_de_suivi[Clôturé])-2),ROWS($1:98)),COLUMN()),\"\")","v":""},{"$f":"IFERROR(INDEX(Tableau_de_suivi[[N°]:[Clôturé]],SMALL(IF(Tableau_de_suivi[Clôturé]=\"OUI\",ROW(Tableau_de_suivi[Clôturé])-2),ROWS($1:98)),COLUMN()),\"\")","v":""},{"$f":"IFERROR(INDEX(Tableau_de_suivi[[N°]:[Clôturé]],SMALL(IF(Tableau_de_suivi[Clôturé]=\"OUI\",ROW(Tableau_de_suivi[Clôturé])-2),ROWS($1:98)),COLUMN()),\"\")","v":""},{"$f":"IFERROR(INDEX(Tableau_de_suivi[[N°]:[Clôturé]],SMALL(IF(Tableau_de_suivi[Clôturé]=\"OUI\",ROW(Tableau_de_suivi[Clôturé])-2),ROWS($1:98)),COLUMN()),\"\")","v":""},{"$f":"IFERROR(INDEX(Tableau_de_suivi[[N°]:[Clôturé]],SMALL(IF(Tableau_de_suivi[Clôturé]=\"OUI\",ROW(Tableau_de_suivi[Clôturé])-2),ROWS($1:98)),COLUMN()),\"\")","v":""},{"$f":"IFERROR(INDEX(Tableau_de_suivi[[N°]:[Clôturé]],SMALL(IF(Tableau_de_suivi[Clôturé]=\"OUI\",ROW(Tableau_de_suivi[Clôturé])-2),ROWS($1:98)),COLUMN()),\"\")","v":""},{"$f":"IFERROR(INDEX(Tableau_de_suivi[[N°]:[Clôturé]],SMALL(IF(Tableau_de_suivi[Clôturé]=\"OUI\",ROW(Tableau_de_suivi[Clôturé])-2),ROWS($1:98)),COLUMN()),\"\")","v":""},{"$f":"IFERROR(INDEX(Tableau_de_suivi[[N°]:[Clôturé]],SMALL(IF(Tableau_de_suivi[Clôturé]=\"OUI\",ROW(Tableau_de_suivi[Clôturé])-2),ROWS($1:98)),COLUMN()),\"\")","v":""},{"$f":"IFERROR(INDEX(Tableau_de_suivi[[N°]:[Clôturé]],SMALL(IF(Tableau_de_suivi[Clôturé]=\"OUI\",ROW(Tableau_de_suivi[Clôturé])-2),ROWS($1:98)),COLUMN()),\"\")","v":""},{"$f":"IFERROR(INDEX(Tableau_de_suivi[[N°]:[Clôturé]],SMALL(IF(Tableau_de_suivi[Clôturé]=\"OUI\",ROW(Tableau_de_suivi[Clôturé])-2),ROWS($1:98)),COLUMN()),\"\")","v":""},{"$f":"IFERROR(INDEX(Tableau_de_suivi[[N°]:[Clôturé]],SMALL(IF(Tableau_de_suivi[Clôturé]=\"OUI\",ROW(Tableau_de_suivi[Clôturé])-2),ROWS($1:98)),COLUMN()),\"\")","v":""},{"$f":"IFERROR(INDEX(Tableau_de_suivi[[N°]:[Clôturé]],SMALL(IF(Tableau_de_suivi[Clôturé]=\"OUI\",ROW(Tableau_de_suivi[Clôturé])-2),ROWS($1:98)),COLUMN()),\"\")","v":""}]

{"sheet":"Liste notaires","index":14,"n_rows":40,"n_cols":12,"rows_kept":40,"cut":false,"hidden":false,"merged":[[3,8,3,11],[3,2,4,2],[3,1,4,1],[3,3,4,3],[3,4,4,4],[3,5,4,5],[3,6,4,6],[3,7,4,7]]}
[]
[null,"Liste notaire "]
[]
[null,"Notaire","Lieu","Personnes de contact","Adresse e-mail","Adresse postale","Téléphone","Fax","Emoluments"]
[null,null,null,null,null,null,null,null,"Constitution","Transfert de siège","Augmentation de capital","Diverses modifications statutaires"]
[null,"Chambres des notaires du GDL","Centre",null,"info@notariat.lu","53, boulevard Joseph II L-1840 Luxembourg","44 70 21","45 51 40"]
[null,"ARRENSDORFF Roger","Centre"," ","notarr@pt.lu","43, boulevard du Prince Henri L-1724 Luxembourg","26 27 30-1","26 27 30 30"]
[null,"BADEN Joëlle","Centre",null,"secretariat@enb.lu","17, rue des Bains L-1212 Luxembourg","22 79 27-1","22 78 22"]
[null,"BETTINGEN Paul","Centre",null,"bettingen@pbettingen.lu","71, rue du Golf L-1638 SENNINGERBERG","34 02 02-1","34 63 64"]
[null,"DECKER Martine","Centre",null,"notaire@martine-decker.lu","272, route de Thionville L-5884 HOWALD-HESPERANGE","40 70 30-1","40 70 59"]
[null,"DELOSCH Edouard","Centre",null,"secretariat@notaire-delosch.lu","7, rue Nicolas Bové L-1253 LUXEMBOURG-MERL","27 18 07","27 18 07 90"]
[null,"DELVAUX Cosita","Centre",null,"contact@notaire-delvaux.lu","39, Boulevard Joseph II L-1840 Luxembourg","45 41 49 - 1","45 41 49 - 454"]
[null,"GRETHEN Léonie","Centre",{"$f":"\"Rachida Martinot (rachida-martinot@notaire-grethen.lu)\"","v":"Rachida Martinot (rachida-martinot@notaire-grethen.lu)"},"leonie@notaire-grethen.lu","10, avenue Guillaume L-1650 Luxembourg","22 92 15-1","22 92 15-402"]
[null,"HELLINCKX Henri","Centre",null,"nothelli@pt.lu","101, rue Cents L-1319 Luxembourg","24 52 62-1","24 52 62-24"]
[null,"LECUIT Marc","Centre",null,"lecuitm@pt.lu","7, rue Wenzel L-7593 BERINGEN/MERSCH","32 02 02-1","32 72 71"]
[null,"MOLITOR  Frank","Centre",null,"info@notairemolitor.lu","101, rue de Bonnevoie L-1261 Luxembourg","49 36 36","48 85 15"]
[null,"REINARD Elisabeth","Centre","Lionel Gobert (L.Gobert@notaire-reinard.lu)","e.reinard@notaire-reinard.lu","2, Place de l’Hôtel de Ville L-9087 ETTELBRUCK","81 21 45","81 77 06"]
[null,"REUTER Karine","Centre",null,"notaire@notaire-reuter.lu","488, route de Longwy L-1940 Luxembourg","28 66 68 -1","28 66 68 68"]
[null,"SCHAEFFER Martine","Centre",null,"secretariat@notaireschaeffer.lu","74, avenue Victor Hugo L-1750 Luxembourg","22 44 75","46 02 61"]
[null,"SCHLESSER Emile","Centre",null,"info@notaireschlesser.lu","35, rue Notre Dame L-2240 Luxembourg","45 30 35-1","45 31 35"]
[null,"SCHWACHTGEN Joëlle","Centre",null,"notairejschwachtgen@pt.lu","4, rue Alexis Heck L-9242 DIEKIRCH","80 35 16 – 1","80 81 47"]
[null,"SECKLER Jean","Centre",null,"secklernot@sl.lu","3, route de Luxembourg L-6130 JUNGLINSTER","78 90 52-1","78 00 37"]
[null,"THOLL Urbain","Centre",null,"urbain.tholl@notairetholl.lu","7, rue Emile Laux L-7544 MERSCH","32 87 17-1","32 86 41"]
[null,"WERSANDT Carlo","Centre",null,"info@notaire-wersandt.lu","12, rue Jean Engling L-1466 Luxembourg","43 16 44-1","43 16 44 44"]
[null,"HAMES Mireille","Ouest",null,"contact@notairehames.lu","21, rue Schwiedelbrouch L-8806 RAMBROUCH","23 64 13 1","23 64 13 40"]
[null,"KOLBACH Danielle","Ouest",null,"info@notaire-kolbach.lu","66, Grand-Rue L-8510 REDANGE-SUR-ATTERT","26 88 86-1","26 88 86 88"]
[null,"MINES Camille ","Ouest",null,"secretariat@notaire-mines.lu","3, route d'Olm L-8331 CAPELLEN","30 00 27-1","30 71 45"]
[null,"DOERNER Christine","Sud",null,"notdoern@pt.lu","10, rue de la Gare L-3236 BETTEMBOURG","51 32 15-1","51 28 63"]
[null,"GOEDERT Carlo","Sud",null,"notaire@cgoedert.lu","61-63, avenue Grande-Duchesse Charlotte L-34541 DUDELANGE","51 64 62","51 19 51"]
[null,"HOLTZ Anja","Sud",null,"notholtz@pt.lu","12-14, rue Marie-Muller-Tesch L-4250 ESCH-SUR-ALZETTE","26 54 83-1","26 54 83-83"]
[null,"KESSELER Jacques","Sud",null,"notaire@kesseler.lu","13, route de Luxembourg L-4761 PETANGE","288 455 - 1","288 455 - 55"]
[null,"MEYERS Jean-Paul","Sud",null,"notaire@enm.lu","7, rue Xavier Brasseur L-4040 ESCH/ALZETTE","54-15-71-1","54 33 51"]
[null,"MOUTRIER Blanche","Sud",null,"blanche.moutrier@notaire-moutrier.lu","32A, rue Zénon Bernard L-4031 ESCH/ALZETTE","53 04 41","54 59 62"]
[null,"SCHUMAN Robert","Sud",null,"schumanr@pt.lu","54, rue JF Kennedy L-4599 DIFFERDANGE","58 98 98-1","58 94 94"]
[null,"WAGNER Jean-Joseph","Sud",null,"nowagner@pt.lu","37, rue des Alliés L-4412 BELVAUX","59 13 96-1","59 09 04"]
[null,"WEBER Alex","Sud",null,"notweber@pt.lu","101, avenue de Luxembourg L-4940 BASCHARAGE","50 72 99","50 11 94"]
[null,"BECK Henri","Est",null,"notaireh.beck@cmdnet.lu","9, Rabatt L-6475 ECHTERNACH","72 00 55 ","72 01 70"]
[null,"CASTEL Jacques","Est",null,"notaire@jcastel.lu","Résidence Prost, 33, route de Trèves L-6793 GREVENMACHER","75 83 53","75 06 04"]
[null,"LOESCH Marc","Est","Kathy KLINGELE (Khadigea.Klingele@notaireloesch.lu)","secretariat@notaireloesch.lu","Résidence du Midi, 13, avenue François Clement L-5612 MONDORF ","23 66 82 04","23 66 89 48"]
[null,"SERRES Patrick","Est",null,"secretariat@notaireserres.lu","16, route de Mondorf, L-5552 REMICH","23 61 95-1","23 69 89 62"]

{"sheet":"Sources","index":15,"n_rows":36,"n_cols":18,"rows_kept":36,"cut":false,"hidden":false,"merged":[]}
[]
[null,"N°","Personne en charge2",null,"N°","Type d'actes","Colonne1","Colonne2","Colonne3","Colonne4","Colonne5","Colonne6","Colonne7","Colonne8","Colonne9","Colonne10","Colonne11","Colonne12"]
[null,{"$f":"ROW(A1)","v":1},"DEVILLET N.",null,{"$f":"ROW(D1)","v":1},"Autorisation d'établissement","NOM","Formulaire de demande ","Déclaration sur l'honneur","Diplôme(s)","Certificat relevé carrière prof. ","Autres preuves de qualifications prof.","Extrait de casier judiciaire ","Attestation de non-faillite","(Projet de) Statuts","Contrat de bail ","Carte ID "]
[null,2,"DIFFERDANGE O.",null,2,"Changement(s) statutaire(s):","NOM","Extrait RCSL","ID ","Statuts ","Déclaration BE notaire ","Autorisation établissement (si nécessaire)","Registre actionnaires / Organigramme (si nécessaire)","Contrat de bail (si nécessaire)"]
[null,3,"MERTZ Y.",null,3,"Clôture annuelle ","NOM"]
[null,4,"XHONNEUX D.",null,4,"Constitution ","NOM","Déclaration BE AFC ","Déclaration BE notaire ","Copie ID(s) ","Certificat blocage de fonds ","Contrat de bail ","Certificat d'évaluation ","Mandat acceptation gérance","Copie ID gérant","Procuration "]
[null,5,"BOURDIN C.",null,5,"Demande inscription TVA ","NOM","Formulaire de demande ","Copie statuts ","Contrat de bail","ID gérant","Copie autorisation établissement ","Relevé d'identité bancaire "]
[null,6,"BRADFER F.",null,6,"Dissolution","NOM","Déclaration BE notaire ","Copie ID ","Attestation AED","Attestation ACD ","Attestation CCSS","Copie des statuts ","Extrait RCSL","Comptes annuels","Situation arrêtée ","Registre des actionnaires ","Organigramme signé"]
[null,7,"HOUSSA M.",null,7,"Etablissement déclaration d'impôt","NOM"]
[null,8,"LAMBERTY C.",null,8,"Etablissement déclaration fiscale","NOM"]
[null,9,"LAVAL J.",null,9,"Etablissement déclaration TVA ","NOM"]
[null,10,"LIMET S.",null,10,"Fusion","NOM","Déclaration BE notaire ","Copie ID ","Copie des statuts ","Extrait RCSL","Comptes annuels","Situation arrêtée ","Registre des actionnaires ","Organigramme signé"]
[null,11,"PONCELET J.",null,11,"Publication RCSL","NOM"]
[null,12,"RAKIB R.",null,12,"Scission ","NOM","Déclaration BE notaire ","Copie ID ","Copie des statuts ","Extrait RCSL","Comptes annuels","Situation arrêtée ","Registre des actionnaires ","Organigramme signé"]
[null,13,"SERVAIS L.",null,13,"Secrétariat social","NOM"]
[null,14,"WALTENER S.",null,14,"Tenue AG annuel","NOM"]
[null,{"$f":"ROW(A15)","v":15},"Autre :",null,15,"Tenue de la comptabilité","NOM"]
[null,null,null,null,16,"Autre(s):","NOM"]
[null,null,null,null,{"$f":"ROW(D17)","v":17},"Base","NOM"]
[]
[]
[]
[]
[]
[]
[]
[]
[]
[]
[null,null,null,null,null,null,null,null,"Noms utilisés dans le classeur"]
[null,"Date du jour : ",{"$f":"TODAY()","v":"2018-01-22"},null,"Publication de l'acte",null,null,null,"ACTE","=Tableau35[Type d''actes]"]
[null,null,null,null,"OUI",null,null,null,"cellule_un","='Tableau de suivi'!$B$3"]
[null,null,null,null,"NON",null,null,null,"NOTAIRE","='Liste notaires'!$B$6:$B$40"]
[null,null,null,null,null,null,null,null,"PERSONNE","=Tableau3[Personne en charge2]"]
[null,null,null,null,"Facturation ",null,null,null,"PremiereCelluleApresTableau","='Tableau de suivi'!$A$3"]
[null,null,null,null,null,null,null,null,"PUBLICATION","=Tableau6[Publication de l''acte]"]