{"text_format":"1","workbook":"xlsx","n_sheets":18,"sheets":["Recueil","Liste","MOD","TOTO","TITI","TEST3","TEST2","TEST1","TATA","jju73","jju72","jju71","jju70","jju69","jju68","jju67","jju66","jju65"],"not_rendered":{"charts":0,"images":5,"macros":1,"external_links":0,"defined_names":38,"comments":0,"pivot_tables":0},"unopened":[],"bounds":{"document_bytes":16777216,"sheet_cells":100000,"rows_first":2000,"rows_last":500,"rows_between":2000,"halvings":0,"cell_chars":16384,"cell_head_chars":4096},"cells_cut":0,"cells_raw":0,"read":"whole","date_system":"1900"}

{"sheet":"Recueil","index":0,"n_rows":371,"n_cols":25,"rows_kept":371,"cut":false,"hidden":false,"merged":[[3,6,4,9],[3,10,4,14],[1,17,1,24],[3,16,4,24]]}
[]
[null,null,null,null,null,null,null,null,null,null,null,null,null,null,null,null,null,{"$f":"MID(CELL(\"filename\",A1),FIND(\"[\",CELL(\"filename\",A1))+1,SUM(FIND({\"[\";\"]\"},CELL(\"filename\",A1))*{-1;1})-6)","v":"Reporting-M-V3"}]
[]
[null,null,null,null,null,null,"Réception",null,null,null,"Solde",null,null,null,null,null,"Récapitulatif annuel"]
[]
["Date","Animation","Ilôt Métier","Sous-Total","RDV EGFA","Totaux","C primoR","C RvltR","CMU RSA PrimoR","CMU RSA RvltR","CMU primoS","CMU RvltS","CMU RSA PrimoS","CMU RSA RvltS","Date la + ancienne","Mois\nV","Animation","Ilôt Métier","Sous Total","RDV EGFA","Totaux","CMU primoR","CMU RvltR","CMU RSA PrimoR","CMU RSA RvltR"]
["2018-01-02",{"$f":"SUM('TOTO:jju65'!C7)","v":99},{"$f":"SUM('TOTO:jju65'!D7)","v":121},{"$f":"SUM(Tableau1[[#This Row],[Animation]:[Ilôt Métier]])","v":220},6,{"$f":"SUM(Tableau1[[#This Row],[Sous-Total]:[RDV EGFA]])","v":226},null,null,null,null,null,null,null,null,null,"2017-01-01",{"$f":"SUM(IF(MONTH($A$7:$A$371)=MONTH($P7),B$7:B$371))","v":242},{"$f":"SUM(IF(MONTH($A$7:$A$371)=MONTH($P7),C$7:C$371))","v":233},{"$f":"SUM(Q7:R7)","v":475},{"$f":"SUM(IF(MONTH($A$7:$A$371)=MONTH($P7),E$7:E$371))","v":6},{"$f":"SUM(S7,T7)","v":481},{"$f":"SUM(IF(MONTH($A$7:$A$371)=MONTH($P7),G$7:G$371))","v":0},{"$f":"SUM(IF(MONTH($A$7:$A$371)=MONTH($P7),H$7:H$371))","v":0},{"$f":"SUM(IF(MONTH($A$7:$A$371)=MONTH($P7),I$7:I$371))","v":0},{"$f":"SUM(IF(MONTH($A$7:$A$371)=MONTH($P7),J$7:J$371))","v":0}]
[{"$f":"A7+1","v":"2018-01-03"},{"$f":"SUM('TOTO:jju65'!C8)","v":18},{"$f":"SUM('TOTO:jju65'!D8)","v":24},{"$f":"SUM(Tableau1[[#This Row],[Animation]:[Ilôt Métier]])","v":42},null,{"$f":"SUM(Tableau1[[#This Row],[Sous-Total]:[RDV EGFA]])","v":42},null,null,null,null,null,null,null,null,null,"2017-02-01",{"$f":"SUM(IF(MONTH($A$7:$A$371)=MONTH($P8),B$7:B$371))","v":0},{"$f":"SUM(IF(MONTH($A$7:$A$371)=MONTH($P8),C$7:C$371))","v":0},{"$f":"SUM(Q8:R8)","v":0},{"$f":"SUM(IF(MONTH($A$7:$A$371)=MONTH($P8),E$7:E$371))","v":8},8,{"$f":"SUM(IF(MONTH($A$7:$A$371)=MONTH($P8),G$7:G$371))","v":0},{"$f":"SUM(IF(MONTH($A$7:$A$371)=MONTH($P8),H$7:H$371))","v":0},{"$f":"SUM(IF(MONTH($A$7:$A$371)=MONTH($P8),I$7:I$371))","v":0},{"$f":"SUM(IF(MONTH($A$7:$A$371)=MONTH($P8),J$7:J$371))","v":0}]
[{"$f":"A8+1","v":"2018-01-04"},{"$f":"SUM('TOTO:jju65'!C9)","v":0},{"$f":"SUM('TOTO:jju65'!D9)","v":0},{"$f":"SUM(Tableau1[[#This Row],[Animation]:[Ilôt Métier]])","v":0},null,{"$f":"SUM(Tableau1[[#This Row],[Sous-Total]:[RDV EGFA]])","v":0},null,null,null,null,null,null,null,null,null,"2017-03-01",{"$f":"SUM(IF(MONTH($A$7:$A$371)=MONTH($P9),B$7:B$371))","v":0},{"$f":"SUM(IF(MONTH($A$7:$A$371)=MONTH($P9),C$7:C$371))","v":0},0,{"$f":"SUM(IF(MONTH($A$7:$A$371)=MONTH($P9),E$7:E$371))","v":0},0,{"$f":"SUM(IF(MONTH($A$7:$A$371)=MONTH($P9),G$7:G$371))","v":0},{"$f":"SUM(IF(MONTH($A$7:$A$371)=MONTH($P9),H$7:H$371))","v":0},{"$f":"SUM(IF(MONTH($A$7:$A$371)=MONTH($P9),I$7:I$371))","v":0},{"$f":"SUM(IF(MONTH($A$7:$A$371)=MONTH($P9),J$7:J$371))","v":0}]
[{"$f":"A9+1","v":"2018-01-05"},{"$f":"SUM('TOTO:jju65'!C10)","v":125},{"$f":"SUM('TOTO:jju65'!D10)","v":88},{"$f":"SUM(Tableau1[[#This Row],[Animation]:[Ilôt Métier]])","v":213},null,{"$f":"SUM(Tableau1[[#This Row],[Sous-Total]:[RDV EGFA]])","v":213},null,null,null,null,null,null,null,null,null,"2017-04-01",{"$f":"SUM(IF(MONTH($A$7:$A$371)=MONTH($P10),B$7:B$371))","v":4},{"$f":"SUM(IF(MONTH($A$7:$A$371)=MONTH($P10),C$7:C$371))","v":5},9,{"$f":"SUM(IF(MONTH($A$7:$A$371)=MONTH($P10),E$7:E$371))","v":0},9,{"$f":"SUM(IF(MONTH($A$7:$A$371)=MONTH($P10),G$7:G$371))","v":0},{"$f":"SUM(IF(MONTH($A$7:$A$371)=MONTH($P10),H$7:H$371))","v":0},{"$f":"SUM(IF(MONTH($A$7:$A$371)=MONTH($P10),I$7:I$371))","v":0},{"$f":"SUM(IF(MONTH($A$7:$A$371)=MONTH($P10),J$7:J$371))","v":0}]
["2018-01-06",{"$f":"SUM('TOTO:jju65'!C11)","v":0},{"$f":"SUM('TOTO:jju65'!D11)","v":0},{"$f":"SUM(Tableau1[[#This Row],[Animation]:[Ilôt Métier]])","v":0},null,{"$f":"SUM(Tableau1[[#This Row],[Sous-Total]:[RDV EGFA]])","v":0},null,null,null,null,null,null,null,null,null,"2017-05-01",{"$f":"SUM(IF(MONTH($A$7:$A$371)=MONTH($P11),B$7:B$371))","v":0},{"$f":"SUM(IF(MONTH($A$7:$A$371)=MONTH($P11),C$7:C$371))","v":0},0,{"$f":"SUM(IF(MONTH($A$7:$A$371)=MONTH($P11),E$7:E$371))","v":0},0,{"$f":"SUM(IF(MONTH($A$7:$A$371)=MONTH($P11),G$7:G$371))","v":0},{"$f":"SUM(IF(MONTH($A$7:$A$371)=MONTH($P11),H$7:H$371))","v":0},{"$f":"SUM(IF(MONTH($A$7:$A$371)=MONTH($P11),I$7:I$371))","v":0},{"$f":"SUM(IF(MONTH($A$7:$A$371)=MONTH($P11),J$7:J$371))","v":0}]
["2018-01-07",{"$f":"SUM('TOTO:jju65'!C12)","v":0},{"$f":"SUM('TOTO:jju65'!D12)","v":0},{"$f":"SUM(Tableau1[[#This Row],[Animation]:[Ilôt Métier]])","v":0},null,{"$f":"SUM(Tableau1[[#This Row],[Sous-Total]:[RDV EGFA]])","v":0},null,null,null,null,null,null,null,null,null,"2017-06-01",{"$f":"SUM(IF(MONTH($A$7:$A$371)=MONTH($P12),B$7:B$371))","v":0},{"$f":"SUM(IF(MONTH($A$7:$A$371)=MONTH($P12),C$7:C$371))","v":0},0,{"$f":"SUM(IF(MONTH($A$7:$A$371)=MONTH($P12),E$7:E$371))","v":0},0,{"$f":"SUM(IF(MONTH($A$7:$A$371)=MONTH($P12),G$7:G$371))","v":0},{"$f":"SUM(IF(MONTH($A$7:$A$371)=MONTH($P12),H$7:H$371))","v":0},{"$f":"SUM(IF(MONTH($A$7:$A$371)=MONTH($P12),I$7:I$371))","v":0},{"$f":"SUM(IF(MONTH($A$7:$A$371)=MONTH($P12),J$7:J$371))","v":0}]
["2018-01-08",{"$f":"SUM('TOTO:jju65'!C13)","v":0},{"$f":"SUM('TOTO:jju65'!D13)","v":0},{"$f":"SUM(Tableau1[[#This Row],[Animation]:[Ilôt Métier]])","v":0},null,{"$f":"SUM(Tableau1[[#This Row],[Sous-Total]:[RDV EGFA]])","v":0},null,null,null,null,null,null,null,null,null,"2017-07-01",{"$f":"SUM(IF(MONTH($A$7:$A$371)=MONTH($P13),B$7:B$371))","v":0},{"$f":"SUM(IF(MONTH($A$7:$A$371)=MONTH($P13),C$7:C$371))","v":0},0,{"$f":"SUM(IF(MONTH($A$7:$A$371)=MONTH($P13),E$7:E$371))","v":0},0,{"$f":"SUM(IF(MONTH($A$7:$A$371)=MONTH($P13),G$7:G$371))","v":0},{"$f":"SUM(IF(MONTH($A$7:$A$371)=MONTH($P13),H$7:H$371))","v":0},{"$f":"SUM(IF(MONTH($A$7:$A$371)=MONTH($P13),I$7:I$371))","v":0},{"$f":"SUM(IF(MONTH($A$7:$A$371)=MONTH($P13),J$7:J$371))","v":0}]
["2018-01-09",{"$f":"SUM('TOTO:jju65'!C14)","v":0},{"$f":"SUM('TOTO:jju65'!D14)","v":0},{"$f":"SUM(Tableau1[[#This Row],[Animation]:[Ilôt Métier]])","v":0},null,{"$f":"SUM(Tableau1[[#This Row],[Sous-Total]:[RDV EGFA]])","v":0},null,null,null,null,null,null,null,null,null,"2017-08-01",{"$f":"SUM(IF(MONTH($A$7:$A$371)=MONTH($P14),B$7:B$371))","v":0},{"$f":"SUM(IF(MONTH($A$7:$A$371)=MONTH($P14),C$7:C$371))","v":0},0,{"$f":"SUM(IF(MONTH($A$7:$A$371)=MONTH($P14),E$7:E$371))","v":0},0,{"$f":"SUM(IF(MONTH($A$7:$A$371)=MONTH($P14),G$7:G$371))","v":0},{"$f":"SUM(IF(MONTH($A$7:$A$371)=MONTH($P14),H$7:H$371))","v":0},{"$f":"SUM(IF(MONTH($A$7:$A$371)=MONTH($P14),I$7:I$371))","v":0},{"$f":"SUM(IF(MONTH($A$7:$A$371)=MONTH($P14),J$7:J$371))","v":0}]
["2018-01-10",{"$f":"SUM('TOTO:jju65'!C15)","v":0},{"$f":"SUM('TOTO:jju65'!D15)","v":0},{"$f":"SUM(Tableau1[[#This Row],[Animation]:[Ilôt Métier]])","v":0},null,{"$f":"SUM(Tableau1[[#This Row],[Sous-Total]:[RDV EGFA]])","v":0},null,null,null,null,null,null,null,null,null,"2017-09-01",{"$f":"SUM(IF(MONTH($A$7:$A$371)=MONTH($P15),B$7:B$371))","v":0},{"$f":"SUM(IF(MONTH($A$7:$A$371)=MONTH($P15),C$7:C$371))","v":0},0,{"$f":"SUM(IF(MONTH($A$7:$A$371)=MONTH($P15),E$7:E$371))","v":0},0,{"$f":"SUM(IF(MONTH($A$7:$A$371)=MONTH($P15),G$7:G$371))","v":0},{"$f":"SUM(IF(MONTH($A$7:$A$371)=MONTH($P15),H$7:H$371))","v":0},{"$f":"SUM(IF(MONTH($A$7:$A$371)=MONTH($P15),I$7:I$371))","v":0},{"$f":"SUM(IF(MONTH($A$7:$A$371)=MONTH($P15),J$7:J$371))","v":0}]
{"$rows_left_out":357}
{"sheet":"Liste","index":1,"n_rows":50,"n_cols":9,"rows_kept":50,"cut":false,"hidden":false,"merged":[[1,7,1,8]]}
["Liste des Agents","Liste des agents à créer","Suppression\nOnglet\nAgent",null,"Suppression des agents choisis","Suppression de tous les agents","Liste des onglets créés à ce jour >\nvvvvvvvvvvvvvvvvvvvvvvvvvvvv",{"$f":"NBFeuilles-3","v":15},{"$f":"COUNTA(ListeOnglets)","v":15}]
["TOTO","TOTO",null,null,null,null,{"$f":"IF(ROW(4:4)>COUNTA(Onglets),””,INDEX(Onglets,ROW(4:4)))","v":"[Reporting-M-V3.xlsm]TOTO"},"sur"]
["TITI","TITI",null,null,null,null,{"$f":"IF(ROW(5:5)>COUNTA(Onglets),””,INDEX(Onglets,ROW(5:5)))","v":"[Reporting-M-V3.xlsm]TITI"}]
["TEST3","TEST3",null,null,null,null,{"$f":"IF(ROW(6:6)>COUNTA(Onglets),””,INDEX(Onglets,ROW(6:6)))","v":"[Reporting-M-V3.xlsm]TEST3"}]
["TEST2","TEST2",1,null,null,null,{"$f":"IF(ROW(7:7)>COUNTA(Onglets),””,INDEX(Onglets,ROW(7:7)))","v":"[Reporting-M-V3.xlsm]TEST2"}]
["TEST1","TEST1",null,null,null,null,{"$f":"IF(ROW(8:8)>COUNTA(Onglets),””,INDEX(Onglets,ROW(8:8)))","v":"[Reporting-M-V3.xlsm]TEST1"}]
["TATA","TATA",null,null,null,null,{"$f":"IF(ROW(9:9)>COUNTA(Onglets),””,INDEX(Onglets,ROW(9:9)))","v":"[Reporting-M-V3.xlsm]TATA"}]
["jju73","jju73",1,null,null,null,{"$f":"IF(ROW(10:10)>COUNTA(Onglets),””,INDEX(Onglets,ROW(10:10)))","v":"[Reporting-M-V3.xlsm]jju73"}]
["jju72","jju72",null,null,null,null,{"$f":"IF(ROW(11:11)>COUNTA(Onglets),””,INDEX(Onglets,ROW(11:11)))","v":"[Reporting-M-V3.xlsm]jju72"}]
["jju71","jju71",null,null,null,null,{"$f":"IF(ROW(12:12)>COUNTA(Onglets),””,INDEX(Onglets,ROW(12:12)))","v":"[Reporting-M-V3.xlsm]jju71"}]
["jju70","jju70",null,null,null,null,{"$f":"IF(ROW(13:13)>COUNTA(Onglets),””,INDEX(Onglets,ROW(13:13)))","v":"[Reporting-M-V3.xlsm]jju70"}]
["jju69","jju69",null,null,null,null,{"$f":"IF(ROW(14:14)>COUNTA(Onglets),””,INDEX(Onglets,ROW(14:14)))","v":"[Reporting-M-V3.xlsm]jju69"}]
["jju68","jju68",null,null,null,null,{"$f":"IF(ROW(15:15)>COUNTA(Onglets),””,INDEX(Onglets,ROW(15:15)))","v":"[Reporting-M-V3.xlsm]jju68"}]
["jju67","jju67",null,null,null,null,{"$f":"IF(ROW(16:16)>COUNTA(Onglets),””,INDEX(Onglets,ROW(16:16)))","v":"[Reporting-M-V3.xlsm]jju67"}]
["jju66","jju66",null,null,null,null,{"$f":"IF(ROW(17:17)>COUNTA(Onglets),””,INDEX(Onglets,ROW(17:17)))","v":"[Reporting-M-V3.xlsm]jju66"}]
{"$rows_left_out":36}
{"sheet":"MOD","index":2,"n_rows":372,"n_cols":5,"rows_kept":372,"cut":false,"hidden":false,"merged":[]}
[null,"Identification CSAM",{"$f":"VLOOKUP(B2,Liste!A2:C50,3,0)","v":{"$error":"#N/A"}}]
[null,"MOD"]
[null,null,"< Date de création"]
[]
[]
[null,"Date","Animation","Ilôt Métier","Total"]
[null,"2018-01-02",null,null,{"$f":"SUM(C7:D7)","v":0}]
[null,{"$f":"B7+1","v":"2018-01-03"},null,null,0]
[null,{"$f":"B8+1","v":"2018-01-04"},null,null,0]
[null,"2018-01-05",null,null,0]
[null,"2018-01-06",null,null,0]
[null,"2018-01-07",null,null,0]
[null,"2018-01-08",null,null,0]
[null,"2018-01-09",null,null,0]
[null,"2018-01-10",null,null,0]
{"$rows_left_out":358}
{"sheet":"TOTO","index":3,"n_rows":372,"n_cols":5,"rows_kept":372,"cut":false,"hidden":false,"merged":[]}
[null,"Identification CSAM",{"$f":"VLOOKUP(B2,Liste!A2:C50,3,0)","v":0}]
[null,"TOTO"]
[null,"2017-12-24","< Date de création"]
[]
[]
[null,"Date","Animation","Ilôt Métier","Total"]
[null,"2018-01-02",11,"1900-01-22",{"$f":"SUM(C7:D7)","v":33}]
[null,{"$f":"B7+1","v":"2018-01-03"},null,null,0]
[null,{"$f":"B8+1","v":"2018-01-04"},null,null,0]
[null,"2018-01-05",null,null,0]
[null,"2018-01-06",null,null,0]
[null,"2018-01-07",null,null,0]
[null,"2018-01-08",null,null,0]
[null,"2018-01-09",null,null,0]
[null,"2018-01-10",null,null,0]
{"$rows_left_out":358}
{"sheet":"TITI","index":4,"n_rows":372,"n_cols":5,"rows_kept":372,"cut":false,"hidden":false,"merged":[]}
[null,"Identification CSAM",{"$f":"VLOOKUP(B2,Liste!A2:C50,3,0)","v":0}]
[null,"TITI"]
[null,"2017-12-24","< Date de création"]
[]
[]
[null,"Date","Animation","Ilôt Métier","Total"]
[null,"2018-01-02",null,null,{"$f":"SUM(C7:D7)","v":0}]
[null,{"$f":"B7+1","v":"2018-01-03"},null,null,0]
[null,{"$f":"B8+1","v":"2018-01-04"},null,null,0]
[null,"2018-01-05",null,null,0]
[null,"2018-01-06",null,null,0]
[null,"2018-01-07",null,null,0]
[null,"2018-01-08",null,null,0]
[null,"2018-01-09",null,null,0]
[null,"2018-01-10",null,null,0]
{"$rows_left_out":358}
{"sheet":"TEST3","index":5,"n_rows":372,"n_cols":5,"rows_kept":372,"cut":false,"hidden":false,"merged":[]}
[null,"Identification CSAM",{"$f":"VLOOKUP(B2,Liste!A2:C50,3,0)","v":0}]
[null,"TEST3"]
[null,"2017-12-24","< Date de création"]
[]
[]
[null,"Date","Animation","Ilôt Métier","Total"]
[null,"2018-01-02",null,null,{"$f":"SUM(C7:D7)","v":0}]
[null,{"$f":"B7+1","v":"2018-01-03"},null,null,0]
[null,{"$f":"B8+1","v":"2018-01-04"},null,null,0]
[null,"2018-01-05",null,null,0]
[null,"2018-01-06",null,null,0]
[null,"2018-01-07",null,null,0]
[null,"2018-01-08",null,null,0]
[null,"2018-01-09",null,null,0]
[null,"2018-01-10",null,null,0]
{"$rows_left_out":358}
{"sheet":"TEST2","index":6,"n_rows":372,"n_cols":5,"rows_kept":372,"cut":false,"hidden":false,"merged":[]}
[null,"Identification CSAM",{"$f":"VLOOKUP(B2,Liste!A2:C50,3,0)","v":1}]
[null,"TEST2"]
[null,"2017-12-24","< Date de création"]
[]
[]
[null,"Date","Animation","Ilôt Métier","Total"]
[null,"2018-01-02",null,null,{"$f":"SUM(C7:D7)","v":0}]
[null,{"$f":"B7+1","v":"2018-01-03"},18,24,42]
[null,{"$f":"B8+1","v":"2018-01-04"},null,null,0]
[null,"2018-01-05",null,null,0]
[null,"2018-01-06",null,null,0]
[null,"2018-01-07",null,null,0]
[null,"2018-01-08",null,null,0]
[null,"2018-01-09",null,null,0]
[null,"2018-01-10",null,null,0]
{"$rows_left_out":358}
{"sheet":"TEST1","index":7,"n_rows":372,"n_cols":5,"rows_kept":372,"cut":false,"hidden":false,"merged":[]}
[null,"Identification CSAM",{"$f":"VLOOKUP(B2,Liste!A2:C50,3,0)","v":0}]
[null,"TEST1"]
[null,"2017-12-24","< Date de création"]
[]
[]
[null,"Date","Animation","Ilôt Métier","Total"]
[null,"2018-01-02",null,null,{"$f":"SUM(C7:D7)","v":0}]
[null,{"$f":"B7+1","v":"2018-01-03"},null,null,0]
[null,{"$f":"B8+1","v":"2018-01-04"},null,null,0]
[null,"2018-01-05",null,null,0]
[null,"2018-01-06",null,null,0]
[null,"2018-01-07",null,null,0]
[null,"2018-01-08",null,null,0]
[null,"2018-01-09",null,null,0]
[null,"2018-01-10",null,null,0]
{"$rows_left_out":358}
{"sheet":"TATA","index":8,"n_rows":372,"n_cols":5,"rows_kept":372,"cut":false,"hidden":false,"merged":[]}
[null,"Identification CSAM",{"$f":"VLOOKUP(B2,Liste!A2:C50,3,0)","v":0}]
[null,"TATA"]
[null,"2017-12-24","< Date de création"]
[]
[]
[null,"Date","Animation","Ilôt Métier","Total"]
[null,"2018-01-02",null,null,{"$f":"SUM(C7:D7)","v":0}]
[null,{"$f":"B7+1","v":"2018-01-03"},null,null,0]
[null,{"$f":"B8+1","v":"2018-01-04"},null,null,0]
[null,"2018-01-05",125,88,213]
[null,"2018-01-06",null,null,0]
[null,"2018-01-07",null,null,0]
[null,"2018-01-08",null,null,0]
[null,"2018-01-09",null,null,0]
[null,"2018-01-10",null,null,0]
{"$rows_left_out":358}
{"sheet":"jju73","index":9,"n_rows":372,"n_cols":5,"rows_kept":372,"cut":false,"hidden":false,"merged":[]}
[null,"Identification CSAM",{"$f":"VLOOKUP(B2,Liste!A2:C50,3,0)","v":1}]
[null,"jju73"]
[null,"2017-12-24","< Date de création"]
[]
[]
[null,"Date","Animation","Ilôt Métier","Total"]
[null,"2018-01-02",null,null,{"$f":"SUM(C7:D7)","v":0}]
[null,{"$f":"B7+1","v":"2018-01-03"},null,null,0]
[null,{"$f":"B8+1","v":"2018-01-04"},null,null,0]
[null,"2018-01-05",null,null,0]
[null,"2018-01-06",null,null,0]
[null,"2018-01-07",null,null,0]
[null,"2018-01-08",null,null,0]
[null,"2018-01-09",null,null,0]
[null,"2018-01-10",null,null,0]
{"$rows_left_out":358}
{"sheet":"jju72","index":10,"n_rows":372,"n_cols":5,"rows_kept":372,"cut":false,"hidden":false,"merged":[]}
[null,"Identification CSAM",{"$f":"VLOOKUP(B2,Liste!A2:C50,3,0)","v":0}]
[null,"jju72"]
[null,"2017-12-24","< Date de création"]
[]
[]
[null,"Date","Animation","Ilôt Métier","Total"]
[null,"2018-01-02",null,null,{"$f":"SUM(C7:D7)","v":0}]
[null,{"$f":"B7+1","v":"2018-01-03"},null,null,0]
[null,{"$f":"B8+1","v":"2018-01-04"},null,null,0]
[null,"2018-01-05",null,null,0]
[null,"2018-01-06",null,null,0]
[null,"2018-01-07",null,null,0]
[null,"2018-01-08",null,null,0]
[null,"2018-01-09",null,null,0]
[null,"2018-01-10",null,null,0]
{"$rows_left_out":358}
{"sheet":"jju71","index":11,"n_rows":372,"n_cols":5,"rows_kept":372,"cut":false,"hidden":false,"merged":[]}
[null,"Identification CSAM",{"$f":"VLOOKUP(B2,Liste!A2:C50,3,0)","v":0}]
[null,"jju71"]
[null,"2017-12-24","< Date de création"]
[]
[]
[null,"Date","Animation","Ilôt Métier","Total"]
[null,"2018-01-02",null,null,{"$f":"SUM(C7:D7)","v":0}]
[null,{"$f":"B7+1","v":"2018-01-03"},null,null,0]
[null,{"$f":"B8+1","v":"2018-01-04"},null,null,0]
[null,"2018-01-05",null,null,0]
[null,"2018-01-06",null,null,0]
[null,"2018-01-07",null,null,0]
[null,"2018-01-08",null,null,0]
[null,"2018-01-09",null,null,0]
[null,"2018-01-10",null,null,0]
{"$rows_left_out":358}
{"sheet":"jju70","index":12,"n_rows":372,"n_cols":5,"rows_kept":372,"cut":false,"hidden":false,"merged":[]}
[null,"Identification CSAM",{"$f":"VLOOKUP(B2,Liste!A2:C50,3,0)","v":0}]
[null,"jju70"]
[null,"2017-12-24","< Date de création"]
[]
[]
[null,"Date","Animation","Ilôt Métier","Total"]
[null,"2018-01-02",null,null,{"$f":"SUM(C7:D7)","v":0}]
[null,{"$f":"B7+1","v":"2018-01-03"},null,null,0]
[null,{"$f":"B8+1","v":"2018-01-04"},null,null,0]
[null,"2018-01-05",null,null,0]
[null,"2018-01-06",null,null,0]
[null,"2018-01-07",null,null,0]
[null,"2018-01-08",null,null,0]
[null,"2018-01-09",null,null,0]
[null,"2018-01-10",null,null,0]
{"$rows_left_out":358}
{"sheet":"jju69","index":13,"n_rows":372,"n_cols":5,"rows_kept":372,"cut":false,"hidden":false,"merged":[]}
[null,"Identification CSAM",{"$f":"VLOOKUP(B2,Liste!A2:C50,3,0)","v":0}]
[null,"jju69"]
[null,"2017-12-24","< Date de création"]
[]
[]
[null,"Date","Animation","Ilôt Métier","Total"]
[null,"2018-01-02",null,null,{"$f":"SUM(C7:D7)","v":0}]
[null,{"$f":"B7+1","v":"2018-01-03"},null,null,0]
[null,{"$f":"B8+1","v":"2018-01-04"},null,null,0]
[null,"2018-01-05",null,null,0]
[null,"2018-01-06",null,null,0]
[null,"2018-01-07",null,null,0]
[null,"2018-01-08",null,null,0]
[null,"2018-01-09",null,null,0]
[null,"2018-01-10",null,null,0]
{"$rows_left_out":358}
{"sheet":"jju68","index":14,"n_rows":372,"n_cols":5,"rows_kept":372,"cut":false,"hidden":false,"merged":[]}
[null,"Identification CSAM",{"$f":"VLOOKUP(B2,Liste!A2:C50,3,0)","v":0}]
[null,"jju68"]
[null,"2017-12-24","< Date de création"]
[]
[]
[null,"Date","Animation","Ilôt Métier","Total"]
[null,"2018-01-02",null,null,{"$f":"SUM(C7:D7)","v":0}]
[null,{"$f":"B7+1","v":"2018-01-03"},null,null,0]
[null,{"$f":"B8+1","v":"2018-01-04"},null,null,0]
[null,"2018-01-05",null,null,0]
[null,"2018-01-06",null,null,0]
[null,"2018-01-07",null,null,0]
[null,"2018-01-08",null,null,0]
[null,"2018-01-09",null,null,0]
[null,"2018-01-10",null,null,0]
{"$rows_left_out":358}
{"sheet":"jju67","index":15,"n_rows":372,"n_cols":5,"rows_kept":372,"cut":false,"hidden":false,"merged":[]}
[null,"Identification CSAM",{"$f":"VLOOKUP(B2,Liste!A2:C50,3,0)","v":0}]
[null,"jju67"]
[null,"2017-12-24","< Date de création"]
[]
[]
[null,"Date","Animation","Ilôt Métier","Total"]
[null,"2018-01-02",null,null,{"$f":"SUM(C7:D7)","v":0}]
[null,{"$f":"B7+1","v":"2018-01-03"},null,null,0]
[null,{"$f":"B8+1","v":"2018-01-04"},null,null,0]
[null,"2018-01-05",null,null,0]
[null,"2018-01-06",null,null,0]
[null,"2018-01-07",null,null,0]
[null,"2018-01-08",null,null,0]
[null,"2018-01-09",null,null,0]
[null,"2018-01-10",null,null,0]
{"$rows_left_out":358}
{"sheet":"jju66","index":16,"n_rows":372,"n_cols":5,"rows_kept":372,"cut":false,"hidden":false,"merged":[]}
[null,"Identification CSAM",{"$f":"VLOOKUP(B2,Liste!A2:C50,3,0)","v":0}]
[null,"jju66"]
[null,"2017-12-24","< Date de création"]
[]
[]
[null,"Date","Animation","Ilôt Métier","Total"]
[null,"2018-01-02",null,null,{"$f":"SUM(C7:D7)","v":0}]
[null,{"$f":"B7+1","v":"2018-01-03"},null,null,0]
[null,{"$f":"B8+1","v":"2018-01-04"},null,null,0]
[null,"2018-01-05",null,null,0]
[null,"2018-01-06",null,null,0]
[null,"2018-01-07",null,null,0]
[null,"2018-01-08",null,null,0]
[null,"2018-01-09",null,null,0]
[null,"2018-01-10",null,null,0]
{"$rows_left_out":358}
{"sheet":"jju65","index":17,"n_rows":372,"n_cols":5,"rows_kept":372,"cut":false,"hidden":false,"merged":[]}
[null,"Identification CSAM",{"$f":"VLOOKUP(B2,Liste!A2:C50,3,0)","v":0}]
[null,"jju65"]
[null,"2017-12-24","< Date de création"]
[]
[]
[null,"Date","Animation","Ilôt Métier","Total"]
[null,"2018-01-02",88,"1900-04-08",{"$f":"SUM(C7:D7)","v":187}]
[null,{"$f":"B7+1","v":"2018-01-03"},null,null,0]
[null,{"$f":"B8+1","v":"2018-01-04"},null,null,0]
[null,"2018-01-05",null,null,0]
[null,"2018-01-06",null,null,0]
[null,"2018-01-07",null,null,0]
[null,"2018-01-08",null,null,0]
[null,"2018-01-09",null,null,0]
[null,"2018-01-10",null,null,0]
{"$rows_left_out":357}